
##TITLE=UV1125_M3-1004-1000_6274892_X7K6TUEJ8X
##JCAMPDX= 6.0         $$ Bruker NMR JCAMP-DX V2.0
##DATA TYPE= NMR SPECTRUM
##DATA CLASS= NTUPLES
##ORIGIN= BRUKER
##OWNER= Administrator
$$ 1.72 TOPSPIN		Version 2.1
$$ 2012-06-07 01:56:12.687 -0500  Administrator@TOPSPIN
$$ Compression mode = diff/dup
##.OBSERVE FREQUENCY= 400.13188235
##.OBSERVE NUCLEUS= ^1H
##.ACQUISITION MODE= SIMULTANEOUS (DQD)
##.ACQUISITION SCHEME= undefined
##.AVERAGES= 64
##.DIGITISER RES= 22
##SPECTROMETER/DATA SYSTEM= spect
##.PULSE SEQUENCE= noesygpps1d.comp
##.SOLVENT NAME= COFFEE_meoh
##.SHIFT REFERENCE= INTERNAL, COFFEE_meoh, 1, 14.96717
##AUDIT TRAIL= $$ (NUMBER, WHEN, WHO, WHERE, PROCESS, VERSION, WHAT)
$$ ##TITLE= Audit trail, TOPSPIN		Version 2.1
$$ ##JCAMPDX= 5.01
$$ ##ORIGIN= Bruker BioSpin GmbH
$$ ##OWNER= Administrator
$$ $$ C:\Bruker\TOPSPIN/data/COFFEE/nmr/UV1125_M3-1004-1000_6274892_X7K6TUEJ8X/22/pdata/1/auditp.txt
$$ ##AUDIT TRAIL=  $$ (NUMBER, WHEN, WHO, WHERE, PROCESS, VERSION, WHAT)
(   1,<2012-06-07 01:56:07.546 -0500>,<Administrator>,<TOPSPIN>,<go>,<TOPSPIN 2.1>,
      <created by zg
	started at 2012-06-07 01:44:37.390 -0500,
	POWCHK enabled, PULCHK disabled,
       configuration hash MD5:
       D5 CA 7A 23 FE 6B EE E2 50 67 74 61 24 F7 5E 3B
       data hash MD5: 64K
       9F CA BC E6 92 AF C2 3D 43 61 AF E9 A6 40 44 39>)
(   2,<2012-06-07 01:56:10.312 -0500>,<Administrator>,<TOPSPIN>,<proc1d>,<TOPSPIN 2.1>,
      <Start of raw data processing
       efp LB = 0.3 FT_mod = 6 PKNL = 1 PHC0 = 0 PHC1 = 0 SI = 128K 
       data hash MD5: 128K
       A8 B9 B9 56 63 92 CE 31 A2 28 A2 17 18 94 3B 8A>)
(   3,<2012-06-07 01:56:11.531 -0500>,<Administrator>,<TOPSPIN>,<proc1d>,<TOPSPIN 2.1>,
      <pk PHC0 = 30.84961 PHC1 = 0 
       data hash MD5: 128K
       4B 53 37 B6 26 F0 79 C3 B5 C2 44 82 A9 61 72 A2>)
(   4,<2012-06-07 01:56:12.359 -0500>,<Administrator>,<TOPSPIN>,<proc1d>,<TOPSPIN 2.1>,
      <abs ABSG = 1 
       data hash MD5: 128K
       A4 BB F8 56 F0 E8 B0 DB E9 CB 21 09 58 4A C7 28>)
(   5,<2012-06-07 01:56:12.421 -0500>,<Administrator>,<TOPSPIN>,<proc1d>,<TOPSPIN 2.1>,
      <abs ABSG = 2 
       data hash MD5: 128K
       3F 20 D2 7D 6D 31 2E CB 06 D1 1F 1C AD 59 A5 58>)
(   6,<2012-06-07 01:56:12.484 -0500>,<Administrator>,<TOPSPIN>,<proc1d>,<TOPSPIN 2.1>,
      <abs ABSG = 3 
       data hash MD5: 128K
       18 BE 49 2A 7C 68 E1 AE 7B 06 A4 A0 3A D1 5F 96>)
(   7,<2012-06-07 01:56:12.546 -0500>,<Administrator>,<TOPSPIN>,<proc1d>,<TOPSPIN 2.1>,
      <abs ABSG = 4 
       data hash MD5: 128K
       F7 25 99 0D 60 5D 70 5A 21 44 CA EC D7 68 EC 6C>)
(   8,<2012-06-07 01:56:12.609 -0500>,<Administrator>,<TOPSPIN>,<proc1d>,<TOPSPIN 2.1>,
      <abs ABSG = 5 
       data hash MD5: 128K
       ED 86 56 81 96 52 8A AB 5F BB FB 03 F6 93 8F 3E>)
$$ ##END=
$$ 
$$ $$ hash MD5
$$ $$ 6C 6D F6 BB D1 22 96 99 84 CB 15 9C EB CD 34 F3
##$RELAX= 
##$RELAX= 
##$RELAX= 
##$RELAX= 
##$RELAX= 
##$RELAX= 
##$RELAX= 
##$RELAX= 
$$ Bruker specific parameters
$$ [...]
##$TP07= 0
##$TPNAME0= <>
##$TPNAME1= <>
##$TPNAME2= <>
##$TPNAME3= <>
##$TPNAME4= <>
##$TPNAME5= <>
##$TPNAME6= <>
##$TPNAME7= <>
##$TPOAL= (0..7)
0.5 0.5 0.5 0.5 0.5 0.5 0.5 0.5
##$TPOFFS= (0..7)
0 0 0 0 0 0 0 0
##$TUNHIN= 0
##$TUNHOUT= 0
##$TUNXOUT= 0
##$USERA1= <user>
##$USERA2= <user>
##$USERA3= <user>
##$USERA4= <user>
##$USERA5= <user>
##$V9= 5
##$VALIST= <valist>
##$VCLIST= <CCCCCCCCCCCCCCC>
##$VD= 0
##$VDLIST= <DDDDDDDDDDDDDDD>
##$VPLIST= <PPPPPPPPPPPPPPP>
##$VTLIST= <TTTTTTTTTTTTTTT>
##$WBST= 2048
##$WBSW= 25
##$XGAIN= (0..3)
0 0 0 0
##$XL= 0
##$YL= 0
##$YMAX_a= 8877097
##$YMIN_a= -6853484
##$ZGOPTNS= <>
##$ZL1= 120
##$ZL2= 120
##$ZL3= 120
##$ZL4= 120
##$ABSF1= 14.96717
##$ABSF2= -5.585361
##$ABSG= 5
##$ABSL= 3
##$ALPHA= 0
##$AQORDER= 0
##$ASSFAC= 0
##$ASSFACI= 0
##$ASSFACX= 0
##$ASSWID= 0
##$AUNMP= <proc_prof1d_extract.lims>
##$AXLEFT= 0
##$AXNAME= <>
##$AXNUC= <1H>
##$AXRIGHT= 0
##$AXTYPE= 0
##$AXUNIT= <>
##$AZFE= 0.1
##$AZFW= 0.1
##$BCFW= 0
##$BC_mod= 0
##$BYTORDP= 0
##$COROFFS= 0
##$CY= 15
##$DATMOD= 1
##$DC= 0
##$DFILT= <>
##$DTYPP= 0
##$F1P= 0
##$F2P= 0
##$FCOR= 0.5
##$FTSIZE= 131072
##$FT_mod= 6
##$GAMMA= 0
##$GB= 0
##$INTBC= 1
##$INTSCL= 1
##$ISEN= 128
##$LB= 0.3
##$LEV0= 0
##$LPBIN= 0
##$MAXI= 10000
##$MC2= 0
##$MEAN= 0
##$ME_mod= 0
##$MI= 0
##$NCOEF= 0
##$NC_proc= -2
##$NLEV= 6
##$NOISF1= 0
##$NOISF2= 0
##$NSP= 0
##$NTH_PI= 0
##$NZP= 0
##$OFFSET= 14.96717
##$PC= 1
##$PHC0= 30.84961
##$PHC1= 0
##$PH_mod= 1
##$PKNL= yes
##$PPARMOD= 0
##$PPDIAG= 0
##$PPIPTYP= 0
##$PPMPNUM= 2147483647
##$PPRESOL= 1
##$PSCAL= 4
##$PSIGN= 0
##$PYNMP= <proc.py>
##$REVERSE= no
##$SF= 400.130005379244
##$SI= 131072
##$SIGF1= 0
##$SIGF2= 0
##$SINO= 400
##$SIOLD= 131072
##$SPECTYP= <>
##$SREGLST= <1H.CDCl3>
##$SSB= 0
##$STSI= 131072
##$STSR= 0
##$SW_p= 8223.68421052632
##$SYMM= 0
##$S_DEV= 0
##$TDeff= 65536
##$TDoff= 0
##$TI= <>
##$TILT= no
##$TM1= 0
##$TM2= 0
##$TOPLEV= 0
##$USERP1= <user>
##$USERP2= <user>
##$USERP3= <user>
##$USERP4= <user>
##$USERP5= <user>
##$WDW= 1
##$XDIM= 131072
##$YMAX_p= 220148645
##$YMIN_p= -312312948
##$CURPLOT= <Network HP LaserJet P1505>
##$CURPRIN= <$Network HP LaserJet P1505>
##$DFORMAT= <normdp>
##$LAYOUT= <+/1D_H.xwp>
##$LFORMAT= <normlp>
##$PFORMAT= <normpl>
##$SURQMSG= 1
$$ End of Bruker specific parameters
$$ ---------------------------------
##NTUPLES= NMR SPECTRUM
##VAR_NAME=  FREQUENCY,     SPECTRUM/REAL,   SPECTRUM/IMAG
##SYMBOL=    X,             R,               I
##VAR_TYPE=  INDEPENDENT,   DEPENDENT,       DEPENDENT
##VAR_FORM=  AFFN,          ASDF,            ASDF
##VAR_DIM=   131072,        131072,          131072
##UNITS=     HZ,            ARBITRARY UNITS, ARBITRARY UNITS
##FACTOR=    0.0627417313425165, 1,          1
##FIRST=     8223.62146879498, -555,         -45994
##LAST=      0,             812,             -46399
##MIN=       0,             -312312948,      0
##MAX=       8223.62146879498, 220148645,    0
$$ Real data points
##PAGE= N=1
##DATA TABLE= (X++(R..R)), XYDATA
$$ [...]
62872D72915o861o096n234m690m104l199k343k029k252k676l091l410l459l052
62858D20419k324j708j582j981k639l236l601l713l600l298k872k424k031j747
62844C83663j702k037k567k756k195j111j18M75Q12R85Q13K75k07k49n7j35n72
62827C73317q99p51l33j24k55l80j85J42P6n67j255j292o51j0Q2k32n23o66p67
62808C64727p64n29k36k49n71q16p42n25m27l75j16M06Q95R44M35k66n45j12P51
62789C61885J561K029K012J380L27n16p26o59q58j060n65M85J030O18J14M08J100
62772C68565J170M89r3O9Q03J587K037K025J788J832K349K922L201L550M493N752
62756D02539O573O779O774O615N935M874M284M775O093P567Q629Q874Q414Q240
$$ plain form
62872 472915 466054 459958 454724 450034 445930 442731 440388 438359 436107 433431 430340 426930 423471 420419
62858 420419 418095 416387 414805 412824 410185 406949 403348 399635 396035 392737 389865 387441 385410 383663
62844 383663 381961 379924 377357 374601 372406 371295 371177 371652 372464 373449 374262 374537 374330 374081 374024 373889 373317
62827 373317 372418 371667 371334 371210 370955 370575 370390 370532 370608 370041 368786 367494 366843 366833 366915 366683 366160 365494 364727
62808 364727 363963 363434 363198 362949 362378 361562 360820 360295 359868 359493 359377 359783 360678 361622 362057 361791 361246 361134 361885
62789 361885 363446 365475 367487 368867 369194 368678 367952 367293 366435 365375 364810 365295 366325 366943 367057 367465 368565
62772 368565 369735 370224 370131 370200 371003 372590 374627 376652 378440 380272 382621 385543 388744 392294 396787 402539
62756 402539 409112 415891 422665 429280 435215 440089 444373 449148 455241 462808 471437 480311 488725 496965
62742D96965R358J1326J2583J2517J2250J2893J4141J5279J6523J8368K0456K2227
62730F74886K4025K6353K8627L0067L1418L4268L8688M3078M6466M9532N3011
62719A080419N6478N9314O1583O3249O3554O2067N9381N5987N1345M5012L7751
62708A696140L0415K2466J2926K326p652j6280k4182l1761l8488m3972m8510n2227
62696A501201n4736n6075n6987n7780n7745n6296n3910n1340m8568m5342m2111
62685I20311l9536l7429l5012l2082k9175k6697k4530k2477k0513j8557j6456
62674F17847j4259j2097r917p717n913m907m439l939l373l072k774j753o2J267
62660E44892J715K143L527N567P320Q706J0356J2258J3627J4264J5121J7072J9749
$$ plain form
62742 496965 506323 517649 530232 542749 554999 567892 582033 597312 613835 632203 652659 674886
62730 674886 698911 725264 753891 783958 815376 849644 888332 931410 977876 1027408 1080419
62719 1080419 1136897 1196211 1257794 1321043 1384597 1446664 1506045 1562032 1613377 1658389 1696140
62708 1696140 1726555 1749021 1761947 1764273 1756621 1740341 1716159 1684398 1645910 1601938 1553428 1501201
62696 1501201 1446465 1390390 1333403 1275623 1217878 1161582 1107672 1056332 1007764 962422 920311
62685 920311 880775 843346 808334 776252 747077 720380 695850 673373 652860 634303 617847
62674 617847 603588 591491 581574 573857 567944 563037 558598 554659 551286 548214 545440 543687 543625 544892
62660 544892 546607 548750 552277 557844 565164 573870 584226 596484 610111 624375 639496 656568 676317
62647F76317K2115K3811K5446K7718L0651L3684L6258L8326M0299M2533M4818
62636A041976M6514M7222M7150M6679M5769M3969M0891L6451L0673K3615J5625
62625A466534P462j57p208j4331k1932k9420l5628l9958m2906m5328m7521m9124
62613A140483m9671m9037m7468m5476m3555m1757l9690l7135l4460l2131l0033
62602F90070k7710k5115k2664k0599j8826j7354j6337j5554j4408j2724j1044
62591D87735r926r339q981q763q566p991o811n415m405l912l675l548l504l369
62577C99530k985k535k263k062j727j484j722k252k431k028j430r14k71O43J512
62562C77581K074K562L234L787L780L459L563M292M982N056M883N292O427P555
$$ plain form
62647 676317 698432 722243 747689 775407 806058 839742 876000 914326 954625 997158 1041976
62636 1041976 1088490 1135712 1182862 1229541 1275310 1319279 1360170 1396621 1427294 1450909 1466534
62625 1466534 1473996 1473839 1466631 1452300 1430368 1400948 1365320 1325362 1282456 1237128 1189607 1140483
62613 1140483 1090812 1041775 994307 948831 905276 863519 823829 786694 752234 720103 690070
62602 690070 662360 637245 614581 593982 575156 557802 541465 525911 511503 498779 487735
62591 487735 477809 468470 459489 450726 442160 434169 427358 421943 417538 413626 409951 406403 402899 399530
62577 399530 396545 394010 391747 389685 387958 386474 384752 382500 380069 378041 376611 375697 375426 376069 377581
62562 377581 379655 382217 385451 389238 393018 396477 400040 404332 409314 414370 419253 424545 430972 438527
62548D38527Q046Q120Q420R209J0344J1790J3604J5498J6981J8153J9778K2231
62536F00701K4787K6412K7034K7484K8314K9163K9324K8445K6565K3841K0489
62525H92559J6747J2734Q402L773r12n345r425j3287j7055k0562k3359k5093k5852
62512G93325k6060k5982k5579k4816k3878k2912k1868k0725j9658j8700j7551
62501E45596j5990j4284j2855j1701j0486r010p365n738m332l354k759k276j905
62488D43541k035k679k995k196o94M06P34Q73J233J544J666K045L011M140M769
62473D53363M743M413M215M489N361O562P648Q578R791J1542J3445J4866J5578
62460E64594J5972J6810J8676K1401K4094K6086K7627K9193L0504L0978L0933
$$ plain form
62548 438527 446573 454693 463113 472322 482666 494456 508060 523558 540539 558692 578470 600701
62536 600701 625488 651900 678934 706418 734732 763895 793219 821664 848229 872070 892559
62525 892559 909306 922040 930442 934215 933303 927958 918533 905246 888191 867629 844270 819177 793325
62512 793325 767265 741283 715704 690888 667010 644098 622230 601505 581847 563147 545596
62501 545596 529606 515322 502467 490766 480280 471270 463905 458167 453835 450481 447722 445446 443541
62488 443541 441506 438827 435832 433636 432942 433348 434082 434955 436188 437732 439398 441443 444454 448594 453363
62473 453363 458106 462519 466734 471223 476584 483146 490794 499372 509163 520705 534150 549016 564594
62460 564594 580566 597376 616052 637453 661547 687633 715260 744453 774957 805935 836868
62449H36868L1269L1874L1427K9183K5944K2748J9535J5846J1966Q529N534K741
62437A073464N16n90q55j062j268p19J047L700O729R926J3152J6112J8542K0371
62423A159065K1682K2696K3551K3847K2709J9689J5333J0537N607M18m976j0440
62411A309718j6170k2266k8117l2867l6411l9287m1683m3185m3495m2768m1263
62400I22206l9201l6926l4661l2155k9143k6059k3588k1615j9392j6782j4453
62389F28231j2699j1001r084p545o826o307n128l451k125j441r31l16M0k32q84
62374E60301j339j401j405j780k561l415m087m619n105n477n708o014o482o660
62360E04248o040m895m152m376n235o054o429o231n471m451l653l194k719k027
$$ plain form
62449 836868 868137 900011 931438 960621 986565 1009313 1028848 1044694 1056660 1065189 1070723 1073464
62437 1073464 1073980 1073390 1072535 1071473 1070205 1069486 1070533 1074233 1080962 1090888 1104040 1120152 1138694 1159065
62423 1159065 1180747 1203443 1226994 1250841 1273550 1293239 1308572 1319109 1324716 1325134 1320158 1309718
62411 1309718 1293548 1271282 1243165 1210298 1173887 1134600 1092917 1049732 1006237 963469 922206
62400 922206 883005 846079 811418 779263 750120 724061 700473 678858 659466 642684 628231
62389 628231 615532 604531 595447 587902 581076 574769 569641 566190 564065 562624 561693 561377 561417 561185 560301
62374 560301 558962 557561 556156 554376 551815 548400 544313 539694 534589 529112 523404 517390 510908 504248
62360 504248 498208 493313 489161 484785 479550 473496 467067 460836 455365 450914 447261 444067 441348 439321
62346D39321j389r81m96K71Q02M95k17j51J110K539K895K236J678J825K068J677
62330D53683J009J081K135L326L944M264M891N722O151N953N483N165N234N823
62316E13864O815P774Q426R058R976J0821J1025J0833J1123J2236J3699J5180
62304F40830J6940J9189K1653K4063K6394K8439K9823L0752L2012L3795L5084
62293I38974L4774L2812K9828K6178K2013J7719J3620R520N153Q13l089o724j0428
62280A111163j3890j6527j8461k0307k2030k2847k2447k1530k0860k0360j9498
62269H92406j8158j6729j5640j5082j5018j5238j5522j5809j6077j6097j5610
62258G17426j4816j4274j4250j4388j4260j3830j3235j2403j1206r837q643p732
$$ plain form
62346 439321 437932 436951 436455 436726 437528 438023 437806 437655 438765 441304 444199 446435 448113 449938 452006 453683
62330 453683 454692 455773 457908 461234 465178 469442 474333 480055 486206 492159 497642 502807 508041 513864
62316 513864 520679 528453 536879 545937 555913 566734 577759 588592 599715 611951 625650 640830
62304 640830 657770 676959 698612 722675 749069 777508 807331 838083 870095 903890 938974
62293 938974 973748 1006560 1036388 1062566 1084579 1102298 1115918 1125438 1130591 1131404 1128315 1121591 1111163
62280 1111163 1097273 1080746 1062285 1041978 1019948 997101 974654 953124 932264 911904 892406
62269 892406 874248 857519 841879 826797 811779 796541 781019 765210 749133 733036 717426
62258 717426 702610 688336 674086 659698 645438 631608 618373 605970 594764 584927 576284 568552
62246E68552p001o492o349o408o163n340m277l491l016k361j240K5R09J339J619
62231E20306J855J785J355J081J567K726L813M298M432M815N571O249O472O461
62217E72786O760P619Q834J0020J0811J0960J0617J0556J1574J3470J5027J5376
62205G04410J5078J5363J6628J8247J9726K1311K3438K6118K9080L1956L4155
62194I55510L5097L4867L4152L3204L1340K7827K2901J7471J2190P242K683j605
62182A212879o073j0968j5807j9822k2978k5888k8752l0993l2107l2321l2064
62171I55106l1287k9725k7575k5375k3346k1295j9152j7217j5644j4122j2324
62160G18044j0490r160q452p975p416o786n994m736l117j928j752k118k096j541
$$ plain form
62246 568552 561551 555059 548710 542302 536139 530799 526522 523031 520015 517654 516414 516439 517348 518687 520306
62231 520306 522161 523946 525301 526382 527949 530675 534488 538786 543218 548033 553604 559853 566325 572786
62217 572786 579546 587165 595999 606019 616830 627790 638407 648963 660537 674007 689034 704410
62205 704410 719488 734851 751479 769726 789452 810763 834201 860319 889399 921355 955510
62194 955510 990607 1025474 1059626 1092830 1124170 1151997 1174898 1192369 1204559 1211801 1214484 1212879
62182 1212879 1206806 1195838 1180031 1160209 1137231 1111343 1082591 1051598 1019491 987170 955106
62171 955106 923819 894094 866519 841144 817798 796503 777351 760134 744490 730368 718044
62160 718044 707554 698394 689942 681967 674551 667765 661771 657035 653918 651990 650238 648120 646024 644483
62146F44483j054q46m52L65J205J910K994M747O407O909O149M938M000L524L472
62131F88751L741M112M460M978N795O563O809O634O568O808O984O700N942N048
62117G69893M497M674N483O359P016P937R642J1693J3187J4178J5707J8221K0734
62104I09221K2059K2183K1757K0855J9054J6505J3888J1276P913L531q72m138
62092A063232o405q701j1436j4065j6246j8401k0762k2600k3080k2460k1701k1139
62080H56236k0250j8668j6785j5144j3858j2776j1825j0920j0025r303q924q593
62068F99165p831o748n926n429m661l522k820l010l257k582j339p38j192k052
62054F48058k767l415m069m433m312l850l250k683k497l026m145n459o833q213
$$ plain form
62146 644483 643429 642583 642131 642496 643701 645611 648605 653352 659759 666668 672817 677755 681755 685279 688751
62131 688751 692492 696604 701064 706042 711837 718400 725209 731843 738411 745219 752203 758903 764845 769893
62117 769893 774390 779064 784547 790906 797922 805859 815501 827194 840381 854559 870266 888487 909221
62104 909221 931280 953463 975220 996075 1015129 1031634 1045522 1056798 1064711 1068242 1067370 1063232
62092 1063232 1056827 1048126 1036690 1022625 1006379 987978 967216 944616 921536 899076 877375 856236
62080 856236 835986 817318 800533 785389 771531 758755 746930 736010 725985 716682 707758 699165
62068 699165 691334 684586 678660 673231 668570 665048 662228 659218 655961 653379 652040 651302 650110 648058
62054 648058 645291 641876 637807 633374 629062 625212 621962 619279 616782 613756 609611 604152 597319 589106
62040E89106r016q420o433m142k592j867j360n58O45K019L139L701L828L902M083
62025E76035M348M819N750P074Q377R360J0057J0612J1171J1950J3016J4022J4545
62012G01136J4642J4706J4872J4987J5086J5374J5790J6124J6491J7082J7457
62001H73747J6825J5078J2893J0648Q052N057K264k4k429n533q889j1691j3972
61988I02026j6405j9198k1812k3742k5024k5854k6175k5735k4506k2956k1820
61977F48799k1402k1197k0451j9071j7537j6047j4459j3089j2634j2894j2462
61966D67556j0459p925o619o821p271p060o552o314o136n522m588l888l680l694
61952C81027l547l059k277j367n83j30J8J59N56J047J180Q83P57J339K300K802
$$ plain form
62040 589106 580090 571670 565237 561095 558503 556636 555276 554718 555363 557382 560521 564222 568050 571952 576035
62025 576035 580383 585202 590952 598026 606403 615763 625820 636432 647603 659553 672569 686591 701136
62012 701136 715778 730484 745356 760343 775429 790803 806593 822717 839208 856290 873747
62001 873747 890572 905650 918543 929191 937243 942300 944564 944540 942111 936578 927689 915998 902026
61988 902026 885621 866423 844611 820869 795845 769991 743816 718081 693575 670619 648799
61977 648799 627397 606200 585749 566678 549141 533094 518635 505546 492912 480018 467556
61966 467556 457097 449172 442553 435732 428461 421401 414849 408535 402399 396877 392289 388401 384721 381027
61952 381027 377480 374421 372144 370777 370194 370064 370082 370241 370797 371844 373024 373907 374664 376003 378303 381105
61936C81105K580K108J694J128L55j72k34l47j063k237l398m408n201n380m709
61921C61821l748l347l636m024m026l636l051k563k553l094l649l632l016k122
61907C15724j024K01J047J029M50Pj68l75m51J78J422K433K783L010L639M363
61891C34268M564M206L773L678M029M705N447O166P161Q654J0113J0658J0333
61878D17755J0240J1036J2002J2116J1527J1192J1385J1370J0534R167P967P229
61866E43520O718O059N048L744K394J172P4q61j314r93j48M63L49q0J90J774M181
61849E72290O227P129P168P175P537P877P672O851N723M475L040J371k65j390
61835F42880j745j634j690k222k932l329l249k832k242j699j620k287l478m795
$$ plain form
61936 381105 383685 385793 387487 388615 388970 388798 388564 388217 387154 384917 381519 377111 371910 366530 361821
61921 361821 358073 354726 351090 347066 343040 339404 336353 333790 331237 328143 324494 320862 317846 315724
61907 315724 314700 314901 315948 316977 317427 317434 317266 316891 316440 316618 318040 320473 323256 326266 329905 334268
61891 334268 338832 343038 346811 350489 354518 359223 364670 370836 377997 386651 396764 407422 417755
61878 417755 427995 439031 451033 463149 474676 485868 497253 508623 519157 528324 536291 543520
61866 543520 550238 556297 561345 565089 567483 568655 568729 567868 566554 565561 565413 565876 566225 566145 566335 568109 572290
61849 572290 578517 585646 592814 599989 607526 615403 623075 629926 635649 640124 643164 644535 644270 642880
61835 642880 641135 639501 637811 635589 632657 629328 626079 623247 621005 619306 617686 615399 611921 607126
61821F07126o139p553q677r051q878q832q966q522p106n384m183l505k906k335
61807E15089j907j322k65Q58J361J401J943L511N540P151Q094Q779R736J1185
61793E71154J2840J4089J4634J4913J5558J6452J6879J6574J6046J5628J4862
61782G39629J3234J1045R028P351N513L183O59j475k860l455l429k995k203r42
61768G72283P66K491L663M087M016L699L176K505J928J601J177k3k332n239p700
61753G86098r039r534j0064j1169j2594j3734j4292j4399j4320j4235j4187j4063
61741F34468j3661j2964j2217j1548j0710r488q189p358p076o928o709o649o787
61728E14184o619n709m346l210k606k381k360k506k641k436j735o71M57J212J154
$$ plain form
61821 607126 600987 593434 584757 575706 566828 557996 549030 540508 533402 528018 523835 520330 517424 515089
61807 515089 513182 511860 511595 512453 513814 515215 517158 520669 526209 533360 541454 550233 559969 571154
61793 571154 583994 598083 612717 627630 643188 659640 676519 693093 709139 724767 739629
61782 739629 752863 763908 772936 780287 785800 788983 789642 788167 785307 781852 778423 775428 773225 772283
61768 772283 773049 775540 779203 783290 787306 791005 794181 796686 798614 800215 801392 801369 799037 793798 786098
61753 786098 777059 767525 757461 746292 733698 719964 705672 691273 676953 662718 648531 634468
61741 634468 620807 607843 595626 584078 573368 563880 555691 548333 541257 534329 527620 520971 514184
61728 514184 507565 501856 497510 494300 491694 489313 486953 484447 481806 479370 477635 476964 477421 478633 479787
61713D79787L65k43L19K000L689M501M600M645M921N384O100P079P874P933P333
61698E46287O731O535O511O295N777M817L065N02k087l746m425n026o234p719
61684E57283q689q919q886r014r231r253q934q203p016n637m673m475m644m506
61670D55203m017l787m117m414l863k459j087n46p84j108j061q25q32j138j440
61655D23725j596j761j935j765j162p26j126k152k897k827k252j768j730k274
61641C97754l161l633l075k103k173l674n137n023l661k544k213j922j258r16
61627C57261j617l073m380m802m012k215l73L21k48r44q02k18j77p70j188q55
61611C31908L8R83J560J462P16k3L9Q81J634J630J143Q58J026J409J836K354K895
$$ plain form
61713 479787 480152 479909 480228 482228 485917 490418 495018 499663 504584 509968 516068 523147 531021 538954 546287
61698 546287 553018 559553 566064 572359 578136 582953 586018 586520 584433 580687 576262 571236 565002 557283
61684 557283 548594 539675 530789 521775 512544 503291 494357 486154 479138 473501 468828 464353 459709 455203
61670 455203 451186 447399 443282 438868 435005 432546 431459 430913 430129 429021 427960 427135 426303 425165 423725
61655 423725 422129 420368 418433 416668 415506 414780 413654 411502 408605 405778 403526 401758 400028 397754
61641 397754 394593 390960 387885 385782 383609 379935 374798 369775 366114 363570 361357 359435 358177 357261
61627 357261 355644 352571 348191 343389 339377 337162 336789 337110 336862 335918 335116 334898 334721 333951 332763 331908
61611 331908 331946 332929 334489 335951 336667 336644 336683 337564 339198 340828 341971 342829 343855 345264 347100 349454 352349
61594C52349L129K788J985J101M03j31n40o16j22P88J636K228K863L705M199L700
61578C79465K531J851K231K870K617J330k07j429k423l240l531l167k772l103
61564C73023m027m593m111k911j888j572j833k281k689k939k887k506k123k230
61550C34433k927l697l977l794l622l614l425k839k233k028k034j778j381j472
61536B95612k117k451j805p82n87j487k466k515j751r89o60n05j56M04R09J071
61520B79725P52J02m91p00n89m54m04l21j43J5J55M35Q30J043R68R73J423K118
61502B85437K512K383J963J519J177J080J285J495J327R17Q62J369J912J916J464
61487C08618J044R25J019J124J037P08M89R14J914K609K184Q21n95j332j246o83
$$ plain form
61594 352349 355478 358266 360251 361352 361755 361624 361084 360468 360346 361134 362770 364998 367861 371566 375765 379465
61578 379465 381996 383847 386078 388948 391565 392895 392688 391259 388836 385596 382065 378898 376126 373023
61564 373023 368996 364403 360292 357381 355493 353921 352088 349807 347118 344179 341292 338786 336663 334433
61550 334433 331506 327809 323832 320038 316416 312802 309377 306538 304305 302277 300243 298465 297084 295612
61536 295612 293495 291044 289239 288457 287870 286383 283917 281402 279651 278662 278002 277497 277341 277745 278654 279725
61520 279725 280477 280579 280088 279388 278799 278345 277941 277620 277477 277492 277647 278082 278912 279955 280923 281896 283319 285437
61502 285437 287949 290332 292295 293814 294991 296071 297356 298851 300178 301095 301957 303326 305238 307154 308618
61487 308618 309662 310587 311606 312730 313767 314475 314964 315878 317792 320401 322585 323406 322811 321479 320233 319550
61471C19550l40p78j644j796p73M24O42K12K99J030J380Q69J98M0K51N49R91J425
61453C22529J429J214J595K558K881J935P73N59Q14M25l07k8J543L164L757L456
61437C48297K887K465K549L343M280M349L476K828L306M258M314L112J577P31
61423C91772O98Q72O51j15j123j877k006j529r08o20n94k10Q11J777J757Q38l4
61406C90160m23q00j365j476q77m59r53j644j453o76m13p39p75l42j36k65m3N55
61388C77876O84K35L22J516K827L215L039L098L222K884K432K523K891K746K110
61373D11620J687J602J316P17L90O92J365K056K558K525J771R87J252K602L752
61358D36892L655K694J866J450J106Q58J066J473J134l73k191l117k996k682k717
$$ plain form
61471 319550 319210 318432 316788 314992 314219 314643 315285 315497 315796 316826 318206 319075 319273 319313 319564 320113 321104 322529
61453 322529 323958 325172 326767 329325 332206 334141 334914 335473 336287 336712 336405 336377 337920 341084 344841 348297
61437 348297 351184 353649 356198 359541 363821 368170 371646 374474 377780 382038 386352 389464 391041 391772
61423 391772 392470 393342 393993 393878 392755 390878 388872 387343 386435 385815 385221 385011 385822 387599 389356 390194 390160
61406 390160 389737 388937 387572 386096 385219 384760 383807 382163 380710 380034 379621 378882 378107 377765 377629 377364 377321 377876
61388 377876 378560 378795 379117 380633 383460 386675 389714 392812 396034 398918 401350 403873 406764 409510 411620
61373 411620 413307 414909 416225 416942 417332 418024 419389 421445 424003 426528 428299 429286 430538 433140 436892
61358 436892 440547 443241 445107 446557 447663 448521 449587 451060 452194 451821 449630 446513 443517 440835 438118
61343D38118k697k091j144n74o70j147j678k072k075j562j024j282k429l510l565
61328D10598k720j917j719j716j078L94J838K082R29m34o47L77J569K089K090
61313D11735K067K199K460K816K984K499J432N78O09J339K114K535K475J865R20
61298D40627K13R8L28N93J073K041L264M263M873N068M569L210J537M35K43O31
61282D73066J163J549J542J148Q43J083J661J974J845J596J376R37J34q23j648
61267D87446k205k432k304j935j420o89K33J004J305J339J542J959K312K582L009
61252D91746L530L722L456L251L794N285P191Q531Q544P402O128N455M976L783
61238E66794J719m62k079l058l580l798l978m421n086n622n831n770n435m810
$$ plain form
61343 438118 435421 433330 432186 431612 430942 429795 428117 426045 423970 422408 421384 420102 417673 414163 410598
61328 410598 407878 405961 404242 402526 401448 401842 403680 405762 406691 406257 405610 405987 407556 409645 411735
61313 411735 413802 416001 418461 421277 424261 426760 428192 428770 429379 430718 432832 435367 437842 439707 440627
61298 440627 440840 440938 441266 441859 442932 444973 448237 452500 457373 462441 467010 470220 471757 472192 472435 473066
61282 473066 474229 475778 477320 478468 479311 480394 482055 484029 485874 487470 488846 489783 489917 489094 487446
61267 487446 485241 482809 480505 478570 477150 476461 476694 477698 479003 480342 481884 483843 486155 488737 491746
61252 491746 495276 498998 502454 505705 509499 514784 521975 530506 539050 546452 552580 558035 563011 566794
61238 566794 568513 568051 565972 562914 559334 555536 551558 547137 542051 536429 530598 524828 519393 514583
61224E14583m138l688l294k613j859j682k220k789k705j936q21K79R39Q56L41
61209D89253J90P58J573K102K410K821L347L829M265M644M743M423L885L405L107
61194E34755L035L140L061K406J520J330K141L084L234K748K337K031J331L05
61180E66458l39l65l65q53j520j789j634j405j169o46J89Q86J005O37L21M94J164
61163E61069K036K768L085K890K408K081K108K258K296K370K633K741K178J100
61149E94021K89K22N56P78Q59J098J630K410L368M333N064N533N952O364O495
61134F38972O249N947N809N530M729L516K256J048j45j127j732k205k861l487
61120F62499l617l329l205l476l761l787l788m002m204m089l766l542l462l391
$$ plain form
61224 514583 510445 506757 503463 500850 498991 497309 495089 492300 489595 487659 486838 487117 488056 488912 489253
61209 489253 489443 490201 491774 493876 496286 499107 502454 506283 510548 515192 519935 524358 528243 531648 534755
61194 534755 537790 540930 543991 546397 547917 549247 551388 554472 557706 560454 562791 564822 566153 566458
61180 566458 566119 565754 565389 564536 563016 561227 559593 558188 557019 556373 556562 557448 558453 559090 559411 559905 561069
61163 561069 563105 565873 568958 571848 574256 576337 578445 580703 582999 585369 588002 590743 592921 594021
61149 594021 594310 594532 595088 595866 596725 597823 599453 601863 605231 609564 614628 620161 626113 632477 638972
61134 638972 645221 651168 656977 662507 667236 670752 673008 674056 673911 672784 671052 668847 665986 662499
61120 662499 658882 655553 652348 648872 645111 641324 637536 633534 629330 625241 621475 617933 614471 611080
61106F11080l344l359l202k629j914j733k340l164l369k668j381M1J310K289K984
61091E88601L613M398N267N935O228O036N148L549J956J448K284L559M392M953
61077F47367N774O618O916O993P864R690J1394J2165J2474J3133J4065J4739J5263
61064G84455J6200J7498J8387J8472J8256J8382J8721J8612J7857J7064J6902
61053I80806J7156J6871J5438J3251J1083R121P013M615K172j19k207l895n089
61040A066216o305q244j0716j2737j3869j4709j5724j6519j6752j6978j7781j8679
61028H97203j8725j7798j6561j5490j4702j4338j4271j3758j2244j0333r100q592
61016G31291p932o788n811n479n482n380n061m353l036j531p40q00o93M29K185
$$ plain form
61106 611080 607736 604377 601175 598546 596632 594899 592559 589395 586026 583358 581977 582018 583328 585617 588601
61091 588601 592214 596612 601879 607814 614042 620078 625226 628775 630731 632179 634463 638022 642414 647367
61077 647367 653141 659759 666675 673668 681532 691222 702616 714781 727255 740388 754453 769192 784455
61064 784455 800655 818153 836540 855012 873268 891650 910371 928983 946840 963904 980806
61053 980806 997962 1014833 1030271 1043522 1054605 1063726 1070739 1075354 1077526 1077407 1075200 1071305 1066216
61040 1066216 1059911 1051667 1040951 1028214 1014345 999636 983912 967393 950641 933663 915882 897203
61028 897203 878478 860680 844119 828629 813927 799589 785318 771560 759316 748983 739883 731291
61016 731291 723359 716571 710760 705281 699799 694419 689358 685005 681969 680438 679698 678898 678205 678634 680819
61001F80819L600M288M568M853N382O240P279Q327R503J1009J2547J3627J4515
60988G86557J6080J8401K0475K1711K2856K4715K6787K8133K8956L0260L2324
60977A057255L4573L6822L9621M3265M7266N1015N4291N7053N9363O1628O4410
60966A606562O7850P1678P5834Q0571Q5991R2011R8809J06796J16058J26232J37039
60955B665431J48634J61695J77621J98331K25163K58214K97352L43298L96626
60946D872365M56151N19942N87508O59183P33931Q11137Q94109R84066J063466
60937A1581858J089285J016329Q37156N97694L67833J95582R0209M1674M0309
60928A5857929O8766Q4617L0908j23624l55371o00788q00269r28381r90273j001517
$$ plain form
61001 680819 684419 688707 693275 698128 703510 709750 717029 725356 734859 745868 758415 772042 786557
60988 786557 802637 821038 841513 863224 886080 910795 937582 965715 994671 1024931 1057255
60977 1057255 1091828 1128650 1168271 1211536 1258802 1309817 1364108 1421161 1480524 1542152 1606562
60966 1606562 1674412 1746090 1821924 1902495 1988486 2080497 2179306 2286102 2402160 2528392 2665431
60955 2665431 2814065 2975760 3153381 3351712 3576875 3835089 4132441 4475739 4872365
60946 4872365 5328516 5848458 6435966 7095149 7829080 8640217 9534326 10518392 11581858
60937 11581858 12671143 13687472 14524628 15122322 15490155 15685737 15775946 15817620 15857929
60928 15857929 15926695 16011312 16042220 15918596 15563225 14962437 14162168 13233787 12243514 11241997
60918A1241997r75956r25373q60611p89702p17175o46045n78858n16613m58655
60909D773009m04554l55114l11228k73026k40523k13878j92375j74206j57953
60900B450152j43490j30882j19368j08219r7742q8543q0419p2871o6162o0858
60890A481598n6731n2989m9447m6576m4456m2484m0105l7306l4368l1655k9632
60879A015849k8550k8078k7613k6878k5881k4588k3046k1611k0521j9491j8237
60868G51355j7143j6695j6552j5909j4667j3489j2739j2141j1466j0805j0171
60857E99578r556r382j0039j0917j0873r803q757q186p236n368l600l234m042
60844D98585m744m802m730m853m717l839k475j466j587k901m521n227m630l484
$$ plain form
60918 11241997 10266041 9340668 8480057 7690355 6973180 6327135 5748277 5231664 4773009
60909 4773009 4368455 4013341 3702113 3429087 3188564 2974686 2782311 2608105 2450152
60900 2450152 2306662 2175780 2056412 1948193 1850451 1761908 1681489 1608618 1542456 1481598
60890 1481598 1424867 1371878 1322431 1275855 1231399 1188915 1148810 1111504 1077136 1045481 1015849
60879 1015849 987299 959221 931608 904730 878849 854261 831215 809604 789083 769592 751355
60868 751355 734212 717517 700965 685056 670389 656900 644161 632020 620554 609749 599578
60857 599578 590022 580640 570601 559684 548811 539008 530251 522065 514829 509461 505861 502627 498585
60844 498585 493841 489039 484309 479456 474739 470900 468425 466959 465372 462471 457950 452723 448093 444609
60830D44609k676k341k281k568l181l547l238k738k736l051l021k649k379j991
60816D06212q30P68J471P69k19l32J37J70l45o26k87J77K86K98Q49K046L113K978
60798D16635J352q18k173k300j949j884j978j642q20p0O0n56j674k769l209k727
60782C93478j791j250j630k802m218n238n433m931m365m213m262l947l175k453
60768C43770k176k235k321k354k388k386k241j879j256m65R2J6m89o61j60L55
60752C23222O9q25j352j070n25k79q7N66J521K025J611N54m71r07o27o3R2m27
60734C23027j048j026m11l6m79j367j893j717j162p06n66p25j134j738k314k475
60718C04230j990j134m93l64n09o27q04j214j646j741j509j253j022n96J2N04
$$ plain form
60830 444609 441933 439592 437311 434743 431562 428015 424777 422039 419303 416252 413231 410582 408203 406212
60816 406212 405382 406150 407621 408390 408171 407839 407976 408146 407801 407175 406888 407065 407351 407649 408498 410544 413657 416635
60798 416635 417987 417169 414996 412696 410747 408863 406885 405243 404423 404353 404413 403857 402183 399414 396205 393478
60782 393478 391687 390437 388807 386005 381787 376549 371116 366185 361820 357607 353345 349398 346223 343770
60768 343770 341594 339359 337038 334684 332296 329910 327669 325790 324534 324069 324161 324177 323688 323027 322867 323222
60752 323222 323291 322466 321114 320044 319519 319240 319153 319719 321240 323265 324876 325430 324959 324052 323425 323362 323454 323027
60734 323027 321979 320953 320542 320506 320027 318660 316767 315050 313888 313182 312616 311891 310757 309019 306705 304230
60718 304230 302240 301106 300613 300249 299740 299113 298309 297095 295449 293708 292199 290946 289924 289328 289340 289844
60702B89844Q15J147J463J370P72J33j22q5KK16P08J302J708J893J938J787J473
60685C06364J329J578J920J850J284M94l30j057j340r26k43j22p92j481j293k11
60669C07024R23J358J056N25J83L5j15k80k56M9M46O35M48q3p55j232j234q36
60651C07891m80n82j158j765j860j281n42l86r29j491j510j356j681k313k452
60636B88105j857j065m55J20O32O43R7m63p37r76j101m36J076K308K301J534J030
60619B90756R31Q40R35J676K743L354L338L057K500J428J79o66j269k133k844
60604C04825k326n38J155J511N92p56j782k058j518o05K17J026J983K570K225
60589C06521J507J521K150K150J157K61J97K08n56j674k281k301j985j126K51
$$ plain form
60702 289844 290659 291806 293269 294639 295411 295544 295422 295337 295339 295555 296263 297565 299273 301166 303104 304891 306364
60685 306364 307693 309271 311191 313041 314325 314819 314489 313432 312092 311166 310923 310801 310009 308528 307235 307024
60669 307024 307947 309305 310361 310886 311069 311104 310989 310709 310453 310502 310948 311583 312031 311948 311193 309961 308727 307891
60651 307891 307411 306829 305671 303906 302046 300765 300223 299837 298908 297417 295907 294551 292870 290557 288105
60636 288105 286248 285183 284728 284848 285480 286123 286220 285757 285020 284044 282943 282507 283583 285891 288192 289726 290756
60619 290756 291687 292527 293462 295138 297881 301235 304573 307630 310130 311558 311737 311071 309802 307669 304825
60604 304825 302499 301961 303116 304627 305219 304463 302681 300623 299105 298500 298717 299743 301726 304296 306521
60589 306521 308028 309549 311699 313849 315006 315267 315464 315672 315116 313442 311161 308860 306875 305749 306000
60574C06000J169P24n69j392j277q31o06n36l45J01P19J087O81l42j038q24k31
60557C02490l4j70j19J49L47N01O87N66rl69J44J083J540J503J581J709J290N40
60539C13429M65J307K103K098J641J373J373J488J762K078K022J592J397J813
60525C35941K425K675K521K070J221J58m13r2O02J048J452K328L427M072M268
60510C63703M700N545O176O240O285O879P603P482O194M444L137K534K259J902
60496D35083J474J254J291J190N74k87o05O7J381K757M113N662P216Q290Q882
60481D78342R615J0803J1954J2559J2940J3698J4684J5211J5226J5416J5984J5957
60469F42389J4229J0844O910L527J123m97j940l828o200q328r386r201q156o641
$$ plain form
60574 306000 307169 307893 307324 305932 304655 303824 303218 302682 302337 302438 303157 304244 304925 304583 303545 302721 302490
60557 302490 302456 302286 302167 302316 302663 303164 303851 304417 304408 304039 304183 305266 306806 308309 309890 311599 312889 313429
60539 313429 313894 315201 317304 319402 321043 322416 323789 325277 327039 329117 331139 332731 334128 335941
60525 335941 338366 341041 343562 345632 346853 347011 346598 346506 347108 348156 349608 351936 355363 359435 363703
60510 363703 368403 373948 380124 386364 392649 399528 407131 414613 420807 425251 428388 430922 433181 435083
60496 435083 436557 437811 439102 440292 440866 440579 439974 440041 441422 444179 448292 453954 461170 469460 478342
60481 478342 487957 498760 510714 523273 536213 549911 564595 579806 595032 610448 626432 642389
60469 642389 656618 667462 674372 677899 679022 678525 676585 672757 666557 658229 648843 639642 631486 624845
60455F24845m962l556k718k111j030P43K606L789M178M403N317P408J0533J4084
60441F63529J7424K0218K2407K4046K5280K6302K7143K7577K7374K6543K5158
60430I33001K3146K0478J7468J4685J2552J1198J0464R839Q507N846J910k841
60418A066253q149j4006k0098k5640k9960l2982l5013l6280l6797l6540l5508
60407G55280l3728l1371k8786k6281k3921k1640j9547j7897j6692j5496j3857
60396E06064j1937j0408r640r231q540p506o658o370o460o478o126n386m522l938
60382D02864l757l552k891k069j853k441l167l404l133k522j572n68k11p44j422
60367C69558j434r76p65q77q21m82j77P7N79J161J178N05j27q0M17P49P57P79
$$ plain form
60455 624845 619883 616327 613609 611498 610468 611211 613817 617606 621784 626187 631504 638912 649445 663529
60441 663529 680953 701171 723578 747624 772904 799206 826349 853926 881300 907843 933001
60430 933001 956147 976625 994093 1008778 1021330 1032528 1042992 1052831 1061338 1067184 1069094 1066253
60418 1066253 1058104 1044098 1024000 998360 968400 935418 900405 864125 827328 790788 755280
60407 755280 721552 690181 661395 635114 611193 589553 570006 552109 535417 519921 506064
60396 506064 494127 483719 474079 464848 456308 448802 442144 435774 429314 422836 416710 411324 406802 402864
60382 402864 399107 395555 392664 390595 388742 386301 383134 379730 376597 374075 372503 371935 371724 370980 369558
60367 369558 368124 367148 366383 365506 364685 364203 364026 364103 364682 365843 367021 367526 367399 367319 367736 368485 369242 370021
60349C70021J145J848K522K612J815N26m22n40j9O95J359J871K168K361K699L194
60333C93855L466L188K491J817J496J592J975K333K239J487M40j03M39J755K782
60318D21252K730J961J503J710J886J440Q62R67J610J913J561J105J003J113J315
60303D43931J787K374K351J351J19k37N41J804K887L607L994M046L784L244K441
60288D78024J494P54M76L97l3r21j704j865j673j890k722l515l650l379l297l209
60272D53287k319o37N15j7j768l273l753l500k864j803n06M19P14Q57J354K109
60256D38815K732L132L481L883M348M830N138N101M921M973N194N115M713M552
60242E00928M821M752L660K058J067Q27K82j429l926o126p393p848p873p672p288
$$ plain form
60349 370021 371166 373014 375536 378148 379963 380489 380067 379527 379508 380203 381562 383433 385601 387962 390661 393855
60333 393855 397321 400509 403000 404817 406313 407905 409880 412213 414452 415939 416379 416276 416715 418470 421252
60318 421252 423982 425943 427446 429156 431042 432482 433344 434311 435921 437834 439395 440500 441503 442616 443931
60303 443931 445718 448092 450443 451794 451913 451676 452217 454021 456908 460515 464509 468555 472339 475583 478024
60288 478024 479518 480272 480748 481145 481112 480191 478487 476622 474949 473059 470337 466822 463172 459793 456496 453287
60272 453287 450968 450331 450846 450829 449061 445788 442035 438535 435671 433868 433362 433781 434495 435352 436706 438815
60256 438815 441547 444679 448160 452043 456391 461221 466359 471460 476381 481354 486548 491663 496376 500928
60242 500928 505749 510501 514161 516219 517286 518113 518395 516966 513040 506914 499521 491673 483800 476128 468840
60227D68840o769o150n439m708m161l969l965l739l123k400j874j532j393j801
60213D17817k794l537l129j922j233j525j786j123j67q3q36j275q30j70j29o54
60197C96624j076r05j58Q55J731K156K060J652J247J056J070J078R32P62P56P32
60181D10572L60j45j6R80J897J663N16k16K96J553K559K850K582K119J862K127
60165D31559K870L641M096M383M835N420N757N604N193M976N186N642N985O063
60151E01210N989N874N698N510N551N872O092N833N295N040N159N161M702L984
60137E76970L269K478J574R06O71L95m18j321j302k43O76L70q37j692j529q27
60121E79140m30o19r96r89m34J91J99n33j342j604j530j773k327k390j533n06
$$ plain form
60227 468840 462071 455921 450482 445774 441613 437644 433679 429940 426817 424417 422543 421011 419618 417817
60213 417817 415023 411486 408357 406435 405202 403677 401891 400768 400601 400518 399682 398407 397577 397407 397278 396624
60197 396624 395548 394643 394485 395340 397071 399227 401287 402939 404186 405242 406312 407390 408322 409084 409840 410572
60181 410572 410932 410787 410771 411751 413648 415311 415827 415611 415907 417460 420019 422869 425451 427570 429432 431559
60165 431559 434429 438070 442166 446549 451384 456804 462561 468165 473358 478334 483520 489162 495147 501210
60151 501210 507199 513073 518771 524281 529832 535704 541796 547629 552924 557964 563123 568284 572986 576970
60137 576970 580239 582717 584291 585197 585868 586263 585845 584524 583222 582979 583655 584025 583188 581496 579967 579140
60121 579140 578710 578091 577095 576106 575672 575863 576062 575529 574187 572583 571053 569280 566953 564563 563030 562524
60105E62524m47j501k641k826k030j069o36p23r53j203j602k022j972j271m85
60090E41143k69m83m68n2K81K18J4q1j12l1M11J053J264R00O69J059J523J364
60072E48403Q84Q65J318J673J858K326K978L029K122R20L39O77J600K514K935
60057E74441K886K990L689M542M769M374M052M071M047L823L717L728L320K381
60043F26830J659J761K368K789K798K514K022J572J627K235K651K121P32q02j941
60028F50936k519k618k619l086m195n488o493p238p841q036p563o770o296o245
60014E73929o116n544m819m631n279o183o302n315m198m046m521m251k851j527
60000E08346j353j866k052j917k115k613k753k404k090j980j610p67j6N4l50m07
$$ plain form
60105 562524 562077 560576 557935 555109 553079 552010 551374 550651 549698 548495 546893 544871 542899 541628 541143
60090 541143 540874 540391 539923 539871 540152 540370 540384 540303 540191 540160 540571 541624 542888 543788 544457 545516 547039 548403
60072 548403 549287 550152 551470 553143 555001 557327 560305 563334 565456 566376 566715 567392 568992 571506 574441
60057 574441 577327 580317 584006 588548 593317 597691 601743 605814 609861 613684 617401 621129 624449 626830
60043 626830 628489 630250 632618 635407 638205 640719 642741 644313 645940 648175 650826 652947 653679 652877 650936
60028 650936 648417 645799 643180 640094 635899 630411 623918 616680 608839 600803 593240 586470 580174 573929
60014 573929 567813 562269 557450 552819 547540 541357 535055 529740 525542 521496 516975 512724 509873 508346
60000 508346 506993 505127 503075 501158 499043 496430 493677 491273 489183 487203 485593 484826 484810 484864 484514 484107
59984D84107L40J417J828J220M03M30J234J748J462R54O95K51p20j534j485j125
59968D91225j458k307k630k286k237k978l763l775l136k424j912j675j839k280
59954D56525k555k463k339k456k611k536k423k572k809k565j573k63N11J51j147
59939D28875k442k762j899n67K45Q9n51o79J72J364J851J490J159J520K193K475
59923D32533K304K046J875J865K210K762K816K080J287J148J104K29j065j417
59909D51777n35L83M39N3j63l81q49j110p40k24k73p43q64l70K41M18J56j09Q7
59890D47193P77J441J527J136Q42P99N42j47p55p54l05K11Q75J943L120L751L592
59873D65788L047K661K815L708N131O295O329N142L512K230J442R06N28L42J71
$$ plain form
59984 484107 484447 485864 487692 488912 489315 489745 490979 492727 494189 495143 495838 496089 495369 493835 492350 491225
59968 491225 489767 487460 484830 482544 480307 477329 473566 469791 466655 464231 462319 460644 458805 456525
59954 456525 453970 451507 449168 446712 444101 441565 439142 436570 433761 431196 429623 429360 429871 430022 428875
59939 428875 426433 423671 421772 421205 421450 421539 420988 420309 420481 421845 423696 425186 426345 427865 430058 432533
59923 432533 434837 436883 438758 440623 442833 445595 448411 450491 451778 452926 454030 454259 453194 451777
59909 451777 451242 451625 452064 452117 451954 451573 450724 449614 448874 448650 448377 447634 446770 446400 446641 447059 447215 447106 447193
59890 447193 447970 449411 450938 452074 452916 453715 454257 454110 453355 452601 452296 452507 453382 455325 458445 462196 465788
59873 465788 468835 471496 474311 478019 483150 489445 495774 500916 504428 506658 508100 509006 509534 509876 510047
59858E10047k03n10l1J529L436M536M441L777L299L099K835K341J775J357J149
59843E42877R58M19n99j657k196k303k513k815k607j844j395j732k077j622q25
59828E20069n67n69J86J799L333M180M450M086K835J263O37J397K652L513M044
59813E53308M514M575L847K616J490P73N21O91R67R47O98O55Q06O71K59K26Q14
59796E78378J419J586J704K197K830L305L851M645N223N109M387L217J477m97
59782F18831j565j007M21J494K039K616L116K760J361l28j515k030k102k082k289
59767F19720k668k678k033j290j207j729k190k244j966j286p3J256J946J862J599
59752F07019J575J482Q09m87j934k861k829j978r87m35l88o91j271j832j796j092
$$ plain form
59858 510047 509844 509334 509303 510832 514268 518804 523245 527022 530321 533420 536255 538596 540371 541728 542877
59843 542877 543835 544254 543655 541998 539802 537499 534986 532171 529564 527720 526325 524593 522516 520894 520069
59828 520069 519502 518933 519119 520918 524251 528431 532881 536967 539802 541065 541702 543099 545751 549264 553308
59813 553308 557822 562397 566244 568860 570350 571123 571644 572335 573302 574249 574947 575602 576408 577079 577338 577564 578378
59796 578378 579797 581383 583087 585284 588114 591419 595270 599915 605138 610247 614634 617851 619328 618831
59782 618831 617266 616259 616680 618174 620213 622829 625945 628705 630066 629738 628223 626193 624091 622009 619720
59767 619720 617052 614374 612341 611051 609844 608115 605925 603681 601715 600429 600356 601612 603558 605420 607019
59752 607019 608594 610076 610885 610398 608464 605603 602774 600796 599809 599374 598986 598295 597024 595192 593396 592304
59736E92304n60q49j372j168n02n59j623k609k573j739q11j66q3q83k218k976
59720E71613k464j258l26J24L86L87p9n62l69K88L91m04j090n85Q51J993K183
59703E71079J913J957K464L092L540L699L558L355L588M492N578O085N850N393
59689F25643N153N064M956M881M859M749M509M289M054L486K507J527Q89M56K2
59674F77044k72k26N5M39R78J550J708J384J225J631J922J283K07j8Q04J439R69
59657F92122J3l06J06N27O96J164K319L665M357M277M223M953O234P113P128O848
59641G45439P097P966Q917R534R798R755R378Q702P803O670N426M470M095M076
59627H49126L941L527K955K210J240L38o6l9j18o66j584k687l904n023n634n513
$$ plain form
59736 592304 591744 590895 589523 588355 587853 587294 585671 583062 580489 578750 577939 577773 577690 576807 574589 571613
59720 571613 569149 567891 567565 567689 568075 568462 568383 567821 567452 567740 568131 567727 566637 566052 566903 568896 571079
59703 571079 572992 574949 577413 580505 584045 587744 591302 594657 598245 602737 608315 614400 620250 625643
59689 625643 630796 635860 640816 645697 650556 655305 659814 664103 668157 671643 674150 675677 676566 677022 677044
59674 677044 676772 676546 676601 677040 678018 679568 681276 682660 683885 685516 687438 688721 688928 688910 689714 691153 692122
59657 692122 692135 691829 691935 692462 693158 694322 696641 700306 704663 708940 713163 718116 724350 731463 738591 745439
59641 745439 752536 760502 769419 778953 788751 798506 807884 816586 824389 831059 836485 840955 845050 849126
59627 849126 853067 856594 859549 861759 862999 863337 863271 863232 863114 862448 860864 858177 854273 849250 843616 838103
59611H38103m889m255l945l895l663k906j941j499j697j689p90N27J391J914K916
59596H13682M422N462N492N073M795M286K869O87j340k523l020l667n245p609
59582H23364r584j0220j0132j0883j2839j4526j4520j3179j1864j1114j0465r711
59570F84327r278r380r596r475r089q750q656q862r288r604r486r099r006r401
59556E55357r701r164p738o030m615l631l008k780k859k857k426j755j336j206
59542D96251q65o4P02Q80O02L60K27K1n8L24Q62Q54L31O6L08L18l57j022r17n10
59522D98313q25j899k863l268l404l382k886k054j649j981k322j919r84k30R3
59507D68740J39r3n99r50p75m64o55j071p55L99J249R78L15M92J544K473K782
$$ plain form
59611 838103 833214 828959 825014 821119 817456 814550 812609 811110 809413 807724 806934 807461 808852 810766 813682
59596 813682 818104 823566 829058 834131 838926 843212 846081 846768 845428 842905 839885 836218 830973 823364
59582 823364 813780 803560 793428 782545 769706 755180 740660 727481 715617 704503 694038 684327
59570 684327 675049 665669 656073 646598 637509 628759 620103 611241 601953 592349 582863 573764 564758 555357
59556 555357 545656 536492 528754 522724 518109 514478 511470 508690 505831 502974 500548 498793 497457 496251
59542 496251 495386 495322 496024 496904 497506 497866 498093 498114 498056 498380 499242 500096 500427 500493 500801 501119 500762 499740 498823 498313
59522 498313 497488 495589 492726 489458 486054 482672 479786 477732 476083 474102 471780 469861 468877 468647 468740
59507 468740 468879 468786 468187 467237 466462 465998 465343 464272 463517 463916 465165 466143 466458 466950 468494 470967 473749
59490D73749K950L432M044M536N068N765O348O518O453O556P030P948R299J0725
59476E60421J1395J0572Q223N016J943n4o37m91p04j467j859j288n38p12j695
59461E88125k440k535k531k776k852k476k154k511l422m225m538m570m759n286
59447E41050n839n827n036l997l413l246k786j721o67l88q20j252j211q28l76
59432E03643J96J088K195L104L544L677L748L675L272K776K673K958L050K664
59418E42263K294K466K963L114K615J600L21q20j308j048o26n57o73o67p51j088
59402E50098j083j46J201J903J864J816J959J897J885K791M531N731N526M610
59388E84583L956L498K792K081J741J337K81j062j766j675j431j353j072l37M77
$$ plain form
59490 473749 476699 480131 484175 488711 493779 499544 505892 512410 518863 525419 532449 540397 549696 560421
59476 560421 571816 582388 590611 595627 597570 597516 596879 596388 595684 594217 592358 591070 590532 589820 588125
59461 588125 585685 583150 580619 577843 574991 572515 570361 567850 564428 560203 555665 551095 546336 541050
59447 541050 535211 529384 524348 520351 516938 513692 510906 509185 508518 508130 507310 506058 504847 504019 503643
59432 503643 503839 504927 507122 510226 513770 517447 521195 524870 528142 530918 533591 536549 539599 542263
59418 542263 544557 547023 549986 553100 555715 557315 557636 556816 555508 554460 553834 553277 552604 551937 551186 550098
59402 550098 549015 548869 550070 551973 553837 555653 557612 559509 561394 564185 568716 574447 579973 584583
59388 584583 588539 592037 594829 596910 598651 599988 600269 599207 597441 595766 594335 592982 591910 591573 592050
59373E92050Q55P91P43J147J991K818L198L244L418L918M580N419O719Q458J0095
59358F49444J1158J1612J1560J1181J1198J2572J5181J7316J7113J4167R433M173
59346G96108m12l189l747k879j681l14J682M040N481M835J928k558p456j1377
59332G80461j3331j3417j2613j1766j1052j0322r489q419o925n106l473k489k129
59319F69930j932j423n01N07J213J537J661J659J493J387J786K729L623L910L693
59304F91272L428L338L422L737M276M803N125N285N285M980M570M728N758O987
59290G56994P538P402P201P204P202P090O955O703O263N952O014N956N088L634
59276H47196K479J773O87j254l310m493m787m989n716o962q314r274r539r246
$$ plain form
59373 592050 592905 593696 594439 595586 597577 600395 603593 606837 610255 614173 618753 624172 630891 639349 649444
59358 649444 660602 672214 683774 694955 706153 718725 733906 751222 768335 782502 791935 796108
59346 796108 795696 792507 788760 785881 784200 783886 785568 789608 795089 799924 801852 799294 791838 780461
59332 780461 767130 753713 741100 729334 718282 707960 698471 690052 683127 678021 674548 672059 669930
59319 669930 667998 666575 666074 666581 667794 669331 670992 672651 674144 675531 677317 680046 683669 687579 691272
59304 691272 694700 698038 701460 705197 709473 714276 719401 724686 729971 734951 739521 744249 750007 756994
59290 756994 764532 771934 779135 786339 793541 800631 807586 814289 820552 826504 832518 838474 843562 847196
59276 847196 849675 851448 852135 850881 847571 843078 838291 833302 827586 820624 812310 803036 793497 784251
59262G84251q843q598q461q397q580r063r529r515q860p805o808o176n791n333
59248F72492m811m641m883m810l665j645M35K210L810M913M670K803M8k754n365
59233F58807p617q912q809p683o218m675l107j877j261q15J39J461K288K237J911
59218F15869K046K738L771N116O666P830Q063P720P753Q508R253R227Q628Q188
59204G11376Q087P881P334O629N756M339K443Q79K50R0m55j494k496l304m270
59189G43045n442o345o712o841p010p024o592n802m922m144l671l806m514n251
59175F64969n485n294n121n114n016m630m094l629l257k887k546k403k589l042
59161F09862l538l846l837l490k887k189j523q93l14Lj86p22j069q64k72L54Q67
$$ plain form
59262 784251 775408 766810 758349 749952 741372 732309 722780 713265 704405 696600 689792 683616 677825 672492
59248 672492 667681 663040 658157 653347 649682 648037 648472 650682 654492 659405 664075 666878 666926 664172 658807
59233 658807 651190 642278 633469 625786 619568 614893 611786 609909 608648 607833 607972 609433 611721 613958 615869
59218 615869 617915 620653 624424 629540 636206 644036 652099 659819 667572 676080 685333 694560 703188 711376
59204 711376 719463 727344 734678 741307 747063 751402 753845 754724 754974 755064 754609 753115 750619 747315 743045
59189 743045 737603 731258 724546 717705 710695 703671 697079 691277 686355 682211 678540 674734 670220 664969
59175 664969 659484 654190 649069 643955 638939 634309 630215 626586 623329 620442 617896 615493 612904 609862
59161 609862 606324 602478 598641 595151 592264 590075 588552 587659 587345 587348 587162 586440 585371 584507 584235 584589 585456
59144E85456J174J068N37nk25l60p36j062q22k69k75j037j619j098K90J558K090
59127E84665K010J769J732J993K248J971J060Q7l79n42j035j915k517k470k395
59112E86282l136m499n277m630l103k018k085k931l795m186l917l016j886j147
59098E40656j038j179j164j079j179j437j767k265k826k860k060j132j033j720
59084E17917k383k797l442m227m160k868j496j384k337k989k511j315j93M99Q22
59069D87136R35J007J117J210J291J584K294L239M049M618N176N878O567O966
59055E33067O988O803O683O721O664O211N501N046N048N060M580L737L022K517
59041F07648J846Q65m2n42q32j351k152k776k694j845q24n09j268k476l012k461
$$ plain form
59144 585456 586630 587698 588235 588230 588005 587645 586909 585847 585025 584756 584481 583444 581825 580727 581017 582575 584665
59127 584665 586675 588444 590176 592169 594417 596388 597448 597535 597156 596614 595579 593664 591147 588677 586282
59112 586282 583146 578647 573370 568740 565637 563619 561534 558603 554808 550622 546705 543689 541803 540656
59098 540656 539618 538439 537275 536196 535017 533580 531813 529548 526722 523862 521802 520670 519637 517917
59084 517917 515534 512737 509295 505068 500908 498040 496544 495160 492823 489834 487323 486008 485815 486314 487136
59069 487136 488071 489078 490195 491405 492696 494280 496574 499813 503862 508480 513656 519534 526101 533067
59055 533067 540055 546858 553541 560262 566926 573137 578638 583684 588732 593792 598372 602109 605131 607648
59041 607648 609494 610359 610317 609775 608943 607592 605440 602664 599970 598125 597301 596792 595524 593048 590036 587575
59025E87575j556j294j792k340k467k486k895l582l980l804l352l051l027l103
59011E48846l061k830k526k348k343k277j910j367j016j034j301j728k350l012
58997E19743l322l096k596k101j575j009p90j279k154k551j931n34R13J724J609
58982E01051Q66K64M03J122J661J445O20j70l73J6M73N07K75M28J250K259K934
58965E15031L490M440N641O361O262N815N607N688N723N440M816M051L428K952
58951E84745K213R22n36j445j637j529j344r18l16M2J37N89J648K497K201J005
58935E88274P0L3M10M75J12l59q18j394k035k354k020j173l20K00N16R17J463
58918E81997K065K855M147N892P478Q282Q273P966P823P849P774P417O846O177
$$ plain form
59025 587575 586019 584725 582933 580593 578126 575640 572745 569163 565183 561379 558027 554976 551949 548846
59011 548846 545785 542955 540429 538081 535738 533461 531551 530184 529168 528134 526833 525105 522755 519743
58997 519743 516421 513325 510729 508628 507053 506044 505254 503975 501821 499270 497339 496805 497718 499442 501051
58982 501051 501917 502181 502584 503706 505367 506812 507432 507262 506889 506905 507378 507885 508160 508588 509838 512097 515031
58965 515031 518521 522961 528602 534963 541225 547040 552647 558335 564058 569498 574314 578365 581793 584745
58951 584745 586958 587880 587344 585899 584262 582733 581389 580471 580155 580197 580334 580923 582571 585068 587269 588274
58935 588274 588344 588377 588787 589262 589374 589015 588197 586803 584768 582414 580394 579221 578901 579101 579617 580534 581997
58918 581997 584062 586917 591064 596956 604434 612716 620989 628955 636778 644627 652401 659818 666664 672841
58904F72841N374M377L414K888K795K480J297n48k163l019l487m249n453o686
58890F69861p566q148q692r272r712r844r629r021p905o366m938m156l894l549
58876E67169k916k421k281k015j173q2O47R78J164J049L97k60o8Q32J309P67p1
58859E63025k67J61O65J120J744K415K720K584K409K499K729K855K903L149L809
58844E94520M816N952P093Q229R160R459Q925P948P168O891P042P496Q099Q511
58830G01309Q478Q217Q115Q137P990P800Q100Q959R668R553Q734P819P137O572
58816H16588N941N253M623M075L471K669J726Q59J13o75j470j872j677j357j625
58801H36642k800m791p373r924j1386j1253j0410j0260j1052j1742j1480j0471
$$ plain form
58904 672841 678215 682592 686006 688894 691689 694169 695466 694918 692755 689736 686249 682000 676547 669861
58890 669861 662295 654147 645455 636183 626471 616627 606998 597977 590072 583706 578768 574612 570718 567169
58876 567169 564253 561832 559551 557536 556363 556281 556928 557906 559070 560119 560516 560256 560188 561020 562329 563096 563025
58859 563025 562758 562919 563584 564704 566448 568863 571583 574167 576576 579075 581804 584659 587562 590711 594520
58844 594520 599336 605288 612381 620610 629770 639229 648154 656102 663270 670161 677203 684699 692798 701309
58830 701309 709787 718004 726119 734256 742246 750046 758146 767105 776773 786326 795060 802879 810016 816588
58816 816588 822529 827782 832405 836480 839951 842620 844346 845205 845318 844643 843173 841301 839624 838267 836642
58801 836642 833842 829051 821678 811754 800368 789115 778705 768445 757393 745651 734171 723700
58789G23700r380q618q352q588q944q914q490q138q128q387q861r407r433q464
58775F01596p078o393o525o385n231l579k298j626j404j497j582j220n75l74q28
58760E55001j258j093n68k2O78J603K316K488K345K115J665J032O26M62m4j051
58744E66295j790j651j085r07j379k362l654m647m547l471k531k254j878q19K41
58729E33561N92P53J366J906J726J563K518M177N249N561N940O425O254N537N282
58714E88410N591N265L660J715O21M32M39J27p10k033l382m214m618n119n674
58699E80510n601m702l716l339l445l602l796m206m695m841m337l218j984j362
58685E27666j608k082j935j102j66N68J204J597J391Q15P20J520K634L225L025
$$ plain form
58789 723700 714320 705702 697350 688762 679818 670904 662414 654276 646148 637761 628900 619493 610060 601596
58775 601596 594518 588125 581600 575215 569984 566405 564107 562481 561077 559580 557998 556778 556203 555829 555001
58760 555001 553743 552650 552082 552060 552738 554341 556657 559145 561490 563605 565270 566302 566928 567390 567346 566295
58744 566295 564505 562854 561769 560862 559483 557121 553467 548820 544273 540802 538271 536017 534139 533320 533561
58729 533561 534153 534906 536272 538178 539904 541467 543985 548162 553411 558972 564912 571337 577591 583128 588410
58714 588410 594001 599266 602926 604641 605262 605694 606133 606260 605550 603517 600135 595921 591303 586184 580510
58699 580510 574909 570207 566491 563152 559707 556105 552309 548103 543408 538567 534230 531012 529028 527666
58685 527666 526058 523976 522041 520939 520773 521341 522545 524142 525533 526348 527068 528588 531222 534447 537472
58670E37472K346J674J421J653J984K024J900J937K017J842J697K213L313M113
58656E67606M055L525L109K877K670K555K585K523K146J521O86o32k626m922o820
58641E80858p976q708r558j0594j1212j0784r535q467q294q724r018q834q172
58628D60982p071n834n157n303n473m742l443k769l038l249k490j060J19N56L91
58613D12419Qj87RL62L91L1j84K71J286K220K613K710L194M172M619L361O80j734
58595D36241k772l059l595m103l723k701k202k592l083l085k938l112l492l715
58581C92069l576k965j991j170r87j231j373j429j730j983j444j41R30J011L32
58566C74322n13j177j394r00J51J103J417J057L21k74j14R31K096K534K398K478
$$ plain form
58670 537472 539818 541492 542913 544566 546550 548574 550474 552411 554428 556270 557967 560180 563493 567606
58656 567606 571661 575186 578295 581172 583842 586397 588982 591505 593651 595172 595858 595226 592600 587678 580858
58641 580858 572882 564174 554616 544022 532810 522026 512491 504024 495730 487006 477988 469154 460982
58628 460982 453911 448077 442920 437617 432144 427402 423959 421190 418152 414903 412413 411353 411472 412028 412419
58613 412419 412427 412240 412249 412611 413002 413033 412849 413120 414406 416626 419239 421949 425143 429315 433934 437295 437975 436241
58595 436241 433469 430410 426815 422712 418989 416288 414086 411494 408411 405326 402388 399276 395784 392069
58581 392069 388493 385528 383537 382367 381380 380149 378776 377347 375617 373634 372190 372049 372979 373990 374322
58566 374322 373809 372632 371238 370338 370489 371592 373009 374066 374387 374113 373999 374930 377026 379560 381958 384436
58550C84436K931L171K963K755K857L051L124L039K600J722J039J297K109K289
58536D19383J604J171J776K761L080K657K203K272K992M135N106N378N192N365
58522D65075O166O989P310P307P290P163O748O159N607N310N632O704P888Q293
58508E59641P909P589P879Q565R368J0265J1029J1355J1569J2280J3229J3346
58496F84024J2170J0245P997N350K620O13n85j781l181l932l705l532m291n439
58482F96573o122o604p592q946j0023j0734j1363j1834j1931j1873j1892j1662
58470E75997j0782r491q338p548p103p022p097o840o132n438n060m712m131l512
58456D82791k974k316j663j512j795j686q70j86l97j152j743k092k284j927p93
$$ plain form
58550 384436 387367 390538 393501 396256 399113 402164 405288 408327 410927 412649 413688 414985 417094 419383
58536 419383 420987 422158 423934 426695 429775 432432 434635 436907 439899 444034 449140 454518 459710 465075
58522 465075 471241 478230 485540 492847 500137 507300 514048 520207 525814 531124 536756 543460 551348 559641
58508 559641 567550 575139 583018 591583 600951 611216 622245 633600 645169 657449 670678 684024
58496 684024 696194 706439 714436 719786 722406 723019 722434 720653 717472 713540 709835 706303 702012 696573
58482 696573 690451 683847 676255 667309 657286 646552 635189 623355 611424 599551 587659 575997
58470 575997 565215 555724 547386 539838 532735 525713 518616 511776 505644 500206 495146 490434 486303 482791
58456 482791 479817 477501 475838 474326 472531 470845 469975 469789 469392 468240 466497 464405 462121 460194 459401
58441D59401M84J100J024O91M13M92J207K104K166J290P24J305K246K563K729
58426D79939L804N589O932P406P585P978Q619R461J0272J0448R656Q384P201N923
58412E89197M209K443J197K88p58j787k375k665k937k849k040j103q71j033m77
58397E78439J031K504L048K730K140J799K065K851L397K868J249o43j956k348
58383E99174k053j815k417l839n119n414m828l944l063k343k096k308k283j386
58369E56266J64J638K541K708K271J863K218L079L235K130O81j16m99j099j628
58354E75452j471r91j129j977k706k757k374k060k073k361k526k133j282n69k72
58339E48771j64j53l12j37J131L082M210L936L407L627M053L858L359L195L123
$$ plain form
58441 459401 459885 460985 462009 462700 463113 463605 464812 466916 469082 470372 471096 472401 474647 477210 479939
58426 479939 483743 489332 496264 503670 511255 519233 527852 537313 547585 558033 567689 576073 583274 589197
58412 589197 593406 595849 597046 597334 596576 594789 592414 589749 586812 583963 581923 580820 579949 578916 578439
58397 578439 579470 581974 585022 587752 589892 591691 593756 596607 600004 602872 604121 603478 601522 599174
58383 599174 597121 595306 592889 589050 583931 578517 573689 569745 566682 564339 562243 559935 557652 556266
58369 556266 556430 558068 560609 563317 565588 567451 569669 572748 575983 578113 578794 578678 578179 577080 575452
58354 575452 573981 572990 571861 569884 567178 564421 562047 559987 557914 555553 553027 550894 549612 549043 548771
58339 548771 548607 548454 548142 548005 549136 552218 556428 560364 563771 567398 571451 575309 578668 581863 584986
58324E84986K724K320K205J949J437J542K682L793L873L525L723M187M286M420
58310F27652N055N395M578L324K849L015L106L496M810O249O513N859N526N685
58296F93112N606N257N128M979M441M184M798N218M195K778L140N273O992P171
58282G62272O834O976P278P357P491P644P312O736O940Q183R530J0148J0034R501
58268H74236Q886Q725R186R517Q907P611O327N164M163M007M929N817N787N700
58254I68962O595P700P796P556Q468J0166J1166J1507J2367J3530J3689J3020
58242A092522J3109J4296J5316J5610J5910J6509J6915J7239J8106J9191J9667
58231A274390J9896K0880K2346K3211K3531K4053K4399K3822K3206K4058K5954
$$ plain form
58324 584986 587710 590030 592235 594184 595621 597163 599845 603638 607511 611036 614759 618946 623232 627652
58310 627652 632707 638102 642680 646004 648853 651868 654974 658470 663280 669529 676042 681901 687427 693112
58296 693112 698718 703975 709103 714082 718523 722707 727505 732723 736918 739696 742836 748109 755101 762272
58282 762272 769106 776082 783360 790717 798208 805852 813164 819900 826840 835023 844553 854701 864735 874236
58268 874236 883122 891847 901033 910550 919457 927068 933395 938559 942722 946729 951658 957475 963262 968962
58254 968962 975557 983257 991053 998609 1007077 1017243 1028409 1039916 1052283 1065813 1079502 1092522
58242 1092522 1105631 1119927 1135243 1150853 1166763 1183272 1200187 1217426 1235532 1254723 1274390
58231 1274390 1294286 1315166 1337512 1360723 1384254 1408307 1432706 1456528 1479734 1503792 1529746
58220A529746K7309K8146K9613L1357L2091L2392L4111L7194L9804M1438M3217
58209A906418M5328M6984M8823N2337N6970O0639O3151O6228P0270P4004P7283
58198B568435Q1145Q5228Q8192R0600R4234R8837J02765J06556J12175J19091
58188C547258J24977J30186J37352J46545J55133J62683J71655J82748J93977
58179D952514K04905K17365K31429K45209K59230K76302K96303L15932L34363
58170G333552L54201L76070L97582M18680M42524M69842M97802N25796N56771
58161A1372820N91596O28074O66824P11878P63888Q19021Q76124R38166J005177
58152A8373568J073217J142357J218192J303514J396425J498514J616044J751021
$$ plain form
58220 1529746 1557055 1585201 1614814 1646171 1678262 1710654 1744765 1781959 1821763 1863201 1906418
58209 1906418 1951746 1998730 2047553 2099890 2156860 2217499 2280650 2346878 2417148 2491152 2568435
58198 2568435 2649580 2734808 2823000 2913600 3007834 3106671 3209436 3315992 3428167 3547258
58188 3547258 3672235 3802421 3939773 4086318 4241451 4404134 4575789 4758537 4952514
58179 4952514 5157419 5374784 5606213 5851422 6110652 6386954 6683257 6999189 7333552
58170 7333552 7687753 8063823 8461405 8880085 9322609 9792451 10290253 10816049 11372820
58161 11372820 11964416 12592490 13259314 13971192 14735080 15554101 16430225 17368391 18373568
58152 18373568 19446785 20589142 21807334 23110848 24507273 26005787 27621831 29372852
58144B9372852J900873K069652K269944K512112K803549L160420L605918M153346
58136E1848666M804872N566766O443111P408866Q415782R439205J0499246J1629779
58128A16056293J2851338J4149750J5362190J5993792J5241581J2434122P615827
58121B09704893J702727m002294q506429j1462242j3025225j3547643j3385322
58114A47478465j2829871j2082783j1256273j0406984r566942q747773p943811
58107G4644028p152368o386777n665681n001004m401885l878342l432653l054679
58099C5670639k731511k455309k218537k010465j823955j659266j516633j390994
58091A9863969j277626j176670j087922j006740r29156q56215p89722p28250o70664
$$ plain form
58144 29372852 31273725 33343377 35613321 38125433 40928982 44089402 47695320 51848666
58136 51848666 56653538 62220304 68663415 76072281 84488063 93927268 104426514 116056293
58128 116056293 128907631 143057381 158419571 174413363 189654944 202089066 209704893
58121 209704893 211407620 207405326 198898897 187436655 174411430 160863787 147478465
58114 147478465 134648594 122565811 111309538 100902554 91335612 82587839 74644028
58107 74644028 67491660 61104883 55439202 50438198 46036313 42157971 38725318 35670639
58099 35670639 32939128 30483819 28265282 26254817 24430862 22771596 21254963 19863969
58091 19863969 18586343 17409673 16321751 15315011 14385855 13529640 12739918 12011668 11341004
58082A1341004o19108n74989n35839m99151m65693m36373m09442l83472l59650
58073G057287l38691l18820k99094k81313k66344k51935k36489k21756k09325
58064D633520j97692j85303j73655j64684j57664j51064j45061j39836j33867
58055C184694j26311j18905j13256j08364j02948r8031r4811r2055q8083q3655
58045B158275q0363p7769p4439p0673o7894o6257o4859o3436o2143o0484n8057
58034A411901n5556n3612n1523m8481m5157m2704m0994l9126l6874l4485l1824
58023I31565k8858k6271k4620k3500k2328k1137j9976j8484j6804j5804j5682
58012F98101j5375j4169j2748j1887j1323j0741j0632j1145j1329j0605r874r982
$$ plain form
58082 11341004 10721896 10146907 9611068 9111917 8646224 8209851 7800409 7416937 7057287
58073 7057287 6718596 6399776 6100682 5819369 5553025 5301090 5064601 4842845 4633520
58064 4633520 4435828 4250525 4076870 3912186 3754522 3603458 3458397 3318561 3184694
58055 3184694 3058383 2939478 2826222 2717858 2614910 2516879 2422068 2330013 2241930 2158275
58045 2158275 2077912 2000143 1925704 1855031 1787137 1720880 1656021 1592585 1530442 1469958 1411901
58034 1411901 1356345 1302733 1251210 1202729 1157572 1114868 1073874 1034748 997874 963389 931565
58023 931565 902707 876436 851816 828316 805988 784851 764875 746391 729587 713783 698101
58012 698101 682726 668557 655809 643922 632599 621858 611226 600081 588752 578147 568273 558291
58000E58291j0237r590q409p804p962q330q771r377r812r786r667r721r379q176
57986D31270o756o010n809n493n038m850m892m855m803m922n093n238n561n908
57972C56042n602m586l948m509n525n718m966m182l933m015m082l963l548k929
57958B94536k400k016j519r32o76q45j059j320k157l489m247l746k651j900j480
57943B64099r60m48k52k01p8j25m79o39k55K00J88m6j11k91r46j707k085k353
57925B53511k940l392k858j392MM54j61j331k132j734l32Q82J144J014J250J474
57909B43461R03j05l44N12J440J402M25p29j447j639j584j502j265p22k68n80
57893B37958j671k787l472m030m597m605l740k696k179j881j210m16j04q7L26
$$ plain form
58000 558291 548054 538464 530055 522251 514289 505959 497188 487811 477999 468213 458546 448825 439446 431270
57986 431270 424514 418504 412695 407202 402164 397314 392422 387567 382764 377842 372749 367511 361950 356042
57972 356042 350440 345854 341906 337397 331872 326154 321188 317006 313073 309058 304976 301013 297465 294536
57958 294536 292136 290120 288601 287669 286993 286148 285089 283769 281612 278123 273876 270130 267479 265579 264099
57943 264099 263139 262691 262439 262238 262160 262035 261556 260917 260662 260862 261050 261004 260893 260602 259656 257949 255864 253511
57925 253511 250571 247179 244321 242929 242933 243387 243226 241895 239763 238029 237697 238579 239723 240737 241987 243461
57909 243461 244364 244259 243915 244427 245867 247269 247694 246965 245518 243879 242295 240793 239528 238806 238538 237958
57893 237958 236287 233500 230028 225998 221401 216796 213056 210360 208181 206300 205090 204674 204570 204483 204809
57878B04809J197J994K494K852K973K634K075J762J643J350R20O32K98n25j737
57863B25371k747l277l499l492l171k727k504k500k458k341k233j933j270n74
57849A90645l04k85K5O65J137J203J086R31N81l9q23j715k610l143l052k606k236
57832A79460j936j537j263j338j281m40Q41J390P09m22j008r01o19o10r20j234
57816A68891j102m91l0k88q89r38k69L89N79P44J444K499L283L493L337L235L500
57799A87387M042M368M120L592L324L342L254K976K703K211J039m75j213p63r1
57784B19816k08q26j043p85o97r27r12m09M1j15p81j477j931k109k007j669j273
57767B02688j020r63r44o88l6P83J217R53L58R2K66L44j6l94k13L94O64J45q61
$$ plain form
57878 204809 206006 208000 210494 213346 216319 218953 221028 222790 224433 225783 226703 227335 227633 227108 225371
57863 225371 222624 219347 215848 212356 209185 206458 203954 201454 198996 196655 194422 192489 191219 190645
57849 190645 190341 190056 190081 190746 191883 193086 194172 195103 195684 195645 194822 193107 190497 187354 184302 181696 179460
57832 179460 177524 175987 174724 173386 172105 171665 172506 173896 174605 174183 173175 172274 171655 171045 170125 168891
57816 168891 167789 167298 167268 166980 166091 165153 164884 165273 165852 166596 168040 170539 173822 177315 180652 183887 187387
57799 187387 191429 195797 199917 203509 206833 210175 213429 216405 219108 221319 222358 221883 220670 219907 219816
57784 219816 219608 218782 217739 216954 216257 215330 214418 214009 214050 213935 213154 211677 209746 207637 205630 203961 202688
57767 202688 201668 200705 199761 199073 199037 199820 201037 201990 202348 202440 202706 203050 203034 202640 202427 202821 203485 203630 202769
57748B02769j831k580l074l076k376j343q28j349k505l275k880j423K26J202J376
57733A79033J234J072O25k49r86r21l31j82p83j356j220p47p26j243j748j885
57717A69587j730j429j079q39p25m26K01O47K96o21j251j266j130j168j128r34
57701A57005j079j736k130j558o41o63j733k532k025o54N62J389K251L185L670
57686A53311L415K715K010J543J494J948K555K612J840P76K34M72J095J584J752
57671A79356J772J918K184K253J941J592J660J871J475M06l99k66K01k0r09j537
57655A93498j418j018r27j218j704k246k651k686k376j964j559j176j036j416
57641A70103k098k452k187j654j269j040p59l66K6K59K01p2k06P3O17J120J593
$$ plain form
57748 202769 200938 198358 195284 192208 189832 188489 187661 186312 183807 180532 177652 176229 176455 177657 179033
57733 179033 180267 181339 181964 181715 180729 179808 179477 179295 178512 177156 175936 175189 174463 173220 171472 169587
57717 169587 167857 166428 165349 164510 163785 163359 163560 164207 164503 163882 162631 161365 160235 159067 157939 157005
57701 157005 155926 154190 152060 150502 149861 149198 147465 144933 142908 142254 142816 144205 146456 149641 153311
57686 153311 156726 159441 161451 162994 164488 166436 168991 171603 173443 174219 174453 174925 176020 177604 179356
57671 179356 181128 183046 185230 187483 189424 191016 192676 194547 196022 196428 196029 195763 195964 195944 195035 193498
57655 193498 192080 191062 190135 188917 187213 184967 182316 179630 177254 175290 173731 172555 171519 170103
57641 170103 168005 165553 163366 161712 160443 159403 158644 158278 158304 158563 158764 158692 158486 158559 159176 160296 161889
57624A61889K169K656K779K780L159L866M351M417M468M893N840P549J0144J2931
57610B33891J4711J5131J5090J5533J6467J7331J7556J6357J2790O800k50o598
57598C74809j1397j4707j6750j7722j7933j7644j6875j5665j4218j2633j0858
57587B08407r053p537o258m918l729l277l417l212k303j491j428j652j545j386
57573A57201j603j847j703j559j821j967j472r92j373k075j918j098r59j888k833
57558A32093l030k880k786k419j682j314j868k805l179k741j950j316j084j191
57544A01848j322j258j256j612k038k006j620j430j438j136o29p09j582k398k468
57529G8946k203k235k316j742m53Q87J571J197j86j847k664k183j139n55n85p26
$$ plain form
57624 161889 164058 166714 169493 172273 175432 179298 183649 188066 192534 197427 203267 210816 220960 233891
57610 233891 248602 263733 278823 294356 310823 328154 345710 362067 374857 381657 381407 374809
57598 374809 363412 348705 331955 314233 296300 278656 261781 246116 231898 219265 208407
57587 208407 199354 191817 185559 180641 176912 173635 170218 167006 164703 163212 161784 160132 158587 157201
57573 157201 155598 153751 152048 150489 148668 146701 145229 144237 142864 140789 138871 137773 136814 134926 132093
57558 132093 129063 126183 123397 120978 119296 117982 116114 113309 110130 107389 105439 104123 103039 101848
57544 101848 100526 99268 98012 96400 94362 92356 90736 89306 87868 86732 86103 85394 83812 81414 78946
57529 78946 76743 74508 72192 70450 69997 70884 72455 73652 73466 71619 68955 66772 65633 65078 64493 63767
57513F3767p81j079j775k456k588k085j419j242j801k630k964k513j711j087p33
57498C6903m73l16m65r65j556j869j704j212p75n80l73J68R11J411J486J335J101
57481C3027P83N61P34J197J390R67K06m24p28p23m56o6K57M72N65K80n67j487
57463C5988j698j208q66j058j118m92K61L42o5l15n23j242k125k065q45M21P80
57446B4172N99P11J125J262R59N11k2p99j603j941j810j739j978k232k372k730
57430A2113l293l233j967k40N97K33m44p94j094B70a616j522q80n84o37o76o78
57413f593p92q46o52n31q49j267j198q79j173k174k861k363j049N2L53n1p96j467
57395b5136j686j413j048r72j098j097q74o49n82n59l60M2L84L43j21p03j052
$$ plain form
57513 63767 62986 61907 60132 57676 55088 53003 51584 50342 48541 45911 42947 40434 38723 37636 36903
57498 36903 36430 36114 35649 34684 33128 31259 29555 28343 27568 26988 26615 26783 27694 29105 30591 31926 33027
57481 33027 33810 34371 35105 36302 37692 38659 38865 38441 37713 36990 36534 36468 36725 37197 37762 38042 37475 35988
57463 35988 34290 33082 32216 31158 30040 29548 29809 30151 30086 29771 29248 28006 25881 23816 22971 23392 24172
57446 24172 24771 25482 26607 27869 28828 29339 29317 28518 26915 24974 23164 21425 19447 17215 14843 12113
57430 12113 8820 5587 3620 3380 3977 4210 3766 2972 1878 270 -1616 -3138 -4018 -4602 -5239 -5915 -6593
57413 -6593 -7385 -8231 -8883 -9414 -10263 -11530 -12728 -13607 -14780 -16954 -19815 -22178 -23227 -23175 -22822 -22873 -23669 -25136
57395 -25136 -26822 -28235 -29283 -30255 -31353 -32450 -33324 -33973 -34555 -35114 -35474 -35432 -35048 -34705 -34826 -35529 -36581
57378c6581j050p74m17k59m88r12j099j009j091j478j548p89K82O81K04m90r16
57361d7734j185j419j413j082p28o66r22j329j649j629j290j099j442k026k242
57346f7855j934j370o42K22P51M08n54j334j649j845j991j793j404j413j791j783
57330h5977j118m77l61m37l77n04j025j518j710j985k484k553j880j369j968l216
57314a08959l874l562k893k328j802j274q59n52l23l54o08n70Q1Q77J190J013
57298a24797N25m55j800k482j761n16k21r28j434j255j078j217j104o07m82j002
57282a40614j339j012q53j678k871l275k832k359k164j873j427j291j687k256
57268a67531k630k778k818k862l000l069k578j342m3L54k56j068j443j553j801
$$ plain form
57378 -36581 -37631 -38405 -38822 -39081 -39569 -40481 -41580 -42589 -43680 -45158 -46706 -47495 -47213 -46532 -46328 -46818 -47734
57361 -47734 -48919 -50338 -51751 -52833 -53561 -54227 -55149 -56478 -58127 -59756 -61046 -62145 -63587 -65613 -67855
57346 -67855 -69789 -71159 -71801 -71579 -70828 -70420 -70974 -72308 -73957 -75802 -77793 -79586 -80990 -82403 -84194 -85977
57330 -85977 -87095 -87572 -87933 -88370 -88747 -89251 -90276 -91794 -93504 -95489 -97973 -100526 -102406 -103775 -105743 -108959
57314 -108959 -112833 -116395 -119288 -121616 -123418 -124692 -125551 -126103 -126426 -126780 -127388 -127958 -127877 -127000 -125810 -124797
57298 -124797 -124272 -124727 -126527 -129009 -130770 -131286 -131507 -132435 -133869 -135124 -136202 -137419 -138523 -139130 -139612 -140614
57282 -140614 -141953 -142965 -143818 -145496 -148367 -151642 -154474 -156833 -158997 -160870 -162297 -163588 -165275 -167531
57268 -167531 -170161 -172939 -175757 -178619 -181619 -184688 -187266 -188608 -188651 -188297 -188553 -189621 -191064 -192617 -194418
57253a94418k185k422k361k036j609j478k061l201m068m002l236k495k118j893
57239b29583j563j106n87k09l25r38j298o09P67J475Q63j85n10j86j16n29p10
57222b35349j28R16J790K171K084J854K047K953M075M632M618M742N231N347M407
57207a88610K735J195K40j84k38j27j42l11k52L13J151J847K294K521K483K295
57191a72790K370K816L074K586J627R00O30N18M97Q61J649K418K727K566K287
57176a45264K329K929L819M361M286M081M303M759M853M508M160M005L895L869
57162h9107M136M522M669M863N812P444Q734R154R495J0632g448E732J3373J3362
57148C2467J3499J3607J3706J4158J4962J5613J5783J5647J5489J5394J5494J5893
$$ plain form
57253 -194418 -196603 -199025 -201386 -203422 -205031 -206509 -208570 -211771 -215839 -219841 -223077 -225572 -227690 -229583
57239 -229583 -231146 -232252 -232839 -233048 -233373 -234311 -235609 -236218 -235451 -233976 -233113 -233298 -233808 -233994 -234110 -234639 -235349
57222 -235349 -235477 -234561 -232771 -230600 -228516 -226662 -224615 -221662 -217587 -212955 -208337 -203595 -198364 -193017 -188610
57207 -188610 -185875 -184680 -184440 -184624 -184862 -184989 -185131 -185442 -185694 -185381 -184230 -182383 -180089 -177568 -175085 -172790
57191 -172790 -170420 -167604 -164530 -161944 -160317 -159417 -158787 -158269 -157772 -156911 -155262 -152844 -150117 -147551 -145264
57176 -145264 -142935 -140006 -136187 -131826 -127540 -123459 -119156 -114397 -109544 -105036 -100876 -96871 -92976 -89107
57162 -89107 -84971 -80449 -75780 -70917 -65105 -57661 -48927 -39773 -30278 -19646 -7448 5732 19105 32467
57148 32467 45966 59573 73279 87437 102399 118012 133795 149442 164931 180325 195819 211712
57136B11712J6314J6346J6142J6209J6357J5731J4164J2609J1642J0431Q156N653
57124C71466M431M477M340L333K276J924J910J609J035L47n53j520k204k964m666
57109C85241o995q240p669o946q040j0646j3033j4623j6135j7776j8970j9847
57097B36321k1322k3590k5919k8105l0776l3970C5836c319m2419m7707n4244o0415
57085b08104o5740p1105p7409q4735r2648j00721j08728j16614j24395j32126
57075a182325j39996j48183j56418j64128j71351j79069j88220j98881k11043
57066b739614k25657k44059k66668k92955l22261l54085l88110m24729m64964
57057e723102n09232n57148o09240o67593p33653q06829q86776r75531j075523
$$ plain form
57136 211712 228026 244372 260514 276723 293080 308811 322975 335584 347226 357657 365813 371466
57124 371466 375897 380374 384714 388047 390323 392247 394157 395766 396801 397148 396595 395075 392871 389907 385241
57109 385241 378246 370006 362337 355391 347351 336705 323672 309049 292914 275138 256168 236321
57097 236321 214999 191409 165490 137385 106609 72639 35836 -3319 -45738 -93445 -147689 -208104
57085 -208104 -273844 -344949 -422358 -507093 -599741 -700462 -809190 -925804 -1050199 -1182325
57075 -1182325 -1322321 -1470504 -1626922 -1791050 -1962401 -2141470 -2329690 -2528571 -2739614
57066 -2739614 -2965271 -3209330 -3475998 -3768953 -4091214 -4445299 -4833409 -5258138 -5723102
57057 -5723102 -6232334 -6789482 -7398722 -8066315 -8799968 -9606797 -10493573 -11469104 -12544627
57048a2544627j187013j309780j445801j597683j766168j952791k164168k410518
57040b6378549k701024l044425l453303l943840m531977n233326o064628p038970
57032f2390042q158744r415641j0792681j2258380j3763945j5259088j6708372
57025a48746893j8074181j9277800k0188834k0648699k0474166j9432910j7281092
57018b84124575j3920507r561665m706201P1621M353173P937437J0764566J2846178
57010b76339973J4261863J5160206J5711662J6045672J6226566J6270903J6171657
57003a66491444J5909695J5459088J4796921J3918863J2852712J1658626J0412325
56996g1483214R182591Q018886O951648N996309N156344M427896L804843L279260
$$ plain form
57048 -12544627 -13731640 -15041420 -16487221 -18084904 -19851072 -21803863 -23968031 -26378549
57040 -26378549 -29079573 -32123998 -35577301 -39521141 -44053118 -49286444 -55351072 -62390042
57032 -62390042 -70548786 -79964427 -90757108 -103015488 -116779433 -132038521 -148746893
57025 -148746893 -166821074 -186098874 -206287708 -226936407 -247410573 -266843483 -284124575
57018 -284124575 -298045082 -307606747 -312312948 -312241327 -307888154 -299950717 -289186151 -276339973
57010 -276339973 -262078110 -246917904 -231206242 -215160570 -198934004 -182663101 -166491444
57003 -166491444 -150581749 -135122661 -120325740 -106406877 -93554165 -81895539 -71483214
56996 -71483214 -62300623 -54281737 -47330089 -41333780 -36177436 -31749540 -27944697 -24665437
56988b4665437K838822K468153K154071J887531J660838J466431J299207J156997
56980i733387J037257R35279Q46488P68439O99639O38337N83421N34842M92115
56971c197570M53600M17845L84383L52794L22440K93507K66938K42795K20031
56962b43237d5038A33060J60396J44788J30947J18861J08013R7504Q7404P8707
56952A059680P1733O5688O0105N5363N1502M7816M3939M0127L6151L1266K5513
56941A588883J9854J4607R065L030k662p702j3111j9707k6855l3499l9532m5529
56929A446842n1839n8456o5161p1324p6157p9308q0676p9833p6611p2171o8229
56918F67077o5112o1733n7636n3725n0660m7951m5168m2731m0796l8559l5496
$$ plain form
56988 -24665437 -21826615 -19358462 -17204391 -15316860 -13656022 -12189591 -10890384 -9733387
56980 -9733387 -8696130 -7760851 -6914363 -6145924 -5446285 -4807948 -4224527 -3689685 -3197570
56971 -3197570 -2743970 -2326125 -1941742 -1588948 -1266508 -973001 -706063 -463268 -243237
56962 -243237 -45038 133060 293456 438244 569191 688052 796065 893569 980973 1059680
56952 1059680 1131413 1197101 1257206 1312569 1364071 1411887 1455826 1495953 1532104 1563370 1588883
56941 1588883 1608737 1623344 1632409 1635439 1632777 1625075 1611964 1592257 1565402 1531903 1492371 1446842
56929 1446842 1395003 1336547 1271386 1200062 1123905 1044597 963921 884088 807477 735306 667077
56918 667077 601965 540232 482596 428871 378211 330260 285092 242361 201565 163006 127510
56907A27510l2281k9677k7418A3168i423k0809j9316j7403j4898j2123r346o804
56895a10122m928m098m353n430o737p403p042o378o325o545n903m341l142k989
56881a85736k962j919J07K443M712O741Q295R513J0858J2275J3151J3375J3481
56868i5666J3411J2097Q878M429j19m100o980q206q066p738p896q017p609p079
56854a22661o761o124m799l434k697k236j471o06k5N35J323J877J844J863K631
56839a40741L723M266M247M309M701N208N722O144O250O251O856Q203R445J0101
56825e5315J0828J2017J2538h756b22E999M664L165J550M21n0k27j5J012K516
56810A9035L621M298N352O941Q229Q845R585J1216J3381J5200J6312J6868J6930
$$ plain form
56907 127510 95229 65552 38134 13168 -9423 -30232 -49548 -66951 -81849 -93972 -103318 -110122
56895 -110122 -115050 -119148 -123501 -128931 -135668 -143071 -150113 -156491 -162816 -169361 -175264 -179605 -182747 -185736
56881 -185736 -188698 -190617 -190510 -188067 -183355 -176614 -168319 -158806 -147948 -135673 -122522 -109147 -95666
56868 -95666 -82255 -70158 -61280 -56851 -56970 -61070 -68050 -76256 -84322 -92060 -99956 -107973 -115582 -122661
56854 -122661 -129422 -135546 -140345 -143779 -146476 -148712 -150183 -150789 -150814 -150279 -148956 -147079 -145235 -143372 -140741
56839 -140741 -137018 -132752 -128505 -124196 -119495 -114287 -108565 -102421 -96171 -89920 -83064 -74861 -65416 -55315
56825 -55315 -44487 -32470 -19932 -8756 -222 5999 10663 13828 15378 15799 15749 15522 15507 16519 19035
56810 19035 22656 26954 32306 39247 47476 56321 65906 77122 90503 105703 122015 138883 155813
56797A55813J6344J4945J2579R140M876M96l116n392o336o349n725m371k236J52
56783A80820K088L647N538P995J0509J2832J5290J7821J9697K0798K2049K3756
56771C42840K4429K2323J7446J1091M103l137r622j4080j6331j7229j7322j6565
56759C27946j5170j3620j1844r325o078k748K71L063N657Q007J0441J3326J6327
56746C26253J8609J9557J8690J5332R372K086m717j0231j4530j7359j8278j7815
56734C26969j7219j6890j6176j4733j2953j0930q212m975k315q00L68K153M371
56721B28658O130O947O983O507N517L700P22l197p068r908j1583j2472j2718j2419
56707A95799j2106j2122j1857j0654r123q431q424p859o460n370n239n310m786
$$ plain form
56797 155813 172157 187102 199681 208821 213697 214193 211077 205685 199349 193000 187275 182904 180668 180820
56783 180820 182908 186555 192093 200088 210597 223429 238719 256540 276237 297035 319084 342840
56771 342840 367269 389592 407038 418129 422232 419095 409473 395393 379062 361833 344511 327946
56759 327946 312776 299156 287312 277987 271909 269161 269432 272495 278152 286159 296600 309926 326253
56746 326253 344862 364419 383109 398441 407813 409899 405182 394951 380421 363062 344784 326969
56734 326969 309750 292860 276684 261951 248998 238068 229856 224881 222566 221766 222134 224287 228658
56721 228658 234788 241735 248718 255225 260742 264442 265164 261967 254899 244991 233408 220936 208218 195799
56707 195799 183693 171571 159714 149060 139937 131506 123082 115223 108763 103393 98154 92844 88058
56694H8058l932l198k422j531j047j212j513j611j917k656l226l148k804k624
56680E5217k354j787j430j623j728j012J95R94J103Q33L42k65n41j25O07R64P81
56663E0171M43L38O32J282J871J829J144N03M19O83R29J140J311J225J030J307
56647F6257K093K485J826O64j12m22n40j52J175K904L860L572K608J707J213J219
56631I0357J604J958J871J363P48K89J46L08L50k80j389k033j742j166r88r03
56615I0493l94J81J95j1M33J453J975J338Oj127j475q65L84J417J458N41o40j471
56597I3891j582p12Q49K004J821P23o1q2P0m6j87j62j93l34k91k7K11O46J810
56578I8348L275L564K017k0p61j71L97L13K47O42Q62L87j06L00J235J432N02n35
$$ plain form
56694 88058 84126 80928 78506 76975 75928 74716 73203 71592 69675 67019 63793 60645 57841 55217
56680 55217 52863 51076 49646 48023 46295 45283 45478 46472 47575 48408 48750 48485 47944 47819 48426 49390 50171
56663 50171 50614 50952 51584 52866 54737 56566 57710 58213 58632 59315 60244 61384 62695 63920 64950 66257
56647 66257 68350 70835 72661 73325 73213 72791 72251 72099 73274 76178 80038 83610 86218 87925 89138 90357
56631 90357 91961 93919 95790 97153 97901 98190 98336 98644 98994 98714 97325 95292 93550 92384 91396 90493
56615 90493 90099 90280 90475 90464 90897 92350 94325 95663 95669 94542 93067 92202 92586 94003 95461 96002 95362 93891
56597 93891 92309 91597 92446 94450 96271 96994 96933 96851 96921 96875 96688 96526 96333 95999 95708 95681 95892 96538 98348
56578 98348 101623 105187 107204 107184 106423 106252 106649 106962 107209 107851 108713 109100 108994 109294 110529 111961 112463 111928
56560A11928o55QO92J085J256J020J09j145j962j941j321m94K79O95N16m6m99
56543A09525o67o93n26nN81O79L09R5K61L92L15M33Q38R64N70L05O52J010N43
56524A15581o14j633k083k015j480o93k22l04k60O38J997K765K650K283K157K120
56508A20887J980J866J945K236K788L602M439M981N104M739L812K670K081K347
56494A65477K749K530J913J473J005n0j323j747j058j45K27J43r6m78q63q47l79
56477A68531mj59o69j183j618j968k078j870j478j005m28J93O57Q12O34J60l46
56460A58181m40K1N71P62P73R23R58M75k18m94m41o26r57q04k27p8n82r34o91
56441A56172n29j023j567j393r09j096j914k339j923j376j441j839j733q98j5
$$ plain form
56560 111928 111273 111281 111973 113058 114314 115334 115443 114298 112336 110395 109074 108580 108859 109554 110070 110024 109525
56543 109525 108858 108165 107639 107634 108215 108894 109203 109298 109559 109951 110266 110699 111537 112501 113071 113376 114028 115038 115581
56524 115581 114967 113334 111251 109236 107756 107063 106841 106537 106277 106915 108912 111677 114327 116610 118767 120887
56508 120887 122867 124733 126678 128914 131702 135304 139743 144724 149828 154567 158379 161049 163130 165477
56494 165477 168226 170756 172669 174142 175147 175097 173774 172027 170969 170824 171051 171194 171098 170620 169757 168910 168531
56477 168531 168527 168368 167699 166516 164898 162930 160852 158982 157504 156499 156071 156264 156921 157733 158367 158527 158181
56460 158181 157741 157762 158333 159095 159868 160791 161749 162224 162006 161512 161071 160445 159488 158684 158457 158379 157797 156863 156172
56441 156172 155643 154620 153053 151660 150751 149655 147741 145402 143479 142103 140662 138823 137090 136192 136177
56426A36177J86k28n18j95M15O73M58K38L59O32P17O08N80P71J002R81O15Q5l75
56407A43181p29r61p89M2J141J610J117L60J63M99Q43J044J266J392J207R52J019
56390A53357J241J062L70l80q11q41m55J89N69L52m5j08j18n88j007k99J407K574
56372A56469K193R87K23J77L23L26J66k26p84j077p75j80J33K4j74j80l0O1n0
56353A57606k87m35m82o86j046j003j58Q94J156N98J74L69O00L51Q0M29J120J320
56335A60600Q22K06k2N4J21J60M05R57J497J515Q49p8o11l40P13K062K847K441
56317A74198J251M24M25M80j13q59r43n56l31n0Q37J823J879J206J035J611J820
56300A84137J132M49N18Q25P67P10J069J352J034M86K64J92k1j7M28O36K3o57
$$ plain form
56426 136177 136363 136135 135617 135422 135837 136510 136968 137206 137565 138197 138914 139522 140102 140873 141875 142856 143471 143556 143181
56407 143181 142452 141491 140702 140744 141885 143495 144612 144972 145135 145634 146477 147521 148787 150179 151386 152338 153357
56390 153357 154598 155660 156030 155650 154839 153998 153543 153732 154301 154653 154608 154500 154382 153794 152787 152488 153895 156469
56372 156469 158662 159649 159872 160049 160372 160698 160864 160638 159854 158777 158002 157822 157955 157979 157805 157625 157595 157656 157606
56353 157606 157319 156884 156402 155716 154670 153667 153509 154403 155559 156157 156331 156700 157300 157651 157731 158160 159280 160600
56335 160600 161422 161628 161606 161660 161781 161941 162346 163303 164800 166315 167164 167086 166475 166135 166848 168910 171757 174198
56317 174198 175449 175873 176298 176778 176665 175806 174863 174307 173976 173926 174763 176586 178465 179671 180706 182317 184137
56300 184137 185269 185718 186236 187061 187828 188538 189607 190959 191993 192479 192743 192935 192914 192897 193325 193961 193984 193327
56282A93327j85J320K477K449J753J254J123J032Q54Q53J316K088K535K163J267
56267B15626O65O82Q97R79J236J985K840L056K408J441R67J350K095K239J482
56252B39948P84J268K709L813L918L563L347L144K772K501K535K697K968L580
56238B79547M291M413L941L798M460N218N304N022N046N413N825O377P231Q027
56224C53913Q313Q179Q011P989Q227Q897R828J0492J0728J0950J1351J1577J1483
56211D79938J1529J2005J2700J3591J5075J7015J8465J8960J9277K0302K1913
56200F60770K3627K5597K8213L1338L4628L8045M1562M4949M8316N2174N6537
56189A085756O0773O4654O8632P2593P5569P7260P8636Q0160Q0593P8644P4655
$$ plain form
56282 193327 193142 194462 196939 199388 201141 202395 203518 204550 205404 206257 207573 209661 212196 214359 215626
56267 215626 216291 216973 217870 218849 220085 222070 224910 227966 230374 231815 232782 234132 236227 238466 239948
56252 239948 240732 242000 244709 248522 252440 256003 259350 262494 265266 267767 270302 272999 275967 279547
56238 279547 283838 288251 292192 295990 300450 305668 310972 315994 321040 326453 332278 338655 345886 353913
56224 353913 362226 370405 378416 386405 394632 403529 413357 423849 434577 445527 456878 468455 479938
56211 479938 491467 503472 516172 529763 544838 561853 580318 599278 618555 638857 660770
56200 660770 684397 709994 738207 769545 804173 842218 883780 928729 977045 1029219 1085756
56189 1085756 1146529 1211183 1279815 1352408 1427977 1505237 1583873 1664033 1744626 1823270 1897925
56178A897925O9591O3250N4879M4752L3918K2847J1393l94j2273k3988l4612m2692
56166B084596m8058n2551n7793o3063o6641o8302o9091o9316o8455o6564o4291
56155A390471o1748n8712n5592n3007n0656m7855m4812m2198l9854l7207l4560
56144H64270l2658l1226k9317k6862k4615k2745k0712j8524j6792j5583j4282
56133F10954j2636j1015r692q666q040p795p452o698n922n464m903l950l240l265
56119E12216l316k641j784j516j270j60J234J717J562J994L127M091M805N786
56105E25845O579O225N165M832N463O027O270P028Q407R434R815J0338J1311J2130
56091F34869J2718J3855J5817J7974K0070K2583K5577K8487L1263L4548L8517
$$ plain form
56178 1897925 1967516 2030766 2085645 2130397 2164315 2187162 2198555 2198161 2185888 2161900 2127288 2084596
56166 2084596 2036538 1983987 1926194 1863131 1796490 1728188 1659097 1589781 1521326 1454762 1390471
56155 1390471 1328723 1270011 1214419 1161412 1110756 1062901 1018089 975891 936037 898830 864270
56144 864270 831612 800386 771069 744207 719592 696847 676135 657611 640819 625236 610954
56133 610954 598318 587303 577611 568945 560905 553110 545658 538960 533038 527574 522671 518721 515481 512216
56119 512216 508900 506259 504475 502959 501689 501529 502763 504480 506042 508036 511163 515254 520059 525845
56105 525845 532424 538649 543814 548646 554109 560136 566406 573434 581841 591275 601090 611428 622739 634869
56091 634869 647587 661442 677259 695233 715303 737886 763463 791950 823213 857761 896278
56080H96278M2646M6649N0469N3399N4397N3244N0308M5518L9009L2338K7426
56069A391681K4344K1706J9008J6759J4566J1138O472K137j055l937p164j0278
56057A485377j3115j6621k1525k7408l3515l9338m4103m6892m7572m6656m4284
56046A104348m0533l6467l3369l0937k7760k3621j9829j7201j5166j3039j0804
56035H35622q566o451m894l941k695p03Q59R25N17J164K277K372J985K765M319
56020H25555M855M546N228O880P575P062P234Q567R227Q514Q205R477J1128J1903
56006I35956J2214J2615J2834J3038J3920J5021J5177J4937J6001J7991J8627
55995A098331J7556J7070J8366J9995K0748K1156K1354K0480J9087J9216K1114
$$ plain form
56080 896278 938924 985573 1036042 1089441 1143838 1197082 1247390 1292908 1331917 1364255 1391681
56069 1391681 1416025 1437731 1456739 1473498 1488064 1499202 1505674 1507811 1506756 1502819 1495655 1485377
56057 1485377 1472262 1455641 1434116 1406708 1373193 1333855 1289752 1242860 1195288 1148632 1104348
56046 1104348 1063815 1027348 993979 963042 935282 911661 891832 874631 859465 846426 835622
56035 835622 827056 820605 815711 811770 809075 808372 809231 810156 810673 811837 814114 816486 818471 821236 825555
56020 825555 830410 834956 840184 847064 854639 861701 868935 877502 886729 895243 903448 912925 924053 935956
56006 935956 948170 960785 973619 986657 1000577 1015598 1030775 1045712 1061713 1079704 1098331
55995 1098331 1115887 1132957 1151323 1171318 1192066 1213222 1234576 1255056 1274143 1293359 1314473
55984A314473K2741K3288K4159K5708K6355K5923K6514K8887L1173L2324L3612
55973A615157L5557L6872L7583L9668M3253M5876M6868M8685N2422N5887N7890
55962B115718O0466O4848O9149P2120P5450Q0213Q4771Q8365R2927R9169J04785
55951C007981J08675J13050J19170J25136J30157J36596J45352J53678J60277
55942D200072J67994J78737J90297K00999K12778K26658K40233K52700K67362
55933F137830K85808L04803L22309L41051L62626L83932M03482M25221M51726
55924I418788M79651N06445N35457N69661O06762O45386O89379P40712P95102
55915A4987343Q50052R09750R76429J045234J114059J189761J277666J374098
$$ plain form
55984 1314473 1337214 1360502 1384661 1410369 1436724 1462647 1489161 1518048 1549221 1581545 1615157
55973 1615157 1650714 1687586 1725169 1764837 1808090 1853966 1900834 1949519 2001941 2057828 2115718
55962 2115718 2176184 2241032 2310181 2382301 2457751 2537964 2622735 2711100 2804027 2903196 3007981
55951 3007981 3116656 3229706 3348876 3474012 3604169 3740765 3886117 4039795 4200072
55942 4200072 4368066 4546803 4737100 4938099 5150877 5377535 5617768 5870468 6137830
55933 6137830 6423638 6728441 7050750 7391801 7754427 8138359 8541841 8967062 9418788
55924 9418788 9898439 10404884 10940341 11510002 12116764 12762150 13451529 14192241 14987343
55915 14987343 15837395 16747145 17723574 18768808 19882867 21072628 22350294 23724392
55907B3724392J476934J593692J730959J886696K062596K273066K532269K844717
55899D0125321L219081L676141M229945M877652N622677O487301P481048Q575744
55891H4294910R734099J0940582J2181032J3424208J4643222J5761969J6452471
55884A77432493J6021369J3718955R354617L621211k259355p240677j0861589
55877A99787024j3146630j4315175j4620683j4317125j3626423j2703461j1650193
55870A05407334j0549172r463901q426511p452117o559202n763211n063398m452204
55862D7677618l928713l490657l122914k806748k533201k297708k090188j901286
55854B5506203j731400j583550j453197j333587j224931j129723j044454r64080
$$ plain form
55907 23724392 25201326 26795018 28525977 30412673 32475269 34748335 37280604 40125321
55899 40125321 43344402 47020543 51250488 56128140 61750817 68238118 75719166 84294910
55891 84294910 94029009 104969591 117150623 130574831 145218053 160980022 177432493
55884 177432493 193453862 207172817 216527434 220148645 217889290 210648613 199787024
55877 199787024 186640394 172325219 157704536 143387411 129760988 117057527 105407334
55870 105407334 94858162 85394261 76967750 69515633 62956431 57193220 52129822 47677618
55862 47677618 43748905 40258248 37135334 34328586 31795385 29497677 27407489 25506203
55854 25506203 23774803 22191253 20738056 19404469 18179538 17049815 16005361 15041281
55846A5041281q89643q23957p64383p06977o53352o06627n64770n24333m86753
55837I020486m54744m26293l98244l72075l50260l30417l09009k87624k69797
55828E822023k54570k38757k22959k09824j98609j86768j74992j65838j59016
55819D010690j52440j46225j41486j36976j30919j24554j20039j16587j12254
55810B829210j07715j04684j02279r8561r4085r0549q7511q3627p9521p6416p3590
55799A830672p0148o7443o6704o6183o3779o0604n8840n7898n5886n3079n0706
55788A159402m8037m4014m0094l8135l7045l4702l1738l0008k8865k6483k3598
55777G76683k2279k2034k0684j8294j6806j6340j5272j3547j2658j2540j1546
$$ plain form
55846 15041281 14151638 13327681 12563298 11856321 11202969 10596342 10031572 9507239 9020486
55837 9020486 8565742 8139449 7741205 7369130 7018870 6688453 6379444 6091820 5822023
55828 5822023 5567453 5328696 5105737 4895913 4697304 4510536 4335544 4169706 4010690
55819 4010690 3858250 3712025 3570539 3433563 3302644 3178090 3058051 2941464 2829210
55810 2829210 2721495 2616811 2514532 2415971 2321886 2231337 2143826 2060199 1980678 1904262 1830672
55799 1830672 1760524 1693081 1626377 1560194 1496415 1435811 1376971 1319073 1263187 1210108 1159402
55788 1159402 1111365 1067351 1027257 989122 952077 917375 885637 855629 826764 800281 776683
55777 776683 754404 732370 711686 693392 676586 660246 644974 631427 618769 606229 594683
55766E94683r478p929p677q080q811r866j0249r052p464p345q305q464p635p277
55752D77051p709p804p242o774o408n483m306l664l043j441M68J110O52O39J314
55737D27360J444O84j5l18q63j692k165k406l122m071m392m240m490n061n209
55722C91444n097n389n629m846l462k811k969k827k059j339p44K55J424J957J843
55707C59751J489L95k060m945o620p048p482q177q200p389o635o319o115o150
55693B84495o673o895n891m450m152m826m872l935l243l218k918k073j701k182
55679B27466k534k150j697j820k264k685l066l094k432j688j834k612k902k564
55665A94124k491k818k677j868j213j147j329j725k489k835j681L64J468J236
$$ plain form
55766 594683 585205 577276 569599 561519 552708 542842 532593 523541 516077 508732 500427 491963 484328 477051
55752 477051 469342 461538 454296 447522 441114 435631 431325 427661 424618 423177 423645 424755 425407 426046 427360
55737 427360 428804 429488 429473 429155 428292 426600 424435 422029 418907 414836 410444 406204 401714 396653 391444
55722 391444 386347 380958 375329 370483 367021 364210 361241 358414 356355 355016 354272 354527 355951 357908 359751
55707 359751 361240 361635 359575 354630 348010 340962 333480 325303 317103 309714 303079 296760 290645 284495
55693 284495 277822 270927 265036 260586 256434 251608 246736 242801 239558 236340 233422 231349 229648 227466
55679 227466 224932 222782 221085 219265 217001 214316 211250 208156 205724 204036 202202 199590 196688 194124
55665 194124 191633 188815 186138 184270 183057 181910 180581 178856 176367 173532 171851 172215 173683 174919
55651A74919J170K093K943K717J881J136K14j185k543l330l657l549k697j431
55637A68681q24j256j853j832j479j358j484j619j625j314p22m83r48j222k81
55622A50381J144J374M32R6J123K161J995J128N05J04l23m89l31l84p20o57j39
55605A57400r4q04j208o36P3P5o3N04J368J610J252R52Q86P99O59N01J45l42n05
55586A62572l07l85j013j572j618j674k335l348m169m765n191n095m276l143k088
55571A21593j052k05k86j535k948l323k591j525o15J12N83O79N26L54K46J95J51
55554A10359r1o44j135j093p32o83r88j084q42p24q63r02q67j169j590j344m51
55537I5157J04q0l03k20m86j345j884j506j034j304j812j735j397j480j639j149
$$ plain form
55651 174919 176089 178182 181125 183842 185723 186859 187073 185888 183345 180015 176358 172809 170112 168681
55637 168681 167857 166601 164748 162916 161437 160079 158595 156976 155351 154037 153315 152832 151884 150662 150381
55622 150381 151525 152899 153331 153427 154550 156711 158706 159834 160339 160443 160120 159631 159300 158916 158196 157539 157400
55605 157400 157306 156502 155294 154658 154731 154806 154743 155247 156615 158225 159477 160429 161315 162114 162773 163274 163419 163077 162572
55586 162572 162265 161880 160867 159295 157677 156003 153668 150320 146151 141386 136195 131100 126824 123681 121593
55571 121593 120541 120336 120050 118515 115567 112244 109653 108128 107513 107625 108208 108887 109413 109767 110013 110208 110359
55554 110359 110268 109624 108489 107396 106664 105981 104993 103909 103067 102343 101480 100578 99711 98542 96952 95608 95157
55537 95157 95261 95181 94878 94658 94172 92827 90943 89437 88403 87099 85287 83552 82155 80675 79036 77887
55521G7887l53j60m69l25N15J270J329R32O03O36J119J839K161J558L05p54j101
55504H6992r21o73n50l69Q7N82N27j91p57m63J83J81k93k09M63N78j75n97K6P10
55484H5131N04J31O40J528J578Q12J83j53p60j480j460o43J7m1l83m89m27m33
55466H4255n60q57j341j707j598j177q97q27p19o07p50j048j110r26q88j128j286
55449F6829j085o84m04m04o06p61n90j45J19j12n63p08m08LJ17k39q13r37l9J478
55429F0048K328J640l2j330j467o51M69J335J632J350O95j41r65j365r39J05J031
55412F3743J416J439J211N65k87o39l29j91q82j918k451k356j921j136j09L99
55396E6554j45j065j263o80q5K23N30P15K95n07p99l76j20o70j449j460n82M45
$$ plain form
55521 77887 77534 77374 76905 76580 77095 78365 79694 80626 81229 81865 82984 84823 86984 88542 88847 88093 86992
55504 86992 86071 85398 84848 84479 84566 85148 85675 85484 84727 84264 84447 84628 84335 84126 84589 85167 84992 84395 84421 85131
55484 85131 85635 85766 86406 87934 89512 90324 90507 90354 89594 88114 86654 86011 86028 85987 85604 85115 84688 84255
55466 84255 83695 82838 81497 79790 78192 77015 76118 75291 74572 73965 73215 72167 71057 70131 69243 68115 66829
55449 66829 65744 65060 64656 64252 63646 62885 62295 62150 62269 62157 61594 60886 60478 60481 60598 60359 59546 58609 58570 60048
55429 60048 62376 64016 63984 62654 61187 60536 61005 62340 63972 65322 66017 65876 64911 63546 62607 62712 63743
55412 63743 65159 66598 67809 68374 68087 67448 67119 66928 66046 64128 61677 59321 57400 56264 56155 56554
55396 56554 56409 55344 54081 53401 53316 53539 54069 54784 55079 54572 53773 53397 53277 52607 51158 49698 49116 49561
55378D9561R10O68L1n17n77r3N38P55L43k48k49N13J182Q18l07r32n24Ol31j184
55358E0363j455p74L18J282J884J873J165K83p3O6K3n02j038j021m66J37K74k00
55340E2139q27q95k68L22J91l94o64m32p2K88Q65J466J438N71n01j054j065r89
55322E0119j047j039o97p0M16L44k57r38j316j302q89j26N94O53Nn81m42J85O97
55303D4309R83J197J142N89m8j47J61K63J64M81J227J533R28J13m2K87L08o3p2
55284E3313O68J429J189o0j213j291m84K22K62j03m08n68o87p16o10m82l95k13
55266D9853J01L36M04N61R49J209Q87J9r61j661j832j302j85R85J660J728J394
55249E4145Q95M72L73N21M85L9n07p46o83n70n30o03q84j256j343r56l96mK72
$$ plain form
55378 49561 50471 51139 51170 50653 50076 49983 50521 51276 51619 51371 51122 51635 52817 53635 53328 52396 51872 51878 51547 50363
55358 50363 48908 48134 48452 49734 51618 53491 54656 54939 54866 54932 54955 54453 53415 52394 51928 52065 52339 52139
55340 52139 51312 50417 50149 50471 50662 50268 49604 49172 49100 49388 50253 51719 53157 53728 53227 52173 51108 50119
55322 50119 49072 48033 47336 47266 47682 48026 47769 46831 45515 44213 43324 43198 43792 44445 44450 43869 43427 43612 44309
55303 44309 45292 46489 47631 48220 48172 48025 48186 48449 48613 49094 50321 51854 52782 52895 52853 53140 53448 53385 53313
55284 53313 53981 55410 56599 56539 55326 54035 53551 53773 54035 53932 53524 52956 52269 51553 50943 50461 50066 49853
55266 49853 49954 50290 50694 51255 52204 53413 54300 54319 53358 51697 49865 48563 48378 49363 51023 52751 54145
55249 54145 55040 55512 55885 56406 56891 56930 56423 55677 54994 54424 53894 53291 52407 51151 49808 48852 48456 48452 48724
55230D8724N88Q76J051J169J194R45N09J99j07r05k008k326j213N04J502J444
55214E2146Q73K58j58r7L28L51m87j444j489p79l36m95o19k36L05N23L76J27P3
55195D9220M15R98J242P75j51j113j966k441j927l16J410K250K334K252J907R99
55179E5888J07L0M40L75j85n25o92j344k146j920o03M43M56K18M16M82p1m59J28
55160E1038J015R44n3p58m52L85Q90O78r3r39j278q69o2N23N03l5o21o99j56M84
55140E0445O71N09M28L71m9o53p59k36K35J96J4J59M73N30J90m17r85r66l9J135
55120E1252J313K06r76r60J37J232J602J287O22k9l24j86N5R6N8K26N87Q53Q87
55101E7938Q80J167J780K141J484r9j418j503q72o98j008p48L26J058N93l79p19
$$ plain form
55230 48724 49312 50188 51239 52408 53602 54547 55056 55255 55148 54243 52235 49909 48696 49200 50702 52146
55214 52146 53019 53277 53119 53022 53350 53701 53214 51770 50281 49502 49166 48671 48052 47816 48121 48644 49020 49147 49220
55195 49220 49635 50633 51875 52650 52499 51386 49420 46979 45052 44736 46146 48396 50730 52982 54889 55888
55179 55888 55995 56025 56465 56840 56655 56130 55438 54094 51948 50028 49425 49868 50324 50542 50958 51440 51369 50910 51038
55160 51038 52053 52997 52944 52186 51734 52119 53009 53687 53594 52655 51377 50508 50446 50969 51472 51437 50816 50117 49961 50445
55140 50445 51116 51625 52053 52424 52375 51722 50963 50727 50962 51158 51172 51331 51804 52334 52524 52107 51122 50156 50117 51252
55120 51252 52565 52771 51795 50835 50972 52204 53806 55093 55715 55686 55362 55176 55231 55327 55385 55611 56198 57051 57938
55101 57938 58818 59985 61765 63906 65390 65291 63873 62370 61498 60800 59792 59044 59370 60428 61021 60642 59923
55084E9923l68l0L6P6J19l5l05m11l62m09o13p73o78k57L51P16N13M9K0N23Q42
55063E8927M44k96p56q67q52o19J1P71J129R14M06o3k93k57j69l12o15o37j94
55044E6672L75P19Q88R96R17N97L12K95L86L98M45O69R04R34P75M70k5n25n96
55025F5606k18K3j98l44K06J070J250M65m82p40l21J70L80M83P56J087J096O86
55007G0975K55J69K82J94j34m02m64m32l98l92n06o36l54M65J122Q92J64n5L09
54988G1054K82n71j388j254l53M73P20L37m98j289j454r51k68L02P95R46L23p34
54970F6472j201p37q5J89L82O65N65k7l88k26l37j115j532o57P21J212P89L75
54952F5065J74k56p29o22j24j3l34m58l33m12m90J91J558K521K429J707R38K34
$$ plain form
55084 59923 59555 59525 59561 59637 59756 59721 59416 59005 58643 58234 57621 56848 56170 55913 56264 56980 57493 57542 57562 58085 58927
55063 58927 59371 59075 58319 57452 56600 55981 55992 56763 57892 58806 59212 59149 58856 58599 58430 58118 57503 56866 56672
55044 56672 57047 57766 58654 59650 60567 61164 61476 61771 62157 62555 63000 63669 64573 65507 66282 66752 66727 66202 65606
55025 65606 65388 65411 65213 64869 65075 66145 67395 67860 67378 66638 66317 66487 66867 67350 68106 69193 70289 70975
55007 70975 71230 71399 71681 71875 71741 71339 70875 70443 70045 69653 69147 68511 68157 68622 69744 70636 70800 70745 71054
54988 71054 71336 70765 69377 68123 67770 68243 68963 69300 68802 67513 66059 65108 64840 65142 65937 66883 67206 66472
54970 66472 65271 64534 64449 64638 65020 65685 66250 66223 65835 65609 65272 64157 62625 61968 62689 63901 64690 65065
54952 65065 65239 64983 64254 63632 63508 63495 63161 62703 62370 61958 61468 61659 63217 65738 68167 69874 70812 71046
54934G1046k21j0P68J290J000K16m30o46m25O2L39po24o65J14R26R59K62m88p75
54914G2691n82l19m47r44j194o66L22R90J021P25L82K0k79l40k03m7J54M58O49
54895G2391N39L90N08O64N36M09P23J141R67L61J77N43O30np38r13o60l76p4K77
54875G7490M11K38J01K14L37L12L94P11J009J229J810K894L803L838L226K736
54859A00753K686K793K795K694K514K194J707J082M15o8k42m06j077k252l265
54844A12323l591l380l013k541j951j505j376j248q03k81j17k02l4M73Q65Q19
54828I4438M71P4k42k80J64Q93J318J186J033J568K792M027M711M855M697M328
54812A26033L773L104K251R59p11k092k557k400k531l275l927l764l061k666k843
$$ plain form
54934 71046 70825 70815 71583 72873 73873 74089 73659 73013 72588 72650 72989 72982 72358 71693 71807 72733 73692 73954 73466 72691
54914 72691 72109 71790 71343 70399 69205 68539 68861 69851 70872 71597 71979 71999 71720 71380 71177 71130 71284 71742 72391
54895 72391 72930 73320 73828 74492 75028 75437 76160 77301 78268 78629 78806 79349 79979 79974 79236 78323 77663 77287 77213 77490
54875 77490 77901 78139 78240 78454 78791 79103 79497 80208 81217 82446 84256 87150 90953 94791 98017 100753
54859 100753 103439 106232 109027 111721 114235 116429 118136 119218 119633 119565 119323 118917 117840 115588 112323
54844 112323 108732 105352 102339 99798 97847 96342 94966 93718 92915 92634 92517 92315 92281 92754 93619 94438
54828 94438 94909 94983 94741 94461 94625 95518 96836 98022 99055 100623 103415 107442 112153 117008 121705 126033
54812 126033 129806 132910 135161 136120 135409 133317 130760 128360 125829 122554 118627 114863 111802 109136 106293
54797A06293k993k520j626j068j268j851k190k242k546l200l379k331n65P02J055
54782H0271J064R88L01j158k529k934k440j510k92R57J516J092M78M69P03M15
54766G7391k36n64n99q56j259j338j190j186j015j86P52Q17K52K10P59P62jk16
54748G2297Q35J985J898Q79M2k94l39J11J120J763J123k73j030p59l00k71m14
54731G8373m19m54n69l78L05J021J245J083J047J368J768J848J505R41L64k09
54715H8839p30q74k86R11K157L112L886M479M457L540K324J836K391L219L367
54700A22628K758K087J812J482L32j566l152l566l121k737k724k667k351k076
54686A07139k037k005j887j957k167j847n95Q83J425Q07m4k03L10Q91J206J355
$$ plain form
54797 106293 103300 100780 99154 98086 96818 94967 92777 90535 87989 84789 81410 79079 78514 79216 80271
54782 80271 81335 82323 82624 81466 78937 76003 73563 72053 71761 72718 74234 75326 75804 76273 76976 77391
54766 77391 77155 76591 75992 75136 73877 72539 71349 70163 69148 68962 69714 70531 70783 70993 71752 72514 72513 72297
54748 72297 73132 75117 77015 77894 77936 77642 77303 77414 78534 80297 81420 81147 80117 79358 79058 78787 78373
54731 78373 77954 77500 76931 76553 76858 77879 79124 80207 81254 82622 84390 86238 87743 88684 89048 88839
54715 88839 88109 87235 86949 87860 90017 93129 97015 101494 105951 109491 111815 113651 116042 119261 122628
54700 122628 125386 127473 129285 130767 131099 129533 126381 122815 119694 116957 114233 111566 109215 107139
54686 107139 105102 103097 101210 99253 97086 95239 94644 95527 96952 97759 97715 97512 97822 98713 99919 101274
54670A01274J353R52K32o3O89J947K443J869J433K238L651M089L072J565M66k88
54654A26922r79j422j473j480j791k275k677l004l185k851j922j056j019j752
54640A00036k440k408j679p33K7M80N75P8j137k495k876j865n04j64q99j522j256
54623H1218m39K97P87R53O28K0k71j28j54o78j171j061n22J1N22R97R61O3j123
54604H0910j642j260n88k26k51m54o28o44n09l74l74n42r00j332j477j031k31
54587F8447L81P05J100J641J940J804J485J133O49K61M92J234J594J061J99k83
54571H3843m66o66p27m41j58k69n17m39q7K12M42O67O53K97K5J40K58j7l03o8
54551H2379L57J90n61j057p50Q3Q24J056P29K40J45M32M48j25o48m72K8L2m49
$$ plain form
54670 101274 102627 103579 103811 103748 104437 106384 108827 110696 112129 114367 118018 122107 125179 126744 127210 126922
54654 126922 125943 124521 123048 121568 119777 117502 114825 111821 108636 105785 103863 102807 101788 100036
54640 100036 97596 95188 93509 92776 92803 93283 93858 93936 92799 90304 87428 85563 85059 84895 83996 82474 81218
54623 81218 80779 81076 81863 82816 83444 83464 83193 83065 82911 82233 81062 80001 79479 79490 80012 81009 81970 82033 80910
54604 80910 79268 78008 77420 77194 76943 76489 75861 75217 74708 74334 73960 73418 72518 71186 69709 68678 68447
54587 68447 68828 69533 70633 72274 74214 76018 77503 78636 79285 79546 80038 81272 82866 83927 84126 83843
54571 83843 83377 82711 81984 81543 81385 81116 80599 80160 80073 80285 80727 81394 82047 82344 82369 82509 82767 82750 82447 82379
54551 82379 82736 82926 82365 81308 80558 80641 81465 82521 83250 83490 83635 84067 84515 84390 83742 83270 83298 83330 82881
54532H2881o98l79J71N99P66N89K30K52Q73J360Q72l34j234j382j117o98j24K53
54514H2880q1q81j255q23j87k7l22n99m16M04J500J976J312J92j47N20J202J031
54496H6279J96n57p23k93L10M55k8m76k11M76P75O79Q93J504J722J201O82Q56
54478I3740J392J558J205O11j33r86j597j584j029l64J17L81M75M17J64l18q49
54461I3200r88n02J98M36K6o39j103j089n18K82N29j90j235j588j116m55J10Q38
54443H6196J674K095J907J418P98P6k70K93J203J255M40J21R15J616J028k70j037
54426I9458j283j792k357j976n98N94Q11N38N81J039J558J918J976J517O00k16
54410A02368l73K5L30J91J8M65J527K425K505J938J286O77q6p82q93m53j69m40
$$ plain form
54532 82881 82183 81804 81975 82574 83340 83929 84159 84411 85284 86644 87516 87182 85948 84566 83449 82751 82627 82880
54514 82880 82799 81918 80663 79840 79653 79626 79304 78705 78289 78693 80193 82169 83481 83673 83526 84046 85248 86279
54496 86279 86475 85918 85195 84902 85212 85667 85639 85163 84952 85428 86203 86882 87775 89279 91001 92202 92884 93740
54478 93740 95132 96690 97895 98506 98373 97387 95790 94206 93177 92813 92930 93311 93786 94203 94367 94049 93200
54461 93200 92212 91710 91908 92344 92370 91731 90628 89539 89021 89303 89832 89642 88407 86819 85703 85248 85358 86196
54443 86196 87870 89965 91872 93290 94088 94164 93894 94187 95390 96645 97085 97206 98121 99737 100765 100495 99458
54426 99458 98175 96383 94026 92050 91452 92046 92857 93395 93976 95015 96573 98491 100467 101984 102584 102368
54410 102368 101995 102020 102350 102541 102559 103024 104551 106976 109481 111419 112705 113382 113296 112514 111621 111168 110999 110559
54392A10559q70r76q61q02p63o45o13p87r74r99r44p97l20L80P01L91jN3K75K02
54372A02209J06N00J098J071K66n91q98p60n13k43L0J90K29L07M69N17K98p1l28
54353A03886l70l67n91j020j154n44M59R58O36K17M22R82J134P35K66Q5J67M72
54335A06373R43J269J183Q90P10M54k40j065j225n72J49L31K34M23R48J407J464
54318A13676J121O81N48P98R23M50j98J2J348K764L076K264J211O15N00O00O52
54301A31041M14j43o88q42o17l12o8J60L16K34q9n09r93j538j872j621q88l32
54283A21653m32r69j391j453j309j199j287j602j873j600o66L03O19L97K55K21
54267A09667l20j413k044j407j49L91j35q25q63l65J39M04M20J70j59j58L06P55
$$ plain form
54392 110559 109689 108713 107852 107050 106287 105642 105029 104242 103268 102269 101325 100528 100208 100588 101289 101680 101679 101732 102007 102209
54372 102209 102315 102815 103913 104984 105250 104659 103761 103001 102488 102245 102275 102465 102694 103001 103470 103987 104285 104214 103886
54353 103886 103516 103149 102558 101538 100384 99840 100299 101257 101893 102110 102532 103514 104648 105383 105649 105734 105901 106373
54335 106373 107316 108585 109768 110658 111368 111822 111582 110517 109292 108720 108869 109200 109434 109857 110805 112212 113676
54318 113676 114797 115478 116026 116824 117747 118197 117999 118011 119359 122123 125199 127463 128674 129289 129789 130389 131041
54301 131041 131455 131312 130624 129782 129165 128853 128785 128945 129261 129495 129406 128897 127904 126366 124494 122873 121985 121653
54283 121653 121221 120252 118861 117408 116099 114900 113613 112011 110138 108538 107872 108175 108794 109191 109446 109667
54267 109667 109347 107934 105890 104483 104334 104725 104590 103765 102902 102537 102676 103080 103500 103670 103511 103353 103659 104414
54249A04414N93k01j074j455j174m98J15L71M14N92R85J256J059L94m86j207j320
54232A02778n75O25J402J265O06R7j12l02n72p22o25k93K93J055J569J361M88
54215A08338m61j003j117r19l82M37J228J745K053K219J971J082k5n22j84K61
54199A14721R5m11m10K75Q02M07o41j369j199m09K98L89j40q14j013n42K02O68
54181A10909P04N42M02K90J12j79m39l39K38P78N22m59j105p01J37L19k51p98
54163A10682r17q67q19o81o36r80j377j136m23j87o27p72l3P93P27N6l10k29k21
54144A02043l55j98L03P24Q92J077J432J786J878J542O77m77j336j575j503j444
54128A05466j176m78J65J71j13J22Q52J235R61O40P11Q48P66P86J102J159L98
$$ plain form
54249 104414 105007 104806 103732 102277 101103 100605 100720 101091 101505 102097 103082 104338 105397 105791 105305 104098 102778
54232 102778 102203 102828 104230 105495 106101 106198 106086 105784 105212 104490 103865 103572 103865 104920 106489 107850 108338
54215 108338 107877 106874 105757 104838 104456 104893 106121 107866 109919 112138 114109 115191 115166 114644 114460 114721
54199 114721 114816 114405 113995 114270 115072 115479 114838 113469 112270 111861 112159 112548 112408 111594 110581 110039 110241 110909
54181 110909 111613 112155 112557 112847 112959 112780 112341 112002 112240 113018 113540 113081 111976 111275 111412 111731 111480 110682
54163 110682 109765 108898 108079 107398 106762 105782 104405 103269 102846 102659 102032 101260 101227 102020 102747 102803 102493 102264 102043
54144 102043 101688 101490 101793 102517 103409 104486 105918 107704 109582 111124 111801 111324 109988 108413 106910 105466
54128 105466 104290 103812 103977 104148 104035 104157 105009 106244 107205 107845 108556 109404 110170 110956 112058 113217 113615
54111A13615p98j505j340o33K15J010J510J421Q13K19Q1K87K98k74j260k043k101
54094A09515j476o96j65J96P01J337J687J408O94Q6j04n5j28m15p54r87j011o91
54076A09142OP70J185J205J152J158R97N63J50K0O6J87N87J289J694J198J23n58
54058A20934m18nN0j73j20M67J323J975K087J617P92p0p57j199j370j288j101
54041A22744j010r79p25k7Q44J167L92j130k215j892l93J139J845J717J084J07
54025A22668r03j287o60M69J165J088O86M99O80J073J455J636J605J530J505J432
54009A34641J252J133J149J076P46L77J83M0k06k98L9N41P12N23L75M37N86P91
53991A44097J060J126Q59P95J540K650K983K284J604J834K629L275L817M619N356
$$ plain form
54111 113615 112817 111312 109972 109339 109554 110564 112074 113495 114308 114527 114608 114895 115193 114919 113659 111616 109515
54094 109515 108039 107343 107178 107374 108075 109412 111099 112507 113201 113287 113183 113128 113000 112585 111831 110844 109833 109142
54076 109142 109148 109918 111103 112308 113460 114618 115615 116178 116328 116348 116414 116601 117188 118477 120171 121369 121492 120934
54058 120934 120516 120511 120561 120388 120268 120735 122058 124033 126120 127737 128529 128459 127702 126503 125133 123845 122744
54041 122744 121734 120755 120030 120003 120847 122014 122406 121276 119061 117169 116776 117915 119760 121477 122561 122668
54025 122668 121765 120478 119818 120287 121452 122540 123226 123725 124405 125478 126933 128569 130174 131704 133209 134641
54009 134641 135893 137026 138175 139251 139997 140374 140557 140597 140391 140093 140132 140673 141385 141908 142283 142720 143306 144097
53991 144097 145157 146283 147142 147937 149477 152127 155110 157394 158998 160832 163461 166736 170553 175172 180528
53976A80528N410M952M794N138N287M786M156M110M513M661M299L810L459K998
53962B42901K226J470J122J016P08K31K3P5k04j106k208l100m043n307o340o246
53946B21218n018l625k882k753k795k735k504k109j741j637j754j728j340q04
53932A87793m67m43n52n12j67L10N85O21P83J250J596J328O07r7p79j724k672
53915A87460k947k521k245k717l521l866l484k548j256P1Q63P79J18n56r29q68
53899A61833k10Q96J778J899J578J536J834J793J046K18K81J465L027L966L850
53884A86790L077K417K340K698K998K966K737K627K726K843K799K704K841L266
53870B25829L664L774L755L969M453M895N076N158N358N580N512N027M360L913
$$ plain form
53976 180528 185938 190890 195684 200822 206109 210895 215051 219161 223674 228335 232634 236444 239903 242901
53962 242901 245127 246597 247719 248735 249443 249674 249697 249772 249568 248462 246254 243154 239111 233804 227464 221218
53946 221218 216200 212575 209693 206940 204145 201410 198906 196797 195056 193419 191665 189937 188597 187793
53932 187793 187326 186883 186331 185819 185652 185962 186547 187168 187951 189201 190797 192125 192732 192635 191856 190132 187460
53915 187460 184513 181992 179747 177030 173509 169643 166159 163611 162355 162426 163289 164068 164186 163630 162701 161833
53899 161833 161623 162519 164297 166196 167774 169310 171144 172937 173983 174201 174482 175947 178974 182940 186790
53884 186790 189867 192284 194624 197322 200320 203286 206023 208650 211376 214219 217018 219722 222563 225829
53870 225829 229493 233267 237022 240991 245444 250339 255415 260573 265931 271511 277023 282050 286410 290323
53856B90323L935M436N320O418P346P540O801N750N264N394N268M283K860J707
53842C62645P93l14j492k165k224k209k518k996l383l664l918m265m947o033p021
53827C16289p281o924o644o660o424n626m811m654n043n311n023m243l306k675
53813B41664k711l276l764l801l648l688l823l714l366l150l256l462l373k772
53799A93860j849j131j049j495j955k098k042j977j847j533j107o89k88R3L27
53784A75220L08Q8k29o21j107j605j819j336p8J236J538O70k67l25k1m13j245
53767A69994j147K54J596J568M69n66j037j110q22j38N93R65J077J284J602J866
53751A76448K193K777L406L660L451L025K629K466K738L412M164M753N174N248
$$ plain form
53856 290323 294258 298694 304014 310432 317778 325318 332119 337869 343133 348527 353795 358078 360938 362645
53842 362645 363438 363124 361632 359467 357243 355034 352516 349520 346137 342473 338555 334290 329343 323310 316289
53827 316289 309008 302084 295440 288780 282356 276730 271919 267265 262222 256911 251888 247645 244339 241664
53813 241664 238953 235677 231913 228112 224464 220776 216953 213239 209873 206723 203467 200005 196632 193860
53799 193860 192011 190880 189831 188336 186381 184283 182241 180264 178417 176884 175777 175088 174800 174893 175220
53784 175220 175528 175616 175387 174766 173659 172054 170235 168899 168821 170057 171595 172265 171998 171673 171652 171239 169994
53767 169994 168847 169101 170697 172265 172734 172168 171131 170021 169199 169061 169654 170619 171696 172980 174582 176448
53751 176448 178641 181418 184824 188484 191935 194960 197589 200055 202793 206205 210369 215122 220296 225544
53737B25544M661L740L569M618N794N594M015K500K067K278K155J455P46N39O38
53722B69913L08r15k543l554l580l347l605m115m198l887l851m252m474m048l269
53707B20583k737k690k976l349l576l500l185k881k738k657k418j939j402j138
53693A83397j244j380j188q20p19q52p13j73K20P9l25o98j218j874j965j003L13
53676A69837Q21L36l25m84p1P50J648J983J398N13K86P75J229J320J388J497J183
53659A84084L70l15m71m97p54q69l06Q23J936K656K950K918K744K646K573K317
53643B02805J950J814J951J975J713J513J662J976K199K388K560K399J791J214
53629B29910J161J412J434J252J399J981K377J993R55j01p24r27r39q69o43k39
$$ plain form
53737 225544 230205 233945 237514 242132 247926 253520 257535 260035 262102 264380 266535 267990 268736 269275 269913
53722 269913 270221 269306 266763 263209 259629 256282 252677 248562 244364 240477 236626 232374 227900 223852 220583
53707 220583 217846 215156 212180 208831 205255 201755 198570 195689 192951 190294 187876 185937 184535 183397
53693 183397 182153 180773 179585 178765 178046 177194 176481 176308 176528 176607 176282 175584 174366 172492 170527 169524 169837
53676 169837 170658 170994 170669 170185 170114 170864 172512 174495 175893 176406 176692 177467 178696 180016 181404 182901 184084
53659 184084 184454 184139 183668 183171 182417 181548 181242 182065 184001 186657 189607 192525 195269 197915 200488 202805
53643 202805 204755 206569 208520 210495 212208 213721 215383 217359 219558 221946 224506 226905 228696 229910
53629 229910 231071 232483 233917 235169 236568 238549 240926 242919 243874 243773 243049 242122 241183 240314 239671 239432
53613B39432J75L73L37K91M53Q45J289J486J138K39o88r32l49L91N23O5l10k27
53595B44531k6j41l84j94N30J303J710J775J570J005L28K57J051J854J747J123
53579B58039J118J715J600J53j411j569l73R54J679K011K234K223J773R27L9k63
53563B70849M17J534J938J362Q51J190J685J433R59J369K411K794K303K044K494
53548B95633K715K054J315J565K600L415L536L213K727K141J545J085Q60R09J126
53533C26439J204R57N73K14l86j298j736r75K64M58n63j303p77J65K26o81j805
53516C20976k691l133k851k000j393j400j319o19l6m90j437j473l14R36J344J035
53500C05135N58K78M20R11J092L58p87j110k17Q95J122N12o7lP01J707K609L095
$$ plain form
53613 239432 239607 239980 240317 240608 241061 241906 243195 244681 245819 246058 245370 244438 244089 244480 245003 245068 244758 244531
53595 244531 244505 244364 243980 243786 244316 245619 247329 249104 250674 251679 252007 252264 253315 255169 256916 258039
53579 258039 259157 260872 262472 262625 261214 259645 259272 260226 261905 263916 266150 268373 270146 271073 271112 270849
53563 270849 271266 272800 274738 276100 276951 278141 279826 281259 282218 283587 285998 288792 291095 293139 295633
53548 295633 298348 300402 301717 303282 305882 309297 312833 316046 318773 320914 322459 323544 324404 325313 326439
53533 326439 327643 328600 329173 329387 329001 327703 325967 324992 325256 325714 325151 323848 323071 323236 323462 322781 320976
53516 320976 318285 315152 312301 310301 308908 307508 306189 305570 305534 305044 303607 302134 301820 302756 304100 305135
53500 305135 305693 305971 306391 307302 308394 308752 307965 306855 306638 307533 308655 309167 309100 309097 309798 311505 314114 317209
53482C17209L137K990K851K646K322K177K709M016N493O246O002N482N655O619
53468C75554P540P772P594P626P920Q136Q342R038J0336J1603J2167J2134J2178
53455D97940J2659J3229J3491J3730J4599J6070J7232J7458J7297J7668J8509
53444F69882J8939J8620J8100J7764J7338J6681J6255J6325J6418J6037J5427
53433H57786J5064J4949J4893J4975J5187J5104J4478J3741J3370J3194J2885
53422A015626J2637J2724J2831J2528J2059J1888J1832J1388J0591R710Q451O388
53410A148653L960K082Q75l05j605k571l291m548o464q025q463q272q350q806
53396A094870r243r549r827r966r923j0101j0873j1934j2566j2443j1888j1404
$$ plain form
53482 317209 320346 323336 326187 328833 331155 333332 336041 340057 345550 351796 357798 363280 368935 375554
53468 375554 383094 390866 398460 406086 414006 422142 430484 439522 449858 461461 473628 485762 497940
53455 497940 510599 523828 537319 551049 565648 581718 598950 616408 633705 651373 669882
53444 669882 688821 707441 725541 743305 760643 777324 793579 809904 826322 842359 857786
53433 857786 872850 887799 902692 917667 932854 947958 962436 976177 989547 1002741 1015626
53422 1015626 1028263 1040987 1053818 1066346 1078405 1090293 1102125 1113513 1124104 1133814 1142265 1148653
53410 1148653 1152613 1154695 1155570 1155265 1153660 1151089 1147798 1143250 1136786 1128761 1120298 1112026 1103676 1094870
53396 1094870 1085627 1076078 1066251 1056285 1046362 1036261 1025388 1013454 1000888 988445 976557 965153
53384I65153j1263j1362j1266j0560r379q325p700p085n939m338k811j666q05
53371H72654o6N93J210J858K586L446M528N798P031Q046Q936R913J1013J2076
53357I49622J2971J3699J4351J5063J5990J7241J8764K0301K1472K2067K2384
53346A143925K3042K4283K5555K6184K6329K6886K8309L0020L1225L1989L3076
53335A450823L4843L6681L7690L7613L7032L6737L7116L8025L8971L9334L8688
53324A863553L7213L5654L4535L3465L1665K9160K6857K5247K3653K1190J7994
53313B180186J4927J2365R950P277M219P19l148o945j0359j3787j7793k2052k5557
53300B130002k7942k9752l1321l2248l2416l2606l3466l4472l4671l4009l3233
$$ plain form
53384 965153 953890 942528 931262 920702 911323 902998 895298 888213 882274 877936 875125 873459 872654
53371 872654 872588 873181 874391 876249 878835 882281 886809 892607 899638 907684 916620 926533 937546 949622
53357 949622 962593 976292 990643 1005706 1021696 1038937 1057701 1078002 1099474 1121541 1143925
53346 1143925 1166967 1191250 1216805 1242989 1269318 1296204 1324513 1354533 1385758 1417747 1450823
53335 1450823 1485666 1522347 1560037 1597650 1634682 1671419 1708535 1746560 1785531 1824865 1863553
53324 1863553 1900766 1936420 1970955 2004420 2036085 2065245 2092102 2117349 2141002 2162192 2180186
53313 2180186 2195113 2207478 2217428 2224705 2228924 2229643 2226495 2219550 2209191 2195404 2177611 2155559 2130002
53300 2130002 2102060 2072308 2040987 2008739 1976323 1943717 1910251 1875779 1841108 1807099 1773866
53289A773866l2744l2272l1585l0876l0417l0291l0395l0451l0017k8958k7743
53278A438117k6887k6223k5164k3600k2036k0818j9705j8384j6932j5581j4369
53267A208418j3277j2445j2034j2032j2356j2924j3512j3759j3502j2886j1995
53256A067696j0612q713o937o090o161o313n894n076m307l573k581j362k52O40
53242A000465J483K337L066L741M768O405Q396J0220J1533J2299J2678J2902J3150
53229A103443J3503J4066J4955J5922J6180J5138J3262J1699J0932J0444R691
53218A249235Q738P671O117L919J631k49j932l728n399o806q508j0814j2795j3394
53204A213686j3085j3340j4551j5802j6630j7622j9070k0314k0865k1004k0827
$$ plain form
53289 1773866 1741122 1708850 1677265 1646389 1615972 1585681 1555286 1524835 1494818 1465860 1438117
53278 1438117 1411230 1385007 1359843 1336243 1314207 1293389 1273684 1255300 1238368 1222787 1208418
53267 1208418 1195141 1182696 1170662 1158630 1146274 1133350 1119838 1106079 1092577 1079691 1067696
53256 1067696 1057084 1048371 1041434 1035344 1029183 1022870 1016976 1011900 1007593 1004020 1001439 1000077 999825 1000465
53242 1000465 1001948 1004285 1007351 1011092 1015860 1022265 1030661 1040881 1052414 1064713 1077391 1090293 1103443
53229 1103443 1116946 1131012 1145967 1161889 1178069 1193207 1206469 1218168 1229100 1239544 1249235
53218 1249235 1257973 1265644 1271761 1275680 1277311 1277062 1275130 1271402 1266003 1259197 1250689 1239875 1227080 1213686
53204 1213686 1200601 1187261 1172710 1156908 1140278 1122656 1103586 1083272 1062407 1041403 1020576
53193A020576j9884j8419j7796j8715k0007k0167j9349j8735j8570j8113j7195
53182H13626j6612j6926j7804j8561j8635j7592j5546j3572j2878j3392j3815
53171F38293j3228j1992j0958j0435j0198r910r314q431p827q194r374j0304j0236
53158E07892r612r337r588r828r758r700r990j0443j0627j0439j0157r934r527
53145C78952q654p504o619o234o088n990o192o859p489p383o622o005o028o348
53131B84937o456o363o357o408o170n490m610l930l662l675l627l283k744k242
53117B19920j794j266q07q49j546k402k690k120j019m2K08m66j612k342k101j243
53101A97829o61q50j484j907j769j166m12J86M24K93k0l00m80o41q24r37q04l23
$$ plain form
53193 1020576 1000692 982273 964477 945762 925755 905588 886239 867504 848934 830821 813626
53182 813626 797014 780088 762284 743723 725088 707496 691950 678378 665500 652108 638293
53171 638293 625065 613073 602115 591680 581482 571572 562258 553827 546000 537806 528432 518128 507892
53158 507892 498280 488943 479355 469527 459769 450069 440079 429636 419009 408570 398413 388479 378952
53145 378952 370298 362794 356175 349941 343853 337863 331671 324812 317323 309940 303318 297313 291285 284937
53131 284937 278481 272118 265761 259353 253183 247693 243083 239153 235491 231816 228189 224906 222162 219920
53117 219920 218126 216860 216053 215204 213658 211256 208566 206446 205427 205385 205593 205127 203515 201173 199072 197829
53101 197829 197168 196318 194834 192927 191158 189992 189580 189766 190190 190483 190463 190163 189683 189042 188218 187281 186477 186154
53083A86154L92R65R97M51k07m91m57n98j085j414j014j6R03J317J404J434J326
53066A90061Q31j6q12j065n27O37J945K955L556L783L537K771J850J276R92L86
53050B12160p47j695j640p00K08L56k89j329k233k507k021j315j147j626k066
53035A93409j839j069m04k72o36j184j542j367n86L84Q14L62n40j091r52n17l60
53018A82610o38j090j447j565j426j188j081j059p76j59K69J35p1K91Q68P67R5
53001A74535j11L71M67m09j241r78j64J33J51P89J711J703P25NJ1j47q94j316
52983A75341q13k48n02r60n96K52M50q1k93L24J078J155N40k79q62r64o13k04
52965A72725j17k18r0L14O76Q42Q96P41J74n63q18k77O28J264J390J147P73M94
$$ plain form
53083 186154 186546 187511 188508 188959 188752 188261 187804 187206 186121 184707 183693 183677 184580 185897 187301 188735 190061
53066 190061 190892 190876 190064 188999 188472 189109 191054 194009 197565 201348 204885 207656 209506 210782 211774 212160
53050 212160 211413 209718 208078 207378 207586 207942 207653 206324 204091 201584 199563 198248 197101 195475 193409
53035 193409 191570 190501 190097 189825 189189 188005 186463 185096 184510 184894 185708 186070 185530 184439 183487 182970 182610
53018 182610 181972 180882 179435 177870 176444 175256 174175 173116 172340 172181 172450 172585 172514 172805 173673 174440 174535
53001 174535 174424 174795 175262 174853 173612 172634 172470 172603 172754 173543 175254 176957 177682 177687 177698 177551 176657 175341
52983 175341 174528 174280 173778 172818 172222 172474 172924 172843 172550 172874 173952 175107 175647 175368 174506 173542 172929 172725
52965 172725 172608 172390 172300 172614 173290 174132 175028 175769 175943 175380 174562 174285 174913 176177 177567 178714 179487 179981
52947A79981M19M31L18J64L59J085K003K496K163J093j26p62n68m2J28j32m18
52930A88592n45o96p88l86N44J311J334R73R66J360J541J167N67J82O8J40M14
52913A96744Q09R75O77J97K1K10L55J87n0j7J89K01k4j06J73M54K04n80j343j599
52893A97677j361r50n84l14j95l08o08q78r07o81l57q2J32L27M59M94M82M61L35
52874A93142M5j33J81Q48J153O03m75j402j902k013j604o22L59N44K7j94M71J423
52856A90451J777J469J013O15J22m14p37q33q43o45o1N98P09J43n74r69j068j006
52838A89747p01j28M29O89O78N30K69K8J27O59J199J293J075R80J023P78J38l64
52820A98449k25K78M04j17p48p96k23M30P12O58N30M85N57P21P56L72l22o77l08
$$ plain form
52947 179981 180400 180831 181149 181313 181672 182757 184760 187256 189419 190512 190386 189624 189056 189014 189142 189010 188592
52930 188592 188047 187351 186563 186177 186721 188032 189366 190339 191305 192665 194206 195373 195940 196122 196190 196330 196744
52913 196744 197553 198528 199205 199402 199423 199633 199988 200175 200125 200108 200297 200498 200474 200368 200541 200995 201199 200619 199276 197677
52893 197677 196316 195366 194782 194468 194273 193965 193357 192479 191572 190891 190534 190452 190584 190911 191370 191864 192346 192807 193142
52874 193142 193187 193054 193235 194083 195236 195839 195364 193962 192060 190047 188443 187821 188180 188724 188751 188557 189028 190451
52856 190451 192228 193697 194710 195325 195447 195033 194296 193463 192620 191975 191914 192512 193221 193364 192790 191821 190753 189747
52838 189747 189046 188918 189347 190036 190714 191244 191513 191541 191668 192327 193526 194819 195894 196874 197897 198675 198813 198449
52820 198449 198224 198502 198906 198789 198041 197245 197022 197452 198164 198822 199352 199837 200394 201115 201871 202243 201921 201244 200936
52801B00936K12n1j081j785j410m78lj99n20o81j045j949l054l623l224k080q74
52784A79091j90j08l18n76r02j265j379j024l55L49R73J345J023j46j359j423
52768A73736j00J522K217J764P08m70j474j905j528p72m17o28p97m98j44k84o53
52751A70277m39N39J446J399M70m98p74k86M84Q52M64l01o27k52J08k83j047j133
52733A70399k82O33Q16M32K8k93o88j087j307j289q93Q6J263J654Q47k03l75R1
52715A69832Q5n76q81k29O81Q50J61q37j658j997j638o99K67P87Q69P95P87R82
52697A67581J339J491J126N89N49R65R96L01l16m8P91J395J706K213K815K836
52681A86329K118J337J049J043Q48M50J87K45M84O30N03J45k50n55p86q61n71
$$ plain form
52801 200936 201148 201097 200016 198231 196821 196343 196340 196141 195621 194940 193895 191946 188892 185269 182045 179965 179091
52784 179091 178901 178793 178475 177899 176997 175732 174353 173329 172974 173323 174296 175641 176664 176518 175159 173736
52768 173736 173636 175158 177375 179139 179847 179377 177903 175998 174470 173698 173281 172653 171856 171358 171214 170930 170277
52751 170277 169838 170377 171823 173222 173692 173194 172420 172134 172618 173470 173934 173633 173006 172754 172862 172579 171532 170399
52733 170399 170117 170750 171566 171998 172026 171733 171045 169958 168651 167362 166469 166555 167818 169472 170319 170116 169741 169832
52715 169832 169917 169341 168460 168231 168912 169762 169923 169086 167428 165431 163793 163094 163361 164148 165017 165812 166599 167581
52697 167581 168920 170411 171537 172126 172675 173640 174636 174937 174621 174573 175364 176759 178465 180678 183493 186329
52681 186329 188447 189784 190833 191876 192724 193174 193361 193606 194090 194720 195223 195368 195118 194563 193777 192916 192345
52664A92345M2M80L30j50l43q6K20K08q3m70q10r69r10q76j116j410j244n01L50
52645A85007Q74J048R48M92k50q57j003q27n72j13O63J312J176L12m42m88j29
52628A87151J4j00j5L65N29R0o20r37p45n51p29r82p36J07J043J505J328P14l5
52609A87396o10o98k03N05P62K66m80o48o2O10P22M71N41J147J803K021J798J389
52591A96730R66O62O14P37O68J67n13q92p75m06k26m51q64r27l76M11P98O40L27
52572A97290J48L9K3L58J060J679J863J723J441R67L51q1k75o61j371j784j422
52555B01348q45r01j464j710j377r10m68J99Q58P84p7p46m63L92J030J309J480
52538A98439J448R35J18m54n53m19k99k11j04O9M37J040J565J477O20m34q32k82
$$ plain form
52664 192345 192387 192867 193197 193047 192704 192618 192838 193046 192963 192493 191683 190714 189804 188928 187812 186402 185158 184657 185007
52645 185007 185881 186929 187877 188369 188119 187262 186259 185432 184860 184747 185410 186722 187898 188210 187768 187280 187151
52628 187151 187165 187065 187050 187415 187944 188034 187414 186477 185732 185181 184452 183470 182734 182841 183884 185389 186717 187431 187396
52609 187396 186786 186088 185885 186390 187152 187418 186938 186290 186228 186838 187560 188031 188572 189719 191522 193543 195341 196730
52591 196730 197696 198358 198972 199709 200377 200544 200031 199139 198364 197958 197732 197281 196417 195490 195114 195525 196323 196963 197290
52572 197290 197438 197477 197500 197858 198918 200597 202460 204183 205624 206591 206942 206861 206586 205925 204554 202770 201348
52555 201348 200503 199602 198138 196428 195051 194141 193673 193872 194730 195514 195437 194691 194228 194620 195650 196959 198439
52538 198439 199887 200822 200940 200486 199933 199514 199215 199004 198900 198969 199406 200446 202011 203488 204108 203674 202842 202560
52520B02560O10R69N70p2m85p30r18p32%N98J06j331k362j938m49Q38J099M61
52502A98794m25r85j116j129j265j293q59j26L99O11Q28J012O87j29n85r4Q24
52485A95149J265J062O27J15n77j186j210n77L15J169J881K200J851J019K59j53
52469B03209l49l91j74J30R7l22o02l96o1j24m92n07K34J420K307K339J570O01
52451B08489N6P2L32N84R17J379J596J091j7r21q96j19M39J2j149k070k110j549
52433B06136j067q48n21J17O60O27J23l20m43m58n43n36l42k59n57r12o75K63
52415B00445J293J804J745J350P51R9l00k77J1M49J171K074K493J923Q93M29P54
52398B17107J071O85j66p87p78k17M55O29O8o75p88k74J4m23j138j534j664j790
$$ plain form
52520 202560 203170 204139 204709 204637 204152 203422 202504 201772 201772 202370 202476 201145 198783 196845 196396 197234 198333 198794
52502 198794 198369 197384 196268 195139 193874 192581 191722 191596 191995 192606 193434 194446 195133 195004 194419 194325 195149
52485 195149 196414 197476 198103 198218 197641 196455 195245 194668 194983 196152 198033 200233 202084 203103 203362 203209
52469 203209 202860 202469 202295 202425 202522 202200 201598 201202 201141 201017 200525 200018 200252 201672 203979 206318 207888 208489
52451 208489 208545 208617 208949 209533 210450 211829 213425 214516 214499 213578 212682 212563 213002 213014 211865 209795 207685 206136
52433 206136 205069 204221 203700 203817 204477 205104 205227 204907 204464 204006 203463 202927 202585 202326 201769 200857 200182 200445
52415 200445 201738 203542 205287 206637 207388 207487 207187 206910 206921 207370 208541 210615 213108 215031 215924 216353 217107
52398 217107 218178 218863 218697 217910 217132 216915 217370 217999 218067 217392 216604 216330 216344 215921 214783 213249 211585 209795
52380B09795j782j499j246j294j273p15J03M98L35R3O0J42L16O96J127J263J062
52363B07681P76M68M0k87p2O24J182J240J135J364K003K817L500L663K976J670
52347B30780N85M64J344K731L988M451L676J963L17n13p41r61j217j162r03j009
52331B43793j629k178k154j735j299p58J51J137J495J015L09M4K06L81N39J066
52315B40383K024K744K499J460P17J160K474L455L414K894K787L010K695J691
52301B73407J087J715K782K745J384R9J32J228K282K668K468J972J517J447J815
52286B98748K187K203K148K626L788N128N982N960N127M031L393L501L953M296
52272C53071M646N444O752Q124R119R685J0074J0620J1479J2456J3226J3792J4443
$$ plain form
52380 209795 208013 206514 205268 203974 202701 201986 202089 202587 202922 203015 203075 203217 203533 204229 205356 206619 207681
52363 207681 208457 208925 208965 208678 208606 209230 210412 211652 212787 214151 216154 218971 222471 226134 229110 230780
52347 230780 231365 231829 233173 235904 239892 244343 248019 249982 250299 249786 249045 248084 246867 245705 244802 243793
52331 243793 242164 239986 237832 236097 234798 234040 234191 235328 236823 237838 238147 238191 238397 238778 239317 240383
52315 240383 242407 245151 247650 249110 249827 250987 253461 256916 260330 263224 266011 269021 271716 273407
52301 273407 274494 276209 278991 281736 283120 283219 283351 284579 286861 289529 291997 293969 295486 296933 298748
52286 298748 300935 303138 305286 307912 311700 316828 322810 328770 333897 337928 341321 344822 348775 353071
52272 353071 357717 363161 369913 378037 387156 396841 406915 417535 429014 441470 454696 468488 482931
52259D82931J5129J5359J5007J4737J5119J5785J6054J6021J6282J6742J6653
52248F55819J5769J4709J4009J3540J3102J2880J2942J2792J1957J0651R491Q740
52236H06401Q106P193N968M827M192L888L104J300r55k592l315l647l797l338
52222H27335k268j503j692k226k068j071J58J304K429L334L649L589L887M879
52208H39736O175P275Q029Q416Q483Q603R286J0390J1064J0799J0114R818R967
52195I58155J0032R770R399Q948Q099O748N211L737K278R42J33j51o34j867l336
52180A017464m141m393n065o513p928q563q699q938r190r009q451p898p395o816
52166I14465o454o630o913o497n370m325l806l401k722k005j542j109m06L88Q84
$$ plain form
52259 482931 498060 513419 528426 543163 558282 574067 590121 606142 622424 639166 655819
52248 655819 671588 686297 700306 713846 726948 739828 752770 765562 777519 788170 797661 806401
52236 806401 814507 821700 827668 832495 836687 840575 843679 844979 844024 841432 838117 834470 830673 827335
52222 827335 825067 823564 821872 819646 817578 816507 816665 817969 820398 823732 827381 830970 834857 839736
52208 839736 845911 853186 861215 869631 878114 886717 896003 906393 917457 928256 938370 948188 958155
52195 958155 968187 977957 987356 996304 1004403 1011151 1016362 1020099 1022377 1023319 1023452 1023301 1022667 1020800 1017464
52180 1017464 1013323 1008930 1003865 997352 989424 980861 972162 963224 954034 945025 936574 928676 921281 914465
52166 914465 908011 901381 894468 887971 882601 878276 874470 871069 868347 866342 864800 863691 863285 863673 864557
52151H64557J031J116J470K329L556M394M002K592J520J804K953L701L595L215
52137I01835L069K956K494J786J279J224J455J660J743J908K333K817K914K348
52123I31821J171l95j979l110l631m042m909n943o241n575m740m362m114l576
52109H80375l079l044l034k351j225m88k80Q0R09J631J598Q31j71q42o98L26J595
52092H72133K267K177J858J637J339Q73N00L47K32K32P73J861K799L072L013L085
52076H98198L066K610K202K739M275N831O651P012P638Q730R884J0774J1581J2778
52062I93969J4530J6402J7719J8318J8715J9367K0011K0055J9450J8754J8349
52051A195639J8079J7693J7141J6244J4619J2352J0303R200Q686P790O196M431
$$ plain form
52151 864557 865588 866704 868174 870503 874059 878453 882455 885047 886567 888371 891324 895025 898620 901835
52137 901835 904904 907860 910354 912140 913419 914643 916098 917758 919501 921409 923742 926559 929473 931821
52123 931821 932992 932597 930618 927508 923877 919835 914926 908983 902742 897167 892427 888065 883951 880375
52109 880375 877296 874252 871218 868867 867642 867154 866874 866954 867863 869494 871092 871923 871752 870910 870212 870538 872133
52092 872133 874400 876577 878435 880072 881411 882284 882784 883131 883363 883595 884368 886229 889028 892100 895113 898198
52076 898198 901264 903874 906076 908815 913090 918921 925572 932584 940222 948952 958836 969610 981191 993969
52062 993969 1008499 1024901 1042620 1060938 1079653 1099020 1119031 1139086 1158536 1177290 1195639
52051 1195639 1213718 1231411 1248552 1264796 1279415 1291767 1302070 1311270 1319956 1327746 1333942 1338373
52039A338373K856J280l42j564k246l025m418n962o944p558q518r742j0447j0482
52025A271261j0634j1232j1472j0580q954p442o112m585l119k402k355j997o45
52012A189732J350L220M530N191N283N150N372O263P580Q859R792J0260J0242
51999A272824R864R325Q707Q008P309O658N809M488K893J501L35j133l133n179
51985A328276o831q371j0251j2271j3777j4517j4775j4896j5076j5545j6327j6893
51973A168746j6582j5528j4569j4176j3910j3299j2672j2638j3059j3248j3049
51962A016016j3040j3469j3577j2516j0627r257r306j0359j1356j1693j1448j0915
51950H78453j0348j0048j0258j0872j1527j2056j2642j3404j4136j4587j4768
$$ plain form
52039 1338373 1341229 1342509 1342167 1340603 1338357 1335332 1330914 1324952 1318008 1310450 1301932 1292190 1281743 1271261
52025 1271261 1260627 1249395 1237923 1227343 1218389 1210947 1204835 1200250 1197131 1194729 1192374 1190377 1189732
52012 1189732 1191082 1194302 1198832 1204023 1209306 1214456 1219828 1226091 1233671 1242530 1252322 1262582 1272824
51999 1272824 1282688 1292013 1300720 1308728 1316037 1322695 1328504 1332992 1335885 1337386 1337721 1336588 1333455 1328276
51985 1328276 1321445 1313074 1302823 1290552 1276775 1262258 1247483 1232587 1217511 1201966 1185639 1168746
51973 1168746 1152164 1136636 1122067 1107891 1093981 1080682 1068010 1055372 1042313 1029065 1016016
51962 1016016 1002976 989507 975930 963414 952787 943530 934224 923865 912509 900816 889368 878453
51950 878453 868105 858057 847799 836927 825400 813344 800702 787298 773162 758575 743807
51939G43807j4724j4231j3040j1427j0166r802j0095j0341j0220j0128j0602j1505
51927F07526j2093j1915j1402j1232j1339j1012j0017r075q949r495j0000j0104
51915D80893r891r312q140o482m847l569k607j912j490j049j64R45J481J276J329
51900D36461K472M014M527L726K690K222J922J173K72P1R06K458M273O025P418
51885D80630Q281Q719Q880Q729Q176P267N976M136J881j07j249j779k343l062
51871E34135l539l762m343n634p126q011q062p681p388p528q205r155r873j0067
51857D33761r927r773r564r021q107p119o364n961n882n915n607m545k839j164
51843C41973j24K97N44Q77J135J117Q49L33o67k213l663m092l469k829k983l408
$$ plain form
51939 743807 729083 714852 701812 690385 680219 670417 660322 649981 639761 629633 619031 607526
51927 607526 595433 583518 572116 560884 549545 538533 528516 519441 510492 500997 490997 480893
51915 480893 471002 461690 453550 447068 442221 438652 436045 434133 432643 431594 431430 432375 433856 435132 436461
51900 436461 438933 442947 447474 451200 453890 456112 458034 459207 459479 459550 460456 462914 467187 473212 480630
51885 480630 488911 497630 506510 515239 523415 530682 536658 540794 542675 542568 541319 539540 537197 534135
51871 534135 530596 526834 522491 516857 509731 501720 493658 485977 478589 471061 462856 453701 443828 433761
51857 433761 423834 414061 404497 395476 387369 380250 373886 367925 362043 356128 350521 345976 343137 341973
51843 341973 341849 342146 342690 343567 344702 345819 346668 347001 346334 344121 340458 336366 332897 330068 327085 323677
51827C23677l033j822q55q14j124r33k73K25L46M13O74J101J740K645L390L208
51811C28565J979O84M32J105J475P46m54r12m15J02r4o53q49o47n25o19o62o20
51793C28638p09p71l39N16R68M07p93j801k248k358k473k803l357l817l724l035
51777C02301k281j943j952j992j951j761j202k29P32J180J052N95L1m09m22j9
51761B91730L62L80J45k22q31j480j505p49p6j58l64K08J119J212N49L01P02O38
51743B91961l71j196q90j92k39o98l77Q56J931K100J598Q01k26j236j669j375
51727B90778r48j013j529j945j780r24L27J317J466Q38J42p4l8k87p77p90J50
51710B84913J609K733L203L339L354L026K342J859K032K462K412J847J280P62
$$ plain form
51827 323677 320644 318822 317967 317153 316029 315096 314823 315048 315394 315807 316481 317582 319322 321967 325357 328565
51811 328565 330544 331228 331660 332765 334240 334986 334532 333620 333205 333307 333213 332560 331711 331064 330539 329920 329258 328638
51793 328638 327929 327158 326819 327335 328303 328710 327917 326116 323868 321510 319037 316234 312877 309060 305336 302301
51777 302301 300020 298077 296125 294133 292182 290421 289219 288990 289722 290902 291954 292549 292580 292171 291749 291730
51761 291730 292092 292472 292617 292395 291564 290084 288579 287830 287754 287596 287232 287440 288559 289771 290320 290621 291323 291961
51743 291961 291590 290394 289504 289312 289073 288375 287998 288854 290785 292885 294483 295284 295058 293822 292153 290778
51727 290778 289830 288817 287288 285343 283563 282639 282966 284283 285749 286587 286729 286655 286617 286330 285553 284763 284913
51710 284913 286522 289255 292458 295797 299151 302177 304519 306378 308410 310872 313284 315131 316411 317173
51696C17173j95j600k668k917k876l238l814l963l603l206k947k537j803r76l32
51681B80498N8J85O3j36j16K95J073K032K835L111K829K412K261K297K187J861
51665C03745J519J290J165J155J195J041N55k2l79n99r69j412j528j177o69l71
51649C04539l90o42q93q13l17J73K03r6k14r0j78o61j111j177j050r95q41l77
51631B95070J05J41j91l16J3L23o9j302k720l385k795j266L73J372J439P57r7
51614B87452m25j5O08Q14P82J192K084K626K333J821J864K298K471K346K289K100
51598C12640J203j76r95p91l00l00n26l19K74P54J065J515J936J726P88k51r37
51581C17306j506k326l238l872m219m477m550m158l425k912k970l284l210k472
$$ plain form
51696 317173 316978 315378 312710 309793 306917 303679 299865 295902 292299 289093 286146 283609 281806 280830 280498
51681 280498 280556 280741 280804 280668 280552 280847 281920 283952 286787 289898 292727 295139 297400 299697 301884 303745
51665 303745 305264 306554 307719 308874 310069 311110 311665 311643 311264 310665 309696 308284 306756 305579 304910 304539
51649 304539 304149 303507 302614 301801 301484 301657 301860 301764 301550 301460 301282 300621 299510 298333 297283 296288 295447 295070
51631 295070 295175 295316 295125 294809 294822 295145 295076 293774 291054 287669 284874 283608 283981 285353 286792 287549 287452
51614 287452 287027 287012 287620 288434 289216 290408 292492 295118 297451 299272 301136 303434 305905 308251 310540 312640
51598 312640 313843 313667 312672 311881 311581 311281 310755 310436 310710 311464 312529 314044 315980 317706 318494 318243 317306
51581 317306 315800 313474 310236 306364 302145 297668 293118 288960 285535 282623 279653 276369 273159 270687
51567B70687j428p29p60j293j675j400o48j07k94r96j480j264n70p7k39q58j318
51550B55551j116k99N74R04N56Pj10M09J278K169K952L485L504L124L078L958
51534B80024N245N679M741L230K159J593J002L02o0J08M93P80R16Q39M82K13O86
51517C08432J974L219L617L459L738M772N737N684M754M059M409N445O053N561
51503C70913M387L586L916N253O816P879Q409Q982J0005J1040J1225J0293Q815
51490D71519P344N834M213K964K566K543J785k87l260o333q768r984r970r698
51476D50468j0336j1798j2768j2451j1516j0863j0277r092p597o759o775o808
51464C33428o229n341m711m376m027l572l220l110l091k756j850p71m07j164k268
$$ plain form
51567 270687 269259 268530 267770 266477 264802 263402 262754 262647 262353 261357 259877 258613 258043 257966 257727 256869 255551
51550 255551 254435 254136 254710 255614 256170 256177 256067 256476 257754 259923 262875 266360 269864 272988 276066 280024
51534 280024 285269 290948 295689 298919 301078 302671 303673 303975 303915 304023 304516 305296 306212 307051 307533 307746 308432
51517 308432 310406 313625 317242 320701 324439 329211 334948 340632 345386 349445 353854 359299 365352 370913
51503 370913 375300 378886 382802 388055 394871 402750 411159 420141 430146 441186 452411 462704 471519
51490 471519 478863 484697 488910 491874 494440 496983 498768 498481 495221 488888 480120 470136 460166 450468
51476 450468 440132 428334 415566 403115 391599 380736 370459 361367 353770 347011 340236 333428
51464 333428 327199 321858 317147 312771 308744 305172 301952 298842 295751 292995 291145 290374 289967 288803 286535
51449B86535k532j701o26j47l27q22j366j702j491o99K04O87O18K24j37j01L91
51432B77008Q50O66p9o40o93p70j317j837j580p23j47k93q30j376j886k290k371
51415B61692k149j869j531r17k59k52j119k117k375j900j317r66o83l11J9J12
51399B44058p9l99m82NR01J550J633J673K231K986L189K931L119M121N177N487
51383B78101N236N157N523N989O038N279L616J510k69j497k583l563l671k561
51369C02305j413j742l396m725m757m140l791l621l138k472k042j721j086k43
51355B64018K25Q6k56k61K89J226K091K346J866J191J024J465J985K122J967J892
51339B83276K035K181K071J689J229Q55O09N99J010J800K563L022L469M360N581
$$ plain form
51449 286535 284003 282302 281676 281529 281202 280380 279014 277312 275821 275122 275326 276013 276631 276855 276718 276617 277008
51432 277008 277858 278524 278445 277805 277112 276342 275025 273188 271608 270885 270738 270445 269615 268239 266353 264063 261692
51415 261692 259543 257674 256143 255226 254967 254715 253596 251479 249104 247204 245887 244921 244238 243927 243946 244058
51399 244058 243979 243580 243098 243103 244004 245554 247187 248860 251091 254077 257266 260197 263316 267437 272614 278101
51383 278101 283337 288494 294017 300006 306044 311323 314939 316449 316180 314683 312100 308537 304866 302305
51369 302305 300892 299150 295754 291029 286272 282132 278341 274720 271582 269110 267068 265347 264261 264018
51355 264018 264243 264329 264073 263812 264101 265327 267418 269764 271630 272821 273845 275310 277295 279417 281384 283276
51339 283276 285311 287492 289563 291252 292481 293336 293945 294544 295554 297354 299917 302939 306408 310768 316349
51324C16349O586P216P811Q515R085R556J0356J1474J2212J2304J2584J3795J5215
51311D53058J5314J3505J0509P210M068J492k20j550l511o352r154j1099j2441
51298D60829j3758j4834j4989j4178j3097j2263j1584j0855j0151r557q942q191
51286C18430p415o735o030n179m422m181m404m401l637k507j963k320k867k822
51272B59547k347k145k300k150j314l34%l87r34j267j475j639j527r81k71K36
51256B40712O10J160J745J748R80J71J15O03P86M38J98M23N44n4r94j408j033
51239B46744l73M3M9l05p38p13K6R48J265R77Q69J392K040K058J359N04Q0K94
51221B56519R80J721K136K117J824J413R57N11J01k61m18n5Q40J688J875J529
$$ plain form
51324 316349 322935 330151 337962 346477 355562 365118 375474 386948 399160 411464 424048 437843 453058
51311 453058 468372 481877 492386 499596 503664 505156 504936 503386 499875 493523 484369 473270 460829
51298 460829 447071 432237 417248 403070 389973 377710 366126 355271 345120 335563 326621 318430
51286 318430 311015 304280 298250 293071 288649 284468 280064 275663 272026 269519 267556 265236 262369 259547
51272 259547 257200 255055 252755 250605 249291 248957 248957 248570 247636 246369 244894 243255 241728 240747 240476 240712
51256 240712 241322 242482 244227 245975 246955 247126 247241 247844 248630 249068 249266 249689 250233 250179 249185 247777 246744
51239 246744 246371 246414 246463 246158 245420 244707 244733 245681 246946 247923 248792 250184 252224 254282 255641 256145 256225 256519
51221 256519 257499 259220 261356 263473 265297 266710 267667 268178 268279 268018 267600 267545 268385 270073 271948 273477
51205B73477J291J383J421J136O99K30m61j339j849j581q79m56n92j016j355j435
51189B68674j245q70m58j75k14p38j573k084j792j121r39j374j650j249n63n8
51173B52571M31J029J153L22q02j119o09k50m42m49L49J451J892J383M04m42p63
51156B56109m69J47N99P77J101J872K702K956K511J754J048N48M21O87R30O75
51140B74368Q3j80R1L45J24k88m44m15m57l96k8K26j52p34n66K89O23j80j163
51121B71146j151l60J30o6m19n30n05m55l87m75q04q67j29J009J481R37J03l07
51103B68351l11j58J53N41P60R08J394K123K335J737J019P96O68k5j040j512j068
51086B76671j00Q01J184Q16pn41m32k28n30r99q40K8R21J274J033L11o11j122
$$ plain form
51205 273477 274768 276151 277572 278708 279407 279637 279176 277837 275988 274407 273528 273072 272480 271464 270109 268674
51189 268674 267429 266559 266101 265926 265712 264974 263401 261317 259525 258404 257465 256091 254441 253192 252629 252571
51173 252571 253002 254031 255184 255506 254704 253585 252976 252726 252284 251835 252184 253635 255527 256910 257314 256872 256109
51156 256109 255640 255787 256386 257163 258264 260136 262838 265794 268305 270059 271107 271655 272076 272763 273693 274368
51140 274368 274451 274271 274362 274707 274831 274543 274099 273684 273227 272831 272803 273029 272877 272143 271577 271866 272489 272309 271146
51121 271146 269995 269635 269765 269699 269280 268750 268245 267790 267403 266928 266124 265257 265128 266137 267618 268555 268658 268351
51103 268351 268040 267882 268035 268576 269336 270244 271638 273761 276096 277833 278852 279648 280316 280291 279251 277739 276671
51086 276671 276571 277372 278556 279372 279365 278824 278392 278164 277634 276635 275795 275823 276744 278018 279051 279362 278751 277629
51068B77629p44J55P29P33O51Q60J227J563J888K082J896J390R52P68P42R00J358
51051B94779J851J859J333P77M42Q0l50l34M12J302J507R34L16M12J346K464K794
51034C11924J974P80L80R92J719J787J362Q87L83j65l09K72J055J229Q01N61J001
51017C26633J763K190K028J608J530K083K808K870K158J615K102L267M105M315
51003C61075M418M708M981N239N895O939P723P847P619P199O059L940J793R10
50989D36345J349K013K134J855J324J80j620l167l479k704j873j728k160k720
50975D25749l038k793j906r38p63j562k470k647k331k360k855k999k180p53N78
50960C96732J638K656L561L982L945M079M902O111O801O424N353M464M267M486
$$ plain form
51068 277629 276885 277040 277769 278502 279153 280013 281240 282803 284691 286773 288669 290059 291011 291779 292521 293421 294779
51051 294779 296630 298489 299822 300599 301041 301121 300771 300437 300849 302151 303658 304592 304908 305320 306666 309130 311924
51034 311924 313898 314678 315058 316050 317769 319556 320918 321805 322188 322023 321714 321986 323041 324270 325071 325632 326633
51017 326633 328396 330586 332614 334222 335752 337835 340643 343513 345671 347286 349388 352655 356760 361075
51003 361075 365493 370201 375182 380421 386316 393255 400978 408825 416444 423643 429702 433642 435435 436345
50989 436345 437694 439707 441841 443696 445020 445200 443580 440413 436934 434230 432357 430629 428469 425749
50975 425749 422711 419918 418012 417074 416311 414749 412279 409632 407301 404941 402086 399087 396907 396154 396732
50960 396732 398370 401026 404587 408569 412514 416593 421495 427606 434407 440831 446184 450648 454915 459401
50946D59401M511M080L396K761K331K219K488K902K998K654K341K591L364M229
50932E02266M934N490N864O091O602P872R673J1177J1996J2605J3537J4641J5498
50919F28246J6159J6860J7405J7417J7102J7195J8102J9584K1284K3107K5056
50908H37517K7115K9468L2428L5928L9386M2205M4244M5737M6972M8091M8926
50897A278017M9049M8195M6635M4790M2583L9633L6015L2186K8161K3551J8603
50886A687418J4380J1361Q673N436K203K09m39q24j697k862m089n638p658r780
50872A696693j1700j3652j5962j8530k1014k3238k5239k7179k9299l1720l4196
50861A444964l6338l8052l9435m0321m0343l9549l8442l7362l6183l4674l2752
$$ plain form
50946 459401 463912 467992 471388 474149 476480 478699 481187 484089 487087 489741 492082 494673 498037 502266
50932 502266 507200 512690 518554 524645 531247 539119 548792 559969 571965 584570 598107 612748 628246
50919 628246 644405 661265 678670 696087 713189 730384 748486 768070 789354 812461 837517
50908 837517 864632 894100 926528 962456 1001842 1044047 1088291 1134028 1181000 1229091 1278017
50897 1278017 1327066 1375261 1421896 1466686 1509269 1548902 1584917 1617103 1645264 1668815 1687418
50886 1687418 1701798 1713159 1721832 1727268 1729471 1729680 1729241 1728417 1726720 1723858 1719769 1714131 1706473 1696693
50872 1696693 1684993 1671341 1655379 1636849 1615835 1592597 1567358 1540179 1510880 1479160 1444964
50861 1444964 1408626 1370574 1331139 1290818 1250475 1210926 1172484 1135122 1098939 1064265 1031513
50850A031513l0377k7672k5191k3518k2498k1354j9694j7854j6230j4797j3495
50839G98833j2459j1592j0548r316q281p472o408m984l790l132k492j429l07N16
50825G17139J398K618L564L753L959N200O991P905P808Q138R704J1456J2143J2208
50811H13984J3101J5261J7670J9300K0238K1186K2422K3656K4737K6069K8104
50800A045728L0730L3446L6058L8776M1765M5110M9264N4739O1091O6957P1684
50789A575348P6266Q1900Q8161R3536R7448J00713J03968J06746J08280J08409
50779B540775J07259J04677J00438R4541Q6946P7408O5940N3199M0190K7763J6509
50768C315645O845j101p529j2738j6852j9725k0991k0388j8314j5921j4330j3880
$$ plain form
50850 1031513 1001136 973464 948273 924755 902257 880903 861209 843355 827125 812328 798833
50839 798833 786374 774782 764234 754918 746637 739165 732757 727773 723983 720851 718359 716930 716623 717139
50825 717139 718537 721155 724719 728472 732431 737631 744622 752527 760335 768473 778177 789633 801776 813984
50811 813984 827085 842346 860016 879316 899554 920740 943162 966818 991555 1017624 1045728
50800 1045728 1076458 1109904 1145962 1184738 1226503 1271613 1320877 1375616 1436707 1503664 1575348
50789 1575348 1651614 1733514 1821675 1915211 2012659 2113372 2217340 2324086 2432366 2540775
50779 2540775 2648034 2752711 2853149 2947690 3034636 3112044 3177984 3231183 3271373 3299136 3315645
50768 3315645 3322490 3321389 3313860 3301122 3284270 3264545 3243554 3223166 3204852 3188931 3174601 3160721
50756C160721j4447j6220j9664k4823l1216l8436m6282n4421o2420p0185p7718
$$ plain form
50756 3160721 3146274 3130054 3110390 3085567 3054351 3015915 2969633 2915212 2852792 2782607 2704889
$$ [...]
##END NTUPLES=NMR SPECTRUM
##END=
