
##TITLE=UV1126_M3-1004-1000_6274846_yQHDf1dNtN
##JCAMPDX= 6.0         $$ Bruker NMR JCAMP-DX V2.0
##DATA TYPE= NMR SPECTRUM
##DATA CLASS= NTUPLES
##ORIGIN= BRUKER
##OWNER= Administrator
$$ 1.72 TOPSPIN		Version 2.1
$$ 2012-06-02 21:53:38.140 -0500  Administrator@TOPSPIN
$$ Compression mode = diff/dup
##.OBSERVE FREQUENCY= 400.13188235
##.OBSERVE NUCLEUS= ^1H
##.ACQUISITION MODE= SIMULTANEOUS (DQD)
##.ACQUISITION SCHEME= undefined
##.AVERAGES= 8
##.DIGITISER RES= 22
##SPECTROMETER/DATA SYSTEM= spect
##.PULSE SEQUENCE= zg30
##.SOLVENT NAME= COFFEE_meoh
##.SHIFT REFERENCE= INTERNAL, COFFEE_meoh, 1, 14.98061
##AUDIT TRAIL= $$ (NUMBER, WHEN, WHO, WHERE, PROCESS, VERSION, WHAT)
$$ ##TITLE= Audit trail, TOPSPIN		Version 2.1
$$ ##JCAMPDX= 5.01
$$ ##ORIGIN= Bruker BioSpin GmbH
$$ ##OWNER= Administrator
$$ $$ C:\Bruker\TOPSPIN/data/COFFEE/nmr/UV1126_M3-1004-1000_6274846_yQHDf1dNtN/10/pdata/1/auditp.txt
$$ ##AUDIT TRAIL=  $$ (NUMBER, WHEN, WHO, WHERE, PROCESS, VERSION, WHAT)
(   1,<2012-06-02 21:53:30.281 -0500>,<Administrator>,<TOPSPIN>,<go>,<TOPSPIN 2.1>,
      <created by zg
	started at 2012-06-02 21:52:23.093 -0500,
	POWCHK enabled, PULCHK disabled,
       configuration hash MD5:
       D5 CA 7A 23 FE 6B EE E2 50 67 74 61 24 F7 5E 3B
       data hash MD5: 64K
       4B 56 7A 51 65 84 D2 D8 DD 6D D6 3C 47 A6 32 C9>)
(   2,<2012-06-02 21:53:33.906 -0500>,<Administrator>,<TOPSPIN>,<proc1d>,<TOPSPIN 2.1>,
      <Start of raw data processing
       efp LB = 0 FT_mod = 6 PKNL = 1 PHC0 = 0 PHC1 = 0 SI = 32K 
       data hash MD5: 32K
       0A 79 5A B0 71 34 F9 73 40 3B 49 35 F6 04 2D 7B>)
(   3,<2012-06-02 21:53:34.203 -0500>,<Administrator>,<TOPSPIN>,<proc1d>,<TOPSPIN 2.1>,
      <pk PHC0 = 213.4534 PHC1 = 0 
       data hash MD5: 32K
       08 82 DF 04 B1 A1 98 0A 64 23 A2 EA 5A A8 25 EC>)
(   4,<2012-06-02 21:53:34.421 -0500>,<Administrator>,<TOPSPIN>,<proc1d>,<TOPSPIN 2.1>,
      <abs ABSG = 1 
       data hash MD5: 32K
       1B 8C D9 AE 34 47 D9 6F 14 25 11 BE 5F 70 E7 F9>)
(   5,<2012-06-02 21:53:34.484 -0500>,<Administrator>,<TOPSPIN>,<proc1d>,<TOPSPIN 2.1>,
      <abs ABSG = 2 
       data hash MD5: 32K
       56 38 D4 69 22 76 4D 97 E2 7E 1E 15 68 04 1C BE>)
(   6,<2012-06-02 21:53:34.515 -0500>,<Administrator>,<TOPSPIN>,<proc1d>,<TOPSPIN 2.1>,
      <abs ABSG = 3 
       data hash MD5: 32K
       46 42 4D 1A 01 C8 9B 12 88 BC 92 19 E6 8F 74 CD>)
(   7,<2012-06-02 21:53:34.546 -0500>,<Administrator>,<TOPSPIN>,<proc1d>,<TOPSPIN 2.1>,
      <abs ABSG = 4 
       data hash MD5: 32K
       F3 54 6B D3 C7 D6 90 A6 E3 20 A4 8C D1 83 7E 6A>)
(   8,<2012-06-02 21:53:34.578 -0500>,<Administrator>,<TOPSPIN>,<proc1d>,<TOPSPIN 2.1>,
      <abs ABSG = 5 
       data hash MD5: 32K
       F9 C8 86 64 AD F1 7B 97 F4 DB D9 8E FE 8F 54 F5>)
$$ ##END=
$$ 
$$ $$ hash MD5
$$ $$ C3 8C 86 25 24 6B 76 83 5A EC D6 D1 AE DB 6F BA
##$RELAX= 
##$RELAX= 
##$RELAX= 
##$RELAX= 
##$RELAX= 
##$RELAX= 
##$RELAX= 
$$ Bruker specific parameters
$$ --------------------------
$$ [...]
150 150 150 150 150 150 150 150
##$TP07= 0
##$TPNAME0= <>
##$TPNAME1= <>
##$TPNAME2= <>
##$TPNAME3= <>
##$TPNAME4= <>
##$TPNAME5= <>
##$TPNAME6= <>
##$TPNAME7= <>
##$TPOAL= (0..7)
0.5 0.5 0.5 0.5 0.5 0.5 0.5 0.5
##$TPOFFS= (0..7)
0 0 0 0 0 0 0 0
##$TUNHIN= 0
##$TUNHOUT= 0
##$TUNXOUT= 0
##$USERA1= <user>
##$USERA2= <user>
##$USERA3= <user>
##$USERA4= <user>
##$USERA5= <user>
##$V9= 5
##$VALIST= <valist>
##$VCLIST= <CCCCCCCCCCCCCCC>
##$VD= 0
##$VDLIST= <DDDDDDDDDDDDDDD>
##$VPLIST= <PPPPPPPPPPPPPPP>
##$VTLIST= <TTTTTTTTTTTTTTT>
##$WBST= 2048
##$WBSW= 25
##$XGAIN= (0..3)
0 0 0 0
##$XL= 0
##$YL= 0
##$YMAX_a= 534991
##$YMIN_a= -638641
##$ZGOPTNS= <>
##$ZL1= 120
##$ZL2= 120
##$ZL3= 120
##$ZL4= 120
##$ABSF1= 14.98061
##$ABSF2= -5.57192
##$ABSG= 5
##$ABSL= 3
##$ALPHA= 0
##$AQORDER= 0
##$ASSFAC= 0
##$ASSFACI= 0
##$ASSFACX= 0
##$ASSWID= 0
##$AUNMP= <proc_prof1d_extract_pilot.lims>
##$AXLEFT= 0
##$AXNAME= <>
##$AXNUC= <1H>
##$AXRIGHT= 0
##$AXTYPE= 0
##$AXUNIT= <>
##$AZFE= 0.1
##$AZFW= 0.1
##$BCFW= 0
##$BC_mod= 0
##$BYTORDP= 0
##$COROFFS= 0
##$CY= 15
##$DATMOD= 1
##$DC= 0
##$DFILT= <>
##$DTYPP= 0
##$F1P= 0
##$F2P= 0
##$FCOR= 0.5
##$FTSIZE= 32768
##$FT_mod= 6
##$GAMMA= 0
##$GB= 0
##$INTBC= 1
##$INTSCL= 1
##$ISEN= 128
##$LB= 0
##$LEV0= 0
##$LPBIN= 0
##$MAXI= 10000
##$MC2= 0
##$MEAN= 0
##$ME_mod= 0
##$MI= 0
##$NCOEF= 0
##$NC_proc= -8
##$NLEV= 6
##$NOISF1= 0
##$NOISF2= 0
##$NSP= 0
##$NTH_PI= 0
##$NZP= 0
##$OFFSET= 14.98061
##$PC= 1
##$PHC0= 213.4534
##$PHC1= 0
##$PH_mod= 1
##$PKNL= yes
##$PPARMOD= 0
##$PPDIAG= 0
##$PPIPTYP= 0
##$PPMPNUM= 2147483647
##$PPRESOL= 1
##$PSCAL= 4
##$PSIGN= 0
##$PYNMP= <proc.py>
##$REVERSE= no
##$SF= 400.13
##$SI= 32768
##$SIGF1= 0
##$SIGF2= 0
##$SINO= 400
##$SIOLD= 32768
##$SPECTYP= <>
##$SREGLST= <1H.CDCl3>
##$SSB= 0
##$STSI= 32768
##$STSR= 0
##$SW_p= 8223.68421052632
##$SYMM= 0
##$S_DEV= 0
##$TDeff= 65536
##$TDoff= 0
##$TI= <>
##$TILT= no
##$TM1= 0
##$TM2= 0
##$TOPLEV= 0
##$USERP1= <user>
##$USERP2= <user>
##$USERP3= <user>
##$USERP4= <user>
##$USERP5= <user>
##$WDW= 1
##$XDIM= 32768
##$YMAX_p= 457488320
##$YMIN_p= -705098
##$CURPLOT= <Network HP LaserJet P1505>
##$CURPRIN= <$Network HP LaserJet P1505>
##$DFORMAT= <normdp>
##$LAYOUT= <+/1D_H.xwp>
##$LFORMAT= <normlp>
##$PFORMAT= <normpl>
##$SURQMSG= 1
$$ End of Bruker specific parameters
$$ ---------------------------------
##NTUPLES= NMR SPECTRUM
##VAR_NAME=  FREQUENCY,     SPECTRUM/REAL,   SPECTRUM/IMAG
##SYMBOL=    X,             R,               I
##VAR_TYPE=  INDEPENDENT,   DEPENDENT,       DEPENDENT
##VAR_FORM=  AFFN,          ASDF,            ASDF
##VAR_DIM=   32768,         32768,           32768
##UNITS=     HZ,            ARBITRARY UNITS, ARBITRARY UNITS
##FACTOR=    0.250966925370066, 1,           1
##FIRST=     8223.43324360095, -72276,       -102378
##LAST=      0,             82305,           -102974
##MIN=       0,             -705098,         0
##MAX=       8223.43324360095, 457488320,    0
$$ Real data points
##PAGE= N=1
##DATA TABLE= (X++(R..R)), XYDATA
$$ [...]
23806 -175971 163464 -211201 139403 -125371 67612 62793 -25304 9762 200035 143280 -118636
23794 181817 102220 -20558 -131859 -113392 -61845 -92156 134303 -233730 234436 -350599
23783 16070 125038 -230044 9771 -229835 405968 31004 -215934 199920 98017 -273397
23772 -222566 -53587 72909 183738 -42075 -16396 5962 -15430 -3272 -319589 -14983 49489
23760 -129517 58617 83244 -303174 139292 -252987 197036 436 -137529 199570 321104
23750 321104 87287 -124649 -102615 -33554 99585 118429 47217 100035 238410 -42259 -84168
23739 -84168 -175688 -28617 -199726 37904 32768 13385 -8625 121489 -162328 576 -227440 -95679
23726 -160097 -182740 -276817 -70001 136733 -98156 -50401 183277 55416 -184473 147121 167414
23715 167414 47225 -47734 475659 -59952 -163124 293794 348448 -82419 68687 -206473 -114151
23704 -114151 -346701 -6892 -105299 137623 -190398 -98244 86691 -154800 -261222 -82034 -45973
23693 -45973 98015 -59481 -134274 -197901 121167 -8654 -172667 167914 -34661 34646 -42955
23681 -283154 -8950 283414 122772 -212318 458296 -169856 108355 213715 94930 -251890
23670 -24509 238771 -148373 252195 299829 -195746 -320737 153170 115314 -61826 242324
23659 90720 -107093 141735 -262090 140161 -5472 -84785 -143776 34823 98693 -78035 -18859
23647 -61553 266699 -72476 224466 -519667 33435 7683 172223 38926 9990 48557 254122
23636 254122 -48115 353727 -18109 -560322 -36143 -36002 -331301 -71986 4043 -18351 50518
23624 -97499 -208493 212541 -239298 417383 -167855 347643 36179 -135228 -144784 -293668
23614 -293668 -266 -147386 -69900 -26676 289146 -78034 -43523 -222847 -130772 -26411 -99482
23603 -99482 -297253 -208739 82407 256084 11900 101410 -105471 161489 -234331 232735
23592 -23398 144541 -102029 114382 344847 154373 -137892 62008 81860 238905 -118737
23581 127142 -73186 95903 -136894 188314 235319 156677 11530 -111195 36226 23585 -316325
23569 271811 23770 199702 4350 -64892 72170 -92712 98788 158512 321736 -10265 243491
23557 -179393 -67453 -125279 129925 -259344 121960 -40173 -385910 -216732 -108476 119508
23546 -341580 52507 -30166 -90785 -460399 158001 136256 174526 59651 157023 -77918 17809
23534 -52432 -133793 -40120 -17975 275444 17503 -165746 33234 -100258 -173671 -309104 153319
23522 -258290 184356 42759 -132607 -41065 141910 -273417 905 -17888 101005 33440 -68560
23510 137294 -54637 -40676 7892 72964 -157757 -446134 133316 -30583 20580 -172596 -41087
23498 218804 160310 133691 -294105 47781 81964 -84685 -73049 -15294 -256969 -262528 -199235
23487 -199235 61583 -184605 -11002 -44395 -148490 143844 23239 -190521 -33055 212360
23476 -199259 129653 53726 -59645 -56724 -167017 -32940 58318 132610 -130610 41587 -29439
23464 267985 144678 15768 85981 49112 -76174 -151570 -140159 -104236 -117856 -24358 -251623
23453 -251623 26615 -35257 -44049 185457 54389 189148 -234270 -45227 -265323 170073 151630
23442 151630 60783 16225 311237 25883 -171177 42686 64040 -102275 236057 160562 -97897
23430 -171796 123211 -69015 -27740 -231536 -30048 -27125 -70733 -40468 -194756 -153572 -430186
23419 -430186 126372 68858 39766 83540 174240 55228 23592 104769 -170344 -115807 6944
23407 285243 -143154 -188817 166197 123281 409338 -36386 111717 79759 64319 -372946
23396 473763 -88278 198765 273575 -44734 94393 80095 -45493 55355 139566 -1943 -148446
23385 -148446 69511 -68843 61566 135698 -53622 -152649 51419 289761 -35118 -363700 -161123
23373 219855 -297846 -131594 -123750 -153506 -175620 -501198 40341 -237938 -172005 -78890 186744
23361 -77232 88289 41619 -97139 -13712 -141897 94059 -270940 -90649 81123 -130260 -163618
23350 -163618 93635 -100540 260647 -403641 -239393 -58254 266113 -181888 -212089 -90239
23339 -68612 -246312 -337842 153219 -239441 -59489 -164316 101238 79161 -57082 220827
23328 -331802 -34213 230314 -10426 -39069 175819 -101586 154774 -213612 -17091 74241
23317 -202982 -107622 -72087 15540 -21939 270122 280447 -136777 -245510 119871 -265203
23306 95564 146077 -47433 -37936 191534 239452 28233 -38535 -165233 443043 -16104 -187697
23295 -187697 -90811 165422 82960 -210900 139788 -56964 234618 37004 -88874 -102544 -920
23283 -92350 -277066 10297 -200566 287393 -305108 41048 101046 -227864 -163960 -7362 198083
23271 -3554 -74956 -11218 -101488 221540 -12015 8656 -281815 8738 144693 -29565 -51863 204988
23258 15243 -593789 -35434 169284 323900 -48305 -25959 -208617 138925 -124522 67870
23247 207522 219164 -317818 123130 -105350 -247050 -68394 -91704 -168962 59440 34704 88043
23236 88043 238721 299288 -91817 66368 -252683 -58385 -205771 -381138 -211554 169768
23225 35193 -325283 -192251 117970 51842 26700 237092 -255899 -132258 -299577 156952
23214 -1073 -26186 -130596 -164943 -211915 -107861 -213630 -50760 -47545 26587 18907 -455684
23202 41566 -67150 -78170 224456 -452435 -213463 -276837 67128 -341 -263557 -88784 323229
23190 12911 -165591 676 115951 -234463 -61185 -318289 110864 -21232 33633 -109885 211424
23178 -92521 -107590 232532 -197975 -179511 38068 -132306 -51614 -222713 -280120 -147672 151824
23166 73475 -21918 -194804 -173002 212972 53319 -95908 -82632 -9327 92266 -49204 -191481
23155 -191481 250974 -135851 -123849 -108788 -21726 -14974 7289 -114784 58167 -272580 84544
23143 113950 129642 32510 -50126 -135318 1161 130345 174629 215965 -226182 89116 -159241
23131 -102664 -294980 269792 140207 373921 -374006 -74086 460297 -108749 -31216 -217228
23121 -217228 76233 103185 337400 48319 -186596 180702 302008 37995 123157 -212992
23110 -226667 -200718 102414 21679 -95271 71584 -137427 -195083 80591 -353757 -121197 66341
23098 190950 -155609 -32612 -37715 -22601 -115674 -30507 270910 15087 -180509 107675 20739
23086 182353 -283764 268039 112622 -270357 -85460 67844 72014 -260364 -14790 -19511 137162
23074 -50031 111888 -121616 -37292 31656 109996 163581 -36130 -80008 -19192 295445 -82174
23062 -154233 -64732 -230592 184965 -216335 28625 153609 45233 -44604 -130406 79281 301963
23051 301963 -66913 -35389 -164130 -15299 47418 66348 62597 120400 38723 21642 -178302
23039 16977 92435 -103283 -157329 47803 -206409 -20030 1760 244020 549 -299992 47048
23027 24326 -29374 -105464 42950 124058 12377 93011 114004 -211611 -270062 -105565 13407
23015 -276218 -59319 -186626 177739 207132 94910 -170145 -240109 269021 147100 -65920
23004 -30113 83031 68694 137846 154440 -69827 -273073 77099 227722 -71090 21067 239273
22993 239273 93798 -74041 307076 -103913 -266270 -66701 -152497 -52340 -67006 -197726 173684
22981 -382769 -75492 -2352 261933 -428979 -89416 81318 -69837 -222185 -41209 -103662 -97385
22970 -97385 17662 220032 -57812 -159 -93246 -38711 7319 171276 -312382 -190139 -139299
22959 -139299 -259575 197965 -125358 -89615 134720 141355 269626 -40140 -196534 325273
22948 46952 -307001 79275 103549 -150681 -204242 -171122 -229918 -101634 -149207 -113136 113652
22936 -36342 24800 121008 73479 -216289 -158109 -50731 -330191 232261 -185133 105291 -122696
22924 26766 126566 2488 -9427 67489 308320 70137 -217872 -63947 -120298 -14586 44316 -424875
22911 5802 227770 92817 180954 40094 21896 -49336 -134145 -99537 -100945 -148620 147575 194659
22899 194659 -460549 180958 110751 -127556 -5476 -47151 -9583 336584 -451713 -16156 -21989
22888 -21989 -217166 168511 108378 -215947 -108882 -44309 -58736 -355537 -160369 18411
22877 -232287 -235647 295744 -247630 -137480 348213 -481536 -126169 -220875 82582 25926
22866 -51238 -147449 -44473 -100635 -31341 34351 434871 283064 190420 -27940 75048 -167426
22854 -274000 -46710 -130544 -95324 -217993 -193678 -63895 216530 -91202 3090 -191282 121112
22842 -20181 -113055 128735 -42892 -349675 44460 -77762 31244 -173071 -99686 -106099 -37300
22830 -340027 -121835 -180922 -422612 -197815 -107511 60039 -239107 -306755 -123716 -130500 -264893
22819 -264893 -142675 -377204 -239094 85079 74690 -138047 142400 36386 283127 -10902
22808 -102943 -80923 103150 80083 -107196 -178647 -106330 111646 -50487 35941 113 214800
22797 214800 -138150 -39430 -33822 73595 100842 120710 -236654 -204037 -62423 83460 265595
22786 265595 -91521 -95341 -51826 372516 -41479 -180317 -3342 24878 -228159 257275 52196
22774 -175545 -131445 386878 5014 40880 30722 233230 -2242 118913 -213990 184159 202783
22763 202783 -323275 -208490 96024 -105928 19833 -188892 440296 -21902 -153870 -182964
22753 -182964 -83649 -146297 -361832 -114362 76405 -239385 382978 -62260 137564 173252
22743 173252 -253126 -41878 -157690 -112190 352234 342389 -316687 -164671 -183128 -125341 18481
22731 50710 -303163 22367 -149406 -96388 -96764 -305890 -215020 54290 23445 -174367 -351222
22720 -351222 105964 -57984 -71797 255078 57246 -27662 -361146 23834 231843 -6390 131236
22708 -210166 -26724 -41060 81978 -213033 -139723 -69641 125608 98822 55587 -27578 173319
22696 312918 55241 -16415 75225 -97145 -155767 -192806 129394 -87684 278854 359079 237402
22685 237402 135143 -32205 -230346 -214864 -424219 -105160 -60251 -98529 277742 -61424
22674 -41106 53305 -108819 313380 -36779 -208952 274074 262386 -79355 -343867 95253 -332572
22662 -336931 -207015 -54651 -451915 278187 -239540 -77143 -127186 -173280 -105324 83292 -318108
22650 -271032 68191 18820 280040 34798 -116349 -181733 -387394 48937 -106726 -101788 -92293
22639 -92293 -104115 -109499 -176876 25821 182971 216494 -97235 71962 -30048 -371814 8255 269414
22627 269414 -35563 -172908 -117251 141364 -16452 32305 -47885 -290574 -60744 -88277 116131
22615 -85622 31171 252803 -87219 228481 -166472 28740 -278178 198507 161128 -95074 -106495
22604 -106495 49842 -129604 43680 -54860 136298 -193647 -73214 -360922 -91684 -185874 -178760
22593 -178760 -15066 40874 -211099 15252 -14480 -54838 45215 -227543 122633 131990 -176813
22581 -19188 -51523 76798 281445 -265231 230993 47702 122091 122211 -269450 -304368 -104594
22569 -96428 -186278 38385 -143275 -129556 -215955 80469 1132 75066 -57140 -219589 256179
22557 353576 45212 32935 206324 -248101 -241870 -144801 108568 -9853 36798 -151389 -259894
22546 -259894 53412 136683 -189567 242878 68479 28122 152042 -92059 -420471 -164500
22535 -369980 -145212 -36335 -127501 -155469 77524 3633 -278663 100155 57427 101215 19772
22523 -47028 190746 38220 -102520 203314 107064 -137650 -12992 129006 -29852 100910
22512 -182640 124247 -252667 82952 -123944 -226868 -172641 85167 -183532 218930 -127595
22501 -98872 -338147 37203 98608 -36855 237771 -13956 47938 148718 156482 -170935 105852
22489 157329 -99137 -78654 -134909 124605 47317 -66592 53088 78714 235120 -467006 -54692
22477 103593 -253001 -31311 -236461 -141463 23231 -26028 -159604 173314 -86598 154244
22466 37053 -47489 32071 136594 -219620 -31550 27465 78603 107111 181097 -12835 -254066
22455 -254066 161225 -59518 -41375 87604 86257 165441 -102728 -3435 -132735 -42433 -92948
22444 -92948 -216467 118774 -163969 -217486 -187862 -114196 -193837 153242 16784 87853 159347
22433 159347 -147704 107090 -225865 -47334 76574 -407235 -4208 -279728 51003 -171455
22422 109714 -85063 426479 81713 89364 126086 -243864 -56930 -19010 -142783 67253 83388
22411 83388 143427 -58585 -147773 -23749 138029 -74050 89250 153325 124667 -168091 -134180
22400 -134180 6791 53880 -86379 -370609 -237535 17401 -76421 -24281 84966 19091 -82800
22388 328465 -21936 43461 106895 143543 17507 -210506 54195 -22656 73480 -63995 -63998 -273800
22376 -273800 -33791 -149086 -345411 227696 106162 82863 -75497 -79219 -107826 197135 -242126
22364 -107481 -75260 -52990 -335649 94298 20085 -15406 -2505 34749 -126533 -235706 110628
22352 -64558 74102 -17059 -88887 -13287 26653 -160209 -73966 -91080 18451 -78216 -89373
22341 -89373 -427622 -18302 -21974 -143571 -434250 -24009 -172979 -29044 26741 16235 -464282
22329 -279332 6500 141374 50484 -178942 -145015 42625 -130419 -235303 -111081 -11011 -151478
22318 -151478 -68073 -65337 -236888 36642 153312 -159587 -89102 -37511 -149219 203354 -227426
22306 29117 301695 -368831 60486 -48612 292725 -184547 164560 -206010 -96391 276982
22295 -229289 43252 -191423 -90451 -266076 -216679 -278640 159708 19523 -163863 108893
22284 -139858 -169925 254356 182312 47876 -78677 56961 43438 124370 45977 151236 -180576
22272 -2324 13896 -300754 -61231 298736 -73711 12947 150828 28717 38759 30825 353816
22261 353816 -69990 82552 -190894 -367964 25875 3472 175763 -95837 -236704 -125325 143807
22249 24131 -86803 -348316 -27623 -32646 -228540 122603 -202261 108442 114162 90182 -108827
22237 75763 65454 -20866 149758 -270272 35834 -289210 115890 150889 -411192 98176 -220687
22225 124833 -188832 -227892 -281307 152179 33033 76887 -299070 65275 59198 61727 54715
22214 54715 406246 -157459 137507 31764 -103076 244065 -149254 -66770 -141658 -32863
22203 -287287 165075 7835 -190039 -284231 -94242 74182 48392 -128104 136026 -108423 18538
22191 -187653 220530 128268 -276899 -73152 -82433 26102 -261040 126057 -36913 129102 -281802
22179 12086 -26174 -219082 -42509 34616 96147 146963 -41127 155360 31889 -122915 111000
22167 -169983 -69045 -195012 29457 156043 -185763 184530 134234 -93565 -188336 -69211 123417
22155 -113053 -71104 211167 -287417 -357399 304993 -146542 -186808 -88960 471651 -109321
22144 -209461 -141600 -140280 -43053 -143920 40904 -167246 -208172 63487 -115387 501914 -119965
22132 -319212 67943 -195586 -212317 -392351 -172289 -28052 2760 -355183 197934 38747 -16120
22120 15414 166892 -150582 -15502 -100021 48453 -39090 -26166 41633 -119072 -84377 94163
22108 -174062 138314 96269 -258059 -18352 -96578 213531 -28612 91839 108188 -156991 31851
22096 110875 141735 22731 -156065 -136486 63789 -7115 -111635 -29829 -315670 -298165 -36215
22084 -156259 13256 -21690 -500124 -287914 85224 122807 33569 -172217 42994 -172980 -19976
22072 318841 -15091 28791 178669 -120633 -97056 102007 64497 37016 294578 31796 -133782
22060 -89057 -37868 -104563 70298 -220321 -223849 103161 -72979 -292969 -45902 -301184 64580
22048 264312 121392 -132347 20697 -77926 -180430 -350026 -113488 -60482 -67607 -214786
22038 -214786 -244350 62241 -86540 -183787 157263 -378472 1492 -56373 54228 171764 -220670
22026 6398 127002 -59212 196001 136463 66135 -54511 23589 11002 -51290 107667 -288935
22014 264486 -220826 3781 -224616 37780 -188962 247097 -32471 104231 129715 -190561
22003 -98340 194556 -35143 271249 140630 48366 -427347 -86184 -90769 78604 -294068 -224196
21992 -224196 -113285 246668 -108812 -309110 -143860 232975 10066 -173706 151300 335676
21982 335676 -214934 -13751 30405 -78507 40371 65350 45634 184638 -302723 -18871 -373861
21971 -373861 -127897 -174212 2836 -204106 37042 139839 92740 -524244 -58967 -255226 321814
21959 -395750 255525 -198950 -154545 -150679 199130 -341520 -29348 -40580 214795 -379833
21948 -190109 -359323 116428 -375028 101370 -85245 113460 -103083 -258235 -414731 62810
21937 -213861 47069 302727 -239750 37335 343450 -134602 -290813 140093 -24195 -261740
21927 -261740 -155237 231358 -217626 13535 25981 -109275 -365473 -295854 127692 -12731
21916 -283913 -353721 9558 74355 -83642 251253 -27318 50962 -247812 -58614 276489 -102355
21904 -65245 201654 -117522 -132145 74742 -543 -294316 -83088 156106 247749 -152676 -67175
21892 -15963 -237820 355158 -23982 -80391 -275844 -184207 -76261 -47454 262139 -189875 -284084
21881 -284084 254233 30413 110797 -157924 77585 166721 147461 60904 47928 -50558 -73439
21870 -73439 -40055 -197127 22335 -140879 -302495 233912 171135 365839 -24512 141834
21859 -412377 39087 -171691 29832 241182 129956 -86297 -26932 56883 -187918 126280
21848 229252 246371 7080 20322 29288 -158718 26978 138314 -251518 -60082 197842 130599
21837 130599 -175049 212491 149636 106596 -183890 -141372 -71546 169481 19386 -301460
21826 -128091 -5962 167263 -9170 -68460 105522 200260 -9744 -119463 -129386 -171147 14039 -62486
21813 28639 32426 -274857 245119 77713 -340463 -13492 -275249 156232 -179410 70489 -76637
21801 -259079 -69844 -9524 -479614 164936 96209 56130 28298 263227 -170264 20048 -227923
21789 61877 37386 7610 -130694 24629 -92850 -8970 -308337 -362094 -345569 162524 273210
21778 273210 -206171 -251638 140720 -189630 -159306 -7429 -14329 189635 65944 -2091 77932
21766 86473 649 -304127 128485 -304711 -173801 205500 301184 -203854 150125 -368168
21755 -314155 233006 32556 -476437 -24519 -169450 -41190 -70716 -15163 -172659 -67694 76106
21743 404367 57161 -173196 -72248 96227 81178 -299271 263834 -79370 -124971 -165518 -132370
21732 -132370 60428 98224 -285381 -146674 -33140 182453 -15889 88734 -286403 14033 -63644
21720 -141673 192223 -27007 -39149 -281771 223542 101572 -81676 -280710 -59744 -195449
21710 -195449 185837 -20423 -417548 52224 71701 -49500 -166584 76455 -75493 -179788 157067
21698 -54516 -36043 -91535 -45426 -66658 -314002 46199 51367 -248858 205751 119583 -120965
21686 -134884 -17708 -364588 -75277 45243 -172547 141882 103011 178740 292867 -271819
21675 -27951 130311 259073 -148295 -41390 48628 -188469 -157061 274622 82954 -170344
21664 487042 -106765 145833 -57104 121903 -127355 89765 304631 -19866 -277781 -291374
21654 -291374 22314 -207095 -84736 109312 63349 24698 198508 78835 -139358 93346 -144042
21642 195401 -216141 -14384 -161098 -301427 17366 51581 117177 -122215 227147 178728
21632 178728 43049 18479 -109240 19951 -55158 204339 98971 -130691 18311 -260603 -30583
21620 -146566 282703 106922 -271826 -153135 -100279 127856 -213435 106887 -245223 -136111
21610 -136111 341 -7306 4566 87100 -97211 57584 -412460 311881 -98847 -62878 -117714 -114592
21598 -114592 -52729 26466 -139886 182258 -205400 220764 -34382 96191 -378017 111862
21587 -47347 -102885 -261063 25537 7617 66679 150384 -165738 -803 -151093 -26077 157410
21575 23737 -79192 -336371 -46412 -195165 406609 34467 -108796 -236428 -190580 -188777 -198087
21564 -198087 10982 -273178 -363807 -174964 23800 319749 -305287 392888 -138815 79303
21553 -329962 -300181 -215834 -724 56658 -327548 -42973 -429115 -150099 -77544 -414399 -30972
21541 285929 -49366 112792 -156703 69898 25645 -25708 -228419 34266 -15466 -38281 60341
21529 -260878 131766 -71237 203559 180841 -121250 8828 -89557 -125882 -224596 -185690 164873
21517 310274 74543 -31086 75081 -111955 -160908 -268301 -66696 -244546 -45447 59684 -365652
21505 -314073 195873 -122716 142369 -251114 14421 113169 -297219 -343510 -12042 72181
21494 -65568 -246919 -127699 83242 339342 -174032 -9798 134601 -240588 -253339 45061 -129728
21482 222719 160648 163517 -98749 -387848 259768 -50028 83635 48272 -281721 -97095 125041
21470 241720 -55196 -99482 -216307 -245527 -58389 215904 -295216 40411 24528 -257915 -491443
21459 -491443 197164 -164988 -190187 18210 -85938 -280088 -357896 -96804 141788 -180370
21448 -252950 -241054 158674 125408 -197482 -230973 267656 -200086 340106 -50141 12588
21437 -297931 37798 101693 154465 27361 -28743 -29006 93358 -92151 -264393 -304277 -17706 254282
21424 50372 180540 150254 102344 146836 291079 618495 138005 173665 -15607 -17052 213617
21412 -142540 257113 104054 -308398 -40359 -70447 -175635 236087 -230721 -232001 -10034
21401 -45902 42305 71718 -232472 -334057 258537 -348735 131892 -407505 -217080 -153882
21391 -153882 62006 -79434 6055 -147474 63895 42395 51411 -33638 20981 -149871 -5586 -161383
21379 -161383 27105 239023 -154148 -202786 -3414 -55070 -111372 -19359 -101874 -120625 82360
21367 -194304 -214501 -57617 -128370 5888 374869 -40880 -99710 1804 98960 -157800 340351
21355 -219552 177096 -93175 -256307 -19649 356187 -151970 -469681 150674 -134277 -292891
21345 -292891 -5512 -215276 -270689 -271293 139533 382773 143432 277032 -146393 -211705 396218
21333 19054 -17196 -93130 -85975 -372346 -2093 -11548 87294 -186816 -31568 229327 -192582
21321 274121 -40724 -72597 138232 -7533 -70011 -208051 -20180 40035 -240351 110908 330850
21310 330850 55865 1563 -22270 187454 -310727 -102292 133548 116187 152768 -29367 1426
21298 -41187 -129621 98946 80640 13107 212676 114000 -60028 -153246 -122103 -240430 14956
21286 -116614 -5499 117455 156949 -167403 -201463 -241486 104330 -15882 -197124 -8873 -95043
21275 -95043 58390 -29119 -43041 -183656 422437 -273825 -94804 113496 -32012 60150 189654
21264 189654 -67355 -4369 -228343 50156 -310482 -50589 52564 -105890 -280309 144733 -36005
21252 -25276 -195839 239293 212550 47039 -141897 70755 78621 142486 -178155 6862 -323821
21240 123989 91014 114906 76192 -126109 168768 -362524 -236490 27269 102920 -198454
21229 82438 4418 -102685 -77885 -24882 -114555 -201940 145413 -67839 -102199 -208230 -124354
21218 -124354 -239158 -60790 -158889 -79717 -44272 134046 -58634 254926 -104213 -98337 9549
21206 -90272 228029 348958 -154195 105235 -499868 1989 -243262 69979 -157208 178746
21195 -107463 -116353 -98096 -241738 -30250 130131 62001 -57504 -179242 -136863 152681 -213122
21183 -203284 -187830 57805 -195886 34245 40204 15216 247191 284097 131396 157928 -60082
21171 -247460 -344226 -106573 -230850 127052 158372 -45717 -314985 -158819 -303854 11745
21160 40364 -131701 -182999 -147669 -325715 239647 -43582 -215682 105130 220955 -55526
21149 -47944 -67851 61994 -544399 -157818 -124206 -80989 -154780 -108071 86741 14487 135211
21138 135211 -69168 -27891 178236 85504 148713 -96961 -143876 -9676 249558 -319840 -619853
21127 -619853 -36356 -152797 -36642 -208614 -135572 -26795 41000 -31560 178860 24549 146595
21116 146595 -221640 -161616 -49584 51084 44889 -65084 120283 -146083 -252928 -178546 140627
21104 -260149 -299679 -109988 130573 253150 -214880 -198851 -471211 -519081 -165267 139770
21093 -82325 -72030 277915 188562 -71955 -118996 -32009 -266342 151166 -17939 128271 -407212
21081 -65664 -253812 288218 -288297 -174107 -221092 66260 147901 14711 -303088 178847
21070 126472 -110714 -63969 -20051 -24203 140497 -116359 18472 53097 232348 -215079 92141
21058 -126829 -33503 -5952 218413 -279015 -166993 56152 -200610 -113497 170068 -248074
21047 -292142 -98593 -226130 211200 74479 -113262 99525 454260 304433 -154263 -22440
21036 -167713 -85195 -86823 -188493 155153 -129793 75387 -121892 93438 -360339 -35662 -41272
21025 -41272 96148 -6292 -63026 -281556 -216722 -12409 -218978 -197872 -197589 -204307 238697 -46856
21012 -307223 -282504 -48080 61380 -260032 -273842 31941 29452 -116981 -150501 100753 79041
21001 79041 -43845 -47470 65632 88897 70123 -70731 -88997 -16449 -216219 -155623 200837
20989 139663 116200 -27580 -27959 113365 554692 198680 -35321 -416526 -223986 1741 -111551
20977 -56941 86655 282557 -141208 -77192 61408 -273496 30298 107943 -61020 -136492 -290836
20966 -290836 -275200 -213565 -262220 34408 -8606 -122832 173128 -127023 -217470 -50742 -169688
20955 -169688 -19729 45255 110449 145516 260083 424019 22278 176226 -109744 -276152
20945 -276152 -59539 -60559 -23006 -238358 92366 -242479 16403 16056 -95003 -97734 -247605 -20679
20932 -221767 65427 -173478 10168 35297 224338 -94621 484588 85703 193551 129843 -224297
20920 194556 -245919 105043 -95525 -93225 -455041 13270 -51468 173884 -40547 -196878 -119208
20909 -119208 18203 104841 -92460 -146674 -106906 -191320 -8628 195649 -172542 -78850 62499
20897 -181086 -372053 -55713 -361940 400339 -125021 102367 -245756 53027 108379 -201001
20886 -248919 -105590 183375 -10008 79376 205354 29155 -385439 23743 -307747 52191
20875 -142908 -195551 66093 -95765 -62296 276650 -5065 33102 -90435 -94255 48503 -137725
20863 -157508 186106 20074 -187071 93244 -35228 -145120 -142970 111232 78546 -5587 -44039
20852 -44039 -340711 -83683 -153926 -19553 24514 151053 -49967 -65036 -295244 38771 43820
20841 43820 -173920 -20894 -72596 -56693 -134283 -141961 -193821 -113260 -135640 -253038 109077
20829 48194 -183288 -72099 -129112 -176799 -88610 29175 15533 -162624 -123054 277186 99610
20817 158115 -161860 -196701 -177269 -212186 102361 38654 52903 147067 45493 185746 -141011
20805 -445345 -131810 334561 70079 -178252 -227341 -40008 37169 35511 -366560 54607 -122785
20793 -29783 -213411 -443276 -116281 -234672 -283235 -143364 176422 -124316 -162183 27912
20782 98735 -1786 -276414 -72028 -207016 -151421 -104131 121214 -219756 -429376 -49338 170459
20770 39749 134422 -61468 235467 -28230 243999 258512 -11267 -147237 -24282 -167925 -50632
20758 -368404 -41388 -309696 110188 -41936 -177898 59190 -164022 40639 -198937 -286162
20748 -286162 88964 -137466 -98490 20068 153177 -187623 -71901 -42120 106905 -188482
20737 -101849 -47958 53171 198840 22330 -6079 -101482 -298212 -347021 85627 78776 -160509
20725 -8532 -56064 4933 126407 -96223 -86092 -270480 -102511 -427209 84307 83378 46686 -32162
20712 22116 61371 -233852 97504 42854 -295987 28479 -78803 221227 629 40515 -146513
20700 -102694 -259330 -134633 -168782 17125 -128537 -171272 3706 -134597 105376 -333168
20689 -98741 -36981 -145142 -110491 -245300 -170902 260490 242572 -127052 -212931 140560 51167
20677 -331785 -136341 -239752 27525 -2546 -142819 -37539 -78093 -184636 68633 -47633 283377
20665 -66209 39277 -179348 155587 42721 -20157 -1142 267355 99039 -202818 213625 -107917
20653 -341392 -57657 -227426 -49741 -337422 97882 -265030 -77222 91864 -233888 230672
20642 167413 119806 -23020 59477 -32797 172450 -119624 -138579 -204571 -329573 118104 67615
20631 67615 235436 28565 -67524 -243658 3046 166083 -333729 -78935 67338 -178895 -166355
20620 -166355 -199769 -201883 -116931 -143601 15135 -313346 -113851 185961 -369201 157853 -340975
20608 -283417 -38381 -117933 -67936 143728 50324 -52709 -77955 -337016 -93415 -5598 -189999
20597 -189999 130487 164841 25148 -262672 62519 13116 192683 -215639 13034 124243
20587 124243 -246521 -37540 -56295 -52297 -20058 -51262 -103275 62399 -145867 229517 -101672
20575 275689 9775 58815 -54232 265625 365986 42237 103178 144730 -34266 106955 -53444
20563 123404 -308042 -102910 44234 -37536 31913 -28567 13379 40181 59103 -19855 247098
20551 -5452 -89152 -392126 -277254 -254269 -262478 188657 69362 -221253 195484 -257386 -290262
20540 -290262 43451 -177683 160945 -170098 38119 -60182 37602 -141573 83837 226655
20530 226655 109467 -115013 -297770 -180487 26689 296115 152877 -153936 -71062 -87187
20520 -87187 -132382 2689 -14829 -40298 -6498 98352 -191654 -180312 -368381 -173018 17808
20508 -289776 -201337 -172328 -80498 -111576 -231857 -43414 -296809 164013 95640 6514 38930
20497 38930 98809 93339 -179437 -68655 114084 -333756 203548 -198227 45707 -95905 -195241
20486 -195241 79874 78959 109508 153488 131032 -262672 252132 158198 -221912 -169924 -110701
20475 -110701 -141964 414844 -118312 -165785 381425 -50695 -65079 108484 -240899 111255
20464 -94983 -65046 -214241 -1152 233718 116273 -62235 -69687 -123506 147339 -5362 -364481
20453 -364481 43327 -109027 -286049 334635 -102215 -279856 -23677 196141 137982 -30904
20442 53954 108048 275335 -6850 -116028 -196963 228890 89991 210714 -308634 -14597 72576
20430 154326 -164436 22391 -219718 15362 -630355 -10919 -507323 5154 -65161 -87403 126935
20418 34510 126067 43310 79384 -3674 55051 -116402 -281599 -99732 52168 108136 135907
20407 135907 -248092 182440 -194667 -22044 151717 215391 -278187 -101804 23087 240686
20397 240686 -187961 14514 -21048 -50807 172529 -261202 66508 -226466 -72745 -44846 -76045
20386 -76045 -127710 -184505 -281294 -156013 -129889 -104280 -247312 177225 -92649 56894 -118656
20374 102203 56823 -161396 60874 -264363 288052 72470 -9434 -97492 -90875 97578 -113553
20362 75389 -288792 99911 -499471 -293716 -121242 -237777 -467767 -123063 14658 -138555
20351 46696 -140604 18711 -45983 -230719 -120925 -34028 30550 75903 116500 -258996 -293384
20340 -293384 8135 -219865 -82648 -108662 -218874 -37929 -94792 -132802 125008 -94064 239532
20328 -120401 -17733 266438 119201 113100 211034 -92861 113602 -57938 -69154 -352256 86233
20316 -83353 -233823 250610 145607 285342 55470 168745 -62014 -24541 -182243 -292273
20306 -292273 -154110 90002 136001 -309556 -119733 -139981 33052 89238 103489 46159 -340827
20294 140418 -149662 -214513 -98083 117211 -201390 14154 145849 -114287 -24633 -121246
20284 -121246 -215351 161885 -310788 256429 -74339 -135795 -168399 -71730 -146582 -176255 -429064
20273 -429064 -251906 -70387 -317359 -45222 -189623 -121120 151501 60068 -72759 80997 -64033
20261 -48819 -111711 -77340 -18720 17463 340748 -155076 32002 -96632 -44140 180507 92903
20250 92903 -226303 216026 -18676 132964 -450600 245083 -398700 7773 -143098 56428
20239 45074 143362 33154 114625 -226110 -77940 2945 -72672 -166946 -14029 101043 29267
20227 -15283 316845 -256885 -165976 91207 -128324 -233508 -76918 96939 177597 -383622 -132278
20215 146348 104691 -276287 91040 -281011 -63222 -62548 42952 -27558 124976 78754 215703
20204 215703 -216928 -178321 -69780 -188566 197300 242825 -95054 -93042 -131655 5106 -172115
20192 -67822 -391991 -139071 210448 -364612 -514030 121304 -369122 -204364 -217360 -372540
20182 -372540 187460 90924 -290163 155649 -153336 25016 49184 -35665 -154468 138361
20171 -42735 -194298 193830 -183488 -232454 -115220 -142053 119125 29536 23966 -204634 105135
20159 -135823 111654 2658 104364 195774 294759 -158169 -259460 68460 -84102 30399 -17027
20147 93991 -90056 -163385 -82626 -147545 13502 -361589 235426 344624 -39849 61106 2972
20135 -64283 31103 -178441 -62707 -189810 165287 -108300 -94960 -70504 -727 63293 1150
20123 -137145 154256 168523 105819 14580 -160851 14465 131466 -104667 -30417 12688 143698
20112 143698 -192449 -297918 -204954 86155 -318024 -73228 -235039 22270 -95687 -204479
20102 -204479 122813 -110451 -176842 -203566 -277319 -66830 103233 -97853 15764 -62239 239450
20090 -158070 -22576 39012 -127497 -48918 25144 70376 93171 -294911 132053 -361501 44687
20078 242321 36346 -169599 -168875 55165 -203816 -123738 28277 -171462 -146636 90024 75843
20067 75843 -221049 16087 -189257 70828 68072 -210371 -166089 -96409 -82756 95227 -82599
20055 -83145 -156205 44775 109973 148795 -14337 -7960 16982 -205321 139659 -224668 -254701
20044 -254701 -354673 -74369 21981 -102540 -356130 58282 -313223 -66646 -75630 -89156 -90291
20033 -90291 112073 90819 -168671 57687 -257769 141504 -133216 3858 -170533 -5584 -72485
20022 -72485 382251 75246 68708 -10230 -85619 -24916 260480 35511 -396 -6425 -64212 274381
20009 -239325 177886 -101765 -96048 -132925 -360609 -18871 -55252 34240 -149200 -79195 -389257
19998 -389257 49464 74087 -96543 96285 -264199 161484 34588 67410 239362 -317679 115504
19986 -51082 -102003 -239228 202269 115361 120866 -42957 -79958 -89579 -78887 -151706 394727
19974 -249986 226393 -289094 -145065 -185103 -334768 -295828 158995 -267116 -121232 -198856
19964 -198856 -88164 -122029 421339 -66349 34230 -73671 224564 -153395 -51043 132258 -120495
19952 -68989 69331 115582 16558 -197470 -19058 50948 201168 -126683 161824 100098 -152904
19940 82114 61055 -182106 80721 -195632 278177 116941 -146761 -196545 -209768 -22385 112208
19928 -31200 -115739 65602 90346 74791 -6617 -178557 116595 15188 126480 -19988 348708
19916 -152940 -179882 227799 -163142 -85376 -106111 72310 -236725 -97881 -299686 131563
19905 441791 -97207 -86399 31642 -45789 -181185 -62782 -19753 -285380 335672 -55847 47563
19893 -360934 -102669 -132664 161835 2538 272861 104759 -200388 34066 24928 -240119 -201071
19882 -201071 153217 -136764 33791 273809 -11385 181004 37023 -116019 -48016 -87771
19872 -87771 207745 47919 -215213 76110 -321821 138335 19384 -210772 -49751 -52216 -240954
19861 -240954 -77074 152599 -88338 -208224 6877 91337 -204430 -32799 -57014 -427192 -99382
19849 -235359 -10606 806 -101788 55995 -139419 -150676 -203178 -72118 46712 -91029 155960
19837 99596 -273033 -288828 -161389 -47471 -426592 -124931 194574 288830 -46981 -222457
19827 -222457 30785 -64794 5782 404138 -239628 -41811 -72268 75448 -57140 -255902 -214809
19816 -214809 -231402 86611 -293914 -313511 -212429 -50217 -59230 -182958 -212268 207032 284638
19805 284638 -231281 71348 80377 209973 -66742 32417 10462 199159 -299782 181962 -204098
19793 34515 -147912 -100019 5953 -67132 -186779 -97766 -242889 206985 -85108 -129965 -101381
19782 -101381 -112084 93601 -59823 239465 150621 -10430 -133345 -122490 -190051 -211922 -191250
19771 -191250 -136564 -211788 -175415 109990 -175696 -131170 10900 117743 37176 28935 84270
19760 84270 -94884 495779 -297110 219310 -286369 -32202 -160070 -418488 218847 -102455
19749 -32647 277515 102316 293149 -116395 -19889 -17127 -119591 -282806 -56215 -160666
19739 -160666 -114503 -140914 -156522 225506 50855 -126719 46043 55147 -262281 -99178 -36914
19727 -138476 -114028 33894 -55235 118668 -317525 217021 -91319 -190915 -159464 -121881 112714
19715 322171 58815 -86565 -127124 -39469 -219413 381931 -958 45025 -20043 2321 73044 -334052
19702 -27979 35145 -269630 -196826 54321 206445 99423 -418238 303375 -87628 -150470 -158528
19691 -158528 -361454 124182 -96797 -201256 32794 -270352 -67253 -19859 -68675 6903 284987
19680 284987 269760 -140848 -13839 -76000 13755 210286 177534 -309803 -66587 -52432 -23898
19668 -285506 -125481 -235184 -652 38348 132320 479300 -319148 -111853 -183177 -119595 -118131
19657 -118131 38451 -18897 -153288 -253228 327974 119571 -224606 -211162 -186045 -24886 -112179
19646 -112179 -254312 -137934 -127326 -91740 -186995 -20547 -186870 -179756 -223676 24122 142630
19635 142630 162424 -241642 -287593 -192150 24750 -52103 31017 -42112 -132262 188519 68567
19623 -100660 -54844 -365888 -81303 -258771 -195445 21939 210399 -73779 -194655 180873
19612 -65624 -169168 -75931 -35978 -181806 -30735 -18204 246829 -373349 -170717 -79978 185870
19600 41254 70423 -91900 113145 129395 -18063 -156968 -265128 131195 -147290 -36485 -148228
19589 -148228 -82002 -10882 80107 157280 83799 107846 44864 -166834 59518 -213992 -210636
19578 -210636 97999 22629 350812 -25097 -91768 270624 -31240 154221 -196088 -258089 389638
19566 -39508 -38185 -161212 -252423 -66779 50406 -99719 -159059 -80371 -57569 306428 5675 -50340
19553 -159845 -470876 -297808 157431 1455 43903 192074 -222186 -249177 -525217 -166964
19542 3056 -85864 32814 -340801 -128348 31465 -147440 35914 39666 -214357 3639 50281
19531 50281 -67020 111537 -214359 -44241 -94030 59528 -213917 -226023 -101106 30302 -246007
19519 -253130 -105772 54320 -25290 -446699 1616 174766 -306185 -222855 -73415 131806 80631
19508 80631 -216197 -549011 -108618 -486543 83897 39909 14443 67697 79656 -387129 -255959
19497 -255959 252898 30711 35384 -284289 -120854 -82477 97885 38782 -224026 -48942 -46989
19486 -46989 -112210 435259 -421 -223618 -73334 184090 -190951 -286868 155536 -365780 -4238
19474 -268478 -201739 -187869 -28653 17424 103939 83012 246537 -167126 -3772 -109070 -17177
19462 -71517 -166220 220443 -168004 7369 -35719 71880 98377 -255395 71452 -125981 -344040
19451 -344040 31091 -310445 -116376 198172 -250450 -145803 -24158 25728 141411 -372150
19440 -193132 -162791 145104 -133813 277042 -3014 387324 227534 -107386 74814 -40122
19429 -22484 -203536 -157598 -308789 -62322 -236705 276392 -44863 100491 220293 -306121
19418 -336351 23552 -190437 -80104 -239500 -337288 19146 184568 -32317 -18119 15697 -256861
19406 20186 73215 7290 -319708 -238345 -301208 26986 -339537 -126579 -60807 8236 170932
19395 170932 6765 -218045 -25942 -264649 281716 -106073 -168358 323737 253560 -206861
19384 -275485 -9654 -350967 -52905 -166950 339499 -100653 33378 15309 100519 -11058 -197384
19373 -197384 -92925 94252 43248 -293305 29606 -83248 41936 86877 215969 -207718 -304720
19362 -304720 141546 -62065 -110368 222072 51960 924 -206899 238792 197677 -163347 -240044
19351 -240044 -12767 264763 154772 229380 -2698 -81580 -221796 -135084 133438 379947 -260814
19339 163444 -153508 21691 214443 -366744 -249705 -26127 -16823 -139971 -302859 -320383
19329 -320383 -308702 -31492 -102019 -210983 -394725 57342 -334570 -209527 -342105 -1262 -3669
19318 -3669 -250545 -112488 -220702 152022 -42384 -91009 -143238 5818 -278823 -58049 -251921
19307 -251921 16940 -359032 -248556 26775 -19535 -11504 -150473 -17774 116829 -159454 -40866
19295 77079 36270 -2516 -353081 -31576 50826 -35981 -8693 -167377 -200798 -213604 -175542 151399
19282 12501 92630 -48003 26851 102758 -36365 206488 -66590 -296194 38324 479453 -169598
19270 29783 156694 -23443 57650 -286252 -285772 18401 -233142 25044 -98980 63869 64840 275563
19258 275563 2078 -121584 -290910 -64741 -190115 -247209 -118636 -183359 -453937 63287 -267677
19246 32076 -1218 155565 83413 -204990 -113291 -202902 -153734 -221947 -220304 -115724 -86930
19235 -86930 76212 13938 152948 -362690 198801 -181305 -129017 234748 -302045 -171357
19225 -171357 157870 255436 -104297 159961 163569 358304 -355203 -321333 -155008 -127966
19215 -127966 -81930 -341820 -35588 -146722 47659 -364847 -168001 12445 8181 -101498 69292
19203 194093 23498 -158972 200209 -126902 -169612 -64053 -145503 28259 48919 -47087 -156346
19192 -156346 -202947 -34124 -144738 -36697 12647 -152394 119101 -453650 -414020 -302722
19182 -302722 -140573 89375 -122341 -29318 -103618 23568 -72118 22803 394104 -3103 -29499
19171 -29499 -121170 -268867 79164 -94160 -75670 119690 -219056 -310924 -94238 -87241 43056
19159 -187620 -214303 -212064 83775 130876 -250823 -204897 95872 135179 -295321 -80098 49390
19147 70426 270857 -255349 -30362 -156111 -112336 72923 -230722 -20330 -99747 -400610 71205
19135 -264345 58798 -235965 -16602 39680 -105407 -46804 -164701 137119 10184 -177269
19124 -43804 -132077 72468 -334871 -64547 -5247 272655 -277332 -66076 -266057 -175739 -186507
19113 -186507 -146780 -132902 91217 158187 157021 -162118 -550632 -223666 -55536 191565 -152201
19101 15358 -33109 7214 -503046 143382 -13657 -10112 -394766 33760 -63459 -140959 -224250
19090 -224250 -57443 42319 317820 -227986 13443 -54236 -57151 194763 49140 -118735 -379403
19079 -379403 159562 44396 132946 44607 88007 -116699 109936 -264448 89590 -28157 33622
19067 -35198 45737 -378097 -63973 21386 63863 -24191 69828 52974 -95781 52366 -356278
19055 -141925 -62841 -86395 -85440 -5297 -123935 153153 -73690 170090 261078 -248482 -49106
19043 -109819 381587 -388200 -3664 80638 51586 83465 -427084 -227827 -136632 -705098 -94896
19031 -90344 -14025 -83462 56606 -77800 145264 26190 21069 146613 -83125 -155985 -242541
19020 -242541 25335 -73732 91370 182887 -55035 136054 175854 -183001 151706 -45523 10667
19008 -208674 194912 143917 138645 -191236 68106 -355182 316163 -343384 -341245 -35880 -180215
18997 -180215 3345 161926 -65092 234264 210420 -200061 -79267 -132062 -85746 -118850 169783
18985 350683 51260 -190092 80002 143269 12533 20546 -170414 103404 -37311 -20375 -184063
18974 -184063 271219 29228 56495 31950 -262739 -386621 -151905 -82803 -7890 -406947 -1699
18962 -254883 -102977 54068 39642 261851 -66359 -110024 111987 116679 -67866 202129 -82000
18950 -42002 -71062 -297380 -6839 -82762 322443 -171787 -161300 -109488 -151100 -3638 8492 -356062
18937 245766 -179349 53338 174376 70116 -202224 -93131 -229041 49302 -33566 47370 -180478
18925 -12574 44116 85857 345106 -25557 -41011 -8489 -51975 23305 80319 143247 -42391 248953
18912 160509 -142135 236309 -252331 -381942 -185014 -35219 124742 -24389 -6237 -58172
18902 -58172 111486 351660 173579 6048 -114126 77079 -93534 -269362 107987 -37542 -172871
18891 -172871 -270996 -197562 -142869 -258047 -43744 -17848 -19083 338998 212674 6560 -363018
18879 65114 41841 199237 -59385 -260285 236348 249152 -11060 -153998 112091 166099 124234
18868 124234 -333423 -282795 -67003 -134592 -229544 -260364 -99298 95419 -254288 41270 -18692
18856 -342308 -111371 -67016 -261296 -170877 -222171 81263 -232069 15848 -486292 -273624
18846 -273624 -294028 68816 -14770 169424 -73295 194876 -38163 36583 -264995 -93792 149054
18834 -3302 81023 100079 106305 -89970 -10099 -55123 -42818 -144746 -187479 -145784 -226908 -179268
18822 -179268 -2560 -229739 299353 -163022 112040 -11001 98890 -253816 27731 36546 -127965
18810 -405972 -339496 -172476 -107501 270756 170980 155531 -6743 123945 85906 -234512 100105
18798 -14094 567011 116763 -14261 377513 327175 -20236 20017 202879 -298045 -102978
18787 197695 -24643 -228309 -140468 -302753 -347757 -30974 -135129 -38014 83783 96998 202507
18776 202507 -254559 -149450 -79079 -244380 -191980 65443 -44430 190642 -257162 115648
18765 57375 109304 310366 71935 -439354 67740 126862 -97772 -221898 -31259 -86360 72309
18753 196434 -294335 32907 -117015 -178600 157411 32438 112880 106448 95003 198071 -435183
18741 -153624 -187235 -77727 -87664 -265542 -108807 -49116 -149920 -114629 272366 -321813 166143
18729 -93468 -127182 -237355 -131818 110693 330188 78293 -130706 327489 -41104 32495
18718 -284865 -134936 -88160 -272882 -99695 -96922 -192259 -5919 -79152 -122304 -152968 232337
18706 -221216 -26278 347064 -97352 251352 -587206 -27521 -148128 -167337 -192127 70078 -256835
18694 23231 -57325 -160090 -5524 -58054 -66501 -159642 -196404 -27428 8441 -81746 203912 35355
18681 -53083 -34859 -12568 95720 -42528 -426862 -184142 328645 -88691 72887 -84037 187686
18669 -118246 -338158 -214002 -387989 -302439 -10007 -134450 12322 -31473 -118936 -243793
18659 -243793 -189994 -161667 -265220 -110631 281785 302065 -77008 -187077 35204 -163064
18648 -427555 179076 103632 -96464 -257677 98619 249974 -180889 -27116 -201338 92498
18637 -38228 142264 -263213 -326280 -28003 -31800 -46234 -46852 83972 98034 -51592 213959 131038
18625 131038 8632 -185127 -180749 -419916 -430843 250937 28446 61434 13481 -18946 -169878
18614 -169878 -169857 188135 205826 -292453 161141 11676 -78297 -2193 -277212 -41166 -102100
18603 -102100 -107868 -347536 207538 -132906 -149855 270336 184361 89790 167371 -45187 26719
18591 -383422 -75659 -118400 -103092 -125012 167713 29591 175215 50385 -50432 -31116 10860
18579 -231096 -287756 158307 -189485 48707 -150463 -188680 -186157 -366317 -455527 -96443 65174
18567 -30367 -458460 234648 210905 242911 -132458 -183413 -7490 -473073 302353 354415 -103423
18555 -39779 -233082 -28406 74713 29268 -235570 1841 -145992 -140294 234303 168893 81543
18543 -30881 -18454 -323697 -286597 -106330 68745 -12547 -305051 -94694 337683 328489 33224
18531 -168031 -124174 -141037 -265093 -24982 -363905 -194079 306842 143511 -54538 -9619 -191750
18520 -191750 56565 -213036 26906 73225 -15365 310046 -80721 -119154 -432105 -125059 -39594
18508 -235935 -96320 -77040 220661 108153 -159862 -35348 73113 -165454 -23192 -46766 -234050
18497 -234050 -242520 -100280 -207906 187531 310366 -92244 268537 34083 -86318 -67400 103838
18485 -176625 -351658 -175489 113814 -138316 -241146 255060 -191023 20887 -199370 12787
18474 -356564 31620 -102251 108392 -346939 -73821 108458 10956 55899 -199453 107870
18463 -162599 -12224 -403460 73673 -65981 -155533 49 -46793 -185567 -62892 -275288 -115492
18451 192513 84593 -132834 -136112 -278353 -132116 -2016 183769 123160 -72773 -63315 310352
18439 -190360 -20740 -230769 63210 109616 -175885 -294894 -150690 165798 89537 120272
18429 120272 82875 -23245 54682 -316927 -241637 -32994 -29040 -285801 -21418 135352 -170266
18417 183276 5027 111613 91094 -91621 31861 192246 -359805 21191 -4814 -167726 -135961
18406 -135961 -83800 87301 94096 -188584 -210774 191827 -61568 -64382 126661 2619 -78812
18394 64483 -57494 -39489 49052 193012 65168 306050 -302838 170851 69695 190710 -442697
18382 317 -125648 48809 -205934 23441 166761 -193378 -355106 -315480 82454 -154689 15319
18370 -25901 208375 -75258 -184068 164215 274508 22645 169747 -163986 -38572 -56552
18360 -56552 -322540 20011 38045 235182 -195835 338662 89083 -199264 313019 202939
18350 202939 186577 -82084 11721 68679 -48807 126273 61777 8453 -93252 79383 -104376
18338 200261 -213882 -198190 4443 308658 23596 333199 -143760 -281100 -306047 91924 -58621
18326 -22496 -96267 -5378 -181837 206293 119402 63880 -76711 -12678 -523065 -115953 -88365
18315 -88365 146857 -11010 -105452 -59313 -168196 -121413 86756 267247 124475 128461 -110428
18303 -527753 88856 57131 15141 207559 -125967 138665 69880 49856 -187500 -95604 113804
18291 32417 -27304 -111025 19494 -90071 -362854 -165429 11602 20739 -68429 -199738 -31997
18279 -297556 187016 -160290 -78871 -269239 227634 -131838 5284 -199376 -167223 -312457
18269 -312457 -152049 -272221 4431 -64328 64576 -41184 -149666 58732 180597 -136499 -72903
18258 -72903 267306 -94986 248890 41432 -187532 -14987 -204664 75021 -55440 288899 -277251
18246 -119838 91111 -247982 175282 -205182 -599732 160127 -108296 -109680 -135851 13202
18235 -74081 -85114 -73565 -372693 91266 190018 -12278 -44831 140183 -162323 -346424 119718
18223 -78736 189944 -52599 -203958 -173745 -203608 -20676 -36328 58887 -288220 65114 -125645
18211 -154253 341 -10531 125183 -84571 163762 -81110 -507891 -80105 298370 -205470 -146057
18200 -146057 168405 -181997 442778 118806 -85562 -293326 579612 72662 -185519 -63678
18189 12866 173811 -90575 -91427 -164835 -172733 -309398 -269027 -217654 -144196 44025 -223203 87508
18176 -455749 -351886 180995 -365217 361 150210 -190662 157241 -17062 -22470 359173 -232107
18164 -204161 -400110 126711 -245876 -73645 49794 -82249 30679 1734 150613 -92723 139080
18152 99589 -44294 -1203 -34091 -295508 411745 170593 83499 160320 83410 -58394 -432998
18141 -432998 -125762 -72219 -411777 227968 13429 280591 -154196 -63428 15027 -372916
18130 -128337 -196675 149615 -335270 -313689 -474817 -71679 -173791 -17449 -270974 -136427
18120 -136427 48418 -129700 -140395 -25055 130596 -97706 198356 83410 236759 172202 184948
18109 184948 161056 26565 -18058 -94549 -240683 96386 133346 37158 -25443 159561 -82819
18097 98308 86157 -160667 41241 -134517 -209899 -124974 134197 16194 171526 54054 -81007
18085 79216 33284 -293268 -89329 -326819 -189453 -149253 -171586 -65025 193289 -98681 -53044
18074 -53044 -60149 160701 128745 86867 27634 -102767 100966 44395 -11806 131403 -180525
18062 258259 -372409 3374 -119886 -107700 196449 46115 182536 208028 131247 -189472 -320476
18051 -320476 62288 -19977 -181133 -81792 95728 -21997 214883 -64689 -28766 -87830 -25660
18039 58469 29496 -107789 -187756 -40290 -30540 -241230 -6268 -277182 -292973 141666 119070
18028 119070 196001 37103 145405 -259227 -114690 -157786 -170258 13499 -46505 -321186 -77700
18016 80192 405021 24910 -110571 -225410 200135 123847 -270402 -72701 -964 -305630 322317
18004 -341875 77051 -161971 28495 -192931 136309 186218 -170439 -311379 -124151 113946
17993 97801 -24931 65888 -69562 190294 -161372 33823 194131 142641 -178256 41532 -167208
17981 -384646 215694 -287450 -147386 54643 -10748 187629 -7540 13180 -246326 -464301
17971 -464301 -105118 -304588 282368 187543 32364 -75403 -48638 -194114 174299 195618
17961 195618 -197502 108534 -9020 -133432 148632 -372402 -117865 -241800 -207253 -42715
17950 -344367 -80240 170766 16748 392872 -236086 180078 -91666 -203546 84965 126495
17940 126495 210657 -39021 396764 -348981 265179 -208303 44420 56230 47793 -123142 -322978
17929 -322978 173622 -129276 -94239 -198755 314810 9688 90447 -149881 -92922 79194 -321333
17917 -84901 -323528 79267 195963 385721 -39782 49625 -258592 -183816 -196638 283392 273701
17906 273701 331997 -64142 223982 -149648 -85983 141009 146482 -271637 -75229 99495 -241249
17894 -381054 -30098 -52850 22013 -25177 216070 86708 82894 104463 94617 138247 -247045
17882 -39498 -101595 20573 -102039 56550 64191 322935 207117 -49451 -75559 -148197 28325
17870 142447 205724 107602 44589 -21211 -273360 -223742 -78028 156820 -510030 -173633 -146852
17859 -146852 26771 79608 332117 -251268 38978 -147785 408775 429416 -112361 -265878
17849 -265878 -57730 -56724 41619 -25789 -294 249336 -37856 -118870 241615 113399 -141103
17837 -226391 133728 -135010 198108 -101086 -43242 -118385 -252648 242306 -243086 -63126
17826 68169 111405 -138990 -4652 122820 -66174 -71334 -61274 -146370 69579 144137 280812
17815 280812 101922 191035 80827 50039 -42902 -524255 -210526 142328 101132 167458 -45510
17803 -223424 -26147 -194896 -49470 -153744 -71619 -29417 -39913 -19441 -213920 -152386 15912
17791 250364 -362041 69273 -101418 30648 -18829 -7894 416 118062 -51947 186481 -186936
17779 330657 2671 113368 76181 50078 -102632 -145087 -148955 280528 -132961 -165766 105355
17767 21693 -120883 -82250 -19127 -4407 197221 188787 -40862 26665 194730 -295514 -25611
17755 25631 -197540 -163272 -70101 -309689 136601 159755 61306 -70176 143596 -142233 280433
17743 -501390 63022 164611 -76724 43658 217128 -17096 204127 -137596 -181144 5320 170299
17732 170299 30769 -30149 22316 273139 -124296 171262 -225353 -59722 -86143 139150
17721 356535 36711 241654 -411316 -54685 317603 -37269 24425 9496 -186415 17138 106317
17710 106317 137939 -111910 24678 223288 -23060 -48957 128942 354002 -152993 289503
17699 139620 -28388 302836 65312 130113 59871 103941 64542 229045 6493 96220 160423
17688 160423 142104 89379 229478 -213663 345800 127610 191625 -3147 -10940 -75741 161056
17676 22764 -255398 -81775 115381 144812 -193769 12382 -6397 -16032 -43557 -62147 184967
17664 -114792 -105222 -117908 -62002 -59463 -181498 138879 42343 258357 253919 -143271 38269
17652 299344 126555 -13409 89345 52263 73336 -99733 -194639 -129131 156131 -263520 -169430
17641 -169430 -310323 1460 -181167 43103 -62616 164584 90200 -22237 -129145 268670 -251934
17629 70417 73641 -167453 327527 -100508 63573 74038 -29856 -110488 31424 317639 46279
17617 226882 -13568 28354 333692 79158 22042 241337 101256 377288 114407 -87935
17606 -236039 -36725 -83537 110751 -128141 197709 -63179 -71776 161868 30573 23414 -85352
17594 72866 133162 -357611 93728 76015 20221 60039 67407 86366 38679 -238149 -170610
17583 -170610 258391 352372 126762 148094 309866 -68318 165885 232336 -64371 -71554 -25871
17571 -441609 -6198 341031 -45125 -171475 129899 -62975 -39672 543142 34391 26560 -55342
17559 -98003 111207 85449 -250843 221338 -179097 169930 229444 197575 -214789 -46550
17548 -178455 313815 -186620 195826 195401 101683 10875 107063 172024 -153270 -135034 -88925
17537 -88925 109063 130554 244835 374179 -38612 139009 94954 -60867 -164792 580430
17526 106695 189908 141438 50347 -82639 102719 -33281 -103414 -68962 -84852 9081 194335
17515 194335 -154067 321034 209747 -68115 79322 107656 202511 -239761 209225 447598
17505 447598 -208154 -82488 170642 106186 -8699 107296 235114 207961 171395 279350 -143080
17493 133499 73206 61139 365597 61517 205776 155093 -185298 59579 64729 114302 4230
17481 92384 252614 210616 303440 61620 241388 -74592 -120002 82909 -83825 -41806 58614
17469 241427 87785 -262 290846 493403 -143501 220109 147979 65922 155387 68858 157088
17458 157088 95838 92648 251739 -196059 355494 88012 -25115 171595 575617 140893
17447 12608 11605 53055 159110 170707 -71532 96944 53586 95566 404568 352445 282500
17436 282500 335938 174663 118820 232098 219719 2779 194089 283772 156261 70690 265299
17425 265299 373621 185155 256813 323082 403457 394706 263603 255999 539556 79531 160606
17414 160606 482228 1417 67131 145312 30706 358020 399615 257948 8941 2601 310234
17403 310234 157717 272690 271841 268596 236485 137707 42151 204823 13601 9352 380809
17392 380809 33047 345614 181784 179093 56750 111013 -45692 145238 155507 -54333 -13220
17380 290683 340878 317377 430177 121796 269395 -40731 402035 -43018 -4144 312295 132128
17368 9041 -45392 -82032 27608 209628 191962 76184 690 318956 61837 -37082 139140 56992
17355 242144 -242877 -211040 274150 502403 82778 -9392 -6430 577792 64573 270405 260155
17344 260155 264230 297773 88640 454355 201773 36323 628496 -114631 430140 373413 375981
17333 375981 201409 119110 -160116 190433 231681 287819 158547 -207361 315955 258200
17323 258200 425223 41644 -57752 469764 -13778 406468 114837 246267 294097 111014
17312 329560 285768 233427 114682 252003 79535 321896 52529 52720 118680 49570 134747
17301 134747 239018 133296 -51148 570921 217294 43280 222415 -42444 -97560 2258 46919
17290 46919 491485 -247631 162234 6000 20570 139075 73702 42989 282447 271301 93457
17278 404697 165382 513680 -72784 192814 127564 92417 187906 156976 204575 515211 170233
17266 154904 202832 304902 14315 208356 251136 250919 294515 275839 171588 48110 396323
17255 396323 135316 184823 -4277 200615 71633 439193 480743 181814 96555 255803 57769
17243 65488 -126761 95720 397482 246284 -161160 287876 302877 432881 -230517 1045
17232 139581 56668 33138 177897 132289 308039 167368 317829 15291 206082 -166071
17221 208977 165535 -29506 301018 22553 111233 104657 94712 87543 52484 141693 -6256 538310
17208 531518 400083 255508 -21296 343853 334561 -129211 295543 117234 266249 280389
17198 280389 271482 -80202 206412 390761 262590 237183 63344 140833 257801 42968 117594
17187 117594 176991 270941 648897 -10929 148752 418899 375675 345417 241216 232418 412136
17176 412136 219325 207074 593157 -5235 59508 356290 24380 153678 318173 339455 143476
17164 433909 410234 215262 290987 121806 327851 420846 190462 163100 360731 383029
17154 383029 311181 470168 482756 -87010 134368 305978 209324 183295 252110 337509 160161
17142 289232 198733 244453 492529 201208 358887 334441 482870 195037 223607 602928
17132 602928 315989 154633 300652 104925 284401 284990 556546 261011 180642 459956
17122 459956 534438 239032 222913 539562 441174 271745 220754 464803 549910 481209 437575
17111 437575 410793 361298 649822 590244 177513 390919 464034 18827 184348 527249
17101 527249 374471 188143 420135 317461 314400 235961 421466 304296 210782 228137
17091 228137 276762 118353 322344 595931 655389 323557 399089 693034 346788 234047
17081 234047 640263 460312 725900 452606 411560 353046 301002 422961 681439 358299
17071 358299 379247 631457 724530 287816 736794 583143 530180 607502 247386 735999
17061 735999 363692 211567 76946 370009 572070 393383 538135 207334 514930 61881
17050 825336 517116 427621 698199 536062 756736 647084 528123 729433 626608 378094
17040 378094 469006 795517 996169 826337 763378 691329 447328 547518 478743 217664
17029 805799 640366 567975 501801 407716 653030 869208 610594 750260 569692 699162
17019 699162 798460 508462 770358 604817 692756 725825 303232 420840 500802 574954
17009 574954 819972 694689 446860 664178 893772 661316 977995 929584 566085 992200
16999 992200 433400 621694 675694 920998 967603 979662 642993 584717 487018 762725
16989 762725 739884 617793 841611 571582 835830 527884 767487 934014 886887 938628
16979 938628 812570 1198169 913346 803251 1053743 1215158 704421 709590 549231 407321
16969 407321 883719 893210 886762 1033230 855975 753589 681148 1010526 832082 955593
16959 955593 686413 1280688 896960 1028395 810533 878376 1092710 921646 1308333 952545
16949 952545 910486 1048567 1328582 1276692 1329883 1056754 1107858 1057337 1115847 1298868 1128419
16938 1128419 1228472 1500667 1453846 1109407 1824137 960820 1251735 1051227 1330080 1354254
16928 1354254 1629052 1481556 1442286 1147254 1693631 1201076 1273008 1276805 1732984 1552597
16918 1552597 1649029 1660221 1332036 1376146 1547235 1582392 1401536 1512010 1602631 1466407
16908 1466407 1440390 1464362 1657502 1421701 1484225 1597771 1491886 1524807 1616170 1661342
16898 1661342 1716925 1781102 1540745 2337857 1875754 2040100 1890234 1738119 1582087 2020310
16888 2020310 1914250 1599447 2020450 1927480 2051360 2210017 2135281 2329519 2151761 2329846
16878 2329846 2081689 2371982 2264247 2062127 2288597 1740628 2396849 2385336 2220329 2409361
16868 2409361 2233506 2346510 2338042 2660145 2483855 2593377 2830497 2454511 2765068 2360135
16858 2360135 2291046 2639995 2922017 2894193 3197272 2840607 3037503 2990853 3216790 3486402
16848 3486402 3153133 3291059 3360239 3440660 3487983 3312662 3360423 3373960 3801265 3711103
16838 3711103 3627114 3771373 3764313 3650070 3883109 3711716 3634035 4259639 4117109 4153079
16828 4153079 4298018 4266504 4206702 4449472 4727347 4325975 4678476 4825725 4798773 4887580
16818 4887580 4750998 5287564 5356902 5165957 5392532 5806897 5830025 5807583 5817347 5648662
16808 5648662 5969185 6384184 5775218 6170640 6748507 6670167 6847872 6843962 6921231 7169594
16798 7169594 7367217 7566122 7676679 7880741 8315844 8448241 8104313 8658386 8572725 9016475
16788 9016475 9455733 9435965 9562522 9772589 10213014 10263413 10462699 10787841 11147085 11286694
16778 11286694 12092640 11778099 12650043 12957960 13174298 13561732 14003490 14348498 14770430
16769 14770430 15375361 15578135 16180365 16513999 17118972 17725124 18025859 18954567 19441149
16760 19441149 20387248 20767664 21394224 22168181 22973398 23492706 24846738 25739717 26934917
16751 26934917 27868343 28429990 29763420 31356874 32297490 33604941 35563026 36974459
16743 36974459 38342578 39994562 42272464 43910768 45769380 47749626 50329489 52638303
16735 52638303 55456925 58050972 61350274 63808641 67602736 70948779 74598953 78516899
16727 78516899 83186197 87420068 92029952 96847683 102286267 107293922 112894323 118542440
16719 118542440 124524443 130336816 136539270 142326489 148166041 153853798 159210930 164385894
16711 164385894 168803278 172494981 175553361 177918665 179569886 180080617 179675863 178075821
16703 178075821 176299323 173291097 169288599 165226502 160031709 154719533 148537460 142559045
16695 142559045 136977040 130577755 124517284 118162124 112342331 106785044 101057478 95688165
16687 95688165 90514827 85689069 81437717 76873769 72675813 68912303 65107726 61774312
16679 61774312 58447826 55629255 52689134 50231833 47647124 45247039 43420949 41413314
16671 41413314 39166934 37479999 35832530 34536098 32712415 31229443 30264322 28645471
16663 28645471 27690617 26556326 25229488 24490165 23606390 22716423 22119714 21003552 20344659
16654 20344659 19553113 18997462 18036264 17511352 16971261 16242930 15695008 15309822 14985131
16645 14985131 14441872 13841754 13718066 13095196 12761582 12634073 12239767 11495522 11310493
16636 11310493 11014052 10730919 10611618 10418161 9699398 9440863 9377172 9210319 9062204
16627 9062204 8761334 8904403 8202692 8048270 8019891 7807025 7409993 7581615 6996985 6922485
16617 6922485 6960634 6550491 6856674 6419067 6312846 6293266 6035540 6057290 5550363 5582151
16607 5582151 5757619 5692211 5332232 5058488 5421321 5042758 4746221 5019102 4576757 4682505
16597 4682505 4562669 4487505 4625771 4325409 3916605 4035564 3865848 4209574 3726448 3942066
16587 3942066 3749130 3608888 3617387 3722079 3696736 3219564 3226701 3199529 3326407 2959042
16577 2959042 3459624 3521783 3064838 3377975 3210686 2958024 2932781 2845987 2583464 2859820
16567 2859820 2840152 2529388 2453600 2634201 2587915 2876214 2452123 2359643 2304334 2397895
16557 2397895 2590295 2327582 2336630 2346342 2110593 2018386 2063988 2158284 2025468 1979927 1853462
16546 1853462 2033513 2209507 2011332 1873551 2205778 1856680 1936039 2152099 1839226 1823707
16536 1823707 1960272 1727981 1404951 1798305 1770429 1851865 1708985 1508817 1584912 1613409
16526 1613409 1458868 1246553 1427358 1621440 1407677 1680986 1288950 1471270 1478506 1370481
16516 1370481 1309567 1417552 1147643 1832505 1425152 1325139 1466225 1170124 1343273 1157805
16506 1157805 1175372 1387894 1190412 1358851 1260353 992390 1397722 1388727 1209777 1316834
16496 1316834 1050721 985967 1125608 1201342 833614 1358750 1171165 1047592 1205213 1023188
16486 1023188 1035009 724236 1192938 1274376 845428 1086893 973372 783025 670742 889627
16476 889627 881449 695362 1098832 1002930 1015961 666031 920770 1077633 726771 924637
16466 924637 990741 739433 941774 852381 633581 815442 782700 876294 862953 656677
16456 656677 531051 507931 430814 799571 396662 939000 803426 620559 506160 513070
16446 513070 712849 709227 773076 509277 811090 628916 660371 456798 656489 559960
16436 559960 810799 407049 483606 399830 433652 600486 867778 301060 765304 483793
16426 483793 416698 507610 788677 439681 501044 285936 446482 223992 386194 396008
16416 396008 418502 479703 475421 455741 519668 301751 137396 784492 609703 393116 228170
16405 228170 509429 146983 547906 321662 460829 408691 156941 574406 425342 772877
16395 772877 452113 417603 717742 645463 648877 319627 383842 315213 205204 291721 444841
16384 444841 429626 444757 238571 651794 301171 -20088 279918 677111 339948 156890
16373 763886 336337 590220 230464 550796 -40707 354290 388296 433996 624103 355530
16363 355530 148401 212370 296805 516286 341989 479270 210914 391064 572552 308479
16353 308479 4783 345505 158735 407742 214767 190860 234350 265191 599912 202443
16342 482198 359543 291129 411418 541369 364423 314100 427965 412030 319228 358940
16332 358940 252902 441524 541326 35041 -34753 369587 228733 -55127 321161 463007
16322 463007 327223 400616 269258 -45369 207511 128295 191684 200637 226544 278874 62334
16310 89454 171603 305064 -310532 279244 213942 64887 116546 164420 164860 533135 196881
16298 413597 239135 -92283 101216 -59838 131070 286102 -134936 234970 168736 244104
16288 244104 -20785 239168 263118 401707 22368 548602 267282 249147 500977 443307
16278 443307 395085 -15334 -172757 473292 58625 212845 391772 122213 391101 245826
16268 245826 193148 302095 350656 191344 175841 368066 298840 154529 87527 84697 243425
16257 243425 -15491 58124 8981 16128 336196 -102722 -82686 331298 266495 111692 240979
16246 240979 84153 -19786 -110449 -51094 287027 295750 265590 59410 297976 94869 142578
16235 142578 478475 59550 137740 63345 -2585 50214 337296 317603 284255 41721 91303
16224 91303 167778 422800 342095 -15018 350175 85835 -133592 100838 -35047 -261346 30981
16212 96759 226658 180495 287641 382432 -351573 -6090 -120053 -105187 -219627 154336 157327
16201 157327 -106996 -110143 170361 -182584 441599 248087 146932 62854 99199 253977
16191 253977 -241025 -56226 16942 -86338 -52873 3322 55519 -120236 -156151 327229 -237979
16179 210990 96350 -44757 -84186 125084 120331 157085 -131568 -156697 133797 -274178 -236028
16168 -236028 307736 273211 -114613 -105296 7142 193830 160386 483428 93775 229827 120315
16157 120315 283150 196169 84464 151973 -45293 50150 17231 -21734 -85417 109773 -149653
16145 128148 -77771 -147326 123521 -1619 -66996 -141798 -60135 109023 -135429 34837 -316288
16133 147537 280562 8520 192442 199760 46789 119525 16255 -198929 -49544 160454 -141969
16121 -45117 297500 -96496 38686 -205590 -171664 161758 -9300 44295 -239463 104865 48919
16109 17647 87164 79807 189554 336522 194515 34471 -138383 191499 393460 -54268 64599
16097 27031 135936 56508 -128116 -91359 -38124 69712 -38077 -292079 239901 106101 -84810
16085 230820 -51203 153081 193634 -21748 -58701 39205 -17686 -201695 -286084 378371 -43751
16073 189827 -19694 -78720 5644 -162634 -248798 -219062 -99387 240220 -141453 -198588 -179693
16062 -179693 -38607 -17237 -259036 305837 -29558 235222 -2193 115465 -95829 163429 140034
16051 140034 -195794 -51233 158125 16762 -162340 67884 7136 426888 190299 27464 196860
16040 196860 -72312 -302645 -38618 -144105 -170843 -39379 -388569 -208182 98238 5020 -125309
16028 59732 -68484 -319654 -244674 -17583 -60875 45591 -238884 219817 9310 50720 -165781
16016 -231200 -243967 54958 40785 274775 117709 59443 258723 68696 41166 -93125 -187543
16005 -187543 298170 175012 -80407 77127 -197524 -40848 -54606 302560 53110 278870
15995 278870 -36271 -43308 70085 -259295 -627927 -29976 -22719 37450 -47906 41739 264599
15984 264599 49894 -108063 230621 162679 48296 43356 73931 -9586 44119 55737 211582
15973 211582 -280569 -83070 298061 164722 316538 211958 36304 376395 311698 34340
15962 182200 312864 -103918 232759 114790 -333444 255468 -80937 -240377 -109408 -270869
15952 -270869 84027 111442 -47192 -152315 45964 71515 -166611 93791 -178685 47876 268652
15941 268652 -143124 115490 -69452 59584 120931 -234978 -111912 -177157 8786 -6311 172908
15929 -24025 -87073 -49474 76767 -169201 -266082 -57472 387924 124549 36155 80485 -111032
15917 -72391 54587 102928 52555 174177 436547 163146 -45958 212617 -68667 101625 73074
15906 73074 -246798 -23951 25461 102077 -271617 -61832 40323 -169651 213426 -191047 -82627
15894 80070 259226 90804 243256 -142343 89615 -16106 -476 93056 -10330 -512159 81820
15882 -69065 -128841 -35220 88390 -141475 -506679 -125016 158210 -772 83919 212148 -65943
15870 139684 -312597 -5812 -272872 -275227 140650 -113410 -56923 -223882 -214488 -12097 108754
15858 26149 -242446 4232 -306676 178749 133324 -118137 -8975 -23145 -134074 50010 137147
15847 137147 163921 39062 155089 -58307 107767 -488657 -158992 -269619 61158 196143
15837 196143 -143857 323188 -134464 -19882 -52362 160928 128771 111006 -180736 33725
15826 158854 -262782 117164 -11779 125170 -80546 19664 -274263 265782 99305 164944
15816 164944 -59579 -185498 -49913 -147499 112880 57119 27445 40634 124402 27385 27245
15805 27245 104949 -253228 -106286 -154973 -53974 -63584 -32844 220495 29624 187070 56132
15793 -220569 -136526 -104804 -91766 -168361 -324809 21437 227310 424704 -20501 -345679 9942
15781 -38847 43610 26507 269921 -229476 -356944 28923 404920 75133 2627 -293495 -182839
15770 -182839 142067 78320 -442491 -237488 87899 104382 -183117 87575 -646624 236274
15759 125153 20360 -212513 -3181 -132648 167388 -132061 60838 -206526 -175914 -134354 -270461
15748 -270461 -27961 187303 -125550 151159 122185 -87691 -83536 -140316 -210004 -127593 52923
15736 85708 -22152 -90533 44606 137156 296199 91468 109272 159482 -45549 66971 -124942
15724 69291 148954 -137646 55397 -311784 16423 -38330 117500 102148 371713 -50984 464594
15712 46044 -290307 112926 190681 -250321 -320173 -99669 70889 -11554 23434 72275 8498
15700 -479102 -461 47884 -246356 -372710 -37173 -175165 -118005 -274489 -63270 -124165 89150
15688 -409116 -136709 -91134 103810 -660287 5131 44195 -119349 113824 93138 179306 -52805
15676 21064 237747 -258134 -176571 -334302 -233881 -347161 -2751 -76562 61681 -26918 77162
15664 -308512 -90741 417505 -101235 -57903 -37461 -393387 83299 -108552 -185130 -50918 147886
15652 255165 -20973 -121333 68276 -116451 69069 -393157 85700 -88173 -34911 -271244 -87998
15640 243274 56857 -54191 -271587 -13774 -97700 -16168 37174 235957 -70959 -139934 143671
15628 64648 242501 116177 -40849 -107124 -244543 -438003 325281 -250235 -79460 -382457
15618 -382457 -289583 170380 16844 448698 36351 -93858 20147 199971 99912 180019 -235052
15606 209207 133401 316515 -81915 36656 -198844 47156 -100871 -69065 1294 -195911 -119688
15595 -119688 315278 -174431 -54670 -75364 -202115 234169 -178503 -204739 23521 96184
15585 96184 -6969 135016 106318 151731 -155210 -22034 -9145 116396 143260 261684 3267
15573 -126996 32537 260978 398010 32215 -10931 170054 225332 147627 -206000 150276
15562 -122256 -358864 -233265 42742 227871 -264187 96088 143141 -175554 67192 -316342
15551 -201849 148059 58173 -56740 244452 195515 64414 95140 -3090 18103 -17748 -111249
15540 -111249 -183406 134797 -504049 -7466 -73717 -207917 -345031 -168254 333664 25546
15529 136972 -312239 289620 -230434 24217 108683 71724 15022 -45107 -444431 -95953 -264223
15518 -264223 -185206 -20913 172968 -194255 12208 412190 -121212 -6823 131257 -170062
15507 223312 24284 326828 -317732 -724 -145652 208784 409386 -32975 -174568 29588 -405898
15495 367884 342518 -125452 253263 470676 -364577 -119517 -170280 -13198 19595 189866
15485 189866 -89185 -53208 -18688 99470 -323354 -443907 256251 -161405 41617 -99614 -129302
15474 -129302 179374 24654 67716 133108 -186764 14044 44968 -128607 143850 -424507
15463 79249 -157891 -336438 -24731 -270824 269059 101559 -79455 210349 -7201 -47735 -147170
15452 -147170 42528 6751 -89262 84212 456739 -51782 242330 17466 -279732 324773 -71043
15440 -153317 36500 -317638 74959 382746 -199713 9448 105518 263108 -250629 2533 -88019
15428 15538 -62153 -158386 258892 -356737 119287 92423 96649 -116797 -113872 -292579 -154591
15417 -154591 -23053 217494 13342 -29074 -41005 -188214 -211397 -296584 -294051 144727 -199385
15405 -144223 68907 -4208 -337295 219841 865 -61375 -386458 -220609 -91197 -38347 159132
15393 216318 47480 -24065 -75869 -256111 -52923 -120208 143005 -188628 -123062 -66033 -93450
15382 -93450 172049 280875 159364 166736 -107930 22589 -107395 121080 64170 -94986 -33059
15370 33322 -2331 285294 102652 101114 51848 -154152 72156 90042 81582 273081 35834
15358 -89189 -30412 -5093 154380 256942 -60726 -69936 -128010 -101702 -27440 -177031 -421961
15347 -421961 22397 223651 -153021 -304039 -182460 97069 -14541 76814 58648 153882 -146313
15335 -42102 -98446 -95880 384467 233119 -53036 207077 35555 370403 117330 112212 374663
15324 374663 123988 55701 -58456 64369 -456145 -264763 -425628 -22462 109536 -335599
15313 265567 292297 9510 -270855 -228752 -18353 267949 -148131 301850 -132261 -186880 83679
15301 -152494 208359 258066 167672 24648 136371 -129074 -120735 37040 -115224 158736 146457
15290 146457 35630 80085 105754 -182618 73686 7125 124634 142242 -42698 331192 -94779
15278 155410 -30632 561473 -105106 169633 -260104 232339 -171798 -11670 182721 -292572
15267 13583 143452 -47289 37339 -170886 172786 63856 164974 -37207 142219 232634 13295
15255 213853 116063 77262 1934 -10870 84886 -65489 -26039 -143219 172106 130373 -205900
15243 427108 414191 151408 -33882 -17223 112536 522658 63084 115066 626414 766008
15233 766008 1144543 922708 941645 1267269 698557 519123 233640 304654 47188 299403
15223 299403 197877 -19599 40252 8516 94070 77062 82060 178463 -7386 -102189 -118618 36925
15210 -2592 60394 85616 -84683 82305 34049 105520 -26353 -125893 199093 264236 -1807 363033
15197 -118171 14334 -255461 69895 -395328 20103 22353 292136 240008 -185941 216172 140781
15186 140781 286413 -149627 -66245 -27543 69731 -1805 290578 254192 -42136 99121 -43422
15174 -107074 269331 -126708 168171 123716 29880 -93082 195541 -174107 -32656 -235418
15164 -235418 296089 44899 -55645 433671 32881 72228 406587 -26539 162777 -132688
15153 -43142 187398 110978 200649 132922 417601 108460 83177 -52498 21753 -171106 243894
15141 -31137 9197 -297588 -240353 -106771 175805 -76705 248294 125438 239988 131227
15131 131227 -106429 232740 232027 336493 195467 -13645 223163 4762 161042 121711 -14283
15119 28680 144059 147935 -165477 211648 34906 46429 285756 431631 133591 -310594
15108 271353 206165 226121 380511 -3430 162841 130533 46935 292587 279833 -103000 -190401
15097 -190401 121559 45973 317292 -137079 14557 -112947 -180980 27812 414971 220445
15087 220445 51739 284333 96089 2380 327073 74695 315786 5479 173059 289260 149141
15076 149141 18764 213042 246647 318108 386253 429865 -171154 250249 7258 -67324 345913
15064 214527 260008 133361 224989 -2575 326207 182674 180412 129675 130250 27086 109205 -340294
15051 -36478 -214913 -753 178111 193321 127908 -44365 400427 -81625 330041 -2056 29776
15039 146148 305291 132811 207702 326160 226823 76716 344967 108333 460627 390291
15029 390291 38553 404461 99558 145359 21798 228238 -72519 -4386 62813 53255 60611 246337
15017 246337 145627 330482 54010 -177087 267992 -70268 109874 49566 192730 382069
15007 382069 425683 503001 359124 341487 238420 119965 168425 414537 173284 -61779
14996 195248 424457 351735 192086 560284 -272056 70121 308096 344777 89732 164420
14986 164420 -30058 261321 363622 -73387 319860 149450 234797 162948 210719 255573 394673
14975 394673 -14841 43622 403967 49674 518524 366867 29880 286820 43418 311269
14965 311269 142870 168242 133902 332926 306296 381558 597811 25555 389375 249792
14955 249792 333067 364769 56994 641106 506841 114316 203889 236117 -34568 511757 294944
14944 294944 464085 334242 279137 508197 122795 54007 172717 3444 266176 92124
14933 672987 520428 159043 87868 541963 -68579 -137866 146636 21835 359157 -227604
14922 -66988 427332 343602 100891 91604 389033 223557 311086 277798 143222 377765 276345
14911 276345 481010 264723 678829 226576 364481 189075 162051 431303 238387 217396
14901 217396 314185 464119 344776 512948 348952 414202 -43611 45449 290349 477038
14891 477038 230948 39881 148916 73122 316368 366945 435875 17908 78237 210537 -64097
14879 422030 291824 203225 352749 257411 150913 572545 418827 202213 344557 217772
14869 217772 363438 610981 246604 494792 372775 422569 80827 379104 348764 383806
14859 383806 574484 577720 553806 449647 34818 381941 620386 417205 647240 362638
14849 362638 321821 540090 468945 301228 541590 452913 501104 424134 509058 421767 864075
14838 864075 373067 556048 267040 662564 469765 235947 249590 575790 514505 626266
14828 626266 400256 332416 497767 198721 509740 408230 521997 393345 563082 104781
14817 353284 243900 472542 642171 628798 210130 267796 228721 590438 596971 414549
14807 414549 718559 394934 465563 221456 204964 708435 415426 776405 651481 467945
14797 467945 337499 522099 478873 921706 427574 420985 553993 537303 486823 721049
14787 721049 640329 757520 379834 310053 779956 431688 472166 491949 637342 388804
14777 388804 423663 1046527 694492 802143 275398 852881 633363 369673 612519 314813
14767 314813 414616 755955 768014 407481 768717 503200 548876 583950 611667 764928
14757 764928 694290 858956 789087 753336 701205 770094 752582 603417 391699 443241 602689
14746 602689 354758 696432 478778 815933 481067 803303 723881 780910 795112 769938
14736 769938 648213 520024 682512 991611 574902 797372 695047 662112 529901 761436
14726 761436 653867 414401 643713 511146 989101 630814 475615 616689 643071 515318
14716 515318 574923 788827 593886 1134879 628747 751079 1211915 815358 769317 638080
14706 638080 975088 710010 772774 640987 683129 505478 849832 967869 723022 1085901
14696 1085901 726291 834292 944661 1030543 758635 637386 830397 902130 808593 1133679
14686 1133679 751601 1014311 993358 1122058 649096 830262 977696 1044782 748054 787712
14676 787712 702308 803098 1092463 967256 823938 810240 1104435 1172669 778201 854421
14666 854421 1169156 968445 1220602 1131123 842668 1287127 1114108 894233 1300131 1240581
14656 1240581 1096757 989014 930465 973889 994419 1011485 1017111 1133727 1363094 939569
14646 939569 1186294 981193 1104654 614178 1163614 1079363 1106993 1111651 1442352 1174035
14636 1174035 1114133 956077 1367716 1096764 1308028 1057884 1266052 952485 1419038 860567
14626 860567 1140824 1335684 1126093 1208339 1589841 976377 1353510 1387294 1316264 1344745
14616 1344745 1223685 1456348 1305267 1431527 1381719 1966236 1379680 1264053 1289921 1827745
14606 1827745 1331450 1320031 1329166 1413061 1467445 1488514 1284830 1501382 1394098 1705150
14596 1705150 1634567 1502232 1592177 1541942 1580368 1662513 1398951 1608844 1640125 1493297
14586 1493297 1545758 1367245 1753305 1985722 1802889 1369363 1226022 1527637 1451571 1743885
14576 1743885 1583506 1900587 1976155 1890544 1997483 1818572 2159673 1476395 1978802 2026076
14566 2026076 2172560 2044449 2032326 2149240 2159873 2085129 2162085 1832147 2320940 2434401
14556 2434401 2339839 2267387 2391436 2596769 2228595 2652045 2797321 2657272 2698029 2620588
14546 2620588 3166232 3105161 2984637 3393974 3103074 3863345 4044061 4350364 5278211 5562935
14536 5562935 6769499 8010637 10105149 14658756 20928726 29510366 29457609 18982968
14528 18982968 12718648 8371119 6184693 4592977 4021919 3329970 2979601 2489598 2358817
14519 2358817 2810663 2338574 2453965 2264195 2250521 2532693 2367611 2458329 2337610 2605277
14509 2605277 2148890 2767878 2472197 2570261 2487035 2310792 2521225 2474115 2530988 2892836
14499 2892836 2833897 2815322 3251736 2927005 2919214 2828136 2832211 2956293 2937207 3076246 3051821
14488 3051821 3057381 2916788 3202619 3278655 3436785 3265569 3291064 3057538 3624908 3211382
14478 3211382 3644565 3113325 3478013 3664672 3784936 3466299 3719491 3871165 3818046 3794935
14468 3794935 4041195 4134831 3796061 3900273 3778913 4004269 4141982 4302270 3912809 4319369
14458 4319369 4133058 4556460 4390208 4351121 4585450 4723638 4491003 4754398 4631973 4752930
14448 4752930 4762243 4687039 4789157 4809963 4916278 5278980 4954859 5327722 5049281 5147464
14438 5147464 5588486 5417014 5579331 5587751 5553572 5905435 5699538 5748411 6113171 6023350
14428 6023350 6246465 6147535 6354994 6461209 6147529 6516555 6945358 6670373 6635620 6360825
14418 6360825 7059536 6690882 6926905 7231155 7230975 7210325 7434063 7489415 7522090 7878439
14408 7878439 8208975 8256997 8086150 8329682 8171040 8534020 8508305 8561329 8594216 8850522
14398 8850522 9054210 9178927 9306370 9526083 9601329 9352741 9744873 10224002 10165925 10288488
14388 10288488 10249942 10547726 10689482 11099825 11032450 11382770 11425673 11812997 12130162 11830033
14378 11830033 12554983 12629231 12793388 12969332 13596236 13099869 13378253 13670339 14388977
14369 14388977 14471857 14389148 14744240 15265078 15546243 15579831 16359966 16377219 16670792 16613777
14359 16613777 17185359 17746571 17941334 18469247 18582062 18779035 19553536 19769080 20213862
14350 20213862 20873319 21301319 21884462 22150593 22799140 22755565 23461850 24081098 24612801
14341 24612801 25125235 25687183 26657357 27046585 27613702 28847213 29102732 29661128 30723267
14332 30723267 31285085 32162796 33093486 33813310 34978026 36001936 36767542 37918411 38814246
14323 38814246 39899039 41203053 42594565 43848629 44904715 46135462 47767321 49241557
14315 49241557 50459437 52110712 53849795 55448277 57562268 59398520 61810681 63327250
14307 63327250 65788999 68101468 70604225 73254310 75648612 78636306 81593050 84676340
14299 84676340 88029041 91334753 95109690 99199587 103563515 108001934 112438526 117097804
14291 117097804 121938656 127709349 133201421 139169311 145697439 152537284 159491925 167430041
14283 167430041 175098897 183769079 192232425 201981616 211821106 222483158 233665950 245008721
14275 245008721 257448063 270089204 282867236 296493795 310053254 323808527 337814722
14268 337814722 351179388 364597147 377014745 388766772 400286283 411597321 421938817
14261 421938817 430848005 438523786 445531179 450572581 453751950 454738112 457488320 456770121
14253 456770121 449785284 442276038 435552132 427693120 420118145 409942108 398486485 387451143
14245 387451143 373612572 359494751 345372519 332417630 317512345 303386370 290647876
14238 290647876 277788943 265308461 252603407 240265455 228322509 216542647 205061510
14231 205061510 194548932 184979779 175629893 166992308 158839601 151249775 144454487 137889871
14223 137889871 131773662 125704473 119999415 115007761 110056034 105407839 101458407 97352499
14215 97352499 93333915 89543010 86034637 82888391 79667656 76601273 73831420 71454171
14207 71454171 68478906 66558318 64194812 61688865 59969006 58033067 56024408 54263463
14199 54263463 52719400 50936227 49516931 47931661 46474373 45451569 43939203 43045291
14191 43045291 42103686 40641655 39282779 38247956 36950565 36111539 35720952 34490692
14183 34490692 33505506 32737486 31885058 31310713 30505113 29806312 29334878 27830395 27672520
14174 27672520 26718705 26258021 25523817 24936983 24504232 24094028 23506813 22946464 22404087
14165 22404087 21876953 21604700 20849562 20768896 20218337 19955560 19032405 18951252 18492110 18198297
14155 18198297 17709019 17385817 17260415 16940320 16499919 16518680 16245076 15707607 15541708
14146 15541708 15348731 14854806 14459817 14099459 14226016 13637825 13644276 13524923 13262425 12920246
14136 12920246 12876389 12441927 12367536 12169270 11799393 11588755 11360881 11443499 11335370 11065202
14126 11065202 10878802 10834548 10330351 10449756 10481516 10105823 9940236 9962487 9630294 9704227
14116 9704227 9453563 9213642 9318182 8885017 8733267 8798683 8808536 8914415 8475022 8156821
14106 8156821 8463857 8018901 8081158 7912953 7762680 7674601 7756041 7540680 7372049 7311875
14096 7311875 7482303 7275295 7202056 7143639 6889304 6650970 6853746 6533345 6480003 6657970
14086 6657970 6548003 6468698 6094156 6322021 6127475 6130336 6144441 5877380 5769975 5819201
14076 5819201 5677931 5574347 5552010 5574201 5576568 5349807 5128412 5098287 5202250 5283062
14066 5283062 5184642 4751158 4907677 4709091 4860525 4872588 5035045 4676564 4796417 4463863
14056 4463863 4637557 4715326 4604962 4296323 4529702 4515876 4235305 4261646 4173756 4366788
14046 4366788 4353396 4115059 4187434 4324406 4360511 4120904 3683395 3878629 3932108 3925247
14036 3925247 3676578 3784915 3831200 3445406 3607328 3753788 3309741 3408089 3585431 3967391
14026 3967391 3258062 3152487 3168175 3542267 3136119 3257124 3320832 3190086 3289478 2906676
14016 2906676 3083779 3079361 3233942 3093209 2952092 2810209 2856637 2936067 3101021 2884163
14006 2884163 3013614 2862632 2942140 2780141 2434824 2870130 2620734 2659371 2768425 2664417
13996 2664417 2599854 2635987 2418877 2273785 2565811 2533540 2620596 2563570 2299771 2431177
13986 2431177 2206958 2711084 2060040 2201352 2667606 2788727 2833159 2728870 3489201 3433693
13976 3433693 4285009 4969695 6868547 10129143 16145263 25626518 30365092 21050752
13968 21050752 14422892 10782556 8156456 6464295 5432313 4543418 4221688 3899975
13960 3899975 3563621 3542921 2830590 3020545 2744223 2734122 2896690 2793298 2529206 2776418
13950 2776418 2529983 2269220 2079935 2466989 2125609 2359806 2220538 1984658 1934538 2286474
13940 2286474 1937192 1893200 2218973 2234606 2228032 2191428 2179941 2089939 1976860 2127713 1858199
13929 1858199 2081292 2288557 1839996 1548597 1991934 1981493 1748019 1671094 1710625 2114916
13919 2114916 1797198 1948140 1529710 1831468 1682236 1758727 1816867 1710117 1349179 2015515
13909 2015515 1592687 1884370 1569751 1686738 1595599 1815260 1585466 1512128 1699738 1495595
13899 1495595 1526599 2109690 1351452 1701254 1550639 1342944 1585854 1318351 1733561 1577554
13889 1577554 1082005 1594735 1714162 1412727 1420047 1285010 1579227 1372328 996905 1500310
13879 1500310 1375808 1351105 1496559 1393478 1408400 1431284 1263139 1077173 1413357 1240221
13869 1240221 1444056 1360680 1221992 1038827 1187023 1192878 1244447 1474763 1449008 1064891
13859 1064891 1103894 1238549 950243 1318822 906234 1215278 944637 1449886 1463942 1209546
13849 1209546 1041059 1147931 1111800 1304048 1230091 1042411 1296229 1410773 1405832 1221740
13839 1221740 905417 796621 1128932 1185061 1089837 1135399 1042406 933598 1107976 811238
13829 811238 928697 1141075 898860 1114703 810377 904954 1146862 886610 956317 1014884
13819 1014884 1097429 802377 1225082 1285076 667064 1086574 1168355 1164882 956489 720121
13809 720121 681792 1203314 938913 1018039 808493 941597 612591 986850 1155090 1119284
13799 1119284 1032687 921220 894330 1077571 889545 988744 720187 943153 848502 780463
13789 780463 1069728 605221 953014 842657 833758 689799 630779 898061 719282 701161
13779 701161 815856 952177 871473 937743 934746 777453 780669 1039128 625623 1061517 726875
13768 726875 1334726 823590 703631 800302 968462 786639 377985 828437 671256 714387
13758 714387 759947 540765 949798 739388 625802 911474 733958 723603 669483 495357
13748 495357 922026 866047 775058 876558 507170 769500 470163 723559 652234 722619
13738 722619 578667 614781 490135 1018431 289593 465764 520275 341767 754341 747838
13728 747838 798870 852365 622526 677112 481060 569841 650300 712169 451797 552397 208853
13716 588418 1016924 575209 497749 661631 682042 779476 268313 713645 380549 725246
13706 725246 280554 559866 446972 639368 619635 706178 805216 521745 774890 856488
13696 856488 595787 532632 781612 715037 598730 748280 349957 530133 383863 686822
13686 686822 800301 626555 595726 426800 849262 566123 387388 446051 322986 737154
13676 737154 378939 695396 658066 457528 747777 598733 333148 328283 346385 369285
13666 369285 427276 40970 706847 240982 556859 638225 338195 342081 407480 475415 424302
13655 424302 462494 324534 839786 317319 500170 324345 317287 547647 573884 820450
13645 820450 882321 430705 560763 462410 374321 431985 495171 706780 604974 251761
13634 461529 569058 270750 658383 272876 771707 497529 494961 5469 388708 448482
13624 448482 542273 501166 795703 270793 156772 553459 488419 466640 434268 471581 548418
13613 548418 613331 321630 566621 532952 372507 -87079 227896 486554 62861 540163
13603 540163 293878 508229 588958 329779 585631 306244 344086 218911 264149 234415
13593 234415 572693 98723 421760 -41900 348530 348509 276693 366667 394845 482914 352477
13582 352477 386869 172568 201945 412388 503027 743484 710161 354116 321542 743453
13572 743453 594452 379368 50281 427120 263178 -97079 217692 462898 253270 456060
13562 456060 106754 245430 370912 377848 270147 72185 246629 296167 251612 543956
13552 543956 338557 492414 465425 111002 728068 381733 316702 567142 298557 324258
13542 324258 173901 331593 238181 170700 467891 316664 -6889 526926 67563 533146
13532 533146 411559 315395 -40164 373351 317214 193581 53283 180313 413587 290398
13522 290398 296307 265080 425070 291233 202393 303221 406726 520608 288850 524904
13512 524904 268918 525623 -18257 420997 135147 118679 301069 317413 -43111 394356
13501 -25719 216301 234899 -112868 297833 222148 262104 216632 21911 539989 415250 288761
13490 288761 420105 170579 282781 445945 233347 201257 468352 408580 243854 -75010
13479 482533 483642 326920 301677 180529 382333 131781 -13855 221035 -18969 172077
13468 525152 387829 291971 286365 250116 260199 -184283 419102 316801 353878 147245 368109
13457 368109 -23037 199642 456611 124378 -101308 135122 212274 450802 455668 31581
13446 -152800 126730 324460 95509 209366 435773 98767 386924 371998 464537 -48180
13435 56628 226131 -299131 455305 736067 282253 92796 50814 241438 152209 714747
13425 714747 379422 254259 295719 249447 192087 285764 -140117 408756 492605 326670
13415 326670 178534 319743 114464 389661 269875 418983 371799 474201 149088 110477
13405 110477 399885 342855 73227 64299 95759 34504 143212 191691 247690 229428 473889
13394 473889 43578 26223 364536 634762 212498 354087 507546 236260 244765 93172
13383 326615 28061 564188 603187 186438 618193 300722 -84480 269262 285935 22563
13372 90620 17457 171735 103653 621018 227715 117214 188272 249237 211295 113902 -21857
13360 654852 75982 283878 -34478 98010 481851 381508 -109979 388172 335750 418056
13350 418056 263171 329611 149253 117121 341907 185223 291125 3027 21091 664 246927
13339 246927 -213791 216668 426184 28484 134784 172314 295051 96709 448800 344682
13329 344682 145841 -222247 118939 323966 583313 147703 289764 330218 150927 -9332
13318 165740 98373 134588 103070 77367 431823 310282 278240 600148 343261 393179 335982
13307 335982 318647 8629 192954 148447 482640 -71103 203118 -28473 437410 -26267 -135811
13296 -135811 368606 241032 180909 -32906 17833 194799 468949 123544 -275461 244423
13285 52987 199161 -38662 219318 -36197 -27744 -11890 417183 224487 180988 295450 187713
13274 187713 175637 236511 111953 78529 148296 78618 148916 31650 -84081 35578 31670
13263 31670 43784 184362 81229 245076 89711 -168214 83720 219723 85268 6612 229833
13252 229833 304341 409350 -20379 270656 183968 92576 84769 348693 29309 -21693 -63531
13241 -63531 58919 377697 162058 -158065 119941 375954 211894 201951 2683 143601 96567
13230 96567 216783 271966 -45188 -67803 -259575 12033 182056 113642 294961 191724 224925
13219 224925 67883 -144333 291019 144638 -48376 267554 -32328 290644 112628 214699
13209 214699 -54984 213006 214010 237793 4297 279922 72241 288861 -15046 -51507 -34333
13198 -34333 394682 300155 334607 37802 -100590 -2317 246558 214612 358678 -195679 136264
13186 171160 -197352 -11437 1622 302793 44987 375104 362569 -58229 38391 -170755 229413
13174 152827 221772 108137 -295303 434723 278465 21616 9791 159167 479803 -298 118724
13162 -98574 -22320 206135 132392 -43483 34543 -29726 -30851 -62975 129987 -26171 77323
13150 327629 -18555 328566 9267 -65294 83587 16565 225319 95608 140299 274705 -127713
13138 -74446 2769 -152024 150594 147099 146475 29601 -31258 198172 -111267 229085 161112
13127 161112 101342 294133 -183625 -198077 416616 -63558 99191 37879 -25578 -158627 250808
13115 169328 216959 -101365 65568 119568 35485 32435 357505 -324834 -89065 39956 -63952
13103 39786 85128 143934 264120 275270 213186 290392 50853 146616 302372 -16180 260129
13091 -112341 296970 320860 27619 2327 77204 -142603 274488 198669 -158544 -20845 -96959
13080 -96959 139946 -41283 58301 52793 143769 255011 9787 -285035 288327 245222 117774
13068 53504 -89526 72818 131348 254186 -415480 183448 -103305 270607 96694 198144
13058 198144 -151409 118152 154564 17002 -196420 129940 9445 223255 -51203 64557 348925
13047 348925 46706 167944 -54673 -63821 611962 76665 189924 225172 -145163 209052 -31192
13035 -112921 4776 180151 106556 -31809 127288 -347973 -13841 115069 169889 231583 207389
13024 207389 368420 282018 163702 -112853 -158172 121414 130048 107813 207901 234856 277985
13013 277985 -64191 29548 83753 40779 294813 -8864 113355 -195751 51641 -28157 234850
13001 121190 184386 -30138 -75396 67359 -906 -68165 259797 18404 124328 129170 381006
12990 381006 -133920 -42405 245692 -175795 74074 231850 -36647 147852 -17500 300815
12979 114090 101657 85170 -109434 415596 141893 210637 80418 123268 154233 239857 -37831
12967 -3684 222446 151582 239534 -139119 287075 382002 -143975 -332626 -5238 79196 -12310
12955 -185679 231916 63897 -19644 79948 152704 186657 191576 -182534 -113464 138684 -84130
12943 286808 83596 -60181 230028 189500 -232807 29920 -89696 -188058 36659 -87805 -106927
12932 -106927 -33068 63452 53434 -42591 -102752 148389 220564 380073 -167148 -71950 181911
12920 10257 -127600 -309118 5204 -117208 35663 -207000 88352 -149924 -112618 207827 324156
12909 324156 -235111 -37981 51760 33417 -28508 -5530 162709 51716 56963 71875 210258
12898 210258 168439 -316554 -14662 172355 291121 -105845 245231 35928 -174179 -108049
12888 -108049 9351 117289 209769 -1017 18107 23778 229957 -61969 434383 124386 -194970
12876 69930 65728 -57505 19213 395295 -211061 -3071 57152 -14248 -199929 -48564 -198422
12865 -198422 -13235 -106752 -19678 132370 137663 -98329 -245226 112063 -84400 3627 46498
12854 46498 -158361 -98063 244880 302025 177822 257537 -200709 122838 -71399 27527 135088
12843 135088 75227 165071 -6748 83218 92533 50195 170487 -39592 -193188 -295690 -325648
12832 -325648 -148226 218159 64549 176963 -41933 245137 33722 -37769 338735 332767 49557
12820 -269537 -176698 -203310 -287790 119283 -189776 890 178384 -173211 52863 -278839 153064
12808 -13534 479134 125791 2692 -178637 234587 -163255 -64926 -113811 -43207 107936 455622
12797 455622 -130019 82993 147270 145497 459369 -298236 -28114 -92031 418193 -36322 89529
12785 120381 71651 122373 219503 205625 47524 -35453 370750 -61371 -42060 -20011 140016
12773 -317776 -67616 157976 -334207 -242021 -148939 79170 -80119 115787 -143240 15748 -38164
12761 -17570 -98286 323303 258234 266889 -162575 -63220 53522 211548 -39547 346008 -14665
12749 29177 142493 -13864 -83539 190300 167364 -72126 293774 -74629 -49957 204100 -117085
12737 441050 292726 110784 34646 -147833 -471871 47902 -37735 -190394 326052 80623
12726 -119746 -9021 62475 182022 113224 -164262 362421 -55847 -240619 80810 192672 107790
12715 107790 230767 223656 -79591 161251 -365037 -201830 42836 -239318 110407 -157288
12704 -11433 20186 -137116 101513 139203 143002 271905 -146809 33059 -104189 20983 189582
12693 189582 395651 165036 -7015 328176 323473 339901 340818 455391 283926 13832 -6333
12681 -143782 -293371 188251 254854 10939 77613 216555 70510 212416 157048 195655 123325
12670 123325 246093 137367 319926 -59690 60513 466921 121664 74451 59308 91997
12660 91997 237842 -92698 131438 107739 76715 136403 343957 210670 -97589 220414 204136
12649 204136 -134732 188858 -77173 -443708 91167 -108497 338882 201919 -129245 14942
12638 -39909 246898 129254 46289 171675 253483 -123837 -80073 -105840 -178420 114509 54846
12626 345331 172365 -66424 349830 163070 314388 199732 157922 -20531 237338 128396
12616 128396 -194353 -95125 279502 151123 -62189 108505 318652 151247 271140 37345
12605 161681 23891 96795 229699 193319 -190816 -32432 -84836 -103553 -252512 -187425 48913
12593 -170310 209281 24039 -231231 -12843 148502 -23616 -118675 -224655 403387 304059
12583 304059 42657 370273 231227 -12557 31793 -66242 -108061 22201 -79626 108767 -243177
12571 29800 -432151 -11011 -50740 -102260 56067 283616 297680 -206767 378242 -140305 79593
12559 122436 129223 77060 -124181 -100879 70490 -11723 109562 225137 65372 17332 -148347
12547 -129515 169840 325704 -8323 168722 78787 12069 -3371 225434 126578 82010 -32917
12535 358616 -155022 -2237 -47947 -127290 84304 1665 -659 20456 -59007 -25321 -181553 -34369
12522 141845 109223 3579 171993 -87554 187628 231506 7863 19093 -77485 19924 -62345
12510 89616 32169 -133262 -86880 -60024 15100 -8142 11485 -79754 218161 -60308 148456
12498 166931 83274 -213305 -18588 223819 -205166 -145585 148121 14633 -194328 -54419
12487 -17180 123046 14544 255093 -110872 -183721 -160167 -99506 243240 67128 -15550 -76691
12476 -76691 482768 -264528 151593 18298 -91907 -37059 -66466 -66750 130050 -225119 -86716
12464 117607 20385 306739 82171 57075 -58959 61840 377159 144668 -9856 -67296 -75026
12453 -75026 -126945 -108953 30423 -5784 68023 42097 72605 -56511 67054 324996 59376 -182810
12440 98043 66480 -204917 -57947 328823 42222 -7165 38919 -303702 277660 98850 169808
12429 169808 96566 34253 56590 245344 -81272 -9224 -34573 113864 23437 -124153 11688
12417 -331138 224811 -198299 128923 -60291 81107 203152 49300 -168819 158053 40303
12406 -96579 -154205 106548 57051 -157094 216931 -243091 -68343 211791 -54309 98173 -51039
12394 264200 160377 -133219 112108 -51450 226066 33392 -13076 -103714 -434944 -38268
12383 41181 10965 54241 58484 152023 7923 -2950 -253457 -78215 50332 25559 68591 185397
12371 185397 98437 101400 -104687 74621 253633 61159 -131686 36582 75406 201606 360636
12360 360636 22838 48670 -186907 104317 -74876 218444 -47460 246591 -290763 17431
12349 131280 189104 -81497 422970 -335265 -162868 -43798 -12045 -68850 264665 -207083
12338 70960 103836 74673 -40006 -57882 405362 164859 -155047 -446952 -134204 -198049 240899
12326 -92522 -16297 -42928 -3168 146677 37278 -22837 119102 -245529 81567 -366069 7714
12314 319786 44929 -29829 -275805 -71395 257274 -38626 47286 -276075 58251 60153 218743
12303 218743 23734 99694 94712 -84727 44885 -143305 47600 426573 -428829 178098 -105491
12291 100070 -355000 37451 -27437 -495095 4002 350629 66903 -308085 24801 91997 89985
12280 89985 165527 171833 52674 21109 -47079 -50356 148234 71574 -122871 184675 11404
12268 -104567 -219391 80436 -123838 175535 118909 408451 97024 105182 314313 186379
12258 186379 170166 104403 -268469 135187 339016 116012 -182861 -89659 -237212 484014
12247 201417 -43709 -166040 344595 -47263 47326 157352 -161680 325615 154938 157863
12237 157863 -120564 322144 228807 258970 -115640 -311821 234211 189664 176183 -9813 -242299
12226 -242299 5822 122945 -6077 249451 207382 -87904 412729 237816 -201875 75453 504428
12215 504428 222628 233335 66602 80039 470760 258815 545904 66239 194470 258321
12205 258321 -66267 314352 348603 250040 407035 173271 72387 -20585 -248290 -87412 270343
12193 230856 222020 -53183 168196 154945 219705 37275 178929 40051 -131285 235461 410860
12182 410860 -56832 -14835 62776 164589 413701 306182 144623 -198386 8618 252968
12172 252968 61144 234724 191173 -37056 229307 128262 209624 105240 119932 -30358 20825
12160 381760 25636 446953 56874 -19321 58679 -225312 135292 269794 -133221 203657
12149 131122 300808 66900 226855 183717 203117 215456 2359 -7673 10660 208226 -333978
12137 315787 42879 48502 106243 -72619 140120 -41851 147340 66237 43413 284222 475886
12126 475886 81951 -58887 38950 -164226 153348 -63443 82148 114178 17534 197501 5303
12114 -25004 242315 188887 41182 -210742 458999 -2189 365723 26401 -295874 186776 88757
12102 278306 198434 188021 362951 -123419 -206780 74052 -186106 -69524 -51133 111426 93211
12091 93211 167194 -19598 92617 -90304 -109952 -163890 135925 103669 -102687 81596 161602
12080 161602 225556 307236 191766 -125731 20790 115755 -79218 208490 349109 121338
12069 -30497 317724 116825 130138 157903 393803 668831 838163 1134725 739654 668161
12059 668161 53917 102067 -129189 -20024 -146572 -405764 295852 187713 -98904 -111916
12049 -111916 18785 -30743 55782 161719 -201476 -499981 -120799 244785 90910 -111769
12038 -74441 -233013 -108932 57597 -310845 -156390 -220635 53328 144494 -204803 -249470 104238
12026 -106851 -46925 -20905 -20894 37224 99293 -345069 316741 -212653 -118015 -157702 -244567
12015 -244567 -372800 -149615 -585942 92272 149584 97682 -104466 60734 -16039 367186
12004 -71306 132593 66441 59444 -150868 -135370 188417 -176722 101976 209537 -150307
11993 194430 -70288 -127714 -20268 181114 104993 -210058 340229 -61348 78482 -73675 -92638
11982 -92638 137397 262809 144270 -68813 -149927 33797 411407 -114444 243762 357179
11972 357179 -173183 -32976 21045 142977 35344 -274330 -163062 -247847 34629 107928 -133482
11960 186422 281458 -281344 -230536 287148 -121743 -112848 -175396 -13754 117770 2998 -6775
11948 -148247 -266030 -266436 -55176 -122253 26703 -202429 -322415 -28826 -238251 64445 -30514
11936 44439 -33329 -266223 -376284 -123568 -58163 165317 371095 -7640 92206 85209 375629
11925 375629 22005 33188 49602 -74722 -378618 -74751 -113069 -143636 -277744 283441 -122625
11913 -135746 47724 -15001 -213189 -117471 56547 107640 122303 210520 -54883 39080 232141
11902 232141 259412 141697 -31036 -60893 -65556 -24713 -97954 196514 -25560 184273 -61511
11890 128934 29922 156982 276284 -59849 -54286 -100791 22452 78038 236355 225115 -154336
11878 -171545 -323557 -323833 218507 -63448 -52934 300718 -126975 -66906 -162167 -112014 -352611
11867 -352611 -45596 -114344 -420656 -253978 18501 -181948 -19679 -162813 -346904 214731
11856 -239549 11920 217579 169532 154266 233558 119186 -130635 -119033 -79177 -213743 84526
11844 -76401 245816 -148510 82561 -222799 -332712 -132047 -21292 -189842 89737 -56629
11833 -231033 -48221 -217709 -164412 72252 -313012 21792 -239685 -1062 -186176 168443 92694
11822 92694 28667 87965 -236030 138350 -90281 -86631 -66306 78300 46246 23515 74018
11811 74018 -32990 48077 -483730 24798 -151427 150999 169864 -110825 -171352 -70755 -167894
11800 -167894 -115307 175921 7876 -11848 -121209 -8984 148726 33323 -16281 -147007 124461
11788 65513 88366 48148 -69962 94546 252516 -202491 30396 -41798 141385 17225 180312
11777 180312 76430 -248696 1782 -140707 86028 276159 109069 -146068 -321984 28603
11766 -86150 176095 -255141 -155492 -207288 83865 -139362 155395 -105088 36017 -160462
11755 55617 -237575 261 -200500 73793 -407147 6142 -44308 -371615 -95954 38156 379955
11744 379955 -25152 233994 -89856 136436 307062 -132434 -189949 -158153 -9963 -162489 135487
11732 129990 -128834 -55186 -59873 -5498 328268 218666 -169116 190593 223846 292568 -233965
11720 27717 16360 -345624 28414 207332 4280 129517 -231516 -83948 -53623 238058 -23299
11708 237876 93635 181480 -162047 -177714 34319 104447 746760 110494 132024 -153457 75210
11696 -294116 -97665 -18143 58928 -181486 -149753 274488 79328 216089 90672 -48508 90847
11684 156231 -81978 -220848 168082 -141075 488912 115455 68239 316607 35386 40674
11674 40674 -286654 -15700 69376 -160851 -182953 -8431 39075 114061 -221443 -49767 108275
11662 -113198 -144388 236908 179418 116354 24649 40055 118583 -195149 -56431 -174311 167619
11650 -58955 33009 22398 -50895 119484 25967 143967 -17401 94248 -123015 227475 -92982
11638 413159 -46268 -134315 80676 -245315 32409 -140051 -3107 -47346 -5 76881 -57001 -47400
11626 -47400 26307 30239 2221 277485 214275 -1374 21840 -264660 -79923 -236637 -312273 168787
11613 336782 210644 -158649 309971 81519 98876 69061 -155735 55002 -79858 -207970
11603 -207970 90583 -345801 147175 -42589 -149553 12186 -377458 31096 301456 310449 101761
11591 218637 154232 -63337 11963 86124 53345 -58212 -424241 164252 -16759 -37598 117631
11579 -37534 178197 -126527 908 -148758 -22490 373815 119267 -132223 -28087 78473 433494
11568 433494 148981 76325 5276 480301 224917 64812 -186573 143204 -283789 132831
11557 29946 202012 247624 -111322 14111 -117641 184475 230242 224252 -158579 156782 -187738
11545 -388324 298535 80507 -179433 252218 193651 -2254 -168747 385336 60581 99503 188340
11534 188340 -32857 -134179 -33284 -243657 -5897 50267 232777 -273523 -76103 224332 -117995
11522 279443 181735 204882 -38567 -200027 217367 108112 114737 -92982 70041 -100826 -221030
11511 -221030 71238 252220 -86900 -212400 375355 -270997 -100334 -76918 312724 270439
11501 270439 30214 87497 -97946 254580 -100354 -117954 -194550 9210 206146 305635 -10121
11489 69125 155518 157084 168867 53168 58935 47882 453183 125397 333688 125854 205274
11478 205274 201160 287977 -31034 397563 396313 94838 64582 149117 354842 26790 165101
11467 165101 90380 186646 206147 -294266 -51200 309542 157013 7451 130706 119685 100671
11456 100671 40728 -147933 378360 163510 3308 202134 354700 120313 237925 -8765
11445 -66254 -17874 283133 161142 364990 460944 -55056 -6731 -24155 19377 102351 140905
11434 140905 167927 -18428 104006 247184 119518 71971 -56894 118410 351717 226068
11424 226068 465502 -172205 -131647 -54590 148867 246165 207101 -167632 44194 -70492 -108199
11413 -108199 -106516 252360 31536 24191 165867 -88001 -119276 164442 -58483 80544 107956
11402 107956 -37814 -9900 -246571 149940 187093 90439 188344 14165 120085 120432 227579
11391 227579 -183640 325128 10916 -16592 8381 -190023 326735 -152092 -287302 337356
11380 -3662 89708 -70916 -86951 -56864 -28407 90533 263812 -32781 76775 217896 437978
11369 437978 -155300 228538 -268411 106362 -61127 -143271 -240901 206617 -331707 326116
11358 -219224 -190249 302220 -61713 -150551 22906 164555 18222 -203988 172552 -189749
11347 1795 1347 -379303 -280006 -89026 10759 -163359 99038 -110798 45985 -360600 -61086
11335 -321389 236787 -303676 90 228806 -308171 -1338 71797 -139460 228302 192101 273602
11324 273602 -55985 -112623 -73608 114735 29551 -178686 -17615 -24937 52711 -183662 116371
11312 20726 136918 156468 124352 85153 187682 151366 11969 -184490 141137 -65384 -162303
11301 -162303 41342 -9492 142667 42479 65172 99615 59679 -76233 -112011 106846 146307
11290 146307 101665 49149 192528 25538 -64099 244268 -282972 -63750 56286 -338331 -377845
11279 -377845 225397 -117005 -92693 -137993 129103 116693 98587 182929 200038 -260308 -63094
11267 -44816 -34649 -31675 -327440 -284938 -430992 136869 -307089 -51114 23560 -328078 -122586
11255 139512 -96884 174487 -151718 -70079 -277886 -189687 -314763 186189 12212 -342095
11244 -226768 198640 95839 256187 -277567 163192 -97 46530 -101726 171758 -187700 -260996
11233 -260996 939 -121680 100409 105653 -83900 198131 -130599 373694 113251 169073 -93796
11221 -409629 44265 105863 26121 166289 -32744 -392466 -59946 -141944 33539 -237879 284411
11209 133179 -59128 -198812 137667 -323342 -84643 -162718 -297104 62343 -24731 -106787 -5917
11197 114459 9618 -404516 -287109 97330 43705 -208823 79505 -128752 128740 -223608
11186 -57968 -158123 -76348 -255260 -227142 -9635 67002 -308254 -323156 -170630 -250003 -229396
11175 -229396 185933 -155732 170948 45920 -552718 -146187 -49230 206718 29364 367214
11165 367214 575224 -58452 83429 40875 -302323 128295 -47353 -74662 247017 -107396
11154 -19044 23343 62551 142277 -409085 73537 32152 -28447 -11989 -31854 137109 127383
11143 127383 350578 195353 -48439 40734 -395988 -112025 -152518 84282 -44549 127851
11132 -91120 -153020 -328864 -78401 -96844 -127408 40642 141869 -32607 186683 -263816 -52857
11120 145582 195580 -75854 -177333 102741 -148158 -154065 202963 -224446 -8100 -147534 283130
11108 134863 222469 94362 55566 -8489 146052 239285 132282 -76642 -179146 301794 12367
11096 20632 79233 49876 57888 304245 33868 27111 192013 538997 260192 -56636 139823
11084 43742 273379 334953 363501 58402 330482 64617 417441 -78474 177061 360622 177401
11072 186249 370734 359469 82449 88346 257731 -182089 561244 192474 236898 299660 156643
11061 156643 380288 356661 17250 147749 176112 261849 471546 375971 376811 87205 583416
11050 583416 148452 449735 259581 600180 793028 571626 526577 387084 656642 534930
11040 534930 926892 540704 825698 905037 769600 763996 839850 734068 686171 721214 402024
11029 402024 1044216 841160 652228 588338 653920 790467 645285 619496 733870 819155
11019 819155 991135 366969 731921 800212 550019 706464 706172 719559 791866 941961 799667
11008 799667 711339 339936 703595 1000705 533370 461934 724892 690980 667122 303114
10997 863192 808261 941523 204616 714192 547876 694903 456932 573730 694511 500150
10987 500150 504304 736378 787585 785914 599826 622588 726008 770373 561217 842901 805790
10976 805790 556288 959159 691523 984944 957617 1075480 789471 1004710 1220534 1283516
10966 1283516 1138762 922280 1385162 1609484 1543339 1793825 2005495 1897863 2310439 2520467
10956 2520467 2553255 2764020 2428890 2676761 2434767 2177956 2155766 2463471 1643335 1993912
10946 1993912 1801889 1842204 1653466 1675966 1747309 1866896 1684753 1562703 1597240 1348688
10936 1348688 1444837 783506 1363708 698950 612960 521860 527595 430706 562671 363124
10926 363124 147409 270087 429762 298616 197563 243463 412605 136316 -154066 2659
10915 102598 227236 119538 273949 126805 48166 223185 191706 21595 -333034 -251258
10905 -251258 -47484 -235059 243535 74040 44927 133658 -233609 -287618 68753 61744 290305
10894 290305 385548 -199996 -22510 -45921 -167562 57658 13437 271179 97836 -214819 -50615
10882 127502 -213909 -156988 -128959 -81443 -51910 166830 -5737 -63301 41369 -278887 -214589
10871 -214589 74508 175711 -39564 -153834 50658 37022 176399 -46128 11754 -397467 123083
10859 26598 -109227 -171699 88946 -180243 -76719 91835 -214249 39726 57630 113010 -128462
10847 -395062 231223 -229210 -57586 928 -102896 137515 199444 -93037 -185025 255634 -234771
10835 -194497 127892 81694 248337 87481 74405 77030 246446 96576 7337 -214320 -180594
10824 -180594 -189137 -133269 -47064 -153654 -29722 44676 -183810 -42936 -66245 180954 185029
10813 185029 191035 -80448 65824 -112664 286311 -222860 167308 -196346 -214450 -81229 112105
10801 -147823 73259 -87836 96507 -136818 -170753 -65893 302283 13080 -134787 -395222 -310528
10790 -310528 -75273 145422 81771 157214 -180078 -162435 -104630 234392 -173070 -64228 -17413
10778 11649 244937 227173 -75822 30195 79695 160289 -11073 -181025 -26107 -121097 86462
10766 57568 -412219 -91543 -96094 -259720 203367 31607 172477 -24641 324257 109307 -49387
10754 17059 66020 243748 29565 -66813 -250822 -165734 -438904 -96189 59035 136165 -147109
10742 -38940 -102252 134856 176499 -130279 -56600 -222500 -138096 -79770 195013 -215074 21190
10730 -124603 83246 -81145 184449 13459 145320 -332240 -61061 -4597 -125023 11417 150519
10719 150519 13185 -13909 -419315 -412158 67832 -95779 -93973 -227320 23906 22689 -69150 206903
10706 -28870 291740 -236121 -199705 470302 222883 -251445 -178868 -151521 62038 169478
10696 169478 -595207 -286160 -355133 68070 -192432 12138 -268436 -72520 -105036 116729
10685 -133963 -413683 -29825 -444974 -177241 -13979 123614 -540647 -160318 -330829 137270
10674 62515 92132 -154938 85537 17811 -217781 -109043 21156 -40365 -105624 -40089 -75514
10663 -75514 -179905 -156894 62722 81738 259258 10386 162048 75873 -149423 226125 -24088
10651 -104044 -3685 143480 -31298 303566 -19727 -331718 32345 -482584 9874 -199838 -135977
10640 -135977 151939 131229 -1101 -46063 196251 -200315 -423161 214955 7354 -289873 -131676
10628 19880 170374 -244761 -96421 -133508 48196 -75258 25765 -224865 144386 213804 82402
10616 -454603 -93064 -316296 133255 -28229 -186266 228854 -193719 -68218 -324800 -262881
10606 -262881 -120902 -73032 -217553 -200246 -98136 108986 -336218 -107768 -200402 -61896
10595 -245526 23674 -165655 15118 110741 136320 -12895 172300 -100371 -155397 135200 -52881
10583 -96460 -78043 69776 7254 238220 -171681 108391 -455351 -5325 134903 -130555 46217
10571 25069 284038 -108847 245969 -87772 -85132 111945 -280538 169468 211897 -73647 -184573
10560 -184573 203717 165268 -14065 -250320 133504 -74474 -32024 -111588 2333 -98753 -76260
10549 -76260 150516 238440 -311211 -24739 -333892 -86379 -202280 37764 -149012 153341
10538 -476010 215428 -42961 -129525 -289826 -107087 -18104 94681 39255 476605 29677 257665
10527 257665 26080 -26319 -185814 -84674 32990 -218308 -121658 -175861 -290517 80855 -220464
10515 -249817 -21639 -130962 16465 62954 200988 163429 216353 -321438 -119209 113745
10504 92935 -231252 -193047 50939 -20161 -416445 165081 -31223 -33635 175264 22843 285061
10493 285061 -31154 -267567 -67870 -156684 -96743 5896 232725 94210 -253719 -232025 93708
10481 28572 -110551 -269864 -251284 404086 153491 43551 128871 29 -80261 -541598 -48691
10469 177153 36392 -203981 64193 146837 252217 350527 382150 37466 215572 138010 169391
10458 169391 77943 167665 -113410 -166482 157519 168942 -3600 -222617 -151742 -36489 -63166
10447 -63166 224698 -116910 73239 2188 25366 20615 -13009 1945 -192797 -55186 -154030 -99600
10435 -99600 35239 -282456 284333 -28377 -63395 -155577 128179 -367330 33463 172287 112375
10424 112375 -291560 -58169 6713 139601 151262 -268198 146170 32315 347835 270552 -110399
10412 -43863 44553 -48695 182473 -507831 -77931 53950 104107 -229016 235650 291417 248466
10401 248466 -177005 -25982 -196760 -185317 -123618 -85975 41518 59350 12303 23570 -104398
10389 31922 22111 -42597 49622 286105 269699 -175977 285361 123423 55603 -70554 129376
10377 -87341 177052 112097 -177028 365518 -266385 -233492 265405 382709 -2148 229849
10366 150574 -2411 361680 134923 45019 41618 83675 325464 320026 272448 66920 267199
10355 267199 295835 358551 787053 254308 148514 199169 337572 402603 483051 201556
10344 176588 -87129 130523 -27126 -13582 128987 159949 325497 -2587 265622 315074 400858
10333 400858 176363 388773 486785 617725 192827 595766 331864 532104 305478 184472
10323 184472 198594 537616 349687 251374 355645 -80313 166375 -150242 -12665 141810
10312 520155 1249 -149125 -33763 62661 54573 32776 569355 181622 86333 149682 142040
10301 142040 468098 109062 -72521 -286375 182527 194535 -92970 -418786 -141440 -241922
10291 -241922 -134216 11878 2827 -101824 -94823 446744 253558 333774 -53825 -93799 -103063
10280 -103063 -272612 -326206 245295 10804 -372371 56413 -56947 330832 -271323 -283157
10270 -283157 -102555 -277081 -60076 -23196 -36668 -313510 -43675 156918 412693 -114338
10259 -43060 -91090 287841 -126753 68809 -20924 -100430 354757 104019 -101362 -16747 45034
10247 272297 139528 272580 155532 375366 45430 -19612 329705 90984 -4020 100188
10236 215635 110078 299205 -232624 -312623 208991 154030 -44599 42425 153347 -372816
10225 -209855 -51996 -113676 78608 -40323 -13866 55372 75268 169158 -136086 362391 -76911
10213 -67193 -74734 14057 -225963 45184 87078 -164473 -161301 135650 45893 -179810 -228842
10202 -228842 -44094 -75434 -239843 -58092 -127593 -122009 58130 -244413 -201468 52870 39791
10191 39791 -53051 -17526 -81532 -82756 80555 66074 70218 231171 -206823 -303165 66355 130079
10179 130079 287622 -205172 -143468 102319 140763 92343 45630 -160282 -195156 18391 81524
10168 81524 -231913 -105442 275191 -143443 -323910 242627 163484 49408 -144613 -229834
10158 -229834 -269780 -351179 -134798 -3162 -151741 11551 -328611 -160996 -109410 -58261 88549
10146 65261 13854 113159 -10512 5049 2687 -145224 -65955 50105 25517 -41464 -512684 177595
10133 -130520 -136092 8779 229291 -58140 -91168 -289240 -69641 -240563 -57399 -107342 -262220
10122 -262220 -252757 -264316 70455 118831 -50809 -31467 171270 -154161 -372261 -197989 -139830
10111 -139830 -282376 -127663 15040 -190012 -211277 -215956 -106216 93660 -124874 -206015 -16692
10099 -100675 207663 -398220 140848 165236 -19659 -81281 14384 56583 -92897 8178 -939
10087 129414 95046 -300895 30596 -104484 -60854 -95230 -8726 283404 62768 478685 68557
10075 -191440 70170 -60721 -170863 169439 -41126 -167617 -242438 -121058 -20363 -312441
10065 -312441 -380944 -102870 -90733 -36266 -122881 -204388 -332761 -146994 59638 -290771 138097
10053 -66006 -79780 3012 468458 -164041 -37090 -102963 195721 -103694 183795 -192910 -293053
10042 -293053 -408199 -113541 -327419 -133683 -102155 -308473 -17166 30874 51253 200419
10032 200419 84543 75740 -147514 -183422 176206 -119052 -20517 -57196 171322 46674 -232072
10020 -212812 161437 -3743 -25060 143219 -75061 32749 -31401 -54612 4471 67151 65145 -151548
10007 -392463 -101355 -66040 -73719 72219 -136814 -458802 -115681 -18582 -31066 237162 -95503
9995 -115505 -99490 -2729 -316346 -262396 86380 25456 1199 -132295 -264558 92610 -289103
9983 149570 247303 -125825 30737 -113409 -194336 126003 -272170 36380 -4382 -36612 -200730
9972 -200730 -89151 -54478 -90627 -92295 -5944 -10427 -162847 -69733 -182404 21289 -115758 -15262
9959 39106 -114920 -6724 51924 -65415 65539 -113088 -551409 -81601 -33363 -76264 -175534
9948 -175534 22555 -236805 33204 -134694 -272548 243536 -323080 18603 -5944 -11561 181873
9936 -527841 -114058 -303511 -377238 57148 -114630 -165915 -208942 -266639 -46608 -190537 -128428
9925 -128428 68372 -5887 -10965 166626 -92399 -63633 -106081 -345226 185147 -179915 167561
9913 -151838 496 -249601 343031 56543 -362570 -154532 -321301 -176417 -193553 -4551 86186
9901 67850 106311 114426 -362244 -42124 -241409 179005 -119744 35531 -113050 -212066 -151626
9890 -151626 -229383 -371893 -63583 -273818 154050 -176098 46942 381 -35793 56844 -114211
9878 -244700 -69444 103654 -483808 -184263 -9936 -346213 -154186 41393 469545 -41022 -239769
9867 -239769 -116493 171330 -273115 -201424 -291202 234017 181708 -430755 -24628 -124781
9857 -124781 -62304 -159802 -418229 -551407 121568 8876 -214090 -231720 -51999 -324024 152218
9845 -27627 22945 387 -142925 -46865 271641 -84681 204680 -170619 -116807 -31849 -113340
9834 -113340 58947 -128695 -54788 221903 -265906 -107514 34809 66368 -256274 -48470 -113621
9823 -113621 -23236 -93196 -220669 -95021 -74012 -160456 -187184 134692 -96049 180468 -97723
9811 -21445 -59636 138359 77707 -316110 -196757 -298873 93491 51482 -118236 -52131 -36963
9800 -36963 42696 -2018 -244049 -38023 -215080 51164 -50883 -108507 -222650 12605 -29294
9788 -180434 -209137 236632 -6827 137812 -203598 124993 -2520 107805 -242418 -390274 -199865
9777 -199865 113721 133458 -196707 -268732 -92072 201271 -60409 32839 188753 37203 -287330
9765 -358694 144942 -35934 29854 -30464 -77505 -164674 -271916 -280671 137290 161892 -18849
9753 -191552 107469 -100012 295757 281003 169631 27839 -190791 -37169 27757 -343523
9742 -105923 -277780 122255 -112216 -11806 -48691 -74676 -355297 -123956 214916 -93177
9731 -57607 -116624 -275897 -183610 225759 -219814 -174825 85047 -24854 81332 148025 266916
9720 266916 181610 -91883 -420817 124102 -58142 -254847 129798 199616 -223993 -126858 -265889
9709 -265889 18796 -101815 -206239 -127575 296547 119686 -250437 16005 -233135 -75141
9698 -12624 -241986 42273 -503832 324226 300295 -182727 -173447 -364164 -172702 50694 -56440
9686 -152331 -402550 -18624 -57154 312500 -413810 70694 254292 -81780 170132 -15217 63920
9674 -143576 -510875 -90394 225800 -234374 -129481 -359560 18806 -65939 274632 -204348
9663 -146989 -301136 26581 -251181 -109763 -101658 -122420 193484 21343 -99090 -67092 -256424
9652 -256424 81865 -251123 -195582 -48219 7806 -254957 -88327 -183132 -194183 134748 123646
9641 123646 100384 111695 57232 -138441 -106976 65696 -57888 -157744 -498822 15472 129265
9630 129265 -30898 24737 -35852 -205791 -444450 -94950 343902 -219584 283072 -10837 -242371
9619 -242371 122585 -103255 1664 120279 -127725 -155883 96141 66687 -354474 20595 6092
9607 199970 -90871 -92548 101880 -64052 -268098 -329733 -243564 216767 -187546 -212995 -329056
9596 -329056 -67431 -364826 -35378 308277 77828 53770 -81365 -148971 138302 -124814 -16482
9584 -174335 -14665 17044 228320 -6958 200545 108845 -74554 -150663 216386 -37510 -76611
9573 -76611 -246342 -292502 77707 -60703 -101831 -23156 59517 -46812 9167 -371902 -82482 58272
9560 -54562 -156835 -119967 -132432 46329 -116586 -383689 22424 142792 167030 38389 -263589
9548 70974 114338 -58128 -133509 70721 -6020 -347505 9393 -42993 -149240 28538 256869 85896
9535 -16300 -118697 -138009 -21668 -146161 -248640 132797 -122406 -81627 -86414 -124839 67173
9523 -204042 290815 174694 226479 45807 -63519 -210030 -95618 110814 -126938 188680
9512 -372350 -118252 62310 -329118 -63079 -49104 -153504 -433031 413983 21063 -327816
9501 -42789 -80779 -49621 180858 26218 -289260 7210 -80934 -137325 -138103 -121084 -445560 3862
9488 45204 -8381 324612 12771 145959 44320 29088 -272948 212289 -127738 129736 -104546
9476 -8617 -122023 -9869 27662 -65756 -112464 -102745 -412753 210281 -78046 -93218 -51919 -77153
9464 -77153 9783 -312992 -248095 -103642 27229 -287018 -47395 -19711 141399 22946 190497
9453 190497 -265325 -21023 -132664 59773 -79498 -30961 -36868 -152192 171397 -83543 301709
9441 -345744 -198403 -37810 -362215 18905 -196607 -264237 -8577 140244 -141539 38497 -10256
9429 173962 -255259 115001 -199253 89979 205548 95244 -239641 -150474 -252572 280176
9418 -138653 -184225 -150795 51319 70620 64708 -394739 -212700 -96392 -30014 -56359 -99246
9407 -99246 -29826 -187114 114530 101469 -13116 137520 -152432 -211303 8748 -210268 -160315
9396 -160315 -96058 1692 -412708 -174793 -119841 -88360 131609 -187551 245089 -192800 -168459
9385 -168459 102381 -244155 -256135 145660 -144255 -196854 -26942 -320367 -256391 -311020 55864
9373 7050 -62908 -45682 -51225 -416766 -219203 -68538 -69401 -129704 154602 -527706 -20716 -261535
9361 -261535 -168371 -69138 287517 26328 -65905 -54170 -199176 322628 -130126 13529 20213
9350 20213 95122 -334104 121730 -65389 57148 -445629 39345 -90091 -213892 -415387 -285104
9339 -285104 -19962 -80042 -267271 -55725 84848 106131 1078 44433 -76329 -262866 -61563
9327 259160 93929 -34356 -209022 55429 -108919 -139194 -12839 28253 -205348 -27533 217433
9315 138278 -66912 -118306 135839 -60535 63197 50443 320439 202497 -186855 -9549 -1980
9303 -82393 -82843 -342013 237994 223569 86059 93874 -173985 -338745 -339578 157331 -115843 -25352
9290 -78998 19898 -151811 -159205 4185 -251832 -247994 134338 -152288 -99711 276736 55230
9278 -78729 -72758 81657 8767 -128850 -208422 -261631 -168598 -47840 -314760 -90999 172250 -10513
9265 -84447 -68540 -251595 106905 237824 -53759 -46079 -236079 -45830 -413067 -216773 66987
9253 109336 86657 -458393 -221963 290333 -98895 -375983 -240855 -268764 121604 81939
9243 81939 -120791 -236741 31941 -192637 115142 -114057 316939 212519 -171925 -250667
9233 -250667 -133004 157631 -15922 95824 27507 68743 -220638 -362789 24854 -387101 224818
9221 -302232 60271 -87684 -497251 -181291 -78099 -29822 -198025 56986 -137779 -119733 -229131
9210 -229131 217752 -90422 -176573 -110740 -244067 -73645 59764 -21485 100227 -220905 256885
9198 -301024 -17791 -104276 -252465 -35876 -173340 -330933 34498 -483870 38701 99938 241119
9187 241119 -96283 30132 -208320 -67476 -181223 203818 -174391 30807 -93175 71780 -107314
9175 54149 228315 -12260 -114219 70992 -232348 -273987 11199 -27499 16592 138338 66568
9163 -122982 -368014 415103 -34626 337506 58010 -183714 -41521 -103238 12122 55587 137902
9152 137902 -87840 62851 -145578 -36775 49659 101748 -369482 -94981 -132828 202730 142376
9141 142376 -78631 13951 -267464 -210149 -163720 363419 -219154 -85957 -232441 40056 69934
9130 69934 -232996 -500210 63506 25358 10687 -67148 -180126 -19036 -344979 6817 -372322
9118 330707 -297253 292826 -158659 231927 33054 -62054 -106153 -72865 65778 -169091 95506
9106 -125344 -196526 100132 84997 -234003 45007 -423255 -74665 -2890 116461 -29646 -15870
9095 -15870 -105047 -190755 -186719 -63479 144836 -80900 -145769 -99227 257575 87539 410383
9084 410383 -64199 25414 145372 -4837 -66133 -295880 124089 -70172 -29553 -141214 -173593
9073 -173593 -67773 -1686 16090 -30318 -108564 -228903 101840 344972 20404 84739 -309133
9061 -140311 309969 -88221 -37026 -55715 -4962 -139624 137363 48932 -101611 -332447 87957
9049 -54031 -288713 -482603 -371443 130508 205503 35011 -190622 135938 -99308 -80344 -119553
9038 -119553 -3440 -90531 -241440 -42603 -269074 -14406 36580 -61110 9047 -189506 -78663
9026 72339 16975 -32319 -3341 -15053 47984 -285265 -91234 -16050 -304058 143862 122687
9015 122687 53370 -238197 -290827 -32381 -48597 35907 49207 -25967 -835 -13201 -190428 -3529
9002 -30495 236802 -68364 -1327 -177172 -293171 26652 -137228 -238554 -109859 211210 -265952
8990 172270 -178927 -108757 371240 -281800 -223730 72931 155302 -172344 -286549 -102926
8979 -61231 -118870 -31339 140494 -64281 -141899 -91942 -166584 -225250 103595 84614 124329
8968 124329 344194 -140658 157279 -79093 -19423 249995 103809 -89138 -285643 -84907
8957 237878 -139104 -110809 90398 -223361 -93767 -219723 -131276 -139564 122815 -82835 -241335
8946 -241335 -197676 -5692 -188583 -160134 -198913 -17036 -251062 -62672 22782 29496 -356078
8934 -82112 -132818 652 -150920 168772 -206977 108398 -222776 61487 -93252 -190907 -140143
8923 -140143 -156477 -167956 -106493 210968 78242 221817 224945 -83429 29820 454582 142352
8911 309183 212533 705210 1186164 1713798 3273724 5326173 9948565 5148286 2941322
8902 2941322 1483767 1244325 684600 652428 542212 632920 285821 -37626 -54377 218685
8891 131656 406002 397685 116760 194074 -256000 -223397 99552 194702 -170324 -114873 197548
8879 -23122 -7308 -191774 -161732 -26688 267824 -177392 -187824 112626 398357 -151503 -132166
8868 -132166 -222994 -103684 -51939 -213499 252280 -382244 -34699 81345 -89959 -303675 243800
8856 -4000 233770 259610 115027 -139966 -42188 -438104 -155931 -208726 -33437 225634 85063
8844 -107400 -40300 113691 -85629 -15408 9138 -191716 -215452 -467719 52404 220052 35778
8832 -246770 -141194 -197822 238455 -120511 241647 177130 -121196 -56049 43448 -28453 90308
8820 -28271 -470068 -241324 62125 383664 65318 222752 -58633 160754 -309299 -44301 -138880
8809 -138880 174425 127289 -285173 -525 -22779 -186287 -298614 -256579 -149360 -138590 -259227
8798 -259227 -104252 -244345 -231219 -95092 -149861 120113 21892 -379841 -172401 286362
8787 200078 200386 -48210 -153124 361750 -151956 -20256 230436 180346 90692 85936 96063
8776 96063 125955 -201404 230870 -99440 -130269 22727 -299647 -153238 -36479 72722 83469
8765 83469 202583 35742 -43005 -218829 120575 100291 -229175 -106382 -77667 -2202 157209
8753 -480422 -34641 61479 -4332 128376 -105229 72910 93203 -241475 129154 51040 224762
8742 224762 130474 24794 73130 -45128 136129 -73844 -440146 -150363 -188480 11755 73668
8731 73668 25920 26543 -154014 -155461 84402 -302465 78369 140286 94085 -128417 308865 135205
8718 -110911 -60181 -70667 -144390 892 -62734 34896 -195282 -303637 -78950 64625 -75802 -215793
8706 -215793 -76462 -173614 -209985 50745 -166859 -73961 -28309 -416156 -98631 -147437 -38024
8694 -184912 11175 8473 -22901 -125057 196882 -260114 -194530 -173317 -357861 192273 -121985
8682 -279974 111759 165781 -89145 -237631 45805 -165959 -161602 -32108 -427352 -59919 181858
8670 -130771 -203707 -111003 -40112 -190948 -87844 -14232 88263 90977 -78437 -27012 12260 169637
8658 169637 -32604 -61873 -30643 291585 -96281 368887 -28727 191134 -140163 -358759 -221257
8647 -221257 -362334 51022 6260 -102667 -139958 -190435 -1572 -219295 -262545 260815 15468
8635 -257400 -155652 -230014 -200299 271168 -148932 -231115 -131899 -511854 -159566 348917
8624 -255639 -281107 -92679 121969 -219370 -18714 -211469 11197 -45097 103425 -172466 -138221
8613 -138221 -324506 8197 -215171 -410904 -26390 -130140 -219324 -7758 135714 -163034 153572
8601 118187 -130319 -180042 -81378 -312913 -290179 160371 175485 199683 -169006 -189857 -273187
8590 -273187 375834 -80351 -13186 -86739 -118182 -252126 208400 -78767 174661 -139644 50752
8578 -278330 117444 -96629 -49196 -72571 -18079 -313255 46591 66689 -245962 -85080 27404
8566 -88638 -25452 -220800 1811 65825 -23877 -261139 -321039 -268670 49533 -27109 138191
8554 -304903 178647 6938 -68757 -271795 -128332 -29244 193311 10264 59363 45493 -186290
8542 -238587 256012 66829 28248 -99975 7986 -274095 2415 -451791 198762 -170237 -105613
8531 -105613 -198558 -57861 108242 -128236 -302562 -189621 -193776 37280 -1407 -126271 -204091
8520 -204091 -76312 68147 -315739 -115587 -213441 -1318 -290406 78807 -142917 167481 115714
8509 115714 134375 50246 -148891 46885 -11789 -29850 114566 57475 -106301 -295992 -150542
8498 -150542 41448 -136925 253277 78023 62085 -19938 63284 57543 -158933 -33113 -91151
8487 -91151 30563 -222103 218362 63084 -101260 85967 -110251 97062 -212808 -45142 29545
8475 -309680 -147376 -19894 -172541 25714 -257661 -11050 -73245 -129575 -20766 -50580 -219707
8464 -219707 196114 31141 75323 -113171 112284 124710 -9283 -16662 -78085 26455 -94277
8452 140245 -9641 -441496 -66579 22022 251799 -119757 153427 -308383 21342 -111558 186947
8440 -7348 147060 -346321 -19762 -210844 139675 91463 -117583 -38118 -181753 162445 -408251
8428 166853 -205389 -77457 -132703 -251599 63192 -132708 590 -27670 -151927 -65366 176036
8416 135357 -197875 225349 -216532 139864 -5070 -253498 -129159 52013 -83223 -159225 -245807
8405 -245807 -76263 -50193 -358541 170330 -88670 -341385 -119122 -161607 141913 469642
8395 469642 -247275 -80109 -327212 -24400 -101293 -2534 -155006 -162505 354646 -211713 -381281
8384 -381281 -295261 -320071 191288 -25902 -2927 153816 -210104 -231096 -209216 -153201 331384
8372 -108544 4117 232568 -7839 17578 -162154 -324539 -57886 141864 -147628 74887 156139
8361 156139 -240765 280829 -44668 128856 -35819 12844 -32676 129292 309708 -120249
8350 217103 -358806 -178438 -3249 -16445 -195125 -224785 40156 -50725 -296007 315545 130722
8338 45040 -235926 31473 -152688 123599 157969 424053 114178 -189344 52402 -6313 32463
8326 -188046 -196661 34881 -361479 451746 -124338 112146 -213340 -164950 104741 -214046
8315 254737 94455 -90522 99097 328406 205257 -1200 -34737 121612 -220906 -98403 -146729
8304 -146729 47265 -350569 54350 -156948 -262378 158762 39374 126652 -18992 -15252 -141829
8293 -141829 135318 -16484 -118755 66110 -78802 -68357 -435883 -208709 -258300 -138856 -54659
8281 -34863 -171514 -61282 -181549 -213272 7497 185456 55952 299986 -2254 -41170 -135236
8270 -135236 -15505 -330125 77484 -25817 34293 -300065 29614 117610 -75301 88200 25235
8258 97906 -206462 61343 531781 -137501 -138594 47993 168345 69659 -196792 -11735 -8580
8247 -8580 204885 -257028 52882 141902 -191442 195034 -147155 -4870 180782 -25254 -22018
8236 -22018 193945 -30084 -184771 -231763 -154163 162968 -12165 -1425 -102968 49026 -191110
8224 1249 -211478 37183 38041 -84331 98766 -203277 546580 -321204 -61056 -265150 -72259
8212 -107455 191014 104682 -15292 147305 -124809 165458 131470 -79291 -94693 36065 126422
8201 126422 -106420 -171355 -45948 270297 -317687 -122256 25441 178356 -92950 -104581 -279155
8190 -279155 -267663 112877 211052 -13918 367996 -1943 -140534 32100 -199979 32233 -149228
8178 -76299 -234708 286176 -19172 52002 63036 46846 -251943 -336236 -205732 -93341 -100633
8167 -100633 88888 87806 66682 -15636 -4549 -149315 -113944 16647 -160754 92156 -90810 -135470
8155 -135470 -5785 -114028 -392613 242601 132336 -55641 -336955 -185419 240729 149504
8145 149504 -128093 -64188 -141602 -271746 15298 -49750 147144 343873 20196 -93982 -39634
8133 -148639 -308938 -28268 16765 56061 210326 -179451 -124825 -120218 -213236 60906 -127039
8121 -9412 48912 82642 -201591 25389 -88748 -132510 163838 144111 102349 -12326 -61156 -153091
8109 -153091 113390 52369 39307 11987 163201 -137330 124442 88712 -197115 -63678 -234666
8098 -234666 -41611 80465 -231332 -230019 155000 32851 -188438 126704 -37581 -230543 -167922
8087 -167922 446510 46935 -131324 413130 -97711 -91017 -20455 -221555 -12587 -134433 98735
8075 -246726 -28797 -123028 -27227 -120439 -238750 72062 -37703 -43011 13055 -93605 -48210 -180347
8063 -180347 495568 -347541 49724 -165143 -75538 -375227 -186261 -332019 87100 39549
8052 259571 -109879 -17289 -386115 -322767 81006 -37960 128460 174932 76832 -166184 -58961
8040 -20014 -6928 -159610 -23175 -87795 15136 171126 -140697 225081 61283 -24498 -43364
8029 -43364 -57597 -186986 -236196 -110077 -248832 179341 -137609 -197037 -103875 223340 104725
8017 -83920 -285806 171715 -114579 -153771 335246 54884 -106702 -268976 40830 -83805 -295942
8006 -295942 -103857 11636 -128845 62813 -112562 165180 145879 20432 -128177 -436799
7996 -436799 -21247 224659 -123041 -279635 -45479 -144062 -139154 316279 -131033 -105405 -141040
7985 -141040 -145568 135705 -138918 -52265 -74981 -135831 56487 -169168 -80649 92485 194828
7974 194828 169104 -245027 157526 -68569 129461 -115969 -173800 64415 -263047 -34778 -90570
7963 -90570 452 164160 23400 -65115 92061 -173680 -162272 195753 -126243 -310727 268833
7951 -78182 336967 59651 -114357 -44722 -130575 -77293 -16807 -30780 -32645 -280744 187120
7939 -184824 94465 85806 99111 -754 -320109 -177286 -129976 -260317 -7850 -80768 504795 207299
7926 164874 70173 9217 -11272 -186420 118074 -125308 -409336 113767 -133772 -307201
7916 -307201 -166313 -359040 196774 30828 -122755 -231291 -191494 246493 73680 -9631 -392
7904 -28155 -128873 -234844 -411741 77364 81446 29548 -324175 -32086 -104391 -108391 -22664
7892 83831 -59403 -173323 108099 228131 350051 -195773 -126785 -112042 -426745 -52577 237295
7880 -11201 98309 220069 -275955 -309938 -221207 50360 -150815 168822 -87992 -205823 -94991
7868 -71219 -160704 121373 -117564 -63476 -99275 -40767 172818 -78714 -166559 258636 22495
7856 188487 -253942 100796 -110751 -32857 135130 5610 -168099 193514 -95148 -147036 180133
7844 -215603 -186890 -82346 -148 184531 -65210 113666 195858 -52747 -181532 -47989 -319069
7833 -319069 108808 -90387 239339 -70203 -260849 -102056 -142388 -298965 -359337 193334
7822 53902 121980 -282048 305332 -51988 128230 140813 -160417 -26960 206140 -207877 -136063
7811 -136063 35374 -405087 300935 13393 -317653 224056 -67152 -18130 -241654 -177641 -139943
7800 -139943 -210984 263941 53781 104843 10537 164267 95469 225614 -420663 102372 -305639
7788 13862 2052 107343 125322 213122 -75560 126308 118595 -94418 -285880 49131 -129055
7776 38396 -162176 -176744 -299131 -147400 -258867 -161611 -115315 38672 -264025 17469 236669
7765 236669 -198855 34520 -160978 82389 119687 170970 -105651 -73646 147808 24042 -245381
7753 -38847 -264792 121247 131532 54588 -107100 -242000 271802 -256936 -254185 -188123 33523
7741 -183563 -171277 -126097 -28482 50391 -36818 -103872 -59562 -91661 25761 -34220 -150323
7730 -150323 -70050 -348449 -123456 -143118 38134 255667 -230218 -138751 -113967 -123043 8439
7718 35073 127749 -12761 -88768 139425 -49455 63892 -23346 202474 -637383 127776 105984
7707 105984 -24452 -248629 179400 -173347 62909 198727 36028 40092 -76766 -77570 128975
7695 139114 -157142 148758 250023 -175315 38304 -60424 -176615 -125743 91023 189819 214941
7684 214941 -130428 -34435 -62739 -125212 58672 -308891 -119055 -32624 106354 111351 128142
7673 128142 -28310 80708 -160013 -425775 60638 194270 -34507 234752 -50562 35356 -4720
7661 -76596 257962 -58248 -68276 109047 -96290 104557 -99194 -71323 35396 -333079 -102079
7649 73102 160739 -186618 -101592 29624 -186257 -66448 -207898 -41362 -216469 -100134 -208713
7638 -208713 -72044 -13638 298906 -207465 -221582 -62681 174394 54204 -285839 -1652 226356
7626 -143372 -191503 268166 -249725 -328285 -116667 91641 -58994 -140185 145159 202970 119220
7615 119220 -53151 86639 -94888 -360857 141824 96775 -331443 -130535 -357134 196196
7604 166275 275815 221679 -226968 159092 43627 42767 -304941 195744 -102526 70120 48982
7593 48982 177632 10900 -240269 -58559 16544 -7835 274370 -142104 -150577 -24849 -177147
7582 -177147 159965 -181679 -197680 -3993 -166341 -52575 -45803 -46452 -38514 112038 -15344 20382
7569 228826 -286034 263207 -268095 -147604 22478 26960 -96052 -78410 -162573 -189707 -210304
7558 -210304 -234925 139782 -310179 -30461 -132260 24196 170100 63474 -100313 89016 -178800
7546 19921 -177753 -18742 -68122 -81592 -104378 254678 21820 95248 -15194 -194168 106237
7534 106465 57050 280250 -274622 177016 76678 -287103 -211364 -29733 313791 105181
7523 -430267 41265 -112977 79935 -23433 -228206 189848 -315014 35891 -216864 -71178 233072
7511 -262402 219840 14111 63264 -124547 125216 97168 182523 64570 57244 -49445 -179150
7500 -179150 -437984 -52048 -103089 88909 -60301 256664 160462 -36016 -298732 70447 -97821
7488 50 -178675 -196681 -176956 -216733 35212 404386 -143646 -70627 -113839 -87161 71339 -310383
7475 150187 -69284 267108 -901 -546619 -85086 118176 -122563 -67749 62857 39452 -71294
7463 -52075 -28832 83385 -41082 -151611 -55967 -74185 -106651 -81535 -169759 -75024 12921 232
7450 224816 -134998 -270809 -110252 214281 -114745 -137292 -99424 -326369 -233983 72147
7439 -292700 32895 92463 61054 66701 -66276 162011 -47770 -96995 142158 114241 -284636
7427 182148 -129752 104029 171168 200548 -72928 153682 27898 68077 -51067 38221 -233153
7415 -44790 -153824 -170436 58271 -61765 -17465 92554 -102426 -151410 -140594 -224257 69795
7403 -29623 -35090 -374490 207011 -48613 -142727 45733 -60091 29841 83491 -336117 -172434
7392 -172434 -146875 94566 10049 284042 -105279 -12548 307550 126014 -301287 -396636 53967
7380 -21601 -42463 31143 130727 -267288 -79571 349467 110616 282332 -185872 -31571 93671
7368 62341 20169 -348872 -3383 -39591 -212369 -121583 -140977 10594 223687 -31334 75784
7356 -138752 -217799 -71171 -101038 -262667 -212171 40897 -100860 57878 -245218 -254743 240284
7344 -329832 -421037 55703 158505 95692 -239986 101295 -27974 -108815 136908 11431 -1546
7332 47001 8700 55208 -173972 -157502 -227617 1364 40348 314701 -45294 -72215 -201414 131993
7319 77252 48753 -213445 -142810 -8065 -194963 -100341 82909 -113274 8337 73203 176285
7308 176285 186973 100296 161944 7490 -94907 -14234 -56426 231537 167124 455471 280505
7297 280505 -384691 205503 75137 61157 159010 63893 -26607 44815 216622 3678 -108719
7285 7217 40116 21782 10037 -192628 -28521 243326 177712 -141952 121375 -116105 297326
7273 -176309 -53349 -19533 -317020 -43124 15988 -335714 -38510 29705 234141 -6557 322543
7261 -404780 -200997 38554 15586 156179 209134 -53374 -278866 -110187 -15283 93838 102637
7250 102637 77783 302578 -65648 -41465 298903 -181093 -233839 -345117 241354 227311 80679
7238 -603 243589 -23009 -219661 -173644 -147464 151068 160528 82409 -229290 327339 305765
7227 305765 16659 61389 -202971 -367827 224062 -103168 -34956 11946 32834 195647 200266
7216 200266 58667 -288017 32101 -349202 -118631 -181470 -87597 -146519 -86104 -200611 -100257
7204 -74230 -157734 -85957 -153076 -340475 -194115 -264041 136956 132445 116306 106428 -40894 -299452
7192 -299452 140723 -132053 -117290 196119 -237574 52834 -38491 -129502 -250072 -43958 163715
7180 -68123 192874 40107 -8871 -113677 86068 240552 -127092 298986 -225017 -291886 -36517
7168 -218998 -337165 173604 -33389 -258199 -161818 -260326 -184171 90392 -46302 138833 -217738
7156 -12485 -114160 -45703 276753 -144772 -10631 23468 278262 448834 -535372 -226706
7145 -19783 -208619 -76680 -110541 -33953 -41742 -290244 278218 100561 247002 -185351 -297436
7134 -297436 97374 -339299 -292751 -104575 -273932 141099 129649 -237058 -9363 -52735 36617
7122 -348735 -74805 222725 -298563 42218 -296918 39760 -151608 -1841 122562 -58539 -147583
7111 -147583 367633 17742 -27797 144079 -33842 104907 13028 -148087 22073 -253178 -71165
7099 304844 -119269 194920 392262 -161039 -198105 56881 299167 -6171 -411132 -165544
7088 -121878 -42281 -190448 -201930 -108280 -332988 -86795 195880 -141017 -127090 -213485 -19689
7076 145799 -191773 -77429 247326 -136342 -115009 252451 -38704 -203449 235450 -101604
7065 -20394 62324 -10834 -273437 68557 -57896 346827 -188289 171778 -17579 -212359 -86695
7053 -217670 45799 -206635 121446 -55343 -459764 -200741 158928 -61151 -76562 -351177
7043 -351177 -148664 434428 60789 -113023 113565 -85473 -138195 57208 152060 -370276 -61517
7031 -97514 57247 100676 -150101 -313996 -167149 -249124 143298 180510 -153784 -13922 94494
7019 -229478 111615 168834 53500 -190296 -172380 -79851 -272261 -114641 -28707 20501 -75438
7007 130268 -92924 126483 125329 339587 93157 -92269 -382291 -32104 96831 -208946 96475
6995 471000 242798 -428024 -54365 -107951 30735 -81534 105820 -75326 34556 -162852 -32707
6983 -220672 -231249 -169852 -164725 -145628 1689 -102799 39465 55945 203244 -43121 -63998 160196
6970 58250 118502 195097 -213437 -27751 112483 -110511 -190521 -148772 -178161 -42824 4754
6958 -216621 88202 49273 -67738 343442 -113704 -205590 174325 96398 440403 169856 59708
6946 -19305 258805 189365 46650 27119 -115830 -20167 77454 76231 -191544 -43108 266865
6934 -162352 -148748 52003 -2149 -168023 -83314 252209 -309046 -28066 -213717 69331 8369
6922 -119908 -240959 139673 -50057 -39958 24047 165739 293927 -348876 88383 110720 46433
6910 87482 93362 -24050 110598 -144512 42104 115150 -186658 69239 318470 -44072 -104439
6899 -104439 41112 -207120 -388860 -268026 -62339 -135949 -196257 -258205 48652 18074 -265936
6887 -54215 198666 -90277 -33165 62420 26521 -113223 -178090 200408 -324982 -1965 -268115
6876 -268115 -319494 55128 88743 -491385 110467 -75366 -66850 -79976 -111678 -52229 -4640 40807
6863 -7892 -102493 -9234 -153757 -287929 24629 88257 79550 -76887 -183969 204186 -230781
6851 134082 269000 -14420 262624 87296 -84966 40387 68442 -58337 99911 -89739 -68263
6840 -68263 42538 -66414 118232 -78017 255938 228827 -103117 -87928 -70387 -22499 -258016
6829 -258016 -111542 -184919 101020 77753 489 -153594 -150333 -141971 -63862 143348 -92425 139265
6816 -79476 -3156 136789 -56889 -66913 -78114 68120 147328 -23374 123763 40262 -267452
6804 108387 44013 203965 -94982 144621 300794 171244 138181 89433 -14472 4206 -160301
6792 -41980 -134552 47068 84875 -155935 62698 -137706 74551 -54041 127490 -161417 -50385
6780 1054 -195045 -80976 -53016 -167485 164159 -452227 222495 -5381 -89405 110509 -205248
6768 -33573 193220 -49021 -309985 -117036 123734 33871 -141960 -35470 -60525 -94901 -294005
6757 -294005 9348 -3450 -110328 82187 -39551 84387 -18547 9715 -115093 -51722 11849 263569
6745 263569 -60837 -25963 -228216 -2552 97564 5131 192280 -23236 -13365 144115 -151558
6733 -100111 -56923 -148378 -77819 22855 91354 13914 -547661 -154317 -73947 -11113 -89583
6722 -89583 318654 -138049 189539 -20835 -353700 139202 -140526 25691 -67674 -50882 -187797
6711 -187797 183315 -6015 -41945 -219302 -136773 -260943 -45410 137991 126281 82482 -128162
6699 19383 119419 -161869 -91075 -7780 -36827 -187944 148929 48666 -19499 -24800 -82013
6688 -82013 -361184 -276049 -34923 41700 -506375 80657 81878 -70863 38099 115388 -158062
6676 -176369 132115 225896 -6842 89544 158913 85417 119533 385835 150897 111938 236326
6665 236326 251384 69533 135576 9127 -191990 213667 177510 31968 97281 166680 58583
6653 -273482 -106110 28055 316305 -428295 -35536 63473 -75408 -42074 -58679 -176665 -30472
6641 -114478 109419 55755 9512 87937 112752 -79120 204950 -35960 263076 -16989 -130733
6630 -130733 145145 -134136 -190036 126094 220517 -156973 105045 88778 -97053 -104900 -24307
6618 119888 -197341 -119015 -91834 -106121 95482 -153533 64691 28410 -370350 136602 -50147
6606 81556 -194448 -38718 54559 -363323 78991 181806 -17731 241679 38532 219867 -169795
6594 -61864 -2889 38399 17383 -38513 -28505 5528 -245041 -104036 13559 -289542 -346758 237864
6581 -28677 -59106 -194159 131091 -67994 -277671 88281 -257678 -27005 -171118 -14137 -84343
6570 -84343 321185 -23956 43529 -232493 76052 177266 131358 -407052 389244 -89627 176488
6558 43962 70051 -106362 67301 138432 -275316 301359 204840 -61826 -257251 12775 -170259
6546 -204796 6918 -8391 -63936 -180974 131456 -94333 135524 -17895 -16577 -82618 -78420 391850
6533 64536 -282877 171566 66470 16341 391689 147554 -130966 -26652 245739 51407 118013
6522 118013 -40113 40349 -375048 -100157 -95352 -91910 92852 -97529 83306 226451 -80976
6510 286715 -15596 99331 9153 834 173026 -115828 -327631 -20662 -21520 -140741 -214042 -143043
6498 -143043 -107183 209369 -60362 -501459 311254 -179003 -179523 9505 18398 273613 66697
6486 73401 -16719 -31717 -237325 -71878 211730 181431 -44935 -1724 -196206 59547 3061 31115
6474 31115 -120875 -70125 -417852 157398 -178235 -32966 -212984 -370992 278833 32701
6463 179276 -187603 -91823 45900 36424 195263 49179 138839 -47597 -34763 -142356 253536
6451 241038 -32667 502858 -163395 -17716 -120013 152605 -254844 -113166 -172993 204415
6440 179414 -180328 205562 7492 -66262 -93621 -247405 -44724 17035 -75591 -43593 34115
6428 105931 -211129 -241572 241645 -139639 55616 165126 -104739 -12254 150124 -177965
6417 6509 176300 -83890 -69097 20253 105887 -286078 301262 4031 -145540 92657 -55562
6405 155013 -52441 -290537 -138892 88301 120779 -25229 -174 277737 -208829 -12259 285572
6393 126638 -98445 -114129 47777 128512 363213 47302 -152745 181497 -294085 -236710 -290443
6382 -290443 234390 -109158 -106809 -44307 296905 -152425 193995 208751 420536 36498 65371
6371 65371 -31032 259035 -106330 -395170 -117170 -23507 -132966 -138746 82367 46823 194543
6360 194543 -231855 258292 -98250 -104248 -297568 355501 -419861 -338947 -145770 181852
6349 -212740 -107433 174797 -10885 10401 60437 -60310 168558 19462 -3812 65509 -98070
6337 -239617 -38660 186800 -117718 -256070 114767 -224854 273707 -396095 11215 329293
6327 329293 -288208 -83238 343030 244636 -267833 -140814 64910 -100914 78391 32217 146427
6316 146427 -24820 33859 -97182 -22186 150061 -271744 19471 66602 -96364 -50546 123498
6304 -4801 209323 77355 12335 192834 -104150 168658 12083 306482 -209268 15404 -274581
6292 -6952 93983 226311 46858 -358509 -47603 -347180 -362573 -13224 -233781 -185655 119819
6280 -24476 -36073 100698 -111516 201847 9533 1768 -33946 141927 128973 63593 129970
6269 129970 -89899 -40413 221930 -35919 15008 71682 391927 -166853 -77035 153713 40736
6257 -62924 -32363 -7960 63108 -163403 103401 -96806 -23150 101043 -131387 -98775 171012
6245 -297608 87864 -225346 146312 -129852 102263 116275 30276 51225 85151 -93811 -21737
6233 -126842 -172999 -285004 -202136 -108706 300932 -41463 -42738 -73752 140242 106200 198107
6222 198107 145938 252659 16743 25143 131267 202564 120862 -189889 -265446 -233174 -389600
6211 -389600 -52274 -273897 96688 17626 -59016 -104435 -19836 -205557 141474 152124 131503
6200 131503 294952 -55332 326600 134289 -19920 113903 -165399 39661 -233431 146390
6189 294791 -224026 10244 143579 -125785 47002 117588 -185050 -36306 483346 196216
6178 -307431 -61770 -97654 -296164 153406 -73683 -282386 177468 146596 -180331 214148
6167 14489 69066 330731 -258451 -158457 68319 -126336 -28918 70981 -11477 -150083 -377832
6156 -377832 -97201 -43820 366222 -447904 104084 89861 -56449 65934 -227225 -56330 -132785
6145 -132785 197105 90022 136721 83024 311187 -227885 -112672 53406 100381 -74890 -16357
6133 -23577 -83718 -89791 151747 -132461 -58905 127801 169021 -154352 -13748 -124655 -57887
6121 119325 -30464 123071 27690 -104958 325331 54911 -141865 214819 -208937 57973
6110 193458 66702 24015 243337 103460 -22244 36138 1845 -272669 -128569 -25965 -125257
6099 -125257 32426 130309 -55644 125781 -172697 -293109 -152868 -62191 -9290 -121312 34314
6087 303455 -209341 31128 -12491 -311636 -423927 -99961 -396382 -51472 467652 -35628 131516
6075 125665 -199813 35404 -168396 78108 294167 -105057 -316601 106897 -33873 6342 57690
6064 57690 -296029 -271240 156531 226862 117423 -180253 -176746 -80740 -131760 -93319 65701
6052 246630 -240099 -106204 298544 124887 -33810 87688 379660 -135540 272 -194311 -212498
6041 -212498 -192980 -63904 10087 99882 -91359 36286 31401 147852 -97666 -174079 -27695 -81902
6029 -81902 -218463 244086 84434 115153 -160840 257497 -17283 -229416 15953 -99550 -305527
6018 -305527 17082 138396 169730 268991 3587 155267 364189 149122 25708 44540 266128
6007 266128 -2 -38629 -48880 -172241 206017 50801 89944 1269 -243120 175252 -101636 -166817
5995 -166817 2792 -136623 -20758 -75863 354331 -75917 -46943 37700 -96717 -115218 245660
5983 15855 -47366 -51339 143154 -32778 176175 -158492 201706 69357 -165802 -213492 -294778
5972 -294778 252199 -262620 53231 193985 148630 -176401 -104510 51523 -22134 290554 46923
5960 -194774 -273393 -250000 -186237 452865 51441 -41969 -281106 149838 -57820 -8697 -265352
5949 -265352 133086 -111443 287964 290827 5326 147917 22793 -163523 -369 155896 -291519
5937 269262 -66138 58036 -62980 -163233 458344 105129 63420 -64368 -331997 194809 54792
5925 9239 -12790 147842 56001 -113178 -41205 -63113 136180 -46483 -14396 -70300 -58497
5914 -58497 28681 -39480 141814 -291720 456895 -455710 -4123 -55593 177242 45414 355619
5903 355619 -56041 -115484 -111994 -55678 32799 73743 -100370 -83648 113153 -1895 -104408
5892 -104408 -364302 -139397 -198171 120522 8441 -77522 275281 -83533 22254 -149904 44702
5880 -214470 -53995 126857 -118027 -169332 27939 -116580 65528 -306265 -25117 52786 -112930
5868 285093 464209 52571 -230469 -60224 115939 -172319 -144109 213791 96806 -248222
5857 103046 68905 87745 132063 -147073 -25437 -32202 29699 -279558 -12477 7532 134416
5846 134416 148297 -164793 -188776 5294 122252 -59227 64660 11143 -290370 -405282 36320
5834 -211950 120974 22659 -370465 328857 -61036 101075 -72280 210539 -51359 -82807 160006
5822 -48541 47848 247996 96008 265292 206611 73823 -62266 -89423 -6093 106119 -140216
5810 -20006 130708 13439 -219644 16036 153630 -2575 -122392 -21554 71938 113505 -111105
5798 -241555 149841 -273407 101141 151618 -113666 42843 440474 -21788 103353 -36938
5787 176542 -81015 69847 128594 32861 -21256 80898 -126976 63296 -871 111378 99484 -59683
5774 125806 -219919 32172 36512 -90912 85264 -84446 -61110 178711 -5316 -39030 92771 59413
5762 59413 459339 -161652 316624 256391 -141795 -123769 65162 -78202 136546 63501 -200800
5750 -79890 -106829 70419 91937 -75291 -263330 -189754 194212 -195314 -324192 -189766 157350
5738 199101 184789 97082 -242852 -67510 -204477 23255 161640 -380017 160282 229633 -203332
5726 129193 -252863 -22068 -124297 138452 -309872 50988 52187 -240146 54586 290991 -116102
5714 103994 -91760 55973 -143465 -222744 80068 262175 -273582 -1311 -89560 -32195 267247
5702 255053 217002 124839 376643 -339730 56991 189099 209379 99255 73875 -279640 182234
5690 -104966 199478 31165 -3949 7234 35011 -182511 166593 -264355 -45031 330174 133729
5678 69416 37322 -128970 29918 183488 162637 -33485 -149551 -77526 -146222 -287474 -24302
5666 -1397 -108457 -146777 111360 -142831 -157832 102732 65321 -174187 -45619 32557 -8758
5654 2711 91592 -2201 -129972 -391880 -206168 -270814 234425 -287939 -287133 -87235 37421 -103300
5641 236688 10960 -48156 -154168 -129477 80801 2669 -90583 82858 -33615 -145766 -30764
5629 -45919 -372042 -118139 -127376 -128788 -47217 -373483 135972 285604 -328386 -197000 48058
5617 147817 57038 -140710 -106188 147718 81031 425752 6216 54952 -137898 407767 38070
5605 -49925 83468 -347972 257954 -121910 -933 13872 156307 -43779 121830 -394019 -73172
5593 -112348 139847 282381 -167460 -257316 136570 -187123 70879 -30253 -343804 59668
5582 -18010 300440 -78949 -67510 508945 -162442 -60788 125975 -237251 -178886 69762 -114437
5570 -122286 -35804 68141 -22742 61493 -151363 163293 -122793 -279277 -38335 158817 147753
5559 147753 -55989 65610 78691 -254406 60250 25057 -147821 128559 287129 -192323 -329955
5548 -329955 -409453 23130 69940 -281417 -315896 -222446 -49586 161804 -67658 98754 -1029
5536 235429 -181564 54234 -192536 88870 374814 97721 138924 87345 43856 -226375 -81959
5524 37087 64321 -39331 65559 113515 -30193 -111868 -54427 -68488 109531 20110 -89059 -197444
5512 -197444 -40695 63607 -2638 -89302 -141051 -168960 -86759 -46548 -90989 186578 51867 115238
5500 115238 -106940 -96799 50725 27553 420281 122210 -100419 520267 -7590 -49845 96559
5488 30808 185065 77090 -217722 -226588 79891 -199602 -24638 -331179 13953 178408 -102539
5476 -212436 -52745 201473 137364 123460 79559 52744 -42430 -1634 -108633 116948 314563
5465 314563 115322 -107328 -31244 -16768 239285 268859 87421 -113031 22516 -6392 -272327
5454 -272327 135083 96560 -115239 -95015 -277703 -262899 86495 -12644 -147123 190208 -69543
5442 -20695 151770 -250868 -40713 -170977 77184 312255 -64346 -70305 237820 -84801 -100387
5431 -100387 128727 -225573 135188 -80066 4945 25931 -219460 125327 38644 -105218 -5183
5419 36157 72428 -71241 301918 -45006 -68785 238010 177985 87219 -235600 232527 -129466
5407 132054 23055 196143 -104986 -87026 -147568 50776 78177 -140287 182359 255175 107623
5395 -64875 231802 243777 -121047 -56667 -112364 172238 -172474 -313009 -123615 -108162 -54635
5384 -54635 -187521 68839 -22313 110141 53456 144057 -77310 26564 200959 -94582 -204179
5373 -204179 215999 357254 148810 -39807 -21641 -115265 -33401 -164722 64270 -211974 -202948
5362 -202948 152324 -206016 113835 -50948 -243383 -30772 -239750 -146398 -71804 -95369 -173078
5351 -173078 94561 -405605 -195435 68606 172459 4233 286172 -11966 84120 46029 -170154
5339 95565 -59538 55228 267860 64766 -323996 95405 79953 24166 9012 -184401 49339
5327 124343 -169150 142124 133453 -70528 -111328 96058 -250900 34177 174134 -117097 36417
5315 -53510 -59218 42532 248363 -26993 -80289 -112973 223438 43497 -184097 247641 -162408
5303 -309220 179841 482291 -30813 -238981 60910 -9899 47413 132601 -46347 -177479 -23542
5291 97147 209741 13939 -175843 192906 85192 -72428 449879 104774 63626 -147580 -180460
5280 -180460 -230411 14973 37119 -122497 -296793 -56867 -87743 -151659 254062 -90027 22528
5268 -95714 198941 56475 -78664 -439332 -19090 120070 9153 -403647 -203681 295246 -351532
5256 211576 -266585 13439 4145 -45062 -32976 -144503 -197925 -206616 -205245 228988 148742 -48647
5243 -92752 93109 35390 -93643 -453976 97537 -5392 -114128 61383 -309887 -213396 43818
5231 11354 -134895 -122773 -304477 -209716 132454 -46711 289635 -134145 -40920 -86106 -182025
5220 -182025 60317 112649 -228746 80896 -135217 -190781 71022 228780 -35649 93342 -85421
5208 88220 20186 -43874 -93278 116205 -114411 -349105 123084 -17076 189286 -28524 30990
5196 -395577 23115 -83047 -130174 -208817 31341 11974 -35919 -111476 378476 -32816 -148842
5185 -148842 -210839 -173184 76449 282409 -67940 -42810 158805 -120326 124236 49360 122582
5174 122582 141792 -45939 -49049 -413939 199696 41844 -40092 10356 -66377 99604 156808
5163 156808 -11008 378059 196941 -125928 153906 -99989 272684 243051 -104866 354202
5152 -516335 96596 -207924 77619 -8170 89585 -141452 129864 137454 199679 -394178 147961
5140 182950 -54788 -132808 198313 398316 134114 118725 -83778 203242 223822 -297510 117921
5128 -235279 149427 2214 148601 240931 -44607 -192722 -115567 30886 119167 21275 -124537
5116 -161060 -79550 300730 -14043 -135571 69803 233977 -248222 -67751 -113147 21350 207038
5105 207038 124154 -173765 5380 517959 120679 -102656 -170106 -89997 77674 177071 -32247
5093 3802 -62882 221036 309254 90144 25956 5189 -12324 -20801 -50242 -154478 280444 -35765
5080 -6999 -224324 222154 217647 -65167 236041 -8858 -72401 136078 153321 -218798 243440
5068 15516 -75993 79466 324518 -199844 59874 -357714 -248626 -184955 11624 51799 -7883
5056 78596 -25335 247630 226767 -65652 209633 -177344 -175063 253063 174811 91405 50768
5045 50768 98449 -139589 301147 -36493 -244227 -39126 281479 136312 -310943 31213 86371
5034 86371 221828 -34971 29494 -42504 -16326 163122 35426 -54722 -42213 112435 323831
5023 323831 206954 -281910 212863 -215412 -378376 -152220 328546 -189681 40136 41783
5013 41783 -46106 370282 196635 -315891 226068 34612 82866 207461 -178262 -165919 220207
5001 -182439 61463 20207 -14800 -127037 50642 125383 -61534 -20080 -114058 -232144 196934
4989 -99688 -140048 -14053 59155 152480 270216 -7974 105042 185441 114956 -133991 53473
4977 262523 184700 3679 53470 -141235 -143793 -82727 -153912 56568 284083 -183396 31246
4965 239026 -133406 16839 -227550 -72842 -23264 18663 -30371 -42165 203601 27070 42102
4954 42102 -205864 -211403 435489 191479 222188 159766 8224 -79562 154064 -46755 401408
4942 -204511 270275 -289961 53515 -263250 121002 150874 -81512 -90308 -85771 437532 -31186
4930 -36392 -135318 -240570 -24614 161834 176272 123016 292759 -4909 346869 -129876 -390209
4919 -390209 575597 -179168 -100954 324992 103478 -194554 432606 65373 -111865 -139690
4909 -139690 187310 -102524 -39575 -109141 -42194 -149053 -130538 -234640 229343 41767 33037
4898 33037 82862 -17864 -254127 167075 145440 251448 -37516 -5531 176260 -80339 131124
4886 40154 39824 214643 -228387 59234 283264 208330 -128220 -59312 -105746 30895 -34100
4874 -156573 -96215 76919 21812 11440 -214045 183254 154337 -209073 -51995 41237 31383
4863 31383 36066 242252 397580 -195404 -18563 -144151 -308280 -110902 -67995 -412104 31399
4851 91290 83868 -68620 -204081 153905 -159643 -295013 148358 -353995 -360717 121117 -51371
4839 12397 39777 -5841 138694 100964 530202 211746 -245839 -39073 -9750 -131126 116463
4827 782 276993 -259559 23569 415976 -21232 -111563 167981 -31705 -331446 49938 278278
4816 278278 102882 186119 -46441 77684 -48059 65906 -224895 -22813 294057 -166859 32531
4804 -308402 -176940 -78676 -54453 -212807 44834 154909 106460 288680 -7006 -171899 69531
4792 248252 -28399 -8222 -91932 163895 -115995 64571 231889 250686 -341273 153346 -161437
4780 457144 80147 194233 -225817 47703 52609 -70096 38782 -19743 80537 115612 -244713
4768 118426 145915 -70465 -121580 271543 -38715 173452 171388 -145935 213088 77927 -146445
4756 128350 -186421 136524 116877 185110 17609 170774 -52671 83900 -21489 67465 -129702
4744 307379 199786 -191129 160179 170246 254214 264849 -70932 103484 109208 176631 14103
4732 -123468 70654 -181135 -36502 -168775 165791 41836 -57324 -207417 358987 199551
4722 199551 -177908 60221 -117415 -1091 -3903 -8037 -38312 -18048 141439 15899 506909
4711 506909 -176540 -193583 -141513 -80379 -70414 -253821 -257998 100485 -186934 38872 -454398
4699 183499 12286 -173902 161863 50701 -64228 -216197 39366 357398 158977 291772
4689 291772 -169791 58292 152093 57666 199071 325637 3335 30962 215577 -32700 256501
4677 232651 -203642 174865 106680 -17121 93022 397716 -158340 87273 2325 -81989 -314327
4666 -314327 122600 -61584 -28089 171296 -75944 -358656 -18265 97302 -151319 252095 -156330
4654 -92831 360353 334269 -96252 -327 134973 131660 -84610 9374 10107 -215144 -213010 178663
4641 18271 249205 -57206 51693 45711 62983 -58810 91756 129697 461191 236733 37238
4629 -227715 -97861 297661 -213948 -11419 326923 -96969 -48581 -176754 -130734 -172603 146382
4617 332648 -26964 -29110 271729 -47924 395122 142417 72534 -115261 64418 -75299 -177718
4606 -177718 59116 246698 32189 95491 143370 -117364 109775 108573 -70953 -62912 187200
4594 -119846 159138 -240163 -339079 60732 128362 -231828 -60644 -47798 110690 12605 92514
4583 92514 114653 -220930 158698 -241842 -117009 -161312 -36158 -233956 -14732 26436 -14196
4571 -256751 66870 109983 -51124 137919 -20251 -58799 243693 -74971 284226 -147475 -53563
4559 86530 268389 52489 375878 88865 46133 -84040 -65410 73244 -281428 65529 -62258
4547 110065 296 -229340 -59074 25391 -86141 -70810 2911 -44475 123267 -535386 17992 -244908
4534 15646 174997 -69456 -151580 325743 38352 -147060 210748 -38548 -29929 74021 313880
4523 313880 135600 169892 233885 72560 -169287 260077 26852 186830 101594 10821 53695
4512 53695 -94505 33002 -8685 15120 97902 -102957 171151 226597 22059 -172804 -263831
$$ [...]
##END NTUPLES=NMR SPECTRUM
##END=
