
##TITLE=UV1126_M3-1004-1000_6274846_yQHDf1dNtN
##JCAMPDX= 6.0         $$ Bruker NMR JCAMP-DX V2.0
##DATA TYPE= NMR SPECTRUM
##DATA CLASS= NTUPLES
##ORIGIN= BRUKER
##OWNER= Administrator
$$ 1.72 TOPSPIN		Version 2.1
$$ 2012-06-02 22:06:42.531 -0500  Administrator@TOPSPIN
$$ Compression mode = diff/dup
##.OBSERVE FREQUENCY= 400.13188235
##.OBSERVE NUCLEUS= ^1H
##.ACQUISITION MODE= SIMULTANEOUS (DQD)
##.ACQUISITION SCHEME= undefined
##.AVERAGES= 64
##.DIGITISER RES= 22
##SPECTROMETER/DATA SYSTEM= spect
##.PULSE SEQUENCE= noesygpps1d.comp
##.SOLVENT NAME= COFFEE_meoh
##.SHIFT REFERENCE= INTERNAL, COFFEE_meoh, 1, 14.96715
##AUDIT TRAIL= $$ (NUMBER, WHEN, WHO, WHERE, PROCESS, VERSION, WHAT)
$$ ##TITLE= Audit trail, TOPSPIN		Version 2.1
$$ ##JCAMPDX= 5.01
$$ ##ORIGIN= Bruker BioSpin GmbH
$$ ##OWNER= Administrator
$$ $$ C:\Bruker\TOPSPIN/data/COFFEE/nmr/UV1126_M3-1004-1000_6274846_yQHDf1dNtN/12/pdata/1/auditp.txt
$$ ##AUDIT TRAIL=  $$ (NUMBER, WHEN, WHO, WHERE, PROCESS, VERSION, WHAT)
(   1,<2012-06-02 22:06:37.156 -0500>,<Administrator>,<TOPSPIN>,<go>,<TOPSPIN 2.1>,
      <created by zg
	started at 2012-06-02 21:55:06.859 -0500,
	POWCHK enabled, PULCHK disabled,
       configuration hash MD5:
       D5 CA 7A 23 FE 6B EE E2 50 67 74 61 24 F7 5E 3B
       data hash MD5: 64K
       FB 5A 04 4D 08 6C D3 8D D5 42 21 86 69 9D 82 44>)
(   2,<2012-06-02 22:06:40.218 -0500>,<Administrator>,<TOPSPIN>,<proc1d>,<TOPSPIN 2.1>,
      <Start of raw data processing
       efp LB = 0.3 FT_mod = 6 PKNL = 1 PHC0 = 0 PHC1 = 0 SI = 128K 
       data hash MD5: 128K
       A1 91 43 EA 0A 34 D5 C8 EB A7 EC 66 85 EB 5E 23>)
(   3,<2012-06-02 22:06:41.421 -0500>,<Administrator>,<TOPSPIN>,<proc1d>,<TOPSPIN 2.1>,
      <pk PHC0 = 34.91455 PHC1 = 0 
       data hash MD5: 128K
       02 4B 48 F3 7C F3 C5 5D 49 2E 23 E3 F7 A5 ED 30>)
(   4,<2012-06-02 22:06:42.203 -0500>,<Administrator>,<TOPSPIN>,<proc1d>,<TOPSPIN 2.1>,
      <abs ABSG = 1 
       data hash MD5: 128K
       98 CF 48 0E 58 5F CF 2F DB FA EA 62 2D DF F6 54>)
(   5,<2012-06-02 22:06:42.265 -0500>,<Administrator>,<TOPSPIN>,<proc1d>,<TOPSPIN 2.1>,
      <abs ABSG = 2 
       data hash MD5: 128K
       AC D4 F0 D9 66 5A ED 96 32 1A 7E F4 56 59 09 E5>)
(   6,<2012-06-02 22:06:42.328 -0500>,<Administrator>,<TOPSPIN>,<proc1d>,<TOPSPIN 2.1>,
      <abs ABSG = 3 
       data hash MD5: 128K
       91 2E D3 98 31 82 D5 07 DA FA F5 10 7B 8C FC 76>)
(   7,<2012-06-02 22:06:42.390 -0500>,<Administrator>,<TOPSPIN>,<proc1d>,<TOPSPIN 2.1>,
      <abs ABSG = 4 
       data hash MD5: 128K
       B5 A1 C3 44 65 2A CA CE C7 74 B6 C5 A9 16 41 F9>)
(   8,<2012-06-02 22:06:42.453 -0500>,<Administrator>,<TOPSPIN>,<proc1d>,<TOPSPIN 2.1>,
      <abs ABSG = 5 
       data hash MD5: 128K
       A8 DE A7 B7 03 EF 7F FC E7 1F DC C0 35 82 14 75>)
$$ ##END=
$$ 
$$ $$ hash MD5
$$ $$ B6 9E 52 2E 63 07 4A 05 68 DB 6C 8C DB AF 29 31
##$RELAX= 
##$RELAX= 
##$RELAX= 
##$RELAX= 
##$RELAX= 
##$RELAX= 
##$RELAX= 
##$RELAX= 
$$ Bruker specific parameters
$$ [...]
##$TP07= 0
##$TPNAME0= <>
##$TPNAME1= <>
##$TPNAME2= <>
##$TPNAME3= <>
##$TPNAME4= <>
##$TPNAME5= <>
##$TPNAME6= <>
##$TPNAME7= <>
##$TPOAL= (0..7)
0.5 0.5 0.5 0.5 0.5 0.5 0.5 0.5
##$TPOFFS= (0..7)
0 0 0 0 0 0 0 0
##$TUNHIN= 0
##$TUNHOUT= 0
##$TUNXOUT= 0
##$USERA1= <user>
##$USERA2= <user>
##$USERA3= <user>
##$USERA4= <user>
##$USERA5= <user>
##$V9= 5
##$VALIST= <valist>
##$VCLIST= <CCCCCCCCCCCCCCC>
##$VD= 0
##$VDLIST= <DDDDDDDDDDDDDDD>
##$VPLIST= <PPPPPPPPPPPPPPP>
##$VTLIST= <TTTTTTTTTTTTTTT>
##$WBST= 2048
##$WBSW= 25
##$XGAIN= (0..3)
0 0 0 0
##$XL= 0
##$YL= 0
##$YMAX_a= 11418787
##$YMIN_a= -6547765
##$ZGOPTNS= <>
##$ZL1= 120
##$ZL2= 120
##$ZL3= 120
##$ZL4= 120
##$ABSF1= 14.96715
##$ABSF2= -5.585381
##$ABSG= 5
##$ABSL= 3
##$ALPHA= 0
##$AQORDER= 0
##$ASSFAC= 0
##$ASSFACI= 0
##$ASSFACX= 0
##$ASSWID= 0
##$AUNMP= <proc_prof1d_extract.lims>
##$AXLEFT= 0
##$AXNAME= <>
##$AXNUC= <1H>
##$AXRIGHT= 0
##$AXTYPE= 0
##$AXUNIT= <>
##$AZFE= 0.1
##$AZFW= 0.1
##$BCFW= 0
##$BC_mod= 0
##$BYTORDP= 0
##$COROFFS= 0
##$CY= 15
##$DATMOD= 1
##$DC= 0
##$DFILT= <>
##$DTYPP= 0
##$F1P= 0
##$F2P= 0
##$FCOR= 0.5
##$FTSIZE= 131072
##$FT_mod= 6
##$GAMMA= 0
##$GB= 0
##$INTBC= 1
##$INTSCL= 1
##$ISEN= 128
##$LB= 0.3
##$LEV0= 0
##$LPBIN= 0
##$MAXI= 10000
##$MC2= 0
##$MEAN= 0
##$ME_mod= 0
##$MI= 0
##$NCOEF= 0
##$NC_proc= -3
##$NLEV= 6
##$NOISF1= 0
##$NOISF2= 0
##$NSP= 0
##$NTH_PI= 0
##$NZP= 0
##$OFFSET= 14.96715
##$PC= 1
##$PHC0= 34.91455
##$PHC1= 0
##$PH_mod= 1
##$PKNL= yes
##$PPARMOD= 0
##$PPDIAG= 0
##$PPIPTYP= 0
##$PPMPNUM= 2147483647
##$PPRESOL= 1
##$PSCAL= 4
##$PSIGN= 0
##$PYNMP= <proc.py>
##$REVERSE= no
##$SF= 400.130005385126
##$SI= 131072
##$SIGF1= 0
##$SIGF2= 0
##$SINO= 400
##$SIOLD= 131072
##$SPECTYP= <>
##$SREGLST= <1H.CDCl3>
##$SSB= 0
##$STSI= 131072
##$STSR= 0
##$SW_p= 8223.68421052632
##$SYMM= 0
##$S_DEV= 0
##$TDeff= 65536
##$TDoff= 0
##$TI= <>
##$TILT= no
##$TM1= 0
##$TM2= 0
##$TOPLEV= 0
##$USERP1= <user>
##$USERP2= <user>
##$USERP3= <user>
##$USERP4= <user>
##$USERP5= <user>
##$WDW= 1
##$XDIM= 131072
##$YMAX_p= 477710285
##$YMIN_p= -342410848
##$CURPLOT= <Network HP LaserJet P1505>
##$CURPRIN= <$Network HP LaserJet P1505>
##$DFORMAT= <normdp>
##$LAYOUT= <+/1D_H.xwp>
##$LFORMAT= <normlp>
##$PFORMAT= <normpl>
##$SURQMSG= 1
$$ End of Bruker specific parameters
$$ ---------------------------------
##NTUPLES= NMR SPECTRUM
##VAR_NAME=  FREQUENCY,     SPECTRUM/REAL,   SPECTRUM/IMAG
##SYMBOL=    X,             R,               I
##VAR_TYPE=  INDEPENDENT,   DEPENDENT,       DEPENDENT
##VAR_FORM=  AFFN,          ASDF,            ASDF
##VAR_DIM=   131072,        131072,          131072
##UNITS=     HZ,            ARBITRARY UNITS, ARBITRARY UNITS
##FACTOR=    0.0627417313425165, 1,          1
##FIRST=     8223.62146879498, 6095,         -106439
##LAST=      0,             8340,            -105507
##MIN=       0,             -342410848,      0
##MAX=       8223.62146879498, 477710285,    0
$$ Real data points
##PAGE= N=1
##DATA TABLE= (X++(R..R)), XYDATA
$$ [...]
$$ plain form
63492 1295133 1329110 1365591 1403468 1442243 1482383 1523679 1563917 1599710 1628331 1648413 1659500
63481 1659500 1661778 1656372 1645436 1631632 1617201 1603163 1589345 1575406 1561724 1548752 1535559 1519784
63469 1519784 1499476 1474534 1446104 1415092 1381734 1346127 1308641 1270039 1231527 1194328 1158865
63458 1158865 1124692 1091552 1060093 1031180 1004917 980767 958249 937088 917199 899004 883218
63447 883218 869657 856790 843281 829594 817232 806746 797447 788832 781180 774751 769454 765412 762819
63434 762819 761045 758906 756249 754327 753976 754301 753865 752574 751482 751177 751363 752052 754205 758623 764535 769947
63418 769947 773594 776164 779168 782818 785726 786775 786274 784775 781831 777078 771739 767501 764225 760441
63404 760441 756112 753085 752286 752329 751897 751971 754315 758910 764457 770626 778169 787105 796309 804965 813299 821845
$$ packed form
63492A295133L3977L6481L7877L8775M0140M1296M0238L5793K8621K0082J1087
63481A659500K278n406j0936j3804j4431j4038j3818j3939j3682j2972j3193j5775
63469A519784k0308k4942k8430l1012l3358l5607l7486l8602l8512l7199l5463
63458A158865l4173l3140l1459k8913k6263k4150k2518k1161j9889j8195j5786
63447H83218j3561j2867j3509j3687j2362j0486r299q615p652o429n297m042k593
63434G62819j774k139k657j922l51L25m36j291j092l05J86O89K153M418N912N412
63418G69947L647K570L004L650K908J049n01j499k944m753n339m238l276l784
63404G60441m329l027p99M3m32P4K344M595N547O169P543Q936R204Q656Q334Q546
$$ plain form
63388 821845 830968 841183 853065 866728 882059 899476 919761 943143 969128 997125 1026702 1057545
63376 1057545 1089827 1124181 1160349 1196262 1229617 1260173 1289274 1317206 1342582 1364708 1385320
63365 1385320 1407317 1432710 1462185 1495540 1531754 1569426 1607896 1647413 1687696 1726936 1762586
63354 1762586 1792528 1815335 1830495 1838944 1842360 1841204 1834477 1822134 1806554 1790424 1774104 1756513
63342 1756513 1737642 1718200 1697067 1671248 1639087 1602132 1563118 1523242 1482361 1441096 1401622
63331 1401622 1366205 1335373 1307588 1280746 1254180 1229153 1207294 1189076 1174338 1163655 1157921
63320 1157921 1156531 1157248 1158446 1160665 1165460 1173574 1184951 1199794 1218449 1240319 1263722 1286986 1309429
63307 1309429 1331418 1353927 1377967 1403973 1431688 1460897 1492182 1526581 1564410 1604603 1645137
$$ packed form
63388H21845R123J0215J1882J3663J5331J7417K0285K3382K5985K7997K9577L0843
63376A057545L2282L4354L6168L5913L3355L0556K9101K7932K5376K2126K0612
63365A385320K1997K5393K9475L3355L6214L7672L8470L9517M0283L9240L5650
63354A762586K9942K2807J5160Q449L416j156o727j2343j5580j6130j6320j7591
63342A756513j8871j9442k1133k5819l2161l6955l9014l9876m0881m1265l9474
63331A401622l5417l0832k7785k6842k6566k5027k1859j8218j4738j0683n734
63320A157921j390P17J198K219M795Q114J1377J4843J8655K1870K3403K3264K2443
63307A309429K1989K2509K4040K6006K7715K9209L1285L4399L7829M0193M0534
$$ plain form
63296 1645137 1683893 1719183 1749804 1774832 1793465 1805207 1810258 1809371 1803119 1791636 1775501 1756581
63284 1756581 1737204 1718301 1698928 1677804 1654629 1629380 1601185 1569113 1534016 1498284 1463246
63273 1463246 1427884 1390955 1353463 1317715 1284467 1252703 1222331 1195317 1173307 1155565 1140375
63262 1140375 1127197 1115866 1104545 1090635 1073769 1056116 1039239 1022204 1003518 983609 964320
63251 964320 946777 930808 915926 901915 888813 877131 867864 861558 857476 854137 850394 845623 839533
63238 839533 832619 826377 821955 818516 813722 805919 795369 783508 771768 761062 751517 742453 733240
63225 733240 724267 716468 709942 703987 698708 695434 694796 695235 694482 692150 689883 689064 689284 689242 688396 687314
63209 687314 686937 687939 690545 694443 698812 702814 706296 709910 714372 719615 724955 730269 736671 745503
$$ packed form
63296A645137L8756L5290L0621K5028J8633J1742N051q87o252j1483j6135j8920
63284A756581j9377j8903j9373k1124k3175k5249k8195l2072l5097l5732l5038
63273A463246l5362l6929l7492l5748l3248l1764l0372k7014k2010j7742j5190
63262A140375j3178j1331j1321j3910j6866j7653j6877j7035j8686j9909j9289
63251I64320j7543j5969j4882j4011j3102j1682r267o306m082l339l743m771o090
63238H39533o914o242m422l439m794p803j0550j1861j1740j0706r545r064r213
63225G33240q973p799o526n955n279l274o38M39p53k332k267q19K20m2q46j082
63209F87314l77J002K606L898M369M002L482L614M462N243N340N314O402Q832
$$ plain form
63195 745503 756561 767790 777181 784855 792917 803337 816345 830905 846287 862731 880761 900332
63183 900332 920870 941967 963825 987102 1012469 1040243 1070218 1101842 1134655 1168563 1203548
63172 1203548 1239327 1275578 1312445 1350326 1389058 1427785 1465953 1503999 1542671 1581902 1620788
63161 1620788 1658446 1694515 1729145 1763030 1797213 1832067 1866348 1897699 1924232 1945337 1961181
63150 1961181 1972057 1978151 1979231 1974521 1963549 1947228 1927279 1904483 1878447 1849399 1819044 1788943
63138 1788943 1759208 1730012 1703467 1682248 1666425 1653181 1640116 1627768 1618349 1613011 1611111 1611590
63126 1611590 1614249 1619752 1628831 1641488 1656868 1674122 1693353 1715248 1739520 1764234 1787174 1807798
63114 1807798 1827588 1848520 1871179 1894093 1914767 1931688 1945391 1957267 1967369 1973982 1975406 1971269
$$ packed form
63195G45503J1058J1229R391P674Q062J0420J3008J4560J5382J6444J8030J9571
63183I00332K0538K1097K1858K3277K5367K7774K9975L1624L2813L3908L4985
63172A203548L5779L6251L6867L7881L8732L8727L8168L8046L8672L9231L8886
63161A620788L7658L6069L4630L3885L4183L4854L4281L1351K6533K1105J5844
63150A961181J0876O094J080m710j0972j6321j9949k2796k6036k9048l0355l0101
63138A788943k9735k9196k6545k1219j5823j3244j3065j2348r419n338j900M79
63126A611590K659N503R079J2657J5380J7254J9231K1895K4272K4714K2940K0624
63114A807798J9790K0932K2659K2914K0674J6921J3703J1876J0102O613J424m137
$$ plain form
63102 1971269 1961545 1945269 1921424 1890850 1856102 1819178 1780207 1738659 1695107 1651279 1608758
63091 1608758 1568078 1528857 1490510 1453084 1417609 1385431 1356927 1331044 1306340 1282359 1259868
63080 1259868 1239950 1223093 1208966 1196878 1186571 1178683 1174245 1173531 1175572 1178911 1182642 1186589 1190930
63067 1190930 1196114 1202842 1211528 1221679 1232104 1241761 1250138 1256972 1262032 1265268 1266888 1267195 1266529 1265255
63053 1265255 1263615 1261794 1260407 1260523 1262527 1265198 1266794 1267081 1267369 1268420 1269414 1269408 1268684 1267834 1266586 1264790
63037 1264790 1263759 1264978 1267680 1269404 1269282 1269271 1271522 1275815 1280532 1285180 1290703 1297854 1306433 1315961 1326049
63022 1326049 1336014 1345017 1352876 1360194 1367489 1374744 1382117 1390740 1402373 1418283 1438429 1461542 1486012
63009 1486012 1510966 1536627 1563562 1591755 1620727 1650564 1682358 1717398 1756152 1798232 1843216
$$ packed form
63102A971269r724j6276k3845l0574l4748l6924l8971m1548m3552m3828m2521
63091A608758m0680l9221l8347l7426l5475l2178k8504k5883k4704k3981k2491
63080A259868j9918j6857j4127j2088j0307p888m438p14K041L339L731L947M341
63067A190930N184O728Q686J0151J0425R657Q377O834N060L236J620L07o66j274
63053A265255j640j821j387J16K004K671J596K87K88J051R94op24q50j248j796
63037A264790j031J219K702J724j22j1K251M293M717M648N523P151Q579R528J0088
63022A326049R965R003P859P318P295P255P373Q623J1633J5910K0146K3113K4470
63009A486012K4954K5661K6935K8193K8972K9837L1794L5040L8754M2080M4984
$$ plain form
62998 1843216 1891256 1942979 1999071 2059976 2125715 2195668 2268576 2343166 2419204 2497803 2580116
62987 2580116 2665482 2751294 2835149 2916898 2998103 3079665 3160620 3239391 3315568 3390052 3463807
62976 3463807 3536988 3609088 3679212 3745916 3807117 3860718 3905472 3941039 3967035 3982128 3984315
62965 3984315 3972163 3945732 3906326 3855530 3794610 3724708 3647414 3565032 3480159 3395004 3311227
62954 3311227 3230480 3154739 3085709 3024112 2970165 2924639 2888684 2862346 2844072 2832224 2826521
62943 2826521 2827328 2834158 2845942 2862581 2885171 2914337 2948978 2986878 3025990 3065016 3103471 3141752
62931 3141752 3180765 3220908 3261293 3299973 3334749 3363816 3386082 3401180 3409067 3409519 3402079 3386307
62919 3386307 3361739 3327769 3284048 3230907 3168837 3097729 3017523 2929809 2837912 2744896 2652156
$$ packed form
62998A843216M8040N1723N6092O0905O5739O9953P2908P4590P6038P8599Q2313
62987B580116Q5366Q5812Q3855Q1749Q1205Q1562Q0955P8771P6177P4484P3755
62976C463807P3181P2100P0124O6704O1201N3601M4754L5567K5996J5093K187
62965C984315j2152k6431l9406n0796o0920o9902p7294q2382q4873q5155q3777
62954C311227q0747p5741o9030o1597n3947m5526l5955k6338j8274j1848n703
62943B826521Q07O830J1784J6639K2590K9166L4641L7900L9112L9026L8455L8281
62931C141752L9013M0143M0385L8680L4776K9067K2266J5098P887M52p440j5772
62919C386307k4568l3970m3721n3141o2070p1108q0206q7714r1897r3016r2740
$$ plain form
62908 2652156 2560415 2471197 2386246 2305862 2228927 2154706 2083839 2017284 1954802 1894986 1836739
62897 1836739 1780533 1728003 1680072 1635520 1591867 1547876 1504694 1464234 1427032 1392340 1359772
62886 1359772 1329728 1302147 1275858 1249711 1223873 1199508 1177486 1157806 1140048 1123870 1108929
62875 1108929 1094699 1080840 1067776 1056485 1047299 1039173 1030710 1021845 1013756 1006972 1000556 993723 987314
62862 987314 982571 979045 975042 969877 964292 958561 951807 943828 936214 930516 926226 921747 916673 911735
62848 911735 906895 901127 894389 888393 884677 882903 881878 881412 882003 883096 883076 881310 879212 878715 880250
62833 880250 882675 884592 885171 884186 882128 880115 878900 877970 876305 874022 872461 872440 873318 874128 874747 875245
62817 875245 874919 873052 870270 868068 867062 866675 866512 866923 867795 867784 865693 862181 859254 858047 857759 857002
$$ packed form
62908B652156r1741q9218q4951q0384p6935p4221p0867o6555o2482n9816n8247
62897A836739n6206n2530m7931m4552m3653m3991m3182m0460l7202l4692l2568
62886A359772l0044k7581k6289k6147k5838k4365k2022j9680j7758j6178j4941
62875A108929j4230j3859j3064j1291r186q126q463q865q089o784o416o833o409
62862I87314m743l526m003n165n585n731o754p979p614n698m290m479n074m938
62848I11735m840n768o738n996l716j774j025m66N91J093k0j766k098m97J535
62833H80250K425J917N79r85k058k013j215r30j665k283j561k1Q78Q10O19M98
62817H75245l26j867k782k202j006l87j63M11Q72j1k091l512k927j207k88p57
$$ plain form
62801 857002 855760 855520 857476 861025 864327 866188 867089 868433 871204 875308 879626 882524 882971 881625 880324
62786 880324 880117 880361 880216 880134 880899 881936 881969 881081 880698 881461 882522 883277 884412 886611 889343 891665 893312
62769 893312 894374 894988 896157 899727 906288 913850 919911 924426 929500 936578 945261 954639 964230 973465
62755 973465 981713 989471 998424 1009607 1022224 1034902 1047419 1060597 1075056 1090816 1107724 1125515
62743 1125515 1143711 1162188 1181754 1203518 1227587 1253008 1279182 1306868 1337453 1371628 1409209
62732 1409209 1449994 1494184 1541890 1592879 1647212 1705774 1769677 1839379 1914987 1997193 2086942
62721 2086942 2183754 2285192 2388772 2494156 2602774 2715407 2830754 2946292 3059705 3168985
62711 3168985 3271566 3364080 3443293 3507251 3555398 3587522 3602728 3599747 3578201 3539187 3484511
$$ packed form
62801H57002j242k40J956L549L302J861R01J344K771M104M318K898M47j346j301
62786H80324k07K44j45q2P65J037L3q88l83P63J061P55J135K199K732K322J647
62769H93312J062O14J169L570O561P562O061M515N074P078Q683R378R591R235
62755I73465Q248P758Q953J1183J2617J2678J2517J3178J4459J5760J6908J7791
62743A125515J8196J8477J9566K1764K4069K5421K6174K7686L0585L4175L7581
62732A409209M0785M4190M7706N0989N4333N8562O3903O9702P5608Q2206Q9749
62721B086942R6812J01438J03580J05384J08618J12633J15347J15538J13413J09280
62711C168985J02581R2514P9213O3958M8147L2124J5206k981k1546l9014n4676
$$ plain form
62700 3484511 3415847 3334976 3244296 3146326 3042802 2934791 2823755 2712009 2602080 2495840
62690 2495840 2394109 2296609 2202427 2111163 2023725 1941539 1864991 1793308 1726103 1664216 1608596
62679 1608596 1559038 1514710 1475391 1441208 1411282 1383676 1357107 1332104 1309984 1291145 1274982
62668 1274982 1261205 1250386 1242998 1238578 1236298 1235946 1237822 1241988 1248276 1256804 1267717 1280428 1294084
62655 1294084 1309151 1327625 1350987 1378639 1409173 1442632 1480398 1523017 1569288 1617824 1668742
62644 1668742 1723494 1783629 1849948 1922152 1998788 2078094 2159619 2244900 2335907 2432671 2532556
62633 2532556 2631772 2727322 2817478 2900829 2975488 3039510 3091780 3131752 3158110 3168285 3160069
62622 3160069 3133657 3091600 3036722 2970521 2893639 2807396 2714474 2618122 2520720 2423115 2325466
$$ packed form
62700C484511o8664q0871r0680r7970j03524j08011j11036j11746j09929j06240
62690B495840j01731r7500r4182r1264q7438q2186p6548p1683o7205o1887n5620
62679A608596m9558m4328l9319l4183k9926k7606k6569k5003k2120j8839j6163
62668A274982j3777j0819p388m420k280l52J876M166O288Q528J0913J2711J3656
62655A294084J5067J8474K3362K7652L0534L3459L7766M2619M6271M8536N0918
62644A668742N4752O0135O6319P2204P6636P9306Q1525Q5281R1007R6764R9885
62633B532556R9216R5550R0156Q3351P4659O4022N2270L9972K6358J0175q216
62622C160069k6412m2057n4878o6201p6882q6243r2922r6352r7402r7605r7649
$$ plain form
62611 2325466 2228696 2134689 2044875 1959231 1877206 1799081 1725607 1656697 1591548 1530140 1473678
62600 1473678 1423188 1378209 1337079 1298115 1260686 1225634 1194431 1167177 1141721 1115849 1090133
62589 1090133 1067307 1048690 1032639 1016970 1001491 987436 975711 966664 960383 956020 951675 946073
62577 946073 939695 933373 926723 919186 911697 905809 901740 898719 896702 896088 896137 895501 894383 894459 896516 899731
62561 899731 903546 908507 914677 920834 926148 931388 937621 944912 953256 963635 976899 992340 1008519
62548 1008519 1024990 1042235 1060446 1079414 1099344 1120929 1144824 1171771 1202778 1238304 1277467
62537 1277467 1318903 1362272 1408370 1457999 1511281 1567577 1625199 1681558 1734547 1783681 1829102
62526 1829102 1869815 1903947 1930542 1949836 1961610 1964568 1957912 1942607 1920405 1892224 1858020 1817795
$$ packed form
62611B325466r6770r4007q9814q5644q2025p8125p3474o8910o5149o1408n6462
62600A473678n0490m4979m1130l8964l7429l5052l1203k7254k5456k5872k5716
62589A090133k2826j8617j6051j5669j5479j4055j1725r047o281m363m345n602
62577I46073o378o322o650p537p489n888m069l021k017o14M9o36j118P6K057L215
62561H99731L815M961O170O157N314N240O233P291Q344J0379J3264J5441J6179
62548A008519J6471J7245J8211J8968J9930K1585K3895K6947L1007L5526L9163
62537A277467M1436M3369M6098M9629N3282N6296N7622N6359N2989M9134M5421
62526A829102M0713L4132K6595J9294J1774K958o656j5305k2202k8181l4204m0225
$$ plain form
62514 1817795 1772266 1723000 1672225 1622025 1573278 1525707 1479202 1434510 1392349 1352480 1314250
62503 1314250 1277595 1242978 1210783 1181386 1155394 1133111 1113990 1097253 1082817 1070932 1061093
62492 1061093 1052086 1043121 1034347 1026253 1019234 1013747 1010089 1007804 1005858 1003694 1001724 1000648 1000877 1002732
62478 1002732 1006530 1012088 1018686 1025919 1034108 1043536 1053899 1065044 1077670 1092486 1109054 1126311
62466 1126311 1144295 1164625 1189089 1218125 1250656 1285087 1320631 1358146 1399600 1446212 1497189
62455 1497189 1550719 1606002 1663732 1724740 1789022 1856133 1925637 1996747 2068059 2137861 2204247
62444 2204247 2264892 2317634 2361672 2397607 2426110 2447437 2462724 2474613 2485612 2496514 2507368
62433 2507368 2519271 2533932 2551854 2572363 2595522 2622782 2655468 2693610 2736472 2783226 2832610
$$ packed form
62514A817795m5529m9266n0775n0200m8747m7571m6505m4692m2161l9869l8230
62503A314250l6655l4617l2195k9397k5992k2283j9121j6737j4436j1885r839
62492A061093r007q965q774q094p019n487l658k285j946k164j970j076K29J855
62478A002732L798N558O598P233Q189R428J0363J1145J2626J4816J6568J7257
62466A126311J7984K0330K4464K9036L2531L4431L5544L7515M1454M6612N0977
62455A497189N3530N5283N7730O1008O4282O7111O9504P1110P1312O9802O6386
62444B204247O0645N2742M4038L5935K8503K1327J5287J1889J0999J0902J0854
62433B507368J1903J4661J7922K0509K3159K7260L2686L8142M2862M6754M9384
$$ plain form
62422 2832610 2882643 2931052 2975303 3012080 3037867 3050831 3051509 3041042 3019355 2985578 2939421 2881233
62410 2881233 2811425 2731031 2642578 2549199 2452828 2354168 2254404 2155949 2061266 1971893 1888861
62399 1888861 1812987 1744034 1680472 1621102 1566642 1518851 1478257 1443515 1412890 1385421 1360570
62388 1360570 1337812 1317269 1299969 1286560 1276047 1266728 1258271 1251922 1248498 1247220 1247050 1248144 1250856
62375 1250856 1253877 1254724 1252133 1246872 1239995 1231569 1221738 1211801 1203007 1194788 1185401 1174177 1162132 1150402
62361 1150402 1139120 1127985 1116920 1105717 1093936 1081893 1071129 1063078 1057422 1052299 1046034 1038259
62349 1038259 1029675 1021395 1014487 1009496 1006067 1003254 1000395 997626 995677 995343 997030 1000464 1004875 1009769
62335 1009769 1015512 1022851 1031868 1041685 1051207 1059844 1067625 1075206 1083922 1095243 1109633 1126087 1143059
$$ packed form
62422B832610N0033M8409M4251L6777K5787J2964O78j0467k1687l3777m6157n8188
62410B881233o9808q0394q8453r3379r6371r8660r9764r8455r4683q9373q3032
62399A888861p5874o8953o3562n9370n4460m7791m0594l4742l0625k7469k4851
62388A360570k2758k0543j7300j3409j0513r319q457o349l424j278j70J094K712
62375A250856L021Q47k591n261o877q426r831r937q794q219r387j1224j2045j1730
62361A150402j1282j1135j1065j1203j1781j2043j0764q051n656n123o265p775
62349A038259q584q280o908m991l429k813k859k769j949l34J687L434M411M894
62335A009769N743P339R017R817R522Q637P781P581Q716J1321J4390J6454J6972
$$ plain form
62322 1143059 1159656 1175753 1191375 1206578 1221831 1237866 1254875 1272273 1289629 1307759 1328486
62311 1328486 1353141 1381328 1411377 1442038 1473633 1507498 1544583 1584842 1627745 1672865 1720062
62300 1720062 1769775 1823284 1881988 1945960 2013612 2083116 2153462 2223520 2290760 2351984 2405106
62289 2405106 2449249 2483364 2506139 2517621 2519750 2514577 2502672 2483859 2458751 2428701 2394695 2357030
62277 2357030 2315862 2271517 2224534 2175937 2127061 2078575 2030079 1981404 1933951 1889882 1850108
62266 1850108 1813968 1780765 1750536 1722993 1696651 1669699 1641406 1612284 1583336 1555533 1529728
62255 1529728 1506418 1485406 1465819 1446651 1427610 1409720 1394800 1383755 1375323 1366978 1357160 1346227
62243 1346227 1335322 1325101 1315859 1308123 1302420 1298747 1296719 1295948 1295842 1295389 1293857 1291760 1290605 1291541
$$ packed form
62322A143059J6597J6097J5622J5203J5253J6035J7009J7398J7356J8130K0727
62311A328486K4655K8187L0049L0661L1595L3865L7085M0259M2903M5120M7197
62300A720062M9713N3509N8704O3972O7652O9504P0346P0058O7240O1224N3122
62289B405106M4143L4115K2775J1482K129n173j1905j8813k5108l0050l4006l7665
62277B357030m1168m4345m6983m8597m8876m8486m8496m8675m7453m4069l9774
62266A850108l6140l3203l0229k7543k6342k6952k8293k9122k8948k7803k5805
62255A529728k3310k1012j9587j9168j9041j7890j4920j1045q432q345r818j0933
62243A346227j0905j0221r242p736n703l673k028p71j06m53j532k097j155R36
$$ plain form
62229 1291541 1294583 1299129 1304782 1311356 1318459 1325605 1332882 1341192 1351425 1363446 1376236 1389209 1403041
62216 1403041 1418793 1436490 1455146 1474233 1494509 1517077 1542005 1568293 1594997 1622178 1650863
62205 1650863 1682374 1717589 1756666 1799470 1846172 1897179 1952508 2011605 2073962 2139552 2208302
62194 2208302 2279263 2350464 2419447 2483841 2541667 2591456 2632149 2663014 2683810 2694938 2697048
62183 2697048 2690390 2674778 2650077 2616323 2573516 2522180 2464324 2403020 2340444 2276920 2212408
62172 2212408 2148256 2086645 2028725 1974245 1922852 1874903 1830905 1790848 1754201 1720107 1687659
62161 1687659 1656584 1627696 1602126 1580099 1560976 1544355 1530328 1518543 1507933 1497884 1489112
62150 1489112 1482867 1479616 1478835 1479770 1481991 1485392 1490030 1495945 1503007 1511141 1520692 1532195 1545607 1560055
$$ packed form
62229A291541L042M546N653O574P103P146P277Q310J0233J2021J2790J2973J3832
62216A403041J5752J7697J8656J9087K0276K2568K4928K6288K6704K7181K8685
62205A650863L1511L5215L9077M2804M6702N1007N5329N9097O2357O5590O8750
62194B208302P0961P1201O8983O4394N7826M9789M0693L0865K0796J1128K110
62183B697048o658j5612k4701l3754m2807n1336n7856o1304o2576o3524o4512
62172B212408o4152o1611n7920n4480n1393m7949m3998m0057l6647l4094l2448
62161A687659l1075k8888k5570k2027j9123j6621j4027j1785j0610j0049q772
62150A489112o245l251p81R35K221L401M638N915P062Q134R551J1503J3412J4448
$$ plain form
62136 1560055 1574557 1588739 1602691 1616442 1629793 1642440 1654186 1665373 1677192 1691031 1707205
62125 1707205 1724660 1742167 1759362 1776344 1792917 1808888 1824618 1840478 1855865 1869555 1881158
62114 1881158 1891725 1902950 1916339 1933120 1954172 1979584 2008655 2040614 2075170 2112335 2152162
62103 2152162 2194645 2239218 2283958 2325807 2362030 2391133 2412220 2424296 2427097 2422168 2412015 2398026
62091 2398026 2379788 2356356 2327352 2292838 2253180 2209648 2164380 2119045 2073893 2028611 1983705
62080 1983705 1940479 1900020 1862798 1828925 1798159 1769984 1744261 1721447 1701383 1682339 1662410
62069 1662410 1641769 1622324 1604974 1588491 1571560 1554685 1539350 1526398 1516186 1509362 1506159 1505441
62057 1505441 1505785 1507381 1511707 1519248 1528411 1536705 1542167 1543777 1541531 1536413 1529570 1521424 1512381 1504174
$$ packed form
62136A560055J4502J4182J3952J3751J3351J2647J1746J1187J1819J3839J6174
62125A707205J7455J7507J7195J6982J6573J5971J5730J5860J5387J3690J1603
62114A881158J0567J1225J3389J6781K1052K5412K9071L1959L4556L7165L9827
62103B152162M2483M4573M4740M1849L6223K9103K1087J2076K801m929j0153j3989
62091B398026j8238k3432k9004l4514l9658m3532m5268m5335m5152m5282m4906
62080A983705m3226m0459l7222l3873l0766k8175k5723k2814k0064j9044j9929
62069A662410k0641j9445j7350j6483j6931j6875j5335j2952j0212o824l203p18
62057A505441L44J596M326P541R163Q294N462J610k246n118o843q146r043q207
$$ plain form
62043 1504174 1499033 1496945 1494930 1489883 1481333 1470632 1458499 1444849 1430617 1418180 1409559 1405060 1403856
62030 1403856 1404939 1407192 1409564 1412139 1416529 1424348 1435400 1448154 1461904 1477541 1495924 1516347
62018 1516347 1537382 1558782 1581744 1607365 1635575 1665572 1696584 1728062 1759786 1792082 1825345
62007 1825345 1859134 1892397 1924885 1957515 1990810 2023784 2055038 2084041 2110287 2131900 2146523
61996 2146523 2153378 2153302 2147015 2134724 2117328 2096364 2072299 2044145 2011235 1974173 1933540 1888989
61984 1888989 1840458 1789171 1736587 1683379 1630392 1579521 1532363 1488613 1446958 1407067 1369623
61973 1369623 1334908 1302541 1272338 1244314 1218031 1192964 1169407 1148144 1129471 1113336 1099995
61962 1099995 1089305 1079634 1068781 1055965 1041860 1026902 1011113 995661 982771 973225 965250 956842
$$ packed form
62043A504174n141k088k015n047q550j0701j2133j3650j4232j2437q621m499j204
62030A403856J083K253K372K575M390P819J1052J2754J3750J5637J8383K0423
62018A516347K1035K1400K2962K5621K8210K9997L1012L1478L1724L2296L3263
62007A825345L3789L3263L2488L2630L3295L2974L1254K9003K6246K1613J4623
61996B146523O855p6o287j2291j7396k0964k4065k8154l2910l7062m0633m4551
61984A888989m8531n1287n2584n3208n2987n0871m7158m3750m1655l9891l7444
61973A369623l4715l2367l0203k8024k6283k5067k3557k1263j8673j6135j3341
61962A099995j0690r671j0853j2816j4105j4958j5789j5452j2890r546p975q408
$$ plain form
61950 956842 948271 941359 937132 935208 934924 935904 937638 939409 940845 942122 943652 945815 948786 952195 955066
61935 955066 956441 956084 954523 952534 950580 948433 945292 940523 934330 927405 919974 911574 901714 890357
61921 890357 877990 865864 855862 849016 844062 838523 831519 824485 818952 814997 812442 811933 813498 815287
61907 815287 815495 814923 816042 819798 824865 829891 834821 839825 844489 848752 853555 859810 867494 876243 886141
61892 886141 897327 909434 921996 935032 948774 963189 978240 994473 1013098 1035441 1062061
61881 1062061 1091932 1122709 1152573 1181927 1212603 1245342 1278901 1311757 1343552 1374311 1403215
61870 1403215 1429235 1452431 1473680 1493274 1510571 1524864 1535893 1543610 1548116 1549946 1549964 1548971 1547702
61857 1547702 1547016 1547559 1549269 1551727 1555097 1560363 1568605 1580371 1595646 1613969 1634414 1655786 1676993
$$ packed form
61950I56842q571o912m227j924k84R80J734J771J436J277J530K163K971L409K871
61935I55066J375l57j561j989j954k147l141m769o193o925p431q400r860j1357
61921H90357j2367j2126j0002o846m954n539p004p034n533l955k555n09J565J789
61907H15287K08n72J119L756N067N026M930N004M664M263M803O255P684Q749R898
61892H86141J1186J2107J2562J3036J3742J4415J5051J6233J8625K2343K6620
61881A062061K9871L0777K9864K9354L0676L2739L3559L2856L1795L0759K8904
61870A403215K6020K3196K1249J9594J7297J4293J1029P717M506J830J8r93j269
61857A547702o86N43J710K458L370N266Q242J1766J5275J8323K0445K1372K1207
$$ plain form
61844 1676993 1697107 1715091 1729711 1739812 1744695 1744444 1740185 1733851 1727167 1720543 1713085 1703677 1692029
61831 1692029 1678764 1664696 1650118 1634748 1618283 1600870 1582912 1564658 1546334 1528412 1511048
61820 1511048 1493257 1473547 1451695 1429206 1407698 1387802 1370183 1356270 1346540 1338855 1330326 1320859
61808 1320859 1313433 1310676 1312400 1316711 1322264 1329026 1337994 1350767 1368381 1390105 1414293 1440732 1470771
61795 1470771 1504616 1540154 1575708 1612600 1653289 1697851 1744076 1790535 1837582 1885246 1931877
61784 1931877 1975431 2014804 2049270 2077644 2098851 2112863 2120642 2123465 2122452 2118378 2111810 2103772
61772 2103772 2096057 2090296 2086922 2085721 2087113 2091866 2099536 2108272 2116489 2123968 2131104 2137804 2143131 2145123
61758 2145123 2141019 2128940 2109686 2085725 2058141 2026032 1989414 1950929 1913313 1876462 1838614
$$ packed form
61844A676993K0114J7984J4620J0101M883k51m259o334o684o624p458r408j1648
61831A692029j3265j4068j4578j5370j6465j7413j7958j8254j8324j7922j7364
61820A511048j7791j9710k1852k2489k1508j9896j7619j3913r730p685q529r467
61808A320859p426k757J724M311N553O762Q968J2773J7614K1724K4188K6439L0039
61795A470771L3845L5538L5554L6892M0689M4562M6225M6459M7047M7664M6631
61784A931877M3554L9373L4466K8374K1207J4012P779K823j013m074o568q038
61772B103772p715n761l374j201J392M753P670Q736Q217P479P136O700N327J992
61758B145123m104j2079j9254k3961k7584l2109l6618l8485l7616l6851l7848
$$ plain form
61747 1838614 1799553 1760949 1723906 1687775 1651377 1614109 1575939 1537588 1500757 1466977 1436032
61736 1436032 1406635 1378806 1354323 1334297 1317321 1300823 1283651 1266720 1251592 1239034 1228702
61725 1228702 1219659 1211088 1202747 1194911 1188118 1182894 1179274 1176318 1172772 1168797 1166472 1167673 1171833 1176728
61711 1176728 1181203 1185977 1191964 1199158 1207373 1216815 1227541 1239454 1253121 1269372 1287518 1305256
61699 1305256 1321078 1335639 1349873 1362917 1373022 1379464 1382242 1380756 1374497 1364602 1352947 1339649
61687 1339649 1323037 1302505 1280067 1258430 1238533 1219671 1201272 1183689 1167507 1152821 1139265
61676 1139265 1126479 1114522 1103770 1094336 1085662 1077020 1068409 1060717 1054935 1051331 1049161 1046955 1043402
61663 1043402 1038397 1033094 1028553 1024662 1020914 1017874 1016880 1018197 1020298 1021371 1020916 1019492 1017395 1014177
$$ packed form
61747A838614l9061l8604l7043l6131l6398l7268l8170l8351l6831l3780l0945
61736A436032k9397k7829k4483k0026j6976j6498j7172j6931j5128j2558j0332
61725A228702r043q571q341p836o793n224l620k956l546l975k325J201M160M895
61711A176728M475M774N987P194Q215R442J0726J1913J3667J6251J8146J7738
61699A305256J5822J4561J4234J3044J0105O442K778j486o259r895j1655j3298
61687A339649j6612k0532k2438k1637j9897j8862j8399j7583j6182j4686j3556
61676A139265j2786j1957j0752r434q674q642q611p692n782l604k170k206l553
61663A043402n005n303m541l891l748l040r94J317K101J073m55j424k097l218
$$ plain form
61649 1014177 1009229 1002426 994230 985395 976591 968174 960163 952248 943758 934039 923238 912513 903025
61636 903025 894846 887189 879472 871665 863906 856565 850591 846918 845269 844136 842167 839085 835256 831100
61622 831100 827108 823694 820642 817240 813291 809473 806464 804311 802839 801959 801299 800386 799632 800217 802292
61607 802292 804169 804208 802866 801919 802252 803549 805756 809489 814953 821686 829586 839118 849952 860259 868012
61592 868012 872654 875198 877116 879420 882333 885409 888189 890908 894295 898583 903215 907722 912358 917437
61578 917437 922533 926945 930738 934550 938297 940728 940708 938552 935568 932377 928256 922334 914970 907507 900921
61563 900921 895168 889716 884165 878313 872125 865818 859600 853273 846497 839434 832546 825796 818824 812009
61549 812009 806264 801380 795760 788553 780873 773769 766215 756818 746704 738521 732651 726661 719092 711821
$$ packed form
61649A014177m948o803q196q835q804q417q011p915q490r719j0801j0725r488
61636I03025q179p657p717p807p759p341n974l673j649j133j969l082l829m156
61622H31100l992l414l052l402l949l818l009k153j472q80o60r13p54N85K075
61607H02292J877L9j342r47L33J297K207L733N464O733P900R532J0834J0307P753
61592H68012M642K544J918K304K913L076K780K719L387M288M632M507M636N079
61578I17437N096M412L793L812L747K431k0k156k984l191m121n922p364p463o586
61563I00921n753n452n551n852o188o307o218o327o776p063o888o750o972o815
61549H12009n745m884n620p207p680p104p554r397j0114q183n870n990p569p271
$$ plain form
61535 711821 707475 705910 704569 701421 696350 690331 684538 679964 676850 674514 672372 670866 670740 671751
61521 671751 672859 673575 674410 676015 678334 680504 681280 679851 676706 673526 671872 672252 674541 678475 683104
61506 683104 686671 688268 689321 692238 697607 703679 708627 712287 715543 719038 722924 727058 730824 733290
61492 733290 734053 733737 733407 733811 735194 737342 739611 741431 743005 745058 747696 750133 751860 753539 756155
61477 756155 759666 762989 765165 766111 766396 766746 767626 768946 770151 770834 771198 771683 772237 772125 770424 766666
61461 766666 761343 756114 753154 753653 756761 760356 762889 764263 765065 765674 766544 768684 772917 778615 783982
61446 783982 788063 791977 797643 805554 814360 822494 829653 836757 845080 855383 867174 878607 887796
61433 887796 894566 900493 907052 914383 921921 929133 935022 938065 937907 936489 936262 937587 939055 939984 941211
$$ packed form
61535G11821m346j565j341l148n071o019n793m574l114k336k142j506j26J011
61521F71751J108P16Q35J605K319K170P76j429l145l180j654L80K289L934M629
61506F83104L567J597J053K917N369O072M948L660L256L495L886M134L766K466
61492G33290P63l16l30M04J383K148K269J820J574K053K638K437J727J679K616
61477G56155L511L323K176R46K85L50Q80J320J205O83L64M85N54j12j701l758
61461G66666n323n229k960M99L108L595K533J374Q02O09Q70K140M233N698N367
61446G83982M081L914N666P911Q806Q134P159P104Q323J0303J1791J1433R189
61433H87796O770N927O559P331P538P212N889L043j58j418k27J325J468R29J227
$$ plain form
61418 941211 943395 945928 947928 949230 950047 950567 951173 951999 951944 949218 943433 936237 929396 923223 917365 911948
61402 911948 907025 901903 896065 890011 884339 878905 874031 871487 872621 876039 878852 880129 881539 884470
61388 884470 888210 891491 894426 898093 903128 909560 917199 925378 932841 938727 943461 948144 953214 958161
61374 958161 962401 966026 969693 973894 978275 981817 984007 985778 988773 993592 999295 1004662 1009341 1013584
61360 1013584 1017677 1022029 1027109 1032506 1036560 1037781 1036511 1034525 1033059 1031813 1029842 1026712 1022626 1018058
61346 1018058 1013656 1010129 1007822 1006429 1005319 1004082 1002726 1001649 1001595 1003267 1006524 1010033 1012265 1013052 1013824
61331 1013824 1016027 1019648 1023640 1027527 1031969 1037702 1044465 1051261 1057316 1062529 1067277 1071997 1076729 1080889
61317 1080889 1083819 1085737 1087721 1090510 1093768 1096814 1099479 1101683 1102815 1102402 1101011 1099494 1097632 1094550
$$ packed form
61418I41211K184K533K000J302Q17N20O06Q26n5k726n785p196o841o173n858n417
61402I11948m923n122n838o054n672n434m874k544J134L418K813J277J410K931
61388H84470L740L281K935L667N035O432P639Q179P463N886M734M683N070M947
61374I58161M240L625L667M201M381L542K190J771K995M819N703N367M679M243
61360A013584M093M352N080N397M054J221j270j986j466j246j971l130m086m568
61346A018058m402l527k307j393j110j237j356j077n4J672L257L509K232P87P72
61331A013824K203L621L992L887M442N733O763O796O055N213M748M720M732M160
61317A080889K930J918J984K789L258L046K665K204J132m13j391j517j862l082
$$ plain form
61303 1094550 1090453 1086842 1084875 1084515 1085469 1087714 1090665 1093114 1094900 1097679 1103032 1110466 1118306 1125885
61289 1125885 1133707 1141834 1149486 1156244 1162480 1168347 1173186 1176321 1177817 1178284 1178509 1179416 1181678 1185014 1188285
61274 1188285 1190434 1191075 1190268 1188380 1186166 1184298 1182688 1180945 1179642 1180178 1182990 1186700 1189635 1191650 1193936
61259 1193936 1197698 1203532 1211294 1219762 1227203 1233396 1240532 1250746 1263058 1274305 1283211 1291955 1303126
61246 1303126 1316598 1330419 1343513 1356035 1367648 1377088 1383416 1386518 1386225 1382089 1374564 1365586 1357361
61233 1357361 1350785 1345221 1339284 1331635 1321632 1309776 1297366 1285473 1274474 1264571 1256140 1249228 1243330
61220 1243330 1238268 1234879 1234177 1235967 1238838 1241388 1243057 1244105 1245431 1248197 1252834 1258343 1263323 1267778
61206 1267778 1273200 1280704 1289826 1299527 1309580 1320391 1332058 1344381 1357369 1370920 1384163 1395928
$$ packed form
61303A094550m097l611j967l60R54K245K951K449J786K779N353P434P840P579
61289A125885P822Q127P652O758O236N867M839L135J496M67K25R07K262L336L271
61274A188285K149O41q07j888k214j868j610j743j303N36K812L710K935K015K286
61259A193936L762N834P762Q468P441O193P136J0214J2312J1247Q906Q744J1171
61246A303126J3472J3821J3094J2522J1613R440O328L102k93m136p525q978q225
61233A357361o576n564n937p649j0003j1856j2410j1893j0999r903q431o912n898
61220A243330n062l389p02J790K871K550J669J048J326K766M637N509M980M455
61206A267778N422P504R122R701J0053J0811J1667J2323J2988J3551J3243J1765
$$ plain form
61194 1395928 1405845 1414256 1421018 1425279 1426757 1426525 1425906 1425087 1423442 1420863 1417933 1414798 1410761 1405371 1399329
61179 1399329 1393709 1388550 1382817 1375779 1367977 1360714 1354995 1351204 1349433 1349662 1351582 1354557 1357966 1361616
61165 1361616 1365856 1371255 1378097 1386092 1394637 1403224 1411301 1417872 1421849 1423304 1423992 1425927 1429437 1433140
61151 1433140 1435851 1437819 1439883 1442100 1443879 1445124 1446510 1448688 1451872 1456357 1462770 1471323 1481209 1491293
61137 1491293 1501361 1512229 1524670 1538745 1554262 1571070 1588274 1603572 1614362 1619702 1620664 1618745
61125 1618745 1614715 1609308 1604016 1600062 1596803 1592098 1584416 1574085 1562602 1551462 1541608 1533018 1524314
61112 1524314 1513579 1500243 1485777 1471947 1458775 1444857 1429369 1412919 1396551 1380823 1366077
61101 1366077 1352805 1341144 1330507 1320406 1311490 1305099 1301677 1300167 1299270 1298921 1300052 1303064 1307046
$$ packed form
61194A395928R917Q411O762M261J478k32o19q19j645k579k930l135m037n390o042
61179A399329n620n159n733p038p802p263n719l791j771K29J920K975L409L650
61165A361616M240N399O842P995Q545Q587Q077O571L977J455O88J935L510L703
61151A433140K711J968K064K217J779J245J386K178L184M485O413Q553R886J0084
61137A491293J0068J0868J2441J4075J5517J6808J7204J5298J0790N340R62j919
61125A618745m030n407n292l954l259m705p682j0331j1483j1140r854q590q704
61112A524314j0735j3336j4466j3830j3172j3918j5488j6450j6368j5728j4746
61101A366077j3272j1661j0637j0101q916o391l422j510q97l49J131L012L982
$$ plain form
61088 1307046 1310611 1312979 1313966 1313445 1311507 1309033 1307287 1306580 1305784 1303680 1300665 1298744 1299743 1303678 1308883
61073 1308883 1313701 1318223 1324458 1334680 1349442 1367301 1386506 1406576 1428006 1450903 1474653 1499062
61061 1499062 1525088 1553913 1585451 1618272 1651094 1683967 1717811 1753048 1789167 1825608 1862548
61050 1862548 1900377 1938618 1975936 2011328 2044804 2076695 2106752 2134453 2159918 2183773 2205950
61039 2205950 2225220 2240423 2251956 2261617 2271053 2280628 2289718 2297578 2303838 2308649 2312791 2317375 2322864
61026 2322864 2328386 2332552 2335153 2337628 2341419 2346058 2349384 2349721 2347543 2344873 2343242 2342384 2340754 2337036
61012 2337036 2331085 2323631 2315405 2306636 2297186 2286849 2275479 2263124 2250197 2237472 2225882 2216349
61000 2216349 2209665 2206180 2205580 2207254 2210981 2216941 2225002 2234576 2245553 2259036 2276641 2299219 2326656
$$ packed form
61088A307046L565K368R87n21j938k474j746p07p96k104l015j921R99L935N205
61073A308883M818M522O235J0222J4762J7859J9205K0070K1430K2897K3750K4409
61061A499062K6026K8825L1538L2821L2822L2873L3844L5237L6119L6441L6940
61050A862548L7829L8241L7318L5392L3476L1891L0057K7701K5465K3855K2177
61039B205950J9270J5203J1533R661R436R575R090P860O260M811M142M584N489
61026B322864N522M166K601K475L791M639L326L37k178k670j631q58j630l718
61012B337036n951p454q226q769r450j0337j1370j2355j2927j2725j1590r533
61000B216349o684l485o00J674L727N960Q061R574J0977J3483J7605K2578K7437
$$ plain form
60987 2326656 2358717 2395475 2436852 2482199 2530609 2581500 2634805 2690836 2750175 2813632 2882054
60976 2882054 2955861 3034646 3117541 3204302 3295830 3393294 3497085 3607328 3725150 3852264
60966 3852264 3989145 4134757 4288560 4451740 4625839 4811436 5009304 5221889 5452423
60957 5452423 5703245 5976278 6274580 6602149 6962615 7359145 7794915 8272543 8794375
60948 8794375 9365476 9995993 10699179 11488671 12380223 13394229 14551814 15868171 17353533
60939 17353533 19019793 20879695 22938806 25196622 27655568 30305278 33065853 35739497
60931 35739497 38047168 39754767 40792591 41268272 41379807 41323400 41258523 41297097 41460501
60922 41460501 41624718 41535264 40922772 39642941 37734086 35366577 32749974 30069100 27461884
$$ packed form
60987B326656L2061L6758M1377M5347M8410N0891N3305N6031N9339O3457O8422
60976B882054P3807P8785Q2895Q6761R1528R7464J03791J10243J17822J27114
60966C852264J36881J45612J53803J63180J74099J85597J97868K12585K30534
60957E452423K50822K73033K98302L27569L60466L96530M35770M77628N21832
60948H794375N71101O30517P03186P89492Q91552J014006J157585J316357J485362
60939A7353533J666260J859902K059111K257816K458946K649710K760575K673644
60931C5739497K307671J707599J037824M75681J11535n6407o4877L8574J63404
60922D1460501J64217q9454o12492j279831j908855k367509k616603k680874k607216
$$ plain form
60913 27461884 25015316 22768013 20724374 18876078 17215063 15732365 14413464 13239455
60905 13239455 12191255 11251490 10404731 9638417 8943215 8311804 7738013 7217238 6746197
60896 6746197 6321318 5938049 5591869 5278882 4995124 4736495 4499899 4283498 4085497
60887 4085497 3903508 3735221 3578592 3431223 3290855 3156860 3030168 2911374 2800052
60878 2800052 2696019 2599635 2510223 2425702 2344670 2267573 2195014 2126414 2061583 2002117 1949331
60867 1949331 1901556 1855358 1809272 1764801 1723759 1686180 1651181 1618446 1587994 1559331 1531811
60856 1531811 1505605 1481487 1459537 1438616 1417544 1396574 1377279 1360881 1346969 1333838 1319661
60845 1319661 1303354 1285215 1267218 1251859 1239778 1229003 1217284 1204539 1191835 1178754 1163694
$$ packed form
60913B7461884k446568k247303k043639j848296j661015j482698j318901j174009
60905A3239455j048200r39765q46759p66314o95202o31411n73791n20775m71041
60896F746197m24879l83269l46180l12987k83758k58629k36596k16401j98001
60887D085497j81989j68287j56629j47369j40368j33995j26692j18794j11322
60878B800052j04033r6384q9412q4521q1032p7097p2559o8600o4831n9466n2786
60867A949331m7775m6198m6086m4471m1042l7579l4999l2735l0452k8663k7520
60856A531811k6206k4118k1950k0921k1072k0970j9295j6398j3912j3131j4177
60845A319661j6307j8139j7997j5359j2081j0775j1719j2745j2704j3081j5060
$$ plain form
60834 1163694 1146863 1131061 1118615 1108784 1099102 1088352 1077378 1067541 1059245 1051823 1044557 1037842 1032970
60821 1032970 1030156 1027243 1021593 1013129 1004256 996950 991465 987860 986602 986868 986229 983334 979502 976529
60807 976529 974430 972730 972501 975130 979854 984351 987417 989703 992248 995704 1000628 1007062 1013825 1019346
60793 1019346 1023150 1025740 1027394 1028032 1027921 1027464 1026525 1024775 1022317 1019095 1014252 1007078 998243 989144 980519
60778 980519 972514 965210 957839 948374 935710 921771 909597 899496 888977 876621 864044 853503
60766 853503 845291 838399 832390 827452 823334 819181 814143 807793 800352 792679 785604 779262 773579 769143
60752 769143 766681 765728 764856 763326 761583 760014 758273 756077 753695 751331 748975 747152 746865 748270 750207
60737 750207 751620 752830 754938 758472 763028 767745 771828 774924 777159 778628 779064 778484 777753 777601 777322
$$ packed form
60834A163694j6831j5802j2446r831r682j0750j0974r837q296p422p266o715m872
60821A032970k814k913n650q464q873p306n485l605j258K66o39k895l832k973
60807I76529k099j700k29K629M724M497L066K286K545L456M924O434O763N521
60793A019346L804K590J654O38j11m57r39j750k458l222m843p174q835r099q625
60778I80519q005p304p371r465j2664j3939j2174j0101j0519j2356j2577j0541
60766H53503q212o892o009m938m118m153n038o350p441p673p075o342n683m436
60752G69143k462r53q72j530j743j569j741k196k382k364k356j823k87J405J937
60737G50207J413J210K108L534M556M717M083L096K235J469M36n80p31j52k79
$$ plain form
60722 777322 775524 772193 768964 767160 766536 766035 764824 762459 759111 755799 753337 750921 747014 741873 737738
60707 737738 736007 735654 735189 734762 735214 736208 736747 736849 737425 738805 740310 741053 740431 738290 735370 733316 733518
60690 733518 736072 740123 744736 749042 752234 754123 755251 756002 756125 755497 754522 753211 750796 747060 743212
60675 743212 740478 738595 736745 735214 734794 735048 734660 733446 732633 732964 733756 734225 734804 736545 739739 743519
60659 743519 746601 748302 749128 750369 752811 755903 758436 759800 760234 760131 759600 758485 756404 753116 749346
60644 749346 746837 746748 748112 748555 746558 742589 738260 734929 732885 731159 728284 723914 719516 716773 715520
60629 715520 714152 711931 709764 708585 708134 707897 708294 709998 712549 714583 715570 716793 720250 726567 734032
60614 734032 739891 742808 743923 745277 747529 749627 750475 750080 748910 746908 743740 739679 735682 732588 730529
$$ packed form
60722G77322j798l331l229j804o24n01j211k365l348l312k462k416l907n141m135
60707G37738j731l53m65m27M52R94N39J02N76J380J505P43o22k141k920k054K02
60690G33518K554M051M613M306L192J889J128P51J23o28r75j311k415l736l848
60675G43212k734j883j850j531m20K54l88j214q13L31P92M69N79J741L194L780
60659G43519L082J701Q26J241K442L092K533J364M34j03n31j115k081l288l770
60644G49346k509q9J364M43j997l969m329l331k044j726k875m370m398k743j253
60629G15520j368k221k167j179m51k37L97J704K551K034R87J223L457O317P465
60614G34032N859K917J115J354K252K098Q48l95j170k002l168m061l997l094k059
$$ plain form
60599 730529 729204 728558 728984 730749 733276 735333 736252 736849 738785 742868 748139 752695 755328 756320 756590 756257
60583 756257 754476 750909 746803 743816 742052 740383 738710 738392 739710 740378 738115 733893 730989 731104 733007
60568 733007 734921 736478 737862 738651 738568 738447 739534 742351 746776 752361 757851 761234 761378 759390 757507
60553 757507 756908 757302 758288 760134 763198 767387 772304 777325 781580 784580 786973 789877 793217 795534 795938
60538 795938 795584 796426 798929 801911 804564 807655 812404 818823 825761 832200 837958 843310 848506 853673 858810
60523 858810 863764 868489 873237 878184 882908 886780 889945 893490 898402 904791 912298 920850 930740 942331
60509 942331 955909 971367 987705 1003405 1017927 1032500 1048805 1067027 1085657 1102875 1117388
60498 1117388 1128212 1134768 1137666 1138738 1139723 1141135 1142615 1144033 1145829 1148564 1152599 1158396 1166797 1178601
$$ packed form
60599G30529j325o46M26J765K527K057R19N97J936M083N271M556K633R92K70l33
60583G56257j781l567m106k987j764j669j673l18J318O68k263m222k904J15J903
60568G33007J914J557J384P89q3j21J087K817M425N585N490L383J44j988j883
60553G57507n99L94R86J846L064M189M917N021M255L000K393K904L340K317M04
60538G95938l54Q42K503K982K653L091M749O419O938O439N758N352N196N167N137
60523H58810M954M725M748M947M724L872L165L545M912O389P507Q552R890J1591
60509I42331J3578J5458J6338J5700J4522J4573J6305J8222J8630J7218J4513
60498A117388J0824O556K898J072R85J412J480J418J796K735M035N797Q401J1804
$$ plain form
60484 1178601 1193632 1210423 1227279 1243840 1261356 1281385 1304757 1332021 1364089 1401469 1443083
60473 1443083 1486746 1530969 1575611 1620595 1664592 1705265 1740319 1768053 1787412 1798073 1800513
60462 1800513 1795781 1785117 1769674 1750412 1728339 1705020 1682538 1662523 1645311 1630521 1618372
60451 1618372 1609894 1605894 1606209 1610061 1616772 1626266 1639458 1658015 1682923 1713251 1747210 1784664 1827684
60438 1827684 1878180 1935787 1998604 2065130 2134580 2205761 2276587 2344628 2407649 2463877 2512437
60427 2512437 2553520 2587833 2616170 2639809 2660814 2681105 2701250 2720449 2737206 2749286 2753354
60416 2753354 2745727 2723771 2686316 2633206 2565418 2485623 2397551 2304372 2208265 2111623 2017607
60405 2017607 1928820 1846038 1768841 1697030 1630778 1569841 1513500 1461338 1413482 1369985 1330345
$$ packed form
60484A178601J5031J6791J6856J6561J7516K0029K3372K7264L2068L7380M1614
60473A443083M3663M4223M4642M4984M3997M0673L5054K7734J9359J0661K440
60462A800513m732j0664j5443j9262k2073k3319k2482k0015j7212j4790j2149
60451A618372q478m000L15L852O711R494J3192J8557K4908L0328L3959L7454M3020
60438A827684N0496N7607O2817O6526O9450P1181P0826O8041O3021N6228M8560
60427B512437M1083L4313K8337K3639K1005K0291K0145J9199J6757J2080M068
60416B753354p627k1956l7455n3110o7788p9795q8072r3179r6107r6642r4016
60405B017607q8787q2782p7197p1811o6252o0937n6341n2162m7856m3497l9640
$$ plain form
60394 1330345 1293803 1259849 1228430 1199819 1174313 1151875 1132054 1114177 1097460 1081071 1064700
60383 1064700 1049296 1036592 1027184 1019500 1011479 1003107 996276 991956 988488 983281 975589 966960 959295
60370 959295 953174 948024 943345 939452 937017 935922 934940 933041 930895 930254 931573 933196 933547 933261 934105
60355 934105 936361 938492 939214 938736 938009 937929 939369 942679 946758 949744 951248 952863 955887 959650 962928
60340 962928 965939 969687 974100 978197 981763 985479 989494 993109 996110 999297 1003363 1008117 1013202 1018789
60326 1018789 1025027 1031344 1036871 1041287 1044866 1047938 1050689 1053443 1056788 1061130 1066003 1070134 1072741 1074816
60312 1074816 1078377 1084025 1089952 1094107 1096628 1099176 1102398 1105466 1108064 1111317 1116234 1122291 1128230 1133549
60298 1133549 1138671 1144275 1150927 1158766 1167119 1174975 1182281 1190150 1199303 1208864 1217223 1223559 1227906 1230248
$$ packed form
60394A330345l6542l3954l1419k8611k5506k2438j9821j7877j6717j6389j6371
60383A064700j5404j2704r408p684q021q372o831m320l468n207p692q629p665
60370I59295o121n150m679l893k435j095r82j899k146o41J319J623L51k86Q44
60355I34105K256K131P22m78p27q0J440L310M079K986J504J615L024L763L278
60340I62928L011L748M413M097L566L716M015L615L001L187M066M754N085N587
60326A018789O238O317N527M416L579L072K751K754L345M342M873M131K607K075
60312A074816L561N648N927M155K521K548L222L068K598L253M917O057N939N319
60298A133549N122N604O652P839Q353P856P306P869R153R561Q359O336M347K342
$$ plain form
60284 1230248 1230348 1228328 1224830 1220631 1216274 1211772 1206422 1199398 1190947 1182562 1175514 1169596 1163824 1157873
60270 1157873 1152134 1146688 1141078 1135067 1128999 1123368 1118544 1114945 1112996 1112835 1114254 1116897 1120347 1124223
60256 1124223 1128468 1133386 1139304 1146522 1155645 1167257 1180890 1195070 1208979 1223275 1238463 1253393
60244 1253393 1266764 1279511 1293853 1309887 1324848 1336229 1344027 1349081 1350648 1347068 1337912 1324101
60232 1324101 1306471 1285743 1263682 1242668 1223685 1205836 1188345 1172055 1158253 1146784 1136306
60221 1136306 1126057 1116482 1108083 1100394 1092395 1083466 1073729 1063793 1054494 1046630 1040552 1035934 1032049 1028242
60207 1028242 1024160 1019800 1015575 1012155 1009979 1008955 1008819 1009465 1010582 1011164 1010083 1007306 1004116 1001910 1001196
60192 1001196 1001908 1004040 1007375 1011000 1013867 1015904 1018136 1021579 1026300 1031474 1035985 1038987 1040393 1041054
$$ packed form
60284A230248J00k020l498m199m357m502n350p024q451q385p048n918n772n951
60270A157873n739n446n610o011o068n631m824l599j949j61J419K643L450L876
60256A124223M245M918N918P218R123J1612J3633J4180J3909J4296J5188J4930
60244A253393J3371J2747J4342J6034J4961J1381P798N054J567l580r156j3811
60232A324101j7630k0728k2061k1014j8983j7849j7491j6290j3802j1469j0478
60221A136306j0249r575q399p689p999q929r737r936r299p864o078m618l885l807
60207A028242m082m360m225l420k176j024j36O46J117N82j081k777l190k206p14
60192A001196P12K132L335L625K867K037K232L443M721N174M511L002J406O61
$$ plain form
60178 1041054 1042193 1044425 1047476 1050873 1054563 1058583 1062458 1065554 1068114 1071506 1076959 1084224 1091889 1099067
60164 1099067 1106226 1114137 1122684 1131458 1141191 1153463 1168697 1185240 1200914 1214779 1226909 1237317
60152 1237317 1246276 1255388 1267022 1282142 1299162 1315224 1328306 1338216 1346227 1354016 1362532 1371533 1380361
60139 1380361 1388993 1397719 1405865 1411790 1414682 1415738 1416822 1418311 1418896 1417373 1413911 1409567 1405235 1401333
60125 1401333 1398051 1395420 1393274 1391399 1389783 1388575 1387770 1386957 1385417 1382647 1379014 1375859 1374584 1375372 1376883
60110 1376883 1377489 1376703 1375117 1372990 1369512 1363844 1356491 1349019 1342517 1336973 1332172 1328451 1326209 1325328 1325519
60095 1325519 1326717 1328582 1330242 1331321 1332751 1335554 1339071 1341534 1342374 1342714 1343373 1343771 1343413 1343122 1343695 1344357
60079 1344357 1343992 1343388 1344718 1348849 1354505 1360212 1365773 1371351 1376363 1380255 1383648 1387628 1392087 1395651
$$ packed form
60178A041054J139K232L051L397L690M020L875L096K560L392N453P265P665P178
60164A099067P159P911Q547Q774R733J2272J5234J6543J5674J3865J2130J0408
60152A237317Q959R112J1634J5120J7020J6062J3082R910Q011P789Q516R001Q828
60139A380361Q632Q726Q146N925K892J056J084J489N85j523l462m344m332l902
60125A401333l282k631k146j875j616j208q05q13j540k770l633l155j275P88J511
60110A376883O06p86j586k127l478n668p353p472o502n544m801l721k242q81J91
60095A325519J198J865J660J079J430K803L517K463Q40L40O59L98l58k91N73O62
60079A344357l65o04J330M131N656N707N561N578N012L892L393L980M459L564
$$ plain form
60065 1395651 1397433 1398350 1400460 1405183 1412243 1420167 1427682 1434648 1441829 1450091 1459930 1471376 1483886 1496482
60051 1496482 1508524 1520348 1532691 1545535 1558090 1569883 1581176 1592132 1602389 1611766 1620599 1628788
60039 1628788 1635214 1638889 1640250 1640579 1640458 1639517 1637391 1634077 1629381 1622776 1613880 1602673 1589465 1575190
60025 1575190 1561286 1548401 1535373 1520482 1503697 1486683 1470579 1454893 1438908 1422997 1407827
60014 1407827 1393210 1378534 1363667 1348658 1333218 1317441 1302624 1290338 1280621 1271802 1262198 1251543
60002 1251543 1240797 1231095 1223005 1216459 1211125 1206750 1203109 1199848 1196672 1193552 1190293 1186156 1180803 1175517
59988 1175517 1172425 1172191 1173573 1175601 1178749 1183085 1186738 1187765 1186722 1185828 1186139 1187042 1187940 1188618 1188202 1185726
59972 1185726 1182044 1179431 1178803 1178752 1177796 1175913 1173183 1168612 1161586 1153383 1145908 1139621 1133722 1127621 1121144
$$ packed form
60065A395651J782R17K110M723P060P924P515O966P181Q262R839J1446J2510J2596
60051A496482J2042J1824J2343J2844J2555J1793J1293J0956J0257R377Q833Q189
60039A628788O426L675J361L29j21r41k126l314m696o605q896j1207j3208j4275
60025A575190j3904j2885j3028j4891j6785j7014j6104j5686j5985j5911j5170
60014A407827j4617j4676j4867j5009j5440j5777j4817j2286r717q819r604j0655
60002A251543j0746r702q090o546n334m375l641l261l176l120l259m137n353n286
59988A175517l092k34J382K028L148M336L653J027j043q94L11R03Q98O78m16k476
59972A185726l682k613o28n1r56j883k730m571p026q203p475o287n899o101o477
$$ plain form
59957 1121144 1113990 1106230 1098977 1093405 1089249 1085226 1080829 1076761 1073697 1071454 1069448 1067213 1064308 1060388
59943 1060388 1055700 1051202 1047998 1046657 1046827 1047293 1046812 1045289 1043908 1043661 1044058 1043886 1043049 1043132 1046055 1052368
59927 1052368 1060651 1068317 1073441 1076368 1079370 1084322 1090942 1097638 1103464 1108433 1112341 1114430 1114413 1112952
59913 1112952 1110827 1108264 1105335 1102401 1099757 1097271 1094768 1092536 1091156 1090857 1091149 1090985 1089511 1087103 1085604
59898 1085604 1086893 1090943 1095678 1098936 1100038 1099335 1097131 1093883 1090975 1090049 1091332 1093449 1095155 1096499
59884 1096499 1097917 1099165 1100115 1101912 1105877 1111349 1115986 1118575 1120284 1122631 1125617 1128907 1133578 1141010
59870 1141010 1150698 1160849 1170911 1181846 1193855 1205506 1215423 1223287 1228823 1231517 1232206 1233470 1237211
59857 1237211 1242845 1248846 1254952 1261710 1268849 1275668 1282444 1290031 1298237 1305733 1311414 1314928 1316200 1315431
$$ packed form
59957A121144p154p760p253n572m156m023m397m068l064k243k006k235k905l920
59943A060388m688m498l204j341J70M66m81j523j381k47L97j72q37Q3K923O313
59927A052368Q283P666N124K927L002M952O620O696N826M969L908K089j7j461
59913A112952k125k563k929k934k644k486k503k232j380k99K92j64j474k408j499
59898A085604J289M050M735L258J102p03k204l248k908r26J283K117J706J344
59884A096499J418J248R50J797L965N472M637K589J709K347K986L290M671P432
59870A141010R688J0151J0062J0935J2009J1651R917P864N536K694O89J264L741
59857A237211N634O001O106O758P139O819O776P587Q206P496N681L514J272p69
$$ plain form
59843 1315431 1313440 1311064 1308352 1305052 1301529 1298400 1295593 1292656 1289659 1286987 1284657 1282819 1282341 1283750
59829 1283750 1285986 1287588 1288908 1291782 1297120 1304202 1312354 1321798 1332536 1343755 1354846 1365934 1377036
59816 1377036 1387779 1398265 1408968 1419251 1427247 1432056 1435151 1438763 1443588 1448796 1453638 1458207 1462959
59803 1462959 1468152 1473599 1478720 1483138 1487315 1492092 1497491 1502656 1507013 1510704 1513749 1515760 1516930 1518402
59789 1518402 1521146 1525178 1530203 1536134 1542555 1548669 1554344 1560248 1566250 1570595 1571566 1569204 1564679 1558934
59775 1558934 1553083 1549182 1548955 1551663 1554294 1553964 1549666 1542202 1533470 1525575 1519518 1514515 1509205 1503487
59761 1503487 1498565 1495352 1493695 1493130 1493519 1494723 1496313 1497910 1499422 1500749 1501663 1502050 1502052 1501890 1501764 1501787 1501726
59744 1501726 1500947 1498883 1495354 1490119 1482542 1472329 1460486 1448826 1438417 1428915 1419437 1409679 1400065
$$ packed form
59843A315431j991k376k712l300l523l129k807k937k997k672k330j838m78J409
59829A283750K236J602J320K874N338P082Q152R444J0738J1219J1091J1088J1102
59816A377036J0743J0486J0703J0283P996M809L095L612M825N208M842M569M752
59803A462959N193N447N121M418M177M777N399N165M357L691L045K011J170J472
59789A518402K744M032N025N931O421O114N675N904O002M345R71k362m525n745
59775A558934n851l901k27K708K631l30m298p464q732p895o057n003n310n718
59761A503487m922l213j657n65L89J204J590J597J512J327R14L87Kj62j26K3o1
59744A501726p79k064l529n235p577j0213j1843j1660j0409r502r478r758r614
$$ plain form
59731 1400065 1391146 1382992 1375020 1366547 1357594 1349014 1341620 1335452 1330055 1324912 1319248 1312160 1303848 1296398
59717 1296398 1292182 1291352 1291778 1291605 1291051 1291432 1293535 1297677 1304525 1314526 1326562 1338274 1348277 1357536
59703 1357536 1367942 1379874 1391881 1402840 1413621 1426063 1440777 1456710 1472707 1488614 1504610
59692 1504610 1520353 1535363 1549766 1563873 1577179 1588424 1596610 1601593 1603798 1603976 1603275 1602871 1603060
59679 1603060 1603006 1601867 1600123 1599316 1600144 1601054 1599396 1594244 1587618 1582487 1580002 1579286 1579457 1580555 1582377 1583780
59663 1583780 1584004 1583917 1584990 1587528 1590801 1594567 1599461 1605850 1613081 1620144 1626768 1633848 1643054 1655695
59649 1655695 1671503 1688645 1705382 1721586 1738279 1756013 1774274 1792227 1809419 1825886 1842153
59638 1842153 1858947 1876218 1892596 1906665 1918737 1930462 1942484 1953446 1961706 1967169 1970719 1972523
$$ packed form
59731A400065q919q154p972q473q953q580p394o168n397n143n664p088q312p450
59717A296398m216q30M26j73n54L81K103M142O848J0001J2036J1712J0003R259
59703A357536J0406J1932J2007J0959J0781J2442J4714J5933J5997J5907J5996
59692A504610J5743J5010J4403J4107J3306J1245Q186M983K205J78p01m04J89
59679A603060n4j139j744q07Q28R10j658n152o626n131k485p16J71J098J822J403
59663A583780K24q7J073K538L273L766M894O389P231P063O624P080R206J2641
59649A655695J5808J7142J6737J6204J6693J7734J8261J7953J7192J6467J6267
59638A842153J6794J7271J6378J4069J2072J1725J2022J0962Q260N463L550J804
$$ plain form
59626 1972523 1971886 1968642 1963768 1958354 1952505 1945643 1937647 1929245 1921170 1913162 1904129 1893338 1881272 1869163
59612 1869163 1857857 1847302 1837050 1827081 1818153 1811444 1807738 1806835 1807849 1810186 1814045 1819902 1827707
59599 1827707 1836821 1846561 1856663 1867346 1878951 1891243 1902921 1912228 1918194 1920918 1920559 1916771 1909539
59586 1909539 1899764 1888154 1873954 1855597 1832394 1804855 1773733 1739797 1704555 1670218 1638625
59575 1638625 1610691 1586760 1566611 1549079 1532603 1516401 1500414 1484142 1466600 1447701 1428425
59564 1428425 1409112 1388807 1367218 1346218 1327929 1311918 1295781 1278439 1261461 1246882 1234976
59553 1234976 1224712 1215357 1206805 1199037 1192296 1187460 1185230 1184757 1183870 1181092 1177073 1173677 1171957 1171457
59539 1171457 1171307 1171398 1172224 1173895 1175716 1176863 1177384 1178377 1180905 1184528 1187131 1186709 1183443 1179535 1176790 1174740
$$ packed form
59626A972523o37l244m874n414n849o862p996q402q075q008r033j0791j2066j2109
59612A869163j1306j0555j0252r969q928o709l706r03J014K337L859N857P805
59599A827707R114R740J0102J0683J1605J2292J1678R307N966K724l59l788p232
59586A909539r775j1610j4200j8357k3203k7539l1122l3936l5242l4337l1593
59575A638625k7934k3931k0149j7532j6476j6202j5987j6272j7542j8899j9276
59564A428425j9313k0305k1589k1000j8289j6011j6137j7342j6978j4579j1906
59553A234976j0264r355q552p768o741m836k230m73q87k778m019l396j720n00
59539A171457j50R1Q26J671J821J147N21R93K528L623K603m22l266l908k745k050
$$ plain form
59523 1174740 1171468 1165816 1158330 1150467 1143561 1138276 1134260 1130266 1125335 1120003 1115747 1113155 1111387 1109636
59509 1109636 1108256 1107958 1108627 1109625 1110619 1111341 1111099 1109615 1108090 1108331 1110678 1113703 1116060 1117759 1119407 1121265
59493 1121265 1123630 1127289 1132800 1139837 1147853 1156811 1166591 1176392 1185713 1195490 1207159 1220873 1235801
59480 1235801 1251985 1270547 1291941 1315228 1339217 1362790 1383609 1398344 1405662 1408006 1409020 1409863
59468 1409863 1409256 1406363 1401973 1397136 1392305 1388053 1385274 1384178 1383948 1383562 1382258 1379280 1374213 1367594 1360151
59453 1360151 1351405 1340251 1327047 1313751 1301538 1289614 1277114 1264914 1254533 1246106 1238561 1231290
59441 1231290 1224691 1219353 1215390 1212418 1209744 1206945 1204509 1203424 1203934 1205411 1207731 1211839 1218361 1226517
59427 1226517 1234992 1243105 1250573 1257168 1263395 1270464 1278496 1285639 1290178 1292841 1295692 1299290 1302368 1304029
$$ packed form
59523A174740l272n652p486p863o906n285m016l994m931n332m256k592j768j751
59509A109636j380k98O69R98R94P22k42j484j525K41K347L025K357J699J648J858
59493A121265K365L659N511P037Q016Q958R780R801R321R777J1669J3714J4928
59480A235801J6184J8562K1394K3287K3989K3573K0819J4735P318K344J014Q43
59468A409863o07k893m390m837m831m252k779j096k30l86j304k978n067o619p443
59453A360151q746j1154j3204j3296j2213j1924j2500j2200j0381q427p545p271
59441A231290o599n338l963k972k674k799k436j085N10J477K320M108O522Q156
59427A226517Q475Q113P468O595O227P069Q032P143M539K663K851L598L078J661
$$ plain form
59413 1304029 1304851 1305822 1307390 1309638 1312371 1314940 1316871 1318658 1321032 1323452 1324313 1322932 1320638 1319674 1321506
59398 1321506 1326139 1332531 1339661 1347554 1357016 1368015 1378989 1388463 1396704 1404722 1412219 1417805 1421115
59385 1421115 1423423 1426038 1428975 1431159 1431140 1427951 1422314 1416742 1413293 1411521 1409839 1408398 1408840 1411359 1414226
59370 1414226 1416784 1420797 1427705 1436233 1444303 1452149 1461877 1474573 1489435 1505604 1523460 1543809 1566736
59357 1566736 1591753 1618612 1647557 1678865 1712353 1747305 1782544 1816028 1844496 1864506 1874737
59346 1874737 1877118 1875143 1871438 1867397 1864223 1863036 1864293 1868236 1875384 1884793 1891957 1890562 1877409 1854659
59332 1854659 1827008 1798036 1769734 1743652 1720815 1701122 1683903 1668707 1655073 1642422 1630929
59321 1630929 1621710 1615313 1610751 1606875 1604043 1603453 1605278 1608394 1611756 1615344 1619899 1626127 1633864 1641767
$$ packed form
59413A304029Q22R71J568K248K733K569J931J787K374K420Q61j381k294r64J832
59398A321506M633O392P130P893R462J0999J0974R474Q241Q018P497N586L310
59385A421115K308K615K937K184j9l189n637n572l449j772j682j441M42K519K867
59370A414226K558M013O908Q528Q070P846R728J2696J4862J6169J7856K0349K2927
59357A566736K5017K6859K8945L1308L3488L4952L5239L3484K8468K0010J0231
59346A874737K381j975l705m041l174j187J257L943P148R409P164j395j3153k2750
59332A854659k7651k8972k8302k6082k2837j9693j7219j5196j3634j2651j1493
59321A630929r219o397m562l876k832n90J825L116L362L588M555O228P737P903
$$ plain form
59307 1641767 1648329 1653529 1658940 1665995 1674967 1685902 1699373 1715328 1732051 1747391 1760702 1772857
59295 1772857 1784826 1797080 1810032 1824208 1840068 1858081 1878528 1900711 1922862 1943595 1963081
59284 1963081 1982183 2000854 2018099 2033116 2045674 2055515 2062106 2064948 2063677 2058025 2048154 2035008
59272 2035008 2020051 2004668 1989602 1974351 1957080 1936039 1911511 1885704 1860346 1835147 1808966
59261 1808966 1781559 1753648 1726281 1700890 1678888 1660110 1642457 1624226 1606090 1589577 1574357
59250 1574357 1558629 1541939 1525980 1512356 1500849 1490335 1480460 1471984 1466132 1464032 1466286 1472595
59238 1472595 1481912 1493124 1505701 1519900 1536241 1554100 1570528 1581224 1583526 1578256 1568353 1556379
59226 1556379 1543922 1532577 1524201 1520008 1519859 1522329 1525327 1527422 1529179 1532656 1539126 1548094 1559068
$$ packed form
59307A641767O562N200N411P055Q972J0935J3471J5955J6723J5340J3311J2155
59295A772857J1969J2254J2952J4176J5860J8013K0447K2183K2151K0733J9486
59284A963081J9102J8671J7245J5017J2558R841O591K842j271n652r871j3146
59272B035008j4957j5383j5066j5251j7271k1041k4528k5807k5358k5199k6181
59261A808966k7407k7911k7367k5391k2002j8778j7653j8231j8136j6513j5220
59250A574357j5728j6690j5959j3624j1507j0514r875q476n852k100K254O309
59238A472595R317J1212J2577J4199J6341J7859J6428J0696K302n270r903j1974
59226A556379j2457j1345q376m193j49K470K998K095J757L477O470Q968J0974
$$ plain form
59213 1559068 1572982 1590468 1609684 1627548 1642854 1656746 1670394 1683816 1696966 1710364 1724105
59202 1724105 1737285 1748863 1758369 1765764 1771421 1776168 1780296 1782509 1780885 1775049 1766444 1756577 1746186
59189 1746186 1736073 1727065 1718602 1708808 1696942 1684727 1674329 1665839 1657697 1648799 1639047 1628389 1616695
59176 1616695 1604645 1593626 1584243 1575527 1566090 1555778 1545715 1536777 1528525 1519908 1510681 1501519 1492680
59163 1492680 1483299 1472530 1461018 1450618 1442695 1437029 1432262 1427179 1421730 1417071 1414341 1413308 1412707
59150 1412707 1412080 1412452 1414654 1417880 1420819 1423491 1426826 1430872 1434643 1437532 1439701 1441238 1442185 1443389 1446014
59135 1446014 1449893 1453498 1455906 1457798 1460122 1462805 1465314 1467578 1469628 1471070 1471660 1471963 1472672 1473463 1473022
59120 1473022 1470194 1464924 1458190 1451078 1443741 1435362 1425388 1414547 1404255 1395278 1387592 1381154 1375795
$$ packed form
59213A559068J3914J7486J9216J7864J5306J3892J3648J3422J3150J3398J3741
59202A724105J3180J1578R506P395N657M747M128K213j624n836q605r867j0391
59189A746186j0113r008q463r794j1866j2215j0398q490q142q898r752j0658j1694
59176A616695j2050j1019r383q716r437j0312j0063q938q252q617r227r162q839
59163A492680r381j0769j1512j0400p923n666m767n083n449m659k730j033o01
59150A412707o27L72K202L226K939K672L335M046L771K889K169J537R47J204K625
59135A446014L879L605K408J892K324K683K509K264K050J442N90L03P09P91m41
59120A473022k828n270o734p112p337q379r974j0841j0292q977p686o438n359
$$ plain form
59107 1375795 1370386 1363404 1354840 1346679 1340838 1337127 1333810 1329661 1324811 1319794 1314458 1308140 1300920 1294402
59093 1294402 1290580 1289516 1288780 1285996 1281539 1277564 1274493 1269961 1261813 1250924 1240039 1230573 1221693 1212335
59079 1212335 1203111 1195876 1191792 1190084 1188675 1186091 1182778 1180506 1180629 1183130 1187134 1191873 1197067 1202919
59065 1202919 1209976 1218732 1229151 1240715 1252999 1265966 1279718 1294213 1309386 1325325 1342194 1359916
59053 1359916 1377969 1395644 1412694 1429533 1446396 1462515 1476781 1489008 1499686 1508614 1515174 1520128
59041 1520128 1525450 1531472 1535812 1536452 1534457 1531953 1528771 1523325 1515978 1508997 1503364 1497932 1491872 1485740
59027 1485740 1479765 1473287 1466498 1460652 1455580 1448852 1438592 1425752 1412609 1400384 1389298 1379531 1370812
59014 1370812 1362132 1353033 1344333 1336691 1329452 1321911 1314647 1308515 1303269 1298388 1294313 1291439 1288511 1283414
$$ packed form
59107A375795n409o982q564q161n841l711l317m149m850n017n336o318p220o518
59093A294402l822j064p36k784m457l975l071m532q148j0889j0885r466q880r358
59079A212335r224p235m084j708j409k584l313k272J23K501M004M739N194N852
59065A202919P057Q756J0419J1564J2284J2967J3752J4495J5173J5939J6869J7722
59053A359916J8053J7675J7050J6839J6863J6119J4266J2227J0678Q928O560M954
59041A520128N322O022M340O40j995k504l182n446p347o981n633n432o060o132
59027A485740n975o478o789n846n072o728j0260j2840j3143j2225j1086r767q719
59014A370812q680r099q700p642p239p541p264o132n246m881m075k874k928n097
$$ plain form
59000 1283414 1275387 1265522 1255503 1246796 1240519 1236853 1234683 1232610 1230215 1227803 1225458 1223131 1221278 1220576
58986 1220576 1221208 1222901 1225178 1227089 1227470 1226278 1225060 1225293 1226843 1228774 1230844 1233140 1235057 1236018 1236821
58971 1236821 1238955 1242859 1248052 1254684 1263582 1274884 1287924 1302470 1318692 1335746 1351810 1366143
58959 1366143 1379968 1394597 1409510 1422931 1433674 1441724 1447451 1450956 1452057 1450646 1447243 1443329 1440656
58946 1440656 1439891 1440231 1440528 1440500 1440574 1441131 1442445 1445053 1449411 1455029 1460473 1464585 1467340 1469145 1469689 1468202
58930 1468202 1464815 1460805 1457128 1453421 1449091 1444660 1441109 1438394 1435857 1434015 1434635 1438764 1445873 1455240
58916 1455240 1466832 1480098 1493227 1504917 1516205 1529170 1544156 1559385 1573245 1585836 1598134
58905 1598134 1610466 1622130 1631937 1638860 1642548 1643451 1642349 1639791 1636006 1631012 1624444 1615587 1604129
$$ packed form
59000A283414q027r865j0019q707o277l666k170k073k395k412k345k327j853p02
58986A220576O32J693K277J911L81j192j218K33J550J931K070K296J917R61Q03
58971A236821K134L904N193O632Q898J1302J3040J4546J6222J7054J6064J4333
58959A366143J3825J4629J4913J3421J0743Q050N727L505J101j411l403l914k673
58946A440656p65L40K97k8P4N57J314K608M358N618N444M112K755J805N44j487
58930A468202l387m010l677l707m330m431l551k715k537j842O20M129P109R367
58916A455240J1592J3266J3129J1690J1288J2965J4986J5229J3860J2591J2298
58905A598134J2332J1664R807O923L688R03j102k558l785m994o568q857j1458
$$ plain form
58892 1604129 1590731 1576369 1561092 1543964 1524423 1503489 1483343 1465688 1450533 1436655 1423259
58881 1423259 1410839 1400189 1391060 1382571 1374740 1368597 1364542 1361597 1358826 1356608 1355730 1355839 1355728 1354915
58867 1354915 1354056 1353872 1354244 1354469 1353986 1352872 1351917 1352104 1353657 1355656 1356888 1357024 1356874 1357702 1360502 1365721
58851 1365721 1373287 1382686 1393025 1403175 1412407 1421309 1431728 1445187 1461453 1479215 1497736 1516979
58839 1516979 1536396 1554958 1572663 1590877 1610635 1631477 1652304 1672521 1691966 1710746 1729749
58828 1729749 1750294 1772601 1795423 1817747 1839832 1861785 1882301 1900048 1915501 1930163 1944459
58817 1944459 1957607 1969157 1979408 1988371 1995377 1999804 2001505 2000581 1997281 1991967 1984707 1975241 1963831
58804 1963831 1951597 1939281 1926130 1910796 1892930 1873089 1851533 1828192 1803627 1778922 1754469
$$ packed form
58892A604129j3398j4362j5277j7128j9541k0934k0146j7655j5155j3878j3396
58881A423259j2420j0650r129q489p831o143m055k945k771k218q78J09j11q13
58867A354915q59j84L72K25m83j114r55J87J553J999J232J36j50Q28K800N219
58851A365721P566R399J0339J0150R232Q902J0419J3459J6266J7762J8521J9243
58839A516979J9417J8562J7705J8214J9758K0842K0827K0217J9445J8780J9003
58828A729749K0545K2307K2822K2324K2085K1953K0516J7747J5453J4662J4296
58817A944459J3148J1550J0251Q963P006M427J701r24l300n314p260r466j1410
58804A963831j2234j2316j3151j5334j7866j9841k1556k3341k4565k4705k4453
$$ plain form
58793 1754469 1729674 1704082 1678192 1652911 1628721 1605626 1583674 1563222 1544468 1526655 1508132
58782 1508132 1487830 1466531 1445926 1426643 1408398 1392090 1379877 1372197 1366171 1358458 1348878 1339737
58770 1339737 1332315 1325722 1319057 1313108 1309414 1308506 1309340 1310008 1309083 1306787 1304695 1303994 1304513 1305837 1308421
58755 1308421 1312697 1317750 1322040 1325040 1327092 1328065 1327392 1325358 1323224 1321856 1320880 1319119 1315399 1309308 1301862
58740 1301862 1295042 1289861 1285347 1280140 1274437 1269362 1265108 1261178 1258027 1256844 1257615 1258909 1259950 1261723
58726 1261723 1265576 1271664 1279293 1288064 1298195 1310120 1323993 1339279 1354830 1369781 1384141 1397903
58714 1397903 1409940 1418689 1423911 1426831 1428236 1427194 1422077 1412540 1400176 1387398 1375755 1365245 1355099
58701 1355099 1344944 1334941 1325164 1315604 1306634 1298488 1290279 1280734 1270210 1260676 1253171 1246628 1239869
$$ packed form
58793A754469k4795k5592k5890k5281k4190k3095k1952k0452j8754j7813j8523
58782A508132k0302k1299k0605j9283j8245j6308j2213p680o026p713r580r141
58770A339737p422o593o665n949l694r08Q34O68r25k296k092p01N19J324K584
58755A308421M276N053M290L000K052R73o73k034k134j368r76j761l720o091p446
58740A301862o820n181m514n207n703n075m254l930l151j183P71J294J041J773
58726A261723L853O088P629Q771J0131J1925J3873J5286J5551J4951J4360J3762
58714A397903J2037Q749N222K920J405j042n117r537j2364j2778j1643j0510j0146
58701A355099j0155j0003r777r560q970q146q209r545j0524r534p505o543o759
$$ plain form
58688 1239869 1233358 1228063 1224078 1221593 1221755 1224986 1229618 1233877 1238224 1244084 1251314 1258748 1266336 1274710
58674 1274710 1283313 1291067 1298400 1306545 1315163 1322756 1329193 1335717 1342580 1348836 1354426 1360300 1366324 1371294
58660 1371294 1375333 1380064 1385876 1391202 1395209 1399109 1403899 1408771 1412891 1416894 1421173 1424087 1423446 1418815
58646 1418815 1411097 1400606 1386805 1369464 1349050 1326271 1301906 1276813 1251578 1226352 1201175
58635 1201175 1176150 1151407 1127455 1105427 1086203 1069479 1054501 1041424 1030770 1021739 1012497 1002345
58623 1002345 992369 983733 976555 970764 966780 964753 964065 964034 964415 965082 965984 967505 970044 973378 977226
58608 977226 981996 987848 993611 998213 1002819 1009551 1018099 1025559 1029874 1031480 1031184 1028662 1024025 1018872
58594 1018872 1014395 1009785 1003705 996203 988100 979633 970905 962843 956446 951438 946485 940493 933445 926372
$$ packed form
58688A239869o511n295l985k485J62L231M632M259M347N860P230P434P588Q374
58674A274710Q603P754P333Q145Q618P593O437O524O863O256N590N874O024M970
58660A371294M039M731N812N326M007L900M790M872M120M003M279K914o41m631
58646A418815p718j0491j3801j7341k0414k2779k4365k5093k5235k5226k5177
58635A201175k5025k4743k3952k2028j9224j6724j4978j3077j0654r031r242j0152
58623A002345r976q636p178n791l984k027o88l1L81O67R02J521K539L334L848
58608I77226M770N852N763M602M606O732Q548P460M315J606k96k522m637n153
58594A018872m477m610o080p502q103q467q728q062o397n008m953n992p048p073
$$ plain form
58580 926372 920693 916965 914177 910875 906745 902373 897991 893774 890850 890273 891087 891131 889782 888104 886373
58565 886373 883769 880949 880481 883614 888495 892629 895510 897977 900738 904611 910456 917683 924343 929757
58551 929757 935445 942369 949171 954626 960061 967362 975874 983347 989111 994392 999946 1005134 1009219 1012354
58537 1012354 1015322 1019107 1024389 1030816 1037330 1043701 1050938 1059611 1068834 1077735 1086825 1096941 1107898
58524 1107898 1119485 1132849 1149292 1167989 1186263 1202207 1216310 1230567 1246580 1264320 1282265
58513 1282265 1298875 1314048 1328925 1344530 1361422 1380420 1402334 1426746 1452297 1478596 1506607
58502 1506607 1536595 1566906 1595449 1621422 1645001 1666341 1685441 1702008 1714925 1722822 1725725 1725247
58490 1725247 1722772 1718337 1711487 1702085 1690119 1675949 1660895 1646126 1630703 1612233 1589784 1564558
$$ packed form
58580I26372n679l728k788l302m130m372m382m217k924n77Q14M4j349j678j731
58565H86373k604k820m68L133M881M134K881K467K761L873N845P227O660N414
58551I29757N688O924O802N455N435P301Q512P473N764N281N554N188M085L135
58537A012354K968L785N282O427O514O371P237Q673R223Q901R090J0116J0957
58524A107898J1587J3364J6443J8697J8274J5944J4103J4257J6013J7740J7945
58513A282265J6610J5173J4877J5605J6892J8998K1914K4412K5551K6299K8011
58502A506607K9988L0311K8543K5973K3579K1340J9100J6567J2917P897K903m78
58490A725247k475m435o850r402j1966j4170j5054j4769j5423j8470k2449k5226
$$ plain form
58478 1564558 1537455 1508013 1476443 1444759 1414756 1386387 1359111 1333409 1310028 1289000 1270180
58467 1270180 1253481 1237987 1222312 1206533 1192403 1181084 1172157 1165100 1159823 1155224 1149393 1142135
58455 1142135 1135356 1130099 1125269 1120109 1115647 1112552 1109831 1107029 1105614 1106678 1109133 1111529 1113731 1115518
58441 1115518 1115696 1114102 1112484 1111945 1111620 1111335 1113140 1118276 1124865 1130746 1136559 1143886 1152367 1161007 1170567
58426 1170567 1182191 1195223 1208702 1223586 1241124 1260361 1279512 1298579 1318401 1338322 1356915
58415 1356915 1373896 1389209 1401424 1409210 1413479 1416069 1417136 1415501 1410618 1402770 1392578 1381807 1373249
58402 1373249 1368223 1365493 1363876 1364090 1366675 1370364 1374429 1380420 1389388 1399394 1407973 1415077 1421326 1425472
58388 1425472 1426078 1423738 1419182 1411335 1399910 1387760 1377600 1368317 1357530 1345965 1336070 1328070 1320730
$$ packed form
58478A564558k7103k9442l1570l1684l0003k8369k7276k5702k3381k1028j8820
58467A270180j6699j5494j5675j5779j4130j1319q927p057n277m599n831p258
58455A142135o779n257m830n160m462l095k721k802j415J064K455K396K202J787
58441A115518J78j594j618n39l25k85J805N136O589N881N813P327Q481Q640R560
58426A170567J1624J3032J3479J4884J7538J9237J9151J9067J9822J9921J8593
58415A356915J6981J5313J2215P786M269K590J067j635m883p848j0192j0771q558
58402A373249n026k730j617K14K585L689M065N991Q968J0006Q579P104O249M146
58388A425472O06k340m556p847j1425j2150j0160r283j0787j1565r895q000p340
$$ plain form
58375 1320730 1314464 1310387 1307660 1304995 1303425 1304368 1306467 1307743 1309456 1314226 1321545 1328780 1335566 1343502
58361 1343502 1352318 1359987 1365943 1370749 1373269 1371680 1366745 1360827 1354324 1346271 1337582 1330177 1323587 1315988
58347 1315988 1308137 1302896 1301310 1302353 1305814 1311940 1318814 1323650 1326357 1328771 1331123 1332659 1334772 1339746
58333 1339746 1347028 1354384 1361913 1370945 1379789 1385117 1387359 1390410 1395872 1401765 1407119 1413596 1421998 1430998
58319 1430998 1439962 1449527 1459050 1467031 1474362 1483524 1494323 1504098 1512479 1522182 1534608 1548293 1562278
58306 1562278 1577336 1593093 1607485 1620078 1632905 1647218 1662180 1677252 1693045 1709401 1725204
58295 1725204 1740297 1755227 1769465 1782351 1794930 1808089 1820245 1830262 1841038 1855915 1872850
58284 1872850 1886958 1898072 1910699 1926811 1944026 1961199 1980514 2002925 2026184 2048733 2071661
$$ packed form
58375A320730o266m077k727k665j570R43K099J276J713M770P319P235O786P936
58361A343502Q816P669N956M806K520j589m935n918o503q053q689p405o590p599
58347A315988p851n241j586J043L461O126O874M836K707K414K352J536K113M974
58333A339746P282P356P529R032Q844N328K242L051N462N893N354O477Q402R000
58319A430998Q964R565R523P981P331R162J0799R775Q381R703J2426J3685J3985
58306A562278J5058J5757J4392J2593J2827J4313J4962J5072J5793J6356J5803
58295A725204J5093J4930J4238J2886J2579J3159J2156J0017J0776J4877J6935
58284A872850J4108J1114J2627J6112J7215J7173J9315K2411K3259K2549K2928
$$ plain form
58273 2071661 2095878 2120867 2146732 2173925 2200678 2224265 2244772 2264217 2282595 2298771 2314368
58262 2314368 2332153 2351301 2369094 2386523 2406892 2429406 2450029 2468750 2490284 2517133 2547335
58251 2547335 2579401 2613959 2650104 2685590 2721109 2759174 2798837 2837125 2875394 2917971 2964526
58240 2964526 3010309 3054154 3099409 3146613 3192582 3237579 3285890 3337888 3388921 3437753 3488816
58229 3488816 3544140 3600368 3656055 3714875 3779108 3846622 3916497 3990951 4069568 4148501 4227584
58218 4227584 4311396 4401231 4493146 4586000 4684091 4789581 4899835 5014580 5137928 5270753
58208 5270753 5408837 5551189 5702324 5863654 6030752 6201985 6381496 6570625 6764828
58199 6764828 6962240 7166816 7380042 7598575 7823383 8061835 8316968 8584017 8861281
$$ packed form
58273B071661K4217K4989K5865K7193K6753K3587K0507J9445J8378J6176J5597
58262B314368J7785J9148J7793J7429K0369K2514K0623J8721K1534K6849L0202
58251B547335L2066L4558L6145L5486L5519L8065L9663L8288L8269M2577M6555
58240B964526M5783M3845M5255M7204M5969M4997M8311N1998N1033M8832N1063
58229C488816N5324N6228N5687N8820O4233O7514O9875P4454P8617P8933P9083
58218D227584Q3812Q9835R1915R2854R8091J05490J10254J14745J23348J32825
58208E270753J38084J42352J51135J61330J67098J71233J79511J89129J94203
58199F764828J97412K04576K13226K18533K24808K38452K55133K67049K77264
$$ plain form
58190 8861281 9154702 9467718 9796768 10141283 10507831 10899511 11311606 11742805 12200231
58181 12200231 12688145 13202448 13742017 14314358 14923916 15565783 16237380 16945395 17694750
58172 17694750 18481832 19305046 20170598 21081486 22032759 23024311 24066223 25165435 26320832
58163 26320832 27538472 28837454 30233235 31729522 33333513 35062713 36928469 38930195
58155 38930195 41075184 43386293 45880444 48559086 51431653 54529680 57887471 61531086
58147 61531086 65499411 69853192 74648817 79926300 85736764 92155338 99252254 107083266
58139 107083266 115732188 125340523 136085303 148165577 161823647 177326344 194892352
58132 194892352 214674255 236815811 261448406 288612127 318272499 350350205 384298226
$$ packed form
58190H861281K93421L13016L29050L44515L66548L91680M12095M31199M57426
58181A2200231M87914N14303N39569N72341O09558O41867O71597P08015P49355
58172A7694750P87082Q23214Q65552R10888R51273R91552J041912J099212J155397
58163B6320832J217640J298982J395781J496287J603991J729200J865756K001726
58155C8930195K144989K311109K494151K678642K872567L098027L357791L643615
58147F1531086L968325M353781M795625N277483N810464O418574P096916P831012
58139A07083266Q648922R608335J0744780J2080274J3658070J5502697J7566008
58132A94892352J9781903K2141556K4632595K7163721K9660372L2077706L3948021
$$ plain form
58125 384298226 418157268 448035169 469091569 477710285 473165930 457529183 434258263
58118 434258263 406802330 377893399 349326568 321977157 296078618 271656989 248789792
58111 248789792 227567885 207995928 190019655 173583926 158606939 144950278 132471591
58104 132471591 121083131 110730876 101351161 92877877 85258979 78430750 72295996 66753449
58096 66753449 61730969 57172189 53014738 49205020 45716104 42529697 39615013 36941824
58088 36941824 34497252 32270994 30237066 28365994 26642521 25057144 23592767 22233500
58080 22233500 20974720 19811173 18726078 17704180 16745059 15852364 15020480 14242229 13518356
58071 13518356 12847893 12219440 11623243 11062494 10542304 10057036 9598966 9169941 8773355
$$ packed form
58125C84298226L3859042K9877901K1056400Q618716m544355j5636747k3270920
58118D34258263k7455933k8908931k8566831k7349411k5898539k4421629k2867197
58111B48789792k1221907j9571957j7976273j6435729j4976987j3656661j2478687
58104A32471591j1388460j0352255r379715q473284p618898o828229o134754n542547
58096F6753449n022480m558780m157451l809718l488916l186407k914684k673189
58088C6941824k444572k226258k033928j871072j723473j585377j464377j359267
58080B2233500j258780j163547j085095j021898r59121q92695q31884p78251p23873
58071A3518356o70463o28453n96197n60749n20190m85268m58070m29025l96586
$$ plain form
58062 8773355 8402897 8049926 7714286 7397741 7094283 6797282 6509616 6236825 5976477
58053 5976477 5723596 5480561 5252239 5036535 4828479 4628711 4439868 4259479 4084257
58044 4084257 3916653 3759808 3610803 3466010 3328241 3201489 3083274 2969181 2860532
58035 2860532 2760840 2669024 2582523 2502804 2431544 2365583 2301563 2241302 2187041 2136161 2086218
58024 2086218 2040057 1999888 1961366 1919948 1878287 1840803 1805655 1768910 1732255 1699407 1668627
58013 1668627 1635787 1601733 1570144 1541200 1513455 1488789 1469240 1451872 1432735 1412949 1395180
58002 1395180 1377458 1356729 1335391 1317822 1302833 1285827 1266112 1246116 1225707 1203491 1181859
57991 1181859 1164552 1150475 1135439 1118704 1102599 1087213 1070856 1054632 1041415 1030980 1020544
$$ packed form
58062H773355l70458l52971l35640l16545l03458k97001k87666k72791k60348
58053E976477k52881k43035k28322k15704k08056j99768j88843j80389j75222
58044D084257j67604j56845j49005j44793j37769j26752j18215j14093j08649
58035B860532r9692r1816q6501p9719p1260o5961o4020o0261n4261n0880m9943
58024B086218m6161m0169l8522m1418m1661l7484l5148l6745l6655l2848l0780
58013A668627l2840l4054l1589k8944k7745k4666j9549j7368j9137j9786j7769
58002A395180j7722k0729k1338j7569j4989j7006j9715j9996k0409k2216k1632
57991A181859j7307j4077j5036j6735j6105j5386j6357j6224j3217j0435j0436
$$ plain form
57980 1020544 1009100 997323 984701 970875 958134 948461 939737 928839 916621 905815 896089 885467
57968 885467 874510 864642 854320 841455 827871 816804 807656 797755 787621 779784 773865 767499 760969
57955 760969 756354 753123 748924 743773 739292 734922 729015 722584 717853 714187 709538 704783 702397 701767
57941 701767 700062 696981 694590 693249 691745 690660 691513 693159 693019 691391 690720 691041 689998 687042 683923
57926 683923 681277 678232 675190 673636 673322 672686 671718 671540 671713 670915 669635 669280 669382 668642 667887 668938 671352
57909 671352 673326 674964 677616 680804 682908 684052 685321 686015 684710 682123 679938 677776 674188 669404
57895 669404 664048 656656 645935 634130 624437 616320 607210 597786 591451 589266 589434 591272 595665 601680
57881 601680 606554 609258 611046 612805 614836 618477 624585 631148 635870 640109 646495 653628 657489 657535 656774
$$ packed form
57980A020544j1444j1777j2622j3826j2741r673q724j0898j2218j0806r726j0622
57968H85467j0957r868j0322j2865j3584j1067r148r901j0134p837n919o366o530
57955G60969m615l231m199n151m481m370n907o431m731l666m649m755k386o30
57941G01767j705l081k391j341j504j085Q53J646j40j628o71L21j043k956l119
57926F83923k646l045l042j554l14o36r68j78J73p98j280l55J02p40p55J051K414
57909F71352J974J638K652L188K104J144J269O94j305k587k185k162l588m784
57895F69404n356p392j0721j1805r693q117r110r424o335k185J68J838M393O015
57881F01680M874K704J788J759K031L641O108O563M722M239O386P133L861M6p61
$$ plain form
57866 656774 655958 652463 645472 637669 630642 622595 611994 600100 588671 578224 569555 563987 561049
57853 561049 558539 555755 554229 554720 555994 557035 557942 558338 557426 555920 555364 555345 553938 550977 548267 546390
57837 546390 543915 539911 534756 528649 521927 516561 514469 514641 514822 515514 518922 524370 528653 531155 534696
57822 534696 540699 547178 552377 556903 561185 564055 565010 565149 565004 564194 563778 565879 570153 573653 575036
57807 575036 575969 577619 578920 579379 580538 583302 586462 589033 591524 593933 595158 595443 596771 599742 602564
57792 602564 604095 605365 607078 608164 607813 606569 604547 601061 596834 593974 592899 591866 590251 589494 589911
57777 589911 589540 587359 584856 583285 582105 581242 581993 584401 586594 588037 590532 594520 597394 597244 595512
57762 595512 594215 593322 592662 593485 595851 597124 595564 593139 592351 592355 590707 587142 583089 578953 574151 568615
$$ packed form
57866F56774q16l495o991p803p027q047j0601j1894j1429j0447q669n568k938
57853E61049k510k784j526M91J274J041R07L96r12j506n56j9j407k961k710j877
57837E46390k475m004n155o107o722n366k092J72J81O92L408N448M283K502L541
57822E34696O003O479N199M526M282K870R55J39j45q10m16K101M274L500J383
57807E75036R33J650J301M59J159K764L160K571K491K409J225K85J328K971K822
57792F02564J531J270J713J086l51j244k022l486m227k860j075j033j615p57M17
57777E89911l71k181k503j571j180q63P51K408K193J443K495L988K874j50j732
57762E95512j297q93o60Q23K366J273j560k425p88Mj648l565m053m136m802n536
$$ plain form
57746 568615 562241 554222 544784 536225 530230 525461 519646 512780 506312 500384 494083 487767 483131 481127
57732 481127 481059 481536 481602 481380 481892 483462 484456 483132 480616 479866 481372 482477 481757 481321 483317 486812 489958
57715 489958 492935 496675 500584 503779 506935 510739 513889 514662 513355 511315 508806 505568 502238 499247
57701 499247 495463 489922 484057 480252 478862 478431 478239 478994 481365 485298 490466 496290 501884 506885 511929
57686 511929 517719 524253 531343 538759 545497 550373 554054 558796 565180 570673 572694 571672 569769 568054
57672 568054 566469 565442 565762 567364 569407 571055 571617 570820 569522 569031 569221 568617 566754 564819 563475 562076
57656 562076 560727 560835 562333 562639 560144 556918 556077 558000 560736 562616 562720 560414 556517 553736 554009
57641 554009 556180 557810 558227 558432 559257 561076 564115 567570 569637 569804 569672 570218 569984 567684 564747 563195
$$ packed form
57746E68615o374q019r438q559n995m769n815o866o468n928o301o316m636k004
57732D81127o8M77O6k22N12J570R94j324k516p50J506J105p20m36J996L495L146
57715D89958K977L740L909L195L156L804L150P73j307k040k509l238l330k991
57701D99247l784n541n865l805j390m31j92P55K371L933N168N824N594N001N044
57686E11929N790O534P090P416O738M876L681M742O384N493K021j022j903j715
57672E68054j585j027L20J602K043J648N62p97j298m91J90o04j863j935j344j399
57656E62076j349J08J498L06k495l226q41J923K736J880J04k306l897k781K73
57641E54009K171J630M17K05Q25J819L039L455K067J67j32N46k34k300k937j552
$$ plain form
57625 563195 562736 562308 562939 566380 572049 578077 584542 592962 603254 614070 625936 641303 661275 684713
57611 684713 710970 741281 776709 816457 858917 902986 947464 989947 1026718 1053193 1064752
57600 1064752 1058512 1035170 999067 956308 912367 870323 830578 792644 757265 725976 698625
57589 698625 673121 648379 625999 607912 593677 581257 569171 556836 544245 532682 524332 519672
57577 519672 516416 512410 508150 504838 501580 496701 490727 485711 482189 478902 475125 471380 468014 464733
57563 464733 461402 458105 454763 451681 449666 448467 446172 441555 435978 431403 427746 424089 421317 421068
57549 421068 422573 423005 421063 418290 416656 416470 416785 416500 414914 412329 410057 408938 408135 406247 403005
57534 403005 398928 394141 388805 383971 380632 378453 376530 374675 372845 370321 366834 363676 362269 362355 362718
$$ packed form
57625E63195m59m28O31L441N669O028O465Q420J0292J0816J1866J5367J9972K3438
57611F84713K6257L0311L5428L9748M2460M4069M4478M2483L6771K6475J1559
57600A064752o240k3342l6103m2759m3941m2044l9745l7934l5379l1289k7351
57589F98625k5504k4742k2380j8087j4235j2420j2086j2335j2591j1563q350m660
57577E19672l256m006m260l312l258m879n974n016l522l287l777l745l366l281
57563D64733l331l297l342l082k015j199k295m617n577m575l657l657k772k49
57549D21068J505M32j942k773j634j86L15k85j586k585k272j119q03j888l242
57534D03005m077m787n336m834l339k179j923j855j830k524l487l158j407Q6L63
$$ plain form
57519 362718 362681 361723 359074 355294 352752 352588 352495 349703 344860 340540 337013 332400 326484 321418 318561 317041
57503 317041 315662 314141 312284 309933 307890 307117 306969 305892 303811 302159 301597 301403 301064 300856 300914 301205
57487 301205 302099 303504 303970 302446 300417 300336 302374 304766 306978 310152 314497 318638 321803 324556 327009
57472 327009 328337 328498 328610 329140 329293 328584 327522 326539 325584 324875 324591 323924 322020 319739 318857 319653 321034
57455 321034 322865 326109 330600 334713 337628 340155 342995 345827 348348 350460 351296 349840 346810 344220
57441 344220 342811 341656 340479 340431 342027 344108 345462 345999 345875 345036 344094 344199 345538 347240 348997 351376
57425 351376 354324 356997 359326 362164 365548 368429 370539 372943 376204 379535 382402 385524 389551 393811
57411 393811 396995 398304 397733 396147 395127 395701 397142 397985 397975 397981 398432 399284 401111 404588 409088 413316 417116
$$ packed form
57519C62718l7r58k649l780k542j64r3k792m843m320l527m613n916n066k857j520
57503C17041j379j521j857k351k043p73j48j077k081j652n62j94l39k08N8K91
57487C01205Q94J405M66j524k029q1K038K392K212L174M345M141L165K753K453
57472C27009J328J61J12N30J53p09j062r83r55p09k84o67j904k281q82P96J381
57455C21034J831L244M491M113K915K527K840K832K521K112Q36j456l030k590
57441C44220j409j155j177m8J596K081J354N37j24q39r42J05J339J702J757K379
57425C51376K948K673K329K838L384K881K110K404L261L331K867L122M027M260
57411C93811L184J309n71j586j020N74J441Q43j0OM51Q52J827L477M500M228L800
$$ plain form
57394 417116 421038 424510 426327 426783 427443 428852 430224 431300 432762 435043 438461 444004 451914 460006 465863
57379 465863 470304 476024 483139 489163 493459 498255 504589 510605 515143 519946 526673 534326 541399 548283
57365 548283 555669 562431 566918 568956 569232 568259 567125 567619 570241 573543 576583 580431 586062 592521 598652
57350 598652 605131 613153 622327 631390 640073 648890 657870 666614 674905 682570 689551 696689 705317 715528
57336 715528 725995 736022 746369 757427 768121 777529 786353 795871 806560 818373 831124 843894
57324 843894 855330 865258 874923 885203 895885 907109 919927 934702 950375 966054 982144 999391
57312 999391 1018025 1038148 1059524 1080861 1100954 1120755 1142433 1166123 1189665 1211874 1233775
57301 1233775 1256062 1277812 1298595 1319404 1340327 1359742 1377228 1395059 1415202 1436759 1457979
$$ packed form
57394D17116L922L472J817M56O60J409J372J076J462K281L418N543P910Q092N857
57379D65863M441N720P115O024M296M796O334O016M538M803O727P653P073O884
57365E48283P386O762M487K038K76r73j134M94K622L302L040L848N631O459O131
57350E98652O479Q022R174R063Q683Q817Q980Q744Q291P665O981P138Q628J0211
57336G15528J0467J0027J0347J1058J0694R408Q824R518J0689J1813J2751J2770
57324H43894J1436R928R665J0280J0682J1224J2818J4775J5673J5679J6090J7247
57312I99391J8634K0123K1376K1337K0093J9801K1678K3690K3542K2209K1901
57301A233775K2287K1750K0783K0809K0923J9415J7486J7831K0143K1557K1220
$$ plain form
57290 1457979 1478861 1500154 1521607 1543069 1565746 1590541 1616360 1641708 1666833 1692859 1719935
57279 1719935 1747656 1776312 1806485 1838273 1871729 1906894 1942593 1976633 2008168 2038613 2069537
57268 2069537 2101175 2133646 2167686 2203060 2238012 2271476 2304286 2337293 2370061 2402350 2434870
57257 2434870 2467433 2498395 2527335 2556399 2587526 2620023 2652194 2683607 2714493 2744765 2774976
57246 2774976 2806405 2838968 2871066 2902795 2936925 2974969 3014435 3051938 3087210 3122269 3158611
57235 3158611 3197046 3238344 3281909 3325410 3367522 3409428 3452137 3494442 3535298 3575929 3617471
57224 3617471 3658701 3698336 3737487 3777382 3816814 3854536 3892257 3932351 3974135 4015226 4055222
57213 4055222 4095446 4136392 4178127 4221875 4268523 4316696 4364864 4414023 4465651 4518299 4569059
$$ packed form
57290A457979K0882K1293K1453K1462K2677K4795K5819K5348K5125K6026K7076
57279A719935K7721K8656L0173L1788L3456L5165L5699L4040L1535L0445L0924
57268B069537L1638L2471L4040L5374L4952L3464L2810L3007L2768L2289L2520
57257B434870L2563L0962K8940K9064L1127L2497L2171L1413L0886L0272L0211
57246B774976L1429L2563L2098L1729L4130L8044L9466L7503L5272L5059L6342
57235C158611L8435M1298M3565M3501M2112M1906M2709M2305M0856M0631M1542
57224C617471M1230L9635L9151L9895L9432L7722L7721M0094M1784M1091L9996
57213D055222M0224M0946M1735M3748M6648M8173M8168M9159N1628N2648N0760
$$ plain form
57202 4569059 4617339 4664333 4709764 4752097 4791331 4828776 4864572 4898031 4930027 4962797 4997912
57191 4997912 5036588 5081072 5133239 5192296 5256020 5323663 5395741 5472175 5553068 5640403 5736362
57180 5736362 5840399 5949891 6062637 6176325 6286501 6387633 6475798 6548668 6604355 6642913
57170 6642913 6667832 6683190 6689986 6687635 6677956 6664726 6649966 6633441 6615250 6596187 6576146 6555038
57158 6555038 6535021 6519250 6508744 6502885 6502582 6510390 6527944 6555732 6594962 6647011 6711122 6785062
57146 6785062 6868004 6960636 7062543 7171445 7284866 7400817 7517143 7631650 7742334 7846364
57136 7846364 7940152 8021975 8092977 8153935 8202826 8237432 8258079 8265439 8258135 8235564 8200891 8157743
57124 8157743 8105827 8043441 7972641 7898015 7821644 7743083 7663008 7582929 7502432 7420850 7340826
$$ packed form
57202D569059M8280M6994M5431M2333L9234L7445L5796L3459L1996L2770L5115
57191D997912L8676M4484N2167N9057O3724O7643P2078P6434Q0893Q7335R5959
57180E736362J04037J09492J12746J13688J10176J01132Q8165P2870N5687L8558
57170F642913K4919J5358O796k351r679j3230j4760j6525j8191j9063k0041k1108
57158F555038k0017j5771j0506n859l03P808J7554K7788L9230N2049O4111P3940
57146F785062Q2942R2632J01907J08902J13421J15951J16326J14507J10684J04030
57136G846364R3788Q1823P1002O0958M8891L4606K0647P360p304k2571l4673m3148
57124H157743n1916o2386p0800p4626p6371p8561q0075q0079q0497q1582q0024
$$ plain form
57113 7340826 7266014 7195851 7126676 7057660 6991662 6930663 6874458 6823757 6780482 6744708 6714907
57102 6714907 6691420 6676238 6669008 6666198 6664183 6660426 6652136 6636834 6613812 6582364 6539638 6483360
57090 6483360 6415533 6340302 6259440 6173049 6082474 5988314 5887359 5776268 5657080 5534648
57080 5534648 5409889 5280010 5143743 5001389 4851290 4691754 4525230 4355004 4178452
57071 4178452 3988654 3781197 3553651 3299913 3011833 2686011 2322730 1918694 1467180
57062 1467180 965086 413500 -188501 -844694 -1557134 -2327398 -3161881 -4069792 -5056977
57053 -5056977 -6128360 -7294859 -8570558 -9964689 -11484691 -13146118 -14971365 -16979935
57045 -16979935 -19188224 -21616258 -24284105 -27202693 -30378344 -33825529 -37566165 -41620284
$$ packed form
57113G340826p4812p0163o9175o9016o5998o0999n6205n0701m3275l5774k9801
57102F714907k3487j5182p230k810k015l757q290j5302k3022l1448m2726n6278
57090F483360o7827p5231q0862q6391r0575r4160j00955j11091j19188j22432
57080E534648j24759j29879j36267j42354j50099j59536j66524j70226j76552
57071D178452j89798k07457k27546k53738k88080l25822l63281m04036m51514
57062A467180n02094D13500a88501o56193p12440p70264q34483r07911r87185
57053e056977j071383j166499j275699j394131j520002j661427j825247k008570
57045a6979935k208289k428034k667847k918588l175651l447185l740636m054119
$$ plain form
57037 -41620284 -46009491 -50766741 -55932135 -61550199 -67697582 -74519627 -82226560 -91053031
57029 -91053031 -101225460 -112939631 -126323361 -141414590 -158196531 -176622085 -196523293
57022 -196523293 -217482997 -238883303 -260133637 -280765398 -300186530 -317365992 -330898881
57015 -330898881 -339487643 -342410848 -339630090 -331612462 -319130023 -303130672 -284628996
57008 -284628996 -264610921 -243986057 -223554719 -203938295 -185513677 -168429253 -152686232
57001 -152686232 -138202070 -124836155 -112427613 -100856067 -90074705 -80091319 -70932578
56994 -70932578 -62622925 -55170762 -48554839 -42723943 -37611393 -33145096 -29246781 -25834972
56986 -25834972 -22835859 -20188292 -17839473 -15743986 -13868721 -12191892 -10694715 -9357964
$$ packed form
57037d1620284m389207m757250n165394n618064o147383o822045p706933q826471
57029i1053031j0172429j1714171j3383730j5091229j6781941j8425554j9901208
57022a96523293k0959704k1400306k1250334k0631761j9421132j7179462j3532889
57015c30898881q588762k923205K780758Q017628J2482439J5999351J8501676
57008b84628996K0018075K0624864K0431338J9616424J8424618J7084424J5743021
57001a52686232J4484162J3365915J2408542J1571546J0781362R983386R158741
56994g0932578Q309653P452163O615923N830896N112550M466297L898315L411809
56986b5834972K999113K647567K348819K095487J875265J676829J497177J336751
$$ plain form
56978 -9357964 -8165412 -7103464 -6156010 -5305210 -4538412 -3849332 -3231663 -2676139 -2173861
56969 -2173861 -1717190 -1296523 -901181 -525033 -167721 170179 489929 792653 1078148
56960 1078148 1344675 1585638 1787502 1937084 2032665 2084402 2103601 2095806 2064434 2015221 1953981
56949 1953981 1883315 1804241 1719039 1630685 1541078 1450976 1360326 1268215 1173925 1078089 981343
56938 981343 882587 780833 678119 577982 481375 386938 295245 209750 133153 65521 6381
56926 -44010 -86158 -121529 -150551 -172486 -188006 -199871 -210267 -219199 -226055 -230987 -234188 -235437 -234972
56913 -234972 -233497 -231024 -226888 -220855 -212797 -201560 -185985 -166993 -146871 -126464 -104947 -82344
56901 -82344 -60191 -39347 -19037 1482 21948 41925 60771 76407 86061 88923 86399 79379 67266
$$ packed form
56978i357964J192552J061948R47454Q50800P66798O89080O17669N55524N02278
56969b173861M56671M20667L95342L76148a67721A70179L19750L02724K85495
56960A078148K66527K40963K01864J49582R5581N1737J9199p795l1372m9213o1240
56949A953981p0666p9074q5202q8354q9607r0102r0650r2111r4290r5836r6746
56938I81343r8756j01754j02714j00137r6607r4437r1693q5495p6597F5521F381
56926d4010m2148l5371k9022k1935j5520j1865j0396q932o856m932l201j249M65
56913b34972J475K473M136O033Q058J1237J5575J8992K0122K0407K1517K2603
56901h2344K2153K0844a9037A482K0466J9977J8846J5636R654K862k524p020j2113
$$ plain form
56888 67266 50620 32788 17349 5087 -5246 -14141 -20626 -23897 -24354 -22806 -19242 -12669 -2241 11509
56873 27035 43665 62551 85021 110427 136185 159263 176797 186278 186797 180003 168641 154293
56861 154293 137521 119644 102774 88150 75717 65356 57321 51519 47527 45229 44342 43703 42456
56848 42456 41810 44115 50122 58471 67740 77405 86760 94703 101130 107185 113692 120535 127775 135898 144685
56833 144685 153406 162617 174111 188382 203808 219289 236097 255750 277235 297847 315893 331065
56821 331065 342744 349697 351634 349900 346417 342642 339609 338180 338870 341741 346635 353371 361907 372626
56807 372626 386295 403456 423993 447636 474644 505323 538899 573523 607749 641448 674503
56796 674503 704617 727275 738538 737863 728028 712781 695110 677330 661528 649159 640707 636190
$$ packed form
56888F7266j6646j7832j5439E087e246q895o485l271m57J548L564O573b241A1509
56873B7035J6630J8886K2470K5406K5758K3078J7534R481N19o794j1362j4348
56861A54293j6772j7877j6870j4624j2433j0361q035n802l992k298q87o39j247
56848D2456o46K305O007Q349R269R665R355P943O427O055O507O843P240Q123Q787
56833A44685Q721R211J1494J4271J5426J5481J6808J9653K1485K0612J8046J5172
56821C31065J1679O953J937j734l483l775l033j429O90K871M894O736Q536J0719
56807C72626J3669J7161K0537K3643K7008L0679L3576L4624L4226L3699L3055
56796F74503L0114K2658J1263o75r835j5247j7671j7780j5802j2369q452m517
$$ plain form
56784 636190 635763 639553 647348 658849 673989 692775 715218 741654 772731 808787 849614 894721
56772 894721 942754 989958 1029937 1056057 1064350 1054448 1029020 993250 953788 916199 882715 852813
56760 852813 825794 802217 783145 769062 759807 754994 754269 757469 764651 775785 790654 809346 832423
56747 832423 859870 889691 917838 939590 951184 950885 939255 918483 891206 859864 826708 793504
56735 793504 760967 729332 699802 674481 654406 638679 626332 617881 613867 612891 612703 612810 614518
56722 614518 618790 625523 634525 645137 654582 658633 655012 644986 630961 613797 593500 571340 549622
56709 549622 529675 511273 493934 477685 462435 447670 433173 419369 406511 394128 381857
56698 381857 370321 360421 352006 344087 336304 329210 322863 316234 308782 301683 296350 292238 287410 281138
$$ packed form
56784F36190m27L790P795J1501J5140J8786K2443K6436L1077L6056M0827M5107
56772H94721M8033M7204L9979K6120Q293r902k5428l5770l9462l7589l3484k9902
56760H52813k7019k3577j9072j4083r255m813p25L200P182J1134J4869J8692K3077
56747H32423K7447K9821K8147K1752J1594k99j1630k0772k7277l1342l3156l3204
56735G93504l2537l1635k9530k5321k0075j5727j2347q451m014r76j88J07J708
56722F14518M272O733R002J0612R445M051l621j0026j4025j7164k0297k2160k1718
56709E49622j9947j8402j7339j6249j5250j4765j4497j3804j2858j2383j2271
56698C81857j1536r900q415p919p783p094o347o629p452p099n333m112m828o272
$$ plain form
56684 281138 274687 269474 265721 263278 262417 263028 263859 263419 261245 257944 254562 252218 251592 252169 252566 252026
56668 252026 251119 250740 251143 252235 253890 255501 256085 255511 254958 255628 257644 260436 263232 264827 264206 262168
56652 262168 261086 262046 263358 263060 261744 261525 263151 265679 268294 270759 272532 273088 273044 273589 274862 276185
56636 276185 277719 280484 284692 289270 293164 296066 297886 298688 299196 300218 301436 301824 301319 300958 301215 301438
56620 301438 301262 301332 302072 302783 302719 302232 302087 302209 301909 301046 300273 300157 300572 301015 301259 301548 302268 303604 305652
56601 305652 308550 312053 315057 316282 315789 315186 315953 318059 320585 322996 325132 326719 327814 329279 331747
56586 331747 334340 335419 334581 333061 332195 332276 332992 334160 335744 337602 339544 341317 342476 342514 341252 339082
56570 339082 336940 335932 336486 337729 338138 337017 334920 332601 330260 328018 326243 324949 323606 321994 320497
$$ packed form
56684B81138o451n213l753k443q61O11Q31m40k174l301l382k344o26N77L97n40
56668B52026r07l79M03J092J655J611N84n74n53O70K016K792K796J595o21k038
56652B62168j082R60J312k98j316k19J626K528K615K465J773N56m4N45J273J323
56636B76185J534K765M208M578L894K902J820Q02N08J022J218L88n05l61K57K23
56620C01438j76P0P40P11o4m87j45J22l00q63p73j16M15M43K44K89P20J336K048
56601C05652K898L503L004J225m93o03P67K106K526K411K136J587J095J465K468
56586C31747K593J079q38j520q66Q1P16J168J584J858J942J773J159L8j262k170
56570C39082k142j008N54J243M09j121k097k319k341k242j775j294j343j612j497
$$ plain form
56555 320497 319172 317344 314612 311473 308599 306525 306340 309168 314139 318391 320243 321020 322553 324372 325053
56540 325053 324958 325446 326252 325958 324713 324298 325403 326734 326965 326056 324548 323092 322790 324486 327484 330186
56524 330186 332093 333932 335888 337247 337976 339163 341347 343551 344538 344302 344007 345052 348162 352799 357647
56509 357647 362236 367473 373767 379616 383450 386077 389526 394058 398371 402434 407803 414883 422026 427965
56495 427965 433187 438153 441990 444030 445231 446860 448739 449751 449313 447656 445332 443120 441779 441384 441276
56480 441276 440833 439811 438008 435381 432405 429535 426494 422974 419721 417785 416962 416197 415269 414660 413989 412215
56464 412215 409351 406371 403401 399745 395777 392875 391166 389249 386729 384969 384448 383283 379640 374174
56450 374174 368857 364655 361429 358975 356885 354215 350463 346375 343040 340735 339129 337998 337360 337651 339825
$$ packed form
56555C20497j325j828k732l139k874k074j85K828M971M252J852P77J533J819O81
56540C25053r5M88Q06k94j245m15J105J331K31r09j508j456l02J696K998K702
56524C30186J907J839J956J359P29J187K184K204R87k36k95J045L110M637M848
56509C57647M589N237O294N849L834K627L449M532M313M063N369P080P143N939
56495D27965N222M966L837K040J201J629J879J012m38j657k324k212j341l95j08
56480D41276m43j022j803k627k976k870l041l520l253j936q23p65r28o09o71j774
56464D12215k864k980k970l656l968k902j709j917k520j760n21j165l643n466
56450C74174n317m202l226k454k090k670l752m088l335k305j606j131o38K91K174
$$ plain form
56435 339825 344291 349638 353702 356022 357904 359981 361530 362513 364163 366656 368239 367959 367499 368782 371272
56420 371272 373250 374370 375168 375185 373608 371165 369617 369659 370715 372392 374666 376959 378430 379105 379539 379507
56404 379507 378283 376327 375485 376996 379922 382046 382247 381833 383383 388019 393982 398412 400319 400974 401609
56389 401609 402118 402297 402796 403899 404547 403749 402251 401731 402824 404780 406662 408089 409108 409912 410456 410126
56373 410126 408359 405778 403852 403049 402376 401183 400213 400042 399622 397681 394790 392747 392317 392748 393258 393966
56357 393966 395409 397980 401752 406176 409983 412003 412065 410764 408555 405544 401980 398448 395529 393563 392789
56342 392789 393574 396292 400705 405475 408936 410867 412939 416593 420903 423483 423257 421403 419841 419795 421565
56327 421565 424564 427682 430673 434795 440824 446931 450285 450594 450222 450811 451824 452684 454134 456578 458966
$$ packed form
56435C39825M466N347M064K320J882K077J549R83J650K493J583k80m60J283K490
56420C71272J978J120P98J7j577k443j548M2J056J677K274K293J471O75M34l2
56404C79507j224j956q42J511K926K124K01m14J550M636N963M430J907O55O35
56389D01609N09J79M99J103O48p98j498n20J093J956J882J427J019Q04N44l30
56373D10126j767k581j926q03o73j193r70j71m20j941k891k043m30M31N10P08
56357C93966J443K571L772M424L807K020O2j301k209l011l564l532k919j966p74
56342C92789P85K718M413M770L461J931K072L654M310K580k26j854j562m6J770
56327D21565K999L118K991M122O029O107L354L09l72N89J013Q60J450K444K388
$$ plain form
56312 458966 460337 461013 461422 461218 460474 460442 462221 465652 469963 474186 476749 476466 474543 473795 475153 476806
56296 476806 477495 478464 480969 484012 486110 487456 488611 488706 486917 484465 483298 483677 484567 485483 486468 487219
56280 487219 487620 488334 489691 490998 491954 493508 496156 498890 501193 504601 510591 518151 525106 530673 535054
56265 535054 537882 539172 540797 544775 550593 556119 560649 565151 569914 573937 576721 579106 582145 586226
56251 586226 591240 596721 601975 606768 611524 616279 620231 623011 625582 629106 633834 639798 647432 656678
56237 656678 666719 677531 690346 705409 720587 733490 743887 753030 762067 772367 785725 802475
56225 802475 820555 837931 854780 871944 888783 904380 919642 936335 955000 975246 996904
56214 996904 1019378 1041241 1062181 1084109 1108802 1135874 1164640 1196108 1231178 1268659 1307381
$$ packed form
56312D58966J371O76M09k04p44l2J779L431M311M223K563k83j923p48J358J653
56296D76806O89R69K505L043K098J346J155R5j789k452j167L79Q90R16R85P51
56280D87219M01P14J357J307R56J554K648K734K303L408N990P560O955N567M381
56265E35054K828J290J625L978N818N526M530M502M763M023K784K385L039M081
56251E86226N014N481N254M793M756M755L952K780K571L524M728N964P634R246
56237F56678J0041J0812J2815J5063J5178J2903J0397R143R037J0300J3358J6750
56225H02475J8080J7376J6849J7164J6839J5597J5262J6693J8665K0246K1658
56214I96904K2474K1863K0940K1928K4693K7072K8766L1468L5070L7481L8722
$$ plain form
56203 1307381 1348666 1394314 1443643 1495117 1549506 1608813 1673350 1742646 1818020 1901330 1992064
56192 1992064 2088490 2190779 2300224 2416313 2537650 2664910 2799630 2940520 3084066 3228434
56182 3228434 3373644 3518086 3657915 3789920 3912057 4021214 4113419 4186474 4239795 4271796
56172 4271796 4280468 4266676 4233811 4183766 4116153 4031996 3935344 3830321 3718928 3602282 3481662
56161 3481662 3357750 3231148 3104203 2980136 2859995 2742725 2628498 2519438 2416538
56152 2416538 2318425 2223984 2133880 2048678 1967628 1890251 1817289 1749353 1686306 1628437 1576376
56141 1576376 1529376 1485538 1444223 1406512 1373016 1342950 1315573 1290711 1267698 1245606 1224547
56130 1224547 1205037 1186408 1167978 1151364 1139027 1130611 1123313 1115874 1109467 1104667 1100622 1097545 1096852
$$ packed form
56203A307381M1285M5648M9329N1474N4389N9307O4537O9296P5374Q3310R0734
56192A992064R6426J02289J09445J16089J21337J27260J34720J40890J43546J44368
56182C228434J45210J44442J39829J32005J22137J09157R2205P3055N3321L2001
56172D271796Q672j3792l2865n0045o7613q4157r6652j05023j11393j16646j20620
56161C481662j23912j26602j26945j24067j20141j17270j14227j09060j02900
56152B416538r8113r4441r0104q5202q1050p7377p2962o7936o3047n7869n2061
56141A576376m7000m3838m1315l7711l3496l0066k7377k4862k3013k2092k1059
56130A224547j9510j8629j8430j6614j2337q416p298p439o407m800m045l077o93
$$ plain form
56117 1096852 1098081 1098675 1097856 1097885 1100418 1104389 1108754 1114571 1122694 1131696 1139902 1147737 1156590 1166902 1178611
56102 1178611 1192160 1208085 1226805 1249124 1275295 1303200 1329508 1353322 1376929 1402555 1430456
56091 1430456 1460661 1494187 1531466 1571588 1614255 1661047 1713987 1774211 1842304 1918168 2000351
56080 2000351 2087380 2180039 2280463 2388865 2503096 2620952 2740065 2855429 2960500 3052091
56070 3052091 3131891 3202477 3264542 3318849 3367737 3412574 3451552 3481581 3500935 3509223 3506634 3494423
56058 3494423 3474654 3448398 3415063 3373418 3321733 3257187 3177593 3084344 2982063 2875304 2767428
56047 2767428 2662074 2562821 2471085 2386736 2310855 2245305 2189663 2141323 2098808 2062226 2030557
56036 2030557 2001775 1975948 1954966 1938763 1924970 1912862 1904366 1900439 1899493 1900086 1902223 1905485 1909046
$$ packed form
56117A096852J229N94q19K9K533L971M365N817Q123R002Q206P835Q853J0312J1709
56102A178611J3549J5925J8720K2319K6171K7905K6308K3814K3607K5626K7901
56091A430456L0205L3526L7279M0122M2667M6792N2940O0224O8093P5864Q2183
56080B000351Q7029R2659J00424J08402J14231J17856J19113J15364J05071R1591
56070C052091P9800P0586O2065N4307M8888M4837L8978L0029J9354Q288k589j2211
56058C494423j9769k6256l3335m1645n1685o4546p9594r3249j02281j06759j07876
56047B767428j05354r9253r1736q4349p5881o5550n5642m8340m2515l6582l1669
56036B030557k8782k5827k0982j6203j3793j2108q496l927r46N93K137L262L561
$$ plain form
56023 1909046 1914100 1923069 1935811 1949598 1963171 1977594 1993132 2009118 2027165 2050262 2077793 2105452
56011 2105452 2131096 2156869 2184729 2213972 2244241 2276847 2311653 2346389 2380283 2414877 2450477
56000 2450477 2485719 2521357 2560181 2602192 2644126 2684600 2725359 2766757 2806944 2846631 2889508
55989 2889508 2936459 2984330 3031792 3081298 3133865 3187419 3242149 3301938 3368254 3437848 3508481
55978 3508481 3581618 3657525 3733461 3809080 3888104 3972416 4060116 4151382 4249991 4356689 4467579
55967 4467579 4581841 4704323 4837402 4976921 5119479 5266909 5420126 5575884 5733920
55958 5733920 5900337 6079160 6267049 6460861 6663886 6879980 7108361 7349085 7606904
55949 7606904 7884317 8177033 8481468 8800606 9137827 9491641 9861366 10251217 10664006
$$ packed form
56023A909046N054Q969J2742J3787J3573J4423J5538J5986J8047K3097K7531K7659
56011B105452K5644K5773K7860K9243L0269L2606L4806L4736L3894L4594L5600
56000B450477L5242L5638L8824M2011M1934M0474M0759M1398M0187L9687M2877
55989B889508M6951M7871M7462M9506N2567N3554N4730N9789O6316O9594P0633
55978C508481P3137P5907P5936P5619P9024Q4312Q7700R1266R8609J06698J10890
55967D467579J14262J22482J33079J39519J42558J47430J53217J55758J58036
55958E733920J66417J78823J87889J93812K03025K16094K28381K40724K57819
55949G606904K77413K92716L04435L19138L37221L53814L69725L89851M12789
$$ plain form
55940 10664006 11097890 11553898 12038688 12554667 13095633 13657843 14247136 14869519 15523482
55931 15523482 16207472 16925571 17679323 18463657 19277960 20131531 21031262 21974755 22963603
55922 22963603 24012701 25138358 26348235 27650690 29060674 30586541 32224412 33976604
55914 33976604 35862503 37900384 40093335 42446209 44982149 47729574 50709220 53949401
55906 53949401 57498077 61404074 65703296 70439723 75681255 81497600 87944921 95094634
55898 95094634 103059017 111974304 121992386 133315291 146202050 160906760 177637959
55891 177637959 196590860 217939872 241738941 267895980 296259377 326431116 357029129
55884 357029129 384993098 406012872 416253484 414134385 400774415 379030283 352186554
$$ packed form
55940A0664006M33884M56008M84790N15979N40966N62210N89293O22383O53963
55931A5523482O83990P18099P53752P84334Q14303Q53571Q99731R43493R88848
55922B2963603J049098J125657J209877J302455J409984J525867J637871J752192
55914C3976604J885899K037881K192951K352874K535940K747425K979646L240181
55906E3949401L548676L905997M299222M736427N241532N816345O447321P149713
55898I5094634P964383Q915287J0018082J1322905J2886759J4704710J6731199
55891A77637959J8952901K1349012K3799069K6157039K8363397L0171739L0598013
55884C57029129K7963969K1019774J0240612k119099j3359970k1744132k6843729
$$ plain form
55877 352186554 323145527 294122075 266547764 241130366 218094459 197443819 179076032
55870 179076032 162796833 148359982 135524775 124064875 113756686 104405783 95881082
55863 95881082 88101960 81004661 74538103 68669917 63365699 58567176 54206859 50233599
55855 50233599 46608574 43289349 40236663 37428723 34853389 32493471 30331615 28359586
55847 28359586 26568282 24935499 23435308 22052446 20777174 19594653 18491038 17462675
55839 17462675 16507886 15615801 14773321 13976980 13228676 12526356 11868138 11258654 10701074
55830 10701074 10188186 9710269 9266157 8857900 8480594 8126974 7797023 7493771 7213873
55821 7213873 6950882 6703638 6473015 6254228 6040373 5830010 5623814 5417728 5207314
$$ packed form
55877C52186554k9041027k9023452k7574311k5417398k3035907k0650640j8367787
55870A79076032j6279199j4436851j2835207j1459900j0308189r350903q524701
55863I5881082p779122p097299o466558n868186n304218m798523m360317l973260
55855E0233599l625025l319225l052686k807940k575334k359918k161856j972029
55847B8359586j791304j632783j500191j382862j275272j182521j103615j028363
55839A7462675r54789q92085q42480p96341p48304p02320o58218o09484n57580
55830A0701074n12888m77917m44112m08257l77306l53620l29951l03252k79898
55821G213873k62991k47244k30623k18787k13855k10363k06196k06086k10414
$$ plain form
55812 5207314 4995455 4788082 4585291 4383969 4186159 3997271 3818187 3645937 3480204
55803 3480204 3322997 3174043 3032332 2899891 2778473 2664914 2555322 2451348 2356903 2271267
55793 2271267 2190909 2115436 2046224 1981644 1919167 1859888 1805707 1754520 1703565 1654876 1611792
55782 1611792 1572415 1532367 1492023 1455195 1422384 1391079 1361250 1334743 1310242 1284371 1257328
55771 1257328 1232507 1211077 1191337 1172731 1156208 1141285 1126652 1112709 1099839 1085599 1067610
55760 1067610 1047774 1029561 1012662 994701 976813 962714 953052 945177 938055 933211 931065 930113 929531
55747 929531 929294 928352 925883 923521 923218 923962 923862 924205 927796 934233 940240 943709 944219 940958 933782 925125
55731 925125 917171 908253 895678 880717 866792 853933 839568 824223 811889 804562 800159 796029
$$ packed form
55812E207314k11859k07373k02791k01322j97810j88888j79084j72250j65733
55803C480204j57207j48954j41711j32441j21418j13559j09592j03974r4445q5636
55793B271267q0358p5473o9212o4580o2477n9279n4181n1187n0955m8689m3084
55782A611792l9377m0048m0344l6828l2811l1305k9829k6507k4501k5871k7043
55771A257328k4821k1430j9740j8606j6523j4923j4633j3943j2870j4240j7989
55760A067610j9836j8213j6899j7961j7888j4099r662p875p122m844k146r52n82
55747I29531k37r42k469k362l03P44j00L43L591O437O007L469N10l261p176q657
55731I25125p954q918j2575j4961j3925j2859j4365j5345j2334p327m403m130
$$ plain form
55719 796029 791076 784541 776105 767398 760517 755199 750130 746235 745568 747600 749812 751179 751778 749903 743406
55704 743406 733363 722659 711357 697394 681460 666869 654404 641488 627180 613996 603653
55693 603653 594595 584995 575159 565655 555893 545882 537036 530084 524142 518579 513782 509528 504714 499264
55679 499264 494309 490032 485264 479592 473961 468909 463973 459002 454263 449271 443342 437173 432060 427794
55665 427794 423321 418995 415911 413427 409841 405348 401793 399492 396926 393710 391255 390108 389141 387985
55651 387985 388083 390610 395169 400924 407178 412436 414747 413596 410244 406068 401786 397982 394871 391807 388433
55636 388433 385638 383797 381026 375279 367383 359823 353384 347347 342208 339361 338588 338586 339590 342649 346735
55621 346735 349644 351698 355391 361068 365983 368114 368203 367556 366588 366053 366981 368650 369003 367749 366717 366729
$$ packed form
55719G96029m953o535q436q707o881n318n069l895o67K032K212J367N99j875o497
55704G43406j0043j0704j1302j3963j5934j4591j2465j2916j4308j3184j0343
55693F03653r058r600r836r504r762j0011q846o952n942n563m797m254m814n450
55679D99264m955m277m768n672n631n052m936m971m739m992n929o169n113m266
55665D27794m473m326l084k484l586m493l555k301k566l216k455j147r67j156
55651C87985R8K527M559N755O254N258K311j151l352m176m282l804l111l064l374
55636C88433k795j841k771n747p896p560o439o037n139k847p73kJ004L059M086
55621C46735K909K054L693N677M915K131Q9o47r68n35R28J669L53j254j032J2
$$ plain form
55605 366729 366630 365931 365849 366915 367926 368128 368292 368913 369394 369710 370846 372936 374808 375758 376047 375634 374476
55588 374476 373879 375030 376244 374384 369114 362960 357194 350922 344450 339697 336289 331041 322975 315441
55574 315441 311242 308690 304700 299156 293857 289344 285147 281476 278617 276136 274243 274244 276128 277548 276772
55559 276772 274794 272982 270758 267516 264695 263619 262886 260471 257162 255416 255515 255194 252864 249412 246769
55544 246769 245977 246535 246898 245948 244348 243656 243854 243097 240435 237200 234861 233093 231005 228758 226740 224463
55528 224463 221485 218283 215260 212192 209590 209050 211086 214083 216556 218927 221782 224115 225009 225674 228000
55513 228000 232122 236985 242216 247801 252975 257159 261177 265887 270315 272724 272997 272400 271468 269547 266214
55498 266214 262002 257904 254854 253216 252242 250773 248955 248129 248497 248350 246555 244226 242601 240810 237391
$$ packed form
55605C66729r9o99q2J066J011K02J64O21M81L16J136K090J872R50K89m13j158
55588C74476n97J151J214j860n270o154n766o272o472m753l408n248q066p534
55574C15441m199k552l990n544n299m513m197l671k859k481j893JJ884J420p76
55559B76772j978j812k224l242k821j076p33k415l309j746R9l21k330l452k643
55544B46769p92N58L63r50j600o92J98p57k662l235k339j768k088k247k018k277
55528B24463k978l202l023l068k602n40K036K997K473K371K855K333Q94O65K326
55513B28000M122M863N231N585N174M184M018M710M428K409K73n97r32j921l333
55498B66214m212m098l050j638r74j469j818q26L68j47j795k329j625j791l419
$$ plain form
55483 237391 232866 228950 226141 223869 222271 221972 222485 222572 222004 221527 221245 220376 218624 216695 215359 214591
55467 214591 213491 210688 205565 199629 195736 195151 196238 196893 197137 198132 199681 200248 198940 196148 192566
55452 192566 188663 184867 181346 177923 174714 172337 170972 170049 169357 169449 170418 171564 172951 175679 179588
55437 179588 182348 182261 180516 179075 177929 176317 175158 175802 177369 177920 177739 178883 181556 183435 182998 181481
55421 181481 180937 181910 183632 185316 186744 188351 190801 193806 195791 195737 194779 194701 195428 195547 194760 193886 192596
55404 192596 189272 183535 177160 171938 168126 165472 164252 164434 164966 164763 163693 162100 160162 158163 156628
55389 156628 155697 154938 154077 153353 152972 152822 152867 153133 153189 152443 151174 150504 151050 152098 152368 151158 148736 146231
55371 146231 145188 146527 149596 152665 154569 155613 156851 158919 161636 164412 166829 168910 170797 172326
$$ packed form
55483B37391m525l916k809k272j598k99N13Q7n68m77k82q69j752j929j336p68
55467B14591j100k803n123n936l893n85J087O55K44R95J549N67j308k792l582
55452A92566l903l796l521l423l209k377j365r23o92R2R69J146J387K728L909
55437A79588K760q7j745j441j146j612j159O44J567N51j81J144K673J879m37j517
55421A81481n44R73J722J684J428J607K450L005J985n4r58p8P27J19p87q74j290
55404A92596l324n737o375n222l812k654j220J82N32k03j070j593j938j999j535
55389A56628r31p59q61p24l81j50M5K66N6p46j269o70N46J048K70j210k422k505
55371A46231j043J339L069L069J904J044J238K068K717K776K417K081J887J529
$$ plain form
55357 172326 173262 173881 174678 175516 175903 176229 177498 179346 179739 177657 174901 173860 174499 175097 175081 175209 175386
55340 175386 174355 171786 169004 167208 166334 166059 166613 168046 169695 170979 171994 173005 174082 175374 176884
55325 176884 177769 176817 173980 170683 168311 167132 166908 167560 168696 169325 168811 167728 167115 167152 166998 165818 163659
55308 163659 161369 159847 159394 159738 160489 161237 161296 160066 158029 156670 156716 156998 155902 153612 151979 152301 154163
55291 154163 156405 158249 159196 158740 156942 154980 154499 156104 158558 159782 158868 156845 155080 153489 151316
55276 151316 149323 149568 152608 156537 159554 161853 163849 164242 161772 157765 154802 153459 152375 151104 150683
55261 150683 151315 151673 151007 150176 149951 149801 149183 148760 149494 151329 153367 154658 154477 152621 149803 147186 145445
55244 145445 144831 145738 148023 150012 149791 147752 146369 147059 148684 149692 150196 151063 152267 153373 154689 156666
$$ packed form
55357A72326R36O19P97Q38L87L26J269J848L93k082k756j041O39N98j6J28J77
55340A75386j031k569k782j796q74k75N54J433J649J284J015J011J077J292J510
55325A76884Q85r52k837l297k372j179k24O52J136O29n14j083o13L7j54j180k159
55308A63659k290j522m53L44P51P48N9j230k037j359M6K82j096k290j633L22J862
55291A54163K242J844R47m56j798j962m81J605K454J224r14k023j765j591k173
55276A51316j993K45L040L929L017K299J996L93k470m007k963j343j084j271m21
55261A50683O32L58o66q31k25j50o18m23P34J835K038J291j81j856k818k617j741
55244A45445o14R07K285J989k21k039j383O90J625J008N04Q67J204J106J316J977
$$ plain form
55228 156666 158784 160141 160793 161579 162881 164372 165772 167115 168336 169170 169430 169054 167934 165951 163113
55213 163113 159714 156693 155651 157681 161755 165016 165307 163217 161185 160838 161611 161842 160746 159146 158421
55198 158421 159056 160486 162146 163987 165790 166820 166818 166638 166994 167224 166422 165233 165085 165879 166073 165269 165059
55181 165059 166697 169311 171217 171866 171637 170784 169637 169119 169844 171056 171375 170404 168895 167649 166959 166875 167226
55164 167226 167380 166634 164999 163211 161824 160552 158679 156095 153779 153024 154035 155694 157044 158631 161620
55149 161620 165774 169304 170954 171411 172164 173558 174607 174400 173165 171926 171406 171347 171048 170494 170551 171703 173113
55132 173113 173561 172956 172070 171079 169409 167040 164940 164004 164359 165821 168093 170278 171198 170604 169337 168048
55116 168048 166700 165591 165742 167566 170042 171959 173253 174470 175672 176701 177907 179701 181748 183344
$$ packed form
55228A56666K118J357O52P86J302J491J400J343J221Q34K60l76j120j983k838
55213A63113l399l021j042K030M074L261K91k090k032l47P73K31j096j600p25
55198A58421O35J430J660J841J803J030kj80L56K30q02j189j48P94J94q04k10
55181A65059J638K614J906O49k29q53j147n18P25J212L19r71j509j246o90q4L51
55164A67226J54p46j635j788j387j272j873k584k316p55J011J659J350J587K989
55149A61620M154L530J650M57P53J394J049k07j235j239n20n9k99n54N7J152J410
55132A73113M48o05q86r91j670k369k100r36L55J462K272K185R20n94j267j289
55116A68048j348j109J51J824K476J917J294J217J202J029J206J794K047J596
$$ plain form
55102 183344 184250 184474 183652 181471 178612 176505 176062 177026 178388 179092 178530 176916 175126 173838 172900 171778
55086 171778 170368 169077 168385 168725 170477 173501 176674 178436 178066 176243 174235 172689 171371 170070 169339
55071 169339 169950 171634 173051 173338 173133 173511 174461 175274 176097 177895 180764 183262 183803 182043 178711 174898
55055 174898 171874 170720 171448 172880 173941 174786 176279 178699 181371 183389 184359 184507 184229 183715 183175 183314
55039 183314 184856 187206 188476 187798 186934 188252 191501 194062 194338 193221 191988 190639 189211 189132 191809
55024 191809 196644 201553 204945 206408 206128 204588 202468 200096 197353 194540 192703 192461 193114 193535 193372
55009 193372 192816 191914 190948 190815 192068 193916 194974 194692 193408 191490 189216 187151 185816 185167 185050 185877
54993 185877 188126 191325 194110 195253 194421 192266 190134 189247 189710 190665 191555 192491 193124 192305 189744 187132
$$ packed form
55102A83344R06K24q22k181k859k107m43R64J362P04n62j614j790j288r38j122
55086A71778j410j291o92L40J752L024L173J762l70j823k008j546j318j301p31
55071A69339O11J684J417K87k05L78R50Q13Q23J798K869K498N41j760l332l813
55055A74898l024j154P28J432J061Q45J493K420K672K018R70J48k78n14n40J39
55039A83314J542K350J270o78q64J318L249K561K76j117j233j349j428p9K677
55024A91809M835M909L392J463k80j540k120k372k743k813j837k42O53M21j63
55009A93372n56r02r66j33J253J848J058k82j284j918k274k065j335o49j17Q27
54993A85877K249L199K785J143q32k155k132q87M63R55Q90R36O33q19k561k612
$$ plain form
54977 187132 186451 187679 189072 189211 187851 185432 182993 182160 183836 186930 189425 190605 191180 191468 190815 189008
54961 189008 186992 185739 185357 185682 186840 188647 190177 190563 189928 189168 189142 190134 191626 192437 191661 189729 188169
54944 188169 188117 189408 191118 192353 192377 190828 188421 186959 187821 190499 193121 194477 195088 196148 197791 198828
54928 198828 198221 196454 195088 195063 195794 196102 195713 195445 195978 196886 197134 196403 195537 195512 196216 196719 196746 197228 199043
54909 199043 201705 203898 205021 205521 205990 206692 207885 209740 211872 213667 215109 216547 217725 217990 217563
54894 217563 217525 218315 219194 219440 219077 218205 216894 216072 216979 219069 220026 218913 217774 218715 220849 222025 222418
54877 222418 224109 227612 231224 233883 236481 239740 242613 243765 243421 242928 243469 245901 250830 257890 265545
54862 265545 272449 278713 285297 292504 299625 305785 310568 313876 315510 315068 312353 308000 303543 300357
$$ packed form
54977A87132o81J228J393J39j360k419k439q33J676L094K495J180N75K88o53j807
54961A89008k016j253l82L25J158J807J530L86o35p60k6R92J492Q11p76j932j560
54944A88169n2J291J710J235K4j549k407j462Q62K678K622J356O11J060J643J037
54928A98828o07j767j366k5P31L08l89k68N33R08K48p31q66k5P04N03K7M82J815
54909A99043K662K193J123N00M69P02J193J855K132J795J442J438J178K65m27
54894B17563l8P90Q79K46l63q72j311q22R07K090R57j113j139R41K134J176L93
54877B22418J691L503L612K659K598L259K873J152l44m93N41K432M929P060P655
54862B65545O904O264O584P207P121O160M783L308J634m42k715m353m457l186
$$ plain form
54848 300357 298379 296096 291941 285655 278453 272135 267866 265430 263560 261136 258010 254724 251799 249514
54834 249514 247928 246738 245411 243888 242860 243028 244419 246695 249601 252707 255307 257203 259085 261550
54820 261550 264374 267462 271761 278114 285687 292812 299086 305345 311676 316886 320197 322093 322911 321774
54806 321774 317771 311492 304487 297568 290359 282440 274381 267493 262694 259674 257199 254230 250558 246466
54792 246466 242319 238759 236656 236139 236061 235104 233170 231096 229267 227302 224904 222232 219497 216856 214654
54777 214654 213208 212425 212159 212657 214001 215414 215845 215032 213359 211112 208751 207445 208077 209824 210812 210131
54761 210131 208275 205912 203574 202405 203644 206936 210370 212537 213432 213166 211343 208416 206344 206811 209479
54746 209479 212626 214781 215293 214346 213144 213276 215031 216987 217881 218171 219060 220654 221974 222335 221976 221601
$$ packed form
54848C00357j978k283m155o286p202o318m269k436j870k424l126l286k925k285
54834B49514j586j190j327j523j028J68J391K276K906L106K600J896J882K465
54820B61550K824L088M299O353P573P125O274O259O331N210L311J896Q18j137
54806C21774m003o279p005o919p209p919q059o888m799l020k475k969l672m092
54792B46466m147l560k103n17p8r57j934k074j829j965k398k672k735k641k202
54777B14654j446p83k66M98J344J413M31q13j673k247k361j306O32J747R88o81
54761B10131j856k363k338j169J239L292L434K167Q95k66j823k927k072M67K668
54746B09479L147K155N12r47j202J32J755J956Q94K90Q89J594J320L61l59l75
$$ plain form
54730 221601 221824 222654 223147 222201 220255 219537 221881 226665 231546 234844 236666 238116 240121 242903 246127
54715 246127 249640 254161 260694 269009 277322 283935 288689 292496 296124 300012 304639 310315 316892 324052
54701 324052 331358 337668 341330 341606 339250 335099 328936 320652 311695 303973 297733 291748 285494 279948
54687 279948 276173 274128 273014 271910 269973 266948 263836 262311 263058 265140 267204 268752 270018 271157
54673 271157 271953 272091 271527 270783 270890 272688 276163 280754 286159 292339 298749 304344 308716 312745 317630
54658 317630 323391 328547 331166 330201 326167 320740 315427 310366 304529 297311 289705 283610 279988 277940
54644 277940 275621 271935 267361 263331 260940 260033 259328 257473 254225 250687 248221 247095 246347 244994 243062
54629 243062 241244 239955 239038 238169 237077 235525 233544 231633 230312 229506 228780 228077 227642 227187 225840 223211
$$ packed form
54730B21601K23Q30M93r46j946p18K344M784M881L298J822J450K005K782L224
54715B46127L513M521O533Q315Q313O613M754L807L628L888M627N676O577P160
54701C24052P306O310L662K76k356m151o163q284q957p722o240n985o254n546
54687B79948l775k045j114j104j937l025l112j525P47K082K064J548J266J139
54673B71157P96J38n64p44J07J798L475M591N405O180O410N595M372M029M885
54658C17630N761N156K619r65m034n427n313n061n837p218p606o095l622k048
54644B77940k319l686m574m030k391r07p05j855l248l538k466j126p48j353j932
54629B43062j818j289r17q69j092j552j981j911j321q06p26p03m35m55j347k629
$$ plain form
54613 223211 220058 217647 216825 217856 220575 224266 227740 229906 230182 228383 224784 220524 217299 216005 215877
54598 215877 215399 213944 212217 211353 211924 213625 215508 216621 216688 216212 215842 215898 216636 218588 222179 227036 231922
54581 231922 235350 236350 234940 232063 228877 226052 223860 222698 222911 224057 225100 225587 226003 226560 226388
54566 226388 224576 221559 218779 217315 217502 219448 222931 226785 229282 229513 228032 226055 224393 223144 221909
54551 221909 220189 218078 216765 217813 221497 226062 229050 229393 228032 226614 225963 225948 226456 227822 230107
54536 230107 232413 233519 233150 232123 231224 230499 229833 229524 229744 229849 229057 227692 227078 227997 229825 231535 233137
54519 233137 235507 238867 242042 243516 242876 240820 238111 235182 232730 231649 231871 232027 231119 230068 230566
54504 230566 232585 234211 234090 232932 232208 232360 232934 233591 234033 233604 232023 230329 230177 232190 235609 239424
$$ packed form
54613B23211l153k411q22J031K719L691L474K166K76j799l599m260l225j294j28
54598B15877m78j455j727q64N71J701J883J113O7m76l70N6P38J952L591M857M886
54581B31922L428J000j410k877l186k825k192j162K13J146J043M87M16N57j72
54566B26388j812l017k780j464J87J946L483L854K497K31j481j977j662j249j235
54551B21909j720k111j313J048L684M565K988L43j361j418o51j5N08J366K285
54536B30107K306J106l69j027q99p25o66l09K20J05p92j365o14R19J828J710J602
54519B33137K370L360L175J474o40k056k709k929k452j081K22J56r08j051M98
54504B30566K019J626j21j158p24J52N74O57M42m29j581j694j52K013L419L815
$$ plain form
54488 239424 242984 245578 246461 245912 245510 246613 248810 250544 251113 251264 251714 252005 251521 251028 251983 254318 256049
54471 256049 255668 253974 252692 252080 251150 249874 249705 251570 254470 256577 256981 255969 254431 253523 254181 256179
54455 256179 258033 258478 257706 256733 255974 255163 254364 254155 254718 255396 255546 255415 255767 256790 257826 258346 258742 259686
54437 259686 260944 261594 261523 261810 263159 264809 265823 266579 267849 269095 269314 269246 270890 274451 277469 277799
54421 277799 276198 275116 275984 278599 282127 285530 287630 287980 287561 287948 289863 292793 295598 297319 298075
54406 298075 299362 302503 306473 308500 307554 305965 306467 308748 310326 310014 308817 307790 306757 305404 304256
54391 304256 303881 303814 302858 300363 297115 294932 294922 296062 296167 294529 292673 291890 291119 288252 282775 276082
54375 276082 269942 265797 264714 266444 268832 269647 268958 268641 269853 272253 275257 278421 280673 280898 279585
$$ packed form
54488B39424L560K594Q83n49m02J103K197J734N69J51M50K91m84m93R55K335J731
54471B56049l81j694j282o12r30j276j69J865K900K107M04j012j538r08O58J998
54455B56179J854M45p72r73p59q11p99k09N63O78J50j31L52J023J036N20L96R44
54437B59686J258O50p1K87J349J650J014P56J270J246K19o8J644L561L018L30
54421B77799j601j082Q68K615L528L403K100L50m19L87J915K930K805J721P56
54406B98075J287L141L970K027r46j589N02K281J578l12j197j027j033j353j148
54391C04256l75o7r56k495l248k183j0J140J05j638j856p83p71k867n477o693
54375B76082o140m145j083J730K388Q15o89l17J212K400L004L164K252K25j313
$$ plain form
54360 279585 278485 278326 278277 278000 278665 281181 284716 287855 290151 291614 291693 289994 287536 286164 286745 288456
54344 288456 289751 289612 288191 286674 286313 287269 288576 289444 290161 291449 293350 295255 296756 297925 298719 298656
54328 298656 297436 295719 294793 295186 295920 295666 294499 293829 294492 295768 296655 297224 298051 299131 300276 301942
54312 301942 304630 307806 310440 312322 313927 315334 316349 317417 319256 321636 323609 324901 326043 327240
54298 327240 328299 329590 331710 334004 334767 333374 331049 329003 326934 323951 320054 316058 312758 310648
54284 310648 309668 308792 306688 303380 300494 299350 299455 299341 298212 296181 293578 290694 287876 285374 283384
54269 283384 282341 282620 283750 284596 284656 284591 285238 286661 288366 289745 290121 289183 287659 286749 286669 286647 286592 287626
54251 287626 290393 293814 296192 296790 295831 293976 292417 292387 293645 294259 292749 289623 286037 282137 277961
$$ packed form
54360B79585j100j59m9k77O65K516L535L139K296J463P9j699k458j372N81J711
54344B88456J295j39j421j517l61R56J307Q68P17J288J901J905J501J169P94o3
54328B98656j220j717r26L93P34k54j167o70O63J276Q87N69Q27J080J145J666
54312C01942K688L176K634J882J605J407J015J068J839K380J973J292J142J197
54298C27240J059J291K120K294P63j393k325k046k069k983l897l996l300k110
54284C10648r80q76k104l308k886j144J05j14j129k031k603k884k818k502j990
54269B83384j043K79J130Q46O0o5O47J423J705J379L76r38j524r10q0k2n5J034
54251B87626K767L421K378N98r59j855j559l0J258O14j510l126l586l900m176
$$ plain form
54236 277961 274945 274669 276418 277597 276664 274425 272398 271162 270616 270770 271669 273168 275176 277683 280248
54221 280248 281827 281411 278763 274642 270569 268132 268055 269852 272497 275158 277182 277952 277366 276131 275072
54206 275072 274421 274286 275348 278314 282862 287904 292684 296887 299839 300703 299730 298547 298710 300430 302917
54191 302917 305428 307574 309034 309455 308550 306187 302737 299584 298662 300743 304230 306399 306041 304345 302914
54176 302914 301711 299738 297229 295788 296144 296997 296886 296259 296625 298283 300091 301184 301660 301609 300720 299108
54160 299108 297465 296054 294432 292517 290984 290164 289358 287672 284926 281543 278388 276833 277805 280285 281924
54145 281924 281756 281282 282091 283593 284131 283382 282499 282504 283542 285120 286156 285507 283456 281906 282038 282625 282029
54128 282029 280908 281178 282821 283836 283305 282513 282655 283301 283891 285071 287450 290276 292516 294410 296834 299679
$$ packed form
54236B77961l016k76J749J179r33k239k027j236n46J54Q99J499K008K507K565
54221B80248J579m16k648m121m073k437p7J797K645K661K024P70n86j235j059
54206B75072o51j35J062K966M548N042M780M203K952Q64r73j183J63J720K487
54191C02917K511K146J460M21r05k363l450l153r22K081L487K169l58j696j431
54176C02914j203j973k509j441L56Q53j11o27L66J658J808J093M76n1q89j612
54160B99108j643j411j622j915j533q20q06j686k746l383l155j555R72K480J639
54145B81924j68m74Q09J502N38p49q83NJ038J578J036o49k051j550J32N87n96
54128B82029j121K70J643J015n31p92J42O46N90J180K379K826K240J894K424K845
$$ plain form
54112 299679 301884 302714 302128 300150 296790 292556 288316 284520 281020 277786 275338 274221 274331 274988 275612
54097 275612 276068 276338 276180 275447 274582 274304 274688 275039 274905 274699 274956 275451 275715 276002 276993 278645 280115 280934
54079 280934 281684 283287 285990 289176 291875 293419 293856 293799 293774 293892 294291 295416 297429 299712 301567 303103
54063 303103 304739 306057 306072 304677 303075 302562 303494 305564 308465 312018 316187 321119 326749 332284 336721
54048 336721 339997 342902 345617 347134 346699 345042 343424 341869 339269 335121 330282 325757 321511 316976
54034 316976 312328 308531 306126 304607 303333 302579 303057 304562 305851 306126 306046 306851 308936 311847 315269 319289
54018 319289 323701 327790 331005 333528 336038 339150 343006 347078 350372 352234 353025 353722 354803 355778 355791
54003 355791 354425 351976 349311 347494 347227 348533 351125 354883 359607 364501 368518 371400 373905 376750
$$ packed form
54112B99679K205Q30n86j978l360m234m240l796l500l234k448j117J10O57O24
54097B75612M56K70j58p33q65k78L84L51j34k06K57M95K64K87R91J652J470Q19
54079B80934P50J603K703L186K699J544M37n7k5J18L99J125K013K283J855J536
54063C03103J636J318J5j395j602n13R32K070K901L553M169M932N630N535M437
54048C36721L276K905K715J517m35j657j618j555k600m148m839m525m246m535
54034C16976m648l797k405j519j274p54M78J505J289K75q0Q05K085K911L422M020
54018C19289M412M089L215K523K510L112L856M072L294J862P91O97J081R75J3
54003C55791j366k449k665j817k67J306K592L758M724M894M017K882K505K845
$$ plain form
53989 376750 379750 382326 384560 387260 390992 395401 399679 403567 407706 413082 420352 429750 441194 453978
53975 453978 466578 477460 486440 494874 504274 515011 526449 537752 548202 557177 564442 570341 575394
53962 575394 579898 584115 588400 592652 595961 597344 596717 594817 592353 589575 586408 582602 577930 572583
53948 572583 567129 561752 555871 548874 540907 532581 524275 516138 508292 500601 492773 485233 479300 475743
53934 475743 473673 471641 469234 466664 463427 458761 453272 448734 446106 444792 443976 443572 443579 443543 443197 442907
53918 442907 443175 444260 446398 449670 453502 457085 460521 464758 470145 475685 479912 481847 481125 478138 474199
53903 474199 470648 467480 463770 459617 456561 455598 455880 456035 455793 455563 455296 454705 453997 453555 453456 453963 455880
53886 455880 459568 464173 468706 473375 478976 485463 492158 499015 506423 513853 520027 524937 530708 539611
$$ packed form
53989C76750L000K576K234K700L732M409M278L888M139N376P270R398J1444J2784
53975D53978J2600J0882Q980Q434R400J0737J1438J1303J0450Q975P265N899N053
53962E75394M504M217M285M252L309J383o27j900k464k778l167l806m672n347
53948E72583n454n377n881o997p967q326q306q137p846p691p828p540n933l557
53934D75743k070k032k407k570l237m666n489m538k628j314q16m04Pl6l46k90
53918D42907K68J085K138L272L832L583L436M237N387N540M227J935p22k987l939
53903D74199l551l168l710m153l056r63K82J55k42k30k67n91p08m42r9N07J917
53886D55880L688M605M533M669N601O487O695O857P408P430O174M910N771Q903
$$ plain form
53872 539611 551527 563893 573976 580877 585451 588934 592169 596006 601536 609205 618049 626746 635397
53859 635397 645320 656866 668623 679454 690318 702923 717156 731088 743481 755221 768064 782617
53847 782617 797637 810726 819772 824441 826474 827967 829314 829353 827503 824887 823014 822028 820824 818335
53833 818335 814133 808094 800257 791027 780958 770116 757996 744203 729007 713094 697114 681683
53821 681683 667513 654979 643534 632065 620133 608593 598685 590647 583470 575797 566794 556473
53809 556473 545691 535748 527312 519620 511322 502338 494259 488431 484143 479329 472812 465196 457728 451137
53795 451137 445784 442041 439790 437992 435603 432952 431448 431697 432589 432671 431829 430901 430067 428668 426573 424718
53779 424718 423807 423205 421644 418642 414816 411288 409062 408545 409250 410325 411600 413485 415594 416534 415782 414932
$$ packed form
53872E39611J1916J2366J0083O901M574L483L235L837N530P669Q844Q697Q651
53859F35397R923J1546J1757J0831J0864J2605J4233J3932J2393J1740J2843J4553
53847G82617J5020J3089R046M669K033J493J347L9j850k616j873r86j204k489
53833H18335m202o039p837r230j0069j0842j2120j3793j5196j5913j5980j5431
53821F81683j4170j2534j1445j1469j1932j1540r908q038p177p673r003j0321
53809E56473j0782r943q436p692q298q984q079n828m288m814o517p616p468o591
53795D51137n353l743k251j798k389k651j504K49Q92Q2q42r28q34j399k095j855
53779D24718r11o02j561l002l826l528k226n17P05J075J275J885K109R40p52q50
$$ plain form
53763 414932 416022 419199 423067 426721 430215 433478 436297 439249 443128 447280 449999 451052 452532 456510
53749 456510 462781 469561 475541 480649 485526 490968 497389 504363 511117 517757 525380 534627 544751 554474
53735 554474 563227 571266 579205 587684 596834 605785 613399 619663 625498 630907 634423 634961 633269 630797
53721 630797 627965 624323 619678 614162 607637 599872 591106 581982 573236 565579 559208 553127 545849 537244
53707 537244 528805 521651 515371 509508 504836 502003 499956 497037 492887 487960 481938 474197 465383 457055
53693 457055 449968 443961 439150 435760 433045 429848 426295 423558 422024 421160 421151 422880 425848 427806 427313
53678 427313 425360 423613 422234 420562 419010 418941 420847 423603 425461 425375 423672 421912 421834 423963 427369 430899
53662 430899 434177 437225 439844 441990 444251 447200 450448 452953 454139 454283 454101 454583 456997 462062 468880
$$ packed form
53763D14932J090L177L868L654L494L263K819K952L879M152K719J053J480L978
53749D56510O271O780N980N108M877N442O421O974O754O640P623R247J0124R723
53735E54474Q753Q039P939Q479R150Q951P614O264N835N409L516N38j692k472
53721F30797k832l642m645n516o525p765q766r124q746p657o371o081p278q605
53707E37244q439p154o280n863m672k833k047k919m150m927o022p741q814q328
53693D57055p087o007m811l390k715l197l553k737j534q64rJ729K968J958m93
53678D27313j953j747j379j672j552o9J906K756J858q6j703j760p8K129L406L530
53662D30899L278L048K619K146K261K949L248K505J186J44j82M82K414N065O818
$$ plain form
53647 468880 475453 480715 485522 491034 496702 500843 503131 505329 509059 513749 517653 520243 522483 524981
53633 524981 527202 528722 530156 532270 535042 538193 541888 546199 550384 553457 555166 555908 556099 556113 556349
53618 556349 556720 556563 555657 554872 555144 556310 557717 559357 561387 562928 562651 560599 558407 557508 557856 558519
53602 558519 558755 558376 557764 557774 559073 561461 564198 566923 569724 572425 574423 575226 574673 572828 570271 568252
53586 568252 567787 568638 569787 570777 571962 573747 576396 580291 585374 590454 594048 595926 596942 597575 597838
53571 597838 598527 601076 605779 611210 615925 619783 623300 626745 630262 633903 637110 639191 640697 643276
53557 643276 647719 653252 659228 666141 674112 681694 687500 692197 697599 704310 711373 717805 723421 728386
53543 728386 732900 737136 740824 743294 744672 746502 750188 755052 758862 760195 759551 758386 757834 758212 758922
$$ packed form
53647D68880O573N262M807N512N668M141K288K198L730M690L904K590K240K498
53633E24981K221J520J434K114K772L151L695M311M185L073J709P42J91J4K36
53618E56349L71j57r06p85K72J166J407J640K030J541k77k052k192q99L48O63
53602E58519K36l79o12J0J299K388K737K725K801K701J998Q03n53j845k557k019
53586E68252m65Q51J149R90J185J785K649L895N083N080L594J878J016O33K63
53571E97838O89K549M703N431M715L858L517L445L517L641L207K081J506K579
53557F43276M443N533N976O913P971P582N806M697N402O711P063O432N616M965
53543G28386M514M236L688K470J378J830L686M864L810J333o44j165n52L78P10
$$ plain form
53528 758922 758883 757694 756268 755708 755746 755008 752628 748890 744427 739687 735276 732074 730632 730656 731087 730617 728626
53511 728626 725978 724296 723880 723128 720970 719001 719658 722566 724510 723339 720362 718341 718434 719973 722022
53496 722022 724020 725597 726825 728377 730721 733499 736225 739133 742657 746508 749986 752899 755616 758572
53482 758572 762307 767450 773833 780093 785240 790448 798168 809419 822965 837165 851460 865714 879377
53469 879377 892245 905192 919230 934370 950231 967283 986496 1008011 1031052 1054964 1079387
53458 1079387 1103622 1127104 1150810 1177012 1206953 1239530 1272887 1306533 1341042 1376368 1411717
53447 1411717 1447016 1483331 1521342 1560107 1597965 1634457 1670880 1708859 1748542 1788363 1826588
53436 1826588 1862905 1898249 1933308 1967940 2002165 2036731 2071878 2106200 2137862 2166848 2194960
$$ packed form
53528G58922l9j189j426n60L8p38k380l738m463m740m411l202j442K4M31m70j991
53511G28626k648j682m16p52k158j969O57K908J944j171k977k021R3J539K049
53496G22022J998J577J228J552K344K778K726K908L524L851L478K913K717K956
53482G58572L735N143O383O260N147N208P720J1251J3546J4200J4295J4254J3663
53469H79377J2868J2947J4038J5140J5861J7052J9213K1515K3041K3912K4423
53458A079387K4235K3482K3706K6202K9941L2577L3357L3646L4509L5326L5349
53447A411717L5299L6315L8011L8765L7858L6492L6423L7979L9683L9821L8225
53436A826588L6317L5344L5059L4632L4225L4566L5147L4322L1662K8986K8112
$$ plain form
53425 2194960 2223569 2252457 2281107 2309937 2339401 2368608 2395946 2420968 2444938 2469397 2494603
53414 2494603 2519318 2541747 2560613 2575609 2587001 2594911 2599165 2599872 2597828 2594095 2589241 2582964 2574110
53401 2574110 2561177 2543526 2522655 2501757 2483274 2466798 2449763 2430037 2407452 2383029 2357551
53390 2357551 2331191 2304129 2276960 2250434 2224936 2200345 2176424 2153216 2130845 2109074 2087515
53379 2087515 2066375 2046516 2028514 2012259 1997938 1986754 1979747 1976195 1974301 1973484 1974937 1979635 1986882
53366 1986882 1995462 2005292 2016987 2030516 2045434 2062200 2082057 2105478 2131678 2159867 2190069 2222405
53354 2222405 2256415 2291701 2328582 2367454 2408051 2450063 2494127 2541339 2591881 2644855 2699505
53343 2699505 2755994 2814964 2876941 2942353 3011460 3083863 3158481 3234399 3311560 3390349 3470707
$$ packed form
53425B194960K8609K8888K8650K8830K9464K9207K7338K5022K3970K4459K5206
53414B494603K4715K2429J8866J4996J1392P910M254P07k044l733m854o277q854
53401B574110j2933j7651k0871k0898j8483j6476j7035j9726k2585k4423k5478
53390B357551k6360k7062k7169k6526k5498k4591k3921k3208k2371k1771k1559
53379B087515k1140j9859j8002j6255j4321j1184p007l552j894q17J453M698P247
53366A986882Q580R830J1695J3529J4918J6766J9857K3421K6200K8189L0202L2336
53354B222405L4010L5286L6881L8872M0597M2012M4064M7212N0542N2974N4650
53343B699505N6489N8970O1977O5412O9107P2403P4618P5918P7161P8789Q0358
$$ plain form
53332 3470707 3551894 3633143 3714326 3795900 3878136 3960455 4041772 4121510 4199843 4276737 4351306
53321 4351306 4422624 4490648 4555579 4616728 4672975 4724118 4770695 4812597 4849091 4880293 4907178
53310 4907178 4929663 4946036 4954892 4956320 4950320 4935528 4910811 4877017 4835647 4786772 4730042 4667084
53298 4667084 4600896 4532913 4462502 4389454 4315133 4240593 4165198 4088056 4009776 3932024 3856133
53287 3856133 3782690 3711589 3641753 3571539 3500198 3428533 3357766 3288442 3220904 3155987 3094332
53276 3094332 3035450 2978242 2922444 2869127 2819941 2775898 2736454 2699605 2663441 2627820 2593909
53265 2593909 2561979 2530723 2499308 2468986 2441563 2416887 2393038 2368812 2344886 2322581 2302444
53254 2302444 2284283 2267775 2252650 2238872 2226976 2217860 2211949 2208852 2208076 2209731 2214154 2221042 2229374
$$ packed form
53332C470707Q1187Q1249Q1183Q1574Q2236Q2319Q1317P9738P8333P6894P4569
53321D351306P1318O8024O4931O1149N6247N1143M6577M1902L6494L1202K6885
53310D907178K2485J6373Q856J428o000j4792k4717l3794m1370m8875n6730o2958
53298D667084o6188o7983p0411p3048p4321p4540p5395p7142p8280p7752p5891
53287C856133p3443p1101o9836p0214p1341p1665p0767o9324o7538o4917o1655
53276C094332n8882n7208n5798n3317m9186m4043l9444l6849l6164l5621l3911
53265B593909l1930l1256l1415l0322k7423k4676k3849k4226k3926k2305k0137
53254B302444j8161j6508j5125j3778j1896r116n911l097p76J655M423O888Q332
$$ plain form
53241 2229374 2238229 2247418 2257265 2268130 2280390 2294654 2311501 2330929 2352437 2375838 2401646 2430371
53229 2430371 2461674 2494468 2527581 2560116 2591498 2621629 2650809 2679187 2706510 2732574 2757352
53218 2757352 2780251 2799905 2815430 2827338 2836293 2841531 2841709 2836994 2828898 2818034 2803472 2784626
53206 2784626 2762353 2737505 2709553 2677491 2641438 2602662 2562574 2522115 2481399 2439579 2395787
53195 2395787 2350566 2305423 2260601 2214602 2166792 2119280 2074819 2033490 1992872 1951219 1909119
53184 1909119 1867928 1827760 1787628 1746962 1706367 1666858 1628579 1590614 1552241 1514034 1477182
53173 1477182 1442015 1408138 1375849 1346183 1319222 1293621 1268447 1244452 1222795 1203464 1185670
53162 1185670 1168841 1152319 1134957 1115967 1095477 1073587 1049941 1025115 1001106 979178 958319
$$ packed form
53241B229374Q855R189R847J0865J2260J4264J6847J9428K1508K3401K5808K8725
53229B430371L1303L2794L3113L2535L1382L0131K9180K8378K7323K6064K4778
53218B757352K2899J9654J5525J1908Q955N238J78m715q096j0864j4562j8846
53206B784626k2273k4848k7952l2062l6053l8776m0088m0459m0716m1820m3792
53195B395787m5221m5143m4822m5999m7810m7512m4461m1329m0618m1653m2100
53184A909119m1191m0168m0132m0666m0595l9509l8279l7965l8373l8207l6852
53173A477182l5167l3877l2289k9666k6961k5601k5174k3995k1657j9331j7794
53162A185670j6829j6522j7362j8990k0490k1890k3646k4826k4009k1928k0859
$$ plain form
53151 958319 937263 916865 898648 882007 865113 847961 832120 817687 803035 787912 774187
53140 774187 762600 751000 737165 721705 706686 692724 678959 664988 651253 638051 625426
53129 625426 613741 603271 593478 583639 574015 565559 558503 551981 545132 538031 531488 526269 522469 519352
53115 519352 515839 511416 506504 501912 498085 494839 491456 486953 480845 473909 467741 463303 460286 458092
53101 458092 456698 456060 455389 453948 452302 451822 452888 454352 454980 454755 454345 453826 452542 450033 446580 442839
53085 442839 439401 436779 435327 434794 434281 433053 431333 429986 429609 430330 432181 434900 437350 438071 436932
53070 436932 435670 436279 439193 443344 447443 450705 452941 454770 457422 461561 466307 469991 471861 472665 473694
53055 473694 475657 478229 480281 480756 479804 478813 478855 479435 479314 478199 476937 476243 475958 475363 473559 469686 463656
$$ packed form
53151I58319k1056k0398j8217j6641j6894j7152j5841j4433j4652j5123j3725
53140G74187j1587j1600j3835j5460j5019j3962j3765j3971j3735j3202j2625
53129F25426j1685j0470r793r839r624q456p056o522o849p101o543n219l800l117
53115E19352l513m423m912m592l827l246l383m503o108o936o168m438l017k194
53101D58092j394o38o71j441j646m80J066J464O28k25m10n19j284k509l453l741
53085D42839l438k622j452n33n13j228j720j347l77P21J851K719K450P21j139
53070D36932j262O09K914M151M099L262K236J829K652M139M746L684J870Q04J029
53055D73694J963K572K052M75r52r91M2N80j21j115j262o94k85n95j804l873o030
$$ plain form
53038 463656 456767 450962 447356 445808 445726 446602 447797 448418 447626 445017 441057 437377 435858 436669 437805 437419
53022 437419 435983 435060 434726 433793 432356 432227 434357 437253 438629 437680 435326 433135 432363 433073 433802 432964
53006 432964 430810 428977 427956 426417 423563 420619 418979 418139 416847 415498 415864 418631 422361 424983 425649
52991 425649 425192 425279 426952 429532 431125 430561 428556 426684 425710 425353 425144 424829 424244 423488 423135 423755 425200
52974 425200 426724 427801 428662 430003 432145 434340 435147 433972 432085 431428 432354 433245 432513 430242 427654 425748
52958 425748 424852 424834 425277 425927 427121 429167 431277 432067 431453 430920 431350 431604 430147 427307 425038 424998 427563
52941 427563 432008 436736 439878 440668 440150 439965 440826 442505 444501 445870 445188 441943 437782 435357 435922 438721
52925 438721 442428 446385 450448 454408 457805 460129 461407 462676 465229 468988 472258 473574 473101 471684
$$ packed form
53038D63656o889n805l606j548q2Q76J195O21p92k609l960l680j519Q11J136l86
53022D37419j436r23l34r33j437j29K130K896J376r49k354k191p72P10P29q38
53006D32964k154j833j021j539k854k944j640q40j292j349L66K767L730K622O66
52991D25649m57Q7J673K580J593n64k005j872r74l57k09l15n85p56l53O20J445
52974D25200J524J077Q61J341K142K195Q07j175j887o57R26Q91p32k271k588j906
52958D25748q96j8M43O50J194K046K110P90o14n33M30K54j457k840k269m0K565
52941D27563M445M728L142P90n18j85Q61J679J996J369o82l245m161k425N65K799
52925D38721L707L957M063L960L397K324J278J269K553L759L270J316m73j417
$$ plain form
52911 471684 469497 466600 464037 463090 463751 464927 465788 466069 465661 465013 465398 467396 469491 469573 467675 465858
52895 465858 465490 466085 466871 467848 468862 468995 467623 465155 462227 459088 456174 454350 454040 454854 456321 458152
52879 458152 459527 459338 457720 456353 456467 457359 457559 456643 455087 453113 450744 448630 447801 448613 450475 452444
52863 452444 453684 453708 452839 452218 452805 454464 456345 457850 458766 458747 457358 454758 451927 450088 449822 450571 450995
52846 450995 450194 448750 448059 448454 448564 446990 444145 441848 441434 442879 445467 448499 451300 453166 453677 453040
52830 453040 452095 451915 452992 454613 455458 455102 454432 454196 453835 452590 451246 451615 454301 458008 461254 463742
52814 463742 465716 466993 467409 467560 468246 469543 471119 473207 476405 480545 484424 486907 487832 487680 486771 485027
52798 485027 482368 479062 475601 472153 468213 463154 457275 451830 447636 444101 440312 436633 434290 433506
$$ packed form
52911D71684k187k897k563r47O61J176Q61K81m08o48L85J998K095Q2j898j817
52895D65858l68N95P86R77J014J33j372k468k928l139k914j824l10Q14J467J831
52879D58152J375j89j618j367J14Q92K00r16j556j974k369k114q29Q12J862J969
52863D52444J240K4q69o21N87J659J881J505R16j9j389k600k831j839k66P49M24
52846D50995q01j444o91L95J10j574k845k297m14J445K588L032K801J866N11o37
52830D53040r45j80J077J621Q45l56o70k36l61j245j344L69K686L707L246K488
52814D63742J974J277M16J51O86J297J576K088L198M140L879K483R25j52r09j744
52798D85027k659l306l461l448l940n059n879n445m194l535l789l679k343p84
$$ plain form
52784 433506 433197 432658 432336 432463 432159 430778 429187 428538 428432 427521 425470 423079 420742 418195 415711 414123
52768 414123 413363 412372 410879 409981 410235 410448 409454 408175 408669 411522 415251 418022 419061 418548 417085 415447
52752 415447 414340 414284 415803 419232 423823 427640 429190 428874 427999 426684 423900 419541 415135 411984 409615
52737 409615 406837 403674 401303 400296 399851 398939 397649 397035 397921 400142 402849 405176 406608 407056 406871 406617
52721 406617 406604 406740 406980 407618 408709 409581 409593 409223 409494 410243 409939 407743 404873 403252 403423 404443 405252 405421
52703 405421 405081 404951 406047 408441 410692 411367 410794 410348 410368 410041 409221 408878 409460 410173 410513 411306 413332 415893
52685 415893 417834 419380 421735 425136 428460 430855 432743 434819 436850 438157 438959 440483 443609 447753
52671 447753 451358 453316 453690 453235 452646 452472 453279 455282 457812 459628 459997 459340 458615 458311 458214 457946 457368
$$ packed form
52784D33506l09n39l22J27l04j381j591o49j06r11k051k391k337k547k484j588
52768D14123p60r91j493q98K54K13r94j279M94K853L729K771J039n13j463j638
52752D15447j107n6J519L429M591L817J550l16q75j315k784m359m406l151k369
52737D09615k778l163k371j007m45r12j290o14Q86K221K707K327J432M48j85k54
52721D06617j3J36K40O38J091Q72J2l70K71P49l04k196k870j621J71J020Q09J69
52703D05421l40j30J096K394K251O75n73m46K0l27q20l43N82P13L40P93K026K561
52685D15893J941J546K355L401L324K395J888K076K031J307Q02J524L126M144
52671D47753L605J958L74m55n89j74Q07K003K530J816L69o57p25l04r7k68n78
$$ plain form
52654 457368 456371 454601 451749 448119 444644 442156 440815 440362 440653 441568 442595 443067 442938 442880 443501 444771
52638 444771 446311 447760 448729 448876 448267 447282 445997 444176 442107 440815 441036 442424 444120 445466 445819 444507
52622 444507 441873 439709 439607 441084 442238 442034 441021 440119 439761 440216 441466 442479 441769 439391 437555 438451
52606 438451 441829 445344 447079 447222 447462 449206 452385 455662 457699 458322 458531 459550 462009 465811 470253
52591 470253 474186 476559 477310 477651 479052 481711 484129 484481 482522 479948 478660 478909 479441 479153 477988 476338
52575 476338 474449 472640 471368 470694 470385 470786 472782 476374 480192 483054 485157 486880 487374 485615 482234
52560 482234 478979 476524 474089 471103 468002 465338 463193 461717 461236 461583 462084 462430 462900 463581 464038 463866
52544 463866 463097 462151 461808 462758 464449 464940 463091 460477 459839 461873 464950 467795 470557 472976 473535 471504
$$ packed form
52654D57368r97j770k852l630l475k488j341m53K91R15J027M72j29n8O21J270
52638D44771J540J449R69J47o09r85j285j821k069j292K21J388J696J346L53j312
52622D44507k634k164j02J477J154k04j013r02l58M55J250J013p10k378j836Q96
52606D38451L378L515J735J43K40J744L179L277K037O23K09J019K459L802M442
52591D70253L933K373P51L41J401K659K418L52j959k574j288K49N32k88j165j650
52575D76338j889j809j272o74l09M01J996L592L818K862K103J723M94j759l381
52560D82234l255k455k435k986l101k664k145j476m81L47N01L46M70O81M57j72
52544D63866p69r46l43R50J691M91j849k614o38K034L077K845K762K419N59k031
$$ plain form
52528 471504 468416 466302 465470 465195 465746 468337 473288 479230 484242 487201 488099 487531 486111 484380 483028
52513 483028 482563 482455 481406 479321 478129 479301 481233 480974 478331 476096 475986 476699 476803 477224 479262 481952
52497 481952 483255 482748 481340 479265 476222 472946 470806 469912 469037 467459 465701 464480 463923 463874 464223 464906
52481 464906 466114 468202 470971 473509 475334 477006 478947 480493 481087 481549 482909 484615 485313 484987 484846
52466 484846 485303 485515 484895 483662 481823 479091 476219 475117 476939 480798 484773 487393 487895 486166 483286
52451 483286 481444 482337 485635 489490 492498 494855 497594 500954 503717 504371 502804 500482 498832 497912 496882
52436 496882 495097 492347 488711 484996 482763 482909 484428 485427 485201 484454 483667 482337 480100 477731 476547
52421 476547 477177 479091 480995 481719 481126 480197 479981 480591 481538 482604 483836 485038 486066 487470 490074 493905
$$ packed form
52528D71504l088k114q32k75N51K591M951N942N012K959Q98n68j420j731j352
52513D83028m65j08j049k085j192J172J932k59k643k235j10P13J04M21K038K690
52497D81952J303n07j408k075l043l276k140q94q75j578j758j221n57m9L49O83
52481D64906J208K088K769K538J825J672J941J546N94M62J360J706O98l26j41
52466D84846M57K12o20j233j839k732k872j102J822L859L975K620N02j729k880
52451D83286j842Q93L298L855L008K357K739L360K763O54j567k322j650r20j030
52436D96882j785k750l636l715k233J46J519R99k26p47p87j330k237k369j184
52421D76547O30J914J904P24n93r29k16O10R47J066J232J202J028J404K604L831
$$ plain form
52405 493905 498213 502561 507186 512227 517168 521145 523446 523815 522748 521371 520469 519760 518485 516409 513701
52390 513701 510348 506454 502761 499915 497535 495131 493641 494688 498120 501617 503160 502808 501584 499805
52376 499805 497446 495268 494355 494682 495020 494410 493220 492449 492314 492026 491226 491102 493169 496955 500118 501501
52360 501501 502819 506116 510591 513649 514456 514522 514924 515079 514650 514669 516005 518402 521887 527486 535353 543663
$$ packed form
52405D93905M308M348M625N041M941L977K301L69j067j377r02p09j275k076k708
52390E13701l353l894l693k846k380k404j490J047L432L497J543l52j224j779
52376D99805k359k178r13L27L38o10j190p71j35k88q00j24K067L786L163J383
52360E01501J318L297M475L058Q07O6M02J55m29J9J336K397L485N599P867Q310
$$ [...]
##END NTUPLES=NMR SPECTRUM
##END=
