
##TITLE=UV1127_M3-1004-1000_6274989_GzzZekQby0
##JCAMPDX= 6.0         $$ Bruker NMR JCAMP-DX V2.0
##DATA TYPE= NMR SPECTRUM
##DATA CLASS= NTUPLES
##ORIGIN= BRUKER
##OWNER= Administrator
$$ 1.72 TOPSPIN		Version 2.1
$$ 2012-06-03 02:06:03.281 -0500  Administrator@TOPSPIN
$$ Compression mode = diff/dup
##.OBSERVE FREQUENCY= 400.13188235
##.OBSERVE NUCLEUS= ^1H
##.ACQUISITION MODE= SIMULTANEOUS (DQD)
##.ACQUISITION SCHEME= undefined
##.AVERAGES= 8
##.DIGITISER RES= 22
##SPECTROMETER/DATA SYSTEM= spect
##.PULSE SEQUENCE= zg30
##.SOLVENT NAME= COFFEE_meoh
##.SHIFT REFERENCE= INTERNAL, COFFEE_meoh, 1, 14.98061
##AUDIT TRAIL= $$ (NUMBER, WHEN, WHO, WHERE, PROCESS, VERSION, WHAT)
$$ ##TITLE= Audit trail, TOPSPIN		Version 2.1
$$ ##JCAMPDX= 5.01
$$ ##ORIGIN= Bruker BioSpin GmbH
$$ ##OWNER= Administrator
$$ $$ C:\Bruker\TOPSPIN/data/COFFEE/nmr/UV1127_M3-1004-1000_6274989_GzzZekQby0/10/pdata/1/auditp.txt
$$ ##AUDIT TRAIL=  $$ (NUMBER, WHEN, WHO, WHERE, PROCESS, VERSION, WHAT)
(   1,<2012-06-03 02:05:55.296 -0500>,<Administrator>,<TOPSPIN>,<go>,<TOPSPIN 2.1>,
      <created by zg
	started at 2012-06-03 02:04:48.781 -0500,
	POWCHK enabled, PULCHK disabled,
       configuration hash MD5:
       D5 CA 7A 23 FE 6B EE E2 50 67 74 61 24 F7 5E 3B
       data hash MD5: 64K
       B9 72 2F C7 0E 71 93 44 B8 CD C6 27 6B 93 92 7B>)
(   2,<2012-06-03 02:05:58.890 -0500>,<Administrator>,<TOPSPIN>,<proc1d>,<TOPSPIN 2.1>,
      <Start of raw data processing
       efp LB = 0 FT_mod = 6 PKNL = 1 PHC0 = 0 PHC1 = 0 SI = 32K 
       data hash MD5: 32K
       0D 58 E9 11 78 43 86 19 BD 51 F8 26 38 8E 47 9E>)
(   3,<2012-06-03 02:05:59.359 -0500>,<Administrator>,<TOPSPIN>,<proc1d>,<TOPSPIN 2.1>,
      <pk PHC0 = 210.6299 PHC1 = 0 
       data hash MD5: 32K
       34 F0 3C DE B2 CB 09 9A 78 23 8E 56 47 E2 82 30>)
(   4,<2012-06-03 02:05:59.531 -0500>,<Administrator>,<TOPSPIN>,<proc1d>,<TOPSPIN 2.1>,
      <abs ABSG = 1 
       data hash MD5: 32K
       12 DF 83 89 D6 33 2C FA 44 41 70 5E 7F 49 3B DA>)
(   5,<2012-06-03 02:05:59.671 -0500>,<Administrator>,<TOPSPIN>,<proc1d>,<TOPSPIN 2.1>,
      <abs ABSG = 2 
       data hash MD5: 32K
       E3 88 D1 34 73 10 E5 A0 4D F8 A9 45 40 7F E8 77>)
(   6,<2012-06-03 02:05:59.718 -0500>,<Administrator>,<TOPSPIN>,<proc1d>,<TOPSPIN 2.1>,
      <abs ABSG = 3 
       data hash MD5: 32K
       D9 7D B8 B5 6C D8 42 9E CD 8E 2D F5 6C 16 77 DE>)
(   7,<2012-06-03 02:05:59.750 -0500>,<Administrator>,<TOPSPIN>,<proc1d>,<TOPSPIN 2.1>,
      <abs ABSG = 4 
       data hash MD5: 32K
       54 80 CB 58 82 56 CA 40 80 C4 6B 67 6A 26 2F 10>)
(   8,<2012-06-03 02:05:59.781 -0500>,<Administrator>,<TOPSPIN>,<proc1d>,<TOPSPIN 2.1>,
      <abs ABSG = 5 
       data hash MD5: 32K
       8A 03 D5 9C 89 6A C2 FA 4B FC 95 3F 85 EB AA 60>)
$$ ##END=
$$ 
$$ $$ hash MD5
$$ $$ 1B 22 E0 39 83 CA F3 E5 A8 8A B9 1F 8B 00 4D A5
##$RELAX= 
##$RELAX= 
##$RELAX= 
##$RELAX= 
##$RELAX= 
##$RELAX= 
##$RELAX= 
$$ Bruker specific parameters
$$ --------------------------
$$ [...]
##$TP= (0..7)
150 150 150 150 150 150 150 150
##$TP07= 0
##$TPNAME0= <>
##$TPNAME1= <>
##$TPNAME2= <>
##$TPNAME3= <>
##$TPNAME4= <>
##$TPNAME5= <>
##$TPNAME6= <>
##$TPNAME7= <>
##$TPOAL= (0..7)
0.5 0.5 0.5 0.5 0.5 0.5 0.5 0.5
##$TPOFFS= (0..7)
0 0 0 0 0 0 0 0
##$TUNHIN= 0
##$TUNHOUT= 0
##$TUNXOUT= 0
##$USERA1= <user>
##$USERA2= <user>
##$USERA3= <user>
##$USERA4= <user>
##$USERA5= <user>
##$V9= 5
##$VALIST= <valist>
##$VCLIST= <CCCCCCCCCCCCCCC>
##$VD= 0
##$VDLIST= <DDDDDDDDDDDDDDD>
##$VPLIST= <PPPPPPPPPPPPPPP>
##$VTLIST= <TTTTTTTTTTTTTTT>
##$WBST= 2048
##$WBSW= 25
##$XGAIN= (0..3)
0 0 0 0
##$XL= 0
##$YL= 0
##$YMAX_a= 533747
##$YMIN_a= -648854
##$ZGOPTNS= <>
##$ZL1= 120
##$ZL2= 120
##$ZL3= 120
##$ZL4= 120
##$ABSF1= 14.98061
##$ABSF2= -5.57192
##$ABSG= 5
##$ABSL= 3
##$ALPHA= 0
##$AQORDER= 0
##$ASSFAC= 0
##$ASSFACI= 0
##$ASSFACX= 0
##$ASSWID= 0
##$AUNMP= <proc_prof1d_extract_pilot.lims>
##$AXLEFT= 0
##$AXNAME= <>
##$AXNUC= <1H>
##$AXRIGHT= 0
##$AXTYPE= 0
##$AXUNIT= <>
##$AZFE= 0.1
##$AZFW= 0.1
##$BCFW= 0
##$BC_mod= 0
##$BYTORDP= 0
##$COROFFS= 0
##$CY= 15
##$DATMOD= 1
##$DC= 0
##$DFILT= <>
##$DTYPP= 0
##$F1P= 0
##$F2P= 0
##$FCOR= 0.5
##$FTSIZE= 32768
##$FT_mod= 6
##$GAMMA= 0
##$GB= 0
##$INTBC= 1
##$INTSCL= 1
##$ISEN= 128
##$LB= 0
##$LEV0= 0
##$LPBIN= 0
##$MAXI= 10000
##$MC2= 0
##$MEAN= 0
##$ME_mod= 0
##$MI= 0
##$NCOEF= 0
##$NC_proc= -8
##$NLEV= 6
##$NOISF1= 0
##$NOISF2= 0
##$NSP= 0
##$NTH_PI= 0
##$NZP= 0
##$OFFSET= 14.98061
##$PC= 1
##$PHC0= 210.6299
##$PHC1= 0
##$PH_mod= 1
##$PKNL= yes
##$PPARMOD= 0
##$PPDIAG= 0
##$PPIPTYP= 0
##$PPMPNUM= 2147483647
##$PPRESOL= 1
##$PSCAL= 4
##$PSIGN= 0
##$PYNMP= <proc.py>
##$REVERSE= no
##$SF= 400.13
##$SI= 32768
##$SIGF1= 0
##$SIGF2= 0
##$SINO= 400
##$SIOLD= 32768
##$SPECTYP= <>
##$SREGLST= <1H.CDCl3>
##$SSB= 0
##$STSI= 32768
##$STSR= 0
##$SW_p= 8223.68421052632
##$SYMM= 0
##$S_DEV= 0
##$TDeff= 65536
##$TDoff= 0
##$TI= <>
##$TILT= no
##$TM1= 0
##$TM2= 0
##$TOPLEV= 0
##$USERP1= <user>
##$USERP2= <user>
##$USERP3= <user>
##$USERP4= <user>
##$USERP5= <user>
##$WDW= 1
##$XDIM= 32768
##$YMAX_p= 463090572
##$YMIN_p= -748552
##$CURPLOT= <Network HP LaserJet P1505>
##$CURPRIN= <$Network HP LaserJet P1505>
##$DFORMAT= <normdp>
##$LAYOUT= <+/1D_H.xwp>
##$LFORMAT= <normlp>
##$PFORMAT= <normpl>
##$SURQMSG= 1
$$ End of Bruker specific parameters
$$ ---------------------------------
##NTUPLES= NMR SPECTRUM
##VAR_NAME=  FREQUENCY,     SPECTRUM/REAL,   SPECTRUM/IMAG
##SYMBOL=    X,             R,               I
##VAR_TYPE=  INDEPENDENT,   DEPENDENT,       DEPENDENT
##VAR_FORM=  AFFN,          ASDF,            ASDF
##VAR_DIM=   32768,         32768,           32768
##UNITS=     HZ,            ARBITRARY UNITS, ARBITRARY UNITS
##FACTOR=    0.250966925370066, 1,           1
##FIRST=     8223.43324360095, 29854,        -32016
##LAST=      0,             18611,           -63224
##MIN=       0,             -748552,         0
##MAX=       8223.43324360095, 463090572,    0
$$ Real data points
##PAGE= N=1
##DATA TABLE= (X++(R..R)), XYDATA
$$ [...]
19526b2839F0750a7607j12617A4519d5059q1141F6974J0441A0479b7436i712A69102
$$ -22839 60750 -17607 -130224 14519 -45059 -126200 66974 77415 10479 -27436 -9712 169102
19513a35581m53032A32816n592b29488P178B11321a96069h176l472k13776h6223
$$ -135581 -588613 132816 127224 -229488 -222310 211321 -196069 -8176 -11648 -225424 -86223
19501A85651b71451E3737a60649A72380c34972f8251E3900c23064I3910a60823
$$ 185651 -271451 53737 -160649 172380 -334972 -68251 53900 -323064 93910 -160823
19490A37065a95617L8147B37647A6696g1057m2898I8344C389b65920j30229d7275
$$ 137065 -195617 -157470 237647 16696 -71057 -113955 98344 3389 -265920 -396149 -47275
19478A82880q4049a86286M1738A48482R9107H296N494P4924c5691k14326A22699
$$ 182880 98831 -186286 -144548 148482 247589 8296 13790 88714 -35691 -250017 122699
19466C0778K7889L49935j40309j08453a65182P0833k05418q4553a68402O7112
$$ 30778 58667 408602 268293 159840 -165182 -94349 -299767 -384320 -168402 -101290
19456a01290r7880O3004j71061a37890d0712k28433A26210Q2036a16616l4663
$$ -101290 -199170 -136166 -307227 -137890 -40712 -269145 126210 208246 -116616 -151279
19446a51279c6512p7876k6599r0173Q8517j46768G7009a33237j67353i3191r9341
$$ -151279 -36512 -114388 -140987 -231160 -142643 -289411 77009 -133237 -300590 -93191 -192532
19435a92532B46761A15831g4986r85B80886a68377A31933A0640c41542J06090
$$ -192532 246761 115831 -74986 -75971 280886 -168377 131933 10640 -341542 -235452
19425b35452e6102H6726L6082f223q8323j03479K4480l9240R1196G1006c7852
$$ -235452 -56102 86726 122808 -6223 -94546 -198025 -173545 -212785 -121589 71006 -37852
19413g8857b6677A38787a93184d4833C10005A37247b71263M9606C56233A18985
$$ -78857 -26677 138787 -193184 -44833 310005 137247 -271263 -221657 356233 118985
19402e957j35536n0318A53022a86082N1821B1907K81088H0916i8676k57854Q1757
$$ -5957 -141493 -191811 153022 -186082 -134261 21907 302995 80916 -98676 -356530 -274773
19391b74773B31401A03429e4243n5821A78906h0831m8767N9594B53845B2778n781
$$ -274773 231401 103429 -54243 -110064 178906 -80831 -129598 -70004 253845 22778 16997
19380A6997K73286d98269a8663J170j05697D7239a86851J7887B09770a64814f0550
$$ 16997 290283 -498269 -18663 -17493 -123190 47239 -186851 -168964 209770 -164814 -60550
19368C70632A02058b62280A34920E0381K4325f5793k88053e3853C503L17892a63636
$$ 370632 102058 -262280 134920 50381 74706 -65793 -353846 -53853 3503 321395 -163636
19356A1772A177c4485q354A28414a4951A84440n9986B0452R275J24048a41856
$$ 11772 1177 -34485 -42839 128414 -14951 184440 124454 20452 29727 153775 -141856
19344i1035D7443k1527b86039j26551J07028l0275E6057b43030j37902a12j83879
$$ -91035 47443 25916 -286039 -412590 -305562 -335837 56057 -243030 -380932 -112 -183991
19333a83991M379A5775a01909m2632K285j0199A31849h6582G3051c1756R165l58767
$$ -183991 -179612 15775 -101909 -144541 -142256 -152455 131849 -86582 73051 -31756 -22591 -381358
19321c81358r3277h8300A47958a25065d2270k61255K54h7050p3093A28974n3032
$$ -381358 -474635 -88300 147958 -125065 -42270 -303525 -303271 -87050 -160143 128974 75942
19310G5942c12848h094j15226f290B56934a8033p4419b0232q3840A32793m4282
$$ 75942 -312848 -8094 -123320 -6290 256934 -18033 -92452 -20232 -104072 132793 88511
19299H8511a04454r3158B1282a49787E3738i3836D1053d33975A2489b63349c9647
$$ 88511 -104454 -197612 21282 -149787 53738 -93836 41053 -433975 12489 -263349 -39647
19287b76782C34623k2222i0261A08808a06127j39651J03473D921f40361A95030
$$ -276782 334623 312401 -90261 108808 -106127 -245778 -142305 4921 -640361 195030
19276c4519E9886g3225j63788g0269m2938B4677d08011A75468J55312A0178a39546
$$ -34519 59886 -73225 -237013 -70269 -113207 24677 -408011 175468 330780 10178 -139546
19264b50919I6426l4379a22805j3395k04600a10653j08099B2824a36164A96632
$$ -250919 96426 62047 -122805 -136200 -340800 -110653 -218752 22824 -136164 196632
19253I666b54579j99060a83055B50128b92616a08481l94552J14839H0996c388
$$ 9666 -254579 -453639 -183055 250128 -292616 -108481 -503033 -388194 80996 -3388
19242c4152C1369i2239M1517j42808J3025G8299J822i9325j62241a2089n9865
$$ -34152 31369 -92239 -50722 -193530 -180505 78299 80121 -99325 -261566 -12089 -71954
19231g1954A15935a35383j77660A05935c25459e6346j3517J9131A73108c28134
$$ -71954 115935 -135383 -313043 105935 -325459 -56346 -69863 -50732 173108 -328134
19220c25772D4697Q7933J6245h4700C7764a11415L347j59330G8141a37958A66362
$$ -325772 44697 132630 148875 -84700 37764 -111415 -108068 -267398 78141 -137958 166362
19208F3268c38418A26459E97N0616J44312D9499g3118A74072b37571g8928H04
$$ 63268 -338418 126459 597 51213 195525 49499 -73118 174072 -237571 -78928 804
19196h4119A47113B5211o442i9323k8638D07771A6726a54876A08046P3029a90755
$$ -84119 147113 25211 18769 -99323 -127961 407771 16726 -154876 108046 181075 -190755
19184a45292N6784c1785G4288a95036B1910f2867o5668B72930c02677a11259m6078
$$ -145292 -88508 -31785 74288 -195036 21910 -62867 -128535 272930 -302677 -111259 -157337
19173a57337A01603M5312c08122E4647b2846C35910A05616a10848j80767A27043
$$ -157337 101603 146915 -308122 54647 -22846 335910 105616 -110848 -291615 127043
19162g8935A58066B8715f3928G643K42597c1501m02588L7634i9767d583F3322
$$ -78935 158066 28715 -63928 7643 250240 -31501 -434089 -396455 -99767 -4583 63322
19150B63250J7887b3970k47371K999A64334d3333k3154A97506e5446k09039A06278
$$ 263250 281137 -23970 -271341 -268342 164334 -43333 -66487 197506 -55446 -264485 106278
19138d40513a94783A16959a41668A73961d00725A11935a01058A85033g101A34542
$$ -440513 -194783 116959 -141668 173961 -400725 111935 -101058 185033 -7101 134542
19127A92808o6380c12501a40311l4444D3314c4919n1202o62431b20014E0920f1959
$$ 192808 126428 -312501 -140311 -174755 43314 -34919 -86121 -748552 -220014 50920 -61959
19115a65316j54743J2443A46110b24034n1174M8157a13360m5910A83789p1280
$$ -165316 -320059 -307616 146110 -224034 -275208 -227051 -113360 -159270 183789 112509
19105A12509R8602G0319i7339L4833j63808C9616c32679i9034b5710m0501B56402
$$ 112509 211111 70319 -97339 -62506 -226314 39616 -332679 -99034 -25710 -66211 256402
19093a53040C44439A24276d9129D5633a95114M0148A55703d6197A53938A3700
$$ -153040 344439 124276 -49129 45633 -195114 -154966 155703 -46197 153938 13700
19082b2036i661I6228F419J2189L18885j26774j01786P6159a15391A53261p1726
$$ -22036 -9661 96228 6419 18608 337493 210719 108933 185092 -115391 153261 81535
19071H1535d7808j41454A4457g7354A39310a79733C2310d0094k9309A5886L26857
$$ 81535 -47808 -189262 14457 -77354 139310 -179733 32310 -40094 -69403 15886 342743
19060C42743A5315J00287a96631p0945D7793R9625h4756G8300k6671b39038B43390
$$ 342743 15315 115602 -196631 -267576 47793 147418 -84756 78300 51629 -239038 243390
19048C16450A36676g6950A12363C0444e8858C9349K01759B6905a11567f92p9999
$$ 316450 136676 -76950 112363 30444 -58858 39349 241108 26905 -111567 -692 -80691
19037h0691H8638a5409k09765P7423G4117C6565a48156O029H8393a29972k83932
$$ -80691 88638 -15409 -225174 -147751 74117 36565 -148156 -142127 88393 -129972 -413904
19026d13904R6615J0503A14026a26120j54609B86762d12622A5974M9395b60678
$$ -413904 -317289 -306786 114026 -126120 -280729 286762 -412622 15974 65369 -260678
19015E0763a12015A04809c9249j2679j08269C44461a89813g7404n6278e3480i654
$$ 50763 -112015 104809 -39249 -51928 -160197 344461 -189813 -77404 -133682 -53480 -9654
19003b60787P5941h8717A12981d48833Q4939h3177B14877o6934b16949A49052
$$ -260787 -184846 -88717 112981 -448833 -363894 -83177 214877 147943 -216949 149052
18992a7710k89453a49989A22597b6263C72798E8142K9329k6600b1755k50018d0021
$$ -17710 -307163 -149989 122597 -26263 372798 58142 87471 60871 -21755 -271773 -40021
18980E5344M9190a41783q8122Q5169f2485m20507f9541j89734M9923B8697A104
$$ 55344 104534 -141783 -229905 -144736 -62485 -482992 -69541 -259275 -209352 28697 1104
18968a99919R9578D4802a41980l8559p7683c751A07665P9301n4681o3523k1109
$$ -199919 -100341 44802 -141980 -180539 -258222 -3751 107665 186966 132285 68762 47653
18957D7653N0248g1129j21728A53771a63705d033k16263F4989c26679B45515p5761
$$ 47653 97901 -71129 -192857 153771 -163705 -4033 -220296 64989 -326679 245515 169754
18946A69754i81A29247a6594A18318f9887k9709j91800C16209h0082M165A7445
$$ 169754 -981 129247 -16594 118318 -69887 -99596 -291396 316209 -80082 -75917 17445
18934a1215k1792G530d86961h5083a4525j11727p0636L7293C63223d01465J29642
$$ -11215 -33007 7530 -486961 -85083 -14525 -126252 -196888 -159595 363223 -401465 -271823
18923b71823R2237A05876b30046A1374P2853J58290a33911E835b80065D0330b05216
$$ -271823 -179586 105876 -230046 11374 84227 242517 -133911 5835 -280065 40330 -205216
18911a53950L3379A27937c2827A13006J33276C1406b18433R6501A80577a99703
$$ -153950 -120571 127937 -32827 113006 246282 31406 -218433 -121932 180577 -199703
18900D9348k3357J76985a27104b4433k36992I930b01295j00367B20521D7361b06410
$$ 49348 25991 202976 -127104 -24433 -261425 9930 -201295 -301662 220521 47361 -206410
18888b09267o2111j55212g5490k2508j43813C05098f1860k27316B5231R7223e8611
$$ -209267 -271378 -426590 -75490 -97998 -241811 305098 -61860 -289176 25231 122454 -58611
18876B70849a47638A95030b87718J07544L8194Q337f4712H2243K15658D279a27691
$$ 270849 -147638 195030 -287718 -180174 -141980 -133643 -64712 82243 297901 4279 -127691
18864A04607J6916E2016J77079q647j06950J34433a99371q764J9878c9979j02149
$$ 104607 121523 52016 229095 220448 113498 247931 -199371 -208135 -188257 -39979 -142128
18853a42128B07082e286C53512a27864D8583J87424a54481I1396B6249b99819
$$ -142128 207082 -5286 353512 -127864 48583 236007 -154481 91396 26249 -299819
18842g7222I6851L11669A9084J7366a89915f5608G2272a24226g33E7569b50432
$$ -77222 96851 408520 19084 36450 -189915 -65608 72272 -124226 -733 57569 -250432
18830d269k33670E5313a16298A1966M10M0072f0139p1246B27503d7805k93523
$$ -4269 -237939 55313 -116298 11966 12376 52448 -60139 -131385 227503 -47805 -341328
18819c41328A73266A5317C466a84755h6882J8584j09338G1346a33563B25214c7924
$$ -341328 173266 15317 3466 -184755 -86882 -68298 -177636 71346 -133563 225214 -37924
18807b26453A25733f8017C03969E8040F777a1866I8292b7962B1497b4959k7448
$$ -226453 125733 -68017 303969 58040 6777 -11866 98292 -27962 21497 -24959 -52407
18796e2407A56100a81171F9029b91161f5942k1654k89437J66045j7492N6300C01760
$$ -52407 156100 -181171 69029 -291161 -65942 -87596 -377033 -210988 -228480 -172180 301760
18784d1080R380G7436a6116j82704B75862A01411a73797B2819i8448B58178C9399
$$ -41080 -31700 77436 -16116 -198820 275862 101411 -173797 22819 -98448 258178 39399
18772c0044j15393k5964K0322q5375C07735d7146F0890a98088c23j03017n2183
$$ -30044 -145437 -171401 -151079 -236454 307735 -47146 60890 -198088 -323 -103340 -155523
18761a55523O6871A75150b21621G7291J52045d1184q5600B5163M8142J2862b98024
$$ -155523 -88652 175150 -221621 77291 229336 -41184 -126784 25163 73305 86167 -298024
18749c34578J48858K3468j61625e5597J9704j52461F58a83715K4218A6074g8630
$$ -334578 -185720 -162252 -323877 -55597 -35893 -188354 658 -183715 -159497 16074 -78630
18737b37134B98480h9574J0407m7556c1352a0707B76675h1408j663c901m13807
$$ -237134 298480 -89574 -79167 -126723 -31352 -10707 276675 -81408 -83071 -3901 -417708
18726d17708J44853R1989E6782N8344K4020a62437e6330C3099N6309L7671d83893
$$ -417708 -272855 -180866 56782 115126 139146 -162437 -56330 33099 89408 127079 -483893
18714b89606E8011B5581a31667k8206r5519J23765i165E4334b04194Q4575A18069
$$ -289606 58011 25581 -131667 -159873 -255392 -131627 -9165 54334 -204194 -119619 118069
18702b05517j0463j5012C0972d0973j02428K7503P798B0295b30839c8368r856
$$ -205517 -215980 -230992 30972 -40973 -143401 -115898 -108100 20295 -230839 -38368 -48224
18691d8224A29243A2390f1486e83m76977A6101b92998B79331I1243P3532g0742
$$ -48224 129243 12390 -61486 -583 -477560 16101 -292998 279331 91243 164775 -70742
18679g3620m0021j91659b7524B03256b37301M858F1460J17375J8067R023b62786
$$ -73620 -113641 -305300 -27524 203256 -237301 -232443 61460 178835 196902 205925 -262786
18667a93938D8496c8308n5916M420C64019b64534J05201n860e7357B35421p1250
$$ -193938 48496 -38308 -94224 -89804 364019 -264534 -159333 -165193 -57357 235421 164171
18656A64171p1762L5524f8584H4953K23741d59755J52651A63782a99740Q4324
$$ 164171 92409 127933 -68584 84953 308694 -459755 -307104 163782 -199740 -115416
18646a15416a0672n0866B35101i2887j35142q4317i5687a4059B89614b72452i2413
$$ -115416 -10672 -61538 235101 -92887 -228029 -312346 -95687 -14059 289614 -272452 -92413
18634b50815B48634a85777n4447A91669a87723j03541f6109j40073R3324r8461
$$ -250815 248634 -185777 -240224 191669 -187723 -291264 -66109 -206182 -112858 -211319
18624b11319f5142A94397f0952A3403a38778m9022k0420D366Q2159a16510k20586
$$ -211319 -65142 194397 -60952 13403 -138778 -187800 -208220 4366 86525 -116510 -337096
18613c37096H1551a71025b146E5391J25005N4365C2672J0645c55967a361H3651
$$ -337096 81551 -171025 -2146 55391 180396 234761 32672 43317 -355967 -1361 83651
18601b67168C30211a24314A55339a1887H6070b12689H1218a18842B14757e5647
$$ -267168 330211 -124314 155339 -11887 86070 -212689 81218 -118842 214757 -55647
18590a01087C94110a49941j55717e4637j73830O8c3498m8641n0784N4456c7336
$$ -101087 394110 -149941 -305658 -54637 -228467 -228399 -33498 -82139 -132923 -78467 -37336
18578B1338c34438A82806g8684l2258A21446M0173a55333B61962c87693a48806
$$ 21338 -334438 182806 -78684 -110942 121446 161619 -155333 261962 -387693 -148806
18567e5053k82598N7613H8303B8957b00080l9270A01617a41843B7935K5903p378
$$ -55053 -337651 -280038 88303 28957 -200080 -239350 101617 -141843 27935 53838 46460
18556D6460L0725N9147e6449m4292k50231l322J53804B74825f07466I298a01391
$$ 46460 77185 136332 -56449 -100741 -350972 -354294 -200490 274825 -607466 9298 -101391
18544C59772b84817F0443c15215f5016K7267A0375b07893J8945M9039k32446a2374
$$ 359772 -284817 60443 -315215 -65016 -37749 10375 -207893 -188948 -139909 -372355 -12374
18532D66358b08782k2493B99607a15495B01220m0624g4601I3562h3012I8742B734
$$ 466358 -208782 -231275 299607 -115495 201220 160596 -74601 93562 -83012 98742 2734
18520B88313r28F9619a24401D5045a29232k49405i3406L778l7476E5647e8463
$$ 288313 287385 69619 -124401 45045 -129232 -378637 -93406 -89628 -127104 55647 -58463
18508b65958H2174d2792H1796Q1811L2133A726J75991h3590j10097F6605J37485
$$ -265958 82174 -42792 81796 163607 195740 1726 177717 -83590 -193687 66605 204090
18497B04090c15240J20857P7067K672j29082F131R4233b86225A59234k602p1365
$$ 204090 -315240 -194383 -117316 -114644 -243726 6131 100364 -286225 159234 156632 85267
18486H5267a20060j34102B28745R916A08456m6848a57145K8817D4422n035c44261
$$ 85267 -120060 -254162 228745 238661 108456 61608 -157145 -128328 44422 39387 -344261
18474c0786o4747C04743a87713r0615b5743j45966e0116C1219f9986q3881H7630
$$ -30786 -95533 304743 -187713 -278328 -25743 -171709 -50116 31219 -69986 -153867 87630
18462b3408j1347k07645d3799a9190n1737j2881B90169g5387m1280B32200I925
$$ -23408 -34755 -242400 -43799 -19190 -70927 -83808 290169 -75387 -116667 232200 9925
18450a12747C0884J72605a91376j78230D9158b14884J02845r3948O2247K8310
$$ -112747 30884 203489 -191376 -369606 49158 -214884 -112039 -205987 -143740 -115430
18440a15430o7419B3696K89892a1400A50484b16854h6758A41092K38782A61368
$$ -115430 -182849 23696 313588 -11400 150484 -216854 -86758 141092 379874 161368
18429g8101k16370n5992P210e670m70695a043E3682b99074a9177N046o3263j8864
$$ -78101 -294471 -350463 -343253 -5670 -476365 -1043 53682 -299074 -19177 -14131 -77394 -96258
18417i6258M7450G9284c41807j15884A3401a72217C9586J19612a23915F9940a35592
$$ -96258 -48808 79284 -341807 -457691 13401 -172217 39586 159198 -123915 69940 -135592
18405a28461b3316r106j0869k6555A32543i0626C14530b05669B9697a89564B40859
$$ -128461 -23316 -32422 -43291 -69846 132543 -90626 314530 -205669 29697 -189564 240859
18393g2612L1221C33971b6739A60916A1537J43546b81240A05130c15668h5633
$$ -72612 -41391 333971 -26739 160916 11537 155083 -281240 105130 -315668 -85633
18382g4366F4561N7428E5858h8855A43282c6850J2348B4846J94252Q5442B7611
$$ -74366 64561 121989 55858 -88855 143282 -36850 -24502 24846 219098 304540 27611
18370A886a3056j06388I1366b01059C62097G411a45564H657i9097A53746n1987
$$ 1886 -13056 -119444 91366 -201059 362097 7411 -145564 8657 -99097 153746 101759
18359A01759e1484k5055D5136b9782n7248j84448A6699a41245j3857F0016b50882
$$ 101759 -51484 -76539 45136 -29782 -87030 -271478 16699 -141245 -155102 60016 -250882
18347e8570j21263B44915a11793C9580j461i9430L2543A416J42700b37664n0428
$$ -58570 -179833 244915 -111793 39580 38119 -99430 -66887 1416 144116 -237664 -288092
18336b88092A5299a11891j22919P533A43609g9897B48287e6662j76373Q2869I2817
$$ -288092 15299 -111891 -234810 -227277 143609 -79897 248287 -56662 -233035 -150166 92817
18324c3327l4667n9533A56742a70450A06676i1005r1680J7032c3121C00802A27834
$$ -33327 -67994 -127527 156742 -170450 106676 -91005 -182685 -165653 -33121 300802 127834
18312b63053F3430L7410a44048m1837g9456p5879c5497B4970J42645F5226a80078
$$ -263053 63430 100840 -144048 -185885 -79456 -155335 -35497 24970 167615 65226 -180078
18300b15203B66660p8241b58989N4168H5408a8067k54864A2342b57864o5675D7702
$$ -215203 266660 188419 -258989 -204821 85408 -18067 -272931 12342 -257864 -323539 47702
18288H4588k8021a45968m4972j39671I0928Q4978C9678b38106P5404a6153C294
$$ 84588 56567 -145968 -190940 -330611 90928 175906 39678 -238106 -162702 -16153 3294
18276F3814J14281C5037a55237M5110A60343E1001J49094a4045j32332b0565k71038
$$ 63814 178095 35037 -155237 -110127 160343 51001 200095 -14045 -146377 -20565 -291603
18265b91603B78799a64187J7145L2545A15348M2962L2829a15872A19537b11863
$$ -291603 278799 -164187 -147042 -114497 115348 158310 191139 -115872 119537 -211863
18254b21019n6992a1539A9662o855K426a68697P9326R769j91367K4494J18877
$$ -221019 -278011 -11539 19662 12807 15233 -168697 -89371 -79602 -270969 -246475 -127598
18243a27598A26312a84605C66684A49243L4701E3159d5045j22923P9697k16716
$$ -127598 126312 -184605 366684 149243 183944 53159 -45045 -167968 -88271 -304987
18233c04987d7103k1047k55963B19961M1072c43115B39191a10854j28424C1585
$$ -304987 -47103 -68150 -324113 219961 261033 -343115 239191 -110854 -239278 31585
18222A18997A4058b34992A44116d9044B26485l9550d2354C12607D9820Q1610b78887
$$ 118997 14058 -234992 144116 -49044 226485 186935 -42354 312607 49820 131430 -278887
18210I8574K79268b80229B44074j18606m826D4210a00143K0149p5690A28623D6922
$$ 98574 377842 -280229 244074 125468 120642 44210 -100143 -79994 -155684 128623 46922
18198i6388a5688m67933b992j65800L0994m9157o1708d5801j51518A16824a3939
$$ -96388 -15688 -483621 -2992 -168792 -137798 -186955 -248663 -45801 -197319 116824 -13939
18186f4183I046a1223A92872a04068m6060B4537b18745c8953k7030a0600H3984
$$ -64183 9046 -11223 192872 -104068 -150128 24537 -218745 -38953 -65983 -10600 83984
18174a13973M229M7295m5649D0893b35290a06359j052d9241J0786j85117A26999
$$ -113973 -109744 -62449 -108098 40893 -235290 -106359 -107411 -49241 -38455 -223572 126999
18162D5290R6787b7083m3364r2221A80311c47142B20612a59124m7246A02352h3628
$$ 45290 142077 -27083 -70447 -162668 180311 -347142 220612 -159124 -206370 102352 -83628
18150g8006b7420k13026M90j08647h7679j24151N3406h966k01802A9312Q7385
$$ -78006 -27420 -240446 -239956 -348603 -87679 -211830 -158424 -8966 -210768 19312 106697
18139A06697a8004n9517r3592i105A05580J04193H2504A6351L9716A0184a7375
$$ 106697 -18004 -77521 -171113 -9105 105580 209773 82504 16351 56067 10184 -17375
18127E0549i9257d1883I3692i511B01415n1064m9284f5321B44630c72010g2591
$$ 50549 -99257 -41883 93692 -9511 201415 150351 101067 -65321 244630 -372010 -72591
18115a43218G8621b34085A48446J9815Q6233c10894A31027d9742A6827a8948E6824
$$ -143218 78621 -234085 148446 168261 254494 -310894 131027 -49742 16827 -18948 56824
18103D9879g5808j57318A01352b04483K7869E6517e6584F082N9096a61244H5456
$$ 49879 -75808 -233126 101352 -204483 -176614 56517 -56584 6082 65178 -161244 85456
18091A28877e8048n3603A6337P999R400b4045B12994K8624J00619e5696I5344
$$ 128877 -58048 -111651 16337 24336 33736 -24045 212994 241618 342237 -55696 95344
18079C238d8828B20402m4522K21869n1075A23846f2231A65896G0824O379g1670
$$ 3238 -48828 220402 175880 397749 346674 123846 -62231 165896 70824 77203 -71670
18067I3161O2058M7108K10714a196D5192a44897A27956b06900B4661O1978a39199
$$ 93161 155219 202327 413041 -1196 45192 -144897 127956 -206900 24661 86639 -139199
18055c0203D04885E821J77488C4912J99206b27472E1767b64930A86381i4483N565
$$ -30203 404885 5821 183309 34912 234118 -227472 51767 -264930 186381 -94483 -88918
18044h8918A7470c52182A60673L158h0454k76105N7701J03970D09326j02138A10710
$$ -88918 17470 -352182 160673 163831 -80454 -356559 -298858 -194888 409326 307188 110710
18032c07422a18763q8978A50965c49999g0039m2425D0372O6111i2721D1225B709
$$ -307422 -118763 -207741 150965 -349999 -70039 -112464 40372 106483 -92721 41225 2709
18020I3877a12874A94291F4877d03467A12861a08344A27583O6266a33614p4974
$$ 93877 -112874 194291 64877 -403467 112861 -108344 127583 193849 -133614 -208588
18010b08588N0508G9205A9558f5575l01752R3786A12085d27885i7893K6620B04037
$$ -208588 -158080 79205 19558 -65575 -367327 -273541 112085 -427885 -97893 -71273 204037
17998F6039f2440m6093j29803B21564b80493a36231A609J45701R9437G0734J11620
$$ 66039 -62440 -108533 -238336 221564 -280493 -136231 1609 147310 246747 70734 182354
17987A82354i4426E1083K57999c08002J53492j50990i3627r5050C61004a61737
$$ 182354 -94426 51083 309082 -308002 -154510 -305500 -93627 -188677 361004 -161737
17976A36035F2464c18782B38427E3715J33827c82929a362l13731d4872J8661o2896
$$ 136035 62464 -318782 238427 53715 187542 -382929 -1362 -315093 -44872 -26211 -89107
17965h9107A61462a04555A29513c33881A45128F1084c11681B66420o4066f261
$$ -89107 161462 -104555 129513 -333881 145128 61084 -311681 266420 202354 -6261
17954b10924L6942j90646D30570r0062L9287j85816G6626L5235l9097a95897Q4752
$$ -210924 -173982 -364628 430570 340508 379795 193979 76626 111861 72764 -195897 -111145
17943a11145a2558k90303i8677D4668a15949p582B537J35853a56211A41634a33163
$$ -111145 -12558 -302861 -98677 44668 -115949 -123531 2537 138390 -156211 141634 -133163
17931d9707A10926m6604b93960f3392k9285A26990B853a61827O4451b4006k1906
$$ -49707 110926 64322 -293960 -63392 -92677 126990 2853 -161827 -97376 -24006 -45912
17920d5912j27021g3323o6291B59064a39978B7865O9837b3479A28140d3461A42301
$$ -45912 -172933 -73323 -139614 259064 -139978 27865 97702 -23479 128140 -43461 142301
17908A0212c9757n7538q9594f3581A49341K61428A57789a26126j16867j0707O8944
$$ 10212 -39757 -97295 -186889 -63581 149341 410769 157789 -126126 -242993 -253700 -184756
17897a84756B40310A14699a14855d0381j54952q2808H7808a3928f686l6973n0556
$$ -184756 240310 114699 -114855 -40381 -195333 -278141 87808 -13928 -6686 -43659 -94215
17886i4215F9069J04224J1420a84864d1160F0807l088b0970k3042A90106b2318
$$ -94215 69069 173293 184713 -184864 -41160 60807 57719 -20970 -44012 190106 -22318
17874H4373h0960k0382G3788b19572e5086K361D2401M2377J46436o5661b17647
$$ 84373 -80960 -101342 73788 -219572 -55086 -52725 42401 84778 231214 165553 -217647
17862a38249B60655G9430J5352f9580C0666F294a53815c6622H5034N0275K2267
$$ -138249 260655 79430 94782 -69580 30666 6294 -153815 -36622 85034 135309 157576
17851A57576b05195A45500c6098D408J41863a25783e2125B04596J00071a70028
$$ 157576 -205195 145500 -36098 4408 146271 -125783 -52125 204596 304667 -170028
17840b22157C43304f9997m2300k384a9291k95193Q4613A74461J8538a31826D0294
$$ -222157 343304 -69997 -112297 -114681 -19291 -314484 -229871 174461 192999 -131826 40294
17828b34319d1729p8011k27180A1794J11471b62952G6673a56301K4817L2583q162
$$ -234319 -41729 -119740 -346920 11794 123265 -262952 76673 -156301 -131484 -98901 -107063
17817a07063j11968L071P0139l954A40735P1768a73843A22896b62726B74Q6491
$$ -107063 -219031 -215960 -145821 -149775 140735 212503 -173843 122896 -262726 274 86765
17806H6765h8065K0884C7421O6366L1671j3337c49622f6604D9814a54349A16084
$$ 86765 -88065 -67181 37421 103787 135458 122121 -349622 -66604 49814 -154349 116084
17794B2875J7366j0105a58546J8909j73669h7298E4809B1331O6926b05106g6889
$$ 22875 40241 30136 -158546 -139637 -313306 -87298 54809 21331 88257 -205106 -76889
17782a60273d2276B7313P2293b25336a7243p7902M0144H9270p007a05122k9796
$$ -160273 -42276 27313 99606 -225336 -17243 -95145 -55001 89270 82263 -105122 -134918
17771a34918B498a77949L6618A09093N9851F3190M2928h2134C05656d5917I6428
$$ -134918 2498 -177949 -141331 109093 168944 63190 106118 -82134 305656 -45917 96428
17759a95004G8197K62123b30982B16945O3969j33408b62267B30369K8569A2073
$$ -195004 78197 340320 -230982 216945 280914 147506 -262267 230369 258938 12073
17748A92324a80461k4900A68077a85800B53774C4008f5109j06284d3550G6349
$$ 192324 -180461 -205361 168077 -185800 253774 34008 -65109 -171393 -43550 76349
17737g5749O582B08270B6551O4191A9618P1170a77832E818g8806a6401r6728J6737
$$ -75749 -69167 208270 26551 90742 19618 90788 -177832 5818 -78806 -16401 -113129 -96392
17725i6392A9783c00737R6652B6786f8072l6204A25882e5186o9204E6740c3298
$$ -96392 19783 -300737 -204085 26786 -68072 -104276 125882 -55186 -124390 56740 -33298
17713D3912a7945m3569k12965J13083b8434H9754j6293k0562M10997a86997d1716
$$ 43912 -17945 -61514 -274479 -161396 -28434 89754 73461 52899 463896 -186997 -41716
17701B2449J67452b04506P2726M7662A3577b33131G4664L5207e5252A07235a34047
$$ 22449 189901 -204506 -131780 -84118 13577 -233131 74664 109871 -55252 107235 -134047
17689I5447J09590q7957J46352b66407A61638K3135a9014j41775A04524a80431
$$ 95447 205037 117080 263432 -266407 161638 184773 -19014 -160789 104524 -180431
17678A14909k7216c66634h3942A22268E8246N8007d4912j8395H0712J84006a77110
$$ 114909 87693 -366634 -83942 122268 58246 116253 -44912 -63307 80712 264718 -177110
17666e199j05682B34932P6408A08712i6460A22156a88848H2496a02131A76573
$$ -5199 -110881 234932 311340 108712 -96460 122156 -188848 82496 -102131 176573
17655C7084c2350C9631j5613K43011A25602g0502l57323B15808C0054a79742A33766
$$ 37084 -32350 39631 24018 267029 125602 -70502 -427825 215808 30054 -179742 133766
17643b65687C59598k0786a2796A63267j7925K15822b0752k28003b9647A0470a66808
$$ -265687 359598 338812 -12796 163267 145342 361164 -20752 -248755 -29647 10470 -166808
17631H6819B5154e4197k0724r9101B85756r0927q6887L57757B13930j5527q1435
$$ 86819 25154 -54197 -74921 -174022 285756 194829 107942 465699 213930 198403 116968
17620A16968b20704J09761B06006e4568A25061c47858A47477J03046b19299A57214
$$ 116968 -220704 -110943 206006 -54568 125061 -347858 147477 250523 -219299 157214
17609A45547B01a61363I4640M01009B6440i0289J3085A21184a0762A31928d5165
$$ 145547 201 -161363 94640 495649 26440 -90289 -77204 121184 -10762 131928 -45165
17597B00654D3406b09195H7868M0729j550Q574O0557c9690J3609B83446d1133
$$ 200654 43406 -209195 87868 128597 127047 135621 196178 -39690 -26081 283446 -41133
17585a72825B24048Q932g4092k22135A26916a51629B36872c4116B47830j17234
$$ -172825 224048 232980 -74092 -296227 126916 -151629 236872 -34116 247830 130596
17575A30596N0673a19776j94358C61555A6474Q5600b43890b5777A52983B9805
$$ 130596 181269 -119776 -314134 361555 16474 102074 -243890 -25777 152983 29805
17564g1899R052A0952J73875a91754B3441a38660E0250I504a16688B20853q9558
$$ -71899 -62847 10952 184827 -191754 23441 -138660 50250 9504 -116688 220853 131295
17553A31295B5391a08823N3905A80867A7788K5993M8496f3521E1235J22516h5869
$$ 131295 25391 -108823 -54918 180867 17788 43781 92277 -63521 51235 173751 -85869
17541a7736B29797J52332a50900a7734k05387o026D64395A14902f7970k21518
$$ -17736 229797 382129 -150900 -17734 -223121 -229147 464395 114902 -67970 -289488
17531b89488f6941k2714B39127F3851k4884j3335N5404R5085G4466b850k8637
$$ -289488 -66941 -89655 239127 63851 38967 25632 81036 176121 74466 -2850 -31487
17520c1487A79857H3982J07633C0891b31147N6144A95851a69365C49481c2306
$$ -31487 179857 83982 191615 30891 -231147 -175003 195851 -169365 349481 -32306
17509E68016c01604H8627P0900C2860J6014M6556M13292A78045J58738j29334
$$ 568016 -301604 88627 159527 32860 48874 95430 508722 178045 336783 207449
17499B07449A00499c23775E15583B2540J19849a49106A26448K9671A0376K02821
$$ 207449 100499 -323775 515583 22540 142389 -149106 126448 156119 10376 213197
17489B13197J20675G3941N783d5686A98559G4475c41186i1297A52700G2265O0255
$$ 213197 333872 73941 79724 -45686 198559 74475 -341186 -91297 152700 72265 132520
17478A32520g8604k3747A39729J7148r167J69173a05193F1161e2514D19831l8824
$$ 132520 -78604 -102351 139729 156877 147710 316883 -105193 61161 -52514 419831 381007
17467C81007G0561B8143j1108J20414L76491B10319k972l4144K33328j34266e9476
$$ 381007 70561 28143 17035 137449 513940 210319 207347 173203 406531 272265 -59476
17455B60711r2953K14056e1183E37211a48478M2482C33965b0176B61753c5565
$$ 260711 167758 381814 -51183 537211 -148478 -105996 333965 -20176 261753 -35565
17444C48704B0006K55485A36203J98722o3837q5100O8214Q6470J24589H2935M23059
$$ 348704 20006 275491 136203 334925 271088 185988 254202 340672 465261 82935 505994
17433E05994j43288j59334J11991A33903o5984M8180c4502C59955K02996A8083
$$ 505994 362706 203372 315363 133903 67919 116099 -34502 359955 562951 18083
17422A19849J1660r052J30605q0849L65281B36304N4463K77542k70893O2015p1385
$$ 119849 131509 122457 253062 172213 537494 236304 290767 568309 297416 359431 288046
17411B88046D9086K95691D1472K2330M5312a53696D01279k2659o1511j08345K13701
$$ 288046 49086 344777 41472 63802 109114 -153696 401279 378620 317109 208764 422465
17400D22465j35884o9124l2243D7698O07264b07322A75186J43716P1783h8495
$$ 422465 286581 217457 185214 47698 654962 -207322 175186 318902 390685 -88495
17389A48227E3403E925N8001j8030a5412C25313a04797C14687A44578k9322n0146
$$ 148227 53403 5925 63926 45896 -15412 325313 -104797 314687 144578 115256 65110
17378F5110N18978G3504L36238k03397a06386D87088E1465J69600N5738G2352
$$ 65110 584088 73504 409742 206345 -106386 487088 51465 221065 276803 72352
17367I8272N2826L2043l8339E9289g015r2180E35318k02930K9903a51754C89309
$$ 98272 151098 183141 144802 59289 -7015 -99195 535318 332388 362291 -151754 389309
17355c9859C85181A13002J56765A26319F2824K18859q3720o9893m7126b1866F1259
$$ -39859 385181 113002 269767 126319 62824 281683 197963 128070 80944 -21866 61259
17343G1841J13820m551J03331A30382P7696p6372J61918J81967A33246b529F5490
$$ 71841 185661 181110 284441 130382 208078 131706 293624 475591 133246 -2529 65490
17331F8307J75321L2511o9097d2731A26757L4793k9888J75638C9016a14518C36730
$$ 68307 243628 276139 207042 -42731 126757 161550 131662 307300 39016 -114518 336730
17319c33748A60210o4410N9939P2967a0789A50450P7831l3876J22497o0846a25431
$$ -333748 160210 95800 155739 228706 -10789 150450 228281 194405 316902 256056 -125431
17307B11440L43196k16338A05839K21095F9871P04P6194c6384B79560A06687K90542
$$ 211440 554636 338298 105839 326934 69871 70575 146769 -36384 279560 106687 397229
17296C97229l9075g2414K3632r7818A27147P829O1882J21590C5178b57344A61566
$$ 397229 358154 -72414 -48782 -146600 127147 134976 196858 318448 35178 -257344 161566
17284g1900A2905L27589n1519k9424R4764F910L65091B5074J03707k9113J34809
$$ -71900 12905 340494 288975 259551 354315 6910 372001 25074 128781 99668 234477
17273B34477L8876k7490R8263l9275a6813B05962L88247A11667P7309J4486O4560
$$ 234477 273353 245863 344126 304851 -16813 205962 594209 111667 188976 203462 268022
17262B68022k9078J09197A21622M2013K69129C0802K2425M25602B12040m655j03118
$$ 268022 238944 348141 121622 163635 432764 30802 53227 478829 212040 207385 104267
17251A04267O3726b45402c2016B13068G7741O4066j5648J80282d9110j4902a5811
$$ 104267 167993 -245402 -32016 213068 77741 141807 126159 306441 -49110 -64012 -15811
17239D10069C0368J24134O772h8568B41332k3553J39944B2993R6654M59231p7114
$$ 410069 30368 154502 161274 -88568 241332 217779 357723 22993 119647 578878 501764
17228E01764a2593H590J51096J22020H0903M62095B58728k3730J00422A23162
$$ 501764 -12593 8590 159686 281706 80903 542998 258728 234998 335420 123162
17217I6181K79185k3890J53398R3439A93427a23432C81807A58239N7329J14265
$$ 96181 375366 351476 504874 598313 193427 -123432 381807 158239 215568 329833
17207C29833A20334K24245d4887B15247g5568H5603J41400J88227b07477B16736
$$ 329833 120334 344579 -44887 215247 -75568 85603 227003 415230 -207477 216736
17196C15466H5492J32098P563Q3919A23276d3618B85085j6427A17081K62994Q7138
$$ 315466 85492 217590 225153 309072 123276 -43618 285085 268658 117081 380075 467213
17185D67213a91651A47656J92758j46165R6778F7057O1285M88710q1713e7615
$$ 467213 -191651 147656 340414 194249 291027 67057 128342 617052 535339 -57615
17174f1060B06308J04795L9764A19584A7586M23282n2232o8525L4622j2260A01076
$$ -61060 206308 311103 350867 119584 17586 440868 388636 320111 354733 342473 101076
17162D47494A1408K51087J10267k9908j42245J90103I0916K76546k2319n9768
$$ 447494 11408 262495 372762 342854 200609 390712 90916 367462 345143 285375
17152B85375H0382M36221B5733J93813J91352A43525K32724N2951J31933n8940
$$ 285375 80382 516603 25733 219546 410898 143525 376249 429200 561133 502193
17142E02193n3714l8809O1368j52763J84864J6089j14808j74973K45477j9222
$$ 502193 448479 409670 471038 318275 503139 519228 404420 229447 474924 455702
17132D55702A69834J28027L15821k4588j74326Q0676j79632R7699j09362P6310
$$ 455702 169834 297861 613682 589094 414768 495444 315812 413511 304149 380459
17122C80459J66872l9755A97350N3154p8023J11027J64521A72195J63769J35183
$$ 380459 547331 507576 197350 250504 172481 283508 448029 172195 335964 471147
17112D71147K3699o9184Q6716B23153K24610A95927J66065R5249A05332K42328
$$ 471147 494846 425662 512378 223153 447763 195927 361992 457241 105332 347660
17102C47660J26270K42037j07039p9544Q8438j17677A67365E3360N88808j68623
$$ 347660 473930 715967 608928 529384 617822 500145 167365 53360 642168 473545
17092D73545k24854M5321J77515j41030J33101j13728K47965j03276j44044q6567
$$ 473545 248691 294012 471527 330497 463598 349870 597835 494559 350515 263948
17082B63948M76261l30188q8964K14537j50668J68395k02480K47160k81765J17456
$$ 263948 740209 410021 321057 535594 384926 553321 350841 598001 316236 433692
17072D33692j59347A11156M46808B46823L01605j15127n323K67350k02928K7409
$$ 433692 274345 111156 557964 246823 548428 433301 427978 695328 492400 519809
17062E19809Q1148A07626K79114K5293J99038k51050J73361O8868k25134L54234
$$ 519809 600957 107626 386740 412033 611071 360021 533382 602250 377116 731350
17052G31350j78335o6244K96696l82584K20829j94875J89243j61697N1586K69475
$$ 731350 553015 486771 783467 400883 621712 426837 616080 454383 505969 775444
17042G75444k50023n2202K83258A12857L93266j50265J10798N1552J12200j5977
$$ 775444 525421 473219 756477 112857 506123 355858 466656 518208 630408 614431
17032F14431j04726K33735K31626l80241j23272K36770k30052K48855j54650j79526
$$ 614431 509705 743440 975066 594825 471553 708323 478271 727126 572476 392950
17022C92950J51046J95259o551J30875l98775K41989J33234j85359L76861m60210
$$ 392950 543996 739255 732704 863579 464804 706793 840027 654668 1031529 571319
17012E71319J33402J88478l03270L445M04011l46891K0378R1310j99906j15492
$$ 571319 704721 893199 589929 593374 997385 650494 670872 762182 562276 446784
17002D46784K66551O8740k3724J4293J50060j71681L24267m68235L87243j73710
$$ 446784 713335 782075 758351 772644 922704 751023 1075290 607055 994298 820588
16992H20588J50765j59418K93010E34765L08608l8854k31173L45188j02657j06516
$$ 820588 971353 811935 1104945 534765 843373 804519 573346 918534 815877 709361
16982G09361k19979J87599K29913j94734K7757J80179k23486L88075k09407K35740
$$ 709361 489382 676981 906894 712160 739917 920096 696610 1084685 875278 1111018
16972A111018k30303K33482q7673j44561l21636L10637M6904L3398j896J36279
$$ 1111018 880715 1114197 1026524 881963 560327 870964 917868 951266 949370 1085649
16962A085649j11049J81135k23881j47994K49497j71713K64644j47034P5499r8782
$$ 1085649 974600 1155735 931854 783860 1033357 861644 1126288 979254 1054753 955971
16952I55971K0251R8883L5075k61230K85732m08465N61184o1192j97982K85859
$$ 955971 976222 1075105 1110180 848950 1134682 726217 1287401 1226209 1028227 1314086
16942A314086l42735M27213N7280l57435M64921l03115J24937j84170J857p2806
$$ 1314086 971351 1398564 1455844 1098409 1563330 1260215 1385152 1200982 1202839 1130033
16932A130033j81036L01525K09190k19509J30206J38134l26933M02360k39524
$$ 1130033 948997 1250522 1459712 1240203 1370409 1508543 1181610 1583970 1344446
16923A344446J35997K4487p2121J84934k4381j46605m04243O02548k11976q3793
$$ 1344446 1480443 1504930 1432809 1617743 1593362 1446757 1042514 1645062 1433086 1349293
16913A349293L46051Q6319j44074j8564l02765J29729M01247j83229p6351j22323
$$ 1349293 1695344 1781663 1637589 1619025 1316260 1445989 1847236 1664007 1587656 1465333
16903A465333K41766n5377r3701J68041l5242L5126N3870M361r1864J45290l1764
$$ 1465333 1707099 1651722 1558021 1726062 1690820 1725946 1779816 1784177 1692313 1837603 1805839
16892A805839J50371K73310n58308J80539j26921J27650L27025o0260k20129O5813
$$ 1805839 1956210 2229520 1671212 1851751 1724830 1852480 2179505 2119245 1899116 1964929
16882A964929K30202Q2983j55827K35908n244j21491R5732J56563J88937l40074
$$ 1964929 2195131 2278114 2122287 2358195 2352951 2231460 2327192 2483755 2672692 2332618
16872B332618J7300K82173m06524L91569l91698L86792j27277j33719K14292K18738
$$ 2332618 2349918 2632091 2225567 2617136 2225438 2612230 2484953 2351234 2565526 2784264
16862B784264r7551Q426K06059o2683J03556j82650K12662M6678n36M3213m8772
$$ 2784264 2686713 2695139 2901198 2838515 2942071 2759421 2972083 3018761 3018225 3061438 3012666
16851C012666K72865L3084j74010j02286M74415j51637j85980K75824N3110P5361
$$ 3012666 3285531 3318615 3144605 3042319 3516734 3365097 3179117 3454941 3508051 3583412
16841C583412J31721R168j15902k3143J99392j86832L97033o7722L03491j37685
$$ 3583412 3715133 3724301 3608399 3585256 3784648 3597816 3994849 3927127 4230618 4092933
16831D092933j58029N73861k90954K74772j35625J46152J39138k62273K57813
$$ 4092933 3934904 4508765 4217811 4492583 4356958 4503110 4642248 4379975 4637788
16822D637788K2894L68232n93418R74057k27676m8604p8428N89443J89668l47020
$$ 4637788 4660682 5028914 4435496 5409553 5181877 5133273 5054845 5644288 5833956 5486936
16812E486936Q1576k82360N93222p6133M00846K68635J19571j86527J43976J70344
$$ 5486936 5568512 5286152 5879374 5803241 6204087 6472722 6592293 6405766 6549742 6720086
16802F720086O2647Q0582K51656K19594K37394L37483K93315q9157k0637L03922
$$ 6720086 6782733 6863315 7114971 7334565 7571959 7909442 8202757 8113600 8092963 8396885
16792H396885M32049j86389J03276M14576K65919k15701N85496M19088k83387
$$ 8396885 8828934 8642545 8745821 9160397 9426316 9210615 9796111 10215199 9931812
16783I931812P42055J22129M30534r7982M21929N21503K14550M28436M09911J1464
$$ 9931812 10673867 10795996 11226530 11128548 11550477 12071980 12286530 12714966 13124877 13136341
16773A3136341N22646L00991P31708J23592M32471N29355N92846R90020k54094
$$ 13136341 13658987 13959978 14691686 14815278 15247749 15777104 16369950 17359970 17105876
16764A7105876Q36138M49363P77350N49193L94595J064317K92470J302297M75567
$$ 17105876 17942014 18391377 19168727 19717920 20112515 21176832 21469302 22771599 23247166
16755B3247166O95158R68992J079411P77973J089351J412891R10007J093198J513572
$$ 23247166 23942324 24911316 25990727 26768700 27858051 29270942 30180949 31274147 32787719
16746C2787719J578441J229476J420715J704112J634158J800050K170487K083366
$$ 32787719 34366160 35595636 37016351 38720463 40354621 42154671 44325158 46408524
16738D6408524K147187K329299K527394K728717K792372K746805L230679L482582
$$ 46408524 48555711 50885010 53412404 56141121 58933493 61680298 64910977 68393559
16730F8393559L306656M051603L991492M543798M667956M316995N242669M857485
$$ 68393559 71700215 75751818 79743310 84287108 88955064 93272059 98514728 103372213
16722A03372213O003430N549474N694210O056501O150222O198670O116357N630925
$$ 103372213 109375643 114925117 120619327 126675828 132826050 139024720 145141077 150772002
16714A50772002N774126N486231M894990M314574L907511K970308J854271J106339
$$ 150772002 156546128 162032359 166927349 171241923 175149434 178119742 179974013 181080352
16706A81080352J29155q16521j647277k908666l381175m358321m977260n160088
$$ 181080352 181209507 180392986 178745709 175837043 172455868 168097547 163120287 157960199
16698A57960199n930880o300631n919553o098997o443243o378366o024149n731630
$$ 157960199 152029319 145728688 139809135 133710138 127266895 120888529 114864380 109132750
16690A09132750n730746n415499m929058n240626m749279m233770m086607m184131
$$ 109132750 103402004 97986505 93057447 87816821 83067542 78833772 74747165 70563034
16682G0563034l537021l489742l243932l203035l076704k543597k401124k340060
$$ 70563034 67026013 63536271 60292339 57089304 54012600 51469003 49067879 46727819
16674D6727819k140353k280123k104516j443977j983899j454431j667909j382236
$$ 46727819 44587466 42307343 40202827 38758850 36774951 35320520 33652611 32270375
16666C2270375j203222j692496j060114q81549j343542o88833p99294j131276
$$ 32270375 31067153 29374657 28314543 27432994 26089452 25400619 24601325 23470049
16658B3470049j383843k65209r81068o60965o94159q36201r79385O6015q03632
$$ 23470049 22086206 21820997 20839929 20178964 19484805 18648604 17669219 17735234 16931602
16649A6931602l88415m88872o52033n12554m49659m16412n92923l4308q21001
$$ 16931602 16543187 16054315 15402282 14889728 14440069 14023657 13430734 13396426 12575425
16640A2575425k63479k64973m77136j77524n6675l65874m44120k39852k64036
$$ 12575425 12311946 12046973 11569837 11392313 11335638 10969764 10525644 10285792 10021756
16631A0021756k24484l81094O347n24946q5939m83887n259l22402J72657m99736
$$ 10021756 9797272 9416178 9422525 8897579 8811640 8327753 8322494 8000092 8172749 7673013
16621G673013l62256R5031j0527m56781j10707k81992j9174k81861M0140l40492
$$ 7673013 7310757 7405788 7395261 6938480 6827773 6545781 6526607 6244746 6284886 5944394
16611E944394M83925n88815k13794k30369J03891J22336k27297k23444N5293m00643
$$ 5944394 6428319 5839504 5625710 5395341 5499232 5621568 5394271 5170827 5226120 4825477
16601D825477J63724P5825l04536Q8429m12737N21368o00861q019k06118j33062
$$ 4825477 4989201 5065026 4760490 4848919 4436182 4957550 4356689 4348670 4142552 4009490
16591D009490K19643o40184M27291l5672O2955l36931J05878j61385k89036J0343
$$ 4009490 4229133 3588949 4016240 3980568 4043523 3706592 3812470 3651085 3362049 3372392
16581C372392L7764l53064K09802k76286l75J18918j06436L09655j56006j7981
$$ 3372392 3410156 3057092 3266894 2990608 2990233 3109151 3002715 3312370 3156364 3138383
16571C138383l20029L70332k88961k49478k5840K16201m7193l06100J3543J3653
$$ 3138383 2818354 3188686 2899725 2650247 2624407 2840608 2793415 2487315 2500858 2514511
16561B514511j40221K58246k56361j71419J40333k06310q8749o8556N38148k37493
$$ 2514511 2374290 2632536 2376175 2204756 2345089 2138779 2050030 1981474 2519622 2282129
16551B282129l0350j77938J9947k85251J07835j34701L63340k63215J75983l77936
$$ 2282129 2251779 2073841 2093788 1808537 1916372 1781671 2145011 1881796 2057779 1679843
16541A679843J75214n2287j82967M56702k85626M53321m89846j34085J63475j14375
$$ 1679843 1855057 1802770 1619803 2076505 1790879 2244200 1754354 1620269 1783744 1669369
16531A669369l57490K29893L2649K7147k28328K88588j92450k02210M29624l02247
$$ 1669369 1311879 1541772 1574421 1601568 1373240 1661828 1469378 1267168 1696792 1394545
16521A394545o8826l0653k15215M08508j18518l38890L80605J47520q167j61849
$$ 1394545 1325719 1295066 1079851 1488359 1369841 1030951 1411556 1559076 1550909 1389060
16511A389060o0139K8001l2548k25639O793L83420l74484J5281j47222K18445
$$ 1389060 1328921 1356922 1324374 1098735 1105528 1488948 1114464 1129745 982523 1200968
16501A200968P1675j18798r5402L75861j61337l16751K46562J01241k71701k82105
$$ 1200968 1272643 1153845 1058443 1434304 1272967 956216 1202778 1304019 1032318 750213
16491G50213O63375n76993L25392m21484L72296m02876J81604K68014k83339J14897
$$ 750213 1413588 836595 1161987 740503 1112799 709923 891527 1159541 876202 991099
16481I91099l6079M0708J76250j62062k75075L03389j74829K17827K79524m57991
$$ 991099 955020 995728 1171978 1009916 734841 1038230 863401 1081228 1360752 902761
16471I02761n0263l13551J54743M09335E01835M46902j00785N0095K00407j24232
$$ 902761 852498 538947 693690 1103025 501835 948737 847952 898047 1098454 974222
16461I74222j42006B54866P20635q3772j38824R2330J81367n09451J44746k0885
$$ 974222 832216 254866 975501 891729 752905 845235 1026602 517151 661897 641012
16451F41012n9158k57068O13896m25775R1257L33686m53599K0580J87937j39215
$$ 641012 581854 324786 938682 512907 604164 937850 484251 504831 692768 553553
16441E53553K04159m9964N184L3265k45840K74289l29286J70047B39237O72368
$$ 553553 757712 707748 712932 746197 500357 774646 445360 615407 239237 911605
16431I11605j34412J02588q8240j00879k58599K49127B63171K56731K9281K03144
$$ 911605 777193 879781 791541 690662 432063 681190 263171 519902 549183 752327
16421G52327k31703J09314K22864k25622k51200j19595L41060L0766k42877L65533
$$ 752327 520624 629938 852802 627180 375980 256385 597445 628211 385334 750867
16411G50867l20501J82166k96496L3883L46894l08886K92282L6165p0440k78120
$$ 750867 430366 612532 316036 349919 696813 387927 680209 716374 645934 367814
16401C67814R7841n7665r4988L25220Q8743k87485A19956J97291O775N88912C00755
$$ 367814 465655 407990 313002 638222 726965 439480 119956 317247 324022 912934 300755
16389B1308N75696n3200k57637G3644N36599R9220k15864j20488q5939L28494
$$ 21308 597004 543804 286167 73644 610243 709463 493599 373111 287172 615666
16379F15666J2345B34271K94937j07660J66222H1063N38282B58888F1797P67389
$$ 615666 628011 234271 529208 421548 587770 81063 619345 258888 61797 829186
16369H29186A06790M96211m1479B78767J41991o7910J56023m4048g8868D23261
$$ 829186 106790 603001 561522 278767 420758 352848 508871 464823 -78868 423261
16358B58494m7453p3060L6473N63458l41542J61438j55659l264J22000j57451
$$ 258494 211041 137981 174454 737912 396370 557808 402149 398885 520885 363434
16348C63434Q545N6543j69529j7736L41673k22338E2420K36029J43297m2093A45693
$$ 363434 371979 428522 258993 241257 582930 360592 52420 288449 431746 389653 145693
16336A62880L35452A13676K20319j6314J06487K5663r8929o9982C2271E999K98591
$$ 162880 498332 113676 333995 317681 424168 449831 350902 280920 32271 5999 304590
16325C04590n1299L76933I8432K04448J3539q2897g7485C21608C7436K90969N7316
$$ 304590 253291 630224 98432 302880 316419 233522 -77485 321608 37436 328405 385721
16314C85721J50994A0727K02726R3021j1079K96851B13830M5301B525M56103H626
$$ 385721 536715 10727 213453 306474 295395 592246 213830 259131 2525 458628 8626
16302E44409j56832j09956K2891E2236L65608G7235J82324J33671j93381H6950
$$ 544409 387577 277621 300512 52236 417844 77235 259559 393230 199849 86950
16291A81225L1896J87933p3466J6736j54651c4949A94235o016p9562J77917B0691
$$ 181225 213121 401054 327588 344324 189673 -34949 194235 188219 108657 286574 20691
16279c1837A37053O2o4552K81809J56778B01900b74497A16248J35311K50856a4974
$$ -31837 137053 137115 72563 354372 511150 201900 -274497 116248 251559 502415 -14974
16267D0549J38485a21323I3216e0862A35753L7478J03699J3347E3327N3975l1556
$$ 40549 179034 -121323 93216 -50862 135753 173231 276930 290277 53327 107302 75746
16256G5746g6219B46997a6771B03579B8162a37973C86367b8110C38770b027D55573
$$ 75746 -76219 246997 -16771 203579 28162 -137973 386367 -28110 338770 -2027 455573
16244A10277c8601A6011i5963k34337B15098K91473I3972J45561a12563B2958
$$ 110277 -38601 16011 -95963 -330300 215098 506571 93972 239533 -112563 22958
16233A74920a06294D4039h3062B24893a23249k15648a7677j01543D51552B07004
$$ 174920 -106294 44039 -83062 224893 -123249 -338897 -17677 -119220 451552 207004
16222a1109A32971J84479B0327d2146j42391A53103E0167K6232J68475D5585a41963
$$ -11109 132971 317450 20327 -42146 -184537 153103 50167 76399 244874 45585 -141963
16210H700J1110K5868K15490G7184C5588J66288B1570J82066N088k0220p1322
$$ 8700 19810 45678 261168 77184 35588 201876 21570 203636 208724 188504 117182
16199A17182a74390I1152a43568I8449L7184l2851e5678B09692I6348J88128p0734
$$ 117182 -174390 91152 -143568 98449 135633 102782 -55678 209692 96348 284476 213742
16188B13742j2658J53053r1330b3891A38588J29853a31215B39182H512J05049
$$ 213742 201084 354137 262807 -23891 138588 268441 -131215 239182 8512 113561
16178A13561f005j38540D72104B6308J2986K25617b1047A38515a89959A43005
$$ 113561 -6005 -144545 472104 26308 39294 264911 -21047 138515 -189959 143005
16167a72291C1855i2035j80485D4643L11455j14686j9007N3449g0428A72281a05734
$$ -172291 31855 -92035 -272520 44643 356098 241412 222405 275854 -70428 172281 -105734
16155A58994P824A2338N6020a53219d8055K1007j2382H3626d5851A85979J95913
$$ 158994 166818 12338 68358 -153219 -48055 -27048 -39430 83626 -45851 185979 381892
16144C81892c50177e3788r2582A55903c54776g1236B57711c09369A01275B7710
$$ 381892 -350177 -53788 -146370 155903 -354776 -71236 257711 -309369 101275 27710
16133d7097k842B16989a31914c5142a732k60661B7225J31845A3275K8045J06946
$$ -47097 -49939 216989 -131914 -35142 -1732 -262393 27225 159070 13275 41320 148266
16122A48266b24341J1478j04311a18681d4104p4312A34632n0947P970a48606E7277
$$ 148266 -224341 -212863 -317174 -118681 -44104 -118416 134632 83685 91655 -148606 57277
16110E506N955b73033h2952c6383C60786H5817L07105a69894A06831Q946a92384
$$ 5506 11461 -273033 -82952 -36383 360786 85817 392922 -169894 106831 115777 -192384
16098E3254b08459G2843h1589k88584C4925K8375a25422n1412G8706m693R8747
$$ 53254 -208459 72843 -81589 -370173 34925 63300 -125422 -176834 78706 74013 172760
16087A72760c9471a2416I031a03896K7527C2661a106j07888q7973E53767c83652
$$ 172760 -39471 -12416 9031 -103896 -76369 32661 -1106 -108994 -196967 553767 -383652
16075c4425A14274J28189A2076M3461I228f552C7465L68513C133K24235C8065
$$ -34425 114274 242463 12076 55537 9228 -6552 37465 405978 3133 227368 38065
16063d14676C34070G713i567q2047J6397A54442c1882D6333J10082h6109m9986
$$ -414676 334070 7713 -9567 -91614 -75217 154442 -31882 46333 156415 -86109 -136095
16052a36095A62236E6891J34142D068a80188p7043A43089b14135j03436C25011
$$ -136095 162236 56891 191033 4068 -180188 -257231 143089 -214135 -317571 325011
16041A12008l5702a38839d6131m25691f90C0691R4524m3235h3536k09216A43398
$$ 112008 76306 -138839 -46131 -471822 -690 30691 125215 81980 -83536 -292752 143398
16029e2714I2188h3006j3745B70875d4760B59794D1575j0401a63474f0360j49379
$$ -52714 92188 -83006 -96751 270875 -44760 259794 41575 31174 -163474 -60360 -209739
16018b09739J01376o4567N6317A07879a10278j24425j00125e9055E32681c82181
$$ -209739 -108363 -172930 -116613 107879 -110278 -234703 -334828 -59055 532681 -382181
16007B43078L2871a19910l1201j00201A47296f7414j60049P46A25441b19067b5099
$$ 243078 275949 -119910 -151111 -251312 147296 -67414 -227463 -226717 125441 -219067 -25099
15995I7528Q059a81833B07388G4646a77784Q5781B03955c73533a76858B35922
$$ 97528 105587 -181833 207388 74646 -177784 -92003 203955 -373533 -176858 235922
15984A39992d0900k40231L0617C17941c54905B65975b16143i3857B87637a39239
$$ 139992 -40900 -281131 -250514 317941 -354905 265975 -216143 -93857 287637 -139239
15973a57716d2539B42385a68978C29555F0912K23849K41624c9904A43032L0724
$$ -157716 -42539 242385 -168978 329555 60912 284761 526385 -39904 143032 173756
15963A73756D1360O9223O1176J68001C7060K2705P8753O4173g945C5930N1066
$$ 173756 41360 110583 171759 339760 37060 59765 138518 202691 -7945 35930 86996
15952H6996e4502I6678m635J55975a76701I8046d5005H2226l4491J00887a699
$$ 86996 -54502 96678 92043 248018 -176701 98046 -45005 82226 47735 148622 -1699
15940C3675J52485f5064o0985a6080l69885b452B96304i5101j28200G1642e6660
$$ 33675 186160 -65064 -126049 -16080 -385965 -2452 296304 -95101 -223301 71642 -56660
15928d7374G2898O4611a4776H4510g3849k01749C7694M5995c4307p6794A27356
$$ -47374 72898 137509 -14776 84510 -73849 -275598 37694 83689 -34307 -111101 127356
15916b63488i3308B0719b2446k45820M7468d8881I0844D105a1110D564a13910
$$ -263488 -93308 20719 -22446 -268266 -220798 -48881 90844 4105 -11110 4564 -113910
15904A24129M855b78119A75684A7293b23008c3497B9464d18308B27340j00484
$$ 124129 128984 -278119 175684 17293 -223008 -33497 29464 -418308 227340 126856
15894A26856D5483J48905f2583A20433J30461a87090A91497a60660a6436j67747
$$ 126856 45483 194388 -62583 120433 250894 -187090 191497 -160660 -16436 -184183
15884a84183M333B44165a36533k33672B18281a85423K6488q9364J22260a5124
$$ -184183 -179850 244165 -136533 -370205 218281 -185423 -158935 -248299 -126039 -15124
15873a29981A08841K2187Q5280a66942f0187j80884a07790I7812a7900j43800
$$ -129981 108841 131028 216308 -166942 -60187 -241071 -107790 97812 -17900 -161700
15863a61700b3688C3206C812c17687A49518a40548c6107k00608i6155j0482k31927
$$ -161700 -23688 33206 3812 -317687 149518 -140548 -36107 -236715 -96155 -106637 -338564
15852c38564i5564G1165a011m3657A74518b20342A11048k3931c0818k17935D0259
$$ -338564 -95564 71165 -1011 -44668 174518 -220342 111048 87117 -30818 -248753 40259
15840a09059d1595I0173J09062E9714J4317f2063F9204a95420K6492a8304D2349
$$ -109059 -41595 90173 199235 59714 74031 -62063 69204 -195420 -168928 -18304 42349
15828A84266a30231B63330l0220J71541a91313K7593a6190l59903e4019b2337
$$ 184266 -130231 263330 233110 404651 -191313 -163720 -16190 -376093 -54019 -22337
15817h8724L5045A344e779l53287B5863L23078j71977J23667g4501n222A04721
$$ -88724 -53679 1344 -5779 -359066 25863 348941 176964 300631 -74501 -79723 104721
15805d4976J0599k52290I09K08620I1185d67980J80085k152a44243F0392a6130
$$ -44976 -34377 -286667 909 209529 91185 -467980 -287895 -290047 -144243 60392 -16130
15793d25379i9873b9896j99131e5712j39509A1849R3541J7419E8037Q5574K4629
$$ -425379 -99873 -29896 -229027 -55712 -195221 11849 105390 122809 58037 143611 168240
15782A68240K179H4673P3193c25353a43542o8474G7536l8621b37500A03431M3541
$$ 168240 170419 84673 157866 -325353 -143542 -212016 77536 38915 -237500 103431 146972
15771A46972M2680O9608H468a06696l45809J61654A42799b21366i6184B67633
$$ 146972 189652 259260 8468 -106696 -452505 -290851 142799 -221366 -96184 267633
15760g1859G4212c076l34333A60320i3968A29509B7086J3998h2952D7676i8973
$$ -71859 74212 -3076 -337409 160320 -93968 129509 27086 41084 -82952 47676 -98973
15748A21599a69527f8024m08630J72190c2867D9889b30189a01351c2763a3394
$$ 121599 -169527 -68024 -476654 -304464 -32867 49889 -230189 -101351 -32763 -13394
15737G6165J66616A9363b1821C27920b05086A45343N6268p0801a20651B57091
$$ 76165 242781 19363 -21821 327920 -205086 145343 201611 130810 -120651 257091
15726a89438A05917B2068K69959I3814h9725j10542K0159C72387A08937a28157
$$ -189438 105917 22068 292027 93814 -89725 -200267 -180108 372387 108937 -128157
15715b19584j30490c7118m50140C8930c34776A90357Q406h3942j15723b7528k65305
$$ -219584 -350074 -37118 -487258 38930 -334776 190357 198763 -83942 -199665 -27528 -292833
15704b92833j33612A14291b00952p8531J29261j2147C6863b32692d9289n3039
$$ -292833 -426445 114291 -200952 -279483 -150222 -162369 36863 -232692 -49289 -102328
15694a02328j36716g485A41570b14885d423m5347C0335c08781O9485h1382A75026
$$ -102328 -239044 -7485 141570 -214885 -4423 -49770 30335 -308781 -239296 -81382 175026
15682a46474O0493C722J70984P3962g7056B37193I7005k2760d9634B15352b13389
$$ -146474 -85981 3722 174706 248668 -77056 237193 97005 74245 -49634 215352 -213389
15670f0248A85140b29961O3930d584j58514I5927a51464a0217k6074l22713C5860
$$ -60248 185140 -229961 -166031 -4584 -163098 95927 -151464 -10217 -36291 -359004 35860
15658b3222j31109k66280E18068b0657F9654Q6431a51388K1411L4688A40100K02898
$$ -23222 -154331 -420611 518068 -20657 69654 156085 -151388 -129977 -95289 140100 342998
15647C42998p0156f4422b968j88802f3183b3912B6816f9226c4410D4258B077d90182
$$ 342998 272842 -64422 -2968 -191770 -63183 -23912 26816 -69226 -34410 44258 2077 -490182
15634B7673b1065k59495A17400a89878A45591E685c60710a76417A04410a55246
$$ 27673 -21065 -280560 117400 -189878 145591 5685 -360710 -176417 104410 -155246
15623e39968I2374c4948k29059A40815a35550k04246A09114c7895F0177J13152
$$ -539968 92374 -34948 -264007 140815 -135550 -339796 109114 -37895 60177 173329
15613A73329F4728C1332J51804B2200c2576k34739B5541d99666e610m7082k13273
$$ 173329 64728 31332 183136 22200 -32576 -267315 25541 -499666 -5610 -52692 -265965
15602b65965e0215o4241M3524p5367J0873N0914B958Q8121j3193J42677A04292
$$ -265965 -50215 -114456 -70932 -146299 -135426 -84512 2958 91079 77886 220563 104292
15590a39298B5199b03040H424a1250j58279j39711e3684k41384e4974n1632a2841
$$ -139298 25199 -203040 8424 -11250 -169529 -309240 -53684 -295068 -54974 -106606 -12841
15578A44501C8333a8798A40466J32217F9716O3911N0955E5624N6052b15616B22705
$$ 144501 38333 -18798 140466 272683 69716 133627 184582 55624 111676 -215616 222705
15566A58810a0576D8532a1933A33179a69410d9092A3335a25063L1106b6217m9470
$$ 158810 -10576 48532 -11933 133179 -169410 -49092 13335 -125063 -93957 -26217 -75687
15555g5687L641J5501m2336h942I148i3718j80004a24670H2444C700c3572d54
$$ -75687 -72046 -56545 -98881 -8942 9148 -93718 -273722 -124670 82444 3700 -33572 -454
15542f3791m9869D0939L8043a24519o9589f2012B17354h8053A16730h4382j04775
$$ -63791 -113660 40939 78982 -124519 -194108 -62012 217354 -88053 116730 -84382 -189157
15531a89157B9559J78200c86496A57340c44848a8824B65300D3003J31710a69331
$$ -189157 29559 207759 -386496 157340 -344848 -18824 265300 43003 174713 -169331
15520d1989q5594K2708F55728B42540C7406J4588b13348A32542n8485f7163K4833
$$ -41989 -127583 -104875 655728 242540 37406 51994 -213348 132542 74057 -67163 -42330
15509d2330G0820a43679D0789b35464g0625J6301A73628e9586B31984d3808I641
$$ -42330 70820 -143679 40789 -235464 -70625 -54324 173628 -59586 231984 -43808 9641
15497h9610A52670D1342e8595j19184A18782c29849H6127d78581B47985g1667
$$ -89610 152670 41342 -58595 -177779 118782 -329849 86127 -478581 247985 -71667
15486c3159A36590h9809C5708j7512b77941D08876A37621n1600h2176H4527R8187
$$ -33159 136590 -89809 35708 18196 -277941 408876 137621 86021 -82176 84527 182714
15475A82714a32057k04067h3021C83277D3415g3747L6251A69853b19140O8450
$$ 182714 -132057 -336124 -83021 383277 43415 -73747 -37496 169853 -219140 -150690
15465a50690G2809a04450B94562a06971o0367A58630b69859R1685M3276N5779
$$ -150690 72809 -104450 294562 -106971 -167338 158630 -269859 -178174 -134898 -79119
15455g9119A03754J28920b0854G1026a71871N0067k88068G1829a56425A82679
$$ -79119 103754 232674 -20854 71026 -171871 -121804 -409872 71829 -156425 182679
15444b25929B17029b0639A58349d0299A56018K75521I6648D0871a87083J5742
$$ -225929 217029 -20639 158349 -40299 156018 431539 96648 40871 -187083 -171341
15434a71341j74594A84306E472c00974K2062J0478B47654C8328J1958E553J1005
$$ -171341 -345935 184306 5472 -300974 -278912 -268434 247654 38328 50286 5553 16558
15423A6558L3151d4879A16851b01145K7669e2307I58J34016A6751K03576d207
$$ 16558 49709 -44879 116851 -201145 -173476 -52307 958 134974 16751 220327 -4207
15411A78079g6676q5852g9055b9462k07868E2204f1412m6991b5390j48777M1306
$$ 178079 -76676 -162528 -79055 -29462 -237330 52204 -61412 -108403 -25390 -174167 -132861
15400a32861I7726L06421a75399A50464L2394H7895b0701A93951b37190A84917
$$ -132861 97726 404147 -175399 150464 182858 87895 -20701 193951 -237190 184917
15389B21521J06436b16885c6318j4714j6074K9589j2163r071C42511o4698c39558
$$ 221521 327957 -216885 -36318 -51032 -67106 -37517 -49680 -58751 342511 277813 -339558
15377b79643J8177H6183a48920M4801M5172A09880c00096P1672i7602F1958P0217
$$ -279643 -261466 86183 -148920 -104119 -58947 109880 -300096 -228424 -97602 61958 132175
15366A32175b49836A98041C309J8241a67458b8367F2626a46432j7490D6175c4894
$$ 132175 -249836 198041 3309 21550 -167458 -28367 62626 -146432 -163922 46175 -34894
15354B15430b84954A39608b37932a10870F8871h8697k7105j39987c8682F2719
$$ 215430 -284954 139608 -237932 -110870 68871 -88697 -115802 -255789 -38682 62719
15343D42439a84065H0704c21285B32456k7298h3044n9901G461d6135a0595k59405
$$ 442439 -184065 80704 -321285 232456 205158 -83044 -142945 7461 -46135 -10595 -270000
15332b70000B74101f4368B82635b49347A90584I4401d7979B15524i3717q0648
$$ -270000 274101 -64368 282635 -249347 190584 94401 -47979 215524 -93717 -174365
15322a74365h2360k42372B48415h0605i250D8647a3111k71928Q5592L428A52872
$$ -174365 -82360 -324732 248415 -80605 -9250 48647 -13111 -285039 -199447 -196019 152872
15310I4148K3571J1311g6717F4349P9883l3374n3573K17594A18914a52610I9980
$$ 94148 117719 129030 -76717 64349 144232 110858 57285 274879 118914 -152610 99980
15298c23435O0680A60497d7489A58303g3092R008k0007A64253D3942J26493a67960
$$ -323435 -262755 160497 -47489 158303 -73092 -64084 -84091 164253 43942 170435 -167960
15286a73391A92849a17361C6395P3012a74521b5188A12379J17990d3291j9563
$$ -173391 192849 -117361 36395 109407 -174521 -25188 112379 230369 -43291 -62854
15276f2854A44942b4224q701j75964B75039a29158C62115a24202k16971a45001
$$ -62854 144942 -24224 -32925 -208889 275039 -129158 362115 -124202 -341173 -145001
15265a00758D1456b47740C8594J4462k0766h9315C57881j00864k4484h9350C5502
$$ -100758 41456 -247740 38594 53056 32290 -89315 357881 257017 232533 -89350 35502
15253e2853B08150a50272A1372f3469K1483l0710B68770I6401J33245I4877M629
$$ -52853 208150 -150272 11372 -63469 -41986 -72696 268770 96401 229646 94877 99506
15242I9506J81656a90008A25074K2315L30778m6879j06734f403H91786L53237
$$ 99506 281162 -190008 125074 147389 478167 431288 324554 -6403 891786 1245023
15232A245023K20886k15785k726m54788k49322k43071a63634B88773G9085k5264
$$ 1245023 1465909 1250124 1247398 792610 543288 300217 -163634 288773 79085 53821
15222E3821A020K69630n6942f1278I8654j587h906A86538G4456a13584I4781a06446
$$ 53821 1020 270650 213708 -61278 98654 97067 -8906 186538 74456 -113584 94781 -106446
15209A96198D2919L41095j14517m4699F9571K37672G8235i4082A8739L246b01476
$$ 196198 42919 384014 269497 224798 69571 307243 78235 -94082 18739 21985 -201476
15197A06442g2111I1969b32464A97278f7590I2127a37339H9468c8493C03320q4948
$$ 106442 -72111 91969 -232464 197278 -67590 92127 -137339 89468 -38493 303320 218372
15186B18372D2173J94941l1044b4376A65592K0933M8235a63004B33704k2068J24948
$$ 218372 42173 237114 206070 -24376 165592 186525 234760 -163004 233704 211636 336584
15175C36584o6155A5926L89337A71792A0642J80480A5705b13964A25394a95576
$$ 336584 270429 15926 405263 171792 10642 191122 15705 -213964 125394 -195576
15164A63086J5966B1590J36238c551q3581o2670E5329J32746B0430A622a0001
$$ 163086 179052 21590 157828 -3551 -87132 -149802 55329 188075 20430 1622 -10001
15152A80061Q2448I3861K13966F1389P2368K07465i51k3713o760D8900M55261
$$ 180061 262509 93861 307827 61389 133757 341222 -951 -24664 -31424 48900 504161
15141E04161k42279K888f9136D5574a55396C00134h983C4934K05272m8270m113
$$ 504161 261882 264770 -69136 45574 -155396 300134 -8983 34934 240206 191936 187823
15130A87823m9742O1254q6063r271l4203K69541E5667J19268k2000n0365i9082
$$ 187823 138081 199335 113272 104001 69798 339339 55667 174935 152935 102570 -99082
15118B58405k4274j11890K92474A18852M4176k882i9878A98720q2365f1473A43185
$$ 258405 234131 122241 414715 118852 163028 160146 -99878 198720 116355 -61473 143185
15106B21854I8033Q9967q6329M0005k5192P3373a38017D0249K69526L201r3280
$$ 221854 98033 188000 101671 141676 116484 189857 -138017 40249 309775 312976 219696
15095B19696R8557a16595A57136a14349C8880L93373g8006r2157A70227F5819
$$ 219696 318253 -116595 157136 -114349 38880 432253 -78006 -170163 170227 65819
15084C41534g3165k78486B35854N4390a11534P082C57561R739E7922K4679K04013
$$ 341534 -73165 -351651 235854 290244 -111534 -104452 357561 367300 57922 82601 286614
15073B86614r5941b6062f604D68629A27008N7419k9885J56691j45132l3684J0032
$$ 286614 190673 -26062 -6604 468629 127008 184427 154542 311233 166101 132417 142449
15062A42449m6383i8584B61033b55632I7650a20977D96578B23197J92446k01510
$$ 142449 96066 -98584 261033 -255632 97650 -120977 496578 223197 415643 214133
15052B14133Q5797L1900a33765C1643N1640K29181h4893E17741j12530A65800
$$ 214133 299930 331830 -133765 31643 83283 312464 -84893 517741 405211 165800
15041A93982L1056O0124A27693J8438C6396J01090a80267C83788e4039B61397
$$ 193982 225038 285162 127693 146131 36396 137486 -180267 383788 -54039 261397
15030A50766a61897B24383N640J82582A18168J76520b88065C47625o5145r7805
$$ 150766 -161897 224383 230023 412605 118168 294688 -288065 347625 282480 184675
15020A84675P2859p6576E3050J18897b8209G8541K32527I6168R7815A1070K82911
$$ 184675 257534 180958 53050 171947 -28209 78541 311068 96168 193983 11070 293981
15009B93981q0161J34047a14865G3329L50348b47997B63433M1228J6068L02978
$$ 293981 213820 347867 -114865 73329 423677 -247997 263433 304661 320729 623707
14999F23707j54216a20773B59327D3284R8821d11598C93803h9644A56499J19945
$$ 623707 469491 -120773 259327 43284 142105 -411598 393803 -89644 156499 276444
14989B76444j08787M0725D3584b3496A08301L61918o5472p9877K4046A14992J6296
$$ 276444 167657 208382 43584 -23496 108301 470219 404747 324870 348916 114992 131288
14978A31288K47954D6720J42488i8271B46799e2032A01638N84302B15089G4428
$$ 131288 379242 46720 189208 -98271 246799 -52032 101638 685940 215089 74428
14967A20654J99081o2089k7981J4005j08199J51312J59145A81022d4519B65513
$$ 120654 319735 257646 229665 243670 135471 286783 445928 181022 -44519 265513
14956F38443B66203a00761C92878A88744O6102p2907K0864K93482H3985L06308
$$ 638443 266203 -100761 392878 188744 254846 181939 202803 496285 83985 390293
14946C90293j08554N8096A42319J86439Q2712A29151K30769O755j78342J87423
$$ 390293 281739 339835 142319 328758 411470 129151 359920 366675 188333 375756
14936C75756A50617P5848J41187k5456M5874H496M08693j17392A00772J13728
$$ 375756 150617 226465 367652 342196 388070 8496 417189 299797 100772 214500
14926B14500L88397j6721B20195Q1236A9259M36621k02920m251j04741K48298
$$ 214500 602897 586176 220195 301431 19259 455880 252960 248709 143968 392266
14916C92266A55737J58178k4101Q7978j69918p4257c5403A70382K78992J57975
$$ 392266 155737 313915 289814 377792 207874 133617 -35403 170382 449374 607349
14906F07349k82330P5442P157i5355B18228J26898J84314j07943B10058L45078
$$ 607349 325019 400461 407618 -95355 218228 345126 529440 421497 210058 555136
14896E55136A86216L70827o7740R0258k6844k74359k4343o2775J40468b10169
$$ 555136 186216 557043 489303 579561 552717 278358 254015 191240 331708 -210169
14885E55499j75935K98226k80547P4417g8347D97607k48302r0559M93993k27104
$$ 555499 379564 677790 397243 471660 -78347 497607 249305 158746 652739 425635
14875D25635j82565M1110Q1226L9265j42845J93438l4806j81651K35581C0743
$$ 425635 243070 284180 365406 404671 261826 455264 420458 238807 474388 30743
14864C02667L67274k56821A07755K41219J44967j86929J91323j79765l4577K17265
$$ 302667 669941 413120 107755 348974 493941 307012 498335 318570 283993 501258
14854E01258j25205q0950J55755P3933J67177k11185J29456j12930k24607L0893
$$ 501258 376053 295103 450858 524791 691968 480783 610239 497309 272702 303595
14844C03595L66305k11117A54031N38501A53840J35619G3871M17441j9587B09013
$$ 303595 669900 458783 154031 692532 153840 289459 73871 491312 471725 209013
14833E39733k1981N1236A94554J90809M53666E8568L31806K89862j62113M8711
$$ 539733 517752 568988 194554 385363 839029 58568 390374 680236 518123 566834
14823E66834l1507j15161A76941r027O41928C90514K22027j80785K83401k53810
$$ 566834 535327 420166 176941 167914 809842 390514 612541 431756 715157 461347
14813D61347K0870J50530k06972J56314j14259J59053k0580k01559j2126K95520
$$ 461347 482217 632747 425775 582089 467830 626883 606303 404744 392618 688138
14803F88138j1626r8422n5995K50661k61942J40350E4507N20370K69253l59553
$$ 688138 676512 578090 522095 772756 510814 651164 54507 574877 844130 484577
14793D84577J98952r2266J7025k09392K22533K0724k59603L00249k04615L9837
$$ 484577 683529 591263 608288 398896 621429 642153 382550 682799 478184 518021
14783E18021B16367M56971j2175A28751K61564K57259k5726j18752o959L5425
$$ 518021 216367 673338 661163 128751 390315 647574 621848 503096 496137 531562
14773E31562j13743J72426K8985n4590j62728J49173j68606K08153j0984K57467
$$ 531562 417819 590245 619230 564640 401912 551085 382479 590632 579648 837115
14763H37115j83411R8818j83377l2110P8854J83456L16554n56616n0792j28011
$$ 837115 653704 752522 569145 537035 615889 799345 1115899 559283 508491 380480
14753C80480P4760K01678J96019D20637J72545L1219l3970J73717j48643J7300
$$ 380480 455240 656918 852937 420637 593182 624401 590431 764148 615505 632805
14743F32805j11035p3977M02263j62358j43480M79151j16227k65q3837j61925
$$ 632805 521770 447793 850056 687698 544218 1023369 907142 906877 823040 661115
14733F61115k13371J98556o7668P6435q1372J77283j73451j54529J9796L64454
$$ 661115 447744 646300 578632 655067 573695 750978 577527 422998 442794 807248
14723H07248p2791L06945m96458L21203o4760O5780p400R9093p823K48329E60595
$$ 807248 734457 1041402 544944 866147 801387 867167 859767 958860 951037 1199366 560595
14711E42645O5905L59192j21422j36972q3963K70118n3281J29128K2944k23032
$$ 542645 608550 967742 846320 709348 625385 895503 842222 971350 994294 771262
14701G71262Q772r332K43368K43335k98768k27191j30003L35354k37339L41267
$$ 771262 780034 770702 1014070 1257405 958637 731446 601443 936797 699458 1040725
14691A040725m65099K39701J2806n9644R1636k15793Q4107R593J27858K62873
$$ 1040725 575626 815327 828133 768489 860125 644332 728439 738032 865890 1128763
14681A128763k49917J07806l65780J22247K08283k11313J64128l8212J83417O3877
$$ 1128763 878846 986652 620872 743119 951402 740089 904217 866005 1049422 1113299
14671A113299n13658K13559j0588r3583k20920O88725j22730l46031L40097K18595
$$ 1113299 599641 813200 802612 709029 488109 1176834 1054104 708073 1048170 1266765
14661A266765q6695J21080j80892m1682l85137O40813j85302k54055K64490N7945
$$ 1266765 1180070 1301150 1120258 1078576 693439 1334252 1148950 894895 1159385 1217330
14651A217330k30377L5178j43540J69352l2439o3292Q2518k96423N28402l6304
$$ 1217330 986953 1022131 878591 1047943 1015504 952212 1034730 738307 1266709 1230405
14641A230405k23173L30713n26653J41249K31157m5058L16385k03735k19111L03893
$$ 1230405 1007232 1337945 811292 952541 1183698 1138640 1455025 1251290 1032179 1336072
14631A336072k99342J89850Q0383J15217l19586p3688M54730k89123R6665l58721
$$ 1336072 1036730 1226580 1306963 1422180 1102594 1028906 1483636 1194513 1291178 932457
14621I32457M76034l2249j69331J01376J11992j55351j3647k50540L49032j55338
$$ 932457 1408491 1376242 1206911 1308287 1420279 1264928 1251281 1000741 1349773 1194435
14611A194435K53595n4579r3116L57774n60996L05710J67717k45575K85764k62097
$$ 1194435 1448030 1393451 1300335 1658109 1097113 1402823 1570540 1324965 1610729 1348632
14601A348632K67480m4284j42098q889k4734R9866P0427J59757m7723l9179k69608
$$ 1348632 1616112 1571828 1429730 1420841 1396107 1495973 1566400 1726157 1678434 1639255 1369647
14590A369647o0733L63177k96365L21821K53866N6253j26292m23226K02208P97
$$ 1369647 1308914 1672091 1375726 1697547 1951413 2007666 1881374 1458148 1660356 1661153
14580A661153M92600k89202K10513n16064P59820n87883L11013j95131J85460
$$ 1661153 2153753 1864551 2075064 1559000 2318820 1730937 2041950 1846819 2032279
14571B032279l11779K06781q4917J74551L0763L30158l83398J97184k62789J28837
$$ 2032279 1720500 1927281 1842364 2016915 2047678 2377836 1994438 2191622 1928833 2057670
14561B057670L24178j65707L36K58776k70235L51204N2116j62660j12835J81698
$$ 2057670 2381848 2216141 2216477 2475253 2205018 2556222 2608338 2445678 2332843 2514541
14551B514541L0443L69026l16010K54077q6609q1256N03232K58678N4670j38741
$$ 2514541 2544984 2914010 2598000 2852077 2765468 2684212 3187444 3446122 3500792 3362051
14541C362051N36313M41853M41542k056Q71123Q67413J733670K546002L825688
$$ 3362051 3898364 4340217 4781759 4779703 5650826 6518239 8251909 10797911 14623599
14532A4623599O576405J1307280q82170j3594365o605353m160065k505162p48265
$$ 14623599 21200004 32507284 31625114 18030749 11425396 7265331 4760169 4011904
14524D011904p11352J36027k40009o98314K68632j81737r0115m06081N40639k20273
$$ 4011904 3300552 3436579 3196570 2498256 2766888 2585151 2495036 2088955 2629594 2409321
14514B409321L4865K64529j73656L65001m12960j41522J45361J37116K7600j63217
$$ 2409321 2444186 2708715 2535059 2900060 2487100 2345578 2490939 2628055 2655655 2492438
14504B492438l2378Q7498o4142L0305K57469l64133M08731J19894K25607m20041
$$ 2492438 2460060 2547558 2483416 2513721 2771190 2407057 2815788 2935682 3161289 2741248
14494B741248P4373K67547J45104j15878n2571J42349J95587N9009K86164m20473
$$ 2741248 2815621 3083168 3228272 3112394 3059823 3202172 3397759 3456768 3742932 3322459
14484C322459j15237J65180j21588J46726p6586J40944K92068l11007m4394K28661
$$ 3322459 3207222 3372402 3250814 3397540 3320954 3461898 3753966 3442959 3398565 3627226
14474C627226L9660j44797L25399j69824J42329m6749J10665M90131n91570M77052
$$ 3627226 3666886 3522089 3847488 3677664 3819993 3773244 3883909 4374040 3782470 4259522
14464D259522k91504L70929j92078J73278J58764r5700M0766j01123K1308J43434
$$ 4259522 3968018 4338947 4146869 4320147 4478911 4383211 4423977 4322854 4344162 4487596
14454D487596J56658k00760M09531j78798M11943j69343n6109J62201n10995R22474
$$ 4487596 4644254 4443494 4853025 4674227 5086170 4916827 4860718 5022919 4511924 5434398
14444E434398k31563K88465m12072K55475K43099j24916j7092l0000L85956m70148
$$ 5434398 5202835 5491300 5079228 5334703 5577802 5452886 5435794 5405794 5791750 5321602
14434E321602N51161l15491M48573j04620K46014j38335N20648k15700K027K11658
$$ 5321602 5872763 5557272 6005845 5901225 6147239 6008904 6529552 6313852 6315879 6527537
14424F527537r6058J62488Q8610K04625J36769J33072k96232L42648J06456J17298
$$ 6527537 6431479 6593967 6682577 6887202 7023971 7157043 6860811 7203459 7309915 7427213
14414G427213O2208j38690M95740K46612j59628L9447M07955k01923j06084N22361
$$ 7427213 7489421 7350731 7846471 8093083 7933455 7972902 8380857 8178934 8072850 8595211
14404H595211l50885M60283Q2127Q8986M08056J32141j46581L40161j97879N84770
$$ 8595211 8244326 8704609 8786736 8875722 9283778 9415919 9269338 9609499 9411620 9996390
14394I996390n09422N50339J84117L07185O4048K46834r2328K51629K61347K09265
$$ 9996390 9486968 10037307 10221424 10528609 10592657 10839491 10747163 10998792 11260139 11469404
14384A1469404j91133N52066j59733O52673m36856O53731L94142P7349K13466
$$ 11469404 11278271 11830337 11670604 12323277 11886421 12540152 12934294 13011643 13225109
14375A3225109K75388Q4318K76284n8851L45236N91364K15254N9896N05715j22884
$$ 13225109 13500497 13584815 13861099 13802248 14147484 14738848 14954102 15013998 15519713 15396829
14365A5396829L58228L34509M89263j47067M68156Q24176m9833N18714L24380
$$ 15396829 15755057 16089566 16578829 16431762 16899918 17724094 17674261 18192975 18517355
14356A8517355K52068N13313L89697K57981N30408P12343J81774N70821K28120
$$ 18517355 18769423 19282736 19672433 19930414 20460822 21173165 21354939 21925760 22153880
14347B2153880N68755M04183N90243M94394M41363R24594N35039L30694N98077
$$ 22153880 22722635 23126818 23717061 24211455 24652818 25577412 26112451 26443145 27041222
14338B7041222O00264J003277L21120P98426Q66688N88709R52338L76076J124762
$$ 27041222 27641486 28644763 28965883 29764309 30630997 31219706 32172044 32548120 33672882
14329C3672882R09310R74881R90623J062874J069487J020969Q75907J028591J468491
$$ 33672882 34582192 35557073 36547696 37610570 38680057 39701026 40576933 41605524 43074015
14320D3074015J110661J613573J090085J581944J653799J520148J628557J560399
$$ 43074015 44184676 45798249 46888334 48470278 50124077 51644225 53272782 54833181
14312E4833181J711801J894983K050126K130265J795290K651256J869301K620576
$$ 54833181 56544982 58439965 60490091 62620356 64415646 67066902 68936203 71556779
14304G1556779K822251K942578K373733L361872L335254L023853L648431L846078
$$ 71556779 74379030 77321608 79695341 83057213 86392467 89416320 93064751 96910829
14296I6910829L942209L948727M504044N158368M833793M943890N650903O046622
$$ 96910829 100853038 104801765 109305809 114464177 119297970 124241860 129892763 135939385
14288A35939385O114013O298380P100391P169261P846442Q529428Q468476R064822
$$ 135939385 142053398 148351778 155452169 162621430 170467872 178997300 187465776 196530598
14280A96530598R535783J0401996J0793470J1263587J2039438J2638161J2753460
$$ 196530598 206066381 216468377 227261847 238525434 250564872 263203033 275956493
14273B75956493J3844684J3579692J3918372J4300333J4722330J4241098J4034200
$$ 275956493 289801177 303380869 317299241 331599574 346321904 360563002 374597202
14266C74597202J2794832J2193843J1145093J0348261R272120Q499524Q182711
$$ 374597202 387392034 399585877 410730970 421079231 430351351 438850875 447033586
14259D47033586O715578L913995J566482J569514K291417k453244o281264q993036
$$ 447033586 453749164 457663159 459229641 460799155 463090572 460637328 454356064 445363028
14251D45363028r513593j1053220j2198581j1891898j3206646j3364001j4102051
$$ 445363028 435849435 424796215 412597634 400705736 387499090 374135089 360033038
14244C60033038j3790684j3992446j4098594j3336500j3599306j2725030j2220930
$$ 360033038 346242354 332249908 318151314 304814814 291215508 278490478 266269548
14237B66269548j1999195j2006141j1979331j1256822j0936509j0472649r565071
$$ 266269548 254270353 242264212 230284881 219028059 208091550 197618901 188053830
14230A88053830r407744q317457p964382q063458p008702p081174o420288n542453
$$ 188053830 178646086 170328629 162364247 154300789 147292087 140210913 133790625 128248172
14222A28248172n687113n070143n071877m840803m316772m533047l228243m329766
$$ 128248172 122561059 117490916 112419039 107578236 103261464 98728417 95500174 91170408
14214I1170408l276102l412462l052312l191873l008739k422039k925478k086985
$$ 91170408 87894306 84481844 81429532 78237659 75228920 72806881 69881403 67794418
14206F7794418k486958k121139k000490k154204k380318j519995j471963j447646
$$ 67794418 65307460 63186321 61185831 59031627 56651309 55131314 53659351 52211705
14198E2211705j819144j469567j620972j542137q89288j459533p48651j386425
$$ 52211705 50392561 48922994 47302022 45759885 44870597 43411064 42662413 41275988
14190D1275988j275334j056487j204084m97481j134257r43631r44937j236210
$$ 41275988 40000654 38944167 37740083 37242602 36108345 35164714 34219777 32983567
14182C2983567n08028j234017n96109p51572n70460q00302p52011n14714p62982
$$ 32983567 32475539 31241522 30645413 29893841 29323381 28523079 27771068 27256354 26493372
14173B6493372n07217o00482p78652n12864j59089p90070k59806p90534l38225
$$ 26493372 25986155 25385673 24607021 24094157 23935068 23144998 22885192 22094658 21756433
14164B1756433m97061o79429k14285l01943o47033m01540m19450K7841k68192
$$ 21756433 21259372 20579943 20365658 20063715 19416682 19015142 18595692 18623533 18355341
14155A8355341q60919k90554j04563p69924P0306k9057l13388p23021r1197p9047
$$ 18355341 17494422 17203868 17099305 16329381 16399687 16370630 16057242 15334221 15243024 15163977
14145A5163977k63921l03712l82252k71718j01907m54331J65197m29779j86747
$$ 15163977 14900056 14596344 14214092 13942374 13840467 13386136 13551333 13121554 12934807
14136A2934807n9811k83401k30418l41092n64753K05415j58311j16297l20739
$$ 12934807 12874996 12591595 12361177 12020085 11455332 11660747 11502436 11386139 11065400
14127A1065400J38482n27359J26906Q4029n29187k48309l33844K05911K0029j51565
$$ 11065400 11203882 10676523 10803429 10887458 10358271 10109962 9776118 9982029 10002058 9850493
14117I850493m39840j16589J22352m08626l77948L78135n47608K78843k15806
$$ 9850493 9410653 9294064 9416416 9007790 8629842 9007977 8460369 8739212 8523406
14108H523406n3020j84647Q7663o20399j04127j9019J47998k28925j16941k47275
$$ 8523406 8470386 8285739 8373402 7753003 7648876 7629857 7777855 7548930 7431989 7184714
14098G184714K74097n4859l34293R3610K0900l61557J50620l36793K88448o55551
$$ 7184714 7458811 7403952 7069659 7163269 7184169 6822612 6973232 6636439 6924887 6269336
14088F269336N5761p8907J96158l7153k30444P7719j50549m75096N08931l92685
$$ 6269336 6325097 6246190 6442348 6405195 6174751 6252470 6101921 5626825 6135756 5743071
14078E743071M19983m36395j81056L82991j63121r0833p4946k36271P786n04164
$$ 5743071 6163054 5726659 5545603 5928594 5765473 5674640 5599694 5363423 5371209 4867045
14068D867045L95583j2263j32706l65176K95982j23513l8047J94784l23205l31673
$$ 4867045 5262628 5250365 5117659 4752483 5048465 4924952 4886905 5081689 4758484 4426811
14058D426811m9368N44487l82212J35719l46988K29188k77544j358J62893k97424
$$ 4426811 4377443 4921930 4539718 4675437 4328449 4557637 4280093 4278735 4441628 4144204
14048D144204o4746j63816N96454l69737Q4486m88499J83050m6244O0030o7365
$$ 4144204 4079458 3915642 4512096 4142359 4226845 3738346 3921396 3875152 3935182 3867817
14038C867817k65348r1304J99449J00945l24194J32344j61644n554o8020P7711
$$ 3867817 3602469 3511165 3710614 3811559 3487365 3619709 3458065 3452511 3384491 3462202
14028C462202p0734J2998j37910K19365l19097J43213j48462J56269R4261J10830
$$ 3462202 3391468 3404466 3266556 3485921 3166824 3310037 3161575 3317844 3412105 3522935
14018C522935J23766k35096r0980j01555k7439K2514k33701K06727j52454l0148
$$ 3522935 3646701 3411605 3320625 3219070 3191631 3214145 2980444 3187171 3034717 3004569
14008C004569R6830l19313K78069j46794m16035M82045l50132L17809o60328N99314
$$ 3004569 3101399 2782086 3060155 2913361 2497326 2979371 2629239 2947048 2286720 2886034
13998B886034q0523k33471q2560N5062j95645P2695j3352j94125M42865l44751
$$ 2886034 2805511 2572040 2489480 2544542 2348897 2421592 2408240 2214115 2656980 2312229
13988B312229L70153j49368k24675J6350j80313M40826K5010r8117R1809K47768
$$ 2312229 2682382 2533014 2308339 2324689 2144376 2585202 2610212 2512095 2603904 2851672
13978B851672N45953K93685M21729O72612J971504L585092N696285J1252155N871157
$$ 2851672 3397625 3691310 4113039 4785651 6757155 10342247 16038532 27290687 33161844
13969C3161844j2190752p979089l717838k356676j183327r04066k99882n46301
$$ 33161844 20971092 12992003 9274165 6917489 5734162 4830096 4530214 3983913
13961C983913j79744m49746j224p1469l89602K95409k11171l24271J45569k53379
$$ 3983913 3804169 3354423 3353199 3281730 2892128 3187537 2976366 2652095 2797664 2544285
13951B544285J54107J16896o42107M59635l70438J4114J01080r558l65067J02412
$$ 2544285 2698392 2815288 2173181 2632816 2262378 2276492 2377572 2368014 2002947 2105359
13941B105359L63434n79339K29632l61085P72122m75322J65428j64480J2966q647
$$ 2105359 2468793 1889454 2119086 1758001 2530123 2054801 2220229 2055749 2068715 2060068
13931B060068k59849J78061l26719k00867M12079K08097j8244j28900K96211l71507
$$ 2060068 1800219 1978280 1651561 1450694 1862773 2070870 2052626 1923726 2219937 1848430
13921A848430l8559m1964k6511J03969j09843j15726L5715j23198J69138M2600
$$ 1848430 1809871 1767907 1741396 1845365 1735522 1619796 1655511 1532313 1701451 1744051
13911A744051O6022J38279j05602K9434k20083j55198K91716j80344j19223M28730
$$ 1744051 1810073 1948352 1842750 1872184 1652101 1496903 1788619 1608275 1489052 1917782
13901A917782k58961Q4207l12982K8188M5857K6760J8202J01077l15348M30823
$$ 1917782 1658821 1743028 1430046 1458234 1504091 1530851 1549053 1650130 1334782 1765605
13891A765605n24654J90194K17828k98746K97531j14886j63980K46440J67573
$$ 1765605 1240951 1431145 1648973 1350227 1647758 1532872 1368892 1615332 1782905
13882A782905l10603j78261J22440K86628J6612k99463K123r3570J48191n4998
$$ 1782905 1472302 1294041 1416481 1703109 1719721 1420258 1422381 1328811 1477002 1422004
13872A422004r0477j87210J92713R0856r5228O4827j47441R1278j86358L5320
$$ 1422004 1331527 1144317 1337030 1427886 1332658 1397485 1250044 1341322 1154964 1190284
13862A190284J30394l8441N9655j94468J68188j27277O4115j92318J54487J93090
$$ 1190284 1320678 1282237 1341892 1147424 1315612 1188335 1252450 1060132 1214619 1407709
13852A407709k45381j67731J85333Q5234K3964K0072o3395l51867J20796Q2534
$$ 1407709 1162328 994597 1179930 1265164 1289128 1309200 1245805 893938 1014734 1097268
13842A097268P2506l16249K65483j65422K40142K39257o9364l02525j65289M15103
$$ 1097268 1169774 853525 1119008 953586 1193728 1432985 1363621 1061096 895807 1310910
13832A310910k59116O5764m3214J37194R5667n3280n3595P9915l85997L44707
$$ 1310910 1051794 1117558 1074344 1211538 1307205 1253925 1200330 1280245 894248 1238955
13822A238955q956j67041j17661j34643M43879j78634q0966n9779j58316L75545
$$ 1238955 1229999 1062958 945297 810654 1254533 1075899 994933 935154 776838 1152383
13812A152383k58199N7992J83691O2387l0536k66469P8161J9410l31462J95044
$$ 1152383 894184 952176 1135867 1198254 1167718 901249 979410 998820 667358 862402
13802H62402j39536K4303M22454k21258k75847J92512k81019M73916l624k47850
$$ 862402 722866 747169 1169623 948365 672518 865030 584011 1057927 1054303 806453
13792H06453K94199l00104K20431L61052n09837J42780l04215K83078J96910k48859
$$ 806453 1100652 800548 1020979 1382031 872194 1014974 710759 993837 1190747 941888
13782I41888o6258k07688L05624k7238o4602j46154L04249j63085N4659k40489
$$ 941888 875630 667942 973566 946328 881726 735572 1039821 876736 931395 690906
13772F90906N5511N4456J6994Q4401p5917l81923L28751R4093j05441j45837L02929
$$ 690906 746417 800873 817867 902268 826351 444428 773179 867272 761831 615994 918923
13761I18923k17053k58747J59761o5736K14620R8139j15865J78097k19756L78440
$$ 918923 701870 443123 602884 537148 751768 849907 734042 912139 692383 1070823
13751A070823m31434K63J84947k36858L22111r8814k42994J63233o3099L2487
$$ 1070823 639389 639652 824599 587741 909852 811038 568044 731277 668178 700665
13741G00665K00429j2197k33698K8252J6981K3383k85366L26194l44841L17931
$$ 700665 901094 888897 655199 683451 700432 723815 438449 764643 419802 737733
13731G37733l38157L48502K08328m69142J94169J99829l37607K45424k18045j16997
$$ 737733 399576 748078 956406 487264 681433 881262 543655 789079 571034 454037
13721D54037J99792K26135C95532J4006K02975k30844q7656J92444M44478k94503
$$ 454037 653829 879964 395532 409538 612513 381669 294013 486457 930935 636432
13711F36432j28482K71036L9109C66655K38093r6284R8995O8952K56886l17877
$$ 636432 507950 778986 818095 366655 604748 508464 607459 676411 933297 615420
13701F15420N5959l18992J20623B04404L52062Q7601l05810M13490J8440l18847
$$ 615420 671379 352387 473010 204404 556466 644067 338257 751747 770187 451340
13691D51340M62375k57911k38858M3009j63247K08702J54017B75234L4993J68094
$$ 451340 913715 655804 416946 459955 296708 505410 659427 275234 310227 478321
13681D78321L48650D02071M94j1362L47846k33341J07584j118B50407J49820j74181
$$ 478321 826971 402071 402565 391203 739049 505708 613292 612174 250407 400227 226046
13670B26046O6605J55912j91065N64446j63323j78077M8213L0166m6417N6861
$$ 226046 292651 448563 257498 821944 658621 480544 528757 558923 512506 569367
13660E69367J06456j63083m0891J47711A27689L50962J53858l4592o385k51058
$$ 569367 675823 512740 471849 619560 127689 478651 632509 597917 591532 340474
13650C40474J02595K6362K2097M235B39161M04068K80300C76782K9723L4578K65411
$$ 340474 443069 469431 491528 495763 239161 643229 923529 376782 406505 441083 706494
13639G06494l51077K63834R5919k53176j17459K22243j41105N6751A62910j5581
$$ 706494 355417 619251 715170 461994 344535 566778 425673 482424 162910 147329
13629A47329M11334p5530j44115K22961j86247J58206K23223B76014L22584k70217
$$ 147329 558663 483133 339018 561979 375732 533938 757161 276014 598598 328381
13619C28381M87775k44998j34159j10435J63070K18473l24274l8890j9711M04124
$$ 328381 816156 571158 436999 326564 489634 708107 383833 344943 325232 729356
13609G29356J51515C33971K9357p1003J30171k7852n3314j13176J30002K26390
$$ 729356 880871 333971 363328 292325 422496 394644 341330 228154 358156 584546
13599E84546B34153K98950J9176k26680J85041n4627A20267J20853o8389M05672
$$ 584546 234153 533103 552279 325599 510640 456013 120267 241120 172731 578403
13589E78403m1804k28960k9005J88284J26467k56360m4118K53944r1634J67937
$$ 578403 536599 307639 278634 466918 593385 337025 292907 546851 455217 623154
13579F23154k59224j54845L49300o2935k41438K69804k61849J32829A62244K74145
$$ 623154 363930 209085 558385 495450 254012 523816 261967 394796 162244 436389
13569D36389B03019L48732l9252k1392B36433K23284B01578L20370A30130J41699
$$ 436389 203019 551751 512499 491107 236433 459717 201578 521948 130130 271829
13559B71829j5960L28575r1552j87979L8504P9702o112q7232J69593A06825J35536
$$ 271829 255869 584444 492892 304913 343417 423119 417007 329775 499368 106825 242361
13548B42361q5146L89621j58414j53556K92008j03074q7415K02693E9712K58362
$$ 242361 157215 546836 388422 234866 526874 423800 336385 539078 59712 318074
13538C18074J38068J65232K2983j12546e6285H0497L21514j21695J06857J10168
$$ 318074 456142 621374 644357 531811 -56285 80497 402011 280316 387173 497341
13528D97341J05659k25684p0298J2008j7663o3657a52818B62176j5881M15916
$$ 497341 603000 377316 307018 319026 301363 237706 -152818 262176 246295 662211
13518F62211j88305j53589J5693j10181M19594B24942P6845b4805A31686J61947
$$ 662211 473906 320317 336010 225829 645423 224942 301787 -24805 131686 293633
13508B93633R3241d6786B18724K51840o8684j02699J04306r5304j1302L170J74779
$$ 293633 386874 -46786 218724 470564 401880 299181 403487 308183 296881 300051 474830
13497D74830N5735j76363I1070L53185j75456J9700j23371J24832j36729F2606
$$ 474830 530565 354202 91070 444255 268799 288499 165128 289960 153231 62606
13486C87476n577j02068j23302L49183o1333A84340E7921Q7502R6611A06221c0090
$$ 387476 381899 279831 156529 505712 444379 184340 57921 145423 242034 106221 -30090
13474D15208R7855a6903A47007L2882K55618B14787a80675C42758q4392I3645
$$ 415208 513063 -16903 147007 179889 435507 214787 -180675 342758 258366 93645
13463C56990n0175P4753q5075O9073K23750k32825j47159O8202r6189q7715M39997
$$ 356990 306815 381568 296493 365566 589316 356491 209332 277534 181345 93630 533627
13452E33627B19845K38173j37724j02611k7379J82056A46958K75438m7998j25988
$$ 533627 219845 458018 320294 217683 190304 372360 146958 422396 374398 248410
13442B48410k5354l1328J64569A30273P8805r3052O3881k3747P1056L22305A82091
$$ 248410 223056 191728 356297 130273 209078 116026 179907 156160 227216 549521 182091
13430C25251m9202a2875C17470q7972K56384n6826i6784H1959a42156I8191L46671
$$ 325251 276049 -12875 317470 229498 485882 429056 -96784 81959 -142156 98191 444862
13419D44862f7813B67336H3483J9866J36075J52676n7882A17797A7374J61352
$$ 444862 -67813 267336 83483 103349 239424 392100 334218 117797 17374 178726
13409A78726F2497d0075D19135j5012j7498A92230J3840l9485j1175l2609L26448
$$ 178726 62497 -40075 419135 404123 386625 192230 206070 166585 155410 122801 449249
13398D49249q5597K29347C069O97466h441B62714j06273J78823A39977F3696P1584
$$ 449249 363652 592999 3069 700535 -8441 262714 156441 335264 139977 63696 135280
13387A35280L95257B52903a78843A11950J05278K24929A54692R2468m805B372
$$ 135280 530537 252903 -178843 111950 217228 442157 154692 247160 242355 2372
13376B88505j17823P1985L4737A28427P9290K47323k21003R840L80976A04129
$$ 288505 170682 242667 277404 128427 207717 455040 234037 243877 624853 104129
13365G8102J53940J17275j9009C6178J89475L17135q9791A21898K94662D9265
$$ 78102 232042 349317 330308 36178 225653 542788 452997 121898 416560 49265
13354D31019r2686B3587L58184B291J41477J27779R2106o9150A46290m3659K82990
$$ 431019 338333 23587 381771 2291 143768 271547 363653 294503 146290 102631 385621
13343C85621a8819A15890Q1726J72504O2134j28039k5619A19987N3791C8541K02643
$$ 385621 -18819 115890 197616 370120 432254 304215 278596 119987 173778 38541 241184
13332B41184m664O2540A27284K11863H2374K54147A64799O6689M20938k40504
$$ 241184 236520 299060 127284 339147 82374 336521 164799 231488 652426 411922
13322D11922j58434n4249q904a266E26655A18859J91451A32934K05118o2566j06901
$$ 411922 253488 199239 190335 -1266 526655 118859 310310 132934 338052 275486 168585
13311A68585J4299M9712L06944A49619g9317C54088j67977J04868A15080J23098
$$ 168585 182884 232596 539540 149619 -79317 354088 186111 290979 115080 238178
13301B38178j13910J46129O9456O4441C566J16430J70436J8503L3603j15939C2907
$$ 238178 124268 270397 339853 404294 3566 119996 290432 308935 342538 226599 32907
13289A28045K22038j10430a25936C26382A6500g7262A25391J68883b79919C113
$$ 128045 350083 239653 -125936 326382 16500 -77262 125391 294274 -279919 3113
13278B55604H1319J76298A24463L25186G4968b34781D03301l6220A57344K54670
$$ 255604 81319 257617 124463 449649 74968 -234781 403301 367081 157344 412014
13268D12014j83888P1649e7431I1060h0311A74178P280o0894J06835I4267A8013
$$ 412014 228126 299775 -57431 91060 -80311 174178 181458 120564 227399 94267 18013
13256B80364D4024K74915B8921c5019j31801A77624J57801I7171J60866J0833
$$ 280364 44024 318939 28921 -35019 -166820 177624 335425 97171 258037 268870
13246B68870D3385O5497J20231C1766d499B08119b5881r165F5677M8765M29191
$$ 268870 43385 108882 229113 31766 -4499 208119 -25881 -35046 65677 114442 543633
13235E43633B20219k3958M0206e5002B04086c0880D6329J25444m3042d3696A72556
$$ 543633 220219 196261 236467 -55002 204086 -30880 46329 171773 128731 -43696 172556
13223D09207B8659K25780j07523R8018a80886A94015R441R2651H9587L01129a05130
$$ 409207 28659 254439 146916 244934 -180886 194015 203456 296107 89587 390716 -105130
13211B51791e0845C35405j9660G7850K95779a39880A36068J40213p4417I2243
$$ 251791 -50845 335405 315745 77850 373629 -139880 136068 276281 201864 92243
13200B44891m1958L5215B6859R3009O3103J66613g390B78387j14329K9272F5811
$$ 244891 202933 238148 26859 119868 182971 349584 -7390 278387 164058 193330 65811
13188D64891e9679j38883C19148A10749J22299D6357P738I549M22077j62181b85810
$$ 464891 -59679 -198562 319148 110749 233048 46357 54095 9549 431626 269445 -285810
13176A71382D7534N3784e4644A74247R9626a54175I8633k1303P2531Q6396a47178
$$ 171382 47534 101318 -54644 174247 273873 -154175 98633 77330 149861 236257 -147178
13164A28663L48489C8814a73213B49775b024r3105A08618J30071a65855B58022
$$ 128663 477152 38814 -173213 249775 -2024 -95129 108618 238689 -165855 258022
13153D29691a8278C79939j54630E7312J38808G5474i220A63533M6267J42047A591
$$ 429691 -18278 379939 225309 57312 196120 75474 -9220 163533 209800 351847 1591
13141B00314h3082D5421a82601B91527E3616K9373N6454b98694A11063b32289
$$ 200314 -83082 45421 -182601 291527 53616 82989 139443 -298694 111063 -232289
13130a0583A9342b06019o2892A38304k3782L71413A43358a29314o1349A49722
$$ -10583 19342 -206019 -268911 138304 114522 485935 143358 -129314 -190663 149722
13119B30169b79022H0978h1236d920A5221h091o314C66023j28949i2220D5539
$$ 230169 -279022 80978 -81236 -4920 15221 -8091 -14405 366023 237074 -92220 45539
13107A08225c0963A61974F2746J5543J95108a51404d2681o4469k06855a00277
$$ 108225 -30963 161974 62746 78289 273397 -151404 -42681 -107150 -314005 -100277
13096E3766J1704i0188c7376A3273L9058d9162q7136E4505a89393P2149A94201
$$ 53766 65470 -90188 -37376 13273 52331 -49162 -136298 54505 -189393 -117244 194201
13084C0253K02108b29061b1980B30417b68434R3024B880K04599j00090R0936r1988
$$ 30253 232361 -229061 -21980 230417 -268434 -175410 2880 207479 107389 198325 106337
13073A06337f9453B86902j30298o6059R5143j8869b31751D17628A34099j8384
$$ 106337 -69453 286902 156604 90545 185688 166819 -231751 417628 134099 115715
13063A15715j7318J67314h9402G4054J65951c0125q976a7872A75192J6237a0106
$$ 115715 98397 265711 -89402 74054 240005 -30125 -39101 -17872 175192 191429 -10106
13051b67577B61552k9371g8282E8304R7745K87154B0399K02851p9080J27154O329
$$ -267577 261552 232181 -78282 58304 156049 443203 20399 223250 144170 271324 277653
13040B77653A15986J93970e38A91751k9405J96144A65722g418A75802F3862a33750
$$ 277653 115986 309956 -538 191751 162346 358490 165722 -7418 175802 63862 -133750
13028H1351f0551E7556K39933B4038J55725q3165k736a93595R469b8865D9350
$$ 81351 -60551 57556 297489 24038 179763 96598 93862 -193595 -184126 -28865 49350
13016G8731J00192q1462K094K4632J9037J50480j26171L07762A58496a85691g270
$$ 78731 178923 97461 99555 124187 143224 293704 167533 475295 158496 -185691 -7270
13004c5146A64397a50294A12895M6958h2269B1166R2663K17135J7628E8331J66752
$$ -35146 164397 -150294 112895 159853 -82269 21166 113829 330964 348592 58331 225083
12993B25083n4352N3379a54258D9146J25832L0335l4326E1896a607B66902a0868
$$ 225083 170731 224110 -154258 49146 174978 205313 170987 51896 -1607 266902 -10868
12981g2578k0947A34809a25074A18453J43869b45971J05228A91814k2518b09775
$$ -72578 -93525 134809 -125074 118453 262322 -245971 -140743 191814 169296 -209775
12970h3781C70808k9716A60946a39487G2183b00450G9065N490K8971J9028c27462
$$ -83781 370808 341092 160946 -139487 72183 -200450 79065 84555 113526 132554 -327462
12958a82353B71882e02350B0942K44118j07702c5815n461d880m6849k8542j14612
$$ -182353 271882 -502350 20942 265060 157358 -35815 -41276 -4880 -51729 -80271 -194883
12947a94883C50901j4409J37247C6119b043F594a04151l9604B11030G4586K5191
$$ -194883 350901 336492 473739 36119 -2043 6594 -104151 -143755 211030 74586 99777
12936I9777J40926j12977J52281L939o4070I871K45756b14804H297c51343N0000
$$ 99777 240703 127726 280007 283946 219876 9871 255627 -214804 8297 -351343 -301343
12925c01343B73956a50310M9507I2864N422b65H1818a19651A48894J08767C5212
$$ -301343 273956 -150310 -100803 92864 98286 -265 81818 -119651 148894 257661 35212
12913a11984n339A53168D7642b7794E81138A2425J0126g5906H6351J0190A2386
$$ -111984 -117323 153168 47642 -27794 581138 12425 22551 -75906 86351 96541 12386
12901c5852B1160b39548E8525P9354c5469A3693K3729g6560A01319i7997G3288
$$ -35852 21160 -239548 58525 137879 -35469 13693 37422 -76560 101319 -97997 73288
12889B32686I0311A2141J24921i4093B68127M3644a91684D05500A16748J35124
$$ 232686 90311 12141 137062 -94093 268127 311771 -191684 405500 116748 251872
12879B51872L298d68481D8279K84891a55812C5006K9482a11241K3843C10342A456
$$ 251872 255170 -468481 48279 333170 -155812 35006 64488 -111241 -87398 310342 1456
12867B77201G0429J42569r4916K53081f3194I9439b6496A74060I562d0870A21481
$$ 277201 70429 212998 118082 371163 -63194 99439 -26496 174060 9562 -40870 121481
12855h98A01771A213h5967I1195h9802B82266M4808h8718A82287M3897a55975
$$ -898 101771 1213 -85967 91195 -89802 282266 327074 -88718 182287 226184 -155975
12843a58170B10792G6257p700M1035k4208b97893A23273l339C015b77463c9328
$$ -158170 210792 76257 68557 109592 85384 -297893 123273 119934 3015 -277463 -39328
12831C92594A28664a47075A26976l5534a4291A50863d46986d6967K0787A73989
$$ 392594 128664 -147075 126976 91442 -14291 150863 -446986 -46967 -26180 173989
12820A67756L6469F1180g2343n7487a717A22069O0855p6349A5544f4905a895H1022
$$ 167756 204225 61180 -72343 -129830 -1717 122069 182924 106575 15544 -64905 -1895 81022
12807B15811a21815D0731J17623a58221I3169C5911f3293B13103n9688p0031a90797
$$ 215811 -121815 40731 158354 -158221 93169 35911 -63293 213103 153415 83384 -190797
12795C0655J9217N0213g144D29582A95193a17545A5411K75072a46336g918j31844
$$ 30655 49872 100085 -7144 429582 195193 -117545 15411 290483 -146336 -7918 -139762
12784a39762O6304p1375A70933d2318G1024H744J63609C2647d21820f2715F6387
$$ -139762 -73458 -144833 170933 -42318 71024 8744 172353 32647 -421820 -62715 66387
12772B48099a65898A48302B7845i0605a2692j88416E12P344b43848i6373b9559
$$ 248099 -165898 148302 27845 -90605 -12692 -201108 512 7856 -243848 -96373 -29559
12760b22685a05246c4376A90272B8167a38347N8843B83764F7024K7206b28204
$$ -222685 -105246 -34376 190272 28167 -138347 -79504 283764 67024 94230 -228204
12749I9032i7117h13B045K7692b09486c8705F8893d7938l22729H8481B6550g0981
$$ 99032 -97117 -813 2045 29737 -209486 -38705 68893 -47938 -370667 88481 26550 -70981
12736C7768J21382o5900b08053q4281G638J43289D212M7374d1110A38130k5314
$$ 37768 159150 93250 -208053 -292334 7638 150927 4212 51586 -41110 138130 112816
12725A12816M8121a8430A01018M3871a34846K2415F370f5681n6011F6037P8098
$$ 112816 160937 -18430 101018 144889 -134846 -112431 6370 -65681 -121692 66037 144135
12714A44135R6133e5185C8907K15863d2741B66922A30437Q6743a24615G8695A5987
$$ 144135 240268 -55185 38907 254770 -42741 266922 130437 217180 -124615 78695 15987
12702c05293B12644g5488l73596d3337A53301f2791C05508A2007k411O6960j7040
$$ -305293 212644 -75488 -449084 -43337 153301 -62791 305508 12007 9596 76556 59516
12691E9516O6705a0578A77353J99668J26895a71007B13326M3854A5607a2763A33426
$$ 59516 126221 -10578 177353 377021 503916 -171007 213326 257180 15607 -12763 133426
12679G4830A872J65083f4197a820A40521j7760a8678A4041a00233B72356p7223
$$ 74830 1872 166955 -64197 -1820 140521 122761 -18678 14041 -100233 272356 195133
12668A95133k8515J69627A51293b25263C23890A35102a17336j6135B9186c6689
$$ 195133 166618 336245 151293 -225263 323890 135102 -117336 -133471 29186 -36689
12657D8301J13592M2315I1606J00470k4256E68J48394b48625C06511G1522K93774
$$ 48301 161893 204208 91606 192076 167820 568 148962 -248625 306511 71522 365296
12646C65296j18856c1250p959j06892A52748J5295J08997H2107N311N45289h5884
$$ 365296 246440 -31250 -39209 -146101 152748 168043 277040 82107 87418 632707 -85884
12634f5793l7732A13411b0934e36A26071c37098A31369N884O7935M3281M9987
$$ -65793 -103525 113411 -20934 -536 126071 -337098 131369 137253 205188 248469 298456
12623B98456D1691K66310A28809E4429J4943r90L74614A51107M9541K0906J25393
$$ 298456 41691 308001 128809 54429 69372 68382 442996 151107 200648 221554 346947
12612C46947A34073N59536A18357a50557A12236K64481r8000a47193B32826B183
$$ 346947 134073 693609 118357 -150557 112236 376717 278717 -147193 232826 2183
12601a04494B46015a44474B30028I2133J49886b3011A4858K84073a3199B35767
$$ -104494 246015 -144474 230028 92133 242019 -23011 14858 298931 -13199 235767
12590A41074L30481G1982K97402C9587b2257A11087h9253B08028b11750k2629
$$ 141074 471555 71982 369384 39587 -22257 111087 -89253 208028 -211750 -234379
12580b34379M0844P7351A17694m0579P4086M5236K7430c7446A67719O6211N9407
$$ -234379 -193535 -116184 117694 77115 151201 196437 223867 -37446 167719 233930 293337
12569B93337a17566e8138K5683G9769a56148A10189r394g7467C55820A04978Q9672
$$ 293337 -117566 -58138 -32455 79769 -156148 110189 100795 -77467 355820 104978 194650
12558A94650J19677A31685b75985A09783J83894A38184J466c16053E1857A8224
$$ 194650 314327 131685 -275985 109783 293677 138184 139650 -316053 51857 18224
12547a51949G9520J94475a99529B10804a63501I3630f8697A39261E0854a51341
$$ -151949 79520 273995 -199529 210804 -163501 93630 -68697 139261 50854 -151341
12536A71237J83105Q8020i5583A50699e0840k19357i5021m6948b4144j1101J5382
$$ 171237 354342 442362 -95583 150699 -50840 -270197 -95021 -141969 -24144 -35245 -19863
12525a9863M75A46987q629M9527C4436j1909J14917m1467R3856R0570i3291A34395
$$ -19863 -19388 146987 138358 187885 34436 22527 137444 95977 189833 280403 -93291 134395
12512E8337L5786M19258I0156c467B46356r2642a99101f4919D6549K97582b25114
$$ 58337 94123 513381 90156 -3467 246356 153714 -199101 -64919 46549 344131 -225114
12500C00995a11791M9043C19351a07535B02327R7379R3a10284j09036C11767a45989
$$ 300995 -111791 -62748 319351 -107535 202327 299706 299799 -110284 -219320 311767 -145989
12488C3096J66569K4522A9707J42557a46591A31230k3369g998H9587b1714a0620
$$ 33096 199665 224187 19707 162264 -146591 131230 107861 -7998 89587 -21714 -10620
12476a1468o7881I6585a08378q417D7846g4864o8866I680Q6169i5479j70283B2656
$$ -11468 -79349 96585 -108378 -116795 47846 -74864 -143730 9680 95849 -95479 -265762 22656
12463a43912j53467q1518P9259h1765j69851B87986I5563a46964A3684J28002
$$ -143912 -297379 -378897 -299638 -81765 -251616 287986 95563 -146964 13684 141686
12453A41686c08830k1170O4957l3020B47201H8888J10183n2219D8093i208p7751
$$ 141686 -308830 -330000 -265043 -298063 247201 88888 199071 146852 48093 -9208 -86959
12442h6959B08066j9705f0891J0401q2342I6945j2280J61736a50171c3207J1252
$$ -86959 208066 188361 -60891 -50490 -132832 96945 84665 246401 -150171 -33207 -21955
12431b1955j83411N8272e2910K5340B92648I8308f4918p1570D8392a14264A33407
$$ -21955 -205366 -147094 -52910 -27570 292648 98308 -64918 -136488 48392 -114264 133407
12419a1308j26560l6900A72448c53263B53868A05138J7479J50528p6031k0937
$$ -11308 -137868 -174768 172448 -353263 253868 105138 122617 273145 197114 176177
12409A76177a18872r0138F068J95607j0983A789L01634A30325c14270A03363b22878
$$ 176177 -118872 -209010 6068 201675 190692 1789 303423 130325 -314270 103363 -222878
12397b28175D5106K7448J09024K5527f0044B0172g7947j87534k9662h0464H2497
$$ -228175 45106 72554 181578 207105 -60044 20172 -77947 -265481 -295143 -80464 82497
12385a00485D3778c09664f6098q9866B03472l5240a1975A41392B2621c66618a56097
$$ -100485 43778 -309664 -66098 -155964 203472 168232 -11975 141392 22621 -366618 -156097
12373a83396P8571D4598D309f3021p28G5702K7963l3007d55147B51789j10195
$$ -183396 -104825 44598 4309 -63021 -63749 75702 103665 70658 -455147 251789 141594
12362A41594k7758b02565B378N9495R5200c51292A5638K07009D9963a89192e5341
$$ 141594 113836 -202565 2378 61873 157073 -351292 15638 222647 49963 -189192 -55341
12350a40564J7370C47971i0452B23689a19421j77774P1372A58951b95949h4207
$$ -140564 -123194 347971 -90452 223689 -119421 -297195 -225823 158951 -295949 -84207
12339f7563K6040j33745A69782a00266o2591g3819j9661A6448c63286A90658A8260
$$ -67563 -41523 -175268 169782 -100266 -162857 -73819 -93480 16448 -363286 190658 18260
12327b17448A18179J33295a34788H5868C0000c2871q4829F5737f8670A0915J60502
$$ -217448 118179 251474 -134788 85868 30000 -32871 -117700 65737 -68670 10915 171417
12316A71417i1175A49869l4630e5924E0968h4994A31704F2550i8840F3471d43411
$$ 171417 -91175 149869 115239 -55924 50968 -84994 131704 62550 -98840 63471 -443411
12304E6675b59483b3223l3360n7642c6096B61834M8328m2308O0255A16542A0674
$$ 56675 -259483 -23223 -56583 -114225 -36096 261834 310162 267854 328109 116542 10674
12292A7035Q3498m2369L6557m7088M8377P9066R9190a43320D0043K2744b5571
$$ 17035 100533 58164 94721 47633 96010 175076 274266 -143320 40043 62787 -25571
12280F2099a84652A09036E3471c4880D70633A63423e0280k30187A27466L5127
$$ 62099 -184652 109036 53471 -34880 470633 163423 -50280 -280467 127466 162593
12270A62593k002G9091B9353J07556b2862l91097b164A70926J24417k4100j29568
$$ 162593 160591 79091 29353 136909 -22862 -413959 -2164 170926 295343 271243 141675
12259A41675a5169B36429A11718J32137c0668B27666a59135G5520k2588j5534
$$ 141675 -15169 236429 111718 243855 -30668 227666 -159135 75520 52932 37398
12249C7398f772C11845f6605B03186o970j9277J5014b6112I8757K11101j11059
$$ 37398 -6772 311845 -66605 203186 196216 176939 191953 -26112 98757 309858 198799
12238A98799J36071A8941a88589h4173L2343k28518c0631k907A18077K4669K1994
$$ 198799 334870 18941 -188589 -84173 -51830 -280348 -30631 -33538 118077 142746 164740
12227A64740B1063K05132q3890b68789A48905L0148n7057a2640j67588h4927B70067
$$ 164740 21063 226195 142305 -268789 148905 179053 121996 -12640 -180228 -84927 270067
12215A47937L21151A63482K62443E2710O1332h9854A92809a3271B48928K35397
$$ 147937 469088 163482 425925 52710 114042 -89854 192809 -13271 248928 484325
12205D84325k22563j23114O3715K10066A21417J00223q4277g1454B32020I3024
$$ 484325 261762 138648 202363 412429 121417 221640 137363 -71454 232020 93024
12194I8280J16301J46844j56267i5525B22325M3692i418B74125n5108j09455B2019
$$ 98280 214581 361425 205158 -95525 222325 266017 -9418 274125 219017 109562 22019
12182C02885n8026R8312j47422A5224e8579B10957O8897p9302e1919D0766N2828
$$ 302885 244859 343171 195749 15224 -58579 210957 279854 200552 -51919 40766 93594
12171I3594J87560M8042e801j3968A54617J4394F5841a82878B65288E1381K3696
$$ 93594 281154 329196 -5801 -19769 154617 169011 65841 -182878 265288 51381 75077
12160G5077b3989j24194p7620A28912b54771A3111K551L69022A85313p319d7162
$$ 75077 -23989 -148183 -225803 128912 -254771 13111 15662 384684 185313 177994 -47162
12148D33825q3019g3423B93399b69989C63759D737g7336A89771A5535J36568j6461
$$ 433825 350806 -73423 293399 -269989 363759 4737 -77336 189771 15535 152103 135642
12137A35642R2688a26799e1382B00836b03412A21585h790A77225a55484g4211
$$ 135642 228330 -126799 -51382 200836 -203412 121585 -8790 177225 -155484 -74211
12126a02670B22473c8332A84672m8406a04293A59641L4086a31029B45203j11364
$$ -102670 222473 -38332 184672 136266 -104293 159641 193727 -131029 245203 133839
12116A33839N2647f2356B48583j0010O7825b7159j24228C19060a22817c5870j39174
$$ 133839 186486 -62356 248583 238573 306398 -27159 -151387 319060 -122817 -35870 -175044
12105a75044P8500j651A5292a8174k02141E6131b15736A37391A7175f3326o7802
$$ -175044 -96544 -98195 15292 -18174 -220315 56131 -215736 137391 17175 -63326 -131128
12094a31128F5445A464K52242i7219D10637j67717a36917o8991C7461g3246a003
$$ -131128 65445 1464 253706 -97219 410637 242920 -136917 -205908 37461 -73246 -1003
12082a75945N9983k4012e8449B63907l6607p3954N0277R8901r9683A6214k724
$$ -175945 -115962 -139974 -58449 263907 227300 153346 203623 302524 202841 16214 13490
12071A3490J59273P010e9469N384B02485J76687a89672D4964L26803N43027L46444
$$ 13490 172763 179773 -59469 -54085 202485 379172 -189672 44964 371767 914794 1261238
12060A261238k7285C90131j02851E6237M482e9484k35165A22286a67699L9942
$$ 1261238 1233953 390131 287280 56237 60719 -59484 -294649 122286 -167699 -127757
12050a27757F3485a35721b5895j48774B07979p0749E6216d2348j25635A75109
$$ -127757 63485 -135721 -25895 -174669 207979 137230 56216 -42348 -167983 175109
12039b53916B49689A00618g7990D6012K95326F9038a80843B00341B8026a05129
$$ -253916 249689 100618 -77990 46012 341338 69038 -180843 200341 28026 -105129
12028b21931F4391a84140Q6847I8969a740k11789q5564E0564g2836l8710A60042
$$ -221931 64391 -184140 -97293 98969 -1740 -213529 -299093 50564 -72836 -111546 160042
12016H2742b94792E566N6061c29607A35961a62551q4235j7838A12673J54087b09992
$$ 82742 -294792 5566 61627 -329607 135961 -162551 -246786 -264624 112673 266760 -209992
12004i8834D36378e8381A60197e8237A5846K04180a86231f4435j09521B38945
$$ -98834 436378 -58381 160197 -58237 15846 220026 -186231 -64435 -173956 238945
11993a20171j9865e1248N145f448C3367l550q406d04758E4045L4855P2139J22852
$$ -120171 -140036 -51248 -46103 -6448 33367 29817 21411 -404758 54045 88900 161039 283891
11981B83891d51411B1408K05325q6847a96960L2886B72072c1177B99895J63992
$$ 283891 -451411 21408 226733 139886 -196960 -164074 272072 -31177 299895 463887
11971D63887a29930B10573e6570F5903h2958G9553J26513G3904K21506A2568b39979
$$ 463887 -129930 210573 -56570 65903 -82958 79553 206066 73904 295410 12568 -239979
11959h6276b1549A11586J609d0190A99993I6347D4239a98087f0733J2984H1438
$$ -86276 -21549 111586 113195 -40190 199993 96347 44239 -198087 -60733 -47749 81438
11947G8029J44637e0150a1280m4368N810A4002M8261a66408B52848a28846n2961
$$ 78029 222666 -50150 -11280 -55648 -49838 14002 62263 -166408 252848 -128846 -181807
11936a81807q5262J31804j62605E8777f5432b9967A88294C8468b2277j68479B08974
$$ -181807 -267069 -135265 -297870 58777 -65432 -29967 188294 38468 -22277 -190756 208974
11924G2690e3609k9444B68952c5345I4298c7915G138a7719E09K26734n9128I400
$$ 72690 -53609 -83053 268952 -35345 94298 -37915 7138 -17719 509 227243 168115 9400
11911E0151a69740F4434a58217B01465b41293i207j48607B27696a09714H4652
$$ 50151 -169740 64434 -158217 201465 -241293 -9207 -157814 227696 -109714 84652
11900A01560b34515C6441g8858j84851i7154I3008a8242C5478a06861q7407h7129
$$ 101560 -234515 36441 -78858 -263709 -97154 93008 -18242 35478 -106861 -194268 -87129
11888A14974N3084d2114B54220c4359B73795h5124p4322B1167R1756b98812D6498
$$ 114974 168058 -42114 254220 -34359 273795 -85124 -159446 21167 112923 -298812 46498
11876E2488a84785K6800J2027D0990a01439l73666A17181J62944a53524m5721
$$ 52488 -184785 -157985 -145958 40990 -101439 -475105 117181 280125 -153524 -199245
11866a99245D1660b008A27009b91923c5803H3089O2195i192B19479d0550C0604
$$ -199245 41660 -2008 127009 -291923 -35803 83089 145284 -9192 219479 -40550 30604
11854a47694o7540o2309E7538P8250a25493l1654L2272B21014c22858F9053N2901
$$ -147694 -215234 -277543 57538 135788 -125493 -157147 -124875 221014 -322858 69053 121954
11843A21954C4114a51499b4265B37357a10000A94444R2390A40881k3915K9930
$$ 121954 34114 -151499 -24265 237357 -110000 194444 286834 140881 116966 146896
11833A46896b05821A21946d08440a61903C5271b63994C90651j43666a44774D6410
$$ 146896 -205821 121946 -408440 -161903 35271 -263994 390651 246985 -144774 46410
11822H7732c33459e3819C86J22785C1341a57450L5287C5758b29869B9107g8786
$$ 87732 -333459 -53819 386 123171 31341 -157450 -122163 35758 -229869 29107 -78786
11810A46014a13673e1040D165a02303L5I2742d41337J55629M9990B14321B8963
$$ 146014 -113673 -51040 4165 -102303 -102268 92742 -441337 -285708 -235718 214321 28963
11798a3966k92258E7690c34694a664F0248h6497A0787a40055o5623B300L83656
$$ -13966 -306224 57690 -334694 -1664 60248 -86497 10787 -140055 -205678 2300 385956
11787C85956b87956d4076C96803B2032L88803a88079B4661b71096a05470j84524
$$ 385956 -287956 -44076 396803 22032 410835 -188079 24661 -271096 -105470 -289994
11777b89994h2423k7564j9123j64901a3887B5269b77118h1159a0024k15247G4541
$$ -289994 -82423 -109987 -129110 -294011 -13887 25269 -277118 -81159 -10024 -225271 74541
11765E5096r160f4303j07154N2816I8911k295a01944F9240B9330a35958A80693
$$ 55096 45936 -64303 -171457 -118641 98911 96616 -101944 69240 29330 -135958 180693
11753A36390b51004A83847J13540H8811J7298n1858J83708D9198a49908j59832
$$ 136390 -251004 183847 297387 88811 106109 54251 237959 49198 -149908 -309740
11743c09740c7987k30019A85371A6912O5200c19162a54907j20929i9681D6969
$$ -309740 -37987 -268006 185371 16912 82112 -319162 -154907 -275836 -99681 46969
11732B4040d8604j11427A01333D1556L6032A2236R7391N845i3072C36157A01690
$$ 24040 -48604 -160031 101333 41556 77588 12236 109627 115472 -93072 336157 101690
11720A95983K18161h4187n9805E1043J17776d4343A35935D594K74349A0492J48940
$$ 195983 414144 -84187 -143992 51043 168819 -44343 135935 4594 278943 10492 159432
11709A59432J48744j53696J70243B439f1706k24070c6569j06094B97893p0323
$$ 159432 308176 154480 324723 2439 -61706 -285776 -36569 -142663 297893 227570
11699B27570A9221b53256C1710K59481A27980a48821K7645N4585B4763J27878
$$ 227570 19221 -253256 31710 291191 127980 -148821 -121176 -66591 24763 152641
11689A52641F313J68229f5157j82803B64339e49663A63942o6074a59296C6184
$$ 152641 6313 174542 -65157 -247960 264339 -549663 163942 97868 -159296 36184
11678B94114B7510n162P0186k174k3963a22174A76975J8416J5458I7836i9544
$$ 294114 27510 22348 92534 90360 66397 -122174 176975 195391 210849 97836 -99544
11666A86677j4449B4311K89755A43769a31237D0410a2451B58304J959c06419F8688
$$ 186677 172228 24311 314066 143769 -131237 40410 -12451 258304 260263 -306419 68688
11654a07854J5716B75089a31186k162A47231m8967i9174F2220i9801E0952j7013
$$ -107854 -92138 275089 -131186 -133348 147231 98264 -99174 62220 -99801 50952 33939
11643C3939a9452l20194A44308G983i5718a8665B74737j25820D6423b97965i3389
$$ 33939 -19452 -339646 144308 7983 -95718 -18665 274737 148917 46423 -297965 -93389
11631d0447o6908B1501J24454P2171J3251F7321c2978l8990A70029N2151e05734
$$ -40447 -107355 21501 145955 218126 231377 67321 -32978 -71968 170029 222180 -505734
11619A65149d6263j45306E3925M6035K13009B0896K5009L39148j29871o6690b2721
$$ 165149 -46263 -191569 53925 99960 312969 20896 45905 385053 255182 188492 -22721
11607a39930H516a9871A72453R2066i2891D4866c14472A38523b68026a03365j80914
$$ -139930 8516 -19871 172453 264519 -92891 44866 -314472 138523 -268026 -103365 -284279
11596b84279J08883A69496a18774j55752G5851h247B04926p438l7444P492j80
$$ -284279 -175396 169496 -118774 -274526 75851 -8247 204926 197488 160044 167536 167356
11585A67356A4898a62712A08691n2128K48703e3309B43668m2167i9327G4571r092
$$ 167356 14898 -162712 108691 56563 305266 -53309 243668 201501 -99327 74571 65479
11574F5479a55743A15918J9897F3648b35854J01643o9011B13935q4091f3660C00162
$$ 65479 -155743 115918 135815 63648 -235854 -134211 -203222 213935 129844 -63660 300162
11562C17757j12366e6524C38895g8317J1142A65771J20910r2801c4501B47736
$$ 317757 205391 -56524 338895 -78317 -67175 165771 286681 193880 -34501 247736
11551B96151F7524b01924A32523a53600e4547J9716A62778C3513M7137L0787f7775
$$ 296151 67524 -201924 132523 -153600 -54547 -34831 162778 33513 80650 111437 -67775
11539C9006a70802A81684K41737b75197b4214k12613b0648j48764D72378c88001
$$ 39006 -170802 181684 423421 -275197 -24214 -236827 -20648 -169412 472378 -388001
11528A45010K41403c1528A50688j6404C8389i2568A12001n2233J50549C5077O2384
$$ 145010 386413 -31528 150688 134284 38389 -92568 112001 59768 210317 35077 97461
11517I7461a01689A04347Q8812A4536J36461a09536d596B46640I661R4646P6011
$$ 97461 -101689 104347 193159 14536 150997 -109536 -4596 246640 9661 104307 180318
11506A80318D9624J21193R3998F362P6509a62875G8154P3611F9511J98761j31740
$$ 180318 49624 170817 264815 6362 82871 -162875 78154 151765 69511 268272 136532
11495A36532J66947R2311B7206K16446a77018f6322B80402a09874A65419K07556
$$ 136532 303479 395790 27206 243652 -177018 -66322 280402 -109874 165419 372975
11485C72975j30790k2731g7387j18367A79066A6656K12841j8390H0167f8617B57875
$$ 372975 242185 219454 -77387 -195754 179066 16656 229497 211107 80167 -68617 257875
11473B5609b3133c831A54431B2279L64187G3755K7854J59055I7156R2459q8959
$$ 25609 -23133 -3831 154431 22279 386466 73755 101609 260664 97156 189615 100656
11462A00656J89839b5960J0064B6686J22957g6320J2566e476C63763O805j79068
$$ 100656 290495 -25960 -15896 26686 149643 -76320 -63754 -5476 363763 370568 191500
11451A91500n7022K61983j17157A26359b5671B17521a6954A80668M7726q586n6764
$$ 191500 134478 396461 279304 126359 -25671 217521 -16954 180668 228394 219808 163044
11440A63044J4545C1945e5557B70433b67310B55822o1850q1142D765L26672A38913
$$ 163044 177589 31945 -55557 270433 -267310 255822 193972 112830 4765 331437 138913
11428D44222a5566D8624K70959A51794d2531C1917d078j86047Q5134A53514m8026
$$ 444222 -15566 48624 319583 151794 -42531 31917 -4078 -190125 -104991 153514 105488
11417A05488L10648j32954A3338K36866b41466j13754A03798a16997B27292I9478
$$ 105488 416136 283182 13338 250204 -241466 -355220 103798 -116997 227292 99478
11406B32318D5610b0850F1693R2698a5115D791g057B36543b43736H8717R3602
$$ 232318 45610 -20850 61693 154391 -15115 4791 -7057 236543 -243736 88717 182319
11395A82319k4148Q3910H2962J58866a97153A46761L9625d3749D0478f9185B13992
$$ 182319 158171 242081 82962 241828 -197153 146761 186386 -43749 40478 -69185 213992
11383E2084d2438C9816a43485A11182N8055G594J53928g3401k59285a10050k44235
$$ 52084 -42438 39816 -143485 111182 169237 7594 161522 -73401 -332686 -110050 -354285
11372c54285a68666J0772n9818A66735a70709B08961a76979F2294J51666f882
$$ -354285 -168666 -157894 -217712 166735 -170709 208961 -176979 62294 213960 -6882
11361C01417a01405A42541a91063C59871b7123j4443C54890A60979g6157F3069
$$ 301417 -101405 142541 -191063 359871 -27123 -41566 354890 160979 -76157 63069
11350d0386r4875A02434a63374C77216G8487K1148c57619B78053A00045J86979
$$ -40386 -135261 102434 -163374 377216 78487 99635 -357619 278053 100045 287024
11340B87024K07525c26451D4293O548a53394j5932f58A73655b9573B44891e1663
$$ 287024 494549 -326451 44293 50841 -153394 -169326 -658 173655 -29573 244891 -51663
11328H2946N1939c9733A45226K94383b77868N5993A17665b13999A91289J27495
$$ 82946 134885 -39733 145226 439609 -277868 -221875 117665 -213999 191289 318784
11318C18784a47095B84828r4228a84500H2962i6249J294c3184o8445D56819B9001
$$ 318784 -147095 284828 190600 -184500 82962 -96249 -94955 -33184 -101629 456819 29001
11306c54225a20510b0298A40317a07656F1577a42514j30240G3388a04384d531
$$ -354225 -120510 -20298 140317 -107656 61577 -142514 -272754 73388 -104384 -4531
11295A47893J05014F3623K7118a88082j58577A43321J50134A09177c17146R8340
$$ 147893 252907 63623 90741 -188082 -346659 143321 293455 109177 -317146 -218806
11285b18806B25906d7679C13426A45548h0951F0208a4128k36838k8150E765J5235
$$ -218806 225906 -47679 313426 145548 -80951 60208 -14128 -250966 -279116 5765 21000
11274B1000b25940h4618q6084r066n524q4785A53586K7282a6677j65805C3002
$$ 21000 -225940 -84618 -170702 -179768 -185292 -270077 153586 180868 -16677 -182482 33002
11262a20629k48255d3424B50664F7765g1656q1364F6226R8057m8939J26583a3300
$$ -120629 -368884 -43424 250664 67765 -71656 -153020 66226 164283 115344 241927 -13300
11250d07289a10645C2732c08952B77330a53938A71592J00840a80689j0839A2485
$$ -407289 -110645 32732 -308952 277330 -153938 171592 272432 -180689 -191528 12485
11239C9588c09177a14256n5928C98743I5738R5997h4963j69536H1313a90414o9076
$$ 39588 -309177 -114256 -170184 398743 95738 191735 -84963 -254499 81313 -190414 -259490
11228b59490C4294d6861k41159h8111A10138a8930k28765Q0951m1912h5618j05570
$$ -259490 34294 -46861 -288020 -88111 110138 -18930 -247695 -166744 -208656 -85618 -191188
11217a91188K197a7835p0399A5973L5568b49193h4032D6427a79330e6819j84915
$$ -191188 -188991 -17835 -88234 15973 51541 -249193 -84032 46427 -179330 -56819 -241734
11206b41734A2625L29907j66747a72312A28967B5908b19025e5705A77338m3556
$$ -241734 12625 342532 175785 -172312 128967 25908 -219025 -55705 177338 133782
11196A33782P5371K11755a07790b9247l74957a75910j61654a59973l7658h9904
$$ 133782 209153 420908 -107790 -29247 -404204 -175910 -337564 -159973 -197631 -89904
11185h5031c6823n7563C8083J91337j13869b09195c9730A03015a19546j00128
$$ -85031 -36823 -94386 38083 229420 115551 -209195 -39730 103015 -119546 -219674
11175b19674A60034a47361o8734D97256a94888f6089j80048h4857A29568b01012
$$ -219674 160034 -147361 -216095 497256 -194888 -66089 -246137 -84857 129568 -201012
11164A85278c3026G5481J68819b6923A83611J1284a77474j64104A05168d61005
$$ 185278 -33026 75481 244300 -26923 183611 194895 -177474 -341578 105168 -461005
11153B1853a59284c8666j58968p1202I1124c3964k5670r1870j1159O8828b0896
$$ 21853 -159284 -38666 -197634 -268836 91124 -33964 -59634 -151504 -162663 -93835 -20896
11141b57151q5411m4709i1011k34905e1868i060l1693H6899a43422D8897J41731
$$ -257151 -342562 -387271 -91011 -325916 -51868 -9060 -40753 86899 -143422 48897 190628
11130A90628p6109e7188k6972k6612J3425A99202k8184P2932D1339K38315l9912
$$ 190628 114519 -57188 -84160 -110772 -97347 199202 171018 243950 41339 279654 239742
11119B39742g3148C71529A47314B8612K66516D9655c24307A21601d100r1873N596
$$ 239742 -73148 371529 147314 28612 295128 49655 -324307 121601 -4100 -95973 -90377
11108i0377A6546K19695C0417a32303B43577B4614b07646b2060p9674A03946J35255
$$ -90377 16546 236241 30417 -132303 243577 24614 -207646 -22060 -101734 103946 239201
11097B39201a39962l1168I421i5271K7488o843A76551L28045I6131a02959a2361
$$ 239201 -139962 -171130 9421 -95271 -67783 -74626 176551 504596 96131 -102959 -12361
11085A51032B436J84755d5862A30094L93327e42B87957l1119A00784J79553l659
$$ 151032 2436 187191 -45862 130094 523421 -542 287957 256838 100784 280337 276678
11074B76678K4344j38620n0766b40231B03016Q2524n4680k3838J66917K23884
$$ 276678 301022 162402 111636 -240231 203016 285540 230860 207022 373939 597823
11064E97823B79851m3467K51193P1369j58993I2110K1103j829N09875k85769l4176
$$ 597823 279851 236384 487577 558946 399953 92110 113213 111384 621259 335490 301314
11053C01314P8818l4948J06636K65671l27241O700J73957k53536K69073k40678
$$ 301314 380132 345184 451820 717491 390250 396950 570907 317371 586444 345766
11043C45766J35983J09358L72383D77206K72391C32585N30663k43694k69264N89015
$$ 345766 481749 591107 963490 477206 749597 332585 863248 619554 350290 939305
11033I39305l66802L2919J48994K37822R2872E17073K76251o4750O5645k3026
$$ 939305 572503 605422 754416 992238 1085110 517073 793324 728574 794219 771193
11023G71193j00400m67K14062k46255N84895n08402R7714l80830K01235o1216
$$ 771193 670793 670326 884388 638133 1223028 714626 812340 431510 632745 571529
11013E71529N8703J82605j33224K25570j94052j32049J29426j79043P9474J21306
$$ 571529 630232 812837 679613 905183 711131 579082 708508 529465 608939 730245
11003G30245k9494r5236J79568K23769l98962R8611J25222l17202K24155l57369
$$ 730245 700751 605515 785083 1008852 609890 708501 833723 516521 740676 383307
10993C83307N67194k27413j93722O1403J539r136K5911q8785K53737j79670N5520
$$ 383307 950501 723088 529366 590769 592308 583172 609083 520298 774035 594365 649885
10982F49885j94050Q7555B69426N86283J03542N5916j4053q0893r4450j50754
$$ 649885 455835 543390 269426 855709 959251 1015167 1001114 920221 825771 675017
10972F75017K53802P5012R5571j17340J92264k59423K88573O4158K82284j96987
$$ 675017 928819 1003831 1099402 982062 1174326 914903 1203476 1267634 1549918 1352931
10962A352931O24837k50307K21274J0999Q76196l2495L1537J67077Q5121m49799
$$ 1352931 1977768 1727461 1948735 1959734 2835930 2803435 2834972 3002049 3087170 2637371
10952B637371J73225m49701q6524j20451k23419R321n44817M68988m0281L5230
$$ 2637371 2810596 2360895 2274371 2153920 1930501 1939822 1395005 1863993 1823712 1858942
10942A858942l41541K30877J39426l06640J79903o4004p66666K00230j33605k99009
$$ 1858942 1517401 1748278 1887704 1581064 1760967 1696963 930297 1130527 996922 697913
10932F97913j94443k7560J16062k08892J72096J17438B30402k3911M656j5306
$$ 697913 503470 475910 591972 383080 555176 672614 230402 206491 211147 195841
10922A95841a56901A43400E9583K56923d047C12331j55277a7005A89363b1879
$$ 195841 -156901 143400 59583 316506 -4047 312331 157054 -17005 189363 -21879
10911B8008b3128m3753A04190C4141R3351b07612N6004m4190h6863m376j99054
$$ 28008 -23128 -66881 104190 34141 127492 -207612 -151608 -195798 -86863 -91239 -290293
10900b90293J26894L8061c3887B8530L06565E4455b19945P2584B93799C2736P737
$$ -290293 -163399 -125338 -33887 28530 335095 54455 -219945 -147361 293799 32736 40473
10889D0473b18285J107C614H35J45254C0080b0605A59845L8554D371K8402n229
$$ 40473 -218285 -217178 3614 835 146089 30080 -20605 159845 198399 4371 32773 27544
10877B7544J1977J13361d2538j4793j07120K0004l32852C29243A45086b5249H1225
$$ 27544 39521 152882 -42538 -57331 -164451 -144447 -477299 329243 145086 -25249 81225
10865e5024B6634b4966r9440j9728C5542L4232a36300B15741c05565g0851C07900
$$ -55024 26634 -24966 -124406 -144134 35542 69774 -136300 215741 -305565 -70851 307900
10853B30467b65513c4254E1359L1613R5066A8070P946R1004a4974D3024J59211
$$ 230467 -265513 -34254 51359 82972 178038 18070 26016 117020 -14974 43024 202235
10842B02235a93743C3467f8933A94286O4432n3620q1122k2870J57777q6125b92278
$$ 202235 -193743 33467 -68933 194286 258718 205098 123976 101106 258883 172758 -292278
10830G2630J35213h6007j3081B08532a32380F623i4809A74261E0974b59469A7811
$$ 72630 207843 -86007 -99088 208532 -132380 6623 -94809 174261 50974 -259469 17811
10818d7709A84a00671C1194N6258K22732a19341D3365a22291C59050A76991N4479
$$ -47709 184 -100671 31194 87452 310184 -119341 43365 -122291 359050 176991 231470
10807B31470e7624o9696A30048d1414j46514A82680a2039A53687e2760J0972r444
$$ 231470 -57624 -127320 130048 -41414 -187928 182680 -12039 153687 -52760 -41788 -51232
10796e1232k87727B8224h3838I0358a13549K9082A0240h4894E7920N7672c7742
$$ -51232 -338959 28224 -83838 90358 -113549 -84467 10240 -84894 57920 115592 -37742
10784E06560b27873g217j49784p1159A6129b48420l4450a39374k1340c0071j85407
$$ 506560 -227873 -7217 -157001 -228160 16129 -248420 -282870 -139374 -160714 -30071 -215478
10773b15478k5409Q5995j5325d3032j27930a5081j69102i497m1753A33301a68108
$$ -215478 -240887 -154892 -170217 -43032 -170962 -15081 -184183 -9497 -51250 133301 -168108
10761B6543a05395d9050k62775d831A63208F4133a5197o0160p4906j8564A9706
$$ 26543 -105395 -49050 -311825 -4831 163208 64133 -15197 -75357 -150263 -168827 19706
10749c94367C16480a24534L9824q330l853H3893P5921c13233J36403G7276a34112
$$ -394367 316480 -124534 -84710 -93040 -96893 83893 159814 -313233 -176830 77276 -134112
10737A38496A9558K8073a3452A14822b37873i5652H9345e73A95869b60189a3610
$$ 138496 19558 47631 -13452 114822 -237873 -95652 89345 -573 195869 -260189 -13610
10725C32093c10127f0743j26152I2087a58132A21511a942m9196l5490D2403P2604
$$ 332093 -310127 -60743 -186895 92087 -158132 121511 -1942 -51138 -86628 42403 115007
10714A15007a88510A27405B9531M10781a51144k33156g7828l0011D7461b31363
$$ 115007 -188510 127405 29531 440312 -151144 -384300 -77828 -107839 47461 -231363
10703A2702b86368H5060B5361J97764c92450A22810F511L35351i0060J3355K1837
$$ 12702 -286368 85060 25361 223125 -392450 122810 6511 341862 -90060 -76705 -54868
10692e4868Q775B23081A06606b02558B11185I1516a27599B8220e0289j77575d785
$$ -54868 -46093 223081 106606 -202558 211185 91516 -127599 28220 -50289 -227864 -4785
10680A86248b42429B2534P7604h8056D3376c3042A35369i3140f814j44711g0205
$$ 186248 -242429 22534 100138 -88056 43376 -33042 135369 -93140 -6814 -151525 -70205
10668i7284k16186i6244A49533D2190a98658o4329B19839A06298a322B1558J23642
$$ -97284 -313470 -96244 149533 42190 -198658 -262987 219839 106298 -1322 21558 145200
10657A45200f2581j39824n704f1932L0507A97684a79184c0257E2428g7044f54
$$ 145200 -62581 -202405 -208109 -61932 -31425 197684 -179184 -30257 52428 -77044 -654
10645a34064I0252D472Q5605E512c46396e2974B6227g2770q0109M5243k74375
$$ -134064 90252 4472 90077 5512 -346396 -52974 26227 -72770 -152879 -107636 -382011
10634c82011J20631N0742j27114F2516I592a43701F714a9392A1413i1956A11715
$$ -382011 -261380 -210638 -337752 62516 9592 -143701 6714 -19392 11413 -91956 111715
10622a39611j04150B13022a01314k93961a70469M6039D25440D0916i9241l19742
$$ -139611 -243761 213022 -101314 -395275 -170469 -124430 425440 40916 -99241 -418983
10612d18983a12969K7537B63681a38470o2596g5718r9498g6755j58110l0155A23197
$$ -418983 -112969 -85432 263681 -138470 -201066 -75718 -175216 -76755 -234865 -265020 123197
10600a23284b8043k78187e595D527M7489P6271b1560f145B75375b14064J3497
$$ -123284 -28043 -306230 -5595 4527 52016 128287 -21560 -6145 275375 -214064 -200567
10589b00567N1613l9736a2675A21353J40034I1940m0726k2451c23467b0479k47163
$$ -200567 -148954 -188690 -12675 121353 261387 91940 51214 28763 -323467 -20479 -267642
10578b67642B26128p7080k5981b46082B5354f1553j26486p6165B02406c49415
$$ -267642 226128 149048 123067 -246082 25354 -61553 -188039 -264204 202406 -349415
10567e2184B131a38150e6665E02572a06363B02596c01577A34081b30957l2161
$$ -52184 2131 -138150 -56665 502572 -106363 202596 -301577 134081 -230957 -263118
10557b63118B79720a40667l0435P9098A25924e6761A84130a17114j58491b7252
$$ -263118 279720 -140667 -171102 -92004 125924 -56761 184130 -117114 -275605 -27252
10546C57254A42753N6883K7608D9126a55007e3680j691A13401a06417B1346c2349
$$ 357254 142753 199636 227244 49126 -155007 -53680 -55371 113401 -106417 21346 -32349
10534a85331n8109h0385L6467Q120n5070p5320Q0777a3836o3417D13381a508n10569
$$ -185331 -243440 -80385 -43918 -35798 -90868 -166188 -85411 -13836 -77253 413381 -1508 -512077
10522e12077A28621d6811E51786h1441K3357I8631J94781A28648b55110A43029
$$ -512077 128621 -46811 551786 -81441 -58084 98631 293412 128648 -255110 143029
10511b19457h7678o9065C35828A269c36277c2061A27199a27091A52017E0068c07456
$$ -219457 -87678 -156743 335828 1269 -336277 -32061 127199 -127091 152017 50068 -307456
10499A65853a73317F4600c81657f9106A59673k8213C8020K02469b04896m3110
$$ 165853 -173317 64600 -381657 -69106 159673 131460 38020 240489 -204896 -248006
10489b48006N3413C9569a7974k94811F3429J56135a75735B47873D8180a16100
$$ -248006 -194593 39569 -17974 -312785 63429 219564 -175735 247873 48180 -116100
10478C70298a52062e6417A6043K24752D7426a62802A23062b50437B36992d7569
$$ 370298 -152062 -56417 16043 240795 47426 -162802 123062 -250437 236992 -47569
10467H9655p673J71755J02819A74255R783a28318A57779L60020A95807c09279
$$ 89655 81982 253737 356556 174255 184038 -128318 157779 517799 195807 -309279
10456A67179C1790a54730b3915j82308L8809A50462a37240D0423b76494A88581
$$ 167179 31790 -154730 -23915 -206223 -167414 150462 -137240 40423 -276494 188581
10445c17163B53a11441A03636f7246K2954l8334B26655n7443a13612C29546h8964
$$ -317163 253 -111441 103636 -67246 -44292 -82626 226655 169212 -113612 329546 -88964
10433a60027A06759a1974j25796O7595A73706B9775a05303j27525E6344K892c9771
$$ -160027 106759 -11974 -137770 -70175 173706 29775 -105303 -232828 56344 59236 -39771
10421b18610B34520j14584a17315C7373a06554I8337h0096k65082A16030L6867
$$ -218610 234520 119936 -117315 37373 -106554 98337 -80096 -345178 116030 152897
10411A52897D3822g9521n8510L2149j68939a6833A80901b72D2857b31665B33110
$$ 152897 43822 -79521 -138031 -105882 -274821 -16833 180901 -272 42857 -231665 233110
10399B9802e57599D53183E2951d0810A7352d05282b9692D5288a29028A22068g6645
$$ 29802 -557599 453183 52951 -40810 17352 -405282 -29692 45288 -129028 122068 -76645
10387a62643e8371I5782b40219R8341G8818c5890A11981e336j63259A26982b3012
$$ -162643 -58371 95782 -240219 -141878 78818 -35890 111981 -5336 -168595 126982 -23012
10375a35517D9542a60744A76763o3738K09868j46566J32134b3576q2564p2D58959
$$ -135517 49542 -160744 176763 113025 322893 176327 308461 -23576 -106140 -106212 458959
10363B77070J28586j57557K0359M5236j25502B6142a12177F3402G116N8882L66045
$$ 277070 405656 248099 268458 313694 188192 26142 -112177 63402 7116 65998 432043
10352D32043M425j40913M19315k20641A49864K00223j21229K57476j70150P2459
$$ 432043 436468 295555 714870 494229 149864 350087 228858 486334 316184 388643
10342C88643j4439J9614m5915J82754B65223l7960K22960K05010k31713J97094
$$ 388643 374204 393818 347903 530657 265223 227263 450223 655233 423520 620614
10332F20614B25636L90965I7360L49732j2279n0362f6135k43012A55676G7196
$$ 620614 225636 616601 97360 447092 434813 384451 -66135 -309147 155676 77196
10321C39085j18053b7930B69863n5236G4796f9486K7962A25613e8658l3932D81561
$$ 339085 221032 -27930 269863 214627 74796 -69486 -41524 125613 -58658 -92590 481561
10309A05711f5829I2420c3358A6328q095K34922F3009R2341a06459C4382J40030
$$ 105711 -65829 92420 -33358 16328 8233 243155 63009 155350 -106459 34382 174412
10298A74412E2829L1644f238A45106D9071I681P2320c6599j24981f4790L0017
$$ 174412 52829 84473 -6238 145106 49071 9681 82001 -36599 -161580 -64790 -34773
10287c4773o2499C84115c1069C0477a5894A34186K8897j7007H93K18366a18310
$$ -34773 -97272 384115 -31069 30477 -15894 134186 163083 146076 893 219259 -118310
10275A63128a97590A42038a48594r1242A1320b65532f7606F2370e3008j37415
$$ 163128 -197590 142038 -148594 -239836 11320 -265532 -67606 62370 -53008 -190423
10265a90423F5776f7781A82736b03870A94495D681a37784A64785a86586I0476
$$ -190423 65776 -67781 182736 -203870 194495 4681 -137784 164785 -186586 90476
10254i6919A27553e605j9085o0176j46806i9697I5379J1641H268J14283L54630
$$ -96919 127553 -5605 -24690 -84866 -231672 -99697 95379 107020 8268 122551 477181
10243D77181k33433K0011j08221l9843J47992l6915c1166B36919k5714n4830E734
$$ 477181 243748 263759 155538 115695 263687 226772 -31166 236919 211205 156375 5734
10231a81347B29264I2600b90791J45202g417r4409c570o6616k69316M1474B10377
$$ -181347 229264 92600 -290791 -145589 -7417 -101826 -3570 -70186 -339502 -298028 210377
10219d44935a83021A12537b22734g9720o2228K5792j1386A0997b9709k02498j19036
$$ -444935 -183021 112537 -222734 -79720 -141948 -116156 -127542 10997 -29709 -232207 -351243
10208c51243h3816n2417B31592a6189E4911O1491a67915j19625I0663a13931A91592
$$ -351243 -83816 -136233 231592 -16189 54911 116402 -167915 -287540 90663 -113931 191592
10196b58196a01477b6990j03988j27973J03897C8173a96379A13873b86475B26483
$$ -258196 -101477 -26990 -130978 -258951 -155054 38173 -196379 113873 -286475 226483
10185A35949M282D8165b46577a02849E1691K6703e8503d324G0884a8892k30069
$$ 135949 140231 48165 -246577 -102849 51691 78394 -58503 -4324 70884 -18892 -248961
10174b48961A9580b22856L8643Q6560C1573j3792b046k34966O0355o3526O8695
$$ -248961 19580 -222856 -184213 -97653 31573 17781 -2046 -237012 -176657 -240183 -171488
10163a71488M4817n3097j61531J20008d4676P729F9143g4767j8113r3652P9889
$$ -171488 -126671 -179768 -341299 -221291 -44676 -36947 69143 -74767 -92880 -186532 -106643
10152a06643o6204o8653C5927M1496k0087b41536J18926J0487j39864o9156A49909
$$ -106643 -172847 -241500 35927 77423 57336 -241536 -122610 -112123 -251987 -321143 149909
10140A55899C9383b07821f867A64891g3280B1345b77687A4328c6407A63903P7910
$$ 155899 39383 -207821 -6867 164891 -73280 21345 -277687 14328 -36407 163903 241813
10129B41813g1165A6106J60363d2169p0399G1492d53948B70651a47312k03301
$$ 241813 -71165 16106 176469 -42169 -112568 71492 -453948 270651 -147312 -350613
10119c50613m2966a58472G4593J89895B330d97766b04769j1154a8848n5484a3434
$$ -350613 -393579 -158472 74593 264488 2330 -497766 -204769 -215923 -18848 -74332 -13434
10107c2415C10676a1405q0618J7158j2244b3307j32905k07822J14904A76470a17271
$$ -32415 310676 -11405 -92023 -74865 -87109 -23307 -156212 -364034 -249130 176470 -117271
10095f432j8632n4797m9123B19344B1746b1211l6414G7958b39776q7199M6735
$$ -6432 -25064 -79861 -128984 219344 21746 -21211 -57625 77958 -239776 -326975 -280240
10084b80240I4666J06712b19924B18761a2521H4495q363J0857a11697K1304n7699
$$ -280240 94666 201378 -219924 218761 -12521 84495 76132 86989 -111697 -90393 -148092
10073a48092N2095A05165d8376m06441a20647N4727B38034c97941g9088H9863
$$ -148092 -95997 105165 -48376 -454817 -120647 -65920 238034 -397941 -79088 89863
10062a12105N1405j3151q0950B10174b5570H6861L0544c3810m0718F5806a18350
$$ -112105 -60700 -73851 -154801 210174 -25570 86861 117405 -33810 -74528 65806 -118350
10050a39429k06112A36571b6415F6982b71916L2657h9629j17647A79464b75031
$$ -139429 -345541 136571 -26415 66982 -271916 -239259 -89629 -207276 179464 -275031
10039A97467d00783a60257M9055A8636K6072a2379A88322d12965a5636j72571
$$ 197467 -400783 -160257 -111202 18636 44708 -12379 188322 -412965 -15636 -188207
10029a88207A81756B6029K68022c71162b0959k30496l0781P0246B20998B5338
$$ -188207 181756 26029 294051 -371162 -20959 -251455 -282236 -211990 220998 25338
10018b23662a01693k35245a6463k71240A2907L1832K46864b9035A13276b61746
$$ -223662 -101693 -336938 -16463 -287703 12907 44739 291603 -29035 113276 -261746
10007a53882a9560B37079g6315A14108a59599g2118k97675a03796J5856D6503
$$ -153882 -19560 237079 -76315 114108 -159599 -72118 -369793 -103796 -87940 46503
9996F3213b17328h7164K7555A7256a75552j38944a23424m6120f1104k55637a51082
$$ 63213 -217328 -87164 -59609 17256 -175552 -314496 -123424 -169544 -61104 -316741 -151082
9984G747K134J05747a95458B43797i3252k31132i2664k42991J24402H9895Q9470
$$ 7747 9881 115628 -195458 243797 -93252 -324384 -92664 -335655 -211253 89895 179365
9973A79365A3478K94556c9775k8702h985p6190j9897q9617A0034a15873G9754
$$ 179365 13478 308034 -39775 -68477 -8985 -85175 -105072 -194689 10034 -115873 79754
9961B22145r5978b8867k74940J197F0461a19864k203C03732E7849d4792j79416
$$ 222145 126167 -28867 -303807 -302610 60461 -119864 -122067 303732 57849 -44792 -224208
9950b24208j07650D6473c8621k6392a4158B25209b79368C9072M2669e8627o013
$$ -224208 -331858 46473 -38621 -65013 -14158 225209 -279368 39072 81741 -58627 -64640
9939f4640q9451l27727a21495L0096m4061n5887A74505f8899k43609m6331D722
$$ -64640 -154091 -481818 -121495 -91399 -135460 -191347 174505 -68899 -312508 -358839 4722
9927b29924A28748A5343a49711f0303A61885g877D1460d25434h7314a8483j24066
$$ -229924 128748 15343 -149711 -60303 161885 -7877 41460 -425434 -87314 -18483 -142549
9916a42549f4950j36210P7658m8251A17460A820K03957a28372j06756h254k88814
$$ -142549 -64950 -201160 -123502 -171753 117460 1820 205777 -128372 -235128 -8254 -297068
9905b97068A29746b46447q565J11221l7627O4631j33205a8768k04143A90314h0825
$$ -297068 129746 -246447 -255012 -143791 -181418 -116787 -249992 -18768 -222911 190314 -80825
9893B81628h4549A61591l4076J0022F3196d7772j47879L4162j44875a43235C5970
$$ 281628 -84549 161591 127515 137537 63196 -47772 -195651 -161489 -306364 -143235 35970
9881a42218m091k3409m1092A2397b3913A38592e9468A374J85667n7691i6051j00383
$$ -142218 -146309 -169718 -210810 12397 -23913 138592 -59468 1374 187041 129350 -96051 -196434
9869a96434Q8659d5759j91408E9451J40898I9163b53253e0774j8443j40999J01296
$$ -196434 -107775 -45759 -237167 59451 200349 99163 -253253 -50774 -69217 -210216 -108920
9858a08920q4792A28795c62365a30922k76866a34982j16423J13980j91697J29752
$$ -108920 -193712 128795 -362365 -130922 -407788 -134982 -251405 -137425 -329122 -199370
9848a99370a3844m9037A27578P4127a22297k22942c0027j03437a4103k63153R6184
$$ -199370 -13844 -62881 127578 201705 -122297 -345239 -30027 -133464 -14103 -277256 -181072
9837a81072j56062a07107k91496a95893D45185A20580a34466d5592C397i7493
$$ -181072 -337134 -107107 -398603 -195893 445185 120580 -134466 -45592 3397 -97493
9826a49635g2190K7993j84269d3225j51270g3891b3229A20957q200m8669b41464
$$ -149635 -72190 -44197 -228466 -43225 -194495 -73891 -23229 120957 112757 64088 -241464
9814B08460b99990j35265e3334j89369b9459A31971Q4551a68067H216a69712B01244
$$ 208460 -299990 -435255 -53334 -242703 -29459 131971 216522 -168067 8216 -169712 201244
9802I2645F140a75169K323J0641H9975b89333j1537J39710I9682a13982b4179
$$ 92645 6140 -175169 -172846 -162205 89975 -289333 -300870 -161160 99682 -113982 -24179
9790A54259M623a66809L7003A2204f1341C46312c15086p5056A67310e76712a17461
$$ 154259 158882 -166809 -129806 12204 -61341 346312 -315086 -390142 167310 -576712 -117461
9778a43860F3039b4881A77876a19067k947j7389n893j469A23090c09979a02189
$$ -143860 63039 -24881 177876 -119067 -122014 -139403 -145296 -146765 123090 -309979 -102189
9766D8116J17270a87625m13794b25978D0820J14322b70281D0553f3442A03342
$$ 48116 165386 -187625 -601419 -225978 40820 155142 -270281 40553 -63442 103342
9755D561e7578j23400A88050b07388B9121g464j971k34271F0571a50527I1999
$$ 4561 -57578 -180978 188050 -207388 29121 -7464 -9435 -243706 60571 -150527 91999
9743B26486i2977A6469a17564a9390k19113A00150M9199a09998K9244A547a23283
$$ 226486 -92977 16469 -117564 -19390 -238503 100150 149349 -109998 -80754 1547 -123283
9731C8631P3675C3946P4284l6735a48708B3239b02539C5266b47625j5523B58994
$$ 38631 112306 33946 108230 71495 -148708 23239 -202539 35266 -247625 -263148 258994
9719A17239A0845e792j4011k77716A93824H2485c73580a30972A26083a77788k9393
$$ 117239 10845 -5792 -19803 -297519 193824 82485 -373580 -130972 126083 -177788 -207181
9708b07181C8851b35501E7940c68169a40450j12770I6892b5925B2378a96873F560
$$ -207181 38851 -235501 57940 -368169 -140450 -253220 96892 -25925 22378 -196873 6560
9696A45078o9756a47131H5772a86433K1244A61407Q428c61845i2613d0467a0642
$$ 145078 75322 -147131 85772 -186433 -165189 161407 169835 -361845 -92613 -40467 -10642
9684b49465j80449A77539a86564N7135k0978r5862a23078l0311G2130b55563L7740
$$ -249465 -429914 177539 -186564 -129429 -150407 -246269 -123078 -153389 72130 -255563 -217823
9673b17823C18874a45986e8590k20718o5737a32755R796I681K07936p6167C7602
$$ -217823 318874 -145986 -58590 -279308 -345045 -132755 -122959 9681 217617 141450 37602
9661C02035c45170A17872a76961C0582d87122A6984b028p1670r1440n6155C06602
$$ 302035 -345170 117872 -176961 30582 -487122 16984 -2028 -73698 -165138 -221293 306602
9649I914i5645k20836d9053j91541a0758k605j04780H236J79085o3626C4410A6322
$$ 9914 -95645 -316481 -49053 -240594 -10758 -13363 -118143 8236 187321 123695 34410 16322
9636A10848J08733b09867c5847A24609F1057b73978K4140b7280j993A29465a58443
$$ 110848 219581 -209867 -35847 124609 61057 -273978 -249838 -27280 -29273 129465 -158443
9624a84524B0692J46046H79M4720J01607a61253j12124R3093h6870c0585I9737
$$ -184524 20692 166738 879 45599 147206 -161253 -273377 -180284 -86870 -30585 99737
9612f8984a0823j92780A44741a94377C9652O6983a98792j98190b4968j51361N7458
$$ -68984 -10823 -203603 144741 -194377 39652 106635 -198792 -396982 -24968 -176329 -118871
9601a18871B7642d7425A34831J1338K0242N299E9478a06551E354i5099k18512
$$ -118871 27642 -47425 134831 146169 166411 171710 59478 -106551 5354 -95099 -313611
9590c13611O4669c1301j12053p3996e8172k66360J61446H1815G33g6765F5194
$$ -313611 -248942 -31301 -143354 -217350 -58172 -324532 -163086 81815 733 -76765 65194
9578c11183D3063d10569a44129J2732E5248m061a01916B35463h3277r587k60216
$$ -311183 43063 -410569 -144129 -131397 55248 51187 -101916 235463 -83277 -92864 -353080
9567c53080G166M6089j3464e5823j29723A05701d58886D92955d4600B09477n1603
$$ -353080 7166 53255 39791 -55823 -185546 105701 -458886 492955 -44600 209477 157874
9556A57874e38715A77352b48184e0448l5190A13003b20488h0015j8632C848a93573
$$ 157874 -538715 177352 -248184 -50448 -85638 113003 -220488 -80015 -98647 3848 -193573
9544i5926B75908J1500A16217C7912a92808h9131K6767O809m6817F297J66411
$$ -95926 275908 287408 116217 37912 -192808 -89131 -62364 -55555 -102372 6297 172708
9533A72708a01255e30E8190f9157A89200c13250a16038B9971d46464c6754j35455
$$ 172708 -101255 -530 58190 -69157 189200 -313250 -116038 29971 -446464 -36754 -172209
9522a72209G047c91543a32522d2720r770E0918b0374j97716f2484C3037b95778
$$ -172209 7047 -391543 -132522 -42720 -52490 50918 -20374 -218090 -62484 33037 -295778
9510A33775a12940L177j31270d545A19099a67511k79960g5069c2971B70105c12926
$$ 133775 -112940 -109763 -241033 -4545 119099 -167511 -447471 -75069 -32971 270105 -312926
9498F360e29509b02707B42849a30353B336g0679l89352D46256a49625j86340A25344
$$ 6360 -529509 -202707 242849 -130353 2336 -70679 -460031 446256 -149625 -335965 125344
9486A77578D0477j635b49974b1274A27513a702m1773l4057A02172a21007l00205
$$ 177578 40477 38842 -249974 -21274 127513 -1702 -43475 -77532 102172 -121007 -421212
9475d21212a23470G5081b18820m7735d8181I1388J10795a46347c5426q6368M7590
$$ -421212 -123470 75081 -218820 -266555 -48181 91388 202183 -146347 -35426 -121794 -74204
9464g4204n0774e6092a4858I3461a23644a5566g595H0873h2205k1593I3015a33438
$$ -74204 -124978 -56092 -14858 93461 -123644 -15566 -7595 80873 -82205 -103798 93015 -133438
9451b96972j49157J17157f3845B51288i0712j0314K7293A90477b0515j09398l16438
$$ -296972 -446129 -328972 -63845 251288 -90712 -101026 -73733 190477 -20515 -129913 -446351
9440d46351E7190B7188a2455k40646a17360A86551a26237A0529a07769k47597
$$ -446351 57190 27188 -12455 -253101 -117360 186551 -126237 10529 -107769 -355366
9430c55366A44187b09068d7086l5549m2417c9881A30116b84544B3325i7879n1746
$$ -355366 144187 -209068 -47086 -82635 -125052 -39881 130116 -284544 23325 -97879 -149625
9419a49625j46248i5648m960B7699g4620l4251B29260j12835a55258H009f5469
$$ -149625 -295873 -95648 -100608 27699 -74620 -108871 229260 116425 -155258 8009 -65469
9407a89537K4705M9966B50692b23919j16511A01581c0665m707A55835b71977C03019
$$ -189537 -164832 -114866 250692 -223919 -340430 101581 -30665 -35372 155835 -271977 303019
9395A87244E2782k3613a39290B6068d1201B76437b25753B4670J03748n5808j4937
$$ 187244 52782 29169 -139290 26068 -41201 276437 -225753 24670 128418 72610 57673
9384E7673a54063e3608B730a27968B68699H3906b07763b8628A55810a52889j27685
$$ 57673 -154063 -53608 2730 -127968 268699 83906 -207763 -28628 155810 -152889 -280574
9373b80574A62891b69205A67269L69116a52202B13851F5396d9867j72394a00344
$$ -280574 162891 -269205 167269 536385 -152202 213851 65396 -49867 -222261 -100344
9362a68384B53449A02296d0484m20507a3878A61857a16739k4681k24568N7254
$$ -168384 253449 102296 -40484 -460991 -13878 161857 -116739 -141420 -365988 -308734
9352c08734O8098B27078C6503c80405A27853g9880B9889c9772o9405J4638l51047
$$ -308734 -240636 227078 36503 -380405 127853 -79880 29889 -39772 -109177 -94539 -445586
9341d45586A08850b55442A34590c234m23901A41191d45883c2950k6857K4134a4535
$$ -445586 108850 -255442 134590 -3234 -427135 141191 -445883 -32950 -59807 -35673 -14535
9329e830l2888b718k0781E1887c9643j10291A86113b23156Q1790F1992C9a12708
$$ -5830 -38718 -2718 -23499 51887 -39643 -149934 186113 -223156 -141366 61992 39 -112708
9316i8920j52863E2224a70182A26548h839l5636q6480p9051L9764h1255j52180
$$ -98920 -251783 52224 -170182 126548 -8839 -44475 -130955 -210006 -170242 -81255 -233435
9305b33435D1594a13927d3854A74573b79630F9349J46538c1332G6289e8394B3940
$$ -233435 41594 -113927 -43854 174573 -279630 69349 215887 -31332 76289 -58394 23940
9293I2149g8104l2965A58728b98150i1877B88729E9625c44819b3938o46m3424
$$ 92149 -78104 -111069 158728 -298150 -91877 288729 59625 -344819 -23938 -24584 -68008
9282f8008A6058a54371A66651h720A06750I069i0273A91837J41199C414J19089
$$ -68008 16058 -154371 166651 -8720 106750 9069 -90273 191837 333036 3414 122503
9271A22503b08758h6340C96J1368N9073d8591F2594b28126j13172g6030A20139
$$ 122503 -208758 -86340 396 11764 70837 -48591 62594 -228126 -341298 -76030 120139
9259c12102J16153C089K45614d9970l44741h1986j2109K4597B94669g8336A82368
$$ -312102 -195949 3089 248703 -49970 -394711 -81986 -94095 -69498 294669 -78336 182368
9247h933k0772j70541e1490C34655b81180d2486B22455d84783B5378J44239a67353
$$ -8933 -29705 -200246 -51490 334655 -281180 -42486 222455 -484783 25378 169617 -167353
9235A56608a99315D9999b29653B01051b43143Q1732k34141H6178N5329n6704D1790
$$ 156608 -199315 49999 -229653 201051 -243143 -161411 -395552 86178 141507 84803 41790
9223F5901b05403m5882J7764J07499j26313H583a55284K8057O3231a9670G2189
$$ 65901 -205403 -251285 -233521 -126022 -252335 8583 -155284 -127227 -63996 -19670 72189
9211a76665o6912A41165d11959a21725A43830J15875a86865D7371R9801e01153
$$ -176665 -243577 141165 -411959 -121725 143830 259705 -186865 47371 147172 -501153
9200A0556K48477h7262A67813a28528A0221L13968i2562B5874N3446b07117K4653
$$ 10556 259033 -87262 167813 -128528 10221 324189 -92562 25874 79320 -207117 -182464
9189a82464k29522J59067R7358J1805B38726g9725r2247r7440J30667j16111J12319
$$ -182464 -411986 -252919 -155561 -143756 238726 -79725 -171972 -269412 -138745 -254856 -142537
9178a42537J0100H0441a4011A57561Q0114F7504M2947a6457A12601d4542j45630
$$ -142537 -132437 80441 -14011 157561 237675 67504 110451 -16457 112601 -44542 -190172
9167a90172c6697j81525A2182e9060p1072q958j27963J20254N9956B28132a03406
$$ -190172 -36697 -218222 12182 -59060 -130132 -139090 -267053 -146799 -86843 228132 -103406
9155a94436r8951A77490a36154j788q9714R7160j68760b0072G8173i8463b8917
$$ -194436 -293387 177490 -136154 -137942 -227656 -130496 -299256 -20072 78173 -98463 -28917
9143F359a19251B48687c1167F8905k8655a79936b7641A82461G3735Q9632a95123
$$ 6359 -119251 248687 -31167 68905 40250 -179936 -27641 182461 73735 163367 -195123
9131H8095i7851l1230j35449h814k26584M6664J6404d5481n1759G4552A0497a78023
$$ 88095 -97851 -129081 -264530 -8814 -235398 -188734 -172330 -45481 -97240 74552 10497 -178023
9118b65221C12313B6594F297b48593g1539C7843b84067g5946k05861n8202J66132
$$ -265221 312313 26594 6297 -248593 -71539 37843 -284067 -75946 -281807 -340009 -173877
9107a73877a0149k6955E8287j2138b60864J12228j35861I4226c21434c3309A5138
$$ -173877 -10149 -37104 58287 46149 -260864 -148636 -284497 94226 -321434 -33309 15138
9095B6308a71779J014l6506H1348J0793A9892a51862d6089j96649a16517J8723
$$ 26308 -171779 -170765 -207271 81348 92141 19892 -151862 -46089 -242738 -116517 -97794
9084i7794C2095a47199C7510P8073E3182K121a93162d953j04508M7336o384J2965
$$ -97794 32095 -147199 37510 115583 53182 55303 -193162 -4953 -109461 -62125 -68509 -55544
9072e5544j0575A70400c66926A02160L7468a72635j86243A03353C5604J7450b33508
$$ -55544 -66119 170400 -366926 102160 139628 -172635 -358878 103353 35604 53054 -233508
9060d0476B3958c18813D5385f2674k62054E4828a64072A32406K7162G0938K96409
$$ -40476 23958 -318813 45385 -62674 -324728 54828 -164072 132406 159568 70938 367347
9049C67347H3475b37161A67178e72364J01762a64487f8064r521l56377a35339
$$ 367347 83475 -237161 167178 -572364 -470602 -164487 -68064 -77585 -433962 -135339
9038b49712l6207a30851j33754b6195B0133b74466O6564F0774P1829a63739f366
$$ -249712 -285919 -130851 -264605 -26195 20133 -274466 -207902 60774 132603 -163739 -6366
9026i8966j88531c4439q9618l3908M8088l25714A0287b63263j16966m8754a29566
$$ -98966 -287497 -34439 -124057 -157965 -109877 -435591 10287 -263263 -380229 -428983 -129566
9014A27173c4508A9044a05484L2450k9418o8128B2944d30294B9055J5776a27392
$$ 127173 -34508 19044 -105484 -73034 -102452 -170580 22944 -430294 29055 44831 -127392
9002A19862h6336a3114A72338a82958C6006a5107k91864i0926q5338d8945j40990
$$ 119862 -86336 -13114 172338 -182958 36006 -15107 -306971 -90926 -176264 -48945 -189935
8991a89935I7544c62j32223B77879h0717o6097C2778b75446J05343G257a32609
$$ -189935 97544 -362 -132585 277879 -80717 -146814 32778 -275446 -170103 7257 -132609
8979A7035M916L23500A9461K6545b09391F1951a17578N2057A95597C6289a37530
$$ 17035 21951 345451 19461 46006 -209391 61951 -117578 -65521 195597 36289 -137530
8967b2871A40665a08273B78752f7792G4812m927c04501A52627d0863G4757a46307
$$ -22871 140665 -108273 278752 -67792 74812 69885 -304501 152627 -40863 74757 -146307
8955b75534N7633C76104a80265d0701j07566I5348J91031g9566l00400a01904
$$ -275534 -217901 376104 -180265 -40701 -148267 95348 286379 -79566 -379966 -101904
8944b57239j3254G3771P6889a77863L1681A15847N3685J16145E4968K45941j47120
$$ -257239 -270493 73771 150660 -177863 -146182 115847 169532 285677 54968 300909 153789
8933A53789o242b20033A81904a28950C24495q8889l2683h213o2186K0447n11119
$$ 153789 147547 -220033 181904 -128950 324495 235606 202923 -8213 -70399 -49952 -561071
8922e61071B73818j0243J58580m6775n4471I1036a3578A787K87548K6801L77156
$$ -561071 273818 263575 422155 375380 320909 91036 -13578 1787 289335 316136 693292
8911F93292l09729J09547M48592P82594J387762K428445N990192D917970B244935
$$ 693292 383563 493110 941702 1724296 3112058 5540503 11530695 4917970 2244935
8901A213447k74689D01208l4106m8849M2913A63754a00773A96776g985A44747
$$ 1213447 938758 401208 367102 318253 361166 163754 -100773 196776 -7985 144747
8890B30372J597a71465D6108L7414J60061d3730j94510A82918k1460M6140a76348
$$ 230372 231969 -171465 46108 83522 243583 -43730 -238240 182918 161458 207598 -176348
$$ [...]
##END NTUPLES=NMR SPECTRUM
##END=
