
##TITLE=UV1127_M3-1004-1000_6274989_GzzZekQby0
##JCAMPDX= 6.0         $$ Bruker NMR JCAMP-DX V2.0
##DATA TYPE= NMR SPECTRUM
##DATA CLASS= NTUPLES
##ORIGIN= BRUKER
##OWNER= Administrator
$$ 1.72 TOPSPIN		Version 2.1
$$ 2012-06-03 02:19:06.906 -0500  Administrator@TOPSPIN
$$ Compression mode = diff/dup
##.OBSERVE FREQUENCY= 400.13188235
##.OBSERVE NUCLEUS= ^1H
##.ACQUISITION MODE= SIMULTANEOUS (DQD)
##.ACQUISITION SCHEME= undefined
##.AVERAGES= 64
##.DIGITISER RES= 22
##SPECTROMETER/DATA SYSTEM= spect
##.PULSE SEQUENCE= noesygpps1d.comp
##.SOLVENT NAME= COFFEE_meoh
##.SHIFT REFERENCE= INTERNAL, COFFEE_meoh, 1, 14.96709
##AUDIT TRAIL= $$ (NUMBER, WHEN, WHO, WHERE, PROCESS, VERSION, WHAT)
$$ ##TITLE= Audit trail, TOPSPIN		Version 2.1
$$ ##JCAMPDX= 5.01
$$ ##ORIGIN= Bruker BioSpin GmbH
$$ ##OWNER= Administrator
$$ $$ C:\Bruker\TOPSPIN/data/COFFEE/nmr/UV1127_M3-1004-1000_6274989_GzzZekQby0/12/pdata/1/auditp.txt
$$ ##AUDIT TRAIL=  $$ (NUMBER, WHEN, WHO, WHERE, PROCESS, VERSION, WHAT)
(   1,<2012-06-03 02:19:01.703 -0500>,<Administrator>,<TOPSPIN>,<go>,<TOPSPIN 2.1>,
      <created by zg
	started at 2012-06-03 02:07:31.375 -0500,
	POWCHK enabled, PULCHK disabled,
       configuration hash MD5:
       D5 CA 7A 23 FE 6B EE E2 50 67 74 61 24 F7 5E 3B
       data hash MD5: 64K
       B0 68 B5 35 EA 0A C0 A8 FC 9D F6 ED 92 22 C8 A0>)
(   2,<2012-06-03 02:19:04.531 -0500>,<Administrator>,<TOPSPIN>,<proc1d>,<TOPSPIN 2.1>,
      <Start of raw data processing
       efp LB = 0.3 FT_mod = 6 PKNL = 1 PHC0 = 0 PHC1 = 0 SI = 128K 
       data hash MD5: 128K
       A7 A8 13 89 37 BF 34 8E 9E B6 81 57 EE 20 D2 48>)
(   3,<2012-06-03 02:19:05.828 -0500>,<Administrator>,<TOPSPIN>,<proc1d>,<TOPSPIN 2.1>,
      <pk PHC0 = 32.83264 PHC1 = 0 
       data hash MD5: 128K
       85 13 CE A7 72 49 8B F8 91 BB 19 96 BA F7 3D 2B>)
(   4,<2012-06-03 02:19:06.562 -0500>,<Administrator>,<TOPSPIN>,<proc1d>,<TOPSPIN 2.1>,
      <abs ABSG = 1 
       data hash MD5: 128K
       E9 30 F8 D7 D8 7A C4 F4 51 4D A0 49 EE F7 D2 A5>)
(   5,<2012-06-03 02:19:06.640 -0500>,<Administrator>,<TOPSPIN>,<proc1d>,<TOPSPIN 2.1>,
      <abs ABSG = 2 
       data hash MD5: 128K
       8E 57 98 8A 4B DE 75 31 7F C1 F7 2B 5E EE 03 5F>)
(   6,<2012-06-03 02:19:06.687 -0500>,<Administrator>,<TOPSPIN>,<proc1d>,<TOPSPIN 2.1>,
      <abs ABSG = 3 
       data hash MD5: 128K
       66 E7 8A EE 58 FD FF CA A9 6C 45 28 C8 B6 23 10>)
(   7,<2012-06-03 02:19:06.750 -0500>,<Administrator>,<TOPSPIN>,<proc1d>,<TOPSPIN 2.1>,
      <abs ABSG = 4 
       data hash MD5: 128K
       D0 0D EB E7 57 75 D0 89 1C 67 97 85 B4 12 61 3D>)
(   8,<2012-06-03 02:19:06.812 -0500>,<Administrator>,<TOPSPIN>,<proc1d>,<TOPSPIN 2.1>,
      <abs ABSG = 5 
       data hash MD5: 128K
       00 AC 54 DB 2D CF 2C 1D 6B 7B A0 2A E7 C7 DD 1F>)
$$ ##END=
$$ 
$$ $$ hash MD5
$$ $$ 76 0C 4E D0 5A BA 6F DB 03 46 2F 7D 84 5B B9 1B
##$RELAX= 
##$RELAX= 
##$RELAX= 
##$RELAX= 
##$RELAX= 
##$RELAX= 
##$RELAX= 
##$RELAX= 
$$ Bruker specific parameters
$$ [...]
##$TP07= 0
##$TPNAME0= <>
##$TPNAME1= <>
##$TPNAME2= <>
##$TPNAME3= <>
##$TPNAME4= <>
##$TPNAME5= <>
##$TPNAME6= <>
##$TPNAME7= <>
##$TPOAL= (0..7)
0.5 0.5 0.5 0.5 0.5 0.5 0.5 0.5
##$TPOFFS= (0..7)
0 0 0 0 0 0 0 0
##$TUNHIN= 0
##$TUNHOUT= 0
##$TUNXOUT= 0
##$USERA1= <user>
##$USERA2= <user>
##$USERA3= <user>
##$USERA4= <user>
##$USERA5= <user>
##$V9= 5
##$VALIST= <valist>
##$VCLIST= <CCCCCCCCCCCCCCC>
##$VD= 0
##$VDLIST= <DDDDDDDDDDDDDDD>
##$VPLIST= <PPPPPPPPPPPPPPP>
##$VTLIST= <TTTTTTTTTTTTTTT>
##$WBST= 2048
##$WBSW= 25
##$XGAIN= (0..3)
0 0 0 0
##$XL= 0
##$YL= 0
##$YMAX_a= 11304683
##$YMIN_a= -6651610
##$ZGOPTNS= <>
##$ZL1= 120
##$ZL2= 120
##$ZL3= 120
##$ZL4= 120
##$ABSF1= 14.96709
##$ABSF2= -5.585441
##$ABSG= 5
##$ABSL= 3
##$ALPHA= 0
##$AQORDER= 0
##$ASSFAC= 0
##$ASSFACI= 0
##$ASSFACX= 0
##$ASSWID= 0
##$AUNMP= <proc_prof1d_extract.lims>
##$AXLEFT= 0
##$AXNAME= <>
##$AXNUC= <1H>
##$AXRIGHT= 0
##$AXTYPE= 0
##$AXUNIT= <>
##$AZFE= 0.1
##$AZFW= 0.1
##$BCFW= 0
##$BC_mod= 0
##$BYTORDP= 0
##$COROFFS= 0
##$CY= 15
##$DATMOD= 1
##$DC= 0
##$DFILT= <>
##$DTYPP= 0
##$F1P= 0
##$F2P= 0
##$FCOR= 0.5
##$FTSIZE= 131072
##$FT_mod= 6
##$GAMMA= 0
##$GB= 0
##$INTBC= 1
##$INTSCL= 1
##$ISEN= 128
##$LB= 0.3
##$LEV0= 0
##$LPBIN= 0
##$MAXI= 10000
##$MC2= 0
##$MEAN= 0
##$ME_mod= 0
##$MI= 0
##$NCOEF= 0
##$NC_proc= -3
##$NLEV= 6
##$NOISF1= 0
##$NOISF2= 0
##$NSP= 0
##$NTH_PI= 0
##$NZP= 0
##$OFFSET= 14.96709
##$PC= 1
##$PHC0= 32.83264
##$PHC1= 0
##$PH_mod= 1
##$PKNL= yes
##$PPARMOD= 0
##$PPDIAG= 0
##$PPIPTYP= 0
##$PPMPNUM= 2147483647
##$PPRESOL= 1
##$PSCAL= 4
##$PSIGN= 0
##$PYNMP= <proc.py>
##$REVERSE= no
##$SF= 400.130005411595
##$SI= 131072
##$SIGF1= 0
##$SIGF2= 0
##$SINO= 400
##$SIOLD= 131072
##$SPECTYP= <>
##$SREGLST= <1H.CDCl3>
##$SSB= 0
##$STSI= 131072
##$STSR= 0
##$SW_p= 8223.68421052632
##$SYMM= 0
##$S_DEV= 0
##$TDeff= 65536
##$TDoff= 0
##$TI= <>
##$TILT= no
##$TM1= 0
##$TM2= 0
##$TOPLEV= 0
##$USERP1= <user>
##$USERP2= <user>
##$USERP3= <user>
##$USERP4= <user>
##$USERP5= <user>
##$WDW= 1
##$XDIM= 131072
##$YMAX_p= 497069883
##$YMIN_p= -386486396
##$CURPLOT= <Network HP LaserJet P1505>
##$CURPRIN= <$Network HP LaserJet P1505>
##$DFORMAT= <normdp>
##$LAYOUT= <+/1D_H.xwp>
##$LFORMAT= <normlp>
##$PFORMAT= <normpl>
##$SURQMSG= 1
$$ End of Bruker specific parameters
$$ ---------------------------------
##NTUPLES= NMR SPECTRUM
##VAR_NAME=  FREQUENCY,     SPECTRUM/REAL,   SPECTRUM/IMAG
##SYMBOL=    X,             R,               I
##VAR_TYPE=  INDEPENDENT,   DEPENDENT,       DEPENDENT
##VAR_FORM=  AFFN,          ASDF,            ASDF
##VAR_DIM=   131072,        131072,          131072
##UNITS=     HZ,            ARBITRARY UNITS, ARBITRARY UNITS
##FACTOR=    0.0627417313425165, 1,          1
##FIRST=     8223.62146879498, 2212,         -110105
##LAST=      0,             5348,            -110552
##MIN=       0,             -386486396,      0
##MAX=       8223.62146879498, 497069883,    0
$$ Real data points
##PAGE= N=1
##DATA TABLE= (X++(R..R)), XYDATA
$$ [...]
63478A784606j7063j7364j7034j7082j7917j8787j8960j9104k0628k3983k8624
63467A568060l3957l9094m2315m2549m1227m0935m2086m2603m1035l8132l5128
63456A128999l2375l0216k9127k8159k5323k0710j7269j6914j7592j6175j2730
63445H82409r799q446p391n747m453m691o383q339r035p380l879o81M39j73j136
63430H05315j956k655k437n72J846K919K547K340K977L530L486L558M034M105
63416H29037L545L346L843L630J487j765m391n886o816p356p219o653o407o641
63402G91754o646n690l699j142J322L169M313N147O143P466Q928J0189J1042J1798
63388H44094J3123J5145J6940J7547J7406J8006K0022K2666K5062K7403L0192
$$ plain form
63478 1784606 1767543 1750179 1733145 1716063 1698146 1679359 1660399 1641295 1620667 1596684 1568060
63467 1568060 1534103 1495009 1452694 1410145 1368918 1327983 1285897 1243294 1202259 1164127 1128999
63456 1128999 1096624 1066408 1037281 1009122 983799 963089 945820 928906 911314 895139 882409
63445 882409 872610 864164 856773 851026 846573 841882 835499 827160 818125 810745 806866 806185 806624 806451 805315
63430 805315 803359 800704 798267 797695 799541 802460 805007 807347 810324 813854 817340 820898 824932 829037
63416 829037 832582 835928 839771 843401 844888 843123 838732 832846 826030 818674 811455 804802 798395 791754
63402 791754 785108 779418 775719 774577 775899 779068 783381 788528 794671 802137 811065 821254 832296 844094
63388 844094 857217 872362 889302 906849 924255 942261 962283 984949 1010011 1037414 1067606
63377A067606L3112L5476L7289L8953M0096L9516L6628L2391K8498K5944K4731
63366A440240K4734K6212K9193L2868L6286L9497M3262M7470N0586N1100M8849
63355A870297M4386L7691K8478J7450O389l030j0010j4447j6767j7822j8308j8398
63343A905909j8537k0114k4259l0030l5023l8074m0262m2918m5630m7005m6451
63332A517606m4426m1473l7951l4371l1166k8140k4727k0829j6845j2976q959
63321A215743m693o99K361M541O689R518J2747J5426J7200J8908K1535K4783K7224
63308A371283K7942K7551K7412K8259K9932L2091L4637L7415L9962M1845M3098
63297A741427M4001M4365M3225L9520L2993K4402J4899N377l612j1534j7649k1270
$$ plain form
63377 1067606 1100718 1136194 1173483 1212436 1252532 1292048 1328676 1361067 1389565 1415509 1440240
63366 1440240 1464974 1491186 1520379 1553247 1589533 1629030 1672292 1719762 1770348 1821448 1870297
63355 1870297 1914683 1952374 1980852 1998302 2004691 2001661 1991651 1977204 1960437 1942615 1924307 1905909
63343 1905909 1887372 1867258 1842999 1812969 1777946 1739872 1699610 1656692 1611062 1564057 1517606
63332 1517606 1473180 1431707 1393756 1359385 1328219 1300079 1275352 1254523 1237678 1224702 1215743
63321 1215743 1211050 1210351 1212712 1217253 1223942 1233460 1246207 1261633 1278833 1297741 1319276 1344059 1371283
63308 1371283 1399225 1426776 1454188 1482447 1512379 1544470 1579107 1616522 1656484 1698329 1741427
63297 1741427 1785428 1829793 1873018 1912538 1945531 1969933 1984832 1990209 1986597 1975063 1957414 1936144
63285A936144k2502k2607k3104k4309k5372k6123k8043l2389l8005m2351m4455
63274A606884m5365m5792m5095m3045m0698l8535l5417l0714k6068k3297k1579
63263A211279j8587j3977j0021q904j0868j4773j9011k1817k2263k1387k1216
63252A028455k2304k3077k1786j8282j3753r629o917n795n574n486n492n790n928
63239H78642n386m690m884n953o968p732r011j0868j2068j1703j0353r067q006
63226G71953o835n827n715o536p138o220l805j504q15j312j245q9P30J33r70j355
63210G23450j461k076k247n38K269L909L802L449L675L719L246L143L775M308
63196G52423M401M920O297P775Q799R742J0717J1235J1412J1909J2396J2018J1750
$$ plain form
63285 1936144 1913642 1891035 1867931 1843622 1818250 1792127 1764084 1731695 1693690 1651339 1606884
63274 1606884 1561519 1515727 1470632 1427587 1386889 1348354 1312937 1282223 1256155 1232858 1211279
63263 1211279 1192692 1178715 1168694 1159790 1148922 1134149 1115138 1093321 1071058 1049671 1028455
63252 1028455 1006151 983074 961288 943006 929253 919624 912707 906912 901338 895852 890360 884570 878642
63239 878642 873256 868566 863682 857729 850761 843029 834018 823150 811082 799379 789026 779959 771953
63226 771953 765118 759291 753576 747040 739902 733682 729877 728373 727558 726246 725001 724912 725642 725775 724805 723450
63210 723450 721989 719913 717666 717128 719397 723306 727108 730557 734232 737951 741197 744340 748115 752423
63196 752423 756824 761744 768041 775816 784615 794357 805074 816309 827721 839630 852026 864044 875794
63183H75794J3902J8382K1825K2023K1036K2129K5377K8323K9641L0098L0808
63172A139338L2325L4704L6999L7554L6129L4711L4848L5409L4600L2971L2376
63161A521964L2884L2875L1695L0178K8868K7592K6570K6029K4771K1025J4939
63150A819390Q619L455j102n959j1016j5836k0363k4439k7515k9244k9801k9400
63138A636789k8043k5778k2650j8658j4370j1114r697r168p740m714p88L168O815
63125A494052J0182J3666J7736K1888K4578K5090K4838K5606K7148K7771K6835
63114A739390K5272K4090K3556K3421K2741K0120J5472J0771P502M253j134p928
63102A907526j3583j7926k3255l0084l5992l9538m2346m5741m7986m7069m4195
$$ plain form
63183 875794 889696 908078 929903 951926 972962 995091 1020468 1048791 1078432 1108530 1139338
63172 1139338 1171663 1206367 1243366 1280920 1317049 1351760 1386608 1422017 1456617 1489588 1521964
63161 1521964 1554848 1587723 1619418 1649596 1678464 1706056 1732626 1758655 1783426 1804451 1819390
63150 1819390 1828009 1831464 1830362 1824403 1813387 1797551 1777188 1752749 1725234 1695990 1666189 1636789
63138 1636789 1608746 1582968 1560318 1541660 1527290 1516176 1506479 1497311 1489571 1484857 1484069 1487237 1494052
63125 1494052 1504234 1517900 1535636 1557524 1582102 1607192 1632030 1657636 1684784 1712555 1739390
63114 1739390 1764662 1788752 1812308 1835729 1858470 1878590 1894062 1904833 1912335 1916588 1915454 1907526
63102 1907526 1893943 1876017 1852762 1822678 1786686 1747148 1704802 1659061 1611075 1564006 1519811
63091A519811m2086m1034l9087l5444l1464k8412k6047k3642k1089j8667j6594
63080A196245j5015j3768j2183r646o375l213q62M93J147J842L327N435P055P441
63066A161923P175P428Q624J0272J1571J1759J0280P342M053J544J02n42m80L88
63052A241439J804K946K864J190j242k723k264q21r0k35J08J355K022R61p11j160
63036A245443l13M73O01O91J144J677K251L250M548N400N545N615O121O798P212
63021A296456P345P222O651N847N881P745J1049J4042J5106J4210J2874J2720
63009A417148J4088J6183J8494K1464K5442K9556L2539L4481L6785M0168M3642
62998A729990M6094M8067N1057N5495O0315O4475O7870P0710P2903P4572P6377
$$ plain form
63091 1519811 1477725 1436691 1397604 1362160 1330696 1302284 1276237 1252595 1231506 1212839 1196245
63080 1196245 1181230 1167462 1155279 1145633 1139258 1136045 1135183 1135676 1136823 1138665 1141992 1147427 1154482 1161923
63066 1161923 1169098 1176526 1185150 1195422 1206993 1218752 1229032 1236374 1240427 1241971 1242073 1241531 1241051 1241439
63052 1241439 1243243 1246189 1249053 1250243 1249001 1246278 1244014 1243193 1243103 1242868 1242976 1244331 1246353 1247314 1246603 1245443
63036 1245443 1245130 1245603 1246204 1246895 1248039 1249716 1251967 1255217 1259765 1265165 1270710 1276325 1282446 1289244 1296456
63021 1296456 1303801 1311023 1317674 1323521 1329402 1337147 1348196 1362238 1377344 1391554 1404428 1417148
63009 1417148 1431236 1447419 1465913 1487377 1512819 1542375 1574914 1609395 1646180 1686348 1729990
62998 1729990 1776084 1824151 1875208 1930703 1991018 2055493 2123363 2194073 2266976 2341548 2417925
62987B417925P8672Q0746Q1470Q0440P7985P4543P0790O7990O7160O7800O8233
62976C233754O7349O5252O2269N8328N3538M8229M1828L2842K0846P559n095j7308
62964C669391l0539m4856n8420o9394p7144q1587q2891q2098q0792p9366p6500
62953B905804p1009o3544n5718m8133m0077l0900k0942j1113k169N529J2028J7825
62941B597581K3545K9188L3877L6717L8038L9281M1261M3059M3336M2386M1802
62930C010071M2052M1727L9692L6642L3437K9122K2136J2839L104o336j6522k8103
62918C219861m0113n1250o1038o9280p5753q0983q6057r0776r3232r2194q8919
62907B390266q5465q2111p7883p3013o9086o6690o4399o0743n6083n1767m8183
$$ plain form
62987 2417925 2496597 2577343 2658813 2739253 2817238 2891781 2962571 3030561 3097721 3165521 3233754
62976 3233754 3301103 3366355 3428624 3486952 3540490 3588719 3630547 3663389 3684235 3691794 3686699 3669391
62964 3669391 3638852 3593996 3535576 3466182 3389038 3307451 3224560 3142462 3061670 2982304 2905804
62953 2905804 2834795 2771251 2715533 2667400 2627323 2596423 2575481 2564368 2562199 2567728 2579756 2597581
62941 2597581 2621126 2650314 2684191 2720908 2758946 2798227 2839488 2882547 2925883 2968269 3010071
62930 3010071 3052123 3093850 3133542 3170184 3203621 3232743 3254879 3267718 3270822 3264486 3247964 3219861
62918 3219861 3179748 3128498 3067460 2998180 2922427 2841444 2755387 2664611 2571379 2479185 2390266
62907 2390266 2304801 2222690 2144807 2071794 2002708 1936018 1871619 1810876 1754793 1703026 1654843
62896A654843m4704m1229l8727l7868l7833l7108l5241l3119l1560l0226k8301
62885A258927k5741k3373k1942k1410k1025j9927j7916j5847j4877j4996j4770
62874A047103j2998j0100p393n526m443m319n374o953p858p730p214o773o333
62861I54089o084o427o861o033l613j222q10k565n023o661o841n729m008k493
62847H89719j530p63J88J076J211K60j365k779l276k786j713l22J378L000L656
62832H85954K956J663P51K51k24l64K68R80N89p48j633j448r81q82q15n08l64
62815H85445n61p73j225k647m576n172l741k134k394l994m844m227l250k815k592
62800H40500j968q38O07J971K477J608K7q41m01M79P08K76qJ75K53j66l46N89
$$ plain form
62896 1654843 1610139 1568910 1530183 1492315 1454482 1417374 1382133 1349014 1317454 1287228 1258927
62885 1258927 1233186 1209813 1187871 1166461 1145436 1125509 1107593 1091746 1076869 1061873 1047103
62874 1047103 1034105 1024005 1016612 1011086 1006643 1002324 996950 989997 982139 974409 967195 960422 954089
62861 954089 948005 941578 934717 928684 925071 923849 923039 920474 915451 908790 901949 896220 892212 889719
62847 889719 888189 887426 887614 888690 889901 890161 888796 886017 882741 879955 878242 877920 879298 882298 885954
62832 885954 888910 890573 891324 891575 891351 890987 891255 892235 892824 892076 890443 888995 888014 887132 886317 885809 885445
62815 885445 884884 884111 882886 880239 875663 870491 866750 864616 862222 858228 853384 849157 845907 843092 840500
62800 840500 838532 837694 838301 840272 842749 844357 844384 843543 843142 843621 844329 844605 844597 844772 845025 844859 844513 845102
62782H45102J813J198j714m223l453j50K223J942O56L97J021J473J699K164K817
62767H52965L659N057O446O238M330L220M911P890R156Q315P554Q173R313J0015
62753I47242J0328J0210R231P964P974R774J2061J3517J4163J4438J4296J4028
62741A085226J4881J7658K1228K3508K3767K3382K4317K7317L1523L5578L8868
62730A367253M1768M4888M8526N2877N8144O4050O9860P5408Q1430Q8144R4104
62719B086452R7735R9626J01959J05497J08448J08751J06385J02511R7083Q8450
62709C102897P5405N8963M1672K5180Q860q775k7458m4763n8657o9720q0049r0341
62697B933214r9113j04629j06719j06569j05439j03850j01466r7593r2115q5934
$$ plain form
62782 845102 846915 848113 846399 842176 838723 838573 840796 842738 843394 843791 844812 846285 847984 850148 852965
62767 852965 856624 861681 868127 874365 878695 881915 886826 894716 903872 912187 919741 927914 937227 947242
62753 947242 957570 967780 977011 984975 992949 1002723 1014784 1028301 1042464 1056902 1071198 1085226
62741 1085226 1100107 1117765 1138993 1162501 1186268 1209650 1233967 1261284 1292807 1328385 1367253
62730 1367253 1409021 1453909 1502435 1555312 1613456 1677506 1747366 1822774 1904204 1992348 2086452
62719 2086452 2184187 2283813 2385772 2491269 2599717 2708468 2814853 2917364 3014447 3102897
62709 3102897 3178302 3237265 3278937 3304117 3312977 3304202 3276744 3231981 3173324 3103604 3023555 2933214
62697 2933214 2834101 2729472 2622753 2516184 2410745 2306895 2205429 2107836 2015721 1929787
62687A929787q0135p4905o9726o4411n9274n4414m9616m5024m1112l7814l4371
62676A318985l0324k6113k2334j8963j5733j2916j1142j0394r675p893n048k212
62664A146238k22J351L525O453R266J1372J3131J4988J6685J7957J9309K1555
62652A281608K4842K8732L2861L7064M1183M5242M9337N3151N6128N8597O1920
62641A770665O6932P2939P8913Q4711R0261R4538R6716R7516R7868R6800R2424
62630B740283Q4757P5739O6165N4516L9454K1983M197j2946k9578m5444n9676
62619B939450p1794q2074r0862r7864j02273j03542j02136r9429r6634r3864r0390
62608A908588q5599p9564p3041o7206o2918n9815n6585n2487m8013m3610l8789
$$ plain form
62687 1929787 1849652 1774747 1705021 1640610 1581336 1526922 1477306 1432282 1391170 1353356 1318985
62676 1318985 1288661 1262548 1240214 1221251 1205518 1192602 1181460 1171066 1161391 1153498 1148450 1146238
62664 1146238 1146016 1147367 1150892 1157345 1166611 1177983 1191114 1206102 1222787 1240744 1260053 1281608
62652 1281608 1306450 1335182 1368043 1405107 1446290 1491532 1540869 1594020 1650148 1708745 1770665
62641 1770665 1837597 1910536 1989449 2074160 2164421 2258959 2355675 2453191 2551059 2647859 2740283
62630 2740283 2825040 2900779 2966944 3021460 3060914 3082897 3087094 3074148 3044570 2999126 2939450
62619 2939450 2867656 2785582 2694720 2596856 2494583 2391041 2288905 2189476 2092842 1998978 1908588
62608 1908588 1822989 1743425 1670384 1603178 1540260 1480445 1423860 1371373 1323360 1279750 1240961
62597A240961l3357k8591k5798k4381k2708k0476j8680j7578j6409j5095j4510
62586A003378j4756j4606j3188j0935q519o114m088l162l372l868m192m630n030
62573I06918m630l608l345m273m743l203n08J153J082N90R42J879K240J534N57
62558H92585O55K342M824P059Q901J0618J1797J1874J1523J2230J4161J5769J5982
62545A020320J5811J7049K0173K4048K7220K9102L0481L2879L6767M0532M2209
62534A336591M2124M2517M4507M6947M8512M9100M8512M5647M0260L3997K8201
62523A806915K1757J2661J047j0704k0371k7376l2420l6777m1518m6422m9987
62512A576805n1169n0526m9027m6669m3286l9786l7262l5447l3366l1029k9129
$$ plain form
62597 1240961 1207604 1179013 1153215 1128834 1106126 1085650 1066970 1049392 1032983 1017888 1003378
62586 1003378 988622 974016 960828 949893 941374 935260 931172 928010 924638 920770 916578 911948 906918
62573 906918 902288 898680 895335 891062 886319 883116 882608 883761 884843 885433 886375 888254 890494 892028 892585
62558 892585 893240 895582 900406 907465 916366 926984 938781 950655 962178 974408 988569 1004338 1020320
62545 1020320 1036131 1053180 1073353 1097401 1124621 1153723 1184204 1217083 1253850 1294382 1336591
62534 1336591 1378715 1421232 1465739 1512686 1561198 1610298 1658810 1704457 1744717 1778714 1806915
62523 1806915 1828672 1841333 1842380 1831676 1811305 1783929 1751509 1714732 1673214 1626792 1576805
62512 1576805 1525636 1475110 1426083 1379414 1336128 1296342 1259080 1223633 1190267 1159238 1130109
62501A130109k7436k4990k1831j9168j7539j5974j3399j0154p582o505o401n987
62489I53143m611l008k326k443j985l16J431J975J644J642K246K836L271M112
62475I57611N517O883P633P813P980Q931J1199J4367J7277J9349K1259K3762K6628
62462A136209K9306L2012L5208L8614M1693M4687M8267N2438N6525N9926O2258
62451A637143O3397O4059O5452O7352O7423O3769N7527N1547M6953M2477L6673
62440B263772K9252K0590J1678M602J321J620L509N788Q820J2797J7083K1646
62428B402478K7365L4096L9980M3776M6551M9873N3266N4610N2255M5696L5038
62417B884984K1312O920n812j6853k8348m1961n6990p1244q2992r1598r6952r9252
$$ plain form
62501 1130109 1102673 1077683 1055852 1036684 1019145 1003171 989772 979618 972036 965531 959130 953143
62489 953143 948532 945524 943198 940755 938770 938454 939885 941860 943504 945146 947392 950228 953499 957611
62475 957611 963128 970011 977644 985457 993437 1002368 1013567 1027934 1045211 1064560 1085819 1109581 1136209
62462 1136209 1165515 1197527 1232735 1271349 1313042 1357729 1405996 1458434 1514959 1574885 1637143
62451 1637143 1700540 1764599 1830051 1897403 1964826 2028595 2086122 2137669 2184622 2227099 2263772
62440 2263772 2293024 2313614 2325292 2329894 2331215 2332835 2336344 2342132 2350952 2363749 2380832 2402478
62428 2402478 2429843 2463939 2503919 2547695 2594246 2644119 2697385 2751995 2804250 2849946 2884984
62417 2884984 2906296 2913216 2907404 2890551 2862203 2820242 2763252 2692008 2609016 2517418 2420466 2321214
62405B321214r9391r8640r7376r4524q9034q1721p4738o9086o3629n7154n0326
62394A445595m4627m0029l5081k9100k3072j8211j4749j2385j0964j0136r007
62383A198234o781l638o64R80R30j05r91j253j373j869k637l542m991p116r096
62368A156088j0228j1094j2463j3474j2532j0075q637r514j0759r636o256l542
62356A037878l936o950j0061j1341j0925r985q855o774l587p04N01N05P31J369
62342I67866J557J548K858N773Q195Q034N760L722L584N235P566R440J0240J0226
62328A051604J0377J1403J2997J4233J4535J4218J4266J5540J7708J9283J9298
62317A215462J8782J9696K2492K5727K8018K9246K9753K9734K9892L1343L4186
$$ plain form
62405 2321214 2221823 2123183 2025807 1931283 1842249 1760528 1685790 1616704 1553075 1495921 1445595
62394 1445595 1400968 1360939 1325858 1296758 1273686 1255475 1240726 1228341 1217377 1207241 1198234
62383 1198234 1191453 1187815 1187151 1188131 1189061 1188956 1187965 1186712 1185339 1183470 1180833 1177291 1172300 1165184 1156088
62368 1156088 1145860 1134766 1122303 1108829 1096297 1086222 1077585 1068071 1057312 1047676 1041420 1037878
62356 1037878 1033942 1026992 1016931 1005590 994665 984680 975825 969051 965464 964760 965261 965766 966497 967866
62342 967866 969423 970971 973829 979602 987797 995831 1001591 1005313 1008897 1014132 1021698 1031138 1041378 1051604
62328 1051604 1061981 1073384 1086381 1100614 1115149 1129367 1143633 1159173 1176881 1196164 1215462
62317 1215462 1234244 1253940 1276432 1302159 1330177 1359423 1389176 1418910 1448802 1480145 1514331
62306A514331L7288M0183M3994M9598N5960O1417O5717O9581P3064P5732P7939
62295B164804Q0401Q2573Q2627P9205P2309O2490N0225L6391K2473R770j364j1289
62283B730615k0382k8617l5752m1885m7725n3862n9713o3769o5290o5173o4655
62272B183792o3629o0984n6389n1071m6784m4363m3224m2102m0269l8059l6141
62261A660777l4646l3539l3385l4518l5506l4002k9811k5668k3959k3758k2437
62250A329548j9256j5810j3360j1411r070o521m578l415k259k66K393M472N096
62237A255563N094N997P863R473J0751J3028J6138J7537J6004J4096J4578J6049
62225A402171J5144J2004J0146J1168J2982J3720J4097J4876J5091J4340J4253
$$ plain form
62306 1514331 1551619 1591802 1635796 1685394 1741354 1802771 1868488 1938069 2011133 2086865 2164804
62295 2164804 2245205 2327778 2410405 2489610 2561919 2624409 2674634 2711025 2733498 2743268 2741904 2730615
62283 2730615 2710233 2681616 2645864 2603979 2556254 2502392 2442679 2378910 2313620 2248447 2183792
62272 2183792 2120163 2059179 2002790 1951719 1904935 1860572 1817348 1775246 1734977 1696918 1660777
62261 1660777 1626131 1592592 1559207 1524689 1489183 1455181 1425370 1399702 1375743 1351985 1329548
62250 1329548 1310292 1294482 1281122 1269711 1260641 1254120 1249542 1246127 1243868 1243602 1245995 1250467 1255563
62237 1255563 1260657 1266654 1274517 1283990 1294741 1307769 1323907 1341444 1357448 1371544 1386122 1402171
62225 1402171 1417315 1429319 1439465 1450633 1463615 1477335 1491432 1506308 1521399 1535739 1549992
62214A549992J5803J7397J7585J7675J9520K2375K4322K5556K7837L1625L6021
62203A805708M0858M6478N1904N5708N8659O3198O9904P6493Q0774Q2723Q2924
62192B515331Q0867P5793O7950N7893M5710L1912J8159N888n182j6272k7695l8627
62180B811727m8424n7258o5444p2723p8273q1226q1257p8942p5446p1660o7681
62169B033393o3186n8062n2611m7348m2607l8305l4159l0306k7314k5254k3151
62158A591090k0091j6514j3716j2175j1243j0351r452q190n915k951p83j66J8
62145A479561J280L552N690P283Q891J0687J1961J2154J1666J1319J1411J1601
62133A587056J1578J1586J2179J3427J4700J5514J6312J7691J9177J9732J9479
$$ plain form
62214 1549992 1565795 1583192 1600777 1618452 1637972 1660347 1684669 1710225 1738062 1769687 1805708
62203 1805708 1846566 1893044 1944948 2000656 2059315 2122513 2192417 2268910 2349684 2432407 2515331
62192 2515331 2596198 2671991 2739941 2797834 2843544 2875456 2893615 2899503 2894321 2878049 2850354 2811727
62180 2811727 2763303 2706045 2640601 2567878 2489605 2408379 2327122 2248180 2172734 2101074 2033393
62169 2033393 1970207 1912145 1859534 1812186 1769579 1731274 1697115 1666809 1639495 1614241 1591090
62158 1591090 1570999 1554485 1540769 1528594 1517351 1507000 1497548 1489358 1483443 1480492 1479709 1479543 1479561
62145 1479561 1480841 1484393 1490083 1497366 1506257 1516944 1528905 1541059 1552725 1564044 1575455 1587056
62133 1587056 1598634 1610220 1622399 1635826 1650526 1666040 1682352 1700043 1719220 1738952 1758431
62122A758431J9613K0369K0400J8990J7432J7051J7171J6639J6373J8245K1894
62111A962608K4974K6860K9901L5999M3692N0003N3930N6556N8416N8523N5990
62100B457452N1205M4892L6908K6827J5368M435m548j1973j9316k7208l4832m1273
62088B497937m6718n1816n6434n9783o1371o1003n8276n3152m7015m2051l9226
62077A921092l7573l5641l2904k9613k6246k3408k1598k0623j9731j8524j7153
62066A638078j5696j4146j2943j2418j1658r290n778l310k711k066M73M068O806
62053A559409Q490R809R850O920J708k789m761n231n665n919n445m871n183o356
62039A549966p910r911j2262j3740j3011j0301p094m432k346o31R38L093O582
$$ plain form
62122 1758431 1778044 1798413 1818813 1837803 1855235 1872286 1889457 1906096 1922469 1940714 1962608
62111 1962608 1987582 2014442 2044343 2080342 2124034 2174037 2227967 2284523 2342939 2401462 2457452
62100 2457452 2508657 2553549 2590457 2617284 2632652 2637087 2632539 2620566 2601250 2574042 2539210 2497937
62088 2497937 2451219 2399403 2342969 2283186 2221815 2160812 2102536 2049384 2002369 1960318 1921092
62077 1921092 1883519 1847878 1814974 1785361 1759115 1735707 1714109 1693486 1673755 1655231 1638078
62066 1638078 1622382 1608236 1595293 1582875 1571217 1561927 1556149 1552839 1550128 1548062 1548535 1552603 1559409
62053 1559409 1567899 1577708 1587558 1594478 1596186 1593397 1588636 1583405 1577740 1571821 1566376 1561505 1556322 1549966
62039 1549966 1542056 1532145 1519883 1506143 1493132 1482831 1475737 1471305 1468959 1468328 1469266 1472359 1478941
62026A478941J0931J4653J7106J9285K2146K4933K6133K5776K5602K6929K9351
62015A721786L1804L4006L6045L7357L7219L6075L5353L5802L6784L7443L7655
62004B117329L7607L7154L6124L4634L2449K8532K1890J2746K515p033j4486j9439
61992B320022k3167k8010l5124m3098m9566n3857n7188o0391o2658o2786o0817
61981A783360n7984n5554n3978n2697n0493m6553m1441l6683l3171l0388k7343
61970A297075k3824k0365j7443j5231j3938j3730j4145j4062j2744j0795r736
61959A131062j0366j1849j2720j2483j1818j1411j1222j0858r916p992n242l059
61947A012126k909m036l535J55M901P314O772N447M926M696M070L597L758L697
$$ plain form
62026 1478941 1489872 1504525 1521631 1540916 1563062 1587995 1614128 1639904 1665506 1692435 1721786
62015 1721786 1753590 1787596 1823641 1860998 1898217 1934292 1969645 2005447 2042231 2079674 2117329
62004 2117329 2154936 2192090 2228214 2262848 2295297 2323829 2345719 2358465 2360980 2353947 2339461 2320022
61992 2320022 2296855 2268845 2233721 2190623 2141057 2087200 2030012 1969621 1906963 1844177 1783360
61981 1783360 1725376 1669822 1615844 1563147 1512654 1466101 1424660 1387977 1354806 1324418 1297075
61970 1297075 1273251 1252886 1235443 1220212 1206274 1192544 1178399 1164337 1151593 1140798 1131062
61959 1131062 1120696 1108847 1096127 1083644 1071826 1060415 1049193 1038335 1028419 1020427 1015185 1012126
61947 1012126 1009217 1005181 1001646 1001801 1006702 1014016 1020788 1026235 1031161 1035857 1039927 1043524 1047282 1050979
61933A050979K331j32k651m734o547q216r764j1347j2907j3844j3747j3188j3128
61920I43105j3634j3707j2485j0181p797o222n722n992o309n808m102j830k70
61907H49046rk21K24J166J536J230J560L275N272O123O112O615Q086R786J1267
61892I11068J2858J4791J6772J8555K0164K1628K3220K5609K8879L1860L3522
61881A158926L4726L7143M0630M3196M3658M2803M1689M0422L8964L7518L5550
61870A595225L2032K7427K3825K2011K0012J5806J0121N064J217k124m881o374
61858A739361p092q107q793p050k327L226P340J0144J3274J7323K1170K3464K3975
61845A825908K3410K2309K0403J7061J2249O706J163m134r007j3063j6294j9256
$$ plain form
61933 1050979 1053310 1053178 1050527 1045793 1039246 1031030 1021266 1009919 997012 983168 969421 956233 943105
61920 943105 929471 915764 903279 893098 885301 879079 873357 867365 861056 855248 851146 849316 849046
61907 849046 849037 848816 849040 850206 851742 852972 854532 857807 863079 869202 875314 881929 890015 899801 911068
61892 911068 923926 938717 955489 974044 994208 1015836 1039056 1064665 1093544 1125404 1158926
61881 1158926 1193652 1230795 1271425 1314621 1358279 1401082 1442771 1483193 1522157 1559675 1595225
61870 1595225 1627257 1654684 1678509 1700520 1720532 1736338 1746459 1751523 1752740 1750616 1745735 1739361
61858 1739361 1732269 1724162 1715369 1708319 1705992 1709218 1716558 1726702 1739976 1757299 1778469 1801933 1825908
61845 1825908 1849318 1871627 1892030 1909091 1921340 1928046 1929209 1925075 1916068 1903005 1886711 1867455
61833A867455k1932k3047k1540j8485j6389j6509j7839j8852j9173j9165j9070
61822A655454j9360k1078k4564k8152k9327k7409k4203k1716k0038j8018j5184
61811A406405j2037q873n500k127O19K859N565Q966J1924J3752J5702J9397K4383
61798A481035K8692L1623L4542L8734M3749M8317N1886N4733N7289N9651O1294
61787A991545O1167N8709N4742N0478M5785L9538L1650K3376J5382P069j549q873
61775B369019j3569j6159j7542j7141j3945q596k963K037O750J1278J4884J6931
61763B330984J7195J5115R939K055o567j3954j9907k5788l2616l9713m5485m9265
61751B141993n1717n3158n2623m9682m6390m5533m6920m7396m5104m1838m0197
$$ plain form
61833 1867455 1845523 1822476 1800936 1782451 1766062 1749553 1731714 1712862 1693689 1674524 1655454
61822 1655454 1636094 1615016 1590452 1562300 1532973 1505564 1481361 1459645 1439607 1421589 1406405
61811 1406405 1394368 1385495 1379995 1377868 1378487 1381346 1386911 1395877 1407801 1421553 1437255 1456652 1481035
61798 1481035 1509727 1541350 1575892 1614626 1658375 1706692 1758578 1813311 1870600 1930251 1991545
61787 1991545 2052712 2111421 2166163 2216641 2262426 2301964 2333614 2356990 2372372 2379441 2377892 2369019
61775 2369019 2355450 2339291 2321749 2304608 2290663 2282067 2279104 2281141 2287891 2299169 2314053 2330984
61763 2330984 2348179 2363294 2373233 2375288 2368721 2354767 2334860 2309072 2276456 2236743 2191258 2141993
61751 2141993 2090276 2037118 1984495 1934813 1888423 1842890 1795970 1748574 1703470 1661632 1621435
61740A621435m0115l9660l7878l5078l1428k7178k3622k1930k1270j9821j7556
61729A305899j6249j6577j6922j5597j2857j0042p785o009m958n129o281p132
61717A180361o432m189j588L74J789L123M082M232M440O308R823J2919J4043J3992
61703A243277J4371J5450J6444J6875J6490J4893J2417J0427R464Q004M372r38
61691A381546o120j0280j3382j5160j5797j6701j8678k0181j9439j7424j6377
61680A212007j6121j4665j2105j0810j1376j1428r296o231l873k037m08j26j896
61667A111635m262n486n708n687m911k840p94n92j873k648k111j307j124j211
61653A071081j105j312k724n511q791j1274j2279j2231j1933j1442j0275q654
$$ plain form
61740 1621435 1581320 1541660 1503782 1468704 1437276 1410098 1386476 1364546 1343276 1323455 1305899
61729 1305899 1289650 1273073 1256151 1240554 1227697 1217655 1209870 1203861 1198903 1193774 1187493 1180361
61717 1180361 1173929 1169740 1168152 1168526 1170315 1173438 1177520 1181752 1186192 1192500 1202323 1215242 1229285 1243277
61703 1243277 1257648 1273098 1289542 1306417 1322907 1337800 1350217 1360644 1370108 1378112 1382484 1381546
61691 1381546 1375426 1365146 1351764 1336604 1320807 1304106 1285428 1265247 1245808 1228384 1212007
61680 1212007 1195886 1181221 1169116 1158306 1146930 1135502 1126206 1119975 1116102 1114065 1113657 1113531 1111635
61667 1111635 1107373 1101887 1096179 1090492 1085581 1082741 1081947 1081355 1079482 1076834 1074723 1073416 1072292 1071081
61653 1071081 1069976 1068664 1065940 1060429 1051638 1040364 1028085 1015854 1003921 992479 982204 973550
61641I73550p640p787q528r142r500r491q783p571o575n830m578k893k209l312
61627H79711m991n693n547n616o004o018n499m670l204q55J190J131j019l048
61613H29868l048j529m79q08j392p15J121K492K427J799J906K611L056L620N483
61598H46412Q178R539Q657P175O645O255M603K379J434J971K540K465K669L928
61584I14850N722O990P164O269M756L350K528K251K437L083L500K376l05k464
61570I62507k436j706l218p164j0382j0426q455p179p353p627p003n964n269m942
61556H73383m745m931n805o823o838n455l726l112l994n682p514r184j0153r871
61542G85550q783q078q043p758o899o530p223p664o554m773m041m157l526k003
$$ plain form
61641 973550 965910 958123 949595 940453 930953 921462 912679 905108 898533 892703 888125 885232 883023 879711
61627 879711 874720 869027 863480 857864 851860 845842 840343 835673 832469 831614 832804 833935 832916 829868
61613 829868 826820 825291 824812 824004 822612 821897 823018 825510 827937 829736 831642 834253 837309 840929 846412
61598 846412 854590 864129 872786 879961 886606 892861 897464 899843 901277 903248 905788 908253 910922 914850
61584 914850 920572 927562 934726 940995 945751 949101 951629 953880 956317 959400 962900 965276 964971 962507
61570 962507 960071 958365 955147 947983 937601 927175 918720 911541 904188 896561 889558 883594 878325 873383
61556 873383 868638 863707 857902 851079 844241 838786 835060 831948 827954 822272 814758 805574 795421 785550
61542 785550 776767 768689 760646 752888 745989 739459 732236 724572 718018 713245 709204 705047 701521 699518
61528F99518j171j735k588k864l045l346k793r73P53J082O39O90R86N43k13P8
61512F85561J229J373k53j932j740j7J514K276L184M735O073O104M695K515N42
61497G15859KJ704M781O788O051L486J296M65M94J026K092K940K420R15L37J403
61481G52059K534K346J789K337L421L447K610K607L850M901M888M614M679M110
61467H00192J853j390l823m479l700k323j134q07j565k896l937m165l626k699
61453G65501j786j001p8J259K804L958M349M195M129M793O290P737P775O167M472
61438H20564M372N651O808P427Q522J0338J1367J0379Q233O506N246L436J236
61425I10085K01J025K418K763K105J723K267L044L103K471K008K230K603K209
$$ plain form
61528 699518 698347 696612 694024 691160 688115 684769 681976 681003 681756 682838 683477 684167 685153 685696 685483 685561
61512 685561 686790 688163 687910 685978 684238 684221 685735 688011 691195 695930 702003 708107 712802 715317 715859
61497 715859 715861 717565 722346 729134 735185 738671 739967 740432 740926 741952 744044 746984 749404 750319 750656 752059
61481 752059 754593 756939 758728 761065 764486 767933 770543 773150 777000 781901 786789 791403 796082 800192
61467 800192 802045 800655 796832 792353 788653 786330 785196 784389 782824 779928 775991 771826 768200 765501
61453 765501 763715 762714 762636 763895 766699 770657 775006 779201 783330 788123 794413 802150 809925 816092 820564
61438 820564 824936 830587 837395 844822 853344 863682 875049 885428 893661 900167 905413 908849 910085
61425 910085 910286 911311 913729 916492 918597 920320 922587 925631 928734 931205 933213 935443 938046 940255
61411I40255J040K04N30J311J039o98k677l720m194n212o787p642o910n174l487
61396H97878k105p56L30M84l38j128o76J351M114O044N877L776J408M90J298K858
61380I20905M225M917M508K967J437J454K961M189M102L781M582N909O138N064
61366I77139M043L936M321M649N001N471N773N731N347M299K311Q2j207j601k407
61351A022888m047n128m481l015k344k469k228j543j534k414k947k468k041k661
61337I83568l433k738n98J292J683Q91j37q20q84k11Q50J689K313L407N204O960
61321I99036P956Q429Q904R293R287R248R826J0900J1601J1287J0078Q576P545
61308A121966P491P945P580N743L415J916J196M53r7M65J919L007L497M501O351
$$ plain form
61411 940255 941295 941499 942029 943340 944379 943681 941004 937284 933090 927878 921091 913449 906539 901365 897878
61396 897878 895773 895017 895347 895831 895493 894365 893689 895040 899154 905198 911075 914851 916259 916749 918047 920905
61380 920905 925130 930047 934555 937522 938959 940413 943374 947563 951665 955446 960028 965937 972075 977139
61366 977139 981182 985118 989439 994088 999089 1004560 1010333 1016064 1021411 1025710 1028021 1028103 1026896 1025295 1022888
61351 1022888 1018841 1013713 1009232 1006217 1003873 1001404 999176 997633 996099 993685 990738 988270 986229 983568
61337 983568 980135 977397 976799 978091 979774 980665 980528 979708 978824 978613 979463 981152 983465 986872 992076 999036
61321 999036 1006992 1015421 1024325 1033618 1042905 1052153 1061979 1072879 1084480 1095767 1105845 1114421 1121966
61308 1121966 1129457 1137402 1144982 1150725 1154140 1156056 1157252 1157705 1157608 1158073 1159992 1162999 1166496 1170997 1177348
61293A177348P782P993P945Q621R347R073Q168P520O701M587J467r02j330l33
61279A253987P08P83k66j760k797l181l489l929l974l613l942n599p519q285p974
61264A199150p337o042l390k36J660K148K856M658O620P795Q481R155R567R743
61250A244828J0640J2815J5277J6630J6819J6903J7404J7543J6063J2595Q229
61239A405746M701K620Q06k065n573q348j0293j2432j4521j4799j2836j0806j0575
61226A311625j1048j0164q337p680q305p856n118j896k59M70K398N659Q202Q818
61212A276509Q779R752J1295J1587J0258R219J0237J2556J3881J3424J2894J4156
61200A414547J6700J8254J7464J5105J2647J0530Q315N831L424J329n12k015l010
$$ plain form
61293 1177348 1185130 1193123 1201068 1209689 1219036 1228109 1236277 1243797 1250498 1255085 1256552 1255650 1254320 1253987
61279 1253987 1254695 1255478 1255212 1253452 1250655 1247474 1243985 1240056 1236082 1232469 1228527 1222928 1215409 1207124 1199150
61264 1199150 1191813 1185771 1182381 1182145 1183805 1185953 1188809 1193467 1200087 1207882 1216363 1225518 1235085 1244828
61250 1244828 1255468 1268283 1283560 1300190 1317009 1333912 1351316 1368859 1384922 1397517 1405746
61239 1405746 1410447 1413067 1413873 1411808 1406235 1397887 1387594 1375162 1360641 1345842 1333006 1322200 1311625
61226 1311625 1300577 1290413 1282076 1274396 1266091 1258235 1253117 1251221 1250962 1251432 1253830 1259489 1267691 1276509
61212 1276509 1285288 1295040 1306335 1317922 1328180 1337399 1347636 1360192 1374073 1387497 1400391 1414547
61200 1414547 1431247 1449501 1466965 1482070 1494717 1505247 1513562 1519393 1522817 1524146 1523634 1521619 1518609
61187A518609l771m800n901o287o109p011j0097j3820j5211j3383j0596r495j0239
61174A401889j1073j0733r289p144m461j667M33J467K026L100N114P528R168R020
61160A395378P102M580K775K029J732J390J252J767K706L136K338N80j039j585
61146A424141r64L27J926L819N988Q152R974J1392J2703J4359J6546J8853K0495
61133A547711K0912J9923J7452J3765J0012P460N735K934j475n116n578l896l213
61120A626626m503o009o796q181j0848j3014j3038j1960j1830j2952j4347j5688
61108A497460j7014j7544j6675j5500j5694j7119j8112j7860j7103j6585j6019
61097A312235j4704j2329r182o063l712j897L04K919M707M946M376L544J599j905
$$ plain form
61187 1518609 1514838 1510038 1504137 1497850 1491741 1484730 1474633 1460813 1445602 1432219 1421623 1412128 1401889
61174 1401889 1390816 1380083 1370794 1363650 1359189 1357522 1357955 1359422 1361448 1364548 1369662 1377190 1386358 1395378
61160 1395378 1402480 1407060 1409835 1411864 1413596 1414986 1416238 1418005 1420711 1423847 1426185 1426765 1425726 1424141
61146 1424141 1423177 1423504 1425430 1429249 1435237 1443389 1453363 1464755 1477458 1491817 1508363 1527216 1547711
61133 1547711 1568623 1588546 1605998 1619763 1629775 1637235 1642970 1645904 1644429 1639313 1633735 1629839 1626626
61120 1626626 1622123 1616114 1609318 1601137 1590289 1577275 1564237 1552277 1540447 1527495 1513148 1497460
61108 1497460 1480446 1462902 1446227 1430727 1415033 1397914 1379802 1361942 1344839 1328254 1312235
61097 1312235 1297531 1285202 1276020 1269957 1266245 1264348 1264652 1267571 1272278 1277224 1281600 1285144 1286743 1284838
61083A284838n328o804o895p549r076r891q841o160k523J177L537L836L324L833
61069A237478N466P159Q969J1871J5556J8462K0105K1573K3537K5427K6749K7652
61057A450004K8090K7903K7811K8768L0210L0575K9490K8008K6587K4696K2540
61046A754682K1228K0828J9899J7492J4151J0506O403J832k644o761j0535j3295
61034A833786j4271j4216j4747j5923j6250j5226j3909j2587j0158o560l695k744
61022A693500k342o26K399N569Q300J0517J2060J3192J4671J6560J8104J9330
61010A811234K1510K5336K9742L3210L5173L5835L5877L6655L9123M2170M3630
60999B189495M3341M3383M4961M7067M8799N0763N3164N4753N4899N4754N4996
$$ plain form
61083 1284838 1279510 1272706 1265811 1258262 1249186 1239295 1230454 1224294 1221771 1222948 1226485 1230321 1233645 1237478
61069 1237478 1242944 1250103 1259072 1270943 1286499 1304961 1325066 1346639 1370176 1395603 1422352 1450004
61057 1450004 1478094 1505997 1533808 1562576 1592786 1623361 1652851 1680859 1707446 1732142 1754682
61046 1754682 1775910 1796738 1816637 1834129 1848280 1858786 1865189 1867021 1864377 1857616 1847081 1833786
61034 1833786 1819515 1805299 1790552 1774629 1758379 1743153 1729244 1716657 1706499 1699939 1696244 1693500
61022 1693500 1691158 1690532 1692931 1698500 1706800 1717317 1729377 1742569 1757240 1773800 1791904 1811234
61010 1811234 1832744 1858080 1887822 1921032 1956205 1992040 2027917 2064572 2103695 2145865 2189495
60999 2189495 2232836 2276219 2321180 2368247 2417046 2467809 2520973 2575726 2630625 2685379 2740375
60988B740375N4478N2622N1174N1692N2888N2476N0413M8511M7832M8263M9791
60977C300515N2618N6470O0951O5873P0619P4313P7490Q2172Q9327R7592J05591
60966D133531J14007J24065J35371J46596J57079J66808J76127J86588K00480
60957E540652K18316K38322K59617K84165L14255L49564L88118M28957M73089
60948H495055N23700N85994O64351P58549Q65095R82579J112577J255640J412296
60939A6655836J589333J798067K043918K326654K652110L018627L361720L519191
60931C6965456L300869K641273J691784P42990M2717l17350l68812j83145J37846
60922D4653628M14841M12769k3233q37325j783301k586055l092384l296226l268709
$$ plain form
60988 2740375 2794853 2847475 2898649 2950341 3003229 3055705 3106118 3154629 3202461 3250724 3300515
60977 3300515 3353133 3409603 3470554 3536427 3607046 3681359 3758849 3841021 3930348 4027940 4133531
60966 4133531 4247538 4371603 4506974 4653570 4810649 4977457 5153584 5340172 5540652
60957 5540652 5758968 5997290 6256907 6541072 6855327 7204891 7593009 8021966 8495055
60948 8495055 9018755 9604749 10269100 11027649 11892744 12875323 13987900 15243540 16655836
60939 16655836 18245169 20043236 22087154 24413808 27065918 30084545 33446265 36965456
60931 36965456 40266325 42907598 44599382 45342372 45385089 45067739 44698927 44515782 44653628
60922 44653628 45068469 45481238 45458005 44620680 42837379 40251324 37158940 33862714 30594005
60913C0594005l091409k834154k550973k273127k010099j763808j538903j339280
60905A3192252j163370j008084q73478p60240o66393n89162n26800m76326m32642
60896F695757l92253l55328l22543k92825k65580k41824k21297k01715j82761
60887D219631j67570j57972j51273j44130j36767j30773j25476j19488j13515
60878B972667j08640j03655r7048r0010q4518p9840p3893o7045o1552n7940n4678
60867B093848n1153m8326m6436m4306m1301l8230l5930l4292l2817l1156k9121
60856A660780k6917k5107k3680k1749j8937j6288j4893j4390j3886j3513j3767
60845A457653j3988j3036j1301j0688j2317j5081j6810j6482j5126j4584j5440
$$ plain form
60913 30594005 27502596 24668442 22117469 19844342 17834243 16070435 14531532 13192252
60905 13192252 12028882 11020798 10147320 9387080 8720687 8131525 7604725 7128399 6695757
60896 6695757 6303504 5948176 5625633 5332808 5067228 4825404 4604107 4402392 4219631
60887 4219631 4052061 3894089 3742816 3598686 3461919 3331146 3205670 3086182 2972667
60878 2972667 2864027 2760372 2663324 2573314 2488796 2408956 2335063 2268018 2206466 2148526 2093848
60867 2093848 2042695 1994369 1947933 1903627 1862326 1824096 1788166 1753874 1721057 1689901 1660780
60856 1660780 1633863 1608756 1585076 1563327 1544390 1528102 1513209 1498819 1484933 1471420 1457653
60845 1457653 1443665 1430629 1419328 1408640 1396323 1381242 1364432 1347950 1332824 1318240 1302800
60834A302800j6550j6932j7260j8352j9114j7849j5283j3985j4547j4712j2997
60823A125219j0859j0119j0423j0626j0672j0570r430p289o129o992p721n835
60811A018554k355l43n76j239j266j292j363k28K416M906N650M943M209M352N323
60796A041691O527P182O735N188L053J196O69J846L553L976K848J636J044j52
60782A086992k849n754p227p705q615r832j0175r777r971j1013j1766j1583j0924
60769I69801j0007q446o634o009p255r155r941r240q154p727p760p318o187n417
60755H60551n880o804o721n686n232o004o916p047o667n821l726o78J314J180
60741G95863M82Q53J451Q48j52R1J069J098M41Q06K199K875K334J880K043J800
$$ plain form
60834 1302800 1286250 1269318 1252058 1233706 1214592 1196743 1181460 1167475 1152928 1138216 1125219
60823 1125219 1114360 1104241 1093818 1083192 1072520 1061950 1052520 1045231 1039102 1032110 1024389 1018554
60811 1018554 1016199 1015856 1015280 1014041 1012775 1011483 1010120 1009892 1012308 1017214 1022864 1027807 1032016 1036368 1041691
60796 1041691 1048218 1055400 1062135 1067323 1070376 1071572 1072241 1074087 1077640 1081616 1084464 1086100 1087144 1086992
60782 1086992 1084143 1078389 1071162 1063457 1054842 1045010 1034835 1025058 1015087 1004074 992308 980725 969801
60769 969801 959794 951348 944714 938705 931450 922295 912354 903114 894960 887233 879473 872155 865968 860551
60755 860551 854671 847867 841146 835460 830228 824224 817308 810261 803594 797773 794047 793369 794683 795863
60741 795863 796345 797198 798649 799497 799345 799436 800505 801603 802044 802850 805049 807924 810258 812138 814181 815981
60725H15981P18j95l19j55J01Q58J584R30r18j898r32M38K64j343k983l913m236
60708H03982m092l624l122k519j408P9J188J615J752J556K83k030l806l455j136
60693G85263J480K647J641p94k772k819j403k81k39m20QO33O76Q8p74j700k537
60676G78697l195l998n133n633m144j058J390J790J100P37M23q77k750l547k481
60661G51321m19J358K297K530K465K598L265M322N167N116M067K910K943M231
60647G94171N022L763J427M68J391J997O23j457k084j311r25j653k568k983l371
60632G92510m176m992n285n034m240k570LK577L810L030Q43j146j427J73K307
60617G76383L465L443L168L322L708L863L561K554M85k370m800n663n107m290
$$ plain form
60725 815981 816699 816504 816185 816030 816131 816989 818573 819503 818585 816687 815755 816193 816457 815114 812131 808218 803982
60708 803982 799890 796266 793144 790625 789217 789296 790484 792099 793851 795407 795690 793660 789854 786399 785263
60693 785263 786743 789390 791031 790237 787465 784646 783243 782962 782723 782303 782311 782944 783620 783708 782934 781234 778697
60676 778697 775502 771504 766371 760738 756594 755536 756926 758716 759816 760553 760976 760099 757349 753802 751321
60661 751321 750902 752260 754557 757087 759552 762150 765415 769737 774904 780020 784087 786997 789940 794171
60647 794171 799193 802956 804383 804851 806242 808239 808862 807405 805321 804010 803085 801432 798864 795881 792510
60632 792510 788334 783342 778057 773023 768783 766213 766216 768793 772603 775633 776476 775330 773903 774076 776383
60617 776383 779848 783291 786459 789781 793489 797352 800913 803467 803952 801582 796782 791119 786012 781722
60603G81722l933l611k575q97N83J208J083P37N17M32L96M31O92J317K208K902
60587G83212K874K049Q85j32q77j420j785k074k575l312l666k965j504m65m85
60572G67760p64j94Q94R46m98j660o27J808K869J505j00L47J999K416J434J332
60556G79467L025M411L491J358N55J594K781K922K514K306K145J668J190J302
60542H10729J986K512K232J461J540L462O350P997P346N644M558M112L600L565
60528H67094N145P637Q571O799M045K591K570K605K340K915M869O864P161N944
60514I37150N339P002J0261J3065J4390J4968J5783J6757J7373J7853J9047K1275
60502A110263K3733K4839K3181J8642J2813P718L908M59k943n170n474m870m494
$$ plain form
60603 781722 777789 774178 771603 770706 771289 772497 773580 774317 774834 775266 775662 776093 776785 778102 780310 783212
60587 783212 786086 788135 789020 788888 788011 786591 784806 782732 780157 776845 773179 770214 768710 768245 767760
60572 767760 766996 766802 767696 768642 768144 766484 765857 767665 770534 772039 771939 772286 774285 776701 778135 779467
60556 779467 782492 786903 790394 791752 792307 793901 796682 799604 802118 804424 806569 808237 809427 810729
60542 810729 812715 815227 817459 818920 820460 823922 830272 838269 845615 851259 855817 859929 863529 867094
60528 867094 872239 879876 888447 895246 899291 901882 904452 907057 909397 912312 917181 924045 931206 937150
60514 937150 942489 949491 959752 972817 987207 1002175 1017958 1034715 1052088 1069941 1088988 1110263
60502 1110263 1133996 1158835 1182016 1200658 1213471 1221189 1225097 1225556 1222613 1217443 1211969 1207099 1202605
60489A202605l603p53L535P069Q882J0273J2684J5919J9013K1822K5005K8970
60477A351421L3423L7696M1382M4886M9098N3958N7646N7944N4368M8223M0709
60466A870754L1981K2000J1229K04j0682k0479k7650l1271l1881l0760k8812k6275
60454A728358k3039j8914j3982q868m327n41K890O310R905J4029J9038K4792L0915
60441A766566L7462M4682N2206N9376O6238P3227P9650Q3645Q4202Q2352P9535
60430B509141P5419O8293N7562M5123L3967K5842K0450J6898J5298J6453J9872
60419B904318K2861K2111J5983M981r441k5949m3612o1890q0232r7175j10243
60408B541712j17505j19050j16398j10823j03004r3871q4692p6262o8751o2194
$$ plain form
60489 1202605 1199002 1198249 1201784 1208853 1217735 1228008 1240692 1256611 1275624 1297446 1322451 1351421
60477 1351421 1384844 1422540 1463922 1508808 1557906 1611864 1669510 1727454 1781822 1830045 1870754
60466 1870754 1902735 1924735 1935964 1936168 1925486 1905007 1877357 1846086 1814205 1783445 1754633 1728358
60454 1728358 1705319 1686405 1672423 1663555 1659228 1658687 1661577 1667887 1677792 1691821 1710859 1735651 1766566
60441 1766566 1804028 1848710 1900916 1960292 2026530 2099757 2179407 2263052 2347254 2429606 2509141
60430 2509141 2584560 2652853 2710415 2755538 2789505 2815347 2835797 2852695 2867993 2884446 2904318
60419 2904318 2927179 2949290 2965273 2970254 2960813 2934864 2891252 2829362 2749130 2651955 2541712
60408 2541712 2424207 2305157 2188759 2077936 1974932 1881061 1796369 1720107 1651356 1589162
60398A589162n6482n1098m5742m0979l7416l4476l1081k7328k4272k2127j9947
60387A198214j7252j4740j3053j2006j1375j1448j2190j2711j2136j0493q377
60376A062433o343m805l947l571l501m078n427o533o129m553l536l876m549m558
60362I97027m353m683n035m294k496j019r96k051k614j562N05K000K462L068M400
60347I80359M884K931k38j857j300l33K69J858M964P605P845O250M479L015J848
60332A022579J939M078P088Q798Q464P011N419M064L225K978K823K304J693J390
60318A083853J250J299K312M527O483O446M767L482L695M437M242K895J376O70
60304A131734Q84J329J536K149M199P310R613J0036R701J0104J0840J0588R650
$$ plain form
60398 1589162 1532680 1481582 1435840 1394861 1357445 1322969 1291888 1264560 1240288 1218161 1198214
60387 1198214 1180962 1166222 1153169 1141163 1129788 1118340 1106150 1093439 1081303 1070810 1062433
60376 1062433 1056090 1051285 1047338 1043767 1040266 1036188 1030761 1024228 1018099 1013546 1010010 1006134 1001585 997027
60362 997027 992674 987991 982956 978662 976166 975147 974151 972100 969486 967924 968429 970429 972891 975959 980359
60347 980359 985243 988174 987936 986079 984779 984446 984715 986573 991537 999142 1006987 1013237 1017716 1020731 1022579
60332 1022579 1024518 1028596 1035684 1044482 1052946 1059957 1065376 1069440 1072665 1075643 1078466 1080770 1082463 1083853
60318 1083853 1085103 1086402 1088714 1093241 1099724 1106170 1110937 1114419 1118114 1122551 1126793 1129688 1131064 1131734
60304 1131734 1132618 1133947 1135483 1137632 1141831 1149141 1158754 1168790 1178491 1188595 1199435 1210023 1219673
60291A219673R765J1294J2268J0904P967N693M950M379K295j300m859p116q154
60278A267759q588q374p229n960o125q019r844r721p936o452o418o966o519m840
60264A164768l469l973n826o524m306l20K705L651L765M537O219Q635J1788J5018
60250A196668J7002J7544J8158J9893K1728K2225K1683K1359K1352K0707J9002
60239A417321J6435J2807P731J517n271j2737k0782k7769l1526l1849l0632k9356
60227A265889k7616k4450k0058j5707j2559j0919j0152r229p792o612o442o754
60215A107599o471n738n816p032q020p535o148n295n253m935l593j812o03q3L52
60200A039617Q61Q98K78j64L66J368J650R54K16K41J020K338L935M811L688Q47
$$ plain form
60291 1219673 1229438 1240732 1253000 1263904 1271871 1277564 1282514 1286893 1289188 1287888 1283029 1275913 1267759
60278 1267759 1259171 1250797 1243568 1237608 1231483 1223464 1213620 1203899 1195963 1189511 1183093 1176127 1169608 1164768
60264 1164768 1161299 1157326 1151500 1144976 1140670 1140350 1143055 1146706 1150471 1155008 1161227 1169862 1181650 1196668
60250 1196668 1213670 1231214 1249372 1269265 1290993 1313218 1334901 1356260 1377612 1398319 1417321
60239 1417321 1433756 1446563 1454294 1455811 1450540 1437803 1417021 1389252 1357726 1325877 1295245 1265889
60227 1265889 1238273 1213823 1193765 1178058 1165499 1154580 1144428 1135199 1127407 1120795 1114353 1107599
60215 1107599 1101128 1095390 1089574 1082542 1074522 1066987 1060839 1055544 1050291 1045356 1041763 1039951 1039348 1039265 1039617
60200 1039617 1040478 1041376 1041654 1041490 1041856 1043224 1044874 1045828 1046044 1046285 1047305 1049643 1053578 1058389 1062077 1062924
60184A062924j474j472J17J161Q03R6L52J726L269L802K876J320N96J421L372
60169A080889N906Q785J1230J1771R969P421O177O605P699Q711R524J0000J0133
60156A194820J0502J1584J2883J3617J3856J4052J3890J2821J1448J1066J1744
60145A332283J2026J0917R170Q174Q256Q655Q724Q530Q257P481N515K611K48m50
60131A430397k56r16k753m357m712m324l792k845j545j065j987l037k858k020
60117A393930j819k023j448j57P25J037J698K803L242K363P23j141l348n772p562
60102A383251q080p651o998o456n870m931l585k334j816j837j389l0J472K464
60088A336210L415M814O007O184N694N239M577L380K547L092M379M937M596M255
$$ plain form
60184 1062924 1061450 1059978 1060095 1061256 1062059 1062155 1062507 1064233 1067502 1071304 1074180 1075500 1076096 1077517 1080889
60169 1080889 1086795 1095580 1106810 1118581 1128550 1135971 1142148 1148753 1156452 1165163 1174687 1184687 1194820
60156 1194820 1205322 1216906 1229789 1243406 1257262 1271314 1285204 1298025 1309473 1320539 1332283
60145 1332283 1344309 1355226 1364396 1372570 1380826 1389481 1398205 1406735 1414992 1422473 1427988 1430599 1430847 1430397
60131 1430397 1430141 1429225 1426472 1422115 1417403 1413079 1409287 1406442 1404897 1403832 1401845 1398808 1395950 1393930
60117 1393930 1392111 1390088 1388640 1388483 1389208 1390245 1391943 1394746 1397988 1400351 1401074 1399933 1396585 1390813 1383251
60102 1383251 1375171 1367520 1360522 1354066 1348196 1343265 1339680 1337346 1335530 1333693 1332304 1332274 1333746 1336210
60088 1336210 1339625 1344439 1350446 1356630 1362324 1367563 1372140 1375520 1378067 1381159 1385538 1390475 1395071 1399326
60074A399326M079L669L502M345N427N101L381J980J742J905K103L143N217P000
60060A451920P434P124P337Q522J0210J1556J1802J1224J1421J3552J6439J7782
60048A586323J6993J5293J3386J1012Q693P620P438O350L992K046J371P77m60
60035A680834j217j045j682m365p527r173r867j1294j3221j4114j3877j3722j3929
60022A565801j3782j3356j3475j4152j4782j5601j7226j8904j9123j8043j7444
60011A389913j7924j7915j6184j3656j1799j0546r141q024q312r659j0217q990
59999A247546p133o299o478o349n289l976l023k201j440j555k972m379l748p25
59985A191979K841M776M350K428O74N00J869L116K719J120r9n71j416l032m155
$$ plain form
60074 1399326 1403405 1407074 1410576 1414921 1420348 1425449 1428830 1430810 1432552 1434457 1436560 1439703 1444920 1451920
60060 1451920 1459354 1466478 1473815 1482337 1492547 1504103 1515905 1527129 1538550 1552102 1568541 1586323
60048 1586323 1603316 1618609 1631995 1643007 1651700 1659320 1666758 1673108 1677100 1679146 1680517 1681294 1680834
60035 1680834 1679617 1678572 1676890 1672525 1664998 1655825 1645958 1634664 1621443 1607329 1593452 1579730 1565801
60022 1565801 1552019 1538663 1525188 1511036 1496254 1480653 1463427 1444523 1425400 1407357 1389913
60011 1389913 1371989 1354074 1337890 1324234 1312435 1301889 1292748 1284724 1276412 1266753 1256536 1247546
59999 1247546 1240413 1234114 1227636 1221287 1215998 1212022 1208999 1206798 1205358 1203803 1200831 1196452 1192704 1191979
59985 1191979 1194820 1199596 1203946 1206374 1207048 1207548 1209417 1212533 1215252 1216372 1216273 1215702 1214286 1211254 1207099
59970A207099l690k363j718k256l241l864m001m241n357p388r184r589q941q473
59956A132793q339p513n807m487m439m952m956m218k812q00Q85P97q01j544j12
59941A083695J640J187j217l349m192m315l702j526J723L890L596J880Q58J549
59927A081717L362M973N478N179N229O042O467N240K795O29o96j664k231j748
59913A120772n98l59j704l338l725k885j730n68P61J939K351J925J155N25N00
59898A115021J518L167L853K339l90j869r55R67J858J278K55k44MP76J454J187
59882A130219k03j600j808j159r19j230q94N89K139K933L796N717Q074R604J0420
59867A165678J1515J2716J2733J1275R652Q958Q786Q255P312O486O035N878N866
$$ plain form
59970 1207099 1203409 1201046 1199328 1197072 1193831 1189967 1185966 1181725 1176368 1168980 1159796 1150207 1141266 1132793
59956 1132793 1124454 1116941 1111134 1106647 1102208 1097256 1092300 1088082 1085270 1084470 1085355 1086152 1085351 1083807 1083695
59941 1083695 1085335 1086522 1085305 1081956 1077764 1073449 1069747 1068221 1069944 1073834 1077430 1079310 1080168 1081717
59927 1081717 1085079 1090052 1095530 1100709 1105938 1111980 1118447 1123687 1126482 1127111 1126415 1124751 1122520 1120772
59913 1120772 1120174 1119815 1118111 1114773 1111048 1108163 1106433 1105865 1106626 1108565 1110916 1112841 1113996 1114521 1115021
59898 1115021 1116539 1119706 1123559 1125898 1125508 1123639 1122684 1123651 1125509 1126787 1127042 1126798 1126802 1127578 1129032 1130219
59882 1130219 1130016 1128416 1126608 1125449 1124530 1123300 1122406 1122995 1125134 1128067 1131863 1137580 1145654 1155258 1165678
59867 1165678 1177193 1189909 1202642 1213917 1223569 1232527 1241313 1249568 1256880 1263366 1269401 1275279 1281145
59854A281145N880N987O510P430P851O839M898L628L696L894K683K7k670m019
59840A333779l766k820k372k660k721j622L10K147L745N571P415Q462Q627Q659
59826A362754Q904R117R615J1173J3425J4730J4257J2951J1777J0364Q388P058
59814A494513P730R686J0611R182O190L271J324J61r64k527m073m562l620k209
59800A524713j741k711m361n474n398m518l769l345k306o8K100K317Q42K31K253
59785A498765N890Q979J0718J1474J1100Q883M977Q99j712k282j219R39L950P305
59771A568666R435Q363L824j761n394o395o249o050n566m755m494n114n629n141
59757A533740m039l042k098r64j12l37j959m790q177j0823j1496j0344q740p623
$$ plain form
59854 1281145 1287025 1293012 1299522 1306952 1314803 1321642 1326540 1330168 1333864 1337758 1340441 1340468 1337798 1333779
59840 1333779 1330013 1327193 1324821 1322161 1319440 1317818 1318128 1320275 1324020 1329591 1337006 1345468 1354095 1362754
59826 1362754 1371658 1380775 1390390 1401563 1414988 1429718 1443975 1456926 1468703 1479067 1487455 1494513
59814 1494513 1502243 1511929 1522540 1531722 1537912 1541183 1542507 1542668 1541704 1539177 1535104 1530542 1526922 1524713
59800 1524713 1522972 1520261 1515900 1510426 1505028 1500510 1496741 1493396 1491090 1491022 1493122 1495439 1496281 1496512 1498765
59785 1498765 1504655 1513634 1524352 1535826 1546926 1555809 1560786 1561685 1559973 1557691 1556472 1557411 1561361 1568666
59771 1568666 1578101 1586464 1590288 1588527 1583133 1576738 1570489 1564439 1558873 1554118 1549624 1544510 1538881 1533740
59757 1533740 1529701 1526659 1524561 1523597 1523485 1523148 1521189 1516399 1508222 1497399 1485903 1475559 1466819 1459196
59743A459196o872o408o688p761q968r897j0465j0051q151o114o216q329r515
59730A353761p950n225l568k770j689q90j519k784k887j823j169j456j604q09
59716A317618N86J994L061L457L342L757N424P560Q894R319R426R142Q110O966
59702A398656O761P434Q057Q311Q531Q684Q617Q926J0227J1775J2115J1009R506
59689A518609Q184O579M533K987K937M043M660L275K27k180k033k91K98j079k302
59674A548447j641m1J074K233M208N625M751K577J611K210K566J965J595K086
59660A579266K535K320J946J722J284P81R47J734K336K806M165O610R000J0396
59646A627848J0900J0898J0792J1543J3924J7078J9113J9352J8621J7389J5281
$$ plain form
59743 1459196 1452324 1445916 1439228 1431467 1422499 1412602 1402137 1392086 1383935 1377821 1371605 1363276 1353761
59730 1353761 1345811 1340586 1337018 1334248 1332559 1331669 1330150 1327366 1324479 1322656 1321487 1320031 1318427 1317618
59716 1317618 1318204 1320198 1323259 1326716 1330058 1333815 1339239 1346799 1355693 1365012 1374438 1383580 1391690 1398656
59702 1398656 1405417 1412851 1420908 1429219 1437750 1446434 1455051 1463977 1474204 1485979 1498094 1509103 1518609
59689 1518609 1526793 1533372 1537905 1540892 1543829 1547872 1552532 1555807 1556034 1553854 1551821 1551530 1551828 1550749 1548447
59674 1548447 1546806 1546765 1547839 1550072 1554280 1559905 1564656 1567233 1568844 1571054 1573620 1575585 1577180 1579266
59660 1579266 1581801 1584121 1586067 1587789 1589073 1589854 1590801 1592535 1594871 1597677 1601842 1608452 1617452 1627848
59646 1627848 1638748 1649646 1660438 1671981 1685905 1702983 1722096 1741448 1760069 1777458 1792739
59635A792739J2711J1165J1214J1589J0779Q426M813M52l352m985m373l189k666
59622A845323k420k106k800n505r209j1663j1790j0515r488r589j0480j1099j0651
59609A738008r186p169m679j560J889M964P240Q634R048Q638Q232Q712J0035J1519
59595A794325J2806J3761J3718J1743P788K851j907n721q345j0393j3132j7116
59583A800378k1411k4809k7153k8617k8642k6961k4842k3738k3243k1957j9885
59572A529120j8262j7412j6603j5817j5717j6021j5786j5435j6444j8751k0348
59561A342524j9886j8039j5887j3747j2053j1565j2013j1985j0812r171p498n504
59549A194364l640l114l655l210j037P28M6j883k189j05K484L750L749L552L602
$$ plain form
59635 1792739 1805450 1816615 1827829 1839418 1850197 1858623 1863436 1863888 1860536 1855551 1851178 1847989 1845323
59622 1845323 1842903 1840797 1837997 1832492 1823283 1811620 1799830 1789315 1779827 1770238 1759758 1748659 1738008
59609 1738008 1728822 1721653 1716974 1715414 1717303 1722267 1729507 1738141 1747189 1755827 1764059 1772771 1782806 1794325
59595 1794325 1807131 1820892 1834610 1846353 1854141 1856992 1855085 1849364 1841019 1830626 1817494 1800378
59583 1800378 1778967 1754158 1727005 1698388 1669746 1642785 1617943 1594205 1570962 1549005 1529120
59572 1529120 1510858 1493446 1476843 1461026 1445309 1429288 1413502 1398067 1381623 1362872 1342524
59561 1342524 1322638 1304599 1288712 1274965 1262912 1251347 1239334 1227349 1216537 1207366 1199868 1194364
59549 1194364 1190724 1187610 1183955 1180745 1179708 1180436 1180482 1178599 1176410 1176305 1178789 1182539 1186288 1189840 1193442
59534A193442L210J458j390l596l591j926p29j221k568l287k917k175k221l687
59520A168802n659o048m079j981k611n618p735o945m460k355j237r36j487k347
59506A115304k196o73Q73J233P75L73K04L74J388K925L441K106L37L55K810O437
59490A136066R317J0123R017P746P972R338J0321J0891J2604J5679J8194J9168
59478A276436K0510K4233K8990L0985K7749J9994J0549K456k645n259o896p991
59466A419111p753o121m418l602l293l055l147l372k921k171k867n446p927q759
59452A354259r110j0712j2891j3615j2499j0993j0241j0235j0504j0502r782q676
59440A224499q011p548n858k610N36K305L489M903N413L889J772J491L242N352
$$ plain form
59534 1193442 1196652 1198110 1196720 1193124 1189533 1187607 1186878 1185657 1183089 1179802 1176885 1174710 1172489 1168802
59520 1168802 1163143 1157095 1153016 1151035 1148424 1142806 1135071 1128126 1123666 1121311 1120074 1119138 1117651 1115304
59506 1115304 1113108 1112435 1113308 1114541 1115316 1115689 1115893 1116267 1117655 1120580 1124021 1126127 1126464 1126819 1129629 1136066
59490 1136066 1145383 1155506 1164523 1172269 1180241 1189579 1199900 1210791 1223395 1239074 1257268 1276436
59478 1276436 1296946 1321179 1350169 1381154 1408903 1428897 1439446 1441902 1439257 1433998 1427102 1419111
59466 1419111 1411358 1405237 1400819 1397217 1393924 1390869 1387722 1384350 1381429 1379258 1376391 1370945 1363018 1354259
59452 1354259 1345149 1334437 1321546 1307931 1295432 1284439 1274198 1263963 1253459 1242957 1233175 1224499
59440 1224499 1216488 1208940 1203082 1200472 1201008 1203313 1206802 1211705 1217118 1221007 1222779 1224270 1227512 1232864
59426A232864P093Q954J0646J1003R831Q203O915O024N695N973N885M318J813
59413A325217J88L59J548K550K678J776M22j27O52J459P02j056j522M22L450N590
59397A344308O254O203O348P040Q061Q981R536R574Q784P086N252M216L545J732
59383A436920j522m592o129o731p340p399n969l697k045j196j89J313K671L379
59369A397474L435L070L072M776Q587J2956J5999J7632J9088K0919K2575K3572
59357A553155K3940K3974K4560K7212L2632L9255M3927M3668L6813K3888Q434
59346A881458m300j1118j2876j2074r649n161J298Q787J5835J9611J6450N689
59334A893950q058j8784k4671k7853k9728k9441k6665k2908j9404j6022j2798
$$ plain form
59426 1232864 1239957 1248911 1259557 1270560 1280391 1288594 1295509 1301533 1307228 1313201 1319086 1323404 1325217
59413 1325217 1325405 1325764 1327312 1329862 1332540 1334316 1334738 1334611 1335263 1336722 1337424 1336368 1334846 1335268 1338718 1344308
59397 1344308 1350562 1356765 1363113 1370153 1378214 1387195 1396731 1406305 1415089 1422175 1427427 1431643 1435188 1436920
59383 1436920 1435398 1430806 1424677 1417946 1410606 1403207 1397238 1393541 1391496 1390300 1390111 1391424 1394095 1397474
59369 1397474 1400909 1403979 1407051 1411827 1420414 1433370 1449369 1467001 1486089 1507008 1529583 1553155
59357 1553155 1577095 1601069 1625629 1652841 1685473 1724728 1768655 1812323 1849136 1873024 1881458
59346 1881458 1877158 1866040 1853164 1841090 1831441 1826280 1827578 1836365 1852200 1871811 1888261 1893950
59334 1893950 1885892 1867108 1842437 1814584 1784856 1755415 1728750 1705842 1686438 1670416 1657618
59323A657618j0623r676q916p675o369n192l592j484L99J698K763L663M186M891
59309A621691O539Q311Q299O289M423M450N734O788P487Q751J0925J3410J5464
59296A728561J6838J7890J9208K0817K1944K2098K1910K2165K2520K2274K1781
59285A958006K1819K1979K1245J9774J8360J6398J2453P020K585K62j731n307
59273B092863r886j3629j6034j7967k0059k2201k4167k5817k6959k7652k8329
59262A860163k9245l0003k9891k8524k6250k4183k3424k3736k3583k2089k0222
59251A579013j9049j7800j5309j2519j1430j1723j0877p936m873l361k353j58
59239A461625K917N631Q188J1756J6305K0438K2925K3206K0664J4770O105l424
$$ plain form
59323 1657618 1646995 1637319 1628403 1620728 1614359 1609167 1605575 1604091 1604490 1606188 1608951 1612614 1616800 1621691
59309 1621691 1628230 1636541 1644840 1651129 1655552 1660002 1665736 1672524 1680011 1688762 1699687 1713097 1728561
59296 1728561 1745399 1763289 1782497 1803314 1825258 1847356 1869266 1891431 1913951 1936225 1958006
59285 1958006 1979825 2001804 2023049 2042823 2061183 2077581 2090034 2097054 2099639 2099901 2098170 2092863
59273 2092863 2082977 2069348 2053314 2035347 2015288 1993087 1968920 1943103 1916144 1888492 1860163
59262 1860163 1830918 1800915 1771024 1742500 1716250 1692067 1668643 1644907 1621324 1599235 1579013
59251 1579013 1559964 1542164 1526855 1514336 1502906 1491183 1480306 1472370 1467497 1464136 1461783 1461625
59239 1461625 1464542 1470173 1478361 1490117 1506422 1526860 1549785 1572991 1593655 1608425 1614530 1611106
59227A611106j1600j6883j8791j7917j5470j2429r018n055n15M199Q288J0939
59215A526854J2171J3168J5124J7675J9206J8843J7544J6885J7336J7941J7310
59204A710057J4835J1282Q219O467N212L088l1k892m339m300l497k813k900l702
59190A734686m487m903n622p225q787q692o806m788m174m934o046o692o734o644
59176A648152o956p449p192n965n072n825p797r585j0760j1713j2219j1769j1063
59163A534787j1382j2431j2582j1455j0416j0046r058o676m383l872m465m083
59151A433938k062K91J585J627R97L38K18R35K293L889N637P712R842J1026J0391
59136A488657Q455P056P459Q820R215Q108O729N975N351M518M245M663M014R01
$$ plain form
59227 1611106 1599506 1582623 1563832 1545915 1530445 1518016 1508998 1503943 1503428 1507627 1515915 1526854
59215 1526854 1539025 1552193 1567317 1584992 1604198 1623041 1640585 1657470 1674806 1692747 1710057
59204 1710057 1724892 1736174 1744393 1750860 1756072 1759160 1759129 1756237 1751898 1747598 1744101 1741288 1738388 1734686
59190 1734686 1730199 1725296 1719674 1712449 1703662 1694970 1688164 1683376 1679202 1674268 1668222 1661530 1654796 1648152
59176 1648152 1641196 1633747 1626555 1620590 1615518 1609693 1601896 1592311 1581551 1569838 1557619 1545850 1534787
59163 1534787 1523405 1510974 1498392 1486937 1476521 1466475 1457417 1450741 1446358 1442486 1438021 1433938
59151 1433938 1431876 1432167 1433752 1435379 1436376 1436714 1436932 1437867 1440160 1444049 1449686 1457398 1467240 1478266 1488657
59136 1488657 1497112 1504168 1511627 1520447 1529662 1537770 1544499 1550474 1555825 1560343 1564588 1569251 1573265 1574166
59122A574166l217n600n727n473o224p686r406j1421j3206j3644j2630j1432j1040
59109A457460j1153j0944r856p714n127l576l883m830m587l292k629l174l920
59096A382775m467n614p398q398p793o599o097o315o790p560q671r633j0012r816
59082A277612r071p939p251p712q460p729n317l010k117j934j115P00L103N648
59068A225408P642Q346Q024P976R018J0765J2632J4641J6836J8833K0319K1229
59056A381669K1333K0515J9515J9371J9880J9662J7946J5513J3720J3201J3357
59045A575682J2560R484N106K421K871M094K996l4k251l030m255o498p906p426
59031A583814o355n833n353m730n080o704q133q557r124j0594j1751j1544j1008
$$ plain form
59122 1574166 1570949 1565349 1559622 1554149 1547925 1540239 1530833 1519412 1506206 1492562 1479932 1468500 1457460
59109 1457460 1446307 1435363 1425507 1417793 1412666 1409090 1405207 1400377 1395790 1392498 1389869 1386695 1382775
59096 1382775 1378308 1372694 1365296 1356898 1349105 1342506 1336409 1330094 1323304 1315744 1307073 1297440 1287428 1277612
59082 1277612 1268541 1260602 1253351 1245639 1237179 1229450 1224133 1221123 1219006 1217072 1215957 1216657 1219760 1225408
59068 1225408 1233050 1241396 1249420 1257396 1266414 1277179 1289811 1304452 1321288 1340121 1360440 1381669
59056 1381669 1403002 1423517 1443032 1462403 1482283 1501945 1519891 1535404 1549124 1562325 1575682
59045 1575682 1588242 1597726 1602832 1605253 1608124 1612218 1615214 1615180 1612929 1609899 1605644 1599146 1591240 1583814
59031 1583814 1577459 1571626 1566273 1561543 1556463 1549759 1541626 1533069 1523945 1513351 1501600 1490056 1479048
59018A479048j1485j2501j2827j2405j1825j1115j0209r583r368q852p728o750
59006A354400o549o931p761r129j0206r659p749o224n610m667l213k972m385n014
58992A264331k964N1J103p0j464j834j436o74K60R78J375J929K752L337L814N043
58976A276531O692O930N104L201L331N168P042Q048Q080P360P219R543J4091J8025
58962A386365J9528K0042K1325K2262K0703J6995J3313J0467P532L984M04k393
58950A540527l690l053j280j85m89j052j012r19p60Q61L873N382L404J33j123
58935A540617o35j225l672o032o855o494n610m600m237m914n656n482n032n073
58921A475100m429j527K724N885P305Q353R806J1258J2796J4992J7125J7455J5594
$$ plain form
59018 1479048 1467563 1455062 1442235 1429830 1418005 1406890 1396681 1387098 1377730 1368878 1361150 1354400
59006 1354400 1347851 1340920 1333159 1324030 1313824 1304165 1296416 1290192 1284582 1279915 1276702 1273730 1269345 1264331
58992 1264331 1261367 1261418 1262521 1262451 1260987 1259153 1257717 1257043 1257303 1258281 1259656 1261585 1264337 1267674 1271488 1276531
58976 1276531 1283223 1290153 1295257 1298458 1301789 1306957 1313999 1322047 1330127 1337487 1344706 1354249 1368340 1386365
58962 1386365 1405893 1425935 1447260 1469522 1490225 1507220 1520533 1531000 1538532 1542516 1542920 1540527
58950 1540527 1536837 1533784 1532504 1532319 1531830 1530778 1529766 1528847 1528087 1528948 1532821 1538203 1541607 1541740 1540617
58935 1540617 1539982 1538757 1535085 1529053 1522198 1515704 1510094 1505494 1501257 1496343 1490687 1485205 1480173 1475100
58921 1475100 1470671 1469144 1471868 1477753 1485058 1493411 1503217 1514475 1527271 1542263 1559388 1576843 1592437
58908A592437J3089J1441J0763J0352R476P759N689M278L498K002p30l340m946
58895A661768o916j0495j4212j5856j5871j6281j7235j7304j6532j6489j7386
58884A497191j7699j6710j5208j3475j0795p265m217k465j619j268j434j874k311
58871A400851l181m712n705m798k628j132j013j501k097k804k948j741J46J283
58857A368020J641K384L762M938N633O259O717O748P149Q772J0669J1289J1178
58844A455159J2374J5141J7593J8754J9802K1717K3543K3663K1466J7466J3231
58833A659909J1214J2995J7341K1366K3740K5370K6914K7505K6351K4016K1541
58822A898262J9404J7710J6345J4668J2065Q915O156M052K265P95k62j426l056
$$ plain form
58908 1592437 1605526 1616967 1627730 1638082 1647558 1655317 1661006 1665284 1668782 1670784 1670054 1666714 1661768
58895 1661768 1654852 1644357 1630145 1614289 1598418 1582137 1564902 1547598 1531066 1514577 1497191
58884 1497191 1479492 1462782 1447574 1434099 1423304 1416039 1411822 1409357 1407738 1406470 1405036 1403162 1400851
58871 1400851 1397670 1392958 1387253 1382455 1379827 1378695 1377682 1376181 1374084 1371280 1368332 1366591 1366737 1368020
58857 1368020 1369661 1372045 1375807 1380745 1386378 1392637 1399354 1406102 1413251 1422023 1432692 1443981 1455159
58844 1455159 1467533 1482674 1500267 1519021 1538823 1560540 1584083 1607746 1629212 1646678 1659909
58833 1659909 1671123 1684118 1701459 1722825 1746565 1771935 1798849 1826354 1852705 1876721 1898262
58822 1898262 1917666 1935376 1951721 1966389 1978454 1987369 1993525 1997577 1999842 2000637 2000375 1998949 1995893
58809A995893m399m763n229p504j1364j4777j6538j7337j8348k0024k2114k3814
58797A829682k4234k3694k3896k5555k6922k6102k3881k2357k1776k0805j9232
58786A571228j8138j7830j7701j7797j8398j8607j7431j5842j5473j5788j4972
58775A383251j3167j2139j1954j0872q658p105o752n892l612j294j30O24J894
58762A304194L250M120M827N455N259L913K144N36q93j727j184M85K058K917L234
58747A338588K715Q66j503k861l075l357m173n009n850o915p187n719m059m649
58733A287812o689o677l516L0J899L467O166Q412Q304P172P805J0467J3073J4499
58719A352224J5545J6742J7080J5391J2102R022P484O780M842P17m177p773r601
$$ plain form
58809 1995893 1991494 1986731 1981502 1973998 1962634 1947857 1931319 1913982 1895634 1875610 1853496 1829682
58797 1829682 1805448 1781754 1757858 1732303 1705381 1679279 1655398 1633041 1611265 1590460 1571228
58786 1571228 1553090 1535260 1517559 1499762 1481364 1462757 1445326 1429484 1414011 1398223 1383251
58775 1383251 1370084 1357945 1345991 1335119 1326461 1319356 1312604 1306712 1303100 1301806 1301676 1302300 1304194
58762 1304194 1307444 1311564 1316391 1321846 1327105 1331018 1333162 1333698 1332805 1331078 1329894 1330379 1332437 1335354 1338588
58747 1338588 1341303 1342169 1340666 1337805 1334730 1331373 1327200 1322191 1316341 1309426 1302239 1296520 1292461 1287812
58733 1287812 1281123 1274446 1270930 1270960 1272859 1276326 1282492 1290904 1299208 1306380 1314185 1324652 1337725 1352224
58719 1352224 1367769 1384511 1401591 1416982 1429084 1438106 1445590 1452370 1457212 1457929 1453752 1445979 1436378
58706A436378j0547j1315j2150j3303j4358j4155j2661j1795j2586j2887j0267
58695A300354o054l723l977m387l549k488j884j039M4K41m18m99M64J735L565
58680A278385O805J0173J0979R260Q216R568J1323J1278J0011R093Q687Q381Q348
58667A400507Q400P623N983M623M015L541L258L986N292N772N581O194P306O829
58653A478910M602L038L157K924P55k231m829p817j1816j5723j8869k2257k6092
58640A383752k8528k8562k7788k7601k7015k5114k3189k2471k1799j9687j6851
58629A115147j4718j3088j1203r539q746q228p381o748o587n870m157k787k676
58616A013419k636j447M5N38N14J203K605M010N285O447P186P919R942J3376J6236
$$ plain form
58706 1436378 1425831 1414516 1402366 1389063 1374705 1360550 1347889 1336094 1323508 1310621 1300354
58695 1300354 1294300 1290577 1286600 1282213 1278664 1276176 1274292 1273253 1273297 1273538 1273120 1272621 1273085 1274820 1278385
58680 1278385 1285190 1295363 1306342 1315602 1323818 1333386 1344709 1355987 1365998 1375091 1383778 1392159 1400507
58667 1400507 1408907 1416530 1422513 1427136 1431151 1434692 1437950 1441936 1447228 1453000 1458581 1464775 1472081 1478910
58653 1478910 1483512 1486550 1489707 1492631 1493386 1491155 1486326 1478509 1466693 1450970 1432101 1409844 1383752
58640 1383752 1355224 1326662 1298874 1271273 1244258 1219144 1195955 1173484 1151685 1131998 1115147
58629 1115147 1100429 1087341 1076138 1066599 1057853 1049625 1042244 1035496 1028909 1023039 1018882 1016095 1013419
58616 1013419 1010783 1009336 1009381 1009919 1010433 1011636 1014241 1018251 1023536 1029983 1037169 1045088 1055030 1068406 1084642
58601A084642J6473J3771Q861K803k513n223n784o604q748j0911j2104j2937j3533
58588A048193j2776j0693q983q163o797m597l375l649l415j873j124k232k837
58575I77679j123Q76O81o32q02l59r99j974j429R0N03l55r15o62l39j00M42J041
58557I71623J446K319L900M994M818M636N755P232P291N988M718M137M028M241
58543A037126M448M110L671M436O252P028N675L726K851K743K713L395N268P352
58529A100794Q872J0518J2665J4270J4865J5681J7357J8580J8354J7617J7255
58518A266828J6646J5454J4583J4193J3280J2417J3926J7826K0794K1003K0944
58507A447894K3171K6360K8199K9261L1102L2968L3277L2320L0958K8632K5043
$$ plain form
58601 1084642 1101115 1114886 1123747 1126550 1124037 1118814 1113030 1106426 1097678 1086767 1074663 1061726 1048193
58588 1048193 1035417 1024724 1015741 1007578 1000781 996184 992809 989160 985745 983872 982748 980516 977679
58575 977679 976556 977432 978113 977481 976679 976320 975321 973347 971918 972008 972511 972156 971241 970579 970240 970140 970582 971623
58557 971623 973069 975388 979288 984282 989100 993736 999491 1006723 1014014 1020002 1024720 1028857 1032885 1037126
58543 1037126 1041574 1045684 1049355 1053791 1060043 1067071 1072746 1076472 1079323 1082066 1084779 1088174 1093442 1100794
58529 1100794 1109666 1120184 1132849 1147119 1161984 1177665 1195022 1213602 1231956 1249573 1266828
58518 1266828 1283474 1298928 1313511 1327704 1340984 1353401 1367327 1385153 1405947 1426950 1447894
58507 1447894 1471065 1497425 1525624 1554885 1585987 1618955 1652232 1684552 1715510 1744142 1769185
58496A769185K1605J8949J5225R076K071l873q926j3170j5063j4508j4416j6518
58484A749637j8595j8632j8579k0793k3879k5562k6715k8837l0292k9106k7013
58473A481634k6708k7254k6225k4210k3126k1924j8445j3984j1717j1627j0926
58462A265488q677o437n054m136l869m424m501l128j789k206l525m063m116m482
58448A205081m289k928j938k269k041M2J753R47o04l82O60O70P96K599M394M332
58432A206823M387O859R606R571Q516J0103J3359J4412J3141J2932J4961J7490
58420A342160J9754K1953K2666K0740J8429J8270J8310J4903Q702L275n88m432
58408A504142p714q821r079j0629j1722r292m854k539k324o82K942N672O602P494
$$ plain form
58496 1769185 1790790 1809739 1824964 1834040 1836111 1832238 1823312 1810142 1795079 1780571 1766155 1749637
58484 1749637 1731042 1712410 1693831 1673038 1649159 1623597 1596882 1568045 1537753 1508647 1481634
58473 1481634 1454926 1427672 1401447 1377237 1354111 1332187 1313742 1299758 1288041 1276414 1265488
58462 1265488 1256811 1250374 1245320 1241184 1237315 1232891 1228390 1225262 1223473 1221267 1217742 1213679 1209563 1205081
58448 1205081 1200792 1197864 1195926 1193657 1191616 1191658 1193411 1194358 1193754 1193372 1194032 1194702 1195498 1198097 1202491 1206823
58432 1206823 1211210 1218069 1227675 1237246 1245762 1255865 1269224 1283636 1296777 1309709 1324670 1342160
58420 1342160 1361914 1383867 1406533 1427273 1445702 1463972 1482282 1497185 1505887 1509162 1508574 1504142
58408 1504142 1496428 1487607 1478528 1467899 1456177 1446885 1442031 1439492 1437168 1436486 1439428 1445100 1451702 1459196
58394A459196Q634Q900R219J1029J2159R292L635p69l296o216r153r769q931r490
58380A474440j0646r390o730o411p884o870k840K60R49J749L452L910L205M225
58366A441419P205R149R495J0896J3596J4364J1944Q598N419J116l846o806p403
58353A515146p952q929q601p249p013p559o650m895m950o344o136m367l530l172
58339A427799p45K730L863L412N322R286J0662Q161N363M282L538L203N043P547
58325A499466P098M510M130O203O876N999P561J1589J3090J0580Q449R193J0120
58312A604864R634J0070J2178J3159J2181J1922J3028J2977J1718J2279J4675
58301A738685J5548J4959J6742K0794K1914J8067J3212J0414Q556P274Q442J1217
$$ plain form
58394 1459196 1467830 1476730 1485949 1496978 1509137 1518429 1522064 1521295 1517999 1511783 1502630 1492861 1483930 1474440
58380 1474440 1463794 1454404 1447674 1441263 1433379 1426509 1423669 1423929 1424878 1426627 1430079 1433989 1437194 1441419
58366 1441419 1448624 1457773 1467268 1478164 1491760 1506124 1518068 1526666 1532085 1533201 1529355 1522549 1515146
58353 1515146 1507194 1498265 1489664 1482415 1475402 1467843 1461193 1456298 1451348 1445004 1438868 1434501 1430971 1427799
58339 1427799 1427054 1429784 1433647 1437059 1442381 1451667 1462329 1470490 1475853 1480135 1483673 1486876 1491919 1499466
58325 1499466 1506564 1511074 1515204 1521407 1528283 1534282 1541843 1553432 1566522 1577102 1585551 1594744 1604864
58312 1604864 1614498 1624568 1636746 1649905 1662086 1674008 1687036 1700013 1711731 1724010 1738685
58301 1738685 1754233 1769192 1785934 1806728 1828642 1846709 1859921 1870335 1878891 1886165 1894607 1905824
58289A905824J2156J1498J2847J5891J6471J4525J4390J6547J7051J6089J8473
58278B071762K4205K7322K5987K5102K6798K7188K4937K4187K6170K6548K3895
58267B354101K2315K2901K1314J6692J4128J5345J5776J3850J4007J7394J8911
58256B546734J6990J6888K0600K3022K1973K2406K6534K9380K8563K8889L2683
58245B814662L5014L3229L1859L3490L4253L2798L3964L8826M1132L8477L6997
58234C204701M0042M2543M1639M2177M6409M9037M8112M9748N6156O0415N9301
58223C740280N9649O5363O9989O9440P0100P6334Q1693Q1017Q0045Q4354Q9594
58212D567858R1212R3205R8906J03870J05948J11346J22637J32372J36624J42764
$$ plain form
58289 1905824 1917980 1929478 1942325 1958216 1974687 1989212 2003602 2020149 2037200 2053289 2071762
58278 2071762 2095967 2123289 2149276 2174378 2201176 2228364 2253301 2277488 2303658 2330206 2354101
58267 2354101 2376416 2399317 2420631 2437323 2451451 2466796 2482572 2496422 2510429 2527823 2546734
58256 2546734 2563724 2580612 2601212 2624234 2646207 2668613 2695147 2724527 2753090 2781979 2814662
58245 2814662 2849676 2882905 2914764 2948254 2982507 3015305 3049269 3088095 3129227 3167704 3204701
58234 3204701 3244743 3287286 3328925 3371102 3417511 3466548 3514660 3564408 3620564 3680979 3740280
58223 3740280 3799929 3865292 3935281 4004721 4074821 4151155 4232848 4313865 4393910 4478264 4567858
58212 4567858 4659070 4752275 4851181 4955051 5060999 5172345 5294982 5427354 5563978 5706742
58202E706742J55295J66549J70443J72806J78891J83662J83965J86885J96046
58193G301284K03310K04418K08804K23189K39749K51654K65376K85858L05002
58184I488644L17593L33094L58428L84603M04173M25991M58350M93633N24528
58175A3189037N58939O03398O48547O87043P28605P80919Q33503Q77646R23840
58166A9831477R81820J042656J099040J162966J243703J329279J410154J499132
58158B9600227J606620J719956J830112J953818K104717K268843K434415K617599
58150D6136307K831152L058869L292472L561611L893973M280134M713606N227555
58142G6995679N852767O581598P416688Q406259R579818J0901906J2347202J3960791
$$ plain form
58202 5706742 5862037 6028586 6199029 6371835 6550726 6734388 6918353 7105238 7301284
58193 7301284 7504594 7709012 7917816 8141005 8380754 8632408 8897784 9183642 9488644
58184 9488644 9806237 10139331 10497759 10882362 11286535 11712526 12170876 12664509 13189037
58175 13189037 13747976 14351374 14999921 15686964 16415569 17196488 18029991 18907637 19831477
58166 19831477 20813297 21855953 22954993 24117959 25361662 26690941 28101095 29600227
58158 29600227 31206847 32926803 34756915 36710733 38815450 41084293 43518708 46136307
58150 46136307 48967459 52026328 55318800 58880411 62774384 67054518 71768124 76995679
58142 76995679 82848446 89430044 96846732 105252991 114832809 125734715 138081917 152042708
58134A52042708J5777733J7754814J9863992K2178735K4798151K7818109L1443466
58127C11677708L5743463L9758081M0927123L6215865K4547235Q200408q435141
58120D88634742k1572384k9696626l3261298l3551772l1951680k9659459k7454628
58113B81486895k5572750k3894714k2257150k0574511j8808364j6973209j5157147
58106A38249050j3456221j1901071j0488075r238332q171256p256025o443777
58099G1294293n723013n100703m557639m066910l633054l271818k970384k703216
58091C9267556k467806k271139k099290j933259j778911j651015j542317j435900
58083B4087919j333440j244606j162508j075367r89738r18012q55057p90092p29492
$$ plain form
58134 152042708 167820441 185575255 205439247 227617982 252416133 280234242 311677708
58127 311677708 347421171 387179252 428106375 464322240 488869475 497069883 488634742
58120 488634742 467062358 437365732 404104434 370552662 338600982 308941523 281486895
58113 281486895 255914145 232019431 209762281 189187770 170379406 153406197 138249050
58106 138249050 124792829 112891758 102403683 93165351 84994095 77738070 71294293
58099 71294293 65571280 60470577 55912938 51846028 48212974 44941156 41970772 39267556
58091 39267556 36799750 34528611 32429321 30496062 28717151 27066136 25523819 24087919
58083 24087919 22754479 21509873 20347365 19271998 18282260 17364248 16509191 15719099 14989607
58074A4989607o85301o52388o18517n86155n63303n43241n14237m80288m52656
58065I893521m29514m02681l75724l57005l42579l23720l03806k91037k81906
58056F785549k68224k53054k43708k36331k23343k08967k01661j97889j88871
58047D763501j76943j69894j65340j55991j44749j39373j37173j29767j18596
58038C425675j11493j08020j01907r4114r0068q7625q0778p1902o7776o6843o2510
58027B482639n5752n2528n1912m8549m3819m3082m4799m3522m0707m1541m4036
58016A972392m2319l7953l7132l9168l8466l5351l4450l4625l1124k5592k3769
58005A592443k5091k4514k2567k3647k6294k5141k1023j9561k1152k1570k0860
$$ plain form
58074 14989607 14304306 13651918 13033401 12447246 11883943 11340702 10826465 10346177 9893521
58065 9893521 9464007 9061326 8685602 8328597 7986018 7662298 7358492 7067455 6785549
58056 6785549 6517325 6264271 6020563 5784232 5560889 5351922 5150261 4952372 4763501
58047 4763501 4586558 4416664 4251324 4095333 3950584 3811211 3674038 3544271 3425675
58038 3425675 3314182 3206162 3104255 3010141 2920073 2832448 2751670 2679768 2611992 2545149 2482639
58027 2482639 2426887 2374359 2322447 2273898 2230079 2186997 2142198 2098676 2057969 2016428 1972392
58016 1972392 1930073 1892120 1854988 1815820 1777354 1742003 1707553 1672928 1641804 1616212 1592443
58005 1592443 1567352 1542838 1520271 1496624 1470330 1445189 1424166 1404605 1383453 1361883 1341023
57994A341023k2352k4537k3163j9862j9565k1016j9025j4606j3325j4936j4099
57983A134537j0538r079j0200r831q099r137j2309j2577r691q509r937j0044q381
57970A006205q822j1551j2447j1034j1228j3336j3082r617p165p541p869o781
57958H85732o263o557n511l721m147o206o259m201l436m334l948k097j405j603
57944H26044k47J331k47l209k468J388K687M98k13J818J770k122m984l698j677
57929H16671k045k595j021N80J13o10L11J322P02m23p76j138j972k259k188l392
57913H01280n366n354k801k04J225K718M204L742J558J89j64j908m782n231k530
57898G86576p62k774o325q247q594q695q496p739o888n689l455j350j296k499
$$ plain form
57994 1341023 1318671 1294134 1270971 1251109 1231544 1210528 1191503 1176897 1163572 1148636 1134537
57983 1134537 1123999 1114920 1104720 1094889 1086790 1077653 1065344 1052767 1043076 1034567 1024630 1014586 1006205
57970 1006205 997383 985832 973385 962351 951123 937787 924705 915088 907923 900382 892513 885732
57958 885732 879469 872912 867401 863680 859533 853327 847068 842867 839431 835097 831149 829052 827647 826044
57944 826044 825797 827128 826881 823672 821204 822592 825279 825777 825564 827382 829152 827030 822046 818348 816671
57929 816671 814626 812031 811010 811590 811703 811093 811404 812726 813428 813005 812229 811091 809119 806860 804672 801280
57913 801280 795914 790560 787759 787555 788780 791498 795702 799444 801002 801191 801027 799119 794337 789106 786576
57898 786576 785814 783040 776715 768468 759874 751179 742683 734944 728056 722367 718912 717562 716266 713767
57884G13767k405j109q31j182N87M312O682O887P651R740J0392Q705P609Q633
57870G79438R221P389M881L467J927j027m218o499q625j0920j2159j2210j2623
57857G38042j3346j2251r218p062o891o198l253J08J857K608L322L453L098L730
57843F97999M998M088J98l400l807k142r01m95k95m08o27P6J412J599O10Q81L404
57826G03190N851N999M402K404L16j074j92K512M155L216J223m73k534m891n445
57811G18659l437j196p46j254j489j923k725k545j163n86j557j741N10L263M096
57796G06166L545L306L345L091L333M612N512M773L395K872K967K952L188L735
57782G56792L253J090j092j559q39m20n31n95m82j25O94J383R67JJ06J127J122
$$ plain form
57884 713767 711362 710253 709422 708240 708827 713139 719821 726708 734359 744099 754491 763196 770805 779438
57870 779438 788659 796048 800929 804396 806323 805296 801078 794579 785954 775034 762875 750665 738042
57857 738042 724696 712445 703227 696165 689274 683076 679823 679931 681788 684396 687718 691171 694269 697999
57843 697999 702997 707085 707283 703883 700076 697934 697033 696538 696243 695835 695208 695284 696696 698295 698905 699786 703190
57826 703190 709041 715040 719442 721846 722162 721088 720896 723408 727563 730779 732002 731529 728995 724104 718659
57811 718659 715222 714026 713280 712026 710537 708614 705889 703344 702181 701595 700038 698297 698807 702070 706166
57796 706166 709711 713017 716362 719453 722786 727398 732910 737683 741078 743950 746917 749869 753057 756792
57782 756792 760045 761135 760043 758484 757645 757225 756694 756099 755617 755492 756186 757569 758536 758537 758643 759770 760892
57765G60892l54j571j875k727m526n533n117m979n711n454l714l126n165p303
57751G03737o945n341m944n575o092p319j0110j2479j1928r197o871n527m032
57738F07377k319j293q19j83K92R9J7Q66J859J961J766K205K722K598K865M761
57722F24774P280Q227P058N118L808L796N101O678O920N662M544M476M261K872
57708G00575J339Q99J007O88L40N64O48j76j248j678j781j994j825j030l15K13
57692F96226J552L629M660L949L154L375L211J521k89q06j131k601m054l780k467
57677G06149j799j756j573j723k551k596p60J391J856J289J447K142K378K777
57663G06671M127M947L591J558J516K884K699L83j517j342j46P22J285J756J674
$$ plain form
57765 760892 760538 758967 757092 754365 749839 744306 739189 734210 728499 723045 719331 716205 711040 703737
57751 703737 696792 691451 686507 680932 674840 667521 657411 644932 633004 623807 616936 611409 607377
57738 607377 605058 603765 602946 602763 603055 603154 603171 604037 605896 607857 609623 611828 614550 617148 620013 624774
57722 624774 632054 640281 647339 652457 656265 660061 665162 671840 678760 684422 688966 693442 697703 700575
57708 700575 701914 702813 703820 704508 704848 705412 706060 705884 704636 702958 701177 699183 697358 696328 696013 696226
57692 696226 697778 701407 706067 710016 713170 716545 719756 721277 720988 720182 719051 716450 712396 708616 706149
57677 706149 704350 702594 701021 699298 696747 694151 693391 694782 696638 697927 699374 701516 703894 706671
57663 706671 710798 715745 719336 720894 722410 725294 727993 728376 726859 725517 725371 726093 727378 729134 730808
57648G30808Q55k07j071j498j273q24j302k877m010l560k430j785j203j84K38
57633G09677o13j320p20l61k006m224m338k485p25P13L057N594O134M793M321
57618G17497O463J0491J5158J9604K2567K3474K4337K7965L4254M0690M6382N2618
57606A041500N9058O2196N8483M6991K8786O160j6861l5636m7869n4215n5785
57595A092808n2927m6756l9786l3999k9551k5862k2703j9931j7331j5083j3379
57584G75500j1772r870q173p037n701l783k703l600m881m280k541k209l250k979
57570G02721m25K137K591J193r41l048l897k556o35j100l917n604m218k054j855
57555F78392k911l005k125j868k442k542j681p84o90j249j827j934j511r36n09
$$ plain form
57648 730808 731663 731456 730385 728887 727614 726790 725488 722611 718601 715041 712611 710826 709623 709439 709677
57633 709677 709064 707744 707024 706663 704657 700433 696095 693610 692885 693598 696655 702249 708383 713176 717497
57618 717497 723960 734451 749609 769213 791780 815254 839591 867556 901810 942500 988882 1041500
57606 1041500 1100558 1162754 1221237 1268228 1297014 1303174 1286313 1250677 1202808 1148593 1092808
57595 1092808 1039881 993125 953339 919340 889789 863927 841224 821293 803962 788879 775500
57584 775500 763728 753858 745685 738648 732947 729164 726461 722861 717980 713700 711159 708950 705700 702721
57570 702721 702296 704433 707024 708217 707276 704228 700331 697775 697140 696040 692123 686519 682301 680247 678392
57555 678392 675481 672476 670351 668483 666041 663499 661818 661034 660344 659095 657268 655334 653823 652887 652378
57540F52378j1O53P10m81j949k023o58N63P62N32L46m0m03o4N85L33n99n76O10
57521F50668R25q46l115l791l020k299k141k118k180k555k948k885k538k462k997
57506F15698m221n787o580n547l166j135k82K6K93J66k23K56K045L984M962N331
57490F05820N726N697M572K962K278L149M946O500O921O230N420N404N962O432
57476F78019O943P783P987O322L710K627L719N052N238N230O009O622O102N580
57462G56943O695Q968J0422J0120Q686P054N794N171M809L814K056N88J91L62
57448H31673M48O61J190J456J214J281K005K190Q52r11j238L4J588K602L074K721
57432H50840J101j227k880l029j862JJ690K145J038n06r83j85Q30J198J055J047
$$ plain form
57540 652378 652367 653020 653730 653249 651300 649277 648619 649182 649944 650476 650822 650782 650379 650315 650900 651233 650634 650058 650668
57521 650668 651593 650747 647632 643841 640821 638522 636381 634263 632083 629528 626580 623695 621157 618695 615698
57506 615698 611477 605690 599110 593563 590397 589262 588980 589006 589299 589465 589242 589498 591543 595527 600489 605820
57490 605820 611546 617243 621815 624777 627055 630204 635150 641650 648571 654801 660221 665625 671587 678019
57476 678019 684962 692745 700732 707054 710764 713391 717110 722162 727400 732630 738639 745261 751363 756943
57462 756943 763638 772606 783028 793148 801834 808888 814682 819853 824662 828476 830532 831120 831311 831673
57448 831673 832121 832782 833972 835428 836642 837923 839928 842118 842970 842059 840821 840855 842443 845045 848119 850840
57432 850840 851941 850714 847834 844805 842943 842944 844634 846779 847817 847311 846328 846143 846973 848171 849226 850273
57416H50273J680K944M187M617M237L785L626L404L074L238L943M158L235K020
57402H98421J742K572M112O336Q968J0694J0246P956N439M118M548O444Q550R286
57388I89432Q405P398P463Q020Q103Q161R110J0485J1036J0635J0124R668Q802
57375A106842P901Q128R694J1300J1606J0477Q832P863Q173R105R227Q108P024
57362A224280P169P986Q269Q000P768P174N565L885L917N652P220P600P737Q541
57348A320763R439R574R180Q936Q947R123R687J0564J0950J0220Q862P975Q148
57335A442368R229J0741J2074J2590J1995J0768J0023J0786J2977J5061J5359
57324A573971J4080J3305J4353J5990J6342J5714J5995J7580J8765J8439J7635
$$ plain form
57416 850273 851953 854897 859084 863701 867938 871723 875349 878753 881827 885065 889008 893166 896401 898421
57402 898421 900163 902735 906847 913183 922151 932845 943091 951047 956486 960604 965152 971596 980146 989432
57388 989432 997837 1005235 1012698 1020718 1028821 1036982 1046092 1056577 1067613 1078248 1088372 1098040 1106842
57375 1106842 1114743 1122871 1132565 1143865 1155471 1165948 1174780 1182643 1190816 1199921 1209148 1217256 1224280
57362 1224280 1231449 1239435 1247704 1255704 1263472 1270646 1276211 1280096 1284013 1289665 1296885 1304485 1312222 1320763
57348 1320763 1330202 1339776 1348956 1357892 1366839 1375962 1385649 1396213 1407163 1417383 1426245 1434220 1442368
57335 1442368 1451597 1462338 1474412 1487002 1498997 1509765 1519788 1530574 1543551 1558612 1573971
57324 1573971 1588051 1601356 1615709 1631699 1648041 1663755 1679750 1697330 1716095 1734534 1752169
57313A752169J7628J7893J7080J5122J3264J2483J2769J3713J4924J5911J6177
57302A919133J5727J5201J5413J6610J8040J8457J7383J5791J5109J5544J6006
57291B098414J5741J5501J6618J9182K1532K1730J9674J7541J7711K0164K2433
57280B306241K2379K0367J8268J7209J7146J7952J9586K1359K2242K2083K1639
57269B526471K1382K1149K0973K1268K1884K1864K0638J8902J8003J8722K0668
57258B751924K2461K2680K1182J9355J8523J8528J8509J8620J9722K1632K2948
57247B976084K2855K2082K1764K2239K3113K3816K3901K3480K3238K3476K3515
57236C229563K2922K2624K3452K4278K3384K1441K0972K2761K4823K5349K4623
$$ plain form
57313 1752169 1769797 1787690 1804770 1819892 1833156 1845639 1858408 1872121 1887045 1902956 1919133
57302 1919133 1934860 1950061 1965474 1982084 2000124 2018581 2035964 2051755 2066864 2082408 2098414
57291 2098414 2114155 2129656 2146274 2165456 2186988 2208718 2228392 2245933 2263644 2283808 2306241
57280 2306241 2328620 2348987 2367255 2384464 2401610 2419562 2439148 2460507 2482749 2504832 2526471
57269 2526471 2547853 2569002 2589975 2611243 2633127 2654991 2675629 2694531 2712534 2731256 2751924
57258 2751924 2774385 2797065 2818247 2837602 2856125 2874653 2893162 2911782 2931504 2953136 2976084
57247 2976084 2998939 3021021 3042785 3065024 3088137 3111953 3135854 3159334 3182572 3206048 3229563
57236 3229563 3252485 3275109 3298561 3322839 3346223 3367664 3388636 3411397 3436220 3461569 3486192
57225C486192K3473K1922K0258J9462J9545J9268J8448J8561J9952K0722J9975
57214C707778J9849K2286K5673K7281K7473K8611L0868L2199L2024L1997L2783
57203D018822L2717L0467K7153K4930K4629K5410K5750K4535K2055J9954J9453
57192D295875J9852J9649J8586J7450J6343J4724J2972J2582J4668J9085K4744
57181D486530L0015L3550L5701L8423M2756M7501N1407N4966N8319N9376N6784
57170D995328N3176N2039N2256M9646M3608L8088L5312L2691K7388K0376J3879
57159E413787P974K031k858n536p135r456j2315j4308j5025j4886j3989j2622
57147E315662j1731j1501j0602q127m910j796J991P306J3277J8562K3212K7866
$$ plain form
57225 3486192 3509665 3531587 3551845 3571307 3590852 3610120 3628568 3647129 3667081 3687803 3707778
57214 3707778 3727627 3749913 3775586 3802867 3830340 3858951 3889819 3922018 3954042 3986039 4018822
57203 4018822 4051539 4082006 4109159 4134089 4158718 4184128 4209878 4234413 4256468 4276422 4295875
57192 4295875 4315727 4335376 4353962 4371412 4387755 4402479 4415451 4428033 4442701 4461786 4486530
57181 4486530 4516545 4550095 4585796 4624219 4666975 4714476 4765883 4820849 4879168 4938544 4995328
57170 4995328 5048504 5100543 5152799 5202445 5246053 5284141 5319453 5352144 5379532 5399908 5413787
57159 5413787 5421761 5423792 5420934 5415398 5408263 5398807 5386492 5372184 5357159 5342273 5328284 5315662
57147 5315662 5303931 5292430 5281828 5273701 5268791 5266995 5268986 5276292 5289569 5308131 5331343 5359209
57135E359209L2385L6615M1409M7430N3921N9843O5131O9745P2785P3617P2642
57124E984732O9942O4773N7455M9984M3472L6737K8837K0859J3447M587p717k2025
57112F345083l4997m5220n3535o0633o6434p1001p4325p5810p5099p2437o7473
57101E648119n9401m9202l9630l1863k4575j7632j3645j3879j5706j6736j8586
57090E347264k3684l0945l7814m4126n0670n6348o0043o3204o7318p1276p4515
57079D767321p9851q9360j00155j08571j15864j25175j35432j43223j48497j53481
57069C567712j58137j61983j68252j80678j97932k16602k37575k63888k94694
57060A687971l27804l66065m14415A07369d28547o05936o86266p76768q75034
$$ plain form
57135 5359209 5391594 5428209 5469618 5517048 5570969 5630812 5695943 5765688 5838473 5912090 5984732
57124 5984732 6054674 6119447 6176902 6226886 6270358 6307095 6335932 6356791 6370238 6374825 6367108 6345083
57112 6345083 6310086 6264866 6211331 6150698 6084264 6013263 5938938 5863128 5788029 5715592 5648119
57101 5648119 5588718 5539516 5499886 5468023 5443448 5425816 5412171 5398292 5382586 5365850 5347264
57090 5347264 5323580 5292635 5254821 5210695 5160025 5103677 5043634 4980430 4913112 4841836 4767321
57079 4767321 4687470 4598110 4497955 4389384 4273520 4148345 4012913 3869690 3721193 3567712
57069 3567712 3409575 3247592 3079340 2898662 2700730 2484128 2246553 1982665 1687971
57060 1687971 1360167 994102 579687 107369 -428547 -1034483 -1720749 -2497517 -3372551
57051c372551r83745j108430j249615j405532j580844j783964k017797k282761
57043a5785239k587009k943260l357693l833876m386717n040920n817659o735110
57035e0487483p816275r074646j0488332j2006062j3583589j5198578j6825584
57028a35480549j8413808j9902287k1262426k2541254k3853172k5235588k6387355
57021b93076439k6546584k4791228k0640639j4417889p013617O63811P980594
57014c77841991J4467172J9670440K3253118K5183788K5736336K5304127K4238511
57007b19988499K2804086K1181566J9472313J7728801J6000330J4341970J2788752
57000i5670681J1348916J0025873Q827698P754236O794358N940086N189425M534246
$$ plain form
57051 -3372551 -4356296 -5464726 -6714341 -8119873 -9700717 -11484681 -13502478 -15785239
57043 -15785239 -18372248 -21315508 -24673201 -28507077 -32893794 -37934714 -43752373 -50487483
57035 -50487483 -58303758 -67378404 -77866736 -89872798 -103456387 -118654965 -135480549
57028 -135480549 -153894357 -173796644 -195059070 -217600324 -241453496 -266689084 -293076439
57021 -293076439 -319623023 -344414251 -365054890 -379472779 -386486396 -385822585 -377841991
57014 -377841991 -363374819 -343704379 -320451261 -295267473 -269531137 -244227010 -219988499
57007 -219988499 -197184413 -176002847 -156530534 -138801733 -122801403 -108459433 -95670681
57000 -95670681 -84321765 -74295892 -65468194 -57713958 -50919600 -44979514 -39790089 -35255843
56992c5255843L959816L458102L028980K667028K359073K095716J873754J686266
56984a4127108J521783J375028J248167J139850J042532R52054Q70434P97552
56976e179708P29143O64638O08333N60667N16389M73227M34542M01389L69376
56967d22004h6011B18468K78332K57701K42813K34546K29741K21402K05116J80705
56957B068824J47831J06358O1581K2312p832l1603n0402o2184o7999p3238p9931
56946B033717q4303q4348q3677q5121q6469q5577q4478q5249q6531q6845q6961
56935A094158q6541q3047p6416p0340o6578o2526n6718n1883m9781m7726m3416
56924C99186l8864l6249l3911k9994k6477k6074k8011l0086l2057l4231l5395
$$ plain form
56992 -35255843 -31296027 -27837925 -24808945 -22141917 -19782844 -17687128 -15813374 -14127108
56984 -14127108 -12605325 -11230297 -9982130 -8842280 -7799748 -6847694 -5977260 -5179708
56976 -5179708 -4450565 -3785927 -3177594 -2616927 -2100538 -1627311 -1192769 -791380 -422004
56967 -422004 -86011 218468 496800 754501 997314 1231860 1461601 1683003 1888119 2068824
56957 2068824 2216655 2323013 2384594 2406906 2399074 2367471 2317069 2254885 2186886 2113648 2033717
56946 2033717 1949414 1865066 1781389 1696268 1609799 1524222 1439744 1354495 1267964 1181119 1094158
56935 1094158 1007617 924570 848154 777814 711236 648710 591992 540109 490328 442602 399186
56924 399186 360322 324073 290162 260168 233691 207617 179606 149520 117463 83232 47837
56913D7837A3000b0835l2851k9984k4584j9376j6710j5525j4196j3243j2830j0879
56901b11013o434j989L15K132N759J0052J2235J1417P923J713n913j1567j3451
56888a98821j3613j4172j3777j0453n487j632N18J725J899J328K027N123Q793
56875b36542J1229J3561J7325K1268K3402K3961K3506K0303J2819K975o159j4060
56863h6412k1084k5230k4445k0768j8303j7836j6914j4542j2239j0664q672n991
56851b83100l957l107k309p21J216K984M569N813O476O791O998O855O503O798
56837b38191P801Q200P463P035P980R049Q820Q071Q100Q248P253N593M320K894
56823a37364M10k353m380o567r875j2623j2282r075n305j911J762N589Q692J1351
$$ plain form
56913 47837 13000 -20835 -53686 -83670 -108254 -127630 -144340 -159865 -174061 -187304 -200134 -211013
56901 -211013 -217447 -219436 -219121 -216989 -211230 -201178 -188943 -177526 -169603 -167890 -173803 -185370 -198821
56888 -198821 -212434 -226606 -240383 -250836 -256323 -257955 -257437 -255712 -253813 -252485 -250458 -245335 -236542
56875 -236542 -225313 -211752 -194427 -173159 -149757 -125796 -102290 -81987 -69168 -66193 -72352 -86412
56863 -86412 -107496 -132726 -157171 -177939 -196242 -214078 -230992 -245534 -257773 -268437 -277109 -283100
56851 -283100 -287057 -290164 -292473 -293194 -291978 -288994 -284425 -278612 -272136 -265345 -258347 -251492 -244989 -238191
56837 -238191 -230390 -222190 -214727 -207692 -199712 -190663 -181843 -173772 -165672 -157424 -150171 -144578 -140258 -137364
56823 -137364 -136954 -139307 -143687 -150254 -160129 -172752 -185034 -194109 -199414 -201325 -199563 -193974 -185282 -173931
56809a73931J4527J7982K0976K4126K8278L2327a081C4911L8565M2341M4963M4714
56797B05494M1281L4200K3170R990k182j1557j7885k0585j9098j4838j0334o370
56785B11286k057K595O540R965J4255J9547K4558K8963L3678L8741M3118M6804
56773D77993N0684N3669N2155M3332K7758Q364j1465k8560m0548m6855m8438m6477
56761D91612m2009l6352l0564k4677j8549j2841q014l244K161P273J1141J4775
56749C50712J9579K4860K9046L2106L4008L1985K2830P775q003k0776l0257l6522
56737D57343l8596l6863l3602k9992k5180j9232j4250j1346r008n775k286M72
56725B31685K826N123O905Q578J1709J6184J8939J7116J0918K211p809j7906k5526
$$ plain form
56809 -173931 -159404 -141422 -120446 -96320 -68042 -35715 -1081 34911 73476 115817 160780 205494
56797 205494 246775 280975 304145 314135 311953 300396 282511 261926 242828 227990 217656 211286
56785 211286 209229 211824 218364 228329 242584 262131 286689 315652 349330 388071 431189 477993
56773 477993 528677 582346 634501 677833 705591 713955 702490 673930 633382 586527 538089 491612
56761 491612 449603 413251 382687 358010 339461 326620 318606 315362 317523 324796 335937 350712
56749 350712 370291 395151 424197 456303 490311 522296 545126 552901 544898 524122 493865 457343
56737 457343 418747 381884 348282 318290 293110 273878 259628 248282 239274 233499 231213 231685
56725 231685 234511 239634 246539 255117 266826 283010 301949 319065 329983 332194 324385 306479 280953
56712B80953k8440k7093k3942k1089j9430j9076j9341j8993j7480j5442j3517
56701E7110j1499r161p005n497m392l306k282j457r33j003j578j540l0J715J349
56686A0491j489D471a148m692k867j185n45j186j857j030P30J314K15p84m94J70
56670a3359K64L45R17J227P67M17R77J938K580a016A845J976O82K15O05N59j5
56653E867N32K553L764K478J74q72p85r24j078m4J900L180L066K062O15j096k581
56636A8811l392l716l738l104j822p99n51l14N92J473J387O38Rn38j167j062N82
56619C289K953M225L691K407J940K916M513N107L983K382K015K712K870K174J959
56604D9136K622K798J922J499K569L852L849L162L118L618L916M168M615M595
$$ plain form
56712 280953 252513 225420 201478 180389 160959 141883 122542 103549 86069 70627 57110
56701 57110 45611 36450 29445 23948 19556 16250 13968 12511 11578 10575 8997 7457 7427 9142 10491
56686 10491 9002 4471 -1148 -5840 -8707 -9892 -10437 -11623 -13480 -14510 -13780 -12466 -12251 -13035 -13529 -13359
56670 -13359 -13095 -12750 -11833 -10606 -9839 -9422 -8445 -6507 -3927 -1016 1845 3821 4503 4718 5323 5882 5867
56653 5867 6399 8952 12716 15194 15368 14496 13711 12787 11709 11665 13565 16745 19811 21873 22488 21392 18811
56636 18811 15419 11703 7965 4861 3039 2240 1689 1375 1967 3440 4827 5465 5474 4936 3769 2707 3289
56619 3289 6242 10467 14158 16565 18505 21421 25934 31041 35024 37406 39421 42133 45003 47177 49136
56604 49136 51758 54556 56478 57977 60546 64398 68247 71409 74527 78145 82061 86229 90844 95439
56590I5439L944M011N625P292P334O526O721P894Q650Q790R224R837R461P665
56576A98413N056K151n18j816j203o0l09k073l999n221n567m662k643j140j625
56561A74784l121l433k371j836k767l962m111l371k531j979j874k295k910l266
56547A34957l324l031j943k49N01q39l048l894l120k404k549k602j944j379j519
56532A03613j629j027l28k89k05J224L736N286M428K280J360K487L782L320J892
56517A29930J719L049L902L288K581K978L625L457L078L276L249K200J452K870
56503A70654N975Q528R470R504R240Q641Q096Q275Q776Q263O206L467J276L45
56489B66716P46J744K113J314J6j030j849k473k408j710j328j439p65J235K827
$$ plain form
56590 95439 99383 103394 109019 116311 123645 130171 136892 144786 153436 162226 171450 181287 190748 198413
56576 198413 203469 205620 205102 203286 202083 202023 201714 199641 195642 190421 184854 180192 177549 176409 174784
56561 174784 171663 168230 165859 164023 161256 157294 153183 149812 147281 145302 143428 141133 138223 134957
56547 134957 131633 128602 126659 126410 126911 126072 123024 119130 116010 113606 111057 108455 106511 105132 103613
56532 103613 101984 100957 100629 100340 100135 101359 105095 110381 114809 117089 118449 120936 124718 128038 129930
56517 129930 131649 134698 138600 141888 144469 147447 151072 154529 157607 160883 164132 166332 167784 170654
56503 170654 176629 185157 194627 204131 213371 222012 230108 238383 247159 255422 261628 265095 266371 266716
56489 266716 267462 269206 271319 272633 272649 271619 269770 267297 264889 263179 261851 260412 259647 260882 263709
56474B63709K130l58k818m435n225m874l455k148j623r26M93J314P71O29K208
56459B45392L263R87l291n696n301m427m137l136j289n51j590k629k516k259k569
56444B10251k475j486q59j559k705l044k447j344k42m6j269k775k890j791r26
56429A84393m82L28Q40l45k169j757J159L510L407K325J721O21j623k998j574
56414A87356J438L446L722K973J379q76k400j977m38M33K24j61n7O07J802L115
56398B00586L625K923J718Q09K90J57O12J129N30j165k139j036J209K681K772
56383B14701K173J388L52p82j316o02J088K348J800K2o12R90K713K055o9n96J067
56366B26720K335J515k7n13k63m17r63j270j138n37O03J799K342K473K906L232
$$ plain form
56474 263709 265839 265481 262663 258228 253003 248129 244674 242526 240903 239977 240470 241784 242555 243184 245392
56459 245392 248655 249642 246351 240655 235354 230927 226790 223654 222365 221814 220224 217595 215079 212820 210251
56444 210251 207776 206290 205431 203872 201167 198123 195676 194332 194090 194044 192775 190000 187110 185319 184393
56429 184393 183911 184239 185079 184734 182565 180808 181967 185477 188884 191209 192930 193551 191928 188930 187356
56414 187356 188794 192240 195962 198935 200314 199438 197038 195061 194623 195056 195280 195119 195062 195669 197471 200586
56398 200586 204211 207134 208852 209661 209951 210108 210720 211849 212379 211214 209075 208039 209248 211929 214701
56383 214701 216874 218262 218614 217832 216516 215914 217002 219350 221150 221172 220560 221550 224263 226318 226249 225653 226720
56366 226720 229055 230570 230543 230030 229767 229350 228387 227117 225979 225442 226045 227844 230186 232659 235565 238797
56350B38797K422Q68K3K7k50q77q64n83j477l078l109j141P10J452K540M438N003
56333B44901K966K14j202j809k570k540r40O99P50R9M98J880L184M244N046M787
56317B60207L536L194M837O635O290M065J656l73k018k289m51K219L869M413M796
56302C00586M924M003K122J64j182j423n13L96o5j064k56K291L420J465j118j537
56286C12213m44J89N91J904L385L641L192L341L884M010M118M614M580L620L171
56271C56009L931M073K454J304K796N079N058L382L029M318N026M536M183M020
56257D09198K833J191J161K892M365M662M767N075M707L472K339J840K013L549
56243D54064O854J0271J1531J0709R647Q916P641N993N365O107P253Q409R829
$$ plain form
56350 238797 241219 242087 242110 242137 241887 241010 240146 239563 238086 235008 231899 230758 231468 232920 235460 239898 244901
56333 244901 247867 248081 246879 245070 242500 239960 239020 239719 240469 240568 241066 242946 246130 250374 255420 260207
56317 260207 263743 266937 271774 278409 284699 288764 290420 290047 288029 285740 285289 287508 291377 295790 300586
56302 300586 305510 309513 311635 311799 310617 309194 308681 309077 309012 307948 307692 309983 313403 314868 313750 312213
56286 312213 311769 311958 312549 314453 317838 321479 324671 328012 331896 335906 340024 344638 349218 352838 356009
56271 356009 359940 364013 366467 367771 370567 375646 380704 384086 387115 391433 396459 400995 405178 409198
56257 409198 412031 413222 414383 417275 421640 426302 431069 436144 440851 444323 446662 448502 450515 454064
56243 454064 460918 471189 482720 493429 503076 511992 519633 525626 530991 537098 544351 552760 562589
56230E62589J0934J0883J0483J1384J3467J5032J5436J5667J6396J7311J8181
56219G17763J8874J8623J6981J5135J4723J5818J7510J9596K1999K3639K3908
56208I24569K4319K6511K9612L1677L2878L4858L7933M1238M4812M9039N2901
56197A330347N5471N8333O3861P1682P9527Q6879R4976J03610J10974J16549J21475
56186B293684J26113J29735J32509J35204J36973J35780J31039J23678J13834
56177C458549J00751Q4666O6671M7000K5560L552j7453l7339n6154p2128q3680
56166C519995r2357j00876j08929j14022j15904j16949j18272j18452j16167j11624
56156B406443j05530r9018r4067r1500q9074q4087p7156p0923o6020o1222n6561
$$ plain form
56230 562589 573523 584406 594889 606273 619740 634772 650208 665875 682271 699582 717763
56219 717763 736637 755260 772241 787376 802099 817917 835427 855023 877022 900661 924569
56208 924569 948888 975399 1005011 1036688 1069566 1104424 1142357 1183595 1228407 1277446 1330347
56197 1330347 1385818 1444151 1508012 1579694 1659221 1746100 1841076 1944686 2055660 2172209 2293684
56186 2293684 2419797 2549532 2682041 2817245 2954218 3089998 3221037 3344715 3458549
56177 3458549 3559300 3643966 3710637 3757637 3783197 3786749 3769296 3731957 3675803 3603675 3519995
56166 3519995 3427638 3326762 3217833 3103811 2987907 2870958 2752686 2634234 2518067 2406443
56156 2406443 2300913 2201895 2107828 2016328 1927254 1843167 1766011 1695088 1629068 1567846 1511285
56145A511285n3116n0444m7346m4369m2427l9999l5188k9537k6054k4391k1884
56134A096530j8553j6765j6409j4837j1660r274q461p526o029n395n510m656l042
56121I68413k526k723j384J151K087J059P07J994L117L502M607O258O537N966
56107I98765P334J0541J2173J1229J0782J2602J4579J5048J5507J7212J8856J9558
56095A164186K0726K3300K6260K9153L3011L7612M1027M2864M5061M8758N3390
56084A565348N9071O6544P4805Q2387R0689J01959J14410J23934J30233J35888
56074B545268J39420J35518J23135J07489R2549P7414O2019N0266M4381M0848
56064C418307L4951K5501J3224j159j5081k4562k8752l0714l2788l5348m0721
$$ plain form
56145 1511285 1458169 1407725 1360379 1316010 1273583 1233584 1198396 1168859 1142805 1118414 1096530
56134 1096530 1077977 1061212 1044803 1029966 1018306 1009032 1000571 993045 987016 981621 976111 971455 968413
56121 968413 965887 963164 961780 962931 965018 966077 966784 968778 971895 975397 980004 986262 992799 998765
56107 998765 1006099 1016640 1028813 1040042 1050824 1063426 1078005 1093053 1108560 1125772 1144628 1164186
56095 1164186 1184912 1208212 1234472 1263625 1296636 1334248 1375275 1418139 1463200 1511958 1565348
56084 1565348 1624419 1690963 1765768 1848155 1938844 2040803 2155213 2279147 2409380 2545268
56074 2545268 2684688 2820206 2943341 3050830 3143379 3220793 3282812 3333078 3377459 3418307
56064 3418307 3453258 3478759 3491983 3490824 3475743 3451181 3422429 3391715 3358927 3323579 3282858
56053C282858n2821p1108q9708j04152j14291j19705j18113j10371j01417r3907
56043B307265q5853p6319o7813o0982n2693m2028l2750k7273k3308j8842j5188
56032A804216j2852r690n497l015k454n24L248N373N339P119J1581J4371J3884
56019A831099J4283J7648K0333K0314K0870K3472K4292K1711K0084K2024K4055
56008B060185K4009K5350K9691L2398L0508K7971K8251K8694K7109K6802K9952
55997B370920L2801L2443L1736L2835L2976L1108L1281L4867L7262L6828L8609
55986B743666M4379M8183M7152M7211N2022N6091N5554N5772O0737O5014O4328
55975C340109O4304O9851P5572P6029P6186Q1866Q8801R1174R2453R7790J04112
$$ plain form
56053 3282858 3230037 3158929 3069221 2965069 2850778 2731073 2612960 2502589 2401172 2307265
56043 2307265 2221412 2145093 2077280 2016298 1963605 1921577 1888827 1861554 1838246 1819404 1804216
56032 1804216 1791364 1781674 1776177 1773162 1770708 1770184 1773432 1778805 1784144 1791263 1802844 1817215 1831099
56019 1831099 1845382 1863030 1883363 1903677 1924547 1948019 1972311 1994022 2014106 2036130 2060185
56008 2060185 2084194 2109544 2139235 2171633 2202141 2230112 2258363 2287057 2314166 2340968 2370920
55997 2370920 2403721 2436164 2467900 2500735 2533711 2564819 2596100 2630967 2668229 2705057 2743666
55986 2743666 2788045 2836228 2883380 2930591 2982613 3038704 3094258 3150030 3210767 3275781 3340109
55975 3340109 3404413 3474264 3549836 3625865 3702051 3783917 3872718 3963892 4056345 4154135 4258247
55964D258247J07573J12266J21538J29590J31945J35066J44939J55409J59002
55955E455575J60049J65589J72704J76864J83348J97799K14565K26833K39101
55946G192427K57116K75358K87557K99530L18182L38251L53786L71580L98557
55937A0092344M27356M50051M74338N09754N49796N84798O20128O63625P07867
55928A5080057P44149P81129Q29578Q82039R28600R78603J044190J116777J183904
55919B3569026J254651J342837J440456J534915J636860J761912J901109K040188
55911C6481954K190861K370201K568070K771531L002220L289753L628294M002977
55903F0305861M438496M974508N615625O357202P233482Q278738R467223J0760896
$$ plain form
55964 4258247 4365820 4478086 4599624 4729214 4861159 4996225 5141164 5296573 5455575
55955 5455575 5615624 5781213 5953917 6130781 6314129 6511928 6726493 6953326 7192427
55946 7192427 7449543 7724901 8012458 8311988 8630170 8968421 9322207 9693787 10092344
55937 10092344 10519700 10969751 11444089 11953843 12503639 13088437 13708565 14372190 15080057
55928 15080057 15824206 16605335 17434913 18316952 19245552 20224155 21268345 22385122 23569026
55919 23569026 24823677 26166514 27606970 29141885 30778745 32540657 34441766 36481954
55911 36481954 38672815 41043016 43611086 46382617 49384837 52674590 56302884 60305861
55903 60305861 64744357 69718865 75334490 81691692 88925174 97203912 106671135 117432031
55895A17432031J2191262J3822423J5672226J7761204K0192541K3066216K6362972
55888B46500875L0025604L3951987L7451265L8627136L4904121K4899421R981529
55881D56341938o231195k0052619k9529572l4579753l6084254l5130106l2725910
55874B62008529k9663038k6415350k3211677k0202089j7504540j5153140j3115672
55867A16743023j1368325r898757q660634p593384o677935n920527n294493m747897
55859E6581071m257552l829379l455315l113410k803021k539469k318440k120199
55851C2144286j942429j795620j672024j551292j432149j328968j241653j156862
55843B0023289j074361j004735r44593q80049q11990p53776p06665o60379o14953
$$ plain form
55895 117432031 129623293 143445716 159117942 176879146 197071687 220137903 246500875
55888 246500875 276526479 310478466 347929731 386556867 421460988 446360409 456341938
55881 456341938 450110743 430058124 400528552 365948799 329864545 294734439 262008529
55874 262008529 232345491 205930141 182718464 162516375 145011835 129858695 116743023
55867 116743023 105374698 95475941 86815307 79221923 72543988 66623461 61328968 56581071
55859 56581071 52323519 48494140 45038825 41925415 39122394 36582925 34264485 32144286
55851 32144286 30201857 28406237 26734213 25182921 23750772 22421804 21180151 20023289
55843 20023289 18948928 17944193 16999600 16119551 15307561 14553785 13847120 13186741 12571788
55834A2571788n79576n52149n21546m88106m61524m40558m14759l84316l58823
55825H370431l38083l13251k85652k65630k53120k37315k15793j97154j84613
55816F079820j73226j63782j63596j72326j81165j86899j93434j99599j98980
55807D446813j92143j86145j81762j73490j61665j52245j45066j34749j22695
55798B996853j15752j13260j07841r8864r2873r0486q5257p6224o9741o7618o4622
55787B014315n9082n5290n4146n1517m6996m4709m4588m2209l7718l5708l6108
55776A506244l4522l1442l1515l3726l2283k7361k5010k6087k5292k1834k0865
55765A196307k3197k3594k0873k0113k2899k4533k2910k1424k1198j8981j4731
$$ plain form
55834 12571788 11992212 11440063 10918517 10430411 9968887 9528329 9113570 8729254 8370431
55825 8370431 8032348 7719097 7433445 7167815 6914695 6677380 6461587 6264433 6079820
55816 6079820 5906594 5742812 5579216 5406890 5225725 5038826 4845392 4645793 4446813
55807 4446813 4254670 4068525 3886763 3713273 3551608 3399363 3254297 3119548 2996853
55798 2996853 2881101 2767841 2660000 2561136 2468263 2377777 2292520 2216296 2146555 2078937 2014315
55787 2014315 1955233 1899943 1845797 1794280 1747284 1702575 1657987 1615778 1578060 1542352 1506244
55776 1506244 1471722 1440280 1408765 1375039 1342756 1315395 1290385 1264298 1239006 1217172 1196307
55765 1196307 1173110 1149516 1128643 1108530 1085631 1061098 1038188 1016764 995566 976585 961854
55754I61854j2885j4072j3586j0144q155r248r312o127k718r74J032L657M470
55741H83792M030N948R718J0410O794K928M98l224q523j1705j2033j3130j5863
55728H59640j6794j5218j4547j5177j3343q930o886q593r100n759k562k946m658
55715G35127m787l909k440J309O756J0096J0007R079P810L105n310j2873j6723
55702G37247j8724k0188j9613j7489j7108j8439j7327j2973r916j0280j0562q768
55690E55860q061j0037j0853p894m492m002m629l943l542n131o636o037m919m868
55676D70816m554l419l848o571q313p122n633o060o516n429m839o022o497m939
55662C91054m387o688q337o092k589j826k704j681J247L570M820N952O381N305
$$ plain form
55754 961854 948969 934897 921311 911167 903012 893764 884452 878325 875607 874633 875665 879322 883792
55741 883792 887822 893770 903488 913898 920692 923620 924118 920894 912371 900666 888633 875503 859640
55728 859640 842846 827628 813081 797904 784561 775631 768745 760152 751052 745293 742731 739785 735127
55715 735127 730340 726431 723991 725300 732056 742152 752159 761238 769048 772153 766843 753970 737247
55702 737247 718523 698335 678722 661233 644125 625686 608359 595386 585470 575190 564628 555860
55690 555860 547799 537762 526909 519015 514523 510521 505892 501949 498407 493276 486640 480603 475684 470816
55676 470816 466262 462843 458995 452424 444111 436989 431356 425296 418780 413351 408512 402490 395993 391054
55662 391054 386667 379979 371642 365550 362961 361135 358431 356750 357997 361567 366387 372339 378720 384025
55648C84025M044L836L279P64k573m906o468p890q259p166o345o924p546p127
55634C30744o866p474p343n625m141l968l180m25K254K573J349L74k94p44K04
55619B97438K584M211M098M122N345N811M017J390p39l245o020o445l579n14J84
55604C08658k2O55Q33o12j170J474N170O504N780N276M966L478J384J72l78j036
55588C41132j227p29j142l153m731m528m506o438q461q206o833o691p216o542
55574B70729n209m913n272m900m195m125l836k259n77m26j093j011l96j20K51
55559B32648R07K20k664n569o159n295m958m800l482j651q63r34q66q60j164o59
55543A93851J107K259J237o64j596j944k694l091k457k101l050l932l543l177
$$ plain form
55648 384025 388069 391905 395184 395948 393375 388469 382001 374111 365852 358686 352341 345417 337871 330744
55634 330744 323878 316404 309061 303436 299295 295327 292147 291722 293976 296549 297898 298272 297978 297234 297438
55619 297438 300022 304233 308331 312453 317798 323609 327626 329016 328277 325032 319012 312567 308988 308474 308658
55604 308658 308636 309291 310124 309512 308342 309816 314986 321490 327270 332546 337512 340990 342374 342546 342168 341132
55588 341132 339905 339176 338034 334881 330150 325622 321116 314678 306217 298011 291178 284487 277271 270729
55574 270729 265520 260607 255335 250435 246240 242115 238279 236020 235443 235017 233924 232913 232517 232397 232648
55559 232648 233555 233775 231111 225542 219383 214088 209130 204330 200848 199197 198334 197400 196534 195674 194510 193851
55543 193851 194958 197217 198454 197790 196194 194250 191556 188465 186008 183907 180857 176925 173382 170205
55529A70205l952m271k673o94o8L93K052L220K100L55J99L54j099k216n0L772
55513A67627N018L314K116K935L867L669L307L311L076K859L418L780K268m40
55499B10125k033k111k257k823k456q53M48K70j157l005m159l414j091M87j01
55484A85870j159m12J665L054L153K359M11k396l994l068j301o88m94M99R59n85
55468A83873k393k134j052j701l160k713j013j140l249m459l802l172l358l056
55454A47471k023j593j769j169kkj171j770j501j616j929r84O37M28k074m347
55438A26586m403k581J28K922M309L166Q84j72o7o08j702j583l36J57k54J02J246
55421A27794J462P62R34J754R57j296j772P59L360L356J826R12N31l47j404j895
$$ plain form
55529 170205 166253 161982 159309 158615 158547 158940 160992 164212 166312 166667 166866 167220 166121 163905 163855 167627
55513 167627 172645 175959 178075 181010 184877 188546 191853 195164 198240 201099 204517 208297 210565 210125
55499 210125 208092 205981 203724 200901 198445 197592 198040 198310 197153 194148 189989 186575 185484 185971 185870
55484 185870 184711 184299 185964 189018 192171 194530 194941 192545 188551 185483 184182 183494 183000 183499 184458 183873
55468 183873 181480 179346 178294 176593 173433 170720 169707 168567 165318 160859 157057 153885 150527 147471
55454 147471 145448 143855 142086 140917 140915 140913 139742 137972 136471 134855 132926 131942 132579 133007 130933 126586
55438 126586 122183 119602 119730 122652 126961 130127 131011 130839 130772 130164 128462 126879 126543 126700 126446 126548 127794
55421 127794 129256 130018 130952 132706 133663 132367 130595 131354 134714 138070 139896 140808 141339 140992 139588 137693
55405A37693k107k441k454j869j244r24o33m62o65n72N66J749J390L9m13l6n59
55388A27058j827j755k18K89j227k589k088q59k92K07J274J845J099R3n2J52q
55371A21102m4M50P58L76j98p58j776k718k053J35J580R59k57k62P87J957L165
55354A23203M218M131K819J927K526L394K911J354pp85j123p05M88J211J22k564
55338A43120n303o597n781l345q63K03m3m65o90j176j681j213L43K023L240L915
55322A25687L395J223j123j491l37l48k282l668k498Q3J888K315J743L51j074
55307A23864j115k6j74k696n369n503l477j654r55m55M53J285J631J616J351Q31
55291A09607L14J58L77O92P29J74q01j372j002k91n1P0Q34J725J486J94q89j293
$$ plain form
55405 137693 135586 133145 130691 128822 127578 126654 126021 125559 124894 124322 124888 126637 128027 128066 127653 127617 127058
55388 127058 125231 123476 123258 123547 122320 119731 117643 116784 116492 116699 117973 119818 120917 121010 120958 121110 121102
55371 121102 121058 121508 122266 122642 122444 121686 119910 117192 115139 115274 116854 117813 117556 117294 118081 120038 123203
55354 123203 127421 131552 134371 136298 138824 142218 145129 146483 146476 145691 144568 143863 144351 145562 145684 143120
55338 143120 137817 131220 125439 122094 121231 121434 121391 120926 120236 119060 117379 116166 116509 118532 121772 125687
55322 125687 129082 130305 129182 127691 127354 127006 124724 121056 118558 118641 120529 122844 124587 124938 123864
55307 123864 122749 122723 122549 119853 114484 108981 105504 103850 102895 102440 102893 104178 105809 107425 108776 109607
55291 109607 109921 110079 110456 111148 111877 112051 111250 109878 108876 108585 108534 108604 109438 111163 112649 112843 111954 110661
55273A10661j517j360k9J932K836K217J172K14j126k407k245q10qo24j353j437
55257A06116j822k790k860j375Q4L28M94J629K400J221q89j756j111l21J13Q04
55241A00265J713J915J086rn54n00l10l27l22L07J587K574K488J764J101K98o48
55224A12428m79J301K419O13k284k343M04J724l80k786k352k81Q20J142K147L203
55208A15296K658P91q62j846k460k319j264m72p77j116l53O94Q13N99J047J394
55192A11823M88p40n61O60J073L26j43M83J489J874J175o12k638l266j836K58
55176A09853J311J316J057L79j107k465k367j012L23J087J454J310O42K33N66
55161A12580P58L9o49j80N67lj385j546p7J303J410Q86N58K42l31p24n46r9J56
$$ plain form
55273 110661 109144 107784 107755 109687 112523 114740 115912 116126 115000 112593 110348 109538 109530 108906 107553 106116
55257 106116 104294 101504 98644 97269 97353 97681 98175 99804 102204 103425 102536 100780 99669 99348 99461 100265
55241 100265 101978 103893 104979 104970 104416 103916 103606 103279 102957 103264 104851 107425 109913 111677 112778 113076 112428
55224 112428 111949 113250 115669 116282 113998 111655 112059 113783 113403 110617 108265 107984 108804 109946 112093 115296
55208 115296 117954 118745 117883 116037 113577 111258 109994 109522 108745 107629 107276 107970 108783 109382 110429 111823
55192 111823 112311 111571 111010 111670 112743 113069 112926 113409 114898 116772 117947 117335 114697 111431 109595 109853
55176 109853 111164 112480 113537 113916 112809 110344 107977 106965 107288 108375 109829 111139 111781 112014 112580
55161 112580 113338 113377 112728 112548 113115 113112 111727 110181 110104 111407 112817 113703 114261 114503 114172 113448 112902 112803 112959
55142A12959J69R5J01L37O04K67r05k060k013o05J217K349K293J368N96P93J500
55125A19065J487O00N6M56P94L25J57J670M157N388M107J025k208m066l788k046
55109A27179o28o59j439j588q39O2N21M64J01K0Q98K493L558L251J988M51j183
55092A34650k573k938k237j508j226n12J089K327J925M66o75j277j790j890r83
55077A22848L98J132J029P54O81Q52J493K441K582J026j492l293l467k285m84
55062A24215J081J741J740K008K586K147n8k663l622k548p07O28R43L05n90o95
55046A26511K68J460K177K588K824K374J176J86Q5L18K24N7J52J53j22r6M61Q74
55028A41670P82P38R08N53l95p29J50J134J185O86J51p19j635j265M55J397J64
$$ plain form
55142 112959 113128 113223 113324 113661 114265 114532 113627 111567 109554 108949 110166 112515 114808 116176 116772 117565 119065
55125 119065 120552 121152 121208 121664 122458 122783 122940 124610 128767 134155 138262 139287 137079 133013 129225 127179
55109 127179 126551 125892 124453 122865 122026 122088 122609 123073 123174 123194 124092 126585 130143 133394 135382 135833 134650
55092 134650 132077 129139 126902 125394 124168 123656 124745 127072 128997 129463 128788 127511 125721 123831 122848
55077 122848 123246 124378 125407 126161 126842 127694 129187 131628 134210 135236 133744 130451 126984 124699 124215
55062 124215 125296 127037 128777 130785 133371 135518 135460 132797 129175 126627 125920 126548 127491 127796 127206 126511
55046 126511 126779 128239 130416 133004 135828 138202 139378 139564 139649 139967 140191 140248 140400 140553 140431 140335 140796 141670
55028 141670 142452 143190 144098 144651 144256 143527 143677 144811 145996 146682 146833 146114 144479 143214 143669 145066 145230
55011A45230j707k045q93M83J653K460K139P93L4M09J46j728l247k774j985k732
54995A36236l287j283J429J037k126l923k509j93R29J393J819J420J83l43L22
54980A31104N94m55j453r50M71J407J446R91M51K28M99O66J02o34l88P79J728
54963A36586J938J751J174L3r33o63N89J625K042K140J589r1j991k603j967j403
54947A39816j281q55nO72J361K603L524K562J04j608j431m51J51M98R79J376J540
54930A49555J569J200K06o05k11Q77J169L26o21j039j144r01k0R93J205N02o38
54913A52423j972k848j810J266L736L133O74n51j9M05K53Q26J942J835O60Q47
54897A60800L092M924M357K416R27J64j81J05P75Q26J10m06n28j060j827j540
$$ plain form
55011 145230 143523 141478 140585 141068 142721 145181 147320 148113 148147 148556 148702 146974 143727 140953 138968 136236
54995 136236 132949 131666 133095 134132 132006 128083 125574 125381 126310 127703 129522 130942 131125 130782 131104
54980 131104 131698 131243 129790 128840 129311 130718 132164 133155 133606 133834 134333 134999 135101 134467 134079 134858 136586
54963 136586 138524 140275 141449 141482 140549 139886 140475 142100 144142 146282 147871 147780 145789 143186 141219 139816
54947 139816 138535 137680 137675 138347 139708 142311 145835 148397 148501 146893 145462 145011 145162 145660 146639 148015 149555
54930 149555 151124 152324 152530 151925 151714 152591 153760 154086 153465 152426 151282 150381 150361 151354 152559 153061 152423
54913 152423 150451 147603 145793 147059 150795 153928 154602 154051 154032 154437 154690 155516 157458 159293 159953 160800
54897 160800 163892 168816 173173 175589 176516 176680 176499 176604 177379 178205 178315 177909 177381 176321 174494 172954
54881A72954k18N32L04O57K294L725L670K735J902J347J515L086N064N217L419
54866B08203K239L197M803N417N634O444P323P790Q583R666R119N896J886n92
54852B85608j674k733l980n069o470q336r326q332o282m698l733l075l307m637
54838B13956n564m692k824j636j151k75J120K253K870L273L417L261L274L610
54824B20892L630L159L209M457O068P083P730Q308Q125O809N403M792M232K749
54810B96646P54j102l341o245q417q586p805p943q824q865p860p055o851o433
54796B08073n554m952m899m876m768m924m901l561r38J093Q45j133k625k246q51
54781A63783j38k59K45J785K399M90k190k508n10O18n97j937j390k55n83j783
$$ plain form
54881 172954 172736 173268 173572 174229 176523 180248 183918 186653 188555 189902 191417 194503 199567 204784 208203
54866 208203 210442 213639 218442 223859 229493 235937 243260 251050 259633 269299 278418 284314 286200 285608
54852 285608 283934 281201 277221 272152 265682 257346 248020 239688 233406 228708 224975 221900 218593 213956
54838 213956 208392 203700 200876 199240 198089 197814 198934 201187 204057 207330 210747 214008 217282 220892
54824 220892 224522 227681 230890 235347 241415 248498 256228 264536 272661 279470 284873 289665 293897 296646
54810 296646 297400 296298 292957 286712 278295 269709 261904 253961 245137 236272 228412 221357 214506 208073
54796 208073 202519 197567 192668 187792 183024 178100 173199 169638 168700 169793 170638 169505 166880 164634 163783
54781 163783 163645 163386 163631 165416 167815 168305 166115 163607 163097 163715 163118 161181 159791 159536 158953 157170
54765A57170k025j333r40p35L35J938K547J633L7j393k195j772m5J809K568K506
54749A60105K589K761K389J731J491J352M90o79p78N06J945K447K222K148K682
54734A83401L443L379J569j581m211m576k609K23K104J920K7j720j573J83J825
54719A81804K700L713N076N433M138K721K845M145N300N978O490O735O739P203
54705B51020Q277Q900Q408P593P075O042L909J746N21o56k880n454p253q738j0528
54690B67982j1316r585o529m836n028n195m057k189m52P70R24k08j373r45Q97
54675B18860K498K996K809K271J533J471K823M602N143M625M672N613O124N732
54661B71772N597O308O643N340K636m57l226n084n577n149m940n347n678n492
$$ plain form
54765 157170 155145 153812 152872 152137 152472 154410 156957 158590 158627 157234 155039 153267 153222 155031 157599 160105
54749 160105 162694 165455 167844 169575 171066 172418 172908 172229 171451 171957 173902 176349 178571 180719 183401
54734 183401 186844 190223 191792 190211 186000 181424 178815 179038 181142 183062 183089 181369 179796 179979 181804
54719 181804 184504 188217 193293 198726 202864 205585 208430 212575 217875 223853 230343 237078 243817 251020
54705 251020 259297 268197 276605 284198 291273 297315 301224 302970 303491 302835 299955 294501 287248 278510 267982
54690 267982 256666 247081 240552 235716 230688 225493 221436 219247 218795 219565 220489 220281 218908 217963 218860
54675 218860 221358 224354 227163 229434 230967 232438 235261 239863 245006 249631 254303 259916 266040 271772
54661 271772 277369 283677 290320 295660 298296 297839 294613 289529 283952 278803 273863 268516 262838 257346
54647B57346n281n439n472m744l363k001j362j863l166m090l673k382j570j758
54633B11182k145j755l97J394K672K396L28k366l985l931l036k397k307k275j713
54618A91665p19k01p69j564j156K51P93l01j345p24N85N68o66j135k2J281J310
54601A87851L21m89o10o18j184k052k141j008J86N7q92r05J88O45k45q56P9J395
54583A79722J509P94K26o35k385l818l384j657l29M09J524K887L347K638J473
54568A82321K44q58j112k20O91O01K38O84J349J121M59M28P19O41R35K318L341
54551A93900K281K65k57O50R21J33l05k70r75k049j747j69P45O91J312K611K359
54534B00096K8j836j398jN45N74R73J233P04nk30k96l92j1O34M92l11k68Q50J338
$$ plain form
54647 257346 252065 246626 241154 236410 233047 231046 229684 227821 224655 220565 216892 214510 212940 211182
54633 211182 209037 207282 206885 208279 210951 213347 213675 211309 207324 203393 200357 197960 195653 193378 191665
54618 191665 190946 190745 189976 188412 187256 187507 188300 187999 186654 185930 186515 187083 186417 185282 185260 186541 187851
54601 187851 188172 187683 187073 186455 185271 183219 181078 180070 180256 180313 179421 178516 178704 179349 179104 178248 178327 179722
54583 179722 181231 182025 182251 181616 179231 175413 172029 170372 170043 170452 171976 174863 178210 180848 182321
54568 182321 182565 181707 180595 180375 181066 181667 181905 182589 183938 185059 185518 185946 186665 187306 188241 190559 193900
54551 193900 196181 196446 196189 196839 197760 197893 197588 197318 196343 194294 192547 192378 193123 193814 195126 197737 200096
54534 200096 200124 198288 196890 196889 197434 198008 198981 200214 200918 200913 200683 200387 199995 199984 200618 201110 200799 200531 201381 202719
54514B02719N30Q9R14J198n73k668k382J03K268K760K303J858J513J050L32o58
54498B11356j398j000N47K034K474K103J444M04r71j806j370J0J502K547K741
54483B20617J943Q23L06K57j34o09o0J206J310l89k070j974n73P27J434J437K76
54466B24527j601k339r77Q99J291O10O92J811K354J312m44j406j071j81J74l05
54450B25346p42k18Q45J217P26M58Q90J215Q54L98L47L44K94R49K364L027J710
54433B40024p04k261k114q15P59J869J950J080N8l99j66O87J863K338J162q16
54417B44515j345M86L040M314M140L577L257L215L353L307K690J907J818K273
54403B80547K198J434J043J240P37j049k781l146k591k061j604j259j776l029
$$ plain form
54514 202719 203249 203338 204252 205450 204877 202209 199827 199930 202198 204958 207261 209119 210632 211682 212014 211356
54498 211356 209958 208958 209505 211539 214013 216116 217560 217964 216993 215187 213817 213827 215329 217876 220617
54483 220617 222560 223383 223689 223946 223812 223203 223143 224349 225659 225270 223200 221226 220653 221380 222814 224251 224527
54466 224527 222926 220587 219610 220509 221800 222410 223102 224913 227267 228579 228135 226729 225658 225477 225651 225346
54450 225346 224604 224386 225231 226448 227174 227632 228522 229737 230591 230989 231336 231680 231974 232923 235287 238314 240024
54433 240024 239320 237059 234945 234130 234889 236758 238708 239788 239846 239447 239281 239968 241831 244169 245331 244515
54417 244515 243170 243656 246696 251010 255150 258727 261984 265199 268552 271859 274549 276456 278274 280547
54403 280547 282745 284179 285222 286462 287199 286150 283369 280223 277632 275571 273967 272708 270932 267903
54389B67903l274j536N16O57r09k244k355j694q19j46l57j518k328j657l35q9
54373B49815j130k049j779o35L45K97q01j718r76J088K292J479K13M04J440J357
54357B49642l3j023o98L4R3m30q69p90o4J109K105K305J706Q38K65L18R15J460
54339B56883J345O81O3k80l09M57K209L677L342J736Q04R05N54n47p79K23L60
54322B71324j483l261k877j286l51K49J636K978K819J779J356J253M41k40N61
54307B74898J627O98j436j473J479M509M969L415J763O94j9l73l53k40j4N17Q45
54290B91506Q1j700l501m743n410n165l666j723o18l88j06K83J6p13p95k36l92
54273B62730j807l389m128m069l262j436O46J233K3r37J5J679J692o1j280k87
$$ plain form
54389 267903 264629 263093 263609 264266 263357 261113 258758 257064 256245 256099 255742 254224 251896 250239 249904 249815
54373 249815 248685 246636 244857 244222 244567 244864 244063 242345 241369 242457 244749 246228 246441 246845 248285 249642
54357 249642 249609 248586 247888 247922 248015 247585 246716 245926 245862 246971 249076 251381 253087 253925 254190 254508 255423 256883
54339 256883 258228 258909 258972 258692 258383 258840 261049 264726 268068 269804 270608 271513 272067 271520 270741 270964 271324
54322 271324 269841 266580 263703 262417 262066 262315 263951 266929 269748 271527 272883 274136 274577 274337 274898
54307 274898 276525 277223 275787 274314 275793 280302 285271 288686 290449 291143 291124 290751 290398 290158 290144 290661 291506
54290 291506 291587 289887 286386 281643 276233 271068 267402 265679 265061 264673 264567 264850 264866 264153 263358 263122 262730
54273 262730 260923 257534 253406 249337 246075 244639 245285 246518 246541 245604 245619 247298 248990 248929 247649 247362
54257B47362K000L481L316K397J662Q10q69k910l828l056j861j824l101m683n674
54242B33222n609m216j787O54K211K845K793J983O09m73p39n89l85J51R06R47
54226B32523J97J42J569K929K626J545J278J122n71k829k855l14J931J851N85
54211B41729PJ94L12K45K69L78P80J723K379J349j017k328j103J245K438K110
54195B50710J444J098Q38O60R13J400J369N92k29m07k24n79j601k137j134P09
54179B53422J527O86n29r70j025j248j014Q5Q20Q7q50l8J906K464J012m34m14
54162B55487K04K36l2kLl10l18M54J296J219J66j233k391k893k745k635l184l788
54144B39534l244j551J33J346K664L915L759J857j07m92K85Q94J115J522J897
$$ plain form
54257 247362 249362 252843 256159 258556 260218 261028 260159 257249 253421 250365 248504 246680 243579 238896 233222
54242 233222 227613 223397 221610 222264 224475 227320 230113 232096 232705 232232 231493 230904 230519 230670 231576 232523
54226 232523 232720 232862 234431 237360 239986 241531 242809 243931 243360 240531 237676 237362 239293 241144 241729
54211 241729 241736 241930 242242 242487 242756 243134 243914 245637 248016 249365 248348 246020 244917 246162 248600 250710
54195 250710 252154 253252 254090 254750 255663 257063 258432 259024 258795 258388 258164 257585 255984 253847 252713 253422
54179 253422 254949 255635 255106 254136 253111 251863 250849 250934 251754 251841 250991 250953 252859 255323 256335 255901 255487
54162 255487 255691 255927 255895 255893 255896 255586 255268 255722 257018 258237 258403 257170 254779 251886 249141 246506 243322 239534
54144 239534 236290 234739 234872 236218 238882 242797 246556 248413 248306 247814 248099 248993 250108 251630 253527
54129B53527J357j55j517j692p35N21J354J613J439Q67Nm36M70K532M134L952
54113B67236K352N31r96k149k509k034j778k453l002k238j140j525k949l324k343
54098B41679j815k249j876J75K110K222J303R03R78P97O93J100J131j78j906k221
54082B42846q77O05J040P38O45J193J982K204J480L68l17n20n73j77R92J822O90
54065B54141j688k239O15M563O166M767K368P44K21N29J248J585J038K05Q3P57
54049B75103J516J996K391K739K874K912L217L796M155L735K411O67o66j294j859
54034C03693k915l668k779m50J408J499N44l5J01L77L79J19j56k9N63P74j49j241
54016B98035n35K067M142L746J806N19N77J136J472J334N19n54m87J458L842M415
$$ plain form
54129 253527 254884 254729 253212 251520 250785 251306 252660 254273 255712 256579 256584 256148 256618 259150 263284 267236
54113 267236 269588 270119 269123 266974 264465 262431 260653 258200 255198 252960 251820 250295 247346 244022 241679
54098 241679 239864 237615 235739 235914 238024 240246 241549 242452 243430 244227 244920 246020 247151 246973 245067 242846
54082 242846 241969 242574 243614 244352 244997 246190 248172 250376 251856 252224 251907 251387 250814 250637 251629 253451 254141
54065 254141 252453 250214 250829 255392 261558 266325 268693 269437 269658 270187 271435 273020 274058 274263 274346 275103
54049 275103 276619 278615 281006 283745 286619 289531 292748 296544 300699 304434 306845 307512 306846 305552 303693
54034 303693 300778 297110 294331 293881 295289 296788 297332 297297 297398 297775 298154 298273 298117 298088 298651 299425 299276 298035
54016 298035 297500 299567 303709 307455 309261 309780 310357 311493 312965 314299 314818 314264 313777 315235 319077 323492
54000C23492K791N63r57j828k313j956l55J824L204K982J686O47O14J115J420
53985C32929J867L373N747P590Q211Q440Q975R133Q188P001P047Q415R923J0877
53971D37716J1560J2062J1856J0791R764R782J0647J0957R518O633L810K215J717
53958E49028J628J723J926J609J48k084m247o256q310r607r113p494o693p320
53944D94938q136q391q853r766r798q152o164n409n558n443n012m715m078k590
53930D02873j190j215k267k748k180j544j561j966k468l095l476k900j350K83
53916C75196J197J306R14L63M3K47R11J818L005M596O452Q071Q768Q126O736O215
53900D33964P433Q732P203K274l044n374m471k754k169k636l061k759j895j005
$$ plain form
54000 323492 326283 326846 325889 324061 321748 319792 319437 321261 324465 327447 329133 329780 330394 331509 332929
53985 332929 334796 338169 343916 351506 359717 368157 377132 386265 394453 401454 408501 416916 426839 437716
53971 437716 449276 461338 473194 483985 493749 503531 514178 525135 534653 541286 545096 547311 549028
53958 549028 550656 552379 554305 555914 556062 553978 549731 543475 535165 525558 516445 508951 502258 494938
53944 494938 486802 478411 469558 459792 449994 441842 435678 430269 424711 419268 414256 409541 405463 402873
53930 402873 401683 400468 398201 395453 393273 391729 390168 388202 385734 382639 379163 376263 374913 375196
53916 375196 376393 377699 378613 378976 379019 379266 380177 381995 385000 389596 396048 404119 412887 421013 427749 433964
53900 433964 441397 450129 457332 459606 456562 451188 446717 443963 441794 439158 436097 433338 431443 430438
53886D30438j76J253L663O000O697N850N263N980P051P411P509Q145Q861Q682
53872E12627P589O272N119M335M259M671M627L927L827N382P909J0051J1470J2364
53858F04429J2247J0715Q859Q521J0137J2236J3004J1959J0368J0137J1644J2726
53846G36982J1023P418N333O061O883N024J390j341k504l237l815l688l441m431
53832G57657o750r164j0824j1679j1827j1786j2574j4065j4400j2629j0787j1184
53820F19988j2922j3480j2760j2607j2959j1869r448q423r815j0980r457o510
53808D88758n051n697o642o416n303m462m636n538o084n559m527m024m044l764
53794D17011l095k824l178l459l219k781k439k193k314l077l933m048l599l341
$$ plain form
53886 430438 430262 431515 435178 441178 447875 453725 458988 464968 472019 479430 486939 495084 503945 512627
53872 512627 520216 526488 531607 535942 540201 544872 549499 553426 557253 562635 570544 580595 592065 604429
53858 604429 616676 627391 636250 644771 654908 667144 680148 692107 702475 712612 724256 736982
53846 736982 748005 755423 760756 766817 773700 778724 780114 778773 776269 773032 769217 765529 762088 757657
53832 757657 750907 741743 730919 719240 707413 695627 683053 668988 654588 641959 631172 619988
53820 619988 607066 593586 580826 568219 555260 543391 533943 525520 515705 504725 495268 488758
53808 488758 483707 478010 471368 464952 459649 455187 450551 445013 438929 433370 428843 424819 420775 417011
53794 417011 413916 411092 407914 404455 401236 398455 396016 393823 391509 388432 384499 380451 376852 373511
53780C73511l020j696L19J463J162N90O83Q95N13j2O7O14J041J175J147J064J153
53763C80669J627K113J919J128O42J035J979K879L427L573L613M057M702M385
53749D17748K669J158J621L326M057L595M062O476R122J0228J0309J0720J1296
53736D96387J0917R393P581O212N625O057P268Q148P555N505L247K151K499L127
53722E81672K474L38j863l089m148o120q170q573p502o902p657q662q954q817
53708E04027q460p451o148n862o812p560p219o558o061m851k768j699l038n282
53694D24258o011n175m527m600m291l132k063j791j911j970k075k185j753n85
53680C82189P03J459J681J649J399Q67K65j20l49o76r21m31R37K135J964Q52N25
$$ plain form
53780 373511 370491 368795 369114 370577 371739 372329 373012 373907 374420 374408 374475 375089 376130 377305 378452 379516 380669
53763 380669 382296 384409 386328 387456 388098 389133 391112 393991 397418 400991 404604 408661 413363 417748
53749 417748 420417 421575 423196 426522 430579 434174 438236 444712 453834 464062 474371 485091 496387
53736 496387 507304 516697 524278 530490 536115 542172 549440 557588 565143 570648 573895 576046 578545 581672
53722 581672 584146 584484 582621 579532 575384 569264 561094 552521 545019 538117 530460 521798 512844 504027
53708 504027 495567 488116 481968 476106 469294 461734 454515 447957 441896 437045 434277 432578 429540 424258
53694 424258 418247 413072 408545 403945 399654 396522 394459 392668 390757 388787 386712 384527 382774 382189
53680 382189 382892 384351 386032 387681 389080 389947 390212 390092 389743 389067 388146 387715 388652 390787 392751 393603 394128
53663C94128J564K419J694K84j5R04J846K555L565M346L723K230J746K520K835
53648D26344K181K389M454O458O252M430K933K260J834J831K675L624L727L484
53634D74876L882M492M325L936M652O038O227M846L578L416L134J331j359l136
53620E20238l178k133j079p58j253j861j570j56J511K521K876K947K618J551J09
53605E22383q04r28j016j678k389k192j145l39m60j040j341j299j111n01Q65K537
53589E09542L534L290J918n4j636j545O19L513N187N054M116L422L144L118L372
53574E46594L936M638N116M734L006Q10L66K847O390P891O568M437L421L470L658
53559F07882L555L240L111L935N890P550P255N466M240M317M627M787N766P338
$$ plain form
53663 394128 395692 398111 399805 400089 400074 400978 402824 405379 408944 413290 417013 419243 420989 423509 426344
53648 426344 428525 430914 435368 441826 448078 452508 455441 457701 459535 461366 464041 467665 471392 474876
53634 474876 478758 483250 487575 491511 496163 502201 508428 513274 516852 520268 523402 524733 523374 520238
53620 520238 517060 514927 513848 513090 511837 509976 508406 508250 509761 512282 515158 518105 520723 522274 522383
53605 522383 521579 520651 519635 517957 515568 513376 512231 511892 511432 510392 509051 507752 506641 506140 507005 509542
53589 509542 513076 516366 518284 518230 516594 515049 515668 519181 524368 529422 533538 536960 540104 543222 546594
53574 546594 550530 555168 560284 565018 568024 568834 569200 572047 578437 586328 592896 597333 600754 604224 607882
53559 607882 611437 614677 617788 621723 627613 635163 642418 647884 652124 656441 661068 665855 671621 678959
53545F78959P302M740K064J971L825N007M818M904O225P519O948M175N77j929
53531G37105k360j448q41j342k423l320l666l002j007J334K115P88j123k123k293
53516G16394k166j695j222j864l699m963m399l071k541k611k422k337k864k905
53502F77635j209J161K005J112K53L72P49Q11R97J645K520L482M355M333K933
53487G03154J394J612L716N999P221P595P641P510P568Q182Q811Q631Q162Q858
53473G96054J0850J2572J3006J3014J3926J5892J8157J9982K0762K0326J9661
53462I74202K0445K3132K6097K7349K6714K5807K6190K7932K9870L1033L1866
53451A270637L3781L7306M1040M2989M2675M1324M0261L9881M0019M0444M0790
$$ plain form
53545 678959 686261 691001 693065 695036 698861 703868 708686 713590 719815 727334 734282 738457 739034 737105
53531 737105 734745 733297 732456 731114 728691 725371 721705 718703 717696 719030 721145 721933 720810 718687 716394
53516 716394 714228 712533 711311 709447 705748 700785 696386 693315 690774 688163 685741 683404 680540 677635
53502 677635 676426 677587 679592 680704 680957 681329 682078 682889 683886 685531 688051 691533 695888 700221 703154
53487 703154 704548 706160 709876 715875 723096 730691 738332 745842 753410 761592 770403 779034 787196 796054
53473 796054 806904 819476 832482 845496 859422 875314 893471 913453 934215 954541 974202
53462 974202 994647 1017779 1043876 1071225 1097939 1123746 1149936 1177868 1207738 1238771 1270637
53451 1270637 1304418 1341724 1382764 1425753 1468428 1509752 1550013 1589894 1629913 1670357 1711147
53440A711147M0584L9618L8104L6601L5880L6409L7596L8091L7401L6549L6547
53429B124527L6960L6801L6049L5144L3697L1239K8787K8008K8829K9435K8808
53418B478284K7727K6905K5677K3380K0733J8733J6980J4255J0418O721M162K191
53406B676166n69m581q864j2337j5350j9150k3752k7291k8093k6747k5324k5037
53394B459071k5564k6304k7196k8296k9433l0443l1166l1216l0391k9218k8515
53383B141329k8466k8658k8743k8390k6812k3294j8224j2970q729n964m728m662
53371A921689m697l574q76K754O370R341J1525J3466J6138J9798K3280K5165K5583
53358B065962K6261K8756L3045L7662M0824M1782M1615M2424M5187M8837N1904
$$ plain form
53440 1711147 1751731 1791349 1829453 1866054 1901934 1938343 1975939 2014030 2051431 2087980 2124527
53429 2124527 2161487 2198288 2234337 2269481 2303178 2334417 2363204 2391212 2420041 2449476 2478284
53418 2478284 2506011 2532916 2558593 2581973 2602706 2621439 2638419 2652674 2663092 2669813 2673975 2676166
53406 2676166 2675597 2671016 2662152 2649815 2634465 2615315 2591563 2564272 2536179 2509432 2484108 2459071
53394 2459071 2433507 2407203 2380007 2351711 2322278 2291835 2260669 2229453 2199062 2169844 2141329
53383 2141329 2112863 2084205 2055462 2027072 2000260 1976966 1958742 1945772 1937043 1931079 1926351 1921689
53371 1921689 1916992 1913418 1912542 1915296 1921666 1931007 1942532 1955998 1972136 1991934 2015214 2040379 2065962
53358 2065962 2092223 2120979 2154024 2191686 2232510 2274292 2315907 2358331 2403518 2452355 2504259
53347B504259N4429N7333O0559O2982O4102O4901O6826P0432P4923P8722Q0883
53336C240351Q2234Q4548Q8141R1228R2206R1632R1063R1009R1137R1435R1680
53325D226664R0639Q7405Q2977P9075P5866P2313O8174O4021N9773N4841M9338
53314E011086M3627L7224K9872K2952J7668J2396M295o534j7100k5918l4683m4872
53302E050013n5257o3931p0698p6150q0155q2651q4528q6557q8477q9937r1058
53291D180614r1364q9672q5904q1762p8841p7360p7177p8290p9636p9295p6998
53280C284315p4653p3258p1254o7323o2790n9381n6530n3109n0188m9223m8575
53269B618031m4865l7649l0189k5433k3371k2677k2645k2775k2234k0886j9743
$$ plain form
53347 2504259 2558688 2616021 2676580 2739562 2803664 2868565 2935391 3005823 3080746 3159468 3240351
53336 3240351 3322585 3407133 3495274 3586502 3678708 3770340 3861403 3952412 4043549 4134984 4226664
53325 4226664 4317303 4404708 4487685 4566760 4642626 4714939 4783113 4847134 4906907 4961748 5011086
53314 5011086 5054713 5091937 5121809 5144761 5162429 5174825 5179120 5172586 5155486 5129568 5094885 5050013
53302 5050013 4994756 4930825 4860127 4783977 4703822 4621171 4536643 4450086 4361609 4271672 4180614
53291 4180614 4089250 3999578 3913674 3831912 3753071 3675711 3598534 3520244 3440608 3361313 3284315
53280 3284315 3209662 3136404 3065150 2997827 2935037 2875656 2819126 2766017 2715829 2666606 2618031
53269 2618031 2573166 2535517 2505328 2479895 2456524 2433847 2411202 2388427 2366193 2345307 2325564
53258B325564j9564j9771j9307j7755j5195j1826q307n720m483l668j974Q03L631
53245B202428N393N946O116O851Q513J0925J3943J7478K1035K3794K5527K6968
53233B374917K8895L1301L3874L6700L9752M1974M1822L8917L4756L1481L0048
53222B764437K9568K8389K5822K2748K0270J8125J5132J1051O891L146j128o636
53210B937815j2195j5975j7898j9709k2833k7180l1975l6728m1065m4458m6594
53199B621205m7728m8460m9424n1133n3562n5776n6398n4893n2168m9758m8444
53188B053461m7857m7247m6356m5506m5060m5066m5416m5973m6426m6232m4945
53177A547377m2566l9520l6486l4235l3052l2113l0174k7386k5600k5964k6853
$$ plain form
53258 2325564 2306000 2286229 2266922 2249167 2233972 2222146 2213839 2208119 2203636 2199968 2197994 2198797 2202428
53245 2202428 2207821 2213767 2219883 2226734 2235247 2246172 2260115 2277593 2298628 2322422 2347949 2374917
53233 2374917 2403812 2435113 2468987 2505687 2545439 2587413 2629235 2668152 2702908 2734389 2764437
53222 2764437 2794005 2822394 2848216 2870964 2891234 2909359 2924491 2935542 2942433 2945579 2944451 2937815
53210 2937815 2925620 2909645 2891747 2872038 2849205 2822025 2790050 2753322 2712257 2667799 2621205
53199 2621205 2573477 2525017 2475593 2424460 2370898 2315122 2258724 2203831 2151663 2101905 2053461
53188 2053461 2005604 1958357 1912001 1866495 1821435 1776369 1730953 1684980 1638554 1592322 1547377
53177 1547377 1504811 1465291 1428805 1394570 1361518 1329405 1299231 1271845 1246245 1220281 1193428
53166A193428k5521k1574j7465j5479j5600j6585j7758j8975j9986k0629k1077
53155I82779k1311k1014k0413k0356k0971k1141j9969j8072j6680j6096j5808
53144G70948j5423j4736j3521j2124j1582j2259j2937j2332j1055j0809j1884
53133F32286j2798j2491j1562j0909j0248q856p087o172o660p799q575q806q795
53120E11528q373o974m808l206l193m123m466l755k938k732k676k147j497j450
53106D59190j980k499k829l254l771l851l106j815o98l62r17j916k717k974k770
53091D23731k385k012j673j233n67J45M84L76K89N09N80M4o68p69k97O1J44M00
53073D17159Q83J134J168J584K491L238L424L309K968K053P68Q9M89J239J537
$$ plain form
53166 1193428 1167907 1146333 1128868 1113389 1097789 1081204 1063446 1044471 1024485 1003856 982779
53155 982779 961468 940454 920041 899685 878714 857573 837604 819532 802852 786756 770948
53144 770948 755525 740789 727268 715144 703562 691303 678366 666034 654979 644170 632286
53133 632286 619488 606997 595435 584526 574278 565422 558335 552163 545503 537704 529129 520323 511528
53120 511528 503155 496181 491373 488167 484974 480851 476385 472630 469692 466960 464284 462137 460640 459190
53106 459190 457210 454711 451882 448628 444857 441006 437900 436085 435387 435025 434108 432192 429475 426501 423731
53091 423731 421346 419334 417661 416428 415861 416006 416490 416866 417155 417664 418244 418288 417620 416851 416554 416615 416759 417159
53073 417159 418042 419176 420344 421928 424419 427657 431081 434390 437358 439411 440179 440268 440757 441996 443533
53058D43533J613K024K532K385J399K25k53L58J474J781N33j372k351k176k067
53043D49638k763l663m132m377m438l622j833m35o79j908k417j682q18r58j892
53028D14021k397j675m32k71j700l133k805j204l25p45j090n81j69n26o83J67
53012C96452J126J012J00p86j716k911l611k981j447K0J049J483R56j08l27O02
52996C88913J006k08j553j198P4K10r18j854k239k677k507m31K598L784K283M26
52980C85709L45J369J694Q77m41j895l164l370j938K69J614J330J19p16m87L55
52964C81670Q38O60M42O43R16R71J252J903J938O46r12j146j98N84R88J948L339
52947C96482L601K042p5j217j178n45J64M55J3o02m72K11K69o26j423j357q59
$$ plain form
53058 443533 445146 447170 449702 452087 453486 453711 453458 453816 455290 457071 457604 456232 453881 451705 449638
53043 449638 446875 443212 439080 434703 430265 426643 424810 424375 423696 421788 419371 417689 416871 415913 414021
53028 414021 411624 409949 409517 409246 407546 404413 401608 400404 400079 399334 398244 397663 397494 396968 396285 396452
53012 396452 397578 398590 398690 397904 396188 393277 389666 386685 385238 385258 386307 387790 388746 388638 388311 388913
52996 388913 389919 389711 388158 386960 387034 387244 386326 384472 382233 379556 377049 376618 379216 383000 385283 385709
52980 385709 386054 387423 389117 389994 389553 387658 384494 381124 379186 379455 381069 382399 382518 381802 381315 381670
52964 381670 382508 383168 383610 384253 385169 386140 387392 389295 391233 391879 390967 389821 389623 390207 391195 393143 396482
52947 396482 400083 402125 402050 400833 399655 399110 399274 399729 399742 399140 398668 398879 399148 398522 397099 395742 394883
52930C94883l97K65J035J076L41K15J592L264L454K256J334J535K024J653L67
52915D14897r15j245m21Q48J590J549J359J734K778M086M970M520K259q43k647
52900D34519j831O63K591K655J356l0q46j358j986k518k335j423p40j131k179
52885D25407k722k369j754j374r27l7J041J768J907J468N07p27j803k492k892
52870D15001l045k716j682j07J351J723L91k020l703l262j136J045K259K659K541
52855D09299J732K40j291k187k321j903j037J57J305J880J524M07p01r52k94M54
52839D06312O75O02O26N43Q4m42p67j319k298k673j318J131K776K776K024J570
52823D10302J541J783K354L047L283K712J324q73l267m059j756K436N225M817
$$ plain form
52930 394883 394486 394751 395786 396862 397203 397418 399010 402274 405728 407984 409318 410853 412877 414530 414897
52915 414897 413982 412737 412316 413164 414754 416303 417662 419396 422174 426260 431230 435750 438009 437166 434519
52900 434519 432688 433351 435942 438597 439953 439923 439077 437719 435733 433215 430880 429457 428717 427586 425407
52885 425407 422685 420316 418562 417188 416261 416224 417265 419033 420940 422408 422915 422188 420385 417893 415001
52870 415001 411956 409240 407558 407451 408802 410525 410916 408896 405193 401931 400795 401840 404099 406758 409299
52855 409299 411031 411271 409980 407793 405472 403569 402532 402689 403994 405874 407398 407805 407104 406152 405858 406312
52839 406312 406987 407589 408215 408758 408842 408400 407633 406314 404016 401343 400025 401156 403932 406708 408732 410302
52823 410302 411843 413626 415980 419027 422310 425022 426346 425473 422206 418147 416391 418827 424052 428869
52809D28869K718J469J780K757L632M101L599J673j030l024l336k258r04l77j089
52794D38580k550l837m405m349m006l695l630l674l236k104j158j538l127m574
52780C92697m877m176l094k078j408j001k62R97J653M61j915l371k965j622j58
52765C68881J632L317L278J072j169j259J75R82O21L35O46O88O7k48N49J910K807
52748C84284K978K781K349J513K72j034k002k552l050l885m737m641l172j307
52734C67797m62p64j043o08k04o76j391r86M78J275L40j090j065L88J396R56K23
52717C64564P14K298L679L975L087J200r79k177j761p42o41j532k118j538k44
52702C67785P56Q00j22j234j384k76J071J656J702J762J542P49L43J361L043L769
$$ plain form
52809 428869 431587 433056 434836 437593 441225 445326 448925 450598 449568 446544 443208 440950 440046 439669 438580
52794 438580 436030 432193 427788 423439 419433 415738 412108 408434 405198 403094 401936 400398 397271 392697
52780 392697 387820 383644 380550 378472 377064 376063 375801 376798 378451 378912 376997 373626 370661 369039 368881
52765 368881 370513 373830 377108 378180 377011 375752 375927 376909 377530 377865 378511 379199 379266 379018 379567 381477 384284
52748 384284 387262 390043 392392 393905 394177 393143 391141 388589 385539 381654 376917 372276 369104 367797
52734 367797 367335 366571 365528 364920 364716 364040 362649 361663 362141 363416 363756 362666 361601 361989 363385 364341 364564
52717 364564 365278 367576 371255 375230 378317 379517 378538 376361 374600 373858 373217 371685 369567 368029 367785
52702 367785 368541 369341 369219 367985 366601 366325 367396 369052 370754 372516 374058 374807 375150 376511 379554 383323
52686C83323L392L004K749J797M64J64J014J463Q75N20J352K500K846K546K137
52671D10146J646J274J605K289K088R37M28J215J665L25j828l023l240l503l726
52656D08298l058j664o32m55p96j264j482r52J68Q56O78N80J284J892J327J88
52640D04968k96l54j062k170k304j133J54O29N60N05N82Q04J184J374R80K45k23
52623D04443l80o61j144j516j828k411l058k956j765k87K63l80j093m55J559L368
52607C91699L649K884K284J857Q65k38q9J237K165K261K867M363N042M028L156
52592D28030M102N452M808K481O73l4q97k181k562j496j93Q2o73j709k172j383
52576D32328M02J745J652R28P92J003P93Q24K112L603L068M09k060k781k484k320
$$ plain form
52686 383323 386715 389719 392468 394265 394729 394893 395907 397370 398245 398765 400117 402617 405463 408009 410146
52671 410146 411792 413066 414671 416960 419048 419985 420413 421628 423293 423618 421790 418767 415527 412024 408298
52656 408298 405240 403576 402944 402489 401693 400429 398947 397995 398163 399019 399697 400277 401561 403453 404780 404968
52640 404968 404672 404318 403256 401086 398782 397649 397803 398432 398992 399497 400079 400883 402067 403441 404421 404666 404443
52623 404443 404063 403402 402258 400742 398914 396503 393445 390489 388724 388437 388700 388320 387227 386772 388331 391699
52607 391699 395348 398232 400516 402373 403238 403000 402911 404148 406313 408574 411441 415804 420846 424874 428030
52592 428030 432132 437584 442392 444873 445546 445512 444615 442434 439872 438376 438183 438265 437592 435883 433711 432328
52576 432328 432730 434475 436127 437055 437847 438850 439643 440467 442579 446182 449250 449659 447599 444818 442334 440014
52560D40014k413k738l558m325l804j967l44Q0l3Rj16n30m33L93Q05R1o00J20
52542D20651J785K801K658K199K053J868J070k90j442j486l28Q21M41j524l324
52527D27953l194j083J567L276L604L232L121L305K691O17j774k697k044j299
52513D37275j127o15P13J641J102o1m18j53m65j350j593r26o66j620k589j932
52497D27216N4J422J211N83Q64J482Q95q80k115j856j126r96q57K42J532J492
52481D29163L80J03J448L001L226K310J347O44j86j145j693j514r13m02j16K54
52465D35907R24J489J329P10Q14K133L462L348J984P41J90j43k96M23J948K999
52449D57962K672J554P66O73R94J385J418O54p15j811k072j855j774j911k042
$$ plain form
52560 440014 437601 434863 431305 426980 423176 421209 420865 420945 420912 420921 420805 420275 419842 420235 421040 421131 420531 420651
52542 420651 422436 425237 427895 430094 432147 434015 435085 434795 433353 431867 431539 432360 432801 431277 427953
52527 427953 424759 423676 425243 428519 432123 435355 438476 441781 444472 445089 443315 440618 438574 437275
52513 437275 436148 435533 436246 437887 438989 438928 438510 438357 437892 436542 434949 434023 433357 431737 429148 427216
52497 427216 427270 428692 429903 430486 431350 432832 433727 432847 430732 428876 427750 426754 425897 426139 427671 429163
52481 429163 429543 429646 431094 434095 437321 439631 440978 441622 441436 440291 438598 437084 436171 435769 435653 435907
52465 435907 436831 438320 439649 440359 441173 443306 446768 450116 452100 452841 453031 452888 452592 453015 454963 457962
52449 457962 460634 462188 462954 463627 464621 466006 467424 468078 467363 465552 463480 461625 459851 457940 455898
52434D55898j995j499k77J129J324m61l050m296l443j940j633k478k578o52K075
52419D36124L140J854J61J40J529K461J969Q19J97O35J985L524M101L182J746
52404D63567J321K003K440J981J784L118N281O073M293J132j135j664j777l043
52390D85374n134o334n925m858l962k771q91P91J290J001R14J116J227J397J614
52375D64849R36j088l049l355k571k259k181r10J172K012J185O45J559K607K448
$$ plain form
52434 455898 453903 452404 452127 453256 454580 454119 451069 446773 443330 441390 439757 437279 434701 434049 436124
52419 436124 439264 441118 441279 441419 442948 445409 447378 448197 448394 449029 451014 454538 458639 461821 463567
52404 463567 464888 466891 469331 471312 473096 476214 481495 487568 491861 492993 491858 490194 488417 485374
52390 485374 480240 473906 467981 463123 459161 456390 455499 456290 457580 458581 459495 460611 461838 463235 464849
52375 464849 465785 464697 461648 458293 455722 453463 451282 450372 451544 453556 454741 455386 456945 459552 462000
$$ [...]
##END NTUPLES=NMR SPECTRUM
##END=
