
##TITLE=UV1128_M3-1004-1000_6275247_l6hmg87Wzp
##JCAMPDX= 6.0         $$ Bruker NMR JCAMP-DX V2.0
##DATA TYPE= NMR SPECTRUM
##DATA CLASS= NTUPLES
##ORIGIN= BRUKER
##OWNER= Administrator
$$ 1.72 TOPSPIN		Version 2.1
$$ 2012-06-02 20:40:44.812 -0500  Administrator@TOPSPIN
$$ Compression mode = diff/dup
##.OBSERVE FREQUENCY= 400.13188235
##.OBSERVE NUCLEUS= ^1H
##.ACQUISITION MODE= SIMULTANEOUS (DQD)
##.ACQUISITION SCHEME= undefined
##.AVERAGES= 8
##.DIGITISER RES= 22
##SPECTROMETER/DATA SYSTEM= spect
##.PULSE SEQUENCE= zg30
##.SOLVENT NAME= COFFEE_meoh
##.SHIFT REFERENCE= INTERNAL, COFFEE_meoh, 1, 14.98061
##AUDIT TRAIL= $$ (NUMBER, WHEN, WHO, WHERE, PROCESS, VERSION, WHAT)
$$ ##TITLE= Audit trail, TOPSPIN		Version 2.1
$$ ##JCAMPDX= 5.01
$$ ##ORIGIN= Bruker BioSpin GmbH
$$ ##OWNER= Administrator
$$ $$ C:\Bruker\TOPSPIN/data/COFFEE/nmr/UV1128_M3-1004-1000_6275247_l6hmg87Wzp/10/pdata/1/auditp.txt
$$ ##AUDIT TRAIL=  $$ (NUMBER, WHEN, WHO, WHERE, PROCESS, VERSION, WHAT)
(   1,<2012-06-02 20:40:36.890 -0500>,<Administrator>,<TOPSPIN>,<go>,<TOPSPIN 2.1>,
      <created by zg
	started at 2012-06-02 20:39:30.359 -0500,
	POWCHK enabled, PULCHK disabled,
       configuration hash MD5:
       D5 CA 7A 23 FE 6B EE E2 50 67 74 61 24 F7 5E 3B
       data hash MD5: 64K
       01 F1 80 33 E5 13 C9 B4 82 7E 87 E4 7B 08 C4 D4>)
(   2,<2012-06-02 20:40:40.578 -0500>,<Administrator>,<TOPSPIN>,<proc1d>,<TOPSPIN 2.1>,
      <Start of raw data processing
       efp LB = 0 FT_mod = 6 PKNL = 1 PHC0 = 0 PHC1 = 0 SI = 32K 
       data hash MD5: 32K
       57 D7 B1 74 6F C4 82 73 61 22 28 AE 3F DA 05 BF>)
(   3,<2012-06-02 20:40:40.937 -0500>,<Administrator>,<TOPSPIN>,<proc1d>,<TOPSPIN 2.1>,
      <pk PHC0 = 214.2004 PHC1 = 0 
       data hash MD5: 32K
       A4 FB D9 92 FD CC 41 C0 AF 80 54 12 09 E0 11 D6>)
(   4,<2012-06-02 20:40:41.125 -0500>,<Administrator>,<TOPSPIN>,<proc1d>,<TOPSPIN 2.1>,
      <abs ABSG = 1 
       data hash MD5: 32K
       1D DF 80 1A 3B 20 EE 26 EB 7D B2 33 74 EB 3B 2F>)
(   5,<2012-06-02 20:40:41.218 -0500>,<Administrator>,<TOPSPIN>,<proc1d>,<TOPSPIN 2.1>,
      <abs ABSG = 2 
       data hash MD5: 32K
       A2 47 20 0C 9E B9 87 15 E5 40 77 2F FD AD 9D 93>)
(   6,<2012-06-02 20:40:41.250 -0500>,<Administrator>,<TOPSPIN>,<proc1d>,<TOPSPIN 2.1>,
      <abs ABSG = 3 
       data hash MD5: 32K
       64 5B 31 71 35 E8 9D C1 86 12 C6 15 71 10 7A 67>)
(   7,<2012-06-02 20:40:41.296 -0500>,<Administrator>,<TOPSPIN>,<proc1d>,<TOPSPIN 2.1>,
      <abs ABSG = 4 
       data hash MD5: 32K
       C1 B8 75 46 90 CB 4C 4F AD 0A 56 4E 34 0E E9 D3>)
(   8,<2012-06-02 20:40:41.312 -0500>,<Administrator>,<TOPSPIN>,<proc1d>,<TOPSPIN 2.1>,
      <abs ABSG = 5 
       data hash MD5: 32K
       18 E0 2A 9D 13 E2 9B C9 B8 F4 2E C0 01 B0 B6 3F>)
$$ ##END=
$$ 
$$ $$ hash MD5
$$ $$ 59 92 57 D8 B6 68 AA BC D3 35 65 45 5E 70 2F 0A
##$RELAX= 
##$RELAX= 
##$RELAX= 
##$RELAX= 
##$RELAX= 
##$RELAX= 
##$RELAX= 
$$ Bruker specific parameters
$$ --------------------------
$$ [...]
##$TP= (0..7)
150 150 150 150 150 150 150 150
##$TP07= 0
##$TPNAME0= <>
##$TPNAME1= <>
##$TPNAME2= <>
##$TPNAME3= <>
##$TPNAME4= <>
##$TPNAME5= <>
##$TPNAME6= <>
##$TPNAME7= <>
##$TPOAL= (0..7)
0.5 0.5 0.5 0.5 0.5 0.5 0.5 0.5
##$TPOFFS= (0..7)
0 0 0 0 0 0 0 0
##$TUNHIN= 0
##$TUNHOUT= 0
##$TUNXOUT= 0
##$USERA1= <user>
##$USERA2= <user>
##$USERA3= <user>
##$USERA4= <user>
##$USERA5= <user>
##$V9= 5
##$VALIST= <valist>
##$VCLIST= <CCCCCCCCCCCCCCC>
##$VD= 0
##$VDLIST= <DDDDDDDDDDDDDDD>
##$VPLIST= <PPPPPPPPPPPPPPP>
##$VTLIST= <TTTTTTTTTTTTTTT>
##$WBST= 2048
##$WBSW= 25
##$XGAIN= (0..3)
0 0 0 0
##$XL= 0
##$YL= 0
##$YMAX_a= 541086
##$YMIN_a= -643368
##$ZGOPTNS= <>
##$ZL1= 120
##$ZL2= 120
##$ZL3= 120
##$ZL4= 120
##$ABSF1= 14.98061
##$ABSF2= -5.57192
##$ABSG= 5
##$ABSL= 3
##$ALPHA= 0
##$AQORDER= 0
##$ASSFAC= 0
##$ASSFACI= 0
##$ASSFACX= 0
##$ASSWID= 0
##$AUNMP= <proc_prof1d_extract_pilot.lims>
##$AXLEFT= 0
##$AXNAME= <>
##$AXNUC= <1H>
##$AXRIGHT= 0
##$AXTYPE= 0
##$AXUNIT= <>
##$AZFE= 0.1
##$AZFW= 0.1
##$BCFW= 0
##$BC_mod= 0
##$BYTORDP= 0
##$COROFFS= 0
##$CY= 15
##$DATMOD= 1
##$DC= 0
##$DFILT= <>
##$DTYPP= 0
##$F1P= 0
##$F2P= 0
##$FCOR= 0.5
##$FTSIZE= 32768
##$FT_mod= 6
##$GAMMA= 0
##$GB= 0
##$INTBC= 1
##$INTSCL= 1
##$ISEN= 128
##$LB= 0
##$LEV0= 0
##$LPBIN= 0
##$MAXI= 10000
##$MC2= 0
##$MEAN= 0
##$ME_mod= 0
##$MI= 0
##$NCOEF= 0
##$NC_proc= -8
##$NLEV= 6
##$NOISF1= 0
##$NOISF2= 0
##$NSP= 0
##$NTH_PI= 0
##$NZP= 0
##$OFFSET= 14.98061
##$PC= 1
##$PHC0= 214.2004
##$PHC1= 0
##$PH_mod= 1
##$PKNL= yes
##$PPARMOD= 0
##$PPDIAG= 0
##$PPIPTYP= 0
##$PPMPNUM= 2147483647
##$PPRESOL= 1
##$PSCAL= 4
##$PSIGN= 0
##$PYNMP= <proc.py>
##$REVERSE= no
##$SF= 400.13
##$SI= 32768
##$SIGF1= 0
##$SIGF2= 0
##$SINO= 400
##$SIOLD= 32768
##$SPECTYP= <>
##$SREGLST= <1H.CDCl3>
##$SSB= 0
##$STSI= 32768
##$STSR= 0
##$SW_p= 8223.68421052632
##$SYMM= 0
##$S_DEV= 0
##$TDeff= 65536
##$TDoff= 0
##$TI= <>
##$TILT= no
##$TM1= 0
##$TM2= 0
##$TOPLEV= 0
##$USERP1= <user>
##$USERP2= <user>
##$USERP3= <user>
##$USERP4= <user>
##$USERP5= <user>
##$WDW= 1
##$XDIM= 32768
##$YMAX_p= 462068550
##$YMIN_p= -794129
##$CURPLOT= <Network HP LaserJet P1505>
##$CURPRIN= <$Network HP LaserJet P1505>
##$DFORMAT= <normdp>
##$LAYOUT= <+/1D_H.xwp>
##$LFORMAT= <normlp>
##$PFORMAT= <normpl>
##$SURQMSG= 1
$$ End of Bruker specific parameters
$$ ---------------------------------
##NTUPLES= NMR SPECTRUM
##VAR_NAME=  FREQUENCY,     SPECTRUM/REAL,   SPECTRUM/IMAG
##SYMBOL=    X,             R,               I
##VAR_TYPE=  INDEPENDENT,   DEPENDENT,       DEPENDENT
##VAR_FORM=  AFFN,          ASDF,            ASDF
##VAR_DIM=   32768,         32768,           32768
##UNITS=     HZ,            ARBITRARY UNITS, ARBITRARY UNITS
##FACTOR=    0.250966925370066, 1,           1
##FIRST=     8223.43324360095, -54569,       6955
##LAST=      0,             107677,          -13620
##MIN=       0,             -794129,         0
##MAX=       8223.43324360095, 462068550,    0
$$ Real data points
##PAGE= N=1
##DATA TABLE= (X++(R..R)), XYDATA
$$ [...]
19528b95602a19669G8994k0874a99453K0515L7312B85304I4890C2496J3070b53860
19516a58887k6036J036L3186N9340j41294J11905k93132B6522i6485n1563c9408
19504a57150F1382a15932D5625b02590D4397g2468A13937f4702k52877a44957
19493b36487e3104C2343K6457g6777k0882A09558b87857m1117J15540a2453k63785
19482b76238B13675o4351a4315o3118I1608h1140o1893F6129e037F5912a26629
19470E7699K81530H998J25480a51906a6591l44939R4373d094l11998a02301b5913
19458A64011e6383A46436c19836A05621J0878J03655a82670I3628b88764j75366
19448d64130B30479n5946o2193a71010K2354b5787k84120a28273f0328b6457A64283
$$ plain form
19528 -295602 -119669 78994 58120 -199453 -178938 -141626 285304 94890 32496 45566 -253860
19516 -158887 -184923 -183887 -150701 -91361 -232655 -120750 -413882 26522 -96485 -148048 -39408
19504 -157150 61382 -115932 45625 -202590 44397 -72468 113937 -64702 -317579 -144957
19493 -236487 -53104 32343 58800 -76777 -97659 109558 -287857 -328974 -213434 -12453 -276238
19482 -276238 213675 149324 -14315 -77433 91608 -81140 -143033 66129 -5037 65912 -126629
19470 57699 339229 8998 134478 -151906 -16591 -361530 -267157 -4094 -316092 -102301 -25913
19458 164011 -56383 146436 -319836 105621 116499 220154 -182670 93628 -288764 -464130
19448 -464130 230479 174533 112340 -171010 -148656 -25787 -309907 -128273 -60328 -26457 164283
19436b44024C54828b6837E7916k8695h6055B01332a75801A98169b31606A58301
19425a41849j12324I998J23255B6188Q1922C4535a03538B65850b8385j93280e9905
19413c37568J15980I8406c23078i4668K7l86739a73671o1012f7567k36063a5794
19401A01356b29452A0824i0558p4069p5051M3808A74421g1664o0516J0835j53865
19390b75210R8615M9423N2437k72972C8482e8978a3923D1073j6709a04102d004
19378b48338F7904a14148L3375B61791f2051n6905I3350l4692M3675b98857C5541
19366E7620c43102J36077D788L04448I971c0745k04310C21621a6486A43657a77013
19354A7296b40247a08040A8503c04530h2629a0759m47304A42253a30784p703N3050
$$ plain form
19436 -244024 354828 -26837 57916 29221 -86055 201332 -175801 198169 -231606 158301
19425 -141849 -254173 9998 133253 26188 108110 34535 -103538 265850 -28385 -221665 -59905
19413 -337568 -221588 98406 -323078 -94668 -94641 -481380 -173671 -234683 -67567 -303630 -15794
19401 101356 -229452 10824 -90558 -164627 -239678 -195870 174421 -71664 -132180 -121345 -275210
19390 -275210 -176595 -127172 -74735 -347707 38482 -58978 -13923 41073 24364 -104102 -4004
19378 -248338 67904 -114148 -80773 261791 -62051 -118956 93350 58658 102333 -298857 35541
19366 57620 -343102 -207025 4788 309236 9971 -30745 -235055 321621 -16486 143657 -177013
19354 17296 -240247 -108040 18503 -304530 -82629 -10759 -458063 142253 -130784 -138487 -85437
19343h5437A49274d1706l743j29241l6639A47348b73330R4894f6577k68792M2377
19332b92992J02781f1957j6840K6043G6878a93880b0917j18786B1042a98755J9389
19321a79366B34785c09038c5385A26657b01103B54495a11860A92741h0379A16403
19310c9795j93672k01198B0908c1887k15861J09780b6764A54004a24460A60716
19299b08549f5738j28179G7080g9856E9794B5223a36942l56125b37789A88225
19288A57088F2931K39751A34148j4703A1852b47203G8690a48858A45827A7762
19277b58537H8689A0253h3526i65C46442h6589k76590B67903d83284a5495D2230
19265a78499B136b45206A05684b67285J27901l0303n1753A55258a17255M605j65306
$$ plain form
19343 -85437 149274 -41706 -45449 -174690 -211329 147348 -273330 -178436 -66577 -335369 -292992
19332 -292992 -190211 -61957 -78797 -52754 76878 -193880 -20917 -139703 21042 -198755 -179366
19321 -179366 234785 -309038 -35385 126657 -201103 254495 -111860 192741 -80379 116403
19310 -39795 -233467 -434665 20908 -31887 -247748 -137968 -26764 154004 -124460 160716
19299 -208549 -65738 -193917 77080 -79856 59794 25223 -136942 -493067 -237789 188225
19288 157088 62931 302682 134148 119445 11852 -247203 78690 -148858 145827 17762
19277 -258537 88689 10253 -83526 -965 346442 -86589 -363179 267903 -483284 -15495 42230
19265 -178499 2136 -245206 105684 -267285 -139384 -169687 -221440 155258 -117255 -112650 -277956
19254b77956C3663A6217R2002a20896F6845p462a54270C8319a96231c4552j317
19243c5869j29901m6460F4520a47575b3283j58291f395m17967b5085D5905H792
19231g2211F5165l813M5779c66959a06707c2714k99551E3453K2399f3067I258
19219a6542j22244N0290c3346r525D25747a18001j5678e5915k77523J27603b0789
19207b7866n5970j4320P658B09154K7635q0889A0733g5212C5545c7506k18385
19196b55891A2146J1063a75302P7727A10308a90420g8947b7423n6131k08267h0730
19184A51640a93577C524a38347M6080j51994F1833J489K49438G0855b78195a36370
19172c14547I7397C0595b22237A10421a00171A48199D5601d40951G8004b29761
$$ plain form
19254 -277956 33663 16217 108219 -120896 66845 59383 -154270 38319 -196231 -34552 -35869
19243 -35869 -165770 -212230 64520 -147575 -23283 -181574 -6395 -424362 -25085 45905 8792
19231 -72211 65165 61352 107131 -366959 -106707 -32714 -332265 53453 75852 -63067 9258
19219 -16542 -138786 -88496 -33346 -42871 425747 -118001 -133679 -55915 -333438 -205835 -20789
19207 -27866 -83836 -98156 -90498 209154 236789 155900 10733 -75212 35545 -37506 -255891
19196 -255891 12146 23209 -175302 -97575 110308 -190420 -78947 -27423 -83554 -291821 -80730
19184 151640 -193577 3524 -138347 -92267 -244261 61833 63322 312760 70855 -278195 -136370
19172 -314547 97397 30595 -222237 110421 -100171 148199 45601 -440951 78004 -229761
19161g8178a2201l47918a50894c0075A72703G1597b5647h920r3537M4609q6399
19150a44247E1665c49012b9274e181A27906i341j34535B12774H5595f464p8632
19139h5096j64025j97457I9910a58302A26989e7343k20998D868J42890b65152
19128A8822b32099M8745j47244A29057C9220b94842a14485j08957f0013b5146
19117f5920F9790a79094A13405e2984E3782a1756k88696B5168a5835j1872k64230
19106b91937C44712a29767m17653a77345A32648k4207J44044J82477a36102a9334
19095i3261A20244l2331e3296j30585M9104l91595J61619K8254M0463i130j04233
19084a13363P23K451A47090C2574J70383c03822a38429A30993j7640H971J48914
$$ plain form
19161 -78178 -12201 -360119 -150894 -30075 172703 71597 -25647 -8920 -102457 -57848 -144247
19150 -144247 51665 -349012 -29274 -5181 127906 -9341 -143876 212774 85595 -6464 -85096
19139 -85096 -249121 -446578 99910 -158302 126989 -57343 -278341 4868 147758 -265152
19128 18822 -232099 -183354 -330598 129057 39220 -294842 -114485 -223442 -60013 -25146
19117 -65920 69790 -179094 113405 -52984 53782 -11756 -300452 25168 -15835 -27707 -291937
19106 -291937 344712 -129767 -547420 -177345 132648 108441 252485 434962 -136102 -19334
19095 -93261 120244 87913 -53296 -183881 -134777 -526372 -364753 -336499 -296036 -9130 -113363
19084 -113363 -112640 -110189 147090 32574 202957 -303822 -138429 130993 113353 8971 157885
19073A57885B3659d65706J16674f6305n7912C0168b13189C7494M7689C5698J38774
19062A74472E598h2417A8730j296a80261O7085j10129Q0753o7584M2761A08726
19050a59272n441C90007C8425d02520a00284j92276A63453o3671J708p665K10246
19039C04071j39379E164i6413F7987K1798h626B3236a84792B55159a76583A60852
19027c2165B60232a87799B47316A1394d03767H238h0486A10034e2184A87763H4817
19015a55597E6623A5602K40154J32168G3866L6037a42072A35609E8165N4907b4108
19003A33591m6417J47442q0248b0573q4065n3731e0722k08336P4852O2893F211
18991a11156C4785b78147E0858L21890f8946k07724J23419B25688a72675k69123
$$ plain form
19073 157885 23659 -465706 -349032 -66305 -124217 30168 -213189 37494 85183 35698 174472
19062 174472 5598 -82417 18730 17434 -180261 -113176 -223305 -142552 -210136 -167375 108726
19050 -159272 -164713 390007 38425 -402520 -100284 -292560 163453 99782 101490 93825 304071
19039 304071 164692 5164 -96413 67987 89785 -8626 23236 -184792 255159 -176583 160852
19027 -32165 260232 -187799 247316 11394 -403767 8238 -80486 110034 -52184 187763 84817
19015 -155597 56623 15602 255756 387924 73866 109903 -142072 135609 58165 113072 -24108
19003 133591 87174 234616 154368 -20573 -104638 -158369 -50722 -259058 -184206 -121313 6211
18991 -111156 34785 -278147 50858 372748 -68946 -276670 -153251 225688 -172675 -441798
18981d41798e8540q1062k4167N8479j01534M0965n3457b5924I5299c8240E3501
18969A48897m8414J83942a24636l65694a99009f1964A46445a33214M7613l41428
18959d27029a34597J1609d3862k92706A31211C3449h5758k44584J54607j28533
18949c04268d2315A857a3243k77330m2456A00316Q4887C7785P5775a95414N2736
18938a42678b4947B27957A03461R501b32976H4320a74539P5973A80143a28641
18927A37673b0921r1325B5808K79901B780a40415l8288g6364I2354f7053b7156
18915d93342B6857a73416b781B25965a54091E8216a09127l52B73921h3427D5418
18903c16803F4279a11114A218d6550A62578h7703k45088B54923c118k48369B53540
$$ plain form
18981 -441798 -58540 -139602 -163769 -105290 -206824 -165859 -219316 -25924 95299 -38240 53501
18969 148897 100483 284425 -124636 -490330 -199009 -61964 146445 -133214 -85601 -427029
18959 -427029 -134597 -122988 -43862 -336568 131211 33449 -85758 -330342 -175735 -304268
18949 -304268 -42315 1857 -13243 -290573 -333029 100316 185203 37785 113560 -195414 -142678
18938 -142678 -24947 227957 103461 112962 -232976 84320 -174539 -98566 180143 -128641
18927 137673 -20921 -112246 25808 305709 2780 -140415 -178703 -76364 92354 -67053 -27156
18915 -493342 26857 -173416 -2781 225965 -154091 58216 -109127 -109479 273921 -83427 45418
18903 -316803 64279 -111114 1218 -46550 162578 -87703 -332791 254923 -3118 -251487 253540
18891b36625B338b34957a10341F4881N0509E1189f2853l66024I1350b03242d821
18879D8677d14123a85349A67294B3143b40183F0219K46324A09042A346f6414j26663
18868a93077D7209a00257o4674O3983A7957a97199A24740J7338e985j48861B1634
18856a23676j88892B99313a34752F4798k9936b62889J10765b3320F934c38729
18845d6234a4292j75534A04670b59361b7110n2335D7312A159a12804B21186L34061
18834E55247A53446E1448J54948D7440c19110a54011o4133k227b3869E04417a13254
18822A46316j885a95942k0256B2100i1839D3247a7900l20209L3833A60597D1136
18810c78762B57353d9374l120q3731l3869l251Q743C50535i6848B54465a59782
$$ plain form
18891 -236625 2338 -234957 -110341 64881 115390 51189 -62853 -428877 91350 -203242 -4821
18879 48677 -414123 -185349 167294 23143 -240183 60219 306543 109042 1346 -66414 -193077
18868 -193077 47209 -100257 -164931 -100948 17957 -197199 124740 142078 -5985 -154846 21634
18856 -123676 -312568 299313 -134752 64798 34862 -262889 -152124 -23320 6934 -338729
18845 -46234 -14292 -189826 104670 -259361 -27110 -79445 47312 1159 -112804 221186 555247
18834 555247 153446 51448 206396 47440 -319110 -154011 -218144 -220371 -23869 504417 -113254
18822 146316 144431 -195942 -216198 22100 -91839 43247 -17900 -338109 -304276 160597 41136
18810 -378762 257353 -49374 -52494 -136225 -170094 -173345 -164602 350535 -96848 254465 -159782
18798H6394a43390C7739j6093D014K3894a52911E1481k188a09201L2257k51228
18787c28172g4979j77600I2324C6781a1706o2731O835A0640J28581E7451L5569
18776I3020K10190c09375d145j00768j02856I0973J39473a61563C7347c04872
18765a37872d8099A28893c5746E2452a14616B08098D0285K6382b08902A73087
18754F3363j9173b01375R4087M8472A4939J0756g7741c302p536j05810A3125d023
18741h2522b1173K028k59638A45243a1643E6286f5386l3838A21979b18010j9569
18730b37579c2948J5179l809C14927a61606A81671m866J07200j16768e9761C7538
18718B39500j05517g5518p3591n1790B71145b2962j24428n7863I5880a40069o6315
$$ plain form
18798 86394 -143390 37739 21646 4014 27908 -152911 51481 49293 -109201 -76944 -328172
18787 -328172 -74979 -252579 92324 36781 -11706 -74437 -67602 10640 139221 57451 93020
18776 93020 303210 -309375 -4145 -104913 -207769 90973 230446 -161563 37347 -304872
18765 -137872 -48099 128893 -35746 52452 -114616 208098 40285 66667 -208902 173087
18754 63363 44190 -201375 -107288 -58816 14939 25695 -77741 -3302 -10838 -116648 13125 -4023
18741 -82522 -21173 -19145 -278783 145243 -11643 56286 -65386 -99224 121979 -218010 -237579
18730 -237579 -32948 -17769 -21578 314927 -161606 181671 176805 284005 167237 -59761 37538
18718 239500 133983 -75518 -149109 -200899 271145 -22962 -147390 -205253 95880 -140069 -206384
18707b06384D1016b66475A64420a20226A19268a12203B89554a55081r4749e8933
18696A29041b06299k65287e9335B03253q2819a33441C0008b11329H8576a53835
18685b11927Q0990j74088J32619B52039c20119A29880a00153k09815J03117k00595
18675d07446a7885k17527K881a15397B08158b55489E1076j5119J38558b52353
18664b14480K662C11888d0660A68266b08236L0042m2574F5316O4265D8622b97331
18652a44943M1511A11580A7855b98588C0947c8979r7057L7098K3650j67693B43131
18640C6414j6316b5951l4200k04183F5111L9345K09854a53226n3043B19683e3417
18628C8986g6679B10590a9452H6159J44901a71513g4665k19801a10018j58259
$$ plain form
18707 -206384 41016 -266475 164420 -120226 119268 -112203 289554 -155081 -249830 -58933
18696 129041 -206299 -471586 -59335 203253 120434 -133441 30008 -211329 88576 -153835
18685 -211927 -130937 -305025 -172406 252039 -320119 129880 -100153 -309968 -206851 -407446
18675 -407446 -17885 -235412 -232531 -115397 208158 -255489 51076 35957 174515 -252353
18664 -214480 -211818 311888 -40660 168266 -208236 -178194 -220768 65316 129581 48622 -297331
18652 -144943 -103432 111580 17855 -298588 30947 -38979 -136036 -98938 -75288 -242981 243131
18640 36414 20098 -25951 -60151 -264334 65111 104456 314310 -153226 -206269 219683 -53417
18628 38986 -76679 210590 -19452 86159 231060 -171513 -74665 -294466 -110018 -268277
18618b68277A31578b06870i4035G0681b02977n7841b8319e0m42437g9797J7974
18607f1823l48022i7373a09l72303O7599P9696N4423A20265n1690a30620I4436
18595e4579j03035m5493f4209m241j06218M0632A54451B9486L75530A03291A4602
18583c10496H2775a09933a2269C00931i8529c286A91034e4949A96430l5234b51987
18571A85365a00364K9401j3014o5783B02189a90613i4166o236A18797a83576L5917
18560a47659j62851a197B2030a77431e8002j99674M9446R4883a1476j55869K6719
18549a40626D3034a57750p0470N5455e353A94500i0452L5475E8222e1441i071
18537f9689A81924a12701c8689H5959a42941K6804C7391K5405D595P9497h9530
$$ plain form
18618 -268277 131578 -206870 -94035 70681 -202977 -260818 -28319 -50 -442487 -79797 -61823
18607 -61823 -409845 -97373 -109 -372412 -304813 -225117 -170694 120265 68575 -130620 94436
18595 -54579 -157614 -203107 -64209 -68450 -174668 -134036 154451 29486 405016 103291 14602
18583 -310496 82775 -109933 -12269 300931 -98529 -3286 191034 -54949 196430 161196 -251987
18571 185365 -100364 -70963 -83977 -149760 202189 -190613 -94166 -100402 118797 -183576 -147659
18560 -147659 -310510 -1197 22030 -177431 -58002 -257676 -208230 -113347 -11476 -167345 -140626
18549 -140626 43034 -157750 -228220 -172765 -5353 194500 -90452 -54977 58222 -51441 -9071
18537 -69689 181924 -112701 -38689 85959 -142941 -116137 37391 62796 4595 84092 -89530
18525a40711J5178c1505j39232C88059b8905j1792C0267J54764k9441n8880d29823
18513a08233L5531g808B8974J48452a49356j43897J16318C0242c4258B40139h1010
18501a43513j5500p5846a0769B1502d4327j53362D9503K1547J08709a07437j01411
18490b08848A88854i5873B33610G3189B820d28636D09448B8581b26129g1439c112
18478B33855j07840i9691N415L2348m67p115j37537p4749E9016a21794p0756j0943
18466b03493A12172k5118l7750a26618k34044f2896l384k55825a58065E0063k330
18455D7733P0587C8028N0510b51524Q7968B86679f1228k62342j7762H516B241
18443c58058a04265F8581a383r0759l9884p0066j74206B8146Q1358h647j47430
$$ plain form
18525 -140711 -125533 -31505 -170737 388059 -28905 -40697 30267 185031 155590 96710 -429823
18513 -108233 -72702 -7808 28974 177426 -149356 -293253 -176935 30242 -34258 240139 -81010
18501 -143513 -159013 -234859 -10769 21502 -44327 -197689 49503 71050 179759 -107437 -208848
18490 -208848 188854 -95873 233610 73189 2820 -428636 409448 28581 -226129 -71439 -3112
18478 233855 126015 -99691 -94276 -61928 -62395 -69510 -207047 -281796 59016 -121794 -192550 -203493
18466 -203493 112172 87054 49304 -126618 -360662 -62896 -66280 -322105 -158065 50063 47733
18455 47733 118320 38028 88538 -251524 -163556 286679 -61228 -323570 -341332 8516 2241
18443 -358058 -104265 68581 -1383 -92142 -132026 -202092 -376298 28146 109504 -8647 -156077
18432a56077E3094a63103B32145F9939b875k21104N1022h2631A27059b92268a09393
18420G345a2539B15378b81231b5576A35511K05819a66230f7125r643B7329Q375
18409C5704b13025e5764A62314f9595B5174a46787N86e6034l46522d9447J37n9441
18397a08751a8056k82396A02569a62787C77710b41584A18756d99824G3663f7348
18386b03544J1894j22451f268D8973b75429O2152Q8183A48820F8989R9022b57240
18374b03423A36021a01990B93894i0543n5433f3802j42736j8790e0242k71643
18364c21885g504B37241a5676j57258m5288P1637k30036A89573a5184k73843B19934
18352a76163r9464C4503A6809J66493D7484R2500h773E7471D223b00372A47435
$$ plain form
18432 -156077 53094 -163103 232145 69939 -2875 -223979 -172957 -82631 127059 -292268 -109393
18420 7345 -12539 215378 -281231 -25576 135511 341330 -166230 -67125 -76768 27329 35704
18409 35704 -213025 -55764 162314 -69595 25174 -146787 -146201 -56034 -402556 -49447 -49310 -108751
18397 -108751 -18056 -300452 102569 -162787 377710 -241584 118756 -499824 73663 -67348
18386 -203544 -191650 -314101 -6268 48973 -275429 -213277 -125094 148820 68989 168011 -257240
18374 -203423 136021 -101990 293894 -90543 -145976 -63802 -206538 -225328 -50242 -321885
18364 -321885 -7504 237241 -15676 -172934 -218222 -146585 -376621 189573 -15184 -289027 219934
18352 -176163 -275627 34503 16809 183302 47484 139984 -8773 57471 4223 -200372 147435
18340c5948I849a8231B75458b27535a02310C332a12651j68723a24377k2008F0839
18328c20260C3135b38166a9720I3939C512b03133h7145j769l15048G9554d9356
18316a04806H6955N0461a0942B9974b49835A12295d5684B12710f9694c0971j64876
18305a95847C5143K5245a19958j14469g59j40729f5475A10456a87247I4591i9300
18293c5065m9927b4397B83052j29747b32900A4342e6938m6297B19470b68843i5514
18281e5179k0466E2220b46885f4076F9430e992H2713b67268a32760C82913d09507
18269D6818e3875b3318C4392K42282c17610h7461B46360a43986B2792M9023h8088
18257e3099A13230J23394I1140c12545Q0811G6761j0362f8792O914l1852H7208
$$ plain form
18340 -35948 9849 -18231 275458 -227535 -102310 3332 -112651 -281374 -124377 -146385 60839
18328 -320260 33135 -238166 -19720 93939 3512 -203133 -87145 -88914 -403962 79554 -49356
18316 -104806 86955 137416 -10942 29974 -249835 112295 -45684 212710 -69694 -30971 -195847
18305 -195847 35143 60388 -119958 -234427 -759 -141488 -65475 110456 -187247 94591 -99300
18293 -35065 -84992 -24397 283052 153305 -232900 14342 -56938 -103235 219470 -268843 -95514
18281 -55179 -75645 52220 -246885 -64076 69430 -5992 82713 -267268 -132760 382913 -409507
18269 46818 -53875 -23318 34392 276674 -317610 -87461 246360 -143986 22792 71815 -88088
18257 -53099 113230 236624 91140 -312545 -231734 76761 66399 -68792 -61878 -93730 87208
18245c8529j0083A86211b0394B99532A3491d285F8943P8215a00167A19282a24626
18233b98609i7869Q937B27786a3503A00760j316d76066l9118D34405H0917a01361
18221A58937o1506a51558C58687a7280B21455l3148k2183D7857d3020h043j9434
18210b7477k14223a17549A14621l1901j6570D426b34205L7321J5795c9366E319
18198a47050d7543B00615b11565B92079i9348A8880b04438j2775L3958g1951B26574
18186a95893C44358A28913l0783g1070j665A8849J57529G6339c68857K8216A7361
18174a49962A43761o5925j6990b37213J01666A05266d15065a5609j74898I8663
18163b65360C11990c39390B2334J68911c0840k82844f1679a9927B2330J29697
$$ plain form
18245 -38529 -48612 186211 -20394 299532 13491 -4285 68943 147158 -100167 119282 -124626
18233 -298609 -97869 -88932 227786 -13503 100760 99444 -476066 -515184 434405 80917 -101361
18221 158937 97431 -151558 358687 -17280 221455 188307 166124 47857 -43020 -8043 -27477
18210 -27477 -241700 -117549 114621 82720 66150 4426 -234205 -196884 -181089 -39366 5319
18198 -147050 -47543 200615 -211565 292079 -99348 18880 -204438 -217213 -183255 -71951 226574
18186 -195893 344358 128913 98130 -71070 -72735 18849 176378 76339 -368857 -340641 17361
18174 -149962 143761 77836 60846 -237213 -135547 105266 -415065 -15609 -190507 98663
18163 -265360 311990 -339390 22334 191245 -30840 -313684 -61679 -19927 22330 152027
18153A52027g3002F9932k19J28349p5181D2456P736f9324k5963k42523h9700c5211
18140i3163C2674j4458c17166J48409M1870f1921K7478E0400b68046d4988j72731
18129b17719b4542E084J8192J66313d1035B6856a5436m9518j42119K3302I8943
18117A13276b23429L1641D7984J2371c8457k54485j3997K4576g3170p2884C5553
18105D8183J24403G0338J23378a31776C2682O9367a41974A3282c4162j08686j0440
18094a53288D189P042b08222A34208a91136q4452G099a17303C1234i8161B1563
18082a4723o2402p8567A83903g6040B21008c77378A62095a37196f4683o4066b7066
18070C9666R2379a33121C5577c05102a42367I6892c0378A78644c45363A93775
$$ plain form
18153 152027 -73002 69932 69713 198062 122881 42456 50192 -69324 -95287 -337810 -89700 -35211
18140 -93163 32674 18216 -317166 -168757 -126887 -61921 -34443 50400 -268046 -44988 -217719
18129 -217719 -24542 5084 23276 189589 -41035 26856 -15436 -64954 -207073 -183771 98943
18117 113276 -223429 -191788 47984 60355 -38457 -292942 -306939 -282363 -73170 -146054 35553
18105 48183 172586 70338 193716 -131776 32682 102049 -141974 13282 -34162 -142848 -153288
18094 -153288 4189 11231 -208222 134208 -191136 -275588 7099 -117303 31234 -98161 21563
18082 -14723 -77125 -155692 183903 -76040 221008 -377378 162095 -137196 -64683 -128749 -27066
18070 39666 132045 -133121 35577 -305102 -142367 96892 -30378 178644 -345363 193775
18059a5768A85418B4603a69931E1567O4797a35453A81536a5914A64297e7011E7261
18047B5671J01579F2809J6679l3864K08621G619J00497j1873c87280B41163e1490
18035H728a02044j36566A29263B5536e0308k5306o1337D6990a46525B09785b42763
18023c67011g3130c5587j74162i1764E8644J14370O2784B1410J28747c65829B8708
18011a13649m2982O8111B1694a55972G6437b28644R5335o7627M3269B69091g2685
17999f4971q8672n0761P9587E7953g8656A04868J88411A11903D8327a16618i020
17987g7751j08957B56379c17169a21256j88160h5220j53196a01857M5098n4734
17977a11493r8373C1981H938b5980B79041E8071K03768a77285k1531d7875k4452
$$ plain form
18059 -15768 185418 24603 -169931 51567 116364 -135453 181536 -15914 164297 -57011 57261
18047 25671 127250 62809 79488 45624 254245 7619 108116 96243 -387280 241163 -51490
18035 8728 -102044 -238610 129263 25536 -50308 -75614 -136951 46990 -146525 209785 -242763
18023 -367011 -73130 -35587 -209749 -91764 58644 173014 235798 21410 150157 -365829 28708
18011 -113649 -156631 -88520 21694 -155972 76437 -228644 -133309 -200936 -157667 269091 -72685
17999 -64971 -153643 -204404 -124817 57953 -78656 104868 293279 111903 48327 -116618 -9020
17987 -77751 -186708 256379 -317169 -121256 -309416 -85220 -238416 -101857 -56759 -111493
17977 -111493 -209866 31981 8938 -25980 279041 58071 261839 -177285 -198816 -47875 -72327
17966g2327J6762C8317J8177a24240n0773p2578F7868K35594a41144k32209G123
17954e7357a0571j69889g0864q789A53800c63306J62786f5019b0889q5024B04647
17942e233G8079k0572Q6745a80683l4216c4710I9608I722c47953a31723j68117
17931b99840J01184A26258l0633i131j05256G8855N652a3234B4601c11213E5980
17919a92676g4594A2327a36619B44005C1628c4900A23174a61308B45805b8521
17908A26026k0730g8353a0395E5833b49823I220Q7908J66692a35199n6151g3994
17896A4121J60394b61118C3535L4624c19826B11664b57823h2426A18848Q8322
17886B07170H4966d2557k55746J32497B60021I8016Q4722H9594N1113a62709A05790
$$ plain form
17966 -72327 -55565 38317 56494 -124240 -175013 -247591 67868 303462 -141144 -373353 7123
17954 -57357 -10571 -180460 -70864 -79653 153800 -363306 -200520 -65019 -20889 -105913 204647
17942 -5233 78079 57507 144252 -180683 -214899 -34710 99608 9722 -347953 -131723 -299840
17931 -299840 -198656 126258 95625 -9131 -114387 78855 84507 -13234 24601 -311213 55980
17919 -192676 -74594 12327 -136619 244005 31628 -34900 123174 -161308 245805 -28521
17908 126026 105296 -78353 -10395 55833 -249823 9220 97128 263820 -135199 -191350 -73994
17896 14121 174515 -261118 33535 68159 -319826 211664 -257823 -82426 118848 207170
17886 207170 84966 -42557 -298303 -165806 260021 98016 182738 89594 140707 -162709 105790
17874b26619j1882h4912j6023B13102a26995A5816a47441C71634A76359q0945
17864I5414b1444m4344A35989b16417R6547m2324P4532p4651E5196h5177H3613
17852B74867c0558I2421g1056b0514K724G7283b9392A64036b04819e9412a8830
17840B4896c24820G3315h5614p2138A20392b01545B1195h0897j36337g3024A91832
17828B00577p2021g1307B06584b0308A72297G7994J40806a30473b6411m87394
17818e13805B68970a73439j20070a36584B19230b08201L548O7603a7946J709m8511
17807f4748A11319m9757b4341A86346c36398i6543p983B1090J57258p6947i1899
17795i4914B62310B5218b79269H0543J4147h5344B31303C7042O4374J95234A40272
$$ plain form
17874 -226619 -238501 -84912 -100935 213102 -126995 15816 -147441 371634 176359 95414
17864 95414 -21444 -65788 135989 -216417 -119870 -162194 -87662 -162313 55196 -85177 83613
17852 274867 -30558 92421 -71056 -20514 -17790 77283 -29392 164036 -204819 -59412 -18830
17840 24896 -324820 73315 -85614 -157752 120392 -201545 21195 -80897 -217234 -73024 191832
17828 200577 128556 -71307 206584 -20308 172297 77994 218800 -130473 -26411 -513805
17818 -513805 268970 -173439 -293509 -136584 219230 -208201 -204653 -137050 -17946 -16237 -64748
17807 -64748 111319 61562 -24341 186346 -336398 -96543 -104526 21090 178348 101401 -91899
17795 -94914 262310 25218 -279269 80543 94690 -85344 231303 37042 101416 296650 140272
17783b12387m45188e7455A19307b1637k23438P8862a291A82340K03548c3993l4499
17772f8492B02359c15982q6954g3838n0263C00794f0918B5799b67406M9448A6024
17760a07792a4386j67511o1609I3156a43812H4325k4533B6381J33027B6033a77591
17748e126B2476d50974B63845b88961C48888H7868h6851C40603j56010b78534
17737e1000j9462j5514I2733f1172m7853J1889A66743q1544j2272a74119B93326
17725b98007f1986j22790G7861J6551f6638r1462a3808m2367j6759r9248m9608
17714b21790j299A40324d0758A56370g8233A60246c2760A31231g0715C5969a22754
17702e5047A8750B4a955q011j25161a5469A68915o7032J63199n2360A4740N0410
$$ plain form
17783 -212387 -657575 -57455 119307 -21637 -245075 -166213 -1291 182340 385888 -33993 -68492
17772 -68492 202359 -315982 -402936 -73838 -124101 300794 -60918 25799 -267406 -217958 16024
17760 -107792 -14386 -181897 -243506 93156 -143812 84325 59792 26381 159408 26033 -177591
17748 -5126 22476 -450974 263845 -288961 348888 87868 -86851 340603 184593 -278534
17737 -51000 -70462 -85976 92733 -61172 -109025 -97136 166743 85199 72927 -174119 293326
17725 -298007 -61986 -184776 77861 94412 -66638 -158100 -13808 -56175 -72934 -172182 -221790
17714 -221790 -223089 140324 -40758 156370 -78233 160246 -32760 131231 -70715 35969 -122754
17702 -55047 18750 24 -1955 -9966 -135127 -15469 168915 101883 265082 212722 14740 65150
17690F5150f9739A41462g2125B36980I9302a5342A9876i1481B02699b708G9366
17678c2915j4927C34106a5961m02483d7801A94635J2067c32552E9151O8512N9292
17667A86955e5839A53735B3774a17348g819j66087A0261K27103b43218B44084
17656C91373k2415f0977j86521N9985A64576c7941A55839M854l192a04396B10479
17644b35872B76029h357H4028L0083a59257A63829F1508N5582a42400j32876C0129
17632a89177C6564G713b93821q8876A18069L7140c39918A85873D178d7123p9253
17621a26376B32982M1805a4494F0441O8548F210g1886K0047H85a72187A7124b87775
17608A71818p1290K4197g7364M724I6609e532j65513D1973c9683p1274A66528
$$ plain form
17690 65150 -69739 141462 -72125 236980 99302 -15342 19876 -91481 202699 -2708 79366
17678 -32915 -47842 334106 -15961 -418444 -47801 194635 206702 -332552 59151 127663 186955
17667 186955 -55839 153735 23774 -117348 -7819 -173906 10261 237364 -243218 244084
17656 391373 368958 -60977 -247498 -187513 164576 -37941 155839 160693 157501 -104396 210479
17644 -235872 276029 -8357 84028 114111 -159257 163829 61508 117090 -142400 -275276 30129
17632 -189177 36564 7713 -293821 -382697 118069 155209 -339918 185873 4178 -47123 -126376
17621 -126376 232982 274787 -14494 60441 128989 6210 -71886 -51839 885 -172187 17124 -287775
17608 171818 100528 124725 -77364 -72640 96609 -5532 -171045 41973 -39683 -110957 166528
17596c6847m09010h4669H1606e7597A32587a80746A4661K8756a32058A93831a96551
17584B92788I0732A2575b11962N7291k8452B4537a43790A81653K74372a0033H7232
17572a41313N9916n6081B64556a20475D5569Q3943a743A05607D5067c55282C46878
17560a5012H4280L28124b65269B79363N1532i9988B37871b1547J198i436k16195
17549b25631m0446A24378K4103a16841J0296C49281a0645o4196D7250J1439J12073
17538A70762f827C882J22765B7314K17407a24278B23577I7822f0205A82817E6734
17526c52162h8144G093K82248A5921K61000G3578a26580A97061P6774c65302B16343
17514A55631E8241O2931M17936a99788A95013a16145C09267b65825A08932d2696
$$ plain form
17596 -36847 -445857 -84669 81606 -57597 132587 -180746 14661 43417 -132058 193831 -196551
17584 292788 90732 12575 -211962 -154671 -183123 24537 -143790 181653 456025 -10033 87232
17572 -141313 -81397 -137478 264556 -120475 45569 129512 -1743 105607 45067 -355282 346878
17560 -15012 84280 412404 -265269 279363 330895 -99988 237871 -21547 -20349 -9436 -225631
17549 -225631 -266077 124378 148481 -116841 -106545 349281 -10645 -74841 47250 58689 170762
17538 170762 -6827 3882 126647 27314 244721 -124278 223577 97822 -60205 182817 56734
17526 -352162 -88144 7093 289341 15921 276921 73578 -126580 197061 273835 -365302 216343
17514 155631 58241 121172 539108 -199788 195013 -116145 309267 -265825 108932 -42696
17503a4393B28243E1686J2203a53692j40001c7743B71463D700i340A41433j8659
17492A22774J5527a2075H0486J27506G3561L0652P1028o8103K33731H6633J4504
17481A01137m704a6584F18318E4730P0788G473J90327K9691m2255A8836K57482
17470B76318k4748n8947g1588h800b411A7371c0203C14037c7805l3228B19811
17458B58697G1081K96409a0940B02060m6780a41629D1267J11715f877l32822C63950
17446C99886j14796A29936n7871P6162N7186a19237A83523K0792F4630J91569
17436B56199J87488A99871K26525j58392A30485M9483d2297D59408B17678J2954
17426B30632P7249N7945k5425j58026l278P1437L8816o0331K7679J08343N1851
$$ plain form
17503 -14393 228243 51686 63889 -153692 -293693 -37743 271463 4700 -9340 141433 122774
17492 122774 138301 -12075 80486 207992 73561 104213 175241 107138 340869 86633 101137
17481 101137 96433 -16584 618318 54730 125518 7473 197800 227491 185236 18836 276318
17470 276318 251570 192623 -71588 -8800 -2411 17371 -30203 314037 -37805 -71033 219811
17458 258697 71081 367490 -10940 202060 155280 -141629 41267 152982 -6877 -339699 363950
17446 399886 285090 129936 72065 148227 205413 -119237 183523 204315 64630 256199
17436 256199 443687 199871 426396 268004 130485 179968 -42297 459408 217678 230632
17426 230632 307881 365826 340401 182375 179097 250534 289350 229019 256698 365041 416892
17415D16892q6862I5242L77697E523J98323J37594L0440A36762i2285D59667B760
17403F520N3918L97825b0718C91556F3068K81421j09561j006Q3919D030L01360
17392C05390K37285k36202r0180J48560A7879K68716j558l7796q8443J37972j14657
17381A82113J38344o4913l187r7433L52638c9232I0822J76236k8964K56608I9176
17369B45127A16343P8938E5678J06624Q1654O8994b05130i4504L1000A26283R8287
17358B24570G8156L00403C5093a08268c6920B55792A7947R8597f5942A61363b6062
17346C45719A17715C7726M28556A28759K3757J62769A30531n5649B1817J93830
17336B15647J16876H2763K1822f9502C12602A32837a03510B06880L84129b7016
$$ plain form
17415 416892 330030 95242 472939 5523 203846 341440 371880 136762 -92285 459667 2760
17403 6520 60438 458263 -20718 391556 63068 344489 234928 233922 317841 4030 305390
17392 305390 542675 306473 216293 364853 17879 286595 285037 247241 158798 296770 182113
17381 182113 320457 255544 252357 154924 507562 -39232 90822 267058 238094 494702 99176
17369 245127 116343 195281 55678 162302 243956 312950 -205130 -94504 -63504 126283 224570
17358 224570 78156 378559 35093 -108268 -36920 255792 17947 116544 -65942 161363 -26062
17346 345719 117715 37726 466282 128759 152516 315285 130531 74882 21817 215647
17336 215647 332523 82763 104585 -69502 312602 132837 -103510 206880 591009 -27016
17325A78611p6163K67675A0730b980C29966D1964e0840O648A14034N05L081J19706
17313B37326J87343d1610B01845k2386E734O38807B09168C6632K07068G3465j0982
17302F2483J37050L7223D2176J46026L0996q9446e8813K5713m409A55047O2953
17291B18000n526C3187J30201J42638C7859o875a16516c6355H1021B8702J56941
17280A85643a66439C43823A06913g4431D17586A38601a3740B92613b91925d5945
17269D31334I7638J53400J2422J2447M8728j23737K9760P8708o2545j1234p8676
17258A56911K0937K36583H5375E56J55398D0493K93601l4799o501e8232A32306
17246g071G5933L76473j87096A16157l6879J73233n7398G0267J26260a3015A80029
$$ plain form
17325 178611 102448 370123 10730 -2980 329966 41964 -50840 -44192 114034 114539 117620 237326
17313 237326 424669 -41610 201845 179459 5734 644541 209168 36632 243700 73465 62483
17302 62483 199533 236756 42176 188202 219198 129752 -58813 -33100 -37509 155047 218000
17291 218000 212474 33187 163388 306026 37859 30984 -116516 -36355 81021 28702 185643
17280 185643 -166439 343823 106913 -74431 417586 138601 -13740 292613 -291925 -45945
17269 431334 97638 251038 263460 275907 324635 200898 230658 309366 246821 235587 156911
17258 156911 177848 414431 85375 556 155954 40493 334094 299295 292794 -58232 132306
17246 -7071 75933 452406 265310 116157 79278 252511 195113 70267 196527 -13015 180029
17234A44748d2249B93258j05708K60052l2577A76054J37119p7319J57061m1871
17224C51044m8942p5578p6012o2114K0658M30926B23048J48617r6656I5536L76693
17213D72229A27800K56635q271o4973r0189p281L461J13776o9354K1132L5676
17202C18412j27085J44110k8479k8168E471K36929J59441n9313e2432B38677O811
17191B45488Q8347I4912K1351J44456j04595L2275K2255J47592A76389M5747K03205
17180D25341j10817N8673A32679K50660p9355A00471J79688M3002o0086n0834
17170B12241a22182A55146J09400o7391J00558j18195J47560j11459L3715A08867
17159D67634m7275J39054A89803J14056n739k1156H1447L87799A71056K91606
$$ plain form
17234 144748 -42249 293258 187550 447602 415025 176054 313173 235854 392915 351044
17224 351044 302102 226524 150512 88398 109056 539982 223048 371665 275009 95536 472229
17213 472229 127800 384435 376164 311191 221002 213721 217182 330958 261604 282736 318412
17202 318412 191327 335437 306958 278790 5471 242400 401841 342528 -52432 238677 245488
17191 245488 333835 94912 116263 260719 156124 188399 210654 358246 176389 222136 425341
17180 425341 314524 373197 132679 383339 303984 100471 280159 323161 263075 212241
17170 212241 -122182 155146 264546 197155 297713 179518 327078 215619 249334 108867
17159 467634 420359 559413 189803 303859 298120 276964 81447 469246 171056 462662
17149D62662A50177J22172j8639J97483J15154J17276F4449P6458L53348k23074
17139B71181K695J00761m7114K18113k20592R2890j73941M83163R0148B56278
17128B35717K15745H2722K06061q2919j6806J26629K44573j6386k71478L94600
17118F66996l17173r0070P7090k2100J23710n1978A78918L88115j18137j99544
17108B49352L72148j16685j56793j16106M43873B18776J08999A14372J32736N8604
17098C05712j21978J94657r3236q7735M14143j70650k05650K84218A16611K57366
17088C73977J89356A76746K0610L69721A99583K15646k8774j1901p8436L50364
17078F46482j19069J16587j77304o5679K24552k22825n9856L28275H4174M7469
$$ plain form
17149 462662 150177 272349 253710 451193 566347 683623 64449 140907 494255 271181
17139 271181 273876 374637 327523 545636 325044 417934 243993 727156 817304 256278
17128 235717 451462 82722 288783 205864 189058 315687 560260 543874 272396 666996
17118 666996 349823 259753 336843 314743 438453 386475 178918 567033 448896 249352
17108 249352 621500 504815 348022 231916 675789 218776 327775 114372 247108 305712
17098 305712 183734 378391 285155 197420 611563 440913 235263 519481 116611 373977
17088 373977 563333 176746 197356 567077 199583 415229 386455 374554 296118 646482
17078 646482 527413 644000 466696 401017 625569 402744 342888 671163 84174 131643
17068A31643K05763J38259j55604K89474J74375k35633K02602C11037L93531C25245
17057F14536j16007M2894A38631M05180N7919k51397K95077j20126B42445K22666
17047D65111M91254D75956K03274j09156O3408C14724K46713K21159k11374j54937
17037D16285L53990A91317N09970J66647B83673M30066j11576J92784k75274j7445
17027E02228M83212l5964j04390l14261R4677q7434j25458P3387K40297j157l36488
17016C88649j52589J09934K04941J842J4424L33390j14459j79691K5633n4310
17006E77764J47770J58716n8853j30829k42695K75787p3015K89978k43035k4635
16996F76953J91387r334J59757j85954L9738j35984J13322j32725Q7132K71902
$$ plain form
17068 131643 337406 475665 320061 609535 783910 548277 750879 311037 704568 325245
17057 614536 498529 541423 138631 543811 601730 350333 645410 525284 242445 465111
17047 465111 956365 475956 679230 570074 633482 314724 561437 782596 571222 416285
17037 416285 770275 191317 701287 867934 283673 713739 602163 794947 519673 502228
17027 502228 985440 949476 845086 530825 625502 538068 412610 485997 726294 725137 388649
17016 388649 236060 345994 550935 552777 567201 900591 786132 606441 632074 577764
17006 577764 725534 884250 825397 694568 451873 727660 654645 944623 701588 676953
16996 676953 868340 859006 1018763 832809 872547 736563 849885 717160 804292 1076194
16986A076194l08100L39611k09917l295J54910L2635j30111p4551o2248J00118
16976I15246l9069K79986l06913Q2475n0825M5236A84042Q03753j50285J41956
16966I79466j50381K95250o8641N8885j5676J5266j33671L67822K8427o31139
16956G45608N2459M42018m19382q5013L38490k94082M1614k362K66430J831J23245
16945A210856l05981L96262n4425j35008k03936O20429l32220L7381q6842j18917
16935A027599q4416M89386n35918K98852L4942L10112j77038q9222J7223N7036
16925A348556j44332L04730k52571M60496k34991j93247J8951K57072R5703l72712
16915A287655k9920M14890m65487J74222Q4058K46224k50207K09165Q4781j4567
$$ plain form
16986 1076194 768094 1107705 897788 894493 1049403 1082038 951927 877376 815128 915246
16976 915246 876177 1156163 849250 931725 880900 926136 184042 987795 837510 979466
16966 979466 829085 1124335 1055694 1114579 1098903 1114169 980498 1348320 1376747 745608
16956 745608 798067 1240085 820703 735690 1074180 780098 821712 819350 1085780 1087611 1210856
16945 1210856 904875 1301137 1246712 1111704 907768 1528197 1195977 1233358 1146516 1027599
16935 1027599 943183 1432569 896651 1195503 1230445 1540557 1363519 1274297 1291520 1348556
16925 1348556 1204224 1508954 1256383 1716879 1481888 1288641 1307592 1564664 1660367 1287655
16915 1287655 1257735 1672625 1207138 1381360 1465418 1711642 1461435 1670600 1755381 1740814
16905A740814K2315J71919k39091r636J59352j03679k2016L1582L41443n49209
16895A543794L42605l4395J71281P9036l95937L22004j22136m7054J6854J12685
16885A988737J61325k79523J35745K06755j44589Q7354j7149J34109M4318R2588
16875B409670l03142j17389K54684J65455K23171l44570K17660J42276J22821
16866B770636l09333J4208K14122l89584K57578j2331J07260L68152k40774R9277
16856B879211K3794j21131P885Q8477N5284K98969k05042J18115J27646k74585
16846B998623K76325K65584j01240K15244k02677L03366k81013j46132K59960
16837C588040j40767L00564L77175m8932j67297L4909J12586k4736M02734l45073
$$ plain form
16905 1740814 1763129 1935048 1695957 1686321 1845673 1741994 1719978 1751560 2093003 1543794
16895 1543794 1886399 1852004 2023285 2102321 1706384 2028388 1906252 1859198 1876052 1988737
16885 1988737 2150062 1870539 2006284 2213039 2068450 2155804 2138655 2272764 2317082 2409670
16875 2409670 2106528 1989139 2243823 2409278 2632449 2287879 2505539 2647815 2770636
16866 2770636 2461303 2475511 2689633 2300049 2557627 2545296 2652556 3020708 2779934 2879211
16856 2879211 2903005 2781874 2789759 2878236 2933520 3232489 3027447 3145562 3273208 2998623
16846 2998623 3274948 3540532 3439292 3654536 3451859 3755225 3474212 3328080 3588040
16837 3588040 3447273 3747837 4125012 4076080 3908783 3943692 4056278 4031542 4434276 4089203
16827D089203K46584K9375J38198O608K28469K86627j89965J64164J12571K87120
16817E398954j22328P408j42035J28538J29345J84500m0348J83931J03774J45232
16807E976971m5786M55415m32585O66559q7839K05305M73332j18241M18041M8517
16797G559689k26271K19486N8368L96464L54863J52035K94258J62109J78245o3619
16787I085627N24236J88135J98829K73110L4227L20790N02006J84015M15573O29879
16777A2356427j28348J68753N86773N72993K38392k7397Q31972J95932N59108
16768A5354605Q31281j06197P81731M18975P92956K36149O48240J222587N21110
16759B0701437N50196R68011K25450J104737Q07813R82141R11572J224396R42131
$$ plain form
16827 4089203 4335787 4365162 4503360 4509968 4738437 5025064 4835099 4999263 5111834 5398954
16817 5398954 5276626 5284034 5141999 5270537 5399882 5584382 5544034 5727965 5831739 5976971
16807 5976971 5931185 6386600 5954015 6620574 6532735 6738040 7211372 7093131 7511172 7559689
16797 7559689 7333418 7552904 7611272 8007736 8362599 8514634 8808892 8971001 9149246 9085627
16787 9085627 9609863 9797998 9996827 10269937 10304164 10624954 11126960 11310975 11726548 12356427
16777 12356427 12228079 12396832 12983605 13556598 13794990 13767593 14599565 14795497 15354605
16768 15354605 16185886 16079689 16861420 17280395 18073351 18309500 18957740 20180327 20701437
16759 20701437 21251633 22219644 22445094 23549831 24357644 25339785 26251357 27475753 28417884
16750B8417884J477933Q97833J299985J251529J193892J444318J915438J562538
16742C9461350J483991K279171J685352K401721K407958K193348K535995L274226
16734E7723112K326028L212021L626635L291669L566807M530819L944282M307171
16726H6528544M650696N208486N296088N254772N727805O089577N897404O502517
16718A31155889N983446O078247O280023N814086N152166N721251M338748M451588
16710A74975444L108279K820596J381151N16924k25792j464558k253903l180889
16702A75677252l592528m495218n235883n402580o195504n663130o339748n911386
16694A32841275o346822n844125o147958n775679n665490m989404n514777m874589
$$ plain form
16750 28417884 29895817 30793650 32093635 33345164 34539056 35983374 37898812 39461350
16742 39461350 40945341 43224512 44909864 47311585 49719543 51912891 54448886 57723112
16734 57723112 60049140 63261161 66887796 70179465 73746272 78277091 82221373 86528544
16726 86528544 91179240 96387726 101683814 106938586 112666391 118755968 124653372 131155889
16718 131155889 137139335 143217582 149497605 155311691 160463857 166185108 170523856 174975444
16710 174975444 178083723 180904319 182285470 182802394 182576602 181112044 178858141 175677252
16702 175677252 172084724 167589506 162353623 156951043 150755539 145092409 138752661 132841275
16694 132841275 126494453 120650328 114502370 108726691 103061201 98071797 92557020 87682431
16686H7682431m774110m191429m285682l606311l757278l301018l723263l038926
16678E7004414k470066k741611k770253k337285k512037j850469j786284j760415
16670C8775994k009590j600594j616761j368913j510798j009962j475949p55120
16662B7428307j225139j183688p55267j004155r20637p57161j101495k33159o90783
16653A9556823n66342q44617o63000p04359k22107o35515o17543l65293m04172
16644A4533875l76432o40365m84694l04489j76207k59753m84606l34599n80984
16635A0891746L49050p49385k85437l31684L3085o7383o75834k9209m13022j92425
16625H529502j56417k17342l8077l04803k50256k02582J16482j51196J7935n56282
$$ plain form
16686 87682431 82908321 78716892 74431210 70824899 67067621 63766603 60043340 57004414
16678 57004414 54534348 51792737 49022484 46685199 44173162 42322693 40536409 38775994
16670 38775994 36766404 35165810 33549049 32180136 30669338 29659376 28183427 27428307
16662 27428307 26203168 25019480 24264213 23260058 22339421 21582260 20480765 20247606 19556823
16653 19556823 18990481 18145864 17482864 16778505 16556398 15920883 15303340 14938047 14533875
16644 14533875 14157443 13517078 13032384 12727895 12551688 12291935 11807329 11472730 10891746
16635 10891746 11240796 10491411 10205974 9874290 9907375 9839992 9164158 9134949 8721927 8529502
16625 8529502 8373085 8155743 8117666 7812863 7562607 7360025 7476507 7325311 7343246 6786964
16615F786964M4865j88206l54261j31837j32933L5083k07381N84j93112k98117
16605E361649K96910o39281K91877J17190k12841m59118K30002o8343j90981k26792
16595D500272j32461O2451l05618P3572k16489M50921n02968p8545J3313l700
16585C860748l07681M32243l07165j7335j71547j89086k70866N8509J79036L6267
16575C303123O9519k63676k47186P3109J80328O2593J19722m07626k76324j53604
16565B459978N26972l90671j25095M3561L1061k5989J13216l06760k68881K44801
16555B302193O3819j13104J19525j75057k00040L00740j35901k85241J09379J88174
16545B174487Q0199m62977Q8680l31090L22156J1179K00689j26148n3988j51152
$$ plain form
16615 6786964 6831829 6643623 6289362 6157525 6024592 6059675 5852294 5852878 5659766 5361649
16605 5361649 5658559 5019278 5311155 5428345 5215504 4756386 4986388 4918045 4727064 4500272
16595 4500272 4367811 4430262 4124644 4198216 3981727 4432648 3929680 3851135 3864448 3860748
16585 3860748 3553067 3985310 3678145 3660810 3489263 3300177 3029311 3087820 3266856 3303123
16575 3303123 3372642 3108966 2861780 2934889 3115217 3177810 3297532 2889906 2613582 2459978
16565 2459978 2986950 2596279 2471184 2514745 2545806 2519817 2633033 2326273 2057392 2302193
16555 2302193 2366012 2252908 2372433 2197376 1997336 2298076 2162175 1876934 1986313 2174487
16545 2174487 2254686 1791709 1880389 1549299 1871455 1882634 2083323 1957175 1903187 1752035
16535A752035O964J87371k35338l0921L5235k90908Q2912j7423K15867p7461l00893
16524A327440R9485M5461o119p5526J50299j06991L528q142L04071m23644k10615
16513A099247K60265m81694K40264R23N19248j77560n57468K63952L13837j02246
16503A378768l82610J56738P8472R0072j13510J13242k01075j0200J03159j5177
16493A197879K1193l1879j01744l05933J26743M22791l3314l71037R3499P7307
16483A095505k95529K34372k58759J68357K49766j77322l4495J05371n12936M27727
16473A002057j30471K02836l30541L10046D39641K71394K63136j06653l68562
16464D98956J03959L98880j1304j91733J51533o6507j07910C54963K29276K40949
$$ plain form
16535 1752035 1758999 1946370 1711032 1680111 1715346 1424438 1507350 1489927 1705794 1628333 1327440
16524 1327440 1426925 1472386 1466267 1390741 1541040 1434049 1437577 1429435 1733506 1309862 1099247
16513 1099247 1359512 877818 1118082 1119005 1638253 1460693 903225 1167177 1481014 1378768
16503 1378768 996158 1152896 1231368 1321440 1207930 1321172 1120097 1109897 1213056 1197879
16493 1197879 1219072 1187193 1085449 779516 906259 1329050 1295736 924699 1018198 1095505
16483 1095505 799976 1034348 775589 943946 1193712 1016390 981895 1087266 574330 1002057
16473 1002057 871586 1074422 743881 1053927 439641 711035 974171 867518 498956
16464 498956 602915 1001795 990491 798758 950291 883784 775874 354963 584239 825188
16454H25188j76578L21746j38698j26011L21835k24391o2571k5387j09652B30306
16443H30940j81571k11871K24509B57439J66147K10454o421J89145k6564N7478
16433H47678k25510r4254K14831C35842O24302A40196K53908J68642j44228K12506
16423F31024M0743P5715k18606B33369J02856M22444j65879A90865J61278K3393
16413C75536R3936q2751k3581K0655J25036k514e7614D99830J96624l17299J73568
16402E52723k11860J50089j35867A66936L40589I4001L01626j08635L97998C31700
16391E62979B02667J28463M5727J95070k7021B06697K38802j37870O71K37037
16381E45337N5837J43425C28084j06566O1707L18632k1029p7283j15429L609j13547
$$ plain form
16454 825188 648610 970356 831658 705647 1027482 803091 740520 715133 605481 230306
16443 830940 649369 437498 662007 257439 423586 634040 627619 816764 790200 847678
16433 847678 622168 527914 742745 335842 960144 140196 394104 562746 418518 631024
16423 631024 671767 747482 528876 233369 336225 758669 592790 190865 352143 375536
16413 375536 469472 386721 363140 383795 508831 506317 -57614 499830 696454 379155 552723
16402 552723 340863 490952 355085 166936 507525 94001 395627 286992 684990 331700
16391 562979 202667 331130 376857 571927 544906 206697 445499 307629 308300 545337
16381 545337 601174 744599 328084 221518 283225 601857 580828 503545 388116 391725 278178
16370B78178j25062M55524k6376k03835L60177l07000J48648L2941j37441j50897
16360C24857J84851p5005j87261K24915j94097K70401A53450l9536L3744d8134
16349b0784D79519k31250A12992L99826J15662B37988n5989K86579k06759J52946
16339D14765j15136A13305N2572E3695K53267D7679P6487h0366B38457J69725
16329D08182j25612j2138j25863D5947K8044M46295j34691K76234k69201N5084
16319D47712A14784J0689f1762B83533P1680a7632I1818N1795C5772O0936K30314
16308C27022A10292K38337J5656A70013K69742A84783K53658E7795R8531a70007
16297F8447L20678H9812Q7305J8388J41595c57247C63026j73565D1521K45609
$$ plain form
16370 278178 153116 608640 582264 378429 738606 431606 580254 613195 475754 324857
16360 324857 509708 434703 247442 472357 278260 548661 153450 113914 147658 -48134
16349 -20784 479519 248269 112992 512818 628480 237988 181999 468578 261819 414765
16339 414765 299629 113305 165877 53695 306962 47679 124166 -80366 238457 408182
16329 408182 282570 270432 144569 45947 73991 520286 385595 661829 392628 447712
16319 447712 114784 125473 -61762 283533 355213 -17632 91818 143613 35772 96708 327022
16308 327022 110292 348629 364285 170013 439755 184783 438441 57795 156326 -170007
16297 68447 389125 89812 177117 195505 337100 -357247 363026 189461 41521 287130
16287B87130E6397L92734A07170N7302L338q1580P9652O6132f2147j60r131D28218
16274B25950C829J75178j6465a3959G11R0545J21721a31958D58256G9086J72039
16263B51125L2868A31482K11962a50786A23956j8218J868R881Q176E8180J78559
16252B36739j11644O7289m2760a85390B19926d7307j1895F53726B78791a58828
16241D06383j7690j63769d0040B59015A3495M67622A29867M2921o7502J09141
16231B14427F0607J87567J77854a8577A94984l6049E1548K09100e6979A57944
16220C61529a71334C08720h3263B51728k7622J06655A393J04747J59721h3453
16209B38712K810a05090B52867b6007B69141o902j14507o078a22369A32818e0160
$$ plain form
16287 287130 56397 449131 107170 164472 167810 86230 165882 232014 -62147 -62307 -71438 428218
16274 225950 3829 179007 162542 -13959 711 91256 212977 -131958 458256 79086 251125
16263 251125 283993 131482 343444 -150786 123956 105738 107606 117487 125663 58180 236739
16252 236739 125095 192384 149624 -185390 219926 -47307 -59202 653726 278791 -158828
16241 406383 388693 224924 -40040 259015 13495 481117 129867 172788 105286 214427
16231 214427 60607 248174 426028 -18577 194984 158935 51548 260648 -56979 157944
16220 361529 -171334 308720 -83263 251728 224106 330761 1393 106140 265861 -83453
16209 238712 241522 -105090 252867 -26007 269141 262239 147732 141654 -122369 132818 -50160
16197A46531J5042d70246D75284k33960A19562D5857K78357j01575a75874B5931
16186b65157C54638E2235e5764A96424D1808b02278Q3005M5812k52874R3403P2966
16175a59966B95734j06759e964G1452i3959H8098L4645m1490C3760J42866a91809
16163E7480a80045C33582J52486H7425M646J8887j706j0007b4465p2597k2155
16152a19217D2481a27152M9407K8582A69211M5496b53567D06372g0766A95617
16141b62727J30836l56091I7258g8246I9144K47729b06064L3725A81451o5971
16131A15480B9209a3465C21539a93268B6841f1584K594j51220A17542N6121a40747
16119g4312m2804b8302A59395a05236L1869A67601a05470F5871B1420R2490b27159
$$ plain form
16197 146531 161573 -470246 475284 241324 119562 45857 324214 222639 -175874 25931
16186 -265157 354638 52235 -55764 196424 41808 -202278 -119273 -73461 -326335 -232932 -159966
16175 -159966 295734 188975 -5964 71452 -93959 88098 122743 81253 33760 176626 -191809
16163 57480 -180045 333582 486068 87425 92071 110958 109252 99245 -24465 -97062 -119217
16152 -119217 42481 -127152 -77745 -49163 169211 214707 -253567 406372 -70766 195617
16141 -262727 -131891 -487982 97258 -78246 99144 346873 -206064 -172339 181451 115480
16131 115480 29209 -13465 321539 -193268 26841 -61584 -58990 -210210 117542 173663 -140747
16119 -74312 -117116 -28302 159395 -105236 -73367 167601 -105470 65871 21420 113910 -227159
16107a77407p088A22716a15253r8754B39860h783D691K40023p4189e4985A79134
16095D6574L4653c11594B06798l1654A7422a5535B8086b29886D765J99346g2806
16083B42747A3932J19253K5768d3557m3844A53713Q6314b62338c8040n0285A44728
16071g2060B6292P5983O3475K76250b48280P7611H9569K2215a86396i0540a8197
16059b16220b0959k1189j70889m0886B20868a3903j42743B9533a97928B79759
16048A0462b00816b1347j0031B2893c76841l3998J302c6213r1456A1874M7193
16037E9067K94330a64410K4561d591B49949J984I0848j4869J4760e15855B26741
16025D8014b52302G3166K6716R8135e1432E3232a76034L7535G6643c03865i3003
$$ plain form
16107 -177407 -184495 122716 -115253 -214007 239860 -8783 4691 244714 170525 -54985 179134
16095 46574 81227 -311594 206798 175144 17422 -15535 28086 -229886 4765 204111 -72806
16083 242747 13932 133185 158953 -43557 -87401 153713 240027 -262338 -38040 -88325 144728
16071 -72060 26292 102275 165750 442000 -248280 -170669 89569 111784 -186396 -90540 -18197
16059 -216220 -20959 -42148 -213037 -253923 220868 -13903 -156646 29533 -197928 279759
16048 10462 -200816 -21347 -31378 22893 -376841 -410839 -409537 -36213 -127669 11874 59067
16037 59067 353397 -164410 -139849 -4591 249949 251933 90848 75979 90739 -515855 226741
16025 48014 -252302 73166 99882 198017 -51432 53232 -176034 -138499 76643 -303865 -93003
16013B69689h4913B00811r0911h3848b0955r2468J0199m3836k27938B61032a24534
16001d5771A012h4205A43046c14903J23163J4181e9253d654B42335a79453e3756
15989b20107l9282i1130M0535o9725B8758i1092F6246c3217C1907J3683b42488
15977B90603i591D3752e3897j73800B54977M8298g8831A69047F8083M5692J08261
15966B22036D6852J20488J82326I818M6875a32353c3259C36758A30402e7639C2232
15954C6558d8021q7828C0079J25142j2623a79835H7504f6253j86406m8427M9006
15943b52080a18596r647F4903J4159h1795I2929d5102n1485j32148B9220J8004
15932D7224K42432b2193A42721c6907r8993j21044J12863r0406J06366B23122
$$ plain form
16013 269689 -84913 200811 109900 -83848 -20955 -113423 -103224 -147060 -374998 261032 -124534
16001 -45771 1012 -84205 143046 -314903 -191740 -177559 -59253 -4654 242335 -179453 -53756
15989 -220107 -259389 -91130 -50595 -120320 28758 -91092 66246 -33217 31907 45590 -242488
15977 290603 -9591 43752 -53897 -227697 254977 303275 -78831 169047 68083 113775 222036
15966 222036 46852 167340 349666 9818 56693 -132353 -33259 336758 130402 -57639 32232
15954 36558 -48021 -135849 30079 155221 142598 -179835 87504 -66253 -252659 -301086 -252080
15943 -252080 -118596 -128243 64903 79062 -81795 92929 -45102 -96587 -228735 29220 47224
15932 47224 289656 -22193 142721 -36907 -135900 -256944 -144081 -234487 -128121 223122
15921i6481A7796J42400a09475A29648c14585B22553K54678F0383b1499o9434
15911i0933C79817a2534j14804A03053c7565C20902C6571a48497j60345A54795
15900C67356C2232J72900a9955j36040j353H3610P510D3606b18276j10894A29744
15888A73377d11120A45173D0508a6256q0504A3623b7960k30253g3149j83941B30567
15876A04205a72238d6756j45444G8265h699n3758p8788F2037b74724B43519d1092
15864A59253g239n2119B27254a62094F9066a75295j28721C5136b85505J37688
15854a47817j25449a09165A61989G7108d55292O4998A22459d9075j7709A67998
15843C7387R9082a96718l7764i3873p5768b1911D53365g7272A25292i6207n6055
$$ plain form
15921 -96481 17796 160196 -109475 129648 -314585 222553 477231 60383 -21499 -90933
15911 -90933 379817 -12534 -127338 103053 -37565 320902 36571 -148497 -308842 154795
15900 367356 32232 205132 -19955 -155995 -157348 83610 91120 43606 -218276 -329170 129744
15888 173377 -411120 145173 40508 -16256 -96760 13623 -27960 -258213 -73149 -257090 230567
15876 104205 -172238 -46756 -192200 78265 -8699 -62457 -141245 62037 -274724 243519 -41092
15864 159253 -7239 -59358 227254 -162094 69066 -175295 -304016 35136 -285505 -147817
15854 -147817 -273266 -109165 161989 77108 -455292 -390294 122459 -49075 -66784 167998
15843 37387 136469 -196718 -234482 -93873 -169641 -21911 453365 -77272 125292 -96207 -152262
15832a52262M9443A06240g1046j38950A55745a9285o8472j31637B7416J41816
15822A69232d2740k73352D9132f2130A35710a8157A36889B2570O0546a78674e8
15810a00217E5091c31669e5371C78869i6715C33490a55025B5185a15466G665K01733
15799B09398c70446H6576m130A6505K43228b54928J02578I7460K49497A0611b81493
15787I8091e7711q9788A9005b8393A08700b42132j2270P6127I144a91704E0233
15775A01381a67364f6885L1481k94175b1536k71918b5100F6789c51876A88475
15764A41975b13236B23460H8130b34007Q9645B91623a22990A56811g1100j27279
15754a98379K8510d1097C1909K0566b4068l8764j4329n6668p5405A30541a96388
$$ plain form
15832 -152262 -102819 106240 -71046 -209996 155745 -19285 -87757 -219394 27416 169232
15822 169232 -42740 -316092 49132 -62130 135710 -18157 136889 22570 83116 -178674 -58
15810 -100217 55091 -331669 -55371 378869 -96715 333490 -155025 25185 -115466 7665 209398
15799 209398 -370446 86576 82446 16505 259733 -254928 -152350 97460 346957 10611 -281493
15787 98091 -57711 -147499 19005 -28393 108700 -242132 -254402 -178275 9144 -191704 50233
15775 101381 -167364 -66885 -35404 -329579 -21536 -293454 -25100 66789 -351876 188475
15764 141975 -213236 223460 88130 -234007 -144362 291623 -122990 156811 -71100 -198379
15754 -198379 -169869 -41097 31909 52475 -24068 -62832 -77161 -133829 -209234 130541 -196388
15742C88312A8780b72819H6444A785M3937h1633J9145m00500h7875j11731A7503
15730a80194B7064g3085A8743J49327A9785J45302m2257a77088Q4492p3775B90251
15718A7622K6053b7788k21834d3411A2416a59300B32022A4319e7354j00485f7594
15706b62902d8322l37636A21057C9042b91613a27151B16081F7645J44490n5361
15696A56774e2956A35866E5760f6472n77811i2939j20306g5512l34168B91088
15685g1806j14259j66648I2822D3105J65434a26145A17524c46736a665B2128Q9700
15674A11828K0613A7073K74490a73268C33200b6530j95639H5389a03351n4055
15664a57406k18906h4760a4938n2476q5108A63348p9211C1894L0920k8712b69304
$$ plain form
15742 388312 18780 -272819 86444 1785 45722 -81633 -62488 -462988 -87875 -199606 17503
15730 -180194 27064 -73085 18743 168070 19785 165087 122830 -177088 -92596 -166371 290251
15718 17622 43675 -27788 -249622 -43411 12416 -159300 232022 14319 -57354 -157839 -67594
15706 -262902 -48322 -385958 121057 39042 -291613 -127151 216081 67645 212135 156774
15696 156774 -52956 135866 55760 -66472 -644283 -92939 -213245 -75512 -409680 291088
15685 -71806 -186065 -352713 92822 43105 208539 -126145 117524 -346736 -1665 22128 111828
15674 111828 132441 17073 291563 -173268 333200 -26530 -222169 85389 -103351 -157406
15664 -157406 -376312 -84760 -14938 -67414 -152522 163348 84137 31894 62814 34102 -269304
15652c05337g1538p9086o5256G5650a3799A6428O070d969j26025c3019J4063k9084
15640d8040E6432a97972n840D3953f9550j21032P3736D0816h9359C37J10108a88663
15627c34010d017q4941B58366i9188A25947D8143c97006a25527k55209A70287
15616a72934E663J00408h6515B26180B2903a19125H2059B7926a70680D5041K0687
15605F5728a05508R520B2290K29300e2319a0729k54282a04043C6952a50968B72815
15593C01663b15394A36636M4394C689K35237b81642E6356d02539J21686J9572
15583b61281B68041p9128p5442a83656Q0881D9985H819b46697A3545c9957k14537
15572b54494j20895A16667a98545A23646J23486g2130B02386h8382j35485E1516
$$ plain form
15652 -305337 -71538 -150624 -215880 75650 -13799 16428 22498 -4969 -130994 -33019 -18956 -48040
15640 -48040 56432 -197972 -203812 43953 -69550 -190582 -116846 40816 -89359 337 110445 -188663
15627 -334010 -4017 -88958 258366 -99188 125947 48143 -397006 -125527 -380736 170287
15616 -172934 5663 106071 -86515 226180 22903 -119125 82059 27926 -170680 45041 65728
15605 65728 -105508 -95988 22290 251590 -52319 -10729 -265011 -104043 36952 -150968 272815
15593 301663 -215394 136636 181030 3689 238926 -281642 56356 -402539 -280853 -261281
15583 -261281 268041 188913 113471 -183656 -102775 49985 8819 -246697 13545 -39957 -254494
15572 -254494 -375389 116667 -198545 123646 247132 -72130 202386 -88382 -223867 51516
15561a6528j6761p4968r0302C7468A5733i2334F1386J03606o829g8056A83329
15549B39133a08950q5742C70884A10199P5386a08980K3934j48577A45665f977
15538i5513j69520m193K4769A30783f663k13078P4740f0609I3333b1243E4579
15526b6948j6664j63689D57635O8621A57585P6811d7242j30034B40934b3610a1273
15514f0441k3669j3410E8063B0572J43391b74042A29330b4084j11205o0662D0774
15502f7154b3675A77470d0270A34181F4481B7795F895J78406m2622D2011a65330
15490A99922b04795B7914N9216l1863a29922A88431a00892H9369b38692K2638
15480b16054A68595k5063n8723R8351d6566J8272F3590a37554O3626h27k5025
$$ plain form
15561 -16528 -33289 -108257 -198559 37468 15733 -92334 61386 164992 158163 -78056 183329
15549 239133 -108950 -194692 370884 110199 185585 -108980 -85046 -233623 145665 -6977
15538 -95513 -265033 -269226 -244457 130783 -6663 -219741 -145001 -60609 93333 -21243 54579
15526 -26948 -43612 -207301 457635 526256 157585 234396 -47242 -177276 240934 -23610 -11273
15514 -60441 -84110 -97520 58063 20572 163963 -274042 129330 -24084 -135289 -195951 40774
15502 -67154 -23675 177470 -40270 134181 64481 27795 6895 185301 142679 42011 -165330
15490 199922 -204795 27914 87130 55267 -129922 188431 -100892 89369 -238692 -216054
15480 -216054 168595 143532 84809 183160 -46566 -28294 63590 -137554 -73928 -827 -25852
15469b5852k12533A0953a60725D3194i6815D2474N2398c07737A48731g1946K6587
15458d5359H3824B3100K5037J77134b71936A03145b08356A79043P585a10763B3085
15446A59061a98128i1985A6409a92749P2436R684H8208c23516B06424A1090f0239
15434E5197Q1886b1407n7610I0073a91039F1618O1162r508f4071I56a02447F9920
15421G386J74393b9628a4653k5439B98969a93025B40516h2923A90452j5653J10933
15410B85732c5964o7597A46369C1437J75853b9084k63705P7876B96820c07622
15399c31841h2463G0765L0434i2467k39591d0287C0471M983g4763D5434K48258
15388B93692A6522Q5083J01624o5920m1364D5029J3765J7772C6378c5838j36437
$$ plain form
15469 -25852 -238385 10953 -160725 43194 -96815 42474 94872 -307737 148731 -71946 -45359
15458 -45359 83824 23100 48137 225271 -271936 103145 -208356 179043 186628 -110763 23085
15446 159061 -198128 -91985 16409 -192749 -120313 -110629 88208 -323516 206424 11090 -60239
15434 55197 137083 -21407 -79017 90073 -191039 61618 122780 113272 -64071 956 -102447 69920
15421 7386 181779 -29628 -14653 -40092 298969 -193025 240516 -82923 190452 174799 285732
15410 285732 -35964 -103561 146369 31437 207290 -29084 -292789 -214913 296820 -307622
15399 -331841 -82463 70765 101199 -92467 -332058 -40287 30471 35454 -74763 45434 293692
15388 293692 16522 101605 203229 137309 95945 45029 58794 76566 36378 -35838 -172275
15377a72275J5002c4249M687C55322j66400H4677H869J83970G4210g0558k13136
15366b83694d0749A02964b85355a12701A62899a40342k11752f2868c1105l30385
15356c61490b0606A16604a49707A66438J00537m8090a25960E0907J75115r1530
15346A34492F901g4268C0066f0155q3199e6381M929j78413I7712C958P9383b0340
15333C0185c6760D0336K82003A5714i9300a960k53630c4496a0206j34285e382
15321G2583J35602C9376a42267C44464A7719a3805B86347c4513m2945j41406A59425
15309A81561a9217E673L0274R7155b59680E04806b65959B6996p699J36432O9A4103
15296C71297g659B87631A41012a903B1675b85196G0454A4057L8670h1039B2419
$$ plain form
15377 -172275 -157273 -34249 -29562 355322 188922 84677 8869 192839 74210 -70558 -283694
15366 -283694 -40749 102964 -285355 -112701 162899 -140342 -352094 -62868 -31105 -361490
15356 -361490 -20606 116604 -149707 166438 266975 218885 -125960 50907 226022 134492
15346 134492 6901 -74268 30066 -60155 -143354 -56381 -51452 -229865 97712 3958 83341 -20340
15333 30185 -36760 40336 322339 15714 -99300 -1960 -255590 -34496 -10206 -144491 -5382
15321 72583 208185 39376 -142267 344464 17719 -13805 286347 -34513 -77458 -218864 159425
15309 181561 -19217 5673 35947 133102 -259680 504806 -265959 26996 19297 155729 155798 14103
15296 371297 -7659 287631 141012 -1903 21675 -285196 70454 14057 52727 -81039 22419
15284H5682e183H2125a67916N3470j9146B3993a793j78662B00731a32219H7948
15272G4213O983e3111C60794q149a372I9027C5575J24058K38907A08843k4978
15261H3865i1875A15855a63709H2380a16526b0219r2640k75616a01451B35628
15250A47815B9710b29879J09849B69419C0880J46181J56448A25839K099l1160
15240I6778j6205J10035G5089J21824c8082A77881N96170J56600J22211N93802
15230A646664o0036K03986m10422F68174l08466E5567K50982G3989a80177B47368
15219D21633b06495C14872c89035g6245q0793j08236B03957m8224j4212a2066
15208g8049b6900j5439q7123d2324B47986c2112B89313G3227J55707D4431i5265
$$ plain form
15284 85682 -5183 82125 -167916 -114446 -133592 23993 -1793 -180455 200731 -132219 87948
15272 74213 81196 -53111 360794 352645 -1372 99027 35575 159633 398540 108843 83865
15261 83865 -91875 115855 -163709 82380 -116526 -20219 -112859 -388475 -101451 235628
15250 147815 29710 -229879 -120030 269419 30880 177061 333509 125839 127938 96778
15240 96778 80573 190608 75089 196913 -38082 177881 774051 930651 1052862 1646664
15230 1646664 1586628 1790614 1380192 668174 359708 55567 306549 73989 -180177 247368
15219 421633 -206495 314872 -389035 -76245 -157038 -265274 203957 155733 141521 -12066
15208 -78049 -26900 -42339 -129462 -42324 247986 -32112 289313 73227 228934 44431 -95265
15196A34135a80877L5767a157A1879M4893J86189F8328Q0231a75081B62838h8351
15184C59523A76558G0271J03838a56902e3154A60843F6747k3108L30796a64237
15173D11051B00506N8619p9716a54842d6923q7714C13897j28655o1947n9505e633
15161d0156k34779A45344m6407a86336H6274K67528i4628F4701a17773m1401A51275
15149B3911J19535q363a25840a0605C7480N1381P8728m606k1910M4552I378L74119
15137C83497j82608r3726a0998L228A41144h6696C13255A14938J78078B8106J74105
15126B02211J55284a09109j35600A52574L16595A31384A9859Q7509M45000B33254
15115C4152c8934E853J64573F8512f8861E7328B7679L03871b1334B46188Q075
$$ plain form
15196 134135 -180877 -145110 -1157 11879 56772 242961 68328 148559 -175081 262838 -88351
15184 359523 176558 70271 174109 -156902 -53154 160843 66747 43639 374435 -164237
15173 411051 200506 259125 179409 -154842 -46923 -134637 313897 185242 123295 63790 -5633
15161 -40156 -274935 145344 98937 -186336 86274 353802 -94628 64701 -117773 -159174 151275
15149 23911 143446 135083 -125840 -10605 37480 88861 167589 162983 141073 185625 9378 383497
15137 383497 200889 107163 -10998 -7770 141144 -86696 313255 114938 293016 28106 202211
15126 202211 357495 -109109 -244709 152574 469169 131384 19859 107368 552368 233254
15115 34152 -38934 5853 170426 68512 -68861 57328 27679 331550 -21334 246188 254263
15104B54263k6878r9494b82793C55099j63573p1836K24210H3178h2593j64185
15094b46778r437F1394J43991f4523K0969C2574A3462f7412B8728K81471J01843
15083D12042o6756A14067m4556a76233B80718G7550o941R545J31826l0108o978
15072A74894J55594g9839D12783A80197a2068k35103A34639j7339a2251B8639
15061D909J89129q0711c19186A75821a15413D40800B419J34405K75156c1769j40824
15050a72593h1524A98785R0436L4329j9870k0328o018o8596N7927L49760k92820
15039C23605J60854D8362J24863J77570n2813J09981i6893M538A13407J34217
15029B47624m0168L9478j15139J60994J4066K23093A41434m4271R4094J0046E382
$$ plain form
15104 254263 227385 127891 -282793 355099 191526 119690 343900 83178 -82593 -246778
15094 -246778 -256215 61394 205385 -64523 -43554 32574 13462 -67412 28728 310199 412042
15083 412042 345286 114067 69511 -176233 280718 77550 70609 80154 211980 181872 174894
15072 174894 330488 -79839 412783 180197 -12068 -247171 134639 117300 -12251 28639
15061 4909 194038 113327 -319186 175821 -115413 440800 2419 136824 411980 -31769 -172593
15050 -172593 -81524 198785 289221 323550 303680 283352 277334 208738 266665 616425 323605
15039 323605 484459 48362 173225 350795 297982 407963 -96893 -92355 113407 247624
15029 247624 207456 246934 131795 292789 306855 529948 141434 97163 191257 201303 5382
15017I8448K3364M3961K49672K9951A24602R8655N7365A07895k4995f107B73797
15005E81283H6757K78877j36586m4532Q6064a25870C06001K18220j99841e0753
14994A69042C9089K50344J9538j44468J04668b8710B71515C5720J11909e4558
14983A07065N1913K52224j31571C7587J48641a51711B67722J19594B613L54991
14973C57604N3006A51190K25408K6867k0285J5268j86831M387C4969O384L02012
14962C43365J6728K3272A89172J80670K1117m6165a88898H8767K68893A56254
14951C21988J12997j48626K5217B7281J82890m7526m1548O0921K6845J83112o0811
14940C31164G2300A8323M51983k32483M4876J73636H9019L09891G8368L43629
$$ plain form
15017 98448 121812 165773 415445 445396 124602 223257 280622 107895 82900 -6107 273797
15005 581283 86757 365634 229048 184516 270580 -125870 306001 524221 324380 -50753
14994 169042 39089 289433 308971 164503 269171 -28710 271515 35720 147629 -54558
14983 107065 158978 411202 279631 37587 186228 -151711 267722 387316 2613 357604
14973 357604 410610 151190 376598 403465 383180 398448 211617 216004 34969 41353 343365
14962 343365 360093 383365 189172 369842 390959 344794 -188898 88767 357660 156254
14951 321988 434985 286359 311576 27281 210171 162645 121097 182018 208863 391975 331164
14940 331164 72300 18323 470306 237823 282699 456335 89019 398910 78368 421997
14930D21997r8630m2014h3221k8032G9640j6861J74423Q2169j08685K03340r4265
14919C19761N1915P0044j63354k579J3442C2654M25730A90048R5087r0857J31313
14908C25591G1561J90074k5158J21893J39958j97609o5324P830p7888O2553O5734
14897B93624B7604K49737K73781j0426B07288J40270K187A25337L56022b4175
14886A19890J27806F5196M20725j35881j04732j2601K74603q5666F9150M74601
14876E43751M2901A95723J83512R7015H6N4925J75112K46675A85511N7927O4703
14865C08141Q5840C9615L75686j3083N4475j17199J0493J8064r0444L03269j37448
14854D43428J45858j88391K76390C31124J07050O4728B36493L52102j05004j39146
$$ plain form
14930 421997 323367 281353 -83221 -111253 79640 62779 237202 319371 210686 414026 319761
14919 319761 371676 441720 278366 275787 289229 32654 458384 190048 285135 194278 325591
14908 325591 71561 261635 236477 358370 498328 300719 235395 243225 165337 227890 293624
14897 293624 27604 277341 551122 540696 207288 347558 349745 125337 481359 -24175
14886 119890 247696 65196 485921 350040 245308 232707 507310 421644 69150 543751
14876 543751 586652 195723 379235 476250 86 55011 230123 476798 185511 243438 308141
14865 308141 393981 39615 415301 402218 456693 339494 349987 368051 277607 580876 443428
14854 443428 589286 400895 677285 331124 438174 502902 236493 588595 483591 344445
14844C44445l9391A22786P22190B61019Q3372A16074K46944J35834n9934r742
14834D29176K45941A46145L79837j63197m1455J18417j66495m3090M1270j19069
14824A52363L25606j19720K97504j32333j62039J94160R6787k56690J42190l7131
14814E00697K10739q9406A85548K23026J19061Q9318k6524J02161j75249p9206
14804D38135J46722J6710B94617R0091Q8161K868A68746J13545l4167K85150p176
14793E26098Q3859q1038l5215J4969l3380J56728k51323K52457J89509C06885
14782E83596n3181P5638B45306O50376m03114L0756O4698J0002k03282K10764
14772F05506P9385B88274M07829l44985N08999l59956J80269N1875l35669J39271
$$ plain form
14844 344445 305054 122786 844976 261019 344391 116074 363018 498852 438918 429176
14834 429176 675117 146145 525982 362785 321330 439747 273252 230162 271432 152363
14824 152363 477969 358249 655753 523420 361381 555541 652328 395638 537828 500697
14814 500697 711436 622030 185548 408574 527635 616953 590429 692590 517341 438135
14804 438135 584857 601567 294617 384708 472869 475737 168746 282291 248124 533274 526098
14793 526098 609957 528919 493704 508673 475293 632021 380698 633155 822664 306885
14782 583596 530415 606053 245306 895682 492568 523324 588022 598024 394742 605506
14772 605506 684891 288274 696103 351118 860117 500161 680430 732305 396636 535907
14762E35907L65313J04985j61283p2898k93677N1279K3601L06919l71950J01167
14752E89363J155p155k30516K06121J76691k98988K29519K15840J7291j20079
14742G79242r5190n9501K35077k89688J50799r0920N7515J7695j94735L76630
14732H86924j90203P7261j71917P9642L62154k00129C34877K11335L26691j62047
14722G10856J24300j31126J5509j95900J26322J31738j96023k3524L41803n2624
14712H51331C82217M46808O5702l92626O3395K17658K13663j56786K95267k66906
14702H68392k10794K24755K50809l65995j2914j63712J02003j51643M92454q4344
14692I49011j0340j30859J63109Q0321J41362J5757m29924K59368m29780K90403
$$ plain form
14762 535907 901220 1006205 844922 772024 478347 529626 553227 860146 488196 589363
14752 589363 590518 583363 352847 558968 735659 436671 666190 882030 899321 779242
14742 779242 684052 624551 859628 569940 720739 629819 687334 705029 510294 886924
14732 886924 696721 773982 602065 681707 1043861 843732 334877 546212 872903 710856
14722 710856 835156 704030 719539 523639 649961 781699 585676 562152 903955 851331
14712 851331 382217 829025 894727 502101 565496 783154 996817 840031 1135298 868392
14702 868392 657598 882353 1133162 767167 754253 590541 692544 540901 1033355 949011
14692 949011 938671 807812 970921 1051242 1192604 1208361 778437 1037805 608025 898428
14682H98428o1607R3854m4591j71400J69059Q6165J80154Q45k72707j51865n529
14671G20806K86476J08393n175n8466o8080J58189j50487l75963O45492M3627
14661A304812m2222o03723N54431l06684P2178j06032K92196L9884p5282l15541
14651H14017O1146J36250Q4555m8953J61761j99122K8789J21923J69160j37353
14641A192173j25478r9689L49132j36908j27290P9657k19489K30636K10970j0038
14631A343676K4867n1398j24133o0171K16854j56360P51L06653k5990k1981k48591
14620A204177j2386J29927p781K40916j65345l2794l9291k5378L54957k47467
14610A399535P9945J13103k40809M53544j36972j26666k80599L08402N5372k9875
$$ plain form
14682 898428 836821 930675 886084 714684 883743 969908 1150062 1150907 878200 726335 720806
14671 720806 1007282 1115675 1110500 1052034 983954 1142143 991656 615693 1261185 1304812
14661 1304812 1262590 658867 1213298 906614 978792 872760 1164956 1204840 1129558 814017
14651 814017 875163 1011413 1095968 1047015 1208776 1009654 1038443 1160366 1329526 1192173
14641 1192173 1066695 967006 1316138 1179230 1051940 1131597 912108 1142744 1353714 1343676
14631 1343676 1368543 1317145 1193012 1132841 1349695 1193335 1194086 1500739 1474749 1452768 1204177
14620 1204177 1191791 1321718 1313937 1554853 1389508 1356714 1317423 1292045 1647002 1399535
14610 1399535 1479480 1592583 1351774 1805318 1668346 1541680 1261081 1569483 1624855 1594980
14600A594980k60401J23261P3204j31514K81550J42068k79724K44793J74057l39708
14590A622566M6763l3597L25171l11422j76592K30445r2887K91336k2464n66014
14580A313305M32998L20218m37273J82143j40186K49718m5441K04603l67065K58503
14570A971523k85997R8035L44307k62327J76518j93770K83822J06985j28982k34381
14560A875733M43821k33436P5344M54668j94542j15659j29808J83697J74923j73721
14550B361020j58305L97695Q3448l893R5325j12004M93195J3462J05064M37581
14540C712588N62692k03764M25558Q50117J185030J522190K270794M366616O246835
14531B0938656J1706968p19684j3063997p135547k600885k934404j606850j008697
$$ plain form
14600 1594980 1334579 1457840 1531044 1399530 1681080 1823148 1543424 1788217 1962274 1622566
14590 1622566 1669329 1635732 1960903 1649481 1472889 1703334 1610447 1901783 1879319 1313305
14580 1313305 1746303 2066521 1629248 1811391 1671205 1920923 1875482 2080085 1713020 1971523
14570 1971523 1685526 1783561 2127868 1865541 2042059 1848289 2132111 2239096 2110114 1875733
14560 1875733 2319554 2086118 2161462 2616130 2421588 2305929 2176121 2359818 2534741 2361020
14550 2361020 2202715 2600410 2683858 2679965 2775290 2663286 3156481 3169943 3275007 3712588
14540 3712588 4275280 4071516 4497074 5347191 6532221 8054411 10325205 14691821 20938656
14531 20938656 32645624 31925940 18861943 11726396 9125511 6191107 4584257 3575560
14523C575560k09951m86242j76747m8284J81703n98448K37765j27553L01741j13925
14513B535619K01140k18046j36398N0358J37685J05726j81044l1M47413k37582
14503B704840Q1473k44426L40113n50269K35732J4001P534N92423l87662J96054
14493B989813L51865j80777J9405q7031K07762m42824L55522J85199l1479K16908
14483C584363l52034j70216O36867l18041J12632K90501k15052l5245Q0913L25205
14473C939893n0844N4656l35223n36J59562R8668K13126J21240q3644l6870k8026
14462D052002K97401n38262L37059k378K75708l96953L66511o2667N8350N02994
14452D889765j39173J09342p6565p9440J68042j87956L08096r2990j3495K17692
$$ plain form
14523 3575560 3365609 2879367 2702620 2654336 2836039 2237591 2475356 2347803 2649544 2535619
14513 2535619 2736759 2518713 2382315 2432673 2570358 2676084 2495040 2495009 2942422 2704840
14503 2704840 2786313 2541887 2882000 2331731 2567463 2581464 2588998 3181421 2793759 2989813
14493 2989813 3341678 3160901 3180306 3093275 3301037 2858213 3213735 3398934 3367455 3584363
14483 3584363 3232329 3062113 3698980 3380939 3493571 3784072 3569020 3533775 3614688 3939893
14473 3939893 3889049 3943705 3608482 3607946 3767508 3866176 4079302 4200542 4116898 4080028 4052002
14462 4052002 4349403 3811141 4148200 4145822 4421530 4024577 4391088 4328421 4386771 4889765
14452 4889765 4750592 4859934 4783369 4703929 4871971 4684015 4992111 4899121 4885626 5103318
14442E103318K50363j26965k5111M4768M79315n5011K2378j92305K71145J64369
14432E936264O1617J18210o731P4091J3262K7669K56407q9989m0773k9374K43758
14421F564411K66901J61116r9756R6203R3202j0238J35911K3123K39022q6791
14411G383104j1067K42427J14838O0345L67972k31788P81862l95483j92969M96284
14401H615525K34159R7695m2091k6638M21065M07451o09148N10108N7412N51783
14391A0217321j72159P0162M60207k70144M27496Q6819M2662l7539N08425j36377
14381A1196873N04584P0403K41564j1256N12285M3382K41764K63685O03379j39807
14371A3526856K9230O43721N08812m84880M01298M34419K05903k1491P28338K17934
$$ plain form
14442 5103318 5353681 5226716 5201605 5246373 5725688 5670677 5693055 5500750 5771895 5936264
14432 5936264 5997881 6116091 6109360 6183451 6196713 6224382 6480789 6390800 6350027 6320653 6564411
14421 6564411 6831312 6992428 6892672 6988875 7082077 7071839 7207750 7230873 7469895 7383104
14411 7383104 7372037 7614464 7729302 7789647 8157619 7925831 8707693 8312210 8119241 8615525
14401 8615525 8849684 8947379 8905288 8878650 9299715 9707166 9098018 9608126 9665538 10217321
14391 10217321 10045162 10115324 10575531 10305387 10732883 10819702 10862364 10824825 11333250 11196873
14381 11196873 11701457 11771860 12013424 12002168 12514453 12557835 12799599 13063284 13666663 13526856
14371 13526856 13556086 14199807 14708619 14223739 14625037 15059456 15265359 15243868 15972206 16190140
14361A6190140K84957J65715N06154L32635L98775J56624L29162M83764K67483
14352A9115409M96526N16431L30148N40620K52642P59492N47640K51072L49459
14343B3159439K91042Q76805O61013P42840P8023P44042R52147M14274P09084
14334B8628709J176067M00824Q03196R59691M88506R92907J008916O36441Q72378
14325C5967635J379140Q94911J076514J310438P98450J598852J005968J880743
14317D5912651J350875J282992J526490J391940J878543J589097K078667J499647
14309E8510902K067888K043305K263433K394981K384087K590519K481726K906956
14301G7643797K655869L162270L463226L294387L510635L780462M008970M315543
$$ plain form
14361 16190140 16475097 16640812 17146966 17479601 17878376 18035000 18364162 18847926 19115409
14352 19115409 19611935 20128366 20458514 20999134 21251776 22011268 22558908 22809980 23159439
14343 23159439 23450481 24327286 24988299 25731139 25809162 26553204 27505351 27919625 28628709
14334 28628709 29804776 30205600 31008796 31968487 32456993 33449900 34458816 35095257 35967635
14325 35967635 37346775 38241686 39318200 40628638 41427088 43025940 44031908 45912651
14317 45912651 47263526 48546518 50073008 51464948 53343491 54932588 57011255 58510902
14309 58510902 60578790 62622095 64885528 67280509 69664596 72255115 74736841 77643797
14301 77643797 80299666 83461936 86925162 90219549 93730184 97510646 101519616 105835159
14293A05835159M724290M486149N113309N427216N411700O258588O000591P033247
14285A50290249O838753P537154Q115019Q096569Q817022R125403R784546J0552741
14277B19157456J0929513J1609094J2063847J3090830J3337636J3314207J4261062
14270C07763645J4386044J4478344J5031637J4423511J4386593J3191674J2247596
14263D05909044J1240852J0357837Q981192Q780537O744414L634125J576306K004018
14255D59228325K840225j303704m767107m954688q380911r445018j0004743j0820608
14247D12391771j1887115j2864053j2984518j2159855j3330683j3443434j3472846
14240C22249267j2980632j3075123j2023922j2166782j2368398j1488267j1743196
$$ plain form
14293 105835159 110559449 115045598 120158907 125586123 130997823 137256411 143257002 150290249
14285 150290249 157129002 164666156 172781175 180877744 189694766 198820169 208604715 219157456
14277 219157456 230086969 241696063 253759910 266850740 280188376 293502583 307763645
14270 307763645 322149689 336628033 351659670 366083181 380469774 393661448 405909044
14263 405909044 417149896 427507733 436488925 445269462 452013876 455648001 457224307 459228325
14255 459228325 462068550 460764846 455997739 451043051 442662140 433217122 423212379 412391771
14247 412391771 400504656 387640603 374656085 362496230 349165547 335722113 322249267
14240 322249267 309268635 296193512 284169590 272002808 259634410 248146143 236402947
14233B36402947j1757618j1199546j0568535j0119539r675999q956243q564033
14226A65561434p515497p811315o587706o163560o144329n784605n784258n122457
14218A14647707m689790m330892m162236m030615l740585m101429l318498l227052
14210H3046610l367930k635588k784517k625494k276345k857419j877836k356161
14202F2265320j732517k316014j938219j483167j385243j941504j446184j675496
14194D8346976j346868j036368p72380j816757j111627j169737o85774j911558
14186C8495907n21445q04259j163760o35615j396970r96771n16881r55072l25007
14177C1180127r43563q73298n52042r11289n51828k78747j076406l74334m73072
$$ plain form
14233 236402947 224645329 213445783 202877248 192757709 183081710 174125467 165561434
14226 165561434 158045937 150234622 143646916 137483356 131339027 125554422 119770164 114647707
14218 114647707 109957917 105627025 101464789 97434174 93693589 89592160 86273662 83046610
14210 83046610 79678680 77043092 74258575 71633081 69356736 66499317 64621481 62265320
14202 62265320 60532803 58216789 56278570 54795403 53410160 51468656 50022472 48346976
14194 48346976 47000108 45963740 45191360 43374603 42262976 41093239 40407465 38495907
14186 38495907 37974462 37170203 36006443 35370828 33973858 32977087 32460206 31505134 31180127
14177 31180127 30236564 29363266 28811224 27899935 27348107 27069360 25992954 25618620 25145548
14168B5145548o78325n30831l93534m77708n70313l23229m66623n69774k85590
14159B0849621m25896o13090j83240m32633n70522J44852m88464o12083k98798
14150A7369747o79312J69819n61093m1277k76269l07665r7307q36156K024k85171
14140A4457340J43287o34354k84771j78371k43920k08419j3559l54334K1393n52809
14130A2151483J650k21551q2911l02282k43884J94350o51476r713l66525J23305
14120A0592446j96996j55983n02543L21884l33758k8282k50959n29340O64666
14111I581135j71624k52460k49591m35282m5715L34077k46204m32921J10528l79350
14101G812593J25288p9264J99778l35841l49306L04811l14504k63458L28831m81347
$$ plain form
14168 25145548 24467223 23936392 23542858 23065150 22494837 22171608 21704985 21135211 20849621
14159 20849621 20423725 19810635 19627395 19194762 18624240 18769092 18280628 17668545 17369747
14150 17369747 16690435 16860254 16299161 16257884 15981615 15673950 15576643 14740487 14742511 14457340
14140 14457340 14600627 13966273 13681502 13503131 13259211 13050792 13037233 12682899 12704292 12151483
14130 12151483 12153133 11931582 11848671 11546389 11302505 11496855 10845379 10835666 10469141 10592446
14120 10592446 10395450 10239467 9736924 10058808 9725050 9696768 9445809 8916469 9581135
14111 9581135 9409511 9157051 8907460 8472178 8426463 8760540 8514336 8081415 8191943 7812593
14101 7812593 7937881 7858617 8058395 7722554 7373248 7678059 7363555 7100097 7428928 6947581
14091F947581m3585j16275Q4885p9903j08635k40528K34182k60679k18868k1830
14081F176345K79639l14783J03293m95315K44787o5675j84953n1215L72133o01656
14071E462600J23841k79350P1831k39913o8461m5754L36321m43605O00774m00408
14061E117876j46082j23048k30427L41920l76499J84370q5859l13514J64670J79887
14051D713294k77245Q7028l34470K39079j64455J65150r4671O4414l5082Q6772
14041D449814n57144J65208l90238L20896q7066j5824N9517k11079J11619l52889
14031C492814L30796j0790m1215k07094m56600M24825j24343j2951R8802p6310
14021C417934l6348K4934l97240J27886Q0911J81023J28430j10182k05152j70351
$$ plain form
14091 6947581 6903996 6787721 6872606 6792703 6684068 6443540 6677722 6417043 6198175 6176345
14081 6176345 6455984 6141201 6244494 5749179 5993966 5928291 5743338 5692123 6064256 5462600
14071 5462600 5586441 5307091 5378922 5139009 5070548 5024794 5361115 4917510 5518284 5117876
14061 5117876 4971794 4848746 4618319 4960239 4583740 4768110 4682251 4368737 4533407 4713294
14051 4713294 4436049 4523077 4188607 4427686 4263231 4428381 4333710 4398124 4363042 4449814
14041 4449814 3892670 4057878 3667640 3988536 3901470 3885646 3945163 3734084 3845703 3492814
14031 3492814 3823610 3812820 3771605 3564511 3107911 3532736 3408393 3395442 3494244 3417934
14021 3417934 3381586 3406520 3009280 3137166 3218077 3399100 3527530 3417348 3212196 3041845
14011C041845k12518K36507n5730K40062k48804q2426K17859j57563j2866k20671
14001B745695P7219j64837K19339J53663m68316M01428m46501P0066J68519l60284
13991B395991M16907j90890l9525k30488K75119o352k09192n0828m07862O65300
13981B618180k14322K73433J50890M2937L98465N76157O16284K327471L455591
13972A0245086O100470J1388523O466837j1502935q027863m405027k568973j422652
13964F273466r88983m62180k21104n02834m29196l4791j75711k66383L6128l8177
13954C190235k92019p4565K31326o44072J21704k65710N28483k33504j09085J890
13944B454683j47977J93522k98732r4445P3712J07358r5967j04304L15209o38564
$$ plain form
14011 3041845 2829327 3065834 3010104 3250166 3001362 2918936 3136795 2979232 2966366 2745695
14001 2745695 2822914 2658077 2877416 3031079 2562763 2964191 2517690 2587756 2756275 2395991
13991 2395991 2812898 2622008 2582483 2351995 2627114 2620762 2411570 2360742 1952880 2618180
13981 2618180 2403858 2677291 2828181 2871118 3269583 3845740 4462024 6789495 10245086
13972 10245086 16345556 27734079 34200916 22697981 14670118 10265091 7696118 6273466
13964 6273466 5284483 4822303 4601199 4098365 3669169 3634378 3458667 3192284 3228412 3190235
13954 3190235 2898216 2823651 3054977 2410905 2532609 2266899 2795382 2561878 2452793 2454683
13944 2454683 2306706 2500228 2201496 2107051 2180763 2288121 2192154 2087850 2403059 1764495
13934A764495L75340R6974j99535P5395n0592j52261j55919K16565j76634j28043
13924A665785k065P462J47725J29320r7992n6892J74938l03429j305n9703K13746
13913A817590j66726Q3008K74067k6664k68068k11928L56944k1469l21306K39304
13903A754752l57160P2386N46585n06416N1831K6387j67414L26286l63817M41760
13893A825180l10021k12873K94375j44421P221N6599j38094q6624K16495k63988
13883A243849N37335J49914n68811k390Q7017J10442l56639M54127r7754j23975
13873A433115J88786l67942P6894j00525J75292M8874j59846m205R76Q4715k07738
13862A168396J53112m64147M50296p8414O3079m76162L16272L5751q6528J15718
$$ plain form
13934 1764495 2139835 2236809 2037274 2112669 2062077 1909816 1753897 1970462 1793828 1665785
13924 1665785 1663720 1671182 1818907 1948227 1850235 1793343 1968281 1664852 1663547 1603844 1817590
13913 1817590 1650864 1733872 2007939 1981275 1713207 1501279 1858223 1836754 1515448 1754752
13903 1754752 1397592 1469978 2016563 1510147 1561978 1588365 1420951 1747237 1383420 1825180
13893 1825180 1515159 1302286 1596661 1452240 1459461 1516060 1377966 1291342 1507837 1243849
13883 1243849 1781184 1931098 1362287 1359897 1446914 1557356 1200717 1654844 1557090 1433115
13873 1433115 1621901 1253959 1330853 1230328 1405620 1454494 1294648 1290443 1291419 1376134 1168396
13862 1168396 1321508 857361 1307657 1229243 1292322 816160 1132432 1168183 1081655 1197373
13852A197373Q5774J29039m72236L56715o7183j65613m3676k71876N69526o4505
13842A253338k86004L6041M1371j89977L01121K00420k28085J00055K7234j44697
13832A110817K15448m06802J39305o7875p0668L05281K5861l00486j0801j60023
13822G80057K79909K3174k32479o0034j72K25689J36135q4372j41087j8058J5955
13811I24717J42194K089j33731K046k57272J19762j74083J65826Q5509j19345
13801G57712O6317k55517M93563k72003Q3193L04778j04552k11397M9375j90110
13791G21359P7919O6334l37343K62990m3038k559K96854m09708K17503q4196J38818
13780I04933J5641m8074j65863J2124K51005p7826P069K31417k16407M5561J35341
$$ plain form
13852 1197373 1283147 1412186 939950 1296665 1229482 1063869 1020193 748317 1317843 1253338
13842 1253338 967334 1003375 1044746 854769 1155890 1356310 1128225 1228280 1255514 1110817
13832 1110817 1326265 919463 1058768 990893 920225 1225506 1251367 950881 940080 780057
13822 780057 1059966 1083140 850661 790627 790455 1016144 1152279 1067907 926820 908762 924717
13811 924717 1066911 1069000 935269 937315 680043 799805 625722 791548 877057 757712
13801 757712 824029 568512 1062075 790072 873265 1178043 1073491 862094 911469 721359
13791 721359 799278 865612 528269 791259 748221 745662 1042516 632808 850311 766115 904933
13780 904933 920574 872500 706637 718761 969766 891940 899009 1130426 914019 959580 1094921
13769A094921j84376M7746k30998r2134J55761q8951Q4895J99814k09040j06381
13759F71257L37456l33382N7220j85068N23271n5435r5574k96481J3958j20866
13749E16356J78302o6324j75074J23322K97597m07243M61123l27576L954K39580
13739H44017l96499K91286l63871L66919J79988Q7067D53956K23270j71660L49039
13729H54605m2007K18346m35928j68512M82953m51611L02011k4363j49929K10901
13719G96466k07919J96587K86991M5993D81769J64089j28858j99364L49529B54651
13708E91343B79598J91954p610K55302J09799l6356B87545M34105C35302M63631
13698G98933l13819J47581k3569o057N5592j36023K00526j44744n7405j23740
$$ plain form
13769 1094921 910545 958291 727293 635159 790920 701969 786864 986678 777638 671257
13759 671257 1008713 675331 732551 547483 1070754 1015319 919745 623264 637222 516356
13749 516356 694658 628334 453260 576582 874179 466936 928059 600483 604437 844017
13739 844017 447518 738804 374933 741852 921840 1008907 453956 677226 505566 854605
13729 854605 812598 1030944 595016 426504 909457 457846 759857 735494 585565 796466
13719 796466 588547 785134 1072125 1118118 481769 645858 517000 317636 667165 254651
13708 591343 279598 471552 463942 719244 829043 792687 287545 721650 335302 798933
13698 798933 485114 632695 609126 603069 658661 522638 723164 578420 521015 397275
13688C97275J9213q3408L45232C30656n3016L41219m8344J14557l39821J84578
13678E29829J5303j29256O1617K77608j67390j98218L7884J928N0752J57084O5881
13667G03022l36520L07040j569j45721J84233k02800K30337B98863M37983l26821
13657D10025H8718N40288o1776Q2315j1189B68028P3726J56474A78999M26193
13647F05192r1733A50017M41813J56076k92286L27862C14179L2535J89702J35296
13637F71712j12063j6176J14717l11857L16837l3042p6238K8024m4929J97600
13627G34585R0397l27768j50374J45113P790k0347L00697A05406M56088j52874
13617D08620J23593j7100m2853K897J0616M489J79380A79629N1810M91747k17485
$$ plain form
13688 397275 416488 333080 678312 330656 277640 618859 570515 685072 345251 529829
13678 529829 545132 415876 477493 755101 587711 389493 427377 429305 480057 637141 703022
13667 703022 366502 673542 671973 526252 710485 507685 738022 298863 736846 410025
13657 410025 88718 629006 567230 649545 638356 268028 341754 498228 178999 605192
13647 605192 513459 150017 591830 747906 455620 783482 314179 346714 536416 671712
13637 671712 559649 543473 658190 346333 663170 630128 553890 581914 536985 734585
13627 734585 824982 497214 346840 491953 499743 479396 780093 105406 561494 408620
13617 408620 532213 515113 472260 475157 485773 490262 669642 179629 231439 723186 505701
13606E05701k26412J45465N1978M4026B55441q9738E5175P38701A08767M00824
13596E09591Q0015B67565M5105j8615L7978M35911C18660m1434A19381K37264
13586C56645M3138J58401B26306M41788A06032N40129C11169L03116j40740j96688
13576B76857A33955J39199J83769j22939j42354K32529j88481K88773J8001k62459
13566B79993L03923K8906j23087j29240j46543K32103j67898P6283K73730A35600
13555I1650J06870J66653j76100K58513B15386J81720A45323J41337L0116b01119
13544B69191G9080L47093B03038J11429L6808A7971K44239K10294j62096L51858
13534F62266j74466j93839J02274j41649K19734k00918F4539K4048L9087J74136
$$ plain form
13606 505701 279289 424754 476732 520758 255441 165703 55175 793876 108767 509591
13596 509591 589606 267565 312670 294055 332033 767944 318660 277226 119381 356645
13586 356645 399783 558184 226306 668094 106032 646161 311169 614285 473545 276857
13576 276857 133955 273154 456923 333984 191630 424159 235678 524451 542452 279993
13566 279993 583916 612822 489735 360495 213952 446055 278157 354440 628170 135600
13555 91650 198520 365173 189073 447586 215386 397106 145323 286660 316776 -201119
13544 269191 79080 426173 203038 314467 351275 17971 262210 472504 310408 662266
13534 662266 487800 293961 396235 254586 474320 273402 64539 88587 127674 301810
13524C01810k1423l9085J7382J98041J28881j19354R7795C4168K87689Q2977A31546
13512B1569L54003L0210j42202P1626A56095Q4144n9002J69191h7109B30547L35979
13501E66526B24622r6077M8364J23269P3310J66488B05444H2750L26495j25871
13491B83374Q3090r8529K3605k5428L8687a966C91678j53843o7486J64928j2451
13480C22826j668L24538B23277N4325j26648J09420J85185j50018e8903A78214
13469D27947K3995j00675A59501J81752j41723O0431J24556h2965B36212J85399
13459D21611A11062J89215J27614O9421a21023A9561L10495G3543L76301k06059
13449B43785K2358N0131K82343I9669L77531A54451J75700J26700j68129H8097
$$ plain form
13524 301810 280387 241302 258684 456725 585606 466252 564047 34168 321857 404834 131546
13512 21569 375572 405782 263580 335206 156095 240239 181237 350428 -87109 230547 566526
13501 566526 224622 128545 176909 300178 373488 539976 205444 82750 409245 283374
13491 283374 366464 267935 291540 266112 304799 -1966 391678 237835 170349 335277 322826
13480 322826 321158 645696 223277 277602 150954 260374 445559 295541 -58903 178214
13469 427947 451942 351267 159501 341253 199530 259961 384517 -82965 236212 421611
13459 421611 111062 300277 427891 497312 -121023 19561 330056 73543 449844 243785
13449 243785 266143 316274 598617 99669 477200 154451 330151 456851 288722 88097
13438A38833n5513f6231D11350j42450K22376B39983q7376K8454O3116q0008L78422
13427E42591H5992K83678A7579J83978J8297H132M81483H6152J98096m6107O2781
13416C00922R7875j89125r0651K93750q9686Q2851l0855j57453o2792Q331l673
13405A59494J38513O5140j19126L02149E7546B7774M26054k3010A85922j8480
13395A67442O9889a34178A75750K05940I2253N75653C6821J90504L717q3201L77259
13384E25100o1957j68896a29738A90539j8993o8372K55541g0150E45527B16779
13373A03948J46133l333M8863K440J16811j71009J30716A01791L3768C1021L43400
13362C74421A00415Q9250a42772B95847N5238A64672J07035N7037I8625K24002
$$ plain form
13438 138833 83320 -66231 411350 268900 491276 239983 152607 181061 244177 164169 542591
13427 542591 85992 369670 17579 201557 219854 8132 489615 86152 284248 238141 300922
13416 300922 398797 209672 119021 412771 323085 405936 375081 217628 154836 163167 159494
13405 159494 298007 363147 244021 546170 57546 27774 453828 430818 185922 167442
13395 167442 237331 -134178 175750 381690 92253 667906 36821 227325 231042 147841 525100
13384 525100 463143 294247 -129738 190539 171546 103174 358715 -70150 545527 216779
13373 103948 250081 246748 295611 298051 414862 243853 374569 101791 135559 31021 374421
13362 374421 100415 189665 -142772 295847 351085 164672 271707 328744 98625 322627
13352C22627O2724j06681M4434A47633J09279J08752b623G8196K3970J41792N5830
13341B99788L1188j24723h1430A31182o837J66688F9091K1392L11971j56569R0252
13330C36137j18424J73095j06191M42478B57069G0191L94255A30828m8257L85960
13320D68531l2211D8977K57628J97520D7684L28768o1194j29682p5983K12904
13310C22497d4971A38665j6907K35759J96396A55057J89774C5615K74765j34519
13300A75861J39312l3595A31236J26766Q5010J1953j30651J74060h3676B68122
13289C18126N0006j23024j5416j06674J44414E722J53618b4442A7444J90039J13537
13278C21020C8836J96298j01842n6991L6308a09305B06703q6035L301N0433L7660
$$ plain form
13352 322627 385351 278670 323104 147633 256912 365664 -2623 78196 102166 243958 299788
13341 299788 330976 206253 -81430 131182 124345 291033 69091 90483 402454 245885 336137
13330 336137 217713 390808 284617 727095 257069 70191 464446 130828 82571 468531
13320 468531 436320 48977 306605 504125 47684 376452 315258 185576 109593 322497
13310 322497 -44971 138665 121758 357517 553913 155057 344831 35615 310380 175861
13300 175861 315173 281578 131236 258002 343012 354965 224314 398374 -83676 268122
13289 318126 368132 245108 229692 123018 267432 5722 159340 -24442 17444 207483 321020
13278 321020 38836 235134 133292 76301 112609 -109305 206703 120668 123969 174402 212062
13267B12062J69249A58591a34807J0767k763B97896A08658J01970p4888j4129
13257A21611a4254F0196P2473K52595d24359B97619R1800A46667a56529B29750
13246B72373A15856J8424o6064J91841d9049a0193B8220K12662m5529b19724C68315
13234A10670J1339j0131J540Q1155K81610j28861o7269n9422F1630P2061J54377
13223B88068J01607n4762j44837J05987N4856J1499C8829K61399i0990B3703d2862
13211A11535m7925N9020Q9169A5979K12649D2663K46727j21748n4893B6483R2378
13200A18861a74218L8044d6737A74085B2585J51818K76996b10271C3985J60740
13190A94725L9066q4145A6451P14404A54095K63244g989F7918a3510G6474j007
$$ plain form
13267 212062 381311 158591 -134807 -124040 -126803 297896 108658 210628 135740 121611
13257 121611 -14254 60196 132669 385264 -424359 297619 389419 146667 -156529 229750
13246 272373 115856 134280 68216 260057 -49049 -10193 28220 240882 195353 -219724 368315
13234 110670 122009 111878 113418 194573 476183 347322 280053 220631 61630 133691 288068
13223 288068 389675 334913 190076 296063 350919 362418 38829 300228 -90990 23703 -42862
13211 111535 63610 122630 211799 15979 228628 42663 289390 167642 112749 26483 118861
13200 118861 -174218 -136174 -46737 174085 22585 174403 451399 -210271 33985 194725
13190 194725 233791 149646 16451 730855 154095 417339 -7989 67918 -13510 76474 75467
13179G5467N1488c5000F3062J37842C6605j7091A604K59961c0539B42450g521
13167G7214J94320Q1737E9622K80896j00039n5946J7654H0836L30819e9691m4266
13156a03957B57436C8924b28197L6265O3077N1226m2789a7171k48919F0686L1215
13145I1901a76557h841l5457A33896P1545n9989a51682E6216N2438M0483B5550
13133A1064J97072F5426J00888c9645F6765k5235O6480J83221A06233K1470b44128
13121b73835D07646j51079J16861g3241o3881C21556A11252O2058p5395m3282
13111E4633K13462d2457E3543L6390j1849J1149D2317C629K36802a53766A45306
13099c398j68657K9753A84388n807b2755A89974e9653B11349l8992a08591a4635
$$ plain form
13179 75467 126955 -35000 63062 200904 36605 19514 1604 261565 -30539 242450 -7521
13167 77214 271534 353271 59622 340518 240479 184533 202187 80836 411655 -59691 -103957
13156 -103957 257436 38924 -228197 -191932 -128855 -77629 -120418 -17171 -266090 60686 91901
13145 91901 -176557 -8841 -44298 133896 205441 145452 -151682 56216 108654 149137 25550
13133 11064 208136 65426 166314 -39645 66765 41530 108010 291231 106233 127703 -244128
13121 -273835 407646 256567 373428 -73241 -137122 321556 111252 173310 97915 54633
13111 54633 268095 -42457 53543 89933 78084 89233 42317 3629 240431 -153766 145306
13099 -3398 -172055 -142302 184388 178581 -22755 189974 -59653 211349 172357 -108591 -14635
13087E2046Q385b05365B75517a9436A9099K33225H4521g2306B06895g3590D07156
13075C53377A65735b60321e1294p256F4242a95726C06344K2705j35318b67H6749
13063C73278D6821P911j4710e6521j00561B58242Q1509A06256K23143I1297M8304
13052A39601M1462l6166h0836A94934K1310a09606A18830M2289J44291E0944K68204
13041C19148p8826l1879D8100o709K16670K4775j7617D6124J55040b20526B91858
13029a9742r2198A83695l7351L71351C7037J36633J46400c3379j9599E41087j98209
13018C42878o3093G4560d6346G2909M1517K9264b75730B45439q8396m2463N9005
13007A73585R7253j02362K36125b01521E3376b07582A19679N992a83671b8832
$$ plain form
13087 52046 60431 -205365 275517 -19436 19099 252324 84521 -72306 206895 -73590 407156
13075 353377 165735 -260321 -51294 -58550 64242 -195726 306344 329049 193731 -267 86749
13063 373278 46821 54732 40022 -56521 -157082 258242 339751 106256 329399 91297 139601
13052 139601 181063 144897 -80836 194934 216244 -109606 118830 161119 305410 50944 319148
13041 319148 240322 208443 48100 41391 258061 282836 265219 46124 201164 -220526 291858
13029 -19742 -111940 183695 146344 517695 37037 173670 320070 -33379 -52978 541087 342878
13018 342878 279785 74560 -46346 72909 114426 143690 -275730 245439 157043 114580 173585
13007 173585 270838 168476 404601 -201521 53376 -207582 119679 125671 -183671 -28832
12996c9219C47770F2238J64136d7926j46652c5587m1353k4957D3008f5841k5108
12985i0949m4064D0293a95528B29592j6435G4754J58375B1384J14016l2433j9171
12974H3796J84144B6958J38157h912B23195P032m6011J06709m0323a63930A23924
12962a08115A01456C7068a63251B2673J78195h026j54868P7954b4540A11919J69172
12951B81091a00650G8583L7886J72764h0307a346C12324d3620A0179J84215a70142
12939C5529R6682a45381C73125A17024e645A65599a49811A3091L12007A43599
12928a6780k2695D6168J15955A0846J08410a51043A61720J5677k2658K8517a70358
12916H3714a42676E28475A16623b50180A22456n9454e6434J5606H8422h2418E1591
$$ plain form
12996 -39219 347770 62238 226374 -47926 -194578 -35587 -76940 -101897 43008 -65841 -90949
12985 -90949 -135013 40293 -195528 229592 213157 74754 233129 21384 135400 102967 83796
12974 83796 267940 26958 165115 -8912 223195 230227 184216 290925 250602 -163930 123924
12962 -108115 101456 37068 -163251 22673 200868 -8026 -162894 -84940 -24540 111919 281091
12951 281091 -100650 78583 116469 289233 -80307 -1346 312324 -43620 10179 194394 -170142
12939 35529 132211 -145381 373125 117024 -5645 165599 -149811 13091 325098 143599
12928 -16780 -39475 46168 162123 10846 119256 -151043 161720 177397 154739 183256 -170358
12916 83714 -142676 528475 116623 -250180 122456 63002 -56434 -40828 88422 -82418 51591
12904a4433A51655e3396k0080B85005j30463M2830p0017m9358J4952f866k39751
12893b46617a21901A43938J2625c3793J3094E4618m87J17868J16130o5562r3710
12882A28857a07875B91662A27504f682r566A19204J2805K13511b50006f5433B39529
12870B95614j09898G3794L19696B0883R1351k0532N6615J21874b53798A53640
12859F2676R750B3885a95090H8201b69019B79998R7896d265G0231a11820A51964
12847B06572b62429h7824c9919B48021c83508C153c47038a36329C93753a5439
12836B20487o1259J44100k9908a66592A12202B887K41770j08426a50177C4550
12825B19932b21672e1608B16813b6743A25783o1756b9933j49161A80304J00778
$$ plain form
12904 -14433 151655 -53396 -73476 285005 154542 197372 127355 77997 92949 -6866 -246617
12893 -246617 -121901 143938 156563 -33793 -20699 54618 54131 171999 288129 222567 128857
12882 128857 -107875 291662 127504 -6682 -16248 119204 132009 345520 -250006 -65433 239529
12870 295614 185716 73794 393490 20883 112234 91702 148317 270191 -253798 153640
12859 62676 72426 23885 -195090 88201 -269019 279998 377894 -4265 70231 -111820 151964
12847 206572 -262429 -87824 -39919 248021 -383508 3153 -347038 -136329 393753 -15439
12836 220487 159228 303328 273420 -166592 112202 2887 244657 136231 -150177 34550
12825 219932 -221672 -51608 216813 -26743 125783 64027 -29933 -179094 180304 281082
12815B81082i2122n2586C5840d2594j9281A24902a81153B06139G0445g3932K2781
12804e1151j10597g4509A30440a82883I237g4362A8315h7035B85960j30613A9412
12792a22307D44252a09836a2370B2432J29230a21166F5930j387K89764j69348
12782A84959G342h6445l5614N8970R60b8377B2814b10061A61047a57639B97792
12770a326j68706A70851a34926K7089e1801o7534b9468E0823J53766K8341K57378
12759D90308E8032a29209A20105a74270A38410R9143q9475n0677J34410F062J19873
12748A25935b11208c6529C3691A6469O4276A5426g82l49332E6405b17598H032
12736C2977J20630f7576k16536A21432P6003D1300a51678j80629A180a557A8227
$$ plain form
12815 281082 -92122 -144708 35840 -42594 -61875 124902 -181153 206139 70445 -73932 -51151
12804 -51151 -161748 -74509 130440 -182883 9237 -74362 18315 -87035 285960 155347 19412
12792 -122307 444252 -109836 -12370 22432 151662 -121166 65930 64543 354307 184959
12782 184959 7342 -86445 -122059 -63089 -62129 -28377 22814 -210061 161047 -157639 297792
12770 -1326 -170032 170851 -134926 -107837 -51801 -119335 -29468 50823 204589 232930 490308
12759 490308 58032 -129209 120105 -174270 138410 237553 148078 97401 231811 6062 125935
12748 125935 -211208 -36529 33691 16469 80745 15426 -782 -350114 56405 -217598 8032
12736 32977 153607 -67576 -284112 121432 197435 41300 -151678 -332307 1180 -1557 18227
12724B39123q9044a72046E6205Q4985n6776L61119h1019j2808M2956D1370P0926
12713A12296F152K3257J03609f1770j49060g5609p2868B42502A9589J17271b6063
12701B17949d8140a3974A54562F2797J06838B3763M1460L39117Q610q258A29682
12689A60259Q62d1012C12712a1651j13463D9558a77570f3911E3011K65287G6446
12677d3797j94329c2373A77832H7410R1337a12135B13542G749J01554O1013e5299
12665c886I4655L33217E704L18201r5996a66545B82904o8138a47097j613G2479
12653b86257D26707A95544K0827D980b45077A71219J30987M1251o1217D3556J16996
12642A60552a20152B27688o3550N7058N7754A6326K53970a22872b0501B09811
$$ plain form
12724 239123 150079 -172046 56205 141190 84414 445533 -81019 -93827 -50871 41370 112296
12713 112296 6152 29409 133018 -61770 -210830 -75609 -148477 242502 19589 136860 -26063
12701 217949 -48140 -13974 154562 62797 169635 23763 65223 404340 412950 404692 129682
12689 160259 161121 -41012 312712 -11651 -125114 49558 -177570 -63911 53011 318298 76446
12677 -43797 -238126 -32373 177832 87410 178747 -112135 213542 7749 109303 170316 -55299
12665 -3886 94655 427872 5704 323905 227909 -166545 282904 214766 -147097 -148710 72479
12653 -286257 426707 195544 216371 4980 -245077 171219 302206 343457 282240 43556 160552
12642 160552 -120152 227688 164138 221196 278950 16326 270296 -122872 -20501 209811
12631b75174d6540p8925b7731j48430A47089Q7176J73776e7154k36521A87265
12620G1074J84844J55156j82461r2626h3072A99782n5712K21740j05758q4726
12610A75326n3600J6402b34335A84608J47595a39732C57906a0963A8232P1902
12600I0134j6821K59007C1353O1959L0445a2248A46661C9375L922J91973k8775
12589B06495M1863j6931b6857D06990j33809G638c03674D78803F4005K31641c03590
12577C64072a50290C66800h7905C28259b60331n8538A44089J02520j02337c60535
12566b75728C8276K11802b7254C27643a48090F3775b53462C38202j58442h720
12555E7852b3156j6908k2318a903I9981a84242D56859h4787B07182m9113F9261
$$ plain form
12631 -275174 -46540 -125465 -27731 -176161 147089 234265 408041 -57154 -293675 187265
12620 71074 255918 411074 228613 135987 -83072 199782 144070 365810 260052 175326
12610 175326 121726 138128 -234335 184608 332203 -139732 357906 -10963 18232 90134
12600 90134 73313 332320 31353 93312 123757 -12248 146661 39375 43297 235270 206495
12589 206495 248358 231427 -26857 406990 273181 7638 -303674 478803 64005 295646 -303590
12577 364072 -150290 366800 -87905 328259 -260331 -318869 144089 246609 144272 -360535
12566 -275728 38276 250078 -27254 327643 -148090 63775 -253462 338202 179760 -8720
12555 57852 -23156 -40064 -62382 -1903 99981 -184242 456859 -84787 207182 158069 69261
12543B20812h5157C5218R5828K27851m0526j30163i9432q0913P2292B10063F1134
12531a01485F324J59104M3323q8363n7975i5748j137A71967a37514B33439a52087
12519a34232B12939Q2608b40929a08611j27712A72075J7848b91327A79107A5057
12508A65731R220i5622F7746i2421H8115P8566b6694j89801F3089e5033A15378
12496a63826A57896M4846b86487B09150H4447M78725f9567j70510C4070c09851
12485i4058A046K74186c23428A86134H0600a13735A46270a00965A55564k5465
12475A30099q971c068j99034A23819c4997A04938d18779A3258b0482F9332b65366
12463d1460m5483A39219B1897g6499A23344d254A05854B9726Q5926K7960P8424
$$ plain form
12543 220812 -85157 35218 131046 358897 318371 188208 -99432 -180345 -108053 210063 61134
12531 -101485 6324 165428 208751 120388 62413 -95748 -96885 171967 -137514 233439 -152087
12519 -134232 212939 295547 -240929 -108611 -236323 172075 189923 -291327 179107 15057
12508 165731 174951 -95622 67746 -92421 88115 166681 -26694 -216495 63089 -55033 115378
12496 -163826 157896 202742 -286487 209150 84447 563172 -69567 -240077 34070 -309851
12485 -94058 1046 275232 -323428 186134 80600 -113735 146270 -100965 155564 130099
12475 130099 121128 -3068 -202102 123819 -34997 104938 -418779 13258 -20482 69332 -265366
12463 -41460 -86943 139219 21897 -76499 123344 -4254 105854 29726 115652 143612 222036
12452B22036A2208b41807M8897j43348h1479D1003a52825B15716a48802F8622
12441B32254a85714J3424j41854A06449d9638A63118k5627K8702J12919F7931
12430D5289d1516D60780G6478C095c1582C50400j00742G0008b99308R9478m8309
12419b48139G2229R188f9894A2103b23816P8358A27377c9905A8556J61946G1326
12407b83997e759A51b31824C1309J08895b9322G0341A1374f3230E143a11380G1702
12394a55371F6863b4517p3155D81318h1354k11118a31929D62444H2094J19945
12384B02039a2076A39694d35432D3334K4808a90789I772J69050c80537a00056
12373B70895a26326F7924R5608n7543h7331q8180M4206A57495a99365A99158H1484
$$ plain form
12452 222036 12208 -241807 -192910 -336258 -81479 41003 -152825 215716 -148802 68622
12441 232254 -185714 -172290 -314144 106449 -49638 163118 137491 166193 279112 67931
12430 45289 -41516 460780 76478 3095 -31582 350400 249658 70008 -299308 -199830 -248139
12419 -248139 72229 81417 -69894 12103 -223816 -145458 127377 -39905 18556 180502 71326
12407 -283997 -5759 151 -231824 31309 140204 -29322 70341 11374 -63230 5143 -111380 71702
12394 -155371 66863 -24517 -97672 481318 -81354 -292472 -131929 462444 82094 202039
12384 202039 -12076 139694 -435432 43334 68142 -190789 9772 178822 -380537 -100056
12373 270895 -126326 67924 163532 105989 -87331 -175511 -131305 157495 -199365 199158 81484
12361b9154A69830l4962a60749f8366j73147B87158e2775B17099K3926C6959a04884
12349B36543k5158C4159A6563R4203d44101f6245p7666l3426A55032F437e1310
12337A35122A3527h9383r4064M4245A11511K31550A362e3226C1774c21222R0211
12326b31011H7773J55842A08788c4510l24637a36488A15494A496N5719A5617a1916
12314b33652B10584k2981a09989M6000B87295E2975J48577H6697a5730m275j41743
12303a61748A529J84256E9797c01835A6547a17907I0325j3983h4686n2637B41494
12291c48419L2047B54217a02549A92693e1587i522c727C1887j3619K48711g6461
12279A83728a388C24590c71540a716E1404i0706B1115Q4361n137B374J60602E7599
$$ plain form
12361 -29154 169830 134868 -160749 -68366 -241513 287158 -52775 217099 241025 36959 -104884
12349 236543 211385 34159 16563 110766 -444101 -66245 -143911 -177337 155032 6437 -51310
12337 135122 13527 -89383 -183447 -139202 111511 343061 1362 -53226 31774 -321222 -231011
12326 -231011 87773 243615 108788 -34510 -359147 -136488 115494 1496 57215 15617 -11916
12314 -233652 210584 187603 -109989 -63989 287295 52975 201552 86697 -15730 -20005 -161748
12303 -161748 1529 185785 59797 -301835 16547 -117907 90325 76342 -84686 -137323 241494
12291 -348419 -316372 254217 -102549 192693 -51587 -9522 -3727 31887 18268 266979 -76461
12279 183728 -1388 324590 -371540 -1716 51404 -90706 21115 105476 100339 2374 162976 57599
12266B44616i5927B40619a24584D2175J45585c8724C84417E8191R9561L5275m1591
12255A51436J39244A15862h2657A46161a14794a5205j2649B94972a21856A30389
12244g125A34453k9817J47607a46794f6920j60442A1477g289B43589C9088K58323
12233B97411f4313A68530F514c29962A32450m9620c60900A60579N0075e5794D9774
12221a81785B67368p5322J19851l8326A8865K78039D7357P6246Q1706d8577B27991
12209B12169P8271J33129N0193N8718I8014P069J50651b4088A52391b0418E43366
12197C09200a3842I9008k0227L37926j13598q9272K3634H4006L45437A04891J19627
12186B24518P74O1313H1969K30889j12234k6234K45484a07459F8144L02717j65199
$$ plain form
12266 244616 -95927 240619 -124584 42175 187760 -38724 384417 58191 157752 193027 151436
12255 151436 290680 115862 -82657 146161 -114794 -15205 -27854 294972 -121856 130389
12244 -7125 134453 104636 252243 -146794 -66920 -227362 11477 -7289 243589 39088 297411
12233 297411 -64313 168530 6514 -329962 132450 82830 -360900 160579 210654 -55794 49774
12221 -181785 267368 192046 311897 273571 18865 296904 47357 123603 205309 -48577 227991
12209 212169 290440 423569 473762 532480 98014 105083 255734 -24088 152391 -20418 543366
12197 309200 -13842 99008 78781 416707 303109 213837 237471 84006 429443 104891 224518
12186 224518 225292 286605 81969 312858 200624 174390 419874 -107459 68144 370861 205662
12175B05662j8867K4262o9571E6950J16330a20031C61048j10623o6578a28226
12164B31259a48112C07823b6924A555J15430J86064o3708f8460B06832k8323J79158
12153C57667J38007e2359C54123A53198b10367A26041a63548B15333O6896e6605
12142C9288Q389J91565e9516F5439M4508a40282O5789D0954d3587j67394A11611
12130g1623j05722A59637M7063l6224i4132r9582A93857r598H8835j4725b82171
12118F2705r706b44013I4703D2409i2773A07165l3267J85941c5156C34192n7035
12107B77157b18284A28295b12551J05127B67551a79109E5010e4671C42465q7694
12097B54771a3811D1465L21730f0699I1912a08103B42677j03787a12571K2185
$$ plain form
12175 205662 186795 211057 141486 56950 173280 -120031 361048 250425 183847 -128226
12164 231259 -148112 307823 -26924 1555 116985 303049 239341 -68460 206832 178509 357667
12153 357667 495674 -52359 354123 153198 -210367 126041 -163548 215333 282229 -56605
12142 39288 47677 239242 -59516 65439 109947 -140282 -74493 40954 -43587 -210981 111611
12130 -71623 -177345 159637 206700 170476 -94132 -193714 193857 184259 88835 74110 -282171
12118 62705 52999 -244013 94703 42409 -92773 107165 73898 259839 -35156 334192 277157
12107 277157 -218284 128295 -212551 -107424 267551 -179109 55010 -54671 342465 254771
12097 254771 -13811 41465 363195 -60699 91912 -108103 242677 138890 -112571 -90386
12087i0386k8000B9654K33670k7341a59838m3466D6229M1879b15983e6756l8198
12076i4954B2353M2099B0043a3411A02051l4130J72361g0548B07047h7765j52635
12065b40400A42588M7558K98231j600J55015j60018P69317n44202l08594j47661
12055B50634C6208a34841B13466B581M256a68081A38952M4527m3423D1978K5593
12044F7571c15636B21950f9653j90784d5362C54822A28950C5611R2469J33543
12034B61623A05102B2198L9393d8302a2388E7568j2506b78063d7716o9416J8337
12023i8795F2688c5717F8711d9844I8730f0052B62688c2034J0027A64879a83930
12011B32372e9799E8448m24a22749A97303F0692J27139M0326A11452b05812e1703
$$ plain form
12087 -90386 -118386 29654 263324 235983 -159838 -203304 46229 88108 -215983 -56756 -94954
12076 -94954 22353 64452 20043 -13411 102051 67921 240282 -70548 207047 -87765 -240400
12065 -240400 142588 190146 488377 486777 641792 481774 1251091 706889 398295 250634
12055 250634 36208 -134841 213466 2581 6837 -168081 138952 183479 140056 41978 67571
12044 67571 -315636 221950 -69653 -260437 -45362 354822 128950 35611 128080 261623
12034 261623 105102 22198 61591 -48302 -12388 57568 45062 -278063 -47716 -117132 -98795
12023 -98795 62688 -35717 68711 -49844 98730 -60052 262688 -32034 -22007 164879 -183930
12011 232372 -59799 58448 58024 -122749 197303 60692 187831 228157 111452 -205812 -51703
11999B9027b12274E8238c10321A05450p771a41765C7427f9377b7893A6416b3601
11987h1434k52166I8573L7434a12179o6171B65752D9658A5523b59230b2083j72345
11976a94428j03423A48425a5990k08653J08718a5569k790A2402J84999a38820
11965I1488k1128M5852a98157o862P4919d6218n8934o7357A0185b91973A6893
11953a90554h268l8917i368D8755I481h2091D7336b31993F6294b97700a40277
11941A7503a41661o4525m9782E8354K51991g9083j64443i9811F7266a32750A19049
11929A33424a32230A57191A7640b08965F4614e9506G6712g6289d21j854k67533
11918b69808e4679G9492a96944g3667J3928q3642j84859g2532B14801M6641E4307
$$ plain form
11999 29027 -212274 58238 -310321 105450 97679 -141765 37427 -69377 -27893 16416 -23601
11987 -81434 -333600 98573 136007 -112179 -178350 265752 49658 15523 -259230 -22083 -194428
11976 -194428 -297851 148425 -15990 -224643 -115925 -15569 -18359 12402 197401 -138820
11965 91488 70360 116212 -198157 -205019 -130100 -46218 -105152 -172509 10185 -291973 16893
11953 -190554 -8268 -47185 -9368 48755 9481 -82091 47336 -231993 66294 -297700 -140277
11941 17503 -141661 -206186 -255968 58354 310345 -79083 -243526 -99811 67266 -132750 119049
11929 133424 -132230 157191 17640 -208965 64614 -59506 76712 -76289 -421 -2275 -269808
11918 -269808 -54679 79492 -196944 -73667 -59739 -143381 -328240 -72532 214801 261442 54307
11906a30082q9130r990D1969a27663k46695E8051K40628a53147f1599F3472b2257
11894B45012b1094E4969R862b12707C96989a94285E7848e6511o3563L9489A47119
11882H2191d9327A02975i774j11569J7740E0868a05279G6059g6499j33072A70643
11870f3339A29088h3606j78184D9546k2528q78K2604E347c84809i9633h029A30443
11857A7578a24998D4071L6897J84873a60710C39371H1011l5918Q8728a09723d9679
11845a62525Q0103n2914l69405K08521N5382e8861K5336j10264C66518G082h7280
11833A32508N7906o7135a7316F4053a27726j30705A25592d31308N0184g682j45975
11822a53657c4075f973r0225A67825e759j3016C8503a67185p4495i0559p7298
$$ plain form
11906 -130082 -219212 -229202 41969 -127663 -374358 58051 298679 -153147 -61599 63472 -22257
11894 245012 -21094 54969 64831 -212707 396989 -194285 57848 -56511 -120074 -80585 147119
11882 82191 -49327 102975 -9774 -121343 -103603 50868 -105279 76059 -76499 -209571 170643
11870 -63339 129088 -83606 -261790 49546 27018 26140 48744 5347 -384809 -99633 -8029 130443
11857 17578 -124998 44071 80968 265841 -160710 339371 81011 45093 133821 -109723 -49679
11845 -162525 -82422 -135336 -504741 -296220 -240838 -58861 -33525 -143789 366518 7082 -87280
11833 132508 190414 123279 -17316 64053 -127726 -258431 125592 -431308 -381124 -7682 -153657
11822 -153657 -34075 -6973 -97198 167825 -5759 -18775 38503 -167185 -241680 -90559 -167857
11811a67857M667B4543J01438e9146B61710a944m6740B3416d06007a24071a6514
11799B19426N5003c9543j3566H1093J66098m1875d68355J57469A297J24799J30904
11788B57000F4843a27478b1969C992J05941a69715h45k29202A72375q3927f9143
11776D001J42226a70224A09167d5389A89483J2382E8865a17731B12491b65761
11765A20871n851b10161I0627a99605l1477D6605a4922B86000a38070D18289a12416
11753c95588J16123A61755F4712b62567A82174b89267J38400D0064b20072C63935
11742a7030j82111c2723A04879J33844F9113b65815A25076K15700c8558A89327
11731b59059c1983K469A13718K03981a96799L4018P1530j31945A89316a6843C5353
$$ plain form
11811 -167857 -163190 24543 125981 -59146 261710 -1944 -48684 23416 -406007 -124071 -16514
11799 219426 274429 -39543 -53109 81093 247191 205316 -468355 -310886 1297 126096 257000
11788 257000 64843 -127478 -21969 3992 109933 -169715 -845 -230047 172375 88448 -69143
11776 4001 146227 -170224 109167 -45389 189483 201865 58865 -117731 212491 -265761
11765 120871 115020 -210161 90627 -199605 -231082 46605 -14922 286000 -138070 418289 -112416
11753 -395588 -279465 161755 64712 -262567 182174 -289267 -150867 40064 -220072 363935
11742 -17030 -199141 -32723 104879 238723 69113 -265815 125076 340776 -38558 189327
11731 -259059 -31983 -29514 113718 317699 -196799 -162781 -91251 -223196 189316 -16843 35353
11719C17323A23567k7327a74125e2978A98686r3701J82543G352Q2661P1307p7849
11708H3471L789g6349A43276a37143I6376p405k5069A1704J36529o5958P6274
11697A58549b10176a2679A6059e4222A08884a64149A4318a87747A34787o714J18734
11686B46807A4313J74745P9789j16445a94746c0578C9718a17436E2254j9712d2323
11674B1735J82144a42873j83373g1668F0022j902d7179q9699b2185B61323m0170
11663B21153c1296k0122E8176Q6013a8574B71772B5119b756j91674B35787b1238
11651E5731K5681C7761d3173p4242b6344j9421B85683a51659C1168c0871A63203
11639a1494A30423h6699o4332J5289O0182l4938B99890A19094b50767P9337A25774
$$ plain form
11719 317323 123567 96240 -174125 -52978 198686 104985 287528 7352 90013 161320 83471
11708 83471 87260 -76349 143276 -137143 96376 88971 63902 11704 148233 82275 158549
11697 158549 -210176 -12679 16059 -54222 108884 -164149 14318 -187747 134787 128073 246807
11686 246807 14313 189058 268847 152402 -194746 -30578 39718 -117436 52254 32542 -42323
11674 21735 203879 -142873 -326246 -71668 60022 58120 -47179 -136878 -22185 261323 221153
11663 221153 -31296 -51418 58176 144189 -18574 271772 25119 -2756 -194430 235787 -21238
11651 55731 81412 37761 -43173 -117415 -26344 -45765 285683 -151659 31168 -30871 163203
11639 -11494 130423 -86699 -151031 -135742 -75560 -110498 299890 119094 -250767 -171430 125774
11627d2075A86858g432j10222o5874C04143I9170g7982J3301J3678q0119A34606
11615E0382a87554A15011O3459l3618a69597M2747G6544j2957K108b5868B14178
11603B8799c2544m7256K8489k31182O9292q136B99202c55961E7669K13090k1706
11592B49053L1513Q166j24676B5927c8911o1160c9789A30914f0363E5333P6953
11581A32286a61519N9336j14271k8048a3571A51049h4251k27816j06049A66296
11570a6821k30017C3410J51237J95654c20317d685k05914i5754I6122g7703k865
11559h0568j21377C16255H1724K25676c94223B41881a05647C35491i5792b3968
11548h9381k2732C63357I7337f8935B23335G6893J99702C5853a52824A18730b21756
$$ plain form
11627 -42075 186858 -7432 -117654 -183528 304143 99170 -77982 -64681 -51003 -131122 134606
11615 50382 -187554 115011 178470 144852 -169597 -126850 76544 63587 65695 -25868 214178
11603 28799 -32544 -79800 -51311 -282493 -213201 -221337 299202 -355961 57669 270759 249053
11592 249053 280566 288732 164056 25927 -38911 -100071 -39789 130914 -60363 55333 132286
11581 132286 -161519 -102183 -216454 -244502 -13571 151049 -84251 -312067 -418116 166296
11570 -16821 -246838 33410 184647 380301 -320317 -4685 -210599 -95754 96122 -77703 -80568
11559 -80568 -201945 316255 81724 307400 -394223 241881 -105647 335491 -95792 -23968
11548 -89381 -112113 363357 97337 -68935 223335 76893 276595 35853 -152824 118730 -221756
11536B5163b6221O731B26374E9762J9510R1731J05094D914K82764I3851a8784
11524A68549b17736B05106n0537K60731D0427J96226E8485a21598A76560d3751
11513D4223J29282c1972D33248A84405E3622K561N7473a33452b0759H9579j557
11502H8022a12160G9681J96645a29341I5287J69788q2302a4081B65301n2741d6667
11490A00772J31388m1638b31215D15665B4524i8319A3137R6821B855J44930b22014
11478C00352q5225C1124L94761q5960b27759A20156k0427K53667j43414k4773
11468A85209R0730A19031b7254C21168J9606A1195O3692J36049M3028C1171e7960
11456A78915b2826A64663b9270n25450E1848N4540A0555K7424R1347J44320q2287
$$ plain form
11536 25163 -26221 -19490 226374 59762 79272 171003 276097 4914 287678 93851 -18784
11524 168549 -217736 205106 154569 415300 40427 236653 58485 -121598 176560 -43751
11513 44223 173505 -31972 433248 184405 53622 56183 113656 -133452 -20759 89579 88022
11502 88022 -112160 79681 276326 -129341 95287 265075 182773 -14081 265301 212560 -46667
11490 100772 232160 190522 -231215 415665 24524 -98319 13137 109958 2855 147785 -222014
11478 300352 215127 31124 425885 339925 -227759 120156 99729 353396 209982 185209
11468 185209 275939 119031 -27254 321168 340774 11195 74887 210936 253964 31171 -57960
11456 178915 -22826 164663 -29270 -554720 51848 106388 10555 37979 129326 273646 191359
11445A91359B1677J62595J49303b49254C929K38713L036R2849j66517b8648A30001
11433A41618j4320e6265B36454C9262d0006r2857F7549b61086A13015Q365e7227
11421A04935c5763D81234A13878A9923M9536J03301l3683c5150G1029a51865m3037
11410a94902I6488l6381J53934M7107a83646O5658A56729a01275n188l2870o0578
11399a99911r3727N8042B13911J61p8068i5621C1775d3014I8250f7378J8154E9202
11386B60919O9602h3353C35738D7005Q2174c9914a7340C07528d0183A4994f6048
11374A09123a76266j84479C06340B5247a96898B24236F8038g4867q7776A2831
11363A58599g6095A314c2341B70351K89970k17764a34607a8024A10532K2502M397
$$ plain form
11445 191359 21677 184272 333575 -249254 3929 242642 245678 338527 172010 -28648 130001
11433 141618 127298 -56265 236454 39262 -40006 -132863 67549 -261086 113015 121380 -57227
11421 104935 -35763 481234 113878 19923 69459 172760 139077 -35150 71029 -151865 -194902
11410 -194902 96488 60107 214041 261148 -183646 -117988 156729 -101275 -106463 -139333 -199911
11399 -199911 -293638 -235596 213911 214072 136004 -95621 31775 -43014 98250 -67378 -49224 59202
11386 260919 330521 -83353 335738 47005 129179 -39914 -17340 307528 -40183 14994 -66048
11374 109123 -176266 -360745 306340 25247 -196898 224236 68038 -74867 -162643 12831
11363 158599 -76095 1314 -32341 270351 560321 342557 -134607 -18024 110532 133034 137431
11352A37431M0g4903E9904a19158L2113A1052a43113i852k53116C00737j30646
11341A70091a8403j29852I0512b61242C35618d20461A84529c42817b2640A89726
11330a5262E2182d2493j17508A81982b58721B46417a013A00354a33684J1643a0175
11318i5159a5894A15787f8589E4229b7096q2709A73833Q1755c41171B45753b3682
11306A15681a23446n0492m2448l947c0079A46704b17760B6860b3903B33962q5328
11295A48634b10868e3993L194b0485k17518J13307D9084a6319A44161H387a41796
11283b31451A66747a21121H1274d0274G0956b55314O5068I5465a84014j30843
11273c14857A09900a49161M0475d0748l0579j19513A30252a56418e1670I4222
$$ plain form
11352 137431 137471 -74903 59904 -119158 -87045 11052 -143113 -9852 -262968 300737 170091
11341 170091 -18403 -148255 90512 -261242 335618 -420461 184529 -342817 -22640 189726
11330 -15262 52182 -42493 -160001 181982 -258721 246417 -1013 100354 -133684 -122041 -10175
11318 -95159 -15894 115787 -68589 54229 -27096 -109805 173833 255588 -341171 245753 -23682
11306 115681 -123446 -173938 -216386 -220333 -30079 146704 -217760 26860 -23903 233962 148634
11295 148634 -210868 -53993 -50799 -20485 -238003 -124696 49084 -16319 144161 8387 -141796
11283 -231451 166747 -121121 81274 -40274 70956 -255314 -190246 95465 -184014 -314857
11273 -314857 109900 -149161 -108686 -40748 -71327 -190840 130252 -156418 -51670 94222
11262h0734b8855k3655m2232E6226B2563a36265M7601c3951A57001C0950a66125
11250a75372p1383h8533A48787a49171r3556n0219J31991C4230K3047N0389a82234
11238b0866B05144c14024J52496L0521K3566l0676B5347h2353r8476A21777F993
11226c12287A03576k6876Q2229o2954b16104N5625C5511P2015J13327H3287c93321
11214b31508P8754D3330a7428A55650b53959A6178b26932a5952j54024C9065g1405
11202A98887f4861A35920i6387c7427H7160O8533g3203j24451D04233a89056A04377
11190I8294P522J18342n9803a00697C5138e4973j57196D1627J89888H6951a9949
11178a47254E4259j082K65210C2948b18592L8270e0335Q584g041k7570A9527d0452
$$ plain form
11262 -80734 -28855 -52510 -94742 56226 22563 -136265 -88664 -33951 157001 30950 -166125
11250 -175372 -246755 -88533 148787 -149171 -242727 -292946 -160955 34230 57277 107666 -182234
11238 -20866 205144 -314024 -161528 -131007 -107441 -138117 25347 -82353 -180829 121777 6993
11226 -312287 103576 76700 158929 95975 -216104 -160479 35511 107526 220853 83287 -393321
11214 -231508 -152754 43330 -17428 155650 -253959 16178 -226932 -15952 -169976 39065 -71405
11202 198887 -64861 135920 -96387 -37427 87160 155693 -73203 -197654 404233 -189056 104377
11190 98294 105816 224158 164355 -100697 35138 -54973 -212169 41627 231515 86951 -19949
11178 -147254 54259 53177 318387 32948 -218592 -180322 -50335 -41751 -7041 -34611 19527 -40452
11165g7869N14K0687k07658J17726A91212m4573a15939l0728D5678J94678I1928
11153B31845k8480a58183a1461j22737A29720a99531c2221C0827a39100n6021
11143a95121I1373c27314a8761j03830B23186d4993k46986b5172A21532k7650
11133I3882J55515b5603C82816E410K30297m1957n6996A6964J0852J13587Q1380
11122B22783H0198l0341J20772J99721j62051F0185c9282j75533A5697R8426j4319
11111I9804a22452n8176h6773o4208H413M04447A44477b38385N3272A69294a74645
11099B63352M7613a10314n299B25608J45515h9765A3923J23886a8363j07062m7876
11088a73301C4559a3139B62580P2500k7085m9173o0987D9310M6192f8948A09545
$$ plain form
11165 -77869 -77355 -56668 -264326 -146600 191212 146639 -115939 -146667 45678 240356 91928
11153 231845 203365 -158183 -11461 -134198 129720 -199531 -32221 30827 -139100 -195121
11143 -195121 91373 -327314 -18761 -122591 223186 -44993 -291979 -25172 121532 93882
11133 93882 249397 -25603 382816 5410 235707 193750 136754 16964 27816 141403 222783
11122 222783 80198 49857 170629 370350 208299 60185 -39282 -214815 15697 114123 99804
11111 99804 -122452 -180628 -86773 -150981 8413 412860 144477 -238385 -185113 169294 -174645
11099 263352 310965 -110314 -115613 225608 371123 -89765 13923 137809 -18363 -125425 -173301
11088 -173301 34559 -13139 262580 335080 307995 258822 197835 49310 95502 -68948 109545
11076B95011A15606J00696K31571A20719E2832K55019j20271J22825g8711B77619
11065C6286N08929j04785j6785p4706j68494K02625G6833K92956J22821A67588
11054B55568q9874J13042K4150j8456J22774r7871L43015k05065m5020J69611
11044E71874L5333L2363j04044L2005k80262M80919J00134l43592J27319p6824
11034E75225L39515k19650M01620l71254J27735l8381C74574J75836J93982K56370
11024A000762k09212J10458j64252M0164N10911j64403l59903L4838k03942M8916
11014F44337L79327j69044o4244L11498k19858l11248N67680m08765j84029K36172
11004G81826k50955M27934l35758J96197l23619J72195L04571k48182k33722K42975
$$ plain form
11076 295011 115606 216302 447873 120719 52832 307851 187580 310405 -78711 277619
11065 36286 545215 440430 423645 348939 180445 383070 76833 369789 492610 167588
11054 255568 165694 278736 302886 284430 407204 309333 652348 447283 402263 571874
11044 571874 607207 639570 535526 567531 287269 768188 868322 524730 652049 575225
11034 575225 914740 695090 1096710 725456 853191 814810 374574 550410 744392 1000762
11024 1000762 791550 902008 737756 777920 1288831 1124428 764525 799363 595421 644337
11014 644337 1023664 854620 790376 1101874 882016 570768 1138448 729683 545654 781826
11004 781826 530871 958805 623047 819244 495625 667820 972391 724209 490487 733462
10994G33462m8997k60367M41282l17206J33884K3640m3077K23304J32979m52712
10984E66192R8169L165k7530L67182m51135J19227O3129j2867J52213o2177N1619
10973H67187J56763J77750k69269O2917o4133J38539O5100K18929k38650J93336
10963A308469J64861J50742j51263M15256K91306L13649K64495L04100j96923
10954B864692J91577m38199L98814j03159n69622L0017k99011j76550l03454L23276
10944A918381J22371n38649J90048r5906K4724j4672r7288k06517m10206N8139
10934I50425j5722j31498n5450j02796k883n9843K22906k32918k71309A47463
10923D1723R1183b71966B38623i7055A75809N4133J85226B3798J69965O6886H6081
$$ plain form
10994 733462 684465 424098 865380 548174 682058 705698 662621 885925 1018904 566192
10984 566192 664361 667526 639996 1007178 556043 675270 738399 725532 877745 815568 867187
10973 867187 1023950 1201700 932431 995348 931215 1069754 1134854 1353783 1115133 1308469
10963 1308469 1473330 1624072 1472809 1888065 2179371 2493020 2757515 3061615 2864692
10954 2864692 3056269 2618070 3016884 2913725 2344103 2374120 2075109 1898559 1595105 1918381
10944 1918381 2040752 1502103 1692151 1596245 1620969 1606297 1509009 1302492 892286 950425
10934 950425 934703 803205 747755 644959 642076 582233 805139 572221 300912 147463
10923 41723 132906 -271966 238623 -97055 175809 229942 415168 23798 193763 260649 86081
10911B16355r2350n0041b18238a9501D4710L83830A19338f6607A12809L532a27539
10899b73485a35318J0827A91108H335a1801k8545n0718d3044J2333q1495d5721
10887g9171j82255B11325h6669A76780c8868A20316e4064k7621E3805Q9569l2963
10876A10411d5867D2005g8533A42899a36188C49570A61583F0903J3015J70652
10866B44570a17250A24924a1747j75111A68549C9135g5588c4115F1750d12859
10855C56262L0981b93898A92020d2776a7442H906J04552l771M1827D878J07340
10844A12218a36582B07231D1826K40997j21940i0698j1599j26927j03393A64280
10833f9344A56837b04750M0783C9343c43201J11049J09065d1163I1060c77462
$$ plain form
10911 216355 124005 73964 -218238 -19501 44710 428540 119338 -66607 112809 116341 -127539
10899 -273485 -135318 -124491 191108 8335 -11801 -40346 -91064 -43044 -30711 -112206 -45721
10887 -79171 -261426 211325 -86669 176780 -38868 120316 -54064 -81685 53805 143374 110411
10876 110411 -45867 42005 -78533 142899 -136188 349570 161583 60903 73918 244570
10866 244570 -117250 124924 -11747 -186858 168549 39135 -75588 -34115 61750 -412859
10855 356262 387243 -293898 192020 -42776 -17442 8906 113458 109687 151514 4878 112218
10844 112218 -136582 207231 41826 282823 160883 -90698 -102297 -229224 -332617 164280
10833 -69344 156837 -204750 -163967 39343 -343201 -232152 -123087 -41163 91060 -377462
10822H6791a91778h201b386j56811j22452c487j33534o2994a2905B03542h9G2299
10809A3997J10452J23222j6575d583n2457l7650G0947c72428a14254j60610B40057
10797A00155a027B53361a94806L700R1556B6938c25674J06039j04042a50766M0236
10786a10530A1611L87838b24862B3163J57622b57276N0684H0212L1192J30988
10776B42392C3361c86336d4443k51284a26074c2501l83416J67403i5328H8242
10765I1845g87k22915m6259M8616H4029c28198J52379A39898k8737a13124o1377
10754a74501B31699J19283A18990h7788A29876c55638a30290j28841P2779A86513
10743E4001K7053b39171d4196o6591L5377B08564d4978J6746B9933a12310k04239
$$ plain form
10822 86791 -191778 -8201 -2386 -159197 -281649 -3487 -137021 -200015 -12905 203542 -89 72299
10809 13997 124449 247671 231096 -4583 -57040 -94690 70947 -372428 -114254 -274864 240057
10797 100155 -1027 253361 -194806 -191106 -99550 26938 -325674 -219635 -323677 -150766 -110530
10786 -110530 11611 399449 -224862 23163 180785 -257276 -206592 80212 111404 242392
10776 242392 33361 -386336 -44443 -295727 -126074 -32501 -415917 -248514 -95328 88242
10765 91845 -787 -223702 -269961 -221345 84029 -328198 -175819 139898 111161 -113124 -174501
10754 -174501 231699 350982 118990 -87788 129876 -355638 -130290 -259131 -186352 186513
10743 54001 81054 -239171 -44196 -110787 -75410 208564 -44978 -28232 29933 -112310 -316549
10732c16549g6172M682D824b42586m3331B54415A21472f2389C41779C5479A5263
10720B95111a5069A50605m8946m6628G343Q7433Q3339a64470o2545A7796a36777
10708a74962C27182F3556h2565k63038a53241B66378c74642a29882m8757O3590
10698a15049p2128J8118B44400C5291J02259a48171J1522N9512K6843B10637a61691
10686A8672b4440A20578A1908a34327A42927g6044A29831a9608I5953K2809d60947
10674e20604B09715D1101j897a66085L2266k48886I0025i1888n9732M1983n4825
10663a64462r2555N1710o6506c2625A6814f0345j12179B12109o1659M553k3060
10652A31943a29853J7363A9076M0107a81230A24768N5929a16325k70212a75657
$$ plain form
10732 -316549 -76172 -71490 4824 -242586 -285917 254415 121472 -62389 341779 35479 15263
10720 295111 -15069 150605 101659 55031 7343 94776 178115 -164470 -227015 17796 -136777
10708 -174962 327182 63556 -82565 -345603 -153241 266378 -374642 -129882 -178639 -115049
10698 -115049 -187177 -169059 244400 35291 137550 -148171 -136649 -77137 -50294 210637 -161691
10686 18672 -24440 120578 11908 -134327 142927 -76044 129831 -19608 95953 118762 -460947
10674 -520604 209715 41101 39204 -166085 -133819 -382705 90025 -91888 -151620 -109637 -164462
10663 -164462 -257017 -205307 -271813 -32625 16814 -60345 -172524 212109 150450 155003 131943
10652 131943 -129853 -112490 19076 59183 -181230 124768 180697 -116325 -386537 -175657
10641c62363A35314a30287A24699F2031b5224l93580b8195A8953M4749K17994
10631B81696A36282i6662j04009j51182R0804H9972a12485j36587D9139J26976
10621A76115b72096A905a54915K4633I3759c1472k51565a12355A39880d879A7047
10609e63686A97602a4103m62523A98677a11541k0399A45908d2969A25907a81611
10598a58805K1971b632k92160a46676j3333A29341c40402f8332A27355K5618j0281
10587A42692a73360k4603A59855b72242d0068k429D1478b8666D0080a39798B12823
10575d02026C6246J85020F4201a7318j08904G0237a74907b1795A45456a09909
10564b99407B39504E0941a4505j97136h4067C78591A5326b26722A0273d83224
$$ plain form
10641 -362363 135314 -130287 124699 62031 -25224 -418804 -28195 18953 63702 281696
10631 281696 136282 -96662 -200671 -351853 -261049 89972 -112485 -249072 49139 176115
10621 176115 -272096 1905 -154915 -130282 93759 -31472 -283037 -112355 139880 -4879 17047
10609 -563686 197602 -14103 -476626 198677 -111541 -131940 145908 -42969 125907 -181611
10598 -158805 -136834 -2632 -294792 -146676 -160009 129341 -340402 -68332 127355 152973 142692
10587 142692 -173360 -197963 159855 -272242 -40068 -42497 41478 -28666 40080 -139798 212823
10575 -402026 36246 221266 64201 -17318 -126222 70237 -174907 -21795 145456 -109909
10564 -299407 239504 50941 -14505 -211641 -84067 378591 15326 -226722 10273 -483224
10553a1254p9035L6918C18126a77947F0512J15805E2644Q4352a37401j89441A4816
10541A03935k8970f9710k88363I2409c33357E6577b59043g5346k47378G3655i3032
10529E2786e6905j3010D0703N4116h2415q542c4662J5785A39862a02119A5002
10517f8226l57249C2574b3755k02670E5376a81164L9468B42056b9510I1160a64488
10505f611g32A86224a81337g1177Q265J2414j78182R6985G2543J7056b49160D4319
10492a58859I4001a64203o7689J08826I4266a1903j27690j04638L7933A97136
10481a57574A43581J5350b85462J11765h4936D3436J2615I176e0020n6166B7360
10469A9044L34689j19376d5974C4206p46L45310L2130q8036P8705C7001K86265
$$ plain form
10553 -11254 -90289 -53371 318126 -177947 60512 176317 52644 136996 -137401 -326842 14816
10541 103935 74965 -69710 -358073 92409 -333357 56577 -259043 -75346 -322724 73655 -93032
10529 52786 -56905 -69915 40703 94819 -82415 -90957 -34662 -18877 139862 -102119 15002
10517 -68226 -425475 32574 -23755 -226425 55376 -181164 -141696 242056 -29510 91160 -164488
10505 -6611 -732 186224 -181337 -71177 -62912 -50498 -228680 -131695 72543 89599 -249160 44319
10492 -158859 94001 -164203 -231892 -123066 94266 -11903 -139593 -244231 -206298 197136
10481 -157574 143581 158931 -285462 -173697 -84936 43436 56051 9176 -50020 -106186 27360
10469 19044 353733 234357 -45974 34206 33460 378770 410900 322864 401569 37001 323266
10458C23266j48607n6978J62384J2434r0787q0507B9214a95527e9104l7031C4951
10446G2193J1467L9256b77556i5237k01146f3284l6047j90108N2329m1443B14889
10434D43774B8585a27646d9505q0354K5568J9627A8944K3265a39415r8368D8641
10422c60252A68353e2825A67094a05575F7595b0519k5594k02473a17655B60532
10411c7895n047k99764J45892j34627I9126J37439a13279J3022g820k44045P1512
10400a80353e5145j39476C3531a07565B03859o5682a51096C8914n906G53b0427
10388b8917j53816E0575f5211C08008A24686a65311P4292j84097h8607H2578E254
10376I8799J81695F1509k2713J25251O1659d40556B47545a3309A96104b61046
$$ plain form
10458 323266 174659 117681 280065 292499 201712 121205 29214 -195527 -59104 -96135 34951
10446 72193 83660 122916 -277556 -95237 -296383 -63284 -99331 -289439 -237110 -278553 214889
10434 443774 28585 -127646 -49505 -129859 -104291 -84664 18944 42209 -139415 -237783 48641
10422 -360252 168353 -52825 167094 -105575 67595 -20519 -46113 -248586 -117655 260532
10411 -37895 -42942 -342706 -196814 -331441 99126 236565 -113279 -100257 -7820 -251865 -180353
10400 -180353 -55145 -194621 33531 -107565 203859 138177 -151096 38914 33008 753 -20427
10388 -28917 -182733 50575 -65211 308008 124686 -165311 -91019 -275116 -88607 82578 5254
10376 98799 280494 61509 38796 164047 225706 -440556 247545 -13309 196104 -261046
10365A1859L84249A68602J45584P5428F71L49627D8952J79207K06303B03125l3097
10354A70028L33293A78593p1783N66807j60219n7733B21219e3563A93027e5254
10343B64409j21615M749L44959p156A28108K92951B07226A01470L40584j81708
10333B60346J55408J36547j82504F8195J90203p7908K92733L28374A45308L83683
10323E28991j63173I1304m1325L36638A79363a47275D56820E9080L2108K14920
10313C06108i287E2307R1877F6154M5662K59860d8017B08419C9324K44088r1944
10302A91468e7853I1385a97134D51499j36961p0441p6322c27505d2127A21738
10291H8847f4954j66505A58194c34199A68637A5259a21589M8543A2896M9562J92389
$$ plain form
10365 11859 396108 168602 314186 389614 671 350298 48952 228159 434462 203125 170028
10354 170028 503321 178593 106810 673617 513398 455665 221219 -53563 193027 -55254
10343 264409 142794 147543 492502 485346 128108 421059 207226 101470 442054 260346
10333 260346 415754 552301 369797 68195 258398 180490 473223 801597 145308 528991
10323 528991 365818 91304 49979 386617 179363 -147275 456820 59080 91188 306108
10313 306108 -9287 52307 144184 66154 111816 371676 -48017 208419 39324 283412 191468
10302 191468 -57853 91385 -197134 451499 314538 244097 167775 -327505 -42127 121738
10291 88847 -64954 -231459 158194 -334199 168637 15259 -121589 -73046 12896 62458 254847
10280B54847D6991a36272B16888d79569H8777d4793j27871K3537D3847k1177a2468
10268f5016l6878l19029g0521L633n7126j20352d0783j01940d4650a244m7462
10257d8706B83585b99028a0552n4668A38306c01563a01297n5106J4752j1780B74703
10245e0944E3117J45979P8354j15407J66800A12162K99439A4461d1070B5368i0849
10233a23119B37291f1927n57656d8354k5224A0092c7731I0070j2541c79328D5095
10221a24010j10169B28375c01685Q4434P9227B70550l783c27265C89179b39762
10210i2404A95578c12905B27226j05149g0492k11655A59968J3807k3628a34459
10199B0001b37271P4346q1582C18119A29509a38399j517C8269b15560E8782a00134
$$ plain form
10280 254847 46991 -136272 216888 -479569 88777 -44793 -172664 -149127 43847 22670 -12468
10268 -65016 -101894 -420923 -70521 -66888 -124014 -244366 -40783 -142723 -44650 -1244 -48706
10257 -48706 283585 -299028 -10552 -65220 138306 -301563 -101297 -156403 -141651 -153431 274703
10245 -50944 53117 199096 277450 162043 328843 112162 411601 14461 -41070 25368 -90849
10233 -123119 237291 -61927 -619583 -48354 -73578 10092 -37731 90070 77529 -379328 45095
10221 -124010 -234179 228375 -301685 -217251 -138024 270550 266767 -327265 389179 -239762
10210 -92404 195578 -312905 227226 122077 -70492 -282147 159968 173775 150147 -134459
10199 20001 -237271 -162925 -244507 318119 129509 -138399 -139916 38269 -215560 58782 -100134
10187b44656G6717c44568e7549j75199C4181a52111g3865B42855a59340A76014
10176B48209A8122h9684L273C5302M3634L9733c8155k51752A07711c4107a4536
10164a56104g7922B00866m47F203a82011a294A19615a48023B89379A29318J27
10153A29445a98106L6320J0167C610b8505J1750A09481q100a39169B03041b64542
10141a98987q1839I8883b44911B35152e4683j39838g6025J2012k8203A58585m4622
10130A13963a559j64920A6380b20735O9445A29706c58715f9411B71588a29781
10119G8942N3652e822F4024d03391A255a89120g1730k79407i9577j20589A04935
10107A4013a64047o6093n9344A61301J9015R6974j00047o2885a16007r3595C0514
$$ plain form
10187 -244656 76717 -344568 -57549 -232748 34181 -152111 -73865 242855 -159340 176014
10176 248209 18122 -89684 -86411 35302 78936 118669 -38155 -289907 107711 -34107 -14536
10164 -156104 -77922 200866 200419 6203 -182011 -1294 119615 -148023 289379 129318 129445
10153 129445 -198106 -161786 -151619 3610 -28505 -16755 109481 101381 -139169 203041 -264542
10141 -198987 -280826 98883 -244911 235152 -54683 -194521 -76025 -64013 -92216 158585 113963
10130 113963 -1559 -166479 16380 -220735 -151290 129706 -358715 -69411 271588 -129781
10119 78942 132594 -5822 64024 -403391 1255 -189120 -71730 -351137 -99577 -220166 104935
10107 14013 -164047 -230140 -289484 161301 180316 277290 177243 114358 -116007 -209602 30514
10095a701k57812c7374j03035b3213B6605b16601A49974O7085a0074H3181c23244
10083i5867l97n0993A44847b79253B3284E197P1192a40947c0823r1781A12229
10071a52954o6060b7617j03775A476a85992L4707k2341I5593e3529l89907A52729
10059a84035k27162O1816b0143k16713a1353k36775E1556Q5060h4392m5981m6927
10048a77300A83800a13704A15583J12969a63422d7483D4239b02133l5023A13712
10037a43367C73201G596b27389I4955d7005j07199A75920o1682g4394B13936B1190
10025e6430j64504i3021J6740C977M9434a48506B45011e1279A05204A5270e073
10013b05978A42451b35850A8828J48630n8582j1692a37582f3711A36797b13442
$$ plain form
10095 -1701 -259513 -37374 -140409 -23213 26605 -216601 149974 217059 -10074 83181 -323244
10083 -95867 -96264 -147257 144847 -279253 23284 5197 76389 -140947 -30823 -122604 112229
10071 -152954 -219014 -27617 -131392 1476 -185992 -151285 -173626 95593 -53529 -443436 152729
10059 -184035 -411197 -349381 -20143 -236856 -11353 -248128 51556 136616 -84392 -130373 -177300
10048 -177300 183800 -113704 115583 228552 -163422 -47483 44239 -202133 -237156 113712
10037 -143367 373201 7596 -227389 94955 -47005 -154204 175920 114238 -74394 213936 21190
10025 -56430 -220934 -93021 -76281 3977 53411 -148506 245011 -51279 105204 15270 -5073
10013 -205978 142451 -235850 18828 167458 108876 97184 -137582 -63711 136797 -213442
10002f0938k61720R2051R5646A50498b80511G3700a84460q077O6356l7126c7630
9990g8629I6871a78049f681j92918D62J94907i0689A12400b05015m2966O4226
9979a83755C8664b13478q6170B1643K21994h257G8453b85566a7381m06293I1101
9967a24016B44274a7871l5866F5361N8117I540J77394a68447B08710C0603l330
9956B7273J66469c8145n8167B78413q0253H3187a32807A42589a78617L0698n2247
9945b00166C6382K47812A23911c30213P5777e93p7655m1130C4719f5889j86839
9934b52728C5908a61899N0497j08982k7695C4954a25731a170A1167M2473h5642
9922a75004L4014j40958G3912a46606C60i3878c8202B08272a28169O127k90378
$$ plain form
10002 -60938 -322658 -230607 -134961 150498 -280511 73700 -184460 -192537 -126181 -163307 -37630
9990 -78629 96871 -178049 -6681 -199599 462 195369 -90689 112400 -205015 -247981 -183755
9979 -183755 38664 -213478 -299648 21643 243637 -8257 78453 -285566 -17381 -423674 91101
9967 -124016 244274 -17871 -53737 65361 123478 9540 186934 -168447 208710 30603 27273
9956 27273 193742 -38145 -96312 278413 198160 83187 -132807 142589 -178617 -147919 -200166
9945 -200166 36382 284194 123911 -330213 -254436 -593 -78248 -119378 34719 -65889 -252728
9934 -252728 35908 -161899 -111402 -220384 -248079 34954 -125731 -1170 11167 53640 -85642
9922 -175004 -140990 -281948 73912 -146606 360 -93878 -38202 208272 -128169 -122042 -412420
9911d12420J77840B5888e1702l22400a35300k11197a35253q5244J4001f5552M802
9900f0750i468A02644L1264b34586D3653h347A44765b07080B9753J59480b09195
9888b54287G1106a02079m487c9071j90863R5342A06136a75474j66466A60179b79650
9876B9184a8302j80945k660C6809O780a52555G275c49928J8650A50887a30880
9864b4819M644n8588A19377F824J44804c49864h7524B12684a64990n6122l9765
9853b60877e4152k42320i4656k26889F4516c51860B674a97612b6264l31272P7568
9842b79968j853C1290P082b67808e1165j25910i70j69038M8056I7674R1194c17780
9829G7846k1711M2854a86377D6176a11777B1955M3769a14371j48867a4061B02400
$$ plain form
9911 -412420 -234580 25888 -51702 -374102 -135300 -346497 -135253 -220497 -206496 -65552 -60750
9900 -60750 -9468 102644 133908 -234586 43653 -8347 144765 -207080 29753 189233 -209195
9888 -254287 71106 -102079 -106566 -39071 -229934 -134592 106136 -175474 -341940 160179 -279650
9876 29184 -18302 -199247 -201907 36809 43589 -152555 7275 -349928 -331278 150887 -130880
9864 -24819 -20175 -78763 119377 6824 151628 -349864 -87524 212684 -164990 -221112 -260877
9853 -260877 -54152 -296472 -94656 -321545 64516 -351860 2674 -197612 -26264 -357536 -279968
9842 -279968 -281821 31290 38372 -267808 -51165 -177075 -970 -170008 -121952 97674 188868 -317780
9829 77846 56135 98989 -186377 46176 -111777 21955 65724 -114371 -263238 -14061 202400
9817a05305j59518J04262M5881d567A62629e3935r5113N8457j2798p0978A34537
9805c7525A08340b59474J27217k0465C6067J10193P2722a17647o1942j4291J8011
9794a75869d700m6062j71883A35898b28349A68315D934d13130c4889A47989a55026
9782e493n5129b3250j72119k0543k70364B34696a06334d9202k4174A87600a28719
9770a78790e1075j87185C760I13J01003d8999a4320r6653l5224e2523F0571a97457
9757a32550l6129b0665k83532a7936k37039g9421k48635d3502P786k14094j86453
9746d36263H8263c6991r0441j61550J15899B73669K46383C9004N375e25339D22726
9734b98723A5935a09183A60024g2263a2729r6340l31405a51444n6127A16172b46782
$$ plain form
9817 -105305 -264823 -160561 -114680 -4567 162629 -53935 -149048 -90591 -103389 -174367 134537
9805 -37525 108340 -259474 -132257 -152722 36067 146260 218982 -117647 -179589 -193880 -175869
9794 -175869 -4700 -50762 -222645 135898 -228349 168315 4934 -413130 -34889 147989 -155026
9782 -5493 -60622 -23250 -195369 -215912 -486276 234696 -106334 -49202 -73376 187600 -128719
9770 -178790 -51075 -238260 3760 913 101916 -48999 -14320 -110973 -146197 -52523 60571 -197457
9757 -132550 -168679 -20665 -304197 -17936 -254975 -79421 -328056 -43502 -35716 -249810 -436263
9746 -436263 88263 -36991 -127432 -288982 -173083 273669 520052 39004 44379 -525339 422726
9734 -298723 15935 -109183 160024 -72263 -12729 -109069 -440474 -151444 -207571 116172 -246782
9722b13764H6901J884c9068E5820a35691j66357e0522E0593C776K18156a10159
9710A10067h1904A35924M4735a29337d0177I3484a31422l2151A62744n6216J18363
9699B24891A07829c58007A83136H4935c6729q0698C55327k7821f272A34536M3035
9688A77571a52736K3026k2122C0686b877j72350L220p6803A1204a07300D0522
9676a49633f2070B21041a36293A81083G800L20775b34980a01864j7210j1468j46416
9665b76958a23763C4951L04342c58932d0300k65761a12946F8358b04042b6479
9654c42361B9664a3840k39456b3494A03229b9582p8973c1795A24317e5534l8307
9643i3841A17427b19438a3706C79959q4645a038j32286a022o3950r4333M6518
$$ plain form
9722 -213764 86901 88785 -39068 55820 -135691 -302048 -50522 50593 3776 221932 -110159
9710 110067 -81904 135924 180659 -129337 -40177 93484 -131422 -163573 162744 106528 224891
9699 224891 107829 -358007 183136 84935 -36729 -117427 355327 327506 -6272 134536 177571
9688 177571 -152736 -129710 -151832 30686 -2877 -175227 -172007 -248810 11204 -107300 40522
9676 -149633 -62070 221041 -136293 181083 7800 328575 -234980 -101864 -119074 -130542 -276958
9665 -276958 -123763 34951 339293 -358932 -40300 -306061 -112946 68358 -204042 -26479
9654 -342361 29664 -13840 -253296 -23494 103229 -29582 -108555 -31795 124317 -55534 -93841
9643 -93841 117427 -219438 -13706 379959 295314 -1038 -133324 -1022 -64972 -159305 -112787
9632a12787d7152l6593A54396a39488M6342q5087o268D6451J94400b36406a00918
9620i8028E6837a99662j74277H6269a33291A29762K83906f9776r6161E9833R6015
9609A55848b83460i3082B01944a50655A94465A0402b35358K3246E8398a30913
9598a58315K4069C7703d0096j36431j70533Q2943e081A27317b25209Q719A78235
9586B41207c97315J78786N1963f764m4821j89393G7953A2398L1467A7093a3288
9574c2460d961b063r8524q5082I0842i0834I6754B3504J34480c09615O0175q6604
9562c36044N5132E8916L0932c1200l3618A8538i8474l2001b4644r0356e1750A6300
9549g250G9441g94129g8238l7248D29848G4594J2468K8307a6462j8193j35593
$$ plain form
9632 -112787 -47152 -83745 154396 -139488 -93146 -178233 -184501 46451 240851 -236406 -100918
9620 -98028 56837 -199662 -373939 86269 -133291 129762 413668 -69776 -165937 59833 155848
9609 155848 -283460 -93082 201944 -150655 194465 10402 -235358 -212112 58398 -130913
9598 -158315 -134246 37703 -40096 -176527 -347060 -264117 -5081 127317 -225209 -216490 178235
9586 241207 -397315 -218529 -166566 -6764 -51585 -240978 77953 12398 43865 17093 -13288
9574 -32460 -4961 -2063 -100587 -185669 90842 -90834 96754 23504 157984 -309615 -249440 -336044
9562 -336044 -280912 58916 89848 -31200 -64818 18538 -98474 -130475 -24644 -115000 -51750 16300
9549 -7250 79441 -794129 -78238 -115486 429848 74594 87062 115369 -16462 -34655 -170248
9538a70248D8796A1905a77562A39787B5954a35306G0053f9995a4269j01541A7262
9526g9365L7725p8389k71342h7546j753K7671H0809a72811j34176B09784R304
9515B19088A9645a52993A9265g2017j65438J18410D5583a75672B3383a46900k3293
9504a70193D36a11376J1953j03742Q5118G4687b1615k45618I1553b34355J10468
9493a23887A3585b70440r80H8698a2014C5586c06346f0860J5738q800A8701i29
9480b39889c8454J1737k6837j80716C3286c662k67767J11518B5083a8915A22804
9468c1408l7737A40489b11327J6592A67444f6973l1977l5630h564m11815h6557
9456H5278a65041O6453B28708B7978a63490B9931a50191B47705G3863C519b60262
$$ plain form
9538 -170248 48796 11905 -177562 139787 25954 -135306 70053 -69995 -14269 -115810 17262
9526 -79365 -41640 -120029 -391371 -87546 -89299 -61628 80809 -172811 -306987 209784 219088
9515 219088 19645 -152993 19265 -72017 -237455 -119045 45583 -175672 23383 -146900 -170193
9504 -170193 436 -111376 -99423 -203165 -118047 74687 -21615 -267233 91553 -234355 -123887
9493 -123887 13585 -270440 -271420 88698 -12014 35586 -306346 -60860 -45122 -53922 18701 -929
9480 -239889 -38454 -26717 -53554 -234270 33286 -3662 -271429 -159911 25083 -18915 122804
9468 -31408 -69145 140489 -211327 -194735 167444 -66973 -98950 -134580 -8564 -420379 -86557
9456 85278 -165041 -98588 228708 27978 -163490 29931 -150191 247705 73863 3519 -260262
9444f5168j42778c0716A53147c74114E3600B326a77536B1493c80694B28531e4551
9432F5453i1136F0643c9273C8152c24591a2786o575m6698C15550a18617o256j82492
9420c07365g7906j71492d301I7287a34005B34547H6565p221L7609c39849B9444
9408a06776j19534B65182j13575a71017g2664D04984A29829K75514a41853A53489
9397d3862j1360l850A25272a20854B17376a55650N7708n3780I6377J07569b74054
9385B8348c24469A34894c88761R6285c4371j94178P6928c0606C6155b38044A6147
9373a9910j88156g7100C5816a01320c9680a0153D0557E686b73605i0359j8805
9362a09164F4383b41632j01815B2372g4778k98096A27584b00408J7141Q7737j41107
$$ plain form
9444 -65168 -207946 -30716 153147 -374114 53600 2326 -177536 21493 -380694 228531 -54551
9432 65453 -91136 60643 -39273 38152 -324591 -12786 -19361 -66059 315550 -118617 -124873 -307365
9420 -307365 -77906 -249398 -4301 97287 -134005 234547 86565 79344 116953 -339849 29444
9408 -106776 -226310 265182 151607 -171017 -72664 404984 129829 405343 -141853 153489
9397 -43862 -55222 -59072 125272 -120854 217376 -155650 -97942 -151722 96377 203946 -274054
9385 28348 -324469 134894 -388761 -292476 -34371 -228549 -151621 -30606 36155 -238044 16147
9373 -19910 -208066 -77100 35816 -101320 -39680 -10153 40557 5686 -273605 -90359 -109164
9362 -109164 64383 -241632 -343447 22372 -74778 -372874 127584 -200408 -183267 -95530 -236637
9351b36637Q6542D1919b29792a0354k55678B08905P4476C3993M5110e1338j93353
9340b44691b2723k88887D5766c25573O7959i0834n9956C63971d9683j70909j076
9329b21668g390o9125B89185F7016e36600A61630a20322A76939g7269A62737a04672
9317C31167A39725b68468G3172b92160C59389d9914o1279j70147h07j48651e8774
9305c50647g0615q3873f8009q6374A94763a54050A44478A5536d9686j04764K2420
9294a32030A22634a89884A73210G8567a2133p9382B7574J04730b28918J13776
9284a15142A63275E2467f9442k07494B5941i4H3862b60889f6118K529C2643f9289
9271G387J7170f3638B9148J29877d18944A37152b15619K4704m137G4701a40006
$$ plain form
9351 -236637 -150095 41919 -229792 -10354 -266032 208905 283381 33993 79103 -51338 -244691
9340 -244691 -22723 -311610 45766 -325573 -257614 -90834 -150790 363971 -49683 -220592 -221668
9329 -221668 -7390 -76515 289185 67016 -536600 161630 -120322 176939 -77269 162737 -104672
9317 331167 139725 -268468 73172 -292160 359389 -49914 -111193 -281340 -807 -149458 -58774
9305 -350647 -70615 -154488 -68009 -154383 194763 -154050 144478 15536 -49686 -154450 -132030
9294 -132030 122634 -189884 173210 78567 -12133 -91515 27574 132304 -228918 -115142
9284 -115142 163275 52467 -69442 -276936 25941 -94 83862 -260889 -66118 -63589 32643 -69289
9271 7387 24557 -63638 29148 159025 -418944 137152 -215619 -190915 -195052 74701 -140006
9259b6763j87918A7246b64091f3970l40108E5587c67065B25833a1662B35787b16020
9247c83883A32398i8365j08201g0583J6592j57413d4931j47358q0592j42716A73391
9235c0060E7162b26192B8348e5682H8127d63576J5013a0702D1267h0236k85774
9224c66010a4247j9752D41200r2136i3204r2568k22747g1161l1681j21014B17329
9212I3677p172g9801l10103g2779k44363J58143A63487b63186g7831c5949A64308
9200D3858K10920a38998d0967k6099A35988a12649C8308b04831O7409C55430e6722
9188b86121K5512G2159a12979D0871f3373r7805B2831J47972g7234j2117l31532
9177d20883a86600F3668a16525H2968b43738G9647a4252H249d6423k29239H1882
$$ plain form
9259 -26763 -214681 17246 -264091 -63970 -404078 55587 -367065 225833 -11662 235787 -216020
9247 -383883 132398 -98365 -206566 -70583 -53991 -211404 -44931 -192289 -272881 -415597 173391
9235 -30060 57162 -226192 28348 -55682 88127 -463576 -448563 -10702 41267 -80236 -366010
9224 -366010 -14247 -33999 441200 349064 -93204 -185772 -408519 -71161 -102842 -223856 217329
9212 93677 86505 -79801 -389904 -72779 -317142 -158999 163487 -263186 -77831 -35949 164308
9200 43858 254778 -138998 -40967 -67066 135988 -112649 38308 -204831 -137422 355430 -56722
9188 -286121 -260609 72159 -112979 40871 -63373 -161178 22831 170803 -77234 -89351 -420883
9177 -420883 -186600 63668 -116525 82968 -243738 79647 -14252 8249 -46423 -275662 81882
9165a83499O6963e4755l8617j27051C914J97880b56028m1602G4790e0447k16909
9154b67356q2574g7324B39301a57086J2911M520G3784c9898e57l016k14639E2924
9141A13026b4955D1288N2758C8207K08978f4204r3832k890A5103a97904G1176
9129e7594m3370B17038D1635f554n3999B7518d0517A93226a40337C1367a82498
9117a76341j5209A2702a12799B00023a39426D6419i7914l713l74646C38273a85935
9105a07071l9454d5865F9068e2735A20835j7992c9972e399n3771J5520H2534J21100
9093B03634g4604L4510j01820q2319A21429Q6249b53527n787H5593a60548j30660
9082b91208d2288I9406a42577O0319b401o4745j14619o5151H3609c04737P7680
$$ plain form
9165 -183499 -116536 -54755 -93372 -220423 3914 201794 -256028 -297630 74790 -50447 -267356
9154 -267356 -349930 -77324 239301 -157086 -144175 -139655 73784 -39898 -557 -3573 -218212 52924
9141 113026 -24955 41288 94046 38207 247185 -64204 -158036 -160926 15103 -197904 71176
9129 -57594 -100964 217038 41635 -6554 -60553 27518 -40517 193226 -140337 31367 -182498
9117 -176341 -191550 12702 -112799 200023 -139426 46419 -97914 -101627 -476273 338273 -185935
9105 -107071 -146525 -45865 69068 -52735 120835 102843 -39972 -5399 -59170 -43650 82534 203634
9093 203634 -74604 -40094 -141914 -224233 121429 207678 -253527 -259314 85593 -160548 -291208
9082 -291208 -42288 99406 -142577 -82258 -2401 -67146 -181765 -246916 83609 -304737 -227057
9071b27057h0868E5251o2h1718A94635c44885C2556a79188g9198m6999j16256
9060b42453f5923J6583o9938l0694m1724Q4574A20971A2251J851e40166C3680
9048a48889D850a02636B17591b76376M8094B04919Q4711A7262a90589N6469N2998
9037h1122j7347r799K1182F7273H521b18853R6760e5781n5463R887E4807e5501
9024a22779j6627o5933o8228Q8678A84422E0458K27944b60294a03462C2004d19926
9012D3955J03412a53182A82067a21136n5939N5668H8151k1704j3637K36441a1564
9000a62328g2658b7268B56936c97526o776M5860a26603e8880j67028C4196b8319
8988b214l21733a9214j64728r0737n879c6328k57450a8171m3613J202m5459L19
$$ plain form
9071 -227057 -80868 55251 55189 -81718 194635 -344885 32556 -179188 -79198 -126197 -242453
9060 -242453 -65923 -49340 -119278 -149972 -191696 -107122 120971 12251 14102 -540166 33680
9048 -148889 4850 -102636 217591 -276376 -228282 204919 289630 17262 -190589 -134120 -81122
9037 -81122 -98469 -108268 -87086 67273 8521 -218853 -122093 -55781 -111244 -101357 54807 -55501
9024 -122779 -139406 -205339 -273567 -184889 184422 50458 278402 -260294 -103462 32004 -419926
9012 43955 147367 -153182 182067 -121136 -177075 -121407 88151 66447 52810 289251 -11564
9000 -162328 -72658 -27268 256936 -397526 -404302 -358442 -126603 -58880 -225908 34196 -28319
8988 -2214 -323947 -19214 -183942 -274679 -280558 -36328 -293778 -18171 -61784 -60582 -106041 -105722
8976a05722M235r385C25723b31325d1016A64381C5018h7569A83019b21155g8441
8964a13247A53045b02855L0997P9832C36196b41941a05051q0932j14367h7757
8953d189B96774b06538i4319d6258n5561F5041a30997A3329e2651j81035a2803
8941b69050Q8594e1728k2158H1482k0853P1995o4194B9801f25j3919C922J71721
8929A75643a5760A03112a0853m1649m03542F0854j1146a37435A64196C3305J17327
8918A50632J10431N2563q470N7965j33984J24630M0448k0773M43469J93646N95578
8907A606135J163563J427948O168797m245034B907923j363284n98886C29602J10830
8898D40432J95296B42913G061J43932a04812B91015n2384n8698b7066n0269A86844
$$ plain form
8976 -105722 -101487 -110872 325723 -231325 -41016 164381 35018 -87569 183019 -221155 -78441
8964 -113247 153045 -202855 -171858 -92026 336196 -241941 -105051 -185983 -300350 -87757
8953 -4189 296774 -206538 -94319 -46258 -101819 65041 -130997 13329 -52651 -233686 -12803
8941 -269050 -180456 -51728 -73886 81482 60629 132624 68430 29801 -625 -14544 3922 175643
8929 175643 -15760 103112 -10853 -52502 -456044 60854 49708 -137435 164196 33305 150632
8918 150632 261063 313626 305156 363121 229137 353767 394215 373442 816911 1010557 1606135
8907 1606135 2769698 4197646 10366443 6121409 2907923 1544639 945753 329602 440432
8898 440432 635728 242913 7061 150993 -104812 291015 238631 179933 -27066 -77335 186844
8886b15606G6450a05635b2733j51393Q859A96741b26589j08550C28064b60293
8875I4306L08115b14812I7071K95215a34969B2674a73007c4122A27228K27127
8865C54355a85222p5917A48376c70992a10729D3061b98060B0677b1806I3268a30113
8853a71209N3268C25836F9780b47430i9478C06920c01908A32518g4856j27308
$$ plain form
8886 -215606 76450 -105635 -22733 -174126 -165267 196741 -226589 -335139 328064 -260293
8875 94306 402421 -214812 97071 392286 -134969 22674 -173007 -34122 127228 354355
8865 354355 -185222 -261139 148376 -370992 -110729 43061 -298060 20677 -21806 93268 -130113
8853 -171209 -117941 325836 69780 -247430 -99478 306920 -301908 132518 -74856 -202164
$$ [...]
##END NTUPLES=NMR SPECTRUM
##END=
