
##TITLE=UV1128_M3-1004-1000_6275247_l6hmg87Wzp
##JCAMPDX= 6.0         $$ Bruker NMR JCAMP-DX V2.0
##DATA TYPE= NMR SPECTRUM
##DATA CLASS= NTUPLES
##ORIGIN= BRUKER
##OWNER= Administrator
$$ 1.72 TOPSPIN		Version 2.1
$$ 2012-06-02 20:53:49.281 -0500  Administrator@TOPSPIN
$$ Compression mode = diff/dup
##.OBSERVE FREQUENCY= 400.13188235
##.OBSERVE NUCLEUS= ^1H
##.ACQUISITION MODE= SIMULTANEOUS (DQD)
##.ACQUISITION SCHEME= undefined
##.AVERAGES= 64
##.DIGITISER RES= 22
##SPECTROMETER/DATA SYSTEM= spect
##.PULSE SEQUENCE= noesygpps1d.comp
##.SOLVENT NAME= COFFEE_meoh
##.SHIFT REFERENCE= INTERNAL, COFFEE_meoh, 1, 14.96725
##AUDIT TRAIL= $$ (NUMBER, WHEN, WHO, WHERE, PROCESS, VERSION, WHAT)
$$ ##TITLE= Audit trail, TOPSPIN		Version 2.1
$$ ##JCAMPDX= 5.01
$$ ##ORIGIN= Bruker BioSpin GmbH
$$ ##OWNER= Administrator
$$ $$ C:\Bruker\TOPSPIN/data/COFFEE/nmr/UV1128_M3-1004-1000_6275247_l6hmg87Wzp/12/pdata/1/auditp.txt
$$ ##AUDIT TRAIL=  $$ (NUMBER, WHEN, WHO, WHERE, PROCESS, VERSION, WHAT)
(   1,<2012-06-02 20:53:44.093 -0500>,<Administrator>,<TOPSPIN>,<go>,<TOPSPIN 2.1>,
      <created by zg
	started at 2012-06-02 20:42:13.781 -0500,
	POWCHK enabled, PULCHK disabled,
       configuration hash MD5:
       D5 CA 7A 23 FE 6B EE E2 50 67 74 61 24 F7 5E 3B
       data hash MD5: 64K
       22 B9 C8 2A 2E 99 31 4C 8E 83 54 E4 FE B7 43 CA>)
(   2,<2012-06-02 20:53:47.015 -0500>,<Administrator>,<TOPSPIN>,<proc1d>,<TOPSPIN 2.1>,
      <Start of raw data processing
       efp LB = 0.3 FT_mod = 6 PKNL = 1 PHC0 = 0 PHC1 = 0 SI = 128K 
       data hash MD5: 128K
       8C 18 65 C6 7D 19 C3 CD AF C8 19 D3 58 C9 F2 3D>)
(   3,<2012-06-02 20:53:48.250 -0500>,<Administrator>,<TOPSPIN>,<proc1d>,<TOPSPIN 2.1>,
      <pk PHC0 = 35.84839 PHC1 = 0 
       data hash MD5: 128K
       89 E0 D3 DC 64 D8 CF 52 78 70 EE FB CE A7 0C DC>)
(   4,<2012-06-02 20:53:48.921 -0500>,<Administrator>,<TOPSPIN>,<proc1d>,<TOPSPIN 2.1>,
      <abs ABSG = 1 
       data hash MD5: 128K
       55 CF A4 12 58 EA 9E EA 0B F2 91 36 AC 57 67 7A>)
(   5,<2012-06-02 20:53:49.000 -0500>,<Administrator>,<TOPSPIN>,<proc1d>,<TOPSPIN 2.1>,
      <abs ABSG = 2 
       data hash MD5: 128K
       EA 2E 95 7E 34 93 D5 B0 9C F5 F6 6F 36 F9 BA 6E>)
(   6,<2012-06-02 20:53:49.062 -0500>,<Administrator>,<TOPSPIN>,<proc1d>,<TOPSPIN 2.1>,
      <abs ABSG = 3 
       data hash MD5: 128K
       B8 BC CB AA 6D BC 7C C9 C4 B9 6C 6B DC 3F 1B 4A>)
(   7,<2012-06-02 20:53:49.109 -0500>,<Administrator>,<TOPSPIN>,<proc1d>,<TOPSPIN 2.1>,
      <abs ABSG = 4 
       data hash MD5: 128K
       3F 34 E1 8D 10 FA 26 6D 3A A0 08 17 BB F3 14 C9>)
(   8,<2012-06-02 20:53:49.171 -0500>,<Administrator>,<TOPSPIN>,<proc1d>,<TOPSPIN 2.1>,
      <abs ABSG = 5 
       data hash MD5: 128K
       5F FE A8 78 6D 4A 31 81 BD 68 07 81 2F D8 10 D9>)
$$ ##END=
$$ 
$$ $$ hash MD5
$$ $$ 20 DE 4F 30 DD 36 77 EB A1 17 3B 48 66 07 1D C6
##$RELAX= 
##$RELAX= 
##$RELAX= 
##$RELAX= 
##$RELAX= 
##$RELAX= 
##$RELAX= 
##$RELAX= 
$$ Bruker specific parameters
$$ [...]
##$TP07= 0
##$TPNAME0= <>
##$TPNAME1= <>
##$TPNAME2= <>
##$TPNAME3= <>
##$TPNAME4= <>
##$TPNAME5= <>
##$TPNAME6= <>
##$TPNAME7= <>
##$TPOAL= (0..7)
0.5 0.5 0.5 0.5 0.5 0.5 0.5 0.5
##$TPOFFS= (0..7)
0 0 0 0 0 0 0 0
##$TUNHIN= 0
##$TUNHOUT= 0
##$TUNXOUT= 0
##$USERA1= <user>
##$USERA2= <user>
##$USERA3= <user>
##$USERA4= <user>
##$USERA5= <user>
##$V9= 5
##$VALIST= <valist>
##$VCLIST= <CCCCCCCCCCCCCCC>
##$VD= 0
##$VDLIST= <DDDDDDDDDDDDDDD>
##$VPLIST= <PPPPPPPPPPPPPPP>
##$VTLIST= <TTTTTTTTTTTTTTT>
##$WBST= 2048
##$WBSW= 25
##$XGAIN= (0..3)
0 0 0 0
##$XL= 0
##$YL= 0
##$YMAX_a= 11892608
##$YMIN_a= -6493681
##$ZGOPTNS= <>
##$ZL1= 120
##$ZL2= 120
##$ZL3= 120
##$ZL4= 120
##$ABSF1= 14.96725
##$ABSF2= -5.58528
##$ABSG= 5
##$ABSL= 3
##$ALPHA= 0
##$AQORDER= 0
##$ASSFAC= 0
##$ASSFACI= 0
##$ASSFACX= 0
##$ASSWID= 0
##$AUNMP= <proc_prof1d_extract.lims>
##$AXLEFT= 0
##$AXNAME= <>
##$AXNUC= <1H>
##$AXRIGHT= 0
##$AXTYPE= 0
##$AXUNIT= <>
##$AZFE= 0.1
##$AZFW= 0.1
##$BCFW= 0
##$BC_mod= 0
##$BYTORDP= 0
##$COROFFS= 0
##$CY= 15
##$DATMOD= 1
##$DC= 0
##$DFILT= <>
##$DTYPP= 0
##$F1P= 0
##$F2P= 0
##$FCOR= 0.5
##$FTSIZE= 131072
##$FT_mod= 6
##$GAMMA= 0
##$GB= 0
##$INTBC= 1
##$INTSCL= 1
##$ISEN= 128
##$LB= 0.3
##$LEV0= 0
##$LPBIN= 0
##$MAXI= 10000
##$MC2= 0
##$MEAN= 0
##$ME_mod= 0
##$MI= 0
##$NCOEF= 0
##$NC_proc= -3
##$NLEV= 6
##$NOISF1= 0
##$NOISF2= 0
##$NSP= 0
##$NTH_PI= 0
##$NZP= 0
##$OFFSET= 14.96725
##$PC= 1
##$PHC0= 35.84839
##$PHC1= 0
##$PH_mod= 1
##$PKNL= yes
##$PPARMOD= 0
##$PPDIAG= 0
##$PPIPTYP= 0
##$PPMPNUM= 2147483647
##$PPRESOL= 1
##$PSCAL= 4
##$PSIGN= 0
##$PYNMP= <proc.py>
##$REVERSE= no
##$SF= 400.130005345912
##$SI= 131072
##$SIGF1= 0
##$SIGF2= 0
##$SINO= 400
##$SIOLD= 131072
##$SPECTYP= <>
##$SREGLST= <1H.CDCl3>
##$SSB= 0
##$STSI= 131072
##$STSR= 0
##$SW_p= 8223.68421052632
##$SYMM= 0
##$S_DEV= 0
##$TDeff= 65536
##$TDoff= 0
##$TI= <>
##$TILT= no
##$TM1= 0
##$TM2= 0
##$TOPLEV= 0
##$USERP1= <user>
##$USERP2= <user>
##$USERP3= <user>
##$USERP4= <user>
##$USERP5= <user>
##$WDW= 1
##$XDIM= 131072
##$YMAX_p= 506943358
##$YMIN_p= -321833584
##$CURPLOT= <Network HP LaserJet P1505>
##$CURPRIN= <$Network HP LaserJet P1505>
##$DFORMAT= <normdp>
##$LAYOUT= <+/1D_H.xwp>
##$LFORMAT= <normlp>
##$PFORMAT= <normpl>
##$SURQMSG= 1
$$ End of Bruker specific parameters
$$ ---------------------------------
##NTUPLES= NMR SPECTRUM
##VAR_NAME=  FREQUENCY,     SPECTRUM/REAL,   SPECTRUM/IMAG
##SYMBOL=    X,             R,               I
##VAR_TYPE=  INDEPENDENT,   DEPENDENT,       DEPENDENT
##VAR_FORM=  AFFN,          ASDF,            ASDF
##VAR_DIM=   131072,        131072,          131072
##UNITS=     HZ,            ARBITRARY UNITS, ARBITRARY UNITS
##FACTOR=    0.0627417313425165, 1,          1
##FIRST=     8223.62146879498, -216,         -114046
##LAST=      0,             1098,            -114529
##MIN=       0,             -321833584,      0
##MAX=       8223.62146879498, 506943358,    0
$$ Real data points
##PAGE= N=1
##DATA TABLE= (X++(R..R)), XYDATA
$$ [...]
61198A510842K2903K2946K2314K1822K0393J6043R533M248J767M9k912o040p426
$$ 1510842 1533745 1556691 1579005 1600827 1621220 1637263 1646796 1651044 1652811 1652860 1649948 1643908 1636482
61185A636482p652q835j1459j4023j5245j5257j4933j5063j5821j6438j5852j4059
$$ 1636482 1628830 1619995 1608536 1594513 1579268 1564011 1549078 1534015 1518194 1501756 1485904 1471845
61173A471845j2165j0892r912q868p858o649m752k711j807j945j463J91J448J217
$$ 1471845 1459680 1448788 1438876 1430008 1422150 1415501 1410749 1408038 1406231 1404286 1402823 1403014 1404462 1405679
61159A405679O07O19J45j844l718l207q82P31Q75Q81J281J127L62M79K156M087
$$ 1405679 1406286 1406905 1407050 1405206 1401488 1398281 1397399 1398130 1399005 1399886 1401167 1402294 1402656 1403135 1405291 1409378
61143A409378M982N156N534O450Q221J1482J5956J9978K2239K3230K4029K4518
$$ 1409378 1414360 1419516 1425050 1431500 1439721 1451203 1467159 1487137 1509376 1532606 1556635 1581153
61131A581153K3832K1949J9527J6516J2306P459M009L294M156M149K264l25k112
$$ 1581153 1604985 1626934 1646461 1662977 1675283 1682742 1686751 1690045 1694201 1698350 1700614 1700289 1698177
61118A698177l114m444o681r247j1303j2647j3642j4546j5225j5511j5682j6334
$$ 1698177 1695063 1690619 1683938 1674691 1663388 1650741 1637099 1622553 1607328 1591817 1576135 1559801
61106A559801j7543j8486j8464j8185j9105k1224k2586k1646j9191j6945j5181
$$ 1559801 1542258 1523772 1505308 1487123 1468018 1446794 1424208 1402562 1383371 1366426 1351245
61095A351245j3075j0805r508r155q125n338j553J814L920M205K251j277m659
$$ 1351245 1338170 1327365 1317857 1308702 1300577 1295239 1293686 1295500 1299420 1303625 1305876 1304599 1299940
61082A299940o974r021j1619j3850j4061j2023r076o525m740l587k817j893j20
$$ 1299940 1292966 1283945 1272326 1258476 1244415 1232392 1223316 1216791 1212051 1208464 1205647 1203754 1203634
61069A203634K763O287R600J2112J3950J5773J7941J9988K1262K1885K2612K3858
$$ 1203634 1206397 1212684 1222284 1234396 1248346 1264119 1282060 1302048 1323310 1345195 1367807 1391665
61057A391665K5499K7410K9503L1169L1517L0344K8256K5880K3601K1968K1353
$$ 1391665 1417164 1444574 1474077 1505246 1536763 1567107 1595363 1621243 1644844 1666812 1688165
61046A688165K1153K0178J8041J5303J2242Q540M313K42l703q444j4046j8894
$$ 1688165 1709318 1729496 1747537 1762840 1775082 1783622 1787935 1788177 1784474 1776030 1761984 1743090
61034A743090k1409k1934k1980k2266k2265k1460k0240j9465j9372j9142j7835
$$ 1743090 1721681 1699747 1677767 1655501 1633236 1611776 1591536 1572071 1552699 1533557 1515722
61023A515722j5770j4326j3892j3042j0742q338p671p909o508l151l00O34J273
$$ 1515722 1499952 1485626 1471734 1458692 1447950 1439612 1431941 1424032 1417524 1414373 1414073 1414707 1415980
61010A415980L403O257Q228R602J1712J4435J6404J7221J7901J9255K1029K2731
$$ 1415980 1419383 1425640 1433868 1443470 1455182 1469617 1486021 1503242 1521143 1540398 1561427 1584158
60998A584158K4359K6194K8405L1015L3959L7094M0123M2565M4126M5284M7043
$$ 1584158 1608517 1634711 1663116 1694131 1728090 1765184 1805307 1847872 1891998 1937282 1984325
60987A984325M9752N2757N5622N8643O1575O3207O3409O4070O6428O9043P0562
$$ 1984325 2034077 2086834 2142456 2201099 2262674 2325881 2389290 2453360 2519788 2588831 2659393
60976B659393P2787P8039Q4802Q9700R2965R7962J05346J11978J16427J21303
$$ 2659393 2732180 2810219 2895021 2984721 3077686 3175648 3280994 3392972 3509399 3630702
60966C630702J28785J37580J46117J55352J66442J78517J90414K02009K12529
$$ 3630702 3759487 3897067 4043184 4198536 4364978 4543495 4733909 4935918 5148447
60957E148447K20774K28277K38921K54146K72169K93073L20096L53970L91041
$$ 5148447 5369221 5597498 5836419 6090565 6362734 6655807 6975903 7329873 7720914
60948G720914M29728M73904N26943N87779O56584P38286Q35618R44581J062565
$$ 7720914 8150642 8624546 9151489 9739268 10395852 11134138 11969756 12914337 13976902
60939A3976902J194608J345046J510484J690731J899423K152008K450967K796531
$$ 13976902 15171510 16516556 18027040 19717771 21617194 23769202 26220169 29016700
60931B9016700L193005L599107L860935L749330L134246K139317J091185K93017
$$ 29016700 32209705 35808812 39669747 43419077 46553323 48692640 49783825 50076842
60923E0076842j46633k77003j68403J18121M36566N24412J53042o73398j697376
$$ 50076842 49930209 49653206 49484803 49602924 50039490 50563902 50716944 50043546 48346170
60914D8346170k597241l190030l470573l515766l398331l174550k897274k608366
$$ 48346170 45748929 42558899 39088326 35572560 32174229 28999679 26102405 23494039
60906B3494039k327565k061440j816742j598485j403880j227825j070786r35673
$$ 23494039 21166474 19105034 17288292 15689807 14285927 13058102 11987316 11051643
60898A1051643q21359p24633o44454n79159n23205m71915m26435l89264l57746
$$ 11051643 10230284 9505651 8861197 8282038 7758833 7286918 6860483 6471219 6113473
60889F113473l26860k95974k68031k43930k22342k03717j89941j80677j73592
$$ 6113473 5786613 5490639 5222608 4978678 4756336 4552619 4362678 4182001 4008409
60880D008409j67510j62268j56477j48672j39794j31650j23882j15199j06444
$$ 4008409 3840899 3678631 3522154 3373482 3233688 3102038 2978156 2862957 2756513
60871B756513r9409r3602q7223q0535p5190p0892o5807n9917n5080n1814m8738
$$ 2756513 2657104 2563502 2476279 2395744 2320554 2249662 2183855 2123938 2068858 2017044 1968306
60860A968306m5209m2085l9707l7304l4602l2230l0370k8466k6188k3546k0531
$$ 1968306 1923097 1881012 1841305 1804001 1769399 1737169 1706799 1678333 1652145 1628599 1608068
60849A608068j7889j7225j8817k0400j9806j7899j6945j7179j7100j6347j5954
$$ 1608068 1590179 1572954 1554137 1533737 1513931 1496032 1479087 1461908 1444808 1428461 1412507
60838A412507j6279j6816j7609j8866j9634j8898j7587j7544j8884k0197k0798
$$ 1412507 1396228 1379412 1361803 1342937 1323303 1304405 1286818 1269274 1250390 1230193 1209395
60827A209395k0916k0202j8228j5931j4570j3761j2467j1372j1969j3787j4798
$$ 1209395 1188479 1168277 1150049 1134118 1119548 1105787 1093320 1081948 1069979 1056192 1041394
60816A041394j4246j2846j0677p497m790m696o628p581o171l953k410j212r4J31
$$ 1041394 1027148 1014302 1003625 996128 991338 986642 980014 972433 966262 962309 959899 958687 958593 958724
60802I58724n02m14J250L319M548N170N778O324O965Q073Q793P499M503K365K528
$$ 958724 958222 957808 959058 962377 966925 972095 977873 984197 991162 999235 1008028 1015527 1020030 1022395 1024923
60787A024923L562L929M350N759O797N474K212q45k839m707p058r348j1004j2008
$$ 1024923 1028485 1032414 1036764 1042523 1049320 1054794 1057006 1056161 1053322 1048615 1041557 1032209 1021205 1009197
60773A009197j2266j1605j0377r176q056o823n947o110o839o677n068l204k528
$$ 1009197 996931 985326 974949 965773 957717 950894 944947 938837 931998 925321 920253 917049 914521
60760I14521l057l827m538n788p780r703j0779j1301j1901j2381j2018j0846r554
$$ 914521 911464 907637 903099 897311 889531 879828 869049 857748 845847 833466 821448 810602 801048
60747H01048q246o458m560l784m256m251k409K39J589R92n05j817k606k832k707
$$ 801048 792802 786344 781784 778000 773744 769493 767084 767323 768912 769904 769399 767582 764976 762144 759437
60732G59437k734k909k337n65J206J395J71p73k54J604M051O092O607N376L785
$$ 759437 756703 753794 751457 750892 752098 753493 753664 752891 752637 754241 758292 764384 770991 776367 780152
60717G80152L234L242K390P90N9Q06J752J520M1j975l720m214k907o69Q55J226
$$ 780152 783386 786628 789018 789808 789867 790673 792425 793945 793986 792011 788291 784077 781170 780501 781356 782582
60701G82582J428J934J815L43j591k397j537Q1J072P39l20q23l96j94j236k724
$$ 782582 784010 785944 787759 788102 786511 784114 782577 782658 783730 784469 784149 783326 782930 782736 781500 778776
60685G78776k933j531O8L94j034l808o577p408n756l782m030n997o857n463l538
$$ 778776 775843 774312 774380 774774 773740 769932 763355 755947 750191 746409 742379 736382 729525 724062 720524
60670G20524k614k166j583j687k824l323j663R84K158J317J20n2O53J541K346
$$ 720524 717910 715744 714161 712474 709650 706327 704664 705648 707806 709123 709243 709191 709844 711385 713731
60655G13731L034L475L562L322K938K840L434M499N218N146M809N037N956O864
$$ 713731 716765 720240 723802 727124 730062 732902 736336 740835 746053 751199 756008 761045 767001 773865
60641G73865O800N256K725N95n8M24Q39O80M03K53j36p93j010l70N07O56k44j749
$$ 773865 780665 785921 788646 789241 789183 789607 790446 791126 791529 791782 791646 790853 789843 789473 789980 790636 790392 788643
60623G88643l016l196k183j016p95j124n45J281K917L081K267J693J493P90p85
$$ 788643 785627 782431 780248 779232 778437 777313 776768 778049 780966 784047 786314 788007 789500 790290 789505
60608G89505k509l476l564l419l624m073m308m368m738n255m882l168j223k80
$$ 789505 786996 783520 779956 776537 772913 768840 764532 760164 755426 750171 745289 742121 740898 740618
60594G40618k2O17J589K064K124K556L119K728J456P14J029J220K30j500l082
$$ 740618 740596 741213 742802 744866 746990 749546 752665 755393 756849 757563 758592 759812 760042 758542 755460
60579G55460m236m792m349l063j757p30M45J560J583M11m51K02J702K607K484
$$ 755460 751224 746432 742083 739020 737263 736533 736978 738538 740121 740532 740081 740283 741985 744592 747076
60564G47076J975J845K466L478L689K332M89J4R34J463R36P52J787K881K976K798
$$ 747076 749051 750896 753362 756840 760529 762861 763350 763364 764298 765761 766697 767449 769236 772117 775093 777891
60548G77891L080K959J849J166K158L373K570J95j269q46K63J207K459M157N469
$$ 777891 780971 783930 785779 786945 789103 792476 795046 795241 793972 793126 793389 794596 797055 801212 806681
60533H06681N947O024N839N037M046M124N566O959O887N598M416M143M466M653
$$ 806681 812628 818652 824491 829528 833574 837698 843264 850223 857110 862708 867124 871267 875733 880386
60519H80386M471M536N606P368Q399P849O737O882Q849J1639J4018J5438J5933
$$ 880386 884857 889393 894999 902367 910766 918615 925352 932234 941083 952722 966740 982178 998111
60506I98111J6062J6971J9602K3627K7445K9299K8320K4930K0612J6766J3321
$$ 998111 1014173 1031144 1050746 1074373 1101818 1131117 1159437 1184367 1204979 1221745 1235066
60495A235066R143M116q8k149k871l596l861k411J04J597J799K946O602J1504
$$ 1235066 1244209 1248325 1248237 1246088 1243217 1239621 1235760 1233349 1233453 1235050 1236849 1239795 1246397 1257901
60481A257901J5535J8496K1676K5649K9744L3294L6408L9731M4063M9839N6271
$$ 1257901 1273436 1291932 1313608 1339257 1369001 1402295 1438703 1478434 1522497 1572336 1628607
60470A628607O1381O3603O3180O1191N7455N0372L9041K4728R898l594j5002k3985
$$ 1628607 1689988 1753591 1816771 1877962 1935417 1985789 2024830 2049558 2059456 2055862 2040860 2016875
60458B016875l0279l3977l5510l5215l3309l0212k6480k2250j7310j1866o729
$$ 2016875 1986596 1952619 1917109 1881894 1848585 1818373 1791893 1769643 1752333 1740467 1733738
60447A733738k372J805O836J2990J9583K5736L1076L5964M1350M8031N5780O3643
$$ 1733738 1731366 1733171 1740007 1752997 1772580 1798316 1829392 1865356 1906706 1954737 2010517 2074160
60435B074160P1294P9345Q7766R4746R8007R6796R1806Q3794P3225O0883M7920
$$ 2074160 2145454 2224799 2312565 2407311 2505318 2602114 2693920 2777714 2850939 2911822 2959742
60424B959742L5571K5467J9298J7162J7094J7536J9143K2483K5048K2984J5146
$$ 2959742 2995313 3020780 3040078 3057240 3074334 3091870 3111013 3133496 3158544 3181528 3196674
60413C196674K982j3026l3444n6374p7387r4174j08087j19763j26499j26240j21312
$$ 3196674 3199656 3186630 3153186 3096812 3019425 2925251 2817164 2697401 2570902 2444662 2323350
60402B323350j15444j09162j01047r1714q3373p6413o9489o2388n6117n0597m4858
$$ 2323350 2207906 2098744 1997697 1905983 1822610 1746197 1676708 1614320 1558203 1507606 1462748
60391A462748l9363l5614l3520l1433k8811k6541k4609k1861j8439j6098j5427
$$ 1462748 1423385 1387771 1354251 1322818 1294007 1267466 1242857 1220996 1202557 1186459 1171032
60380A171032j4865j3244j1421j0431r835q945q202q117q104p451o504n855n240
$$ 1171032 1156167 1142923 1131502 1121071 1111236 1102291 1094089 1085972 1077868 1070417 1063913 1058058 1052818
60367A052818m302l694m332o060p811q816r022q610p716o377m584k595j260j369
$$ 1052818 1048516 1044822 1040490 1034430 1026619 1017803 1008781 1000171 992455 986078 981494 978899 977639 976270
60353I76270k461l033k290j049m51l87R7J262K344K752K987L956N537O318N159
$$ 976270 973809 970776 968486 967437 966986 966599 966696 967958 970302 973054 976041 979997 985534 991852 997011
60338I97011K797J261J610K953L887M128M116L938L549L419L992M901N590O097
$$ 997011 999808 1001069 1002679 1005632 1009519 1013647 1017763 1021701 1025250 1028669 1032661 1037562 1043152 1049249
60324A049249O292N201K532K58Q12L786O237O392N282M382L631K661K247L127
$$ 1049249 1055541 1060742 1063274 1063532 1064344 1068130 1074367 1080759 1086041 1090423 1094054 1096715 1098962 1102089
60310A102089M465M854M255L790M113M808N045M139J996k98r36P61L405N266O411
$$ 1102089 1106554 1111408 1115663 1119453 1123566 1128374 1133419 1137558 1139554 1139256 1138320 1139081 1142486 1147752 1154163
60295A154163Q030J0168J1456J1312J1047J2118J4036J4980J4144J2589J1611
$$ 1154163 1162193 1172361 1183817 1195129 1206176 1218294 1232330 1247310 1261454 1274043 1285654
60284A285654J1008R479O359K329j548m852p672r902j1153j1252j0546r855j0040
$$ 1285654 1296662 1306141 1312500 1314829 1313281 1308429 1300757 1290855 1279702 1268450 1257904 1248049 1238009
60271A238009j1170j2070j1301q916o647n898o209o255n611m749l895k977k298
$$ 1238009 1226839 1214769 1203468 1194552 1187905 1182007 1175798 1169543 1163932 1159183 1155288 1152311 1150013
60258A150013k054j384Q75M380P295Q502Q824R739J1689J4109J6402J8395K0187
$$ 1150013 1147959 1146575 1147450 1151830 1159125 1167627 1176451 1186190 1197879 1211988 1228390 1246785 1266972
60245A266972K1990K3919K5778K7258K8270K8692K7950K5383K0901J4777P082
$$ 1266972 1288962 1312881 1338659 1365917 1394187 1422879 1450829 1476212 1497113 1511890 1518972
60234A518972j868j0776j8189k4178k9946l5411l8419l7185l2698k7736k3964
$$ 1518972 1517104 1506328 1488139 1463961 1434015 1398604 1360185 1323000 1290302 1262566 1238602
60223A238602k0987j7928j4888j2650j1698j1873j2581j2994j2408j0858r351
$$ 1238602 1217615 1199687 1184799 1172149 1160451 1148578 1135997 1123003 1110595 1099737 1090386
60212A090386q967r545r621q116n754m198l930l909l406l109l733m444l734j500
$$ 1090386 1081419 1071874 1062253 1054137 1048383 1044185 1040255 1036346 1032940 1029831 1026098 1021654 1017920 1016420
60198A016420P71J776J506O47k32p50n86K75J474K511K904K362J170L17P26K314
$$ 1016420 1017191 1018967 1020473 1021120 1020888 1020138 1019552 1019827 1021301 1023812 1026716 1029078 1030248 1030565 1031291 1033605
60182A033605L988M551L665K249J898L347N380N963M690L206K990L782M706N640
$$ 1033605 1037593 1042144 1045809 1048058 1049956 1053303 1058683 1064646 1069336 1072542 1075532 1079314 1084020 1089660
60168A089660O501O418N041L766M232O125P785Q401Q251P529O527O468Q338J1119
$$ 1089660 1096161 1102579 1107620 1111386 1115618 1121743 1129528 1137929 1146180 1153709 1160236 1166704 1175042 1186161
60154A186161J2903J3473J4096J4900J4526J2569J0457R444R371R767J0431J0474
$$ 1186161 1199064 1212537 1226633 1241533 1256059 1268628 1279085 1288529 1297900 1307667 1318098 1328572
60142A328572Q663N444L055K746L390L596L588L968M215L718L040K789K259N74
$$ 1328572 1337235 1342679 1345734 1348480 1351870 1355466 1359054 1363022 1367237 1370955 1373995 1376784 1379043 1379617
60128A379617j632k993l301l387l632l756l645l360k633j382l59k77n08K73K162
$$ 1379617 1377985 1374992 1371691 1368304 1364672 1360916 1357271 1353911 1351278 1349896 1349537 1349260 1348752 1349025 1351187
60113A351187L686L578K227J057R54J627K240K182J156j034m102o724p293n839
$$ 1351187 1354873 1358451 1360678 1361735 1362689 1364316 1366556 1368738 1369894 1368860 1364758 1358034 1350741 1344902
60099A344902m424m743n968o059m642l079k034q06P73J679J641K091M207P187
$$ 1344902 1340478 1335735 1329767 1323708 1319066 1315987 1313953 1313147 1313920 1315599 1317240 1319331 1323538 1330725
60085A330725R422J0335J0138Q805O405L728J704O63P49K125M073M950M084K917
$$ 1330725 1340147 1350482 1360620 1369425 1375830 1379558 1381262 1381925 1382674 1384799 1388872 1393822 1397906 1400823
60071A400823L127M279M611L696K947L489M659M995M016K688K435L759N797P309
$$ 1400823 1403950 1408229 1412840 1416536 1419483 1422972 1427631 1432626 1436642 1439330 1441765 1445524 1451321 1458630
60057A458630Q110R099J0867J2865J4155J4477J4246J4038J4267J4850J5040J4172
$$ 1458630 1466740 1475839 1486706 1499571 1513726 1528203 1542449 1556487 1570754 1585604 1600644 1614816
60045A614816J2654J1505J0862R862Q248O930O510O193M963K989J178j24j297
$$ 1614816 1627470 1638975 1649837 1659699 1667947 1674877 1681387 1687580 1692543 1695532 1696710 1696586 1695289
60032A695289k803m733o631p614p376p162q713j1946j4715j5420j4762j4339j4593
$$ 1695289 1692486 1687753 1681122 1673508 1666132 1658970 1650257 1638311 1623596 1608176 1593414 1579075 1564482
60019A564482j4881j4757j4319j3980j4479j6378j8985k0674k0771k0190j9761
$$ 1564482 1549601 1534844 1520525 1506545 1492066 1475688 1456703 1436029 1415258 1395068 1375307
60008A375307j9073j7699j6214j5020j3319j0512p657o298o522p307q031q547
$$ 1375307 1356234 1338535 1322321 1307301 1293982 1283470 1275813 1269515 1262993 1255686 1247655 1239108
59996A239108q462p575o623o480p030p464p192n819l157j96J064p6j663j356Q02
$$ 1239108 1230646 1223071 1216448 1209968 1202938 1195474 1188282 1182463 1179306 1179110 1180174 1180098 1178435 1177079 1177881
59981A177881K991M035L793K109o88k815k549o60L30o93k517l825m612n156n229
$$ 1177881 1180872 1184907 1188700 1190809 1190121 1187306 1184757 1184097 1184427 1183734 1181217 1177392 1172780 1167624 1162395
59966A162395m976n248o338p251o922n585m406m264n169o486p433p606p079n961
$$ 1162395 1157419 1152171 1145833 1138582 1131660 1126075 1121669 1117405 1112236 1105750 1098317 1090711 1083632 1077671
59952A077671m168k036o41q25k068k979k760j687m13N82J019R63Q82J159J622
$$ 1077671 1073503 1071467 1070826 1070001 1067933 1064954 1062194 1060507 1060094 1060676 1061695 1062658 1063540 1064699 1066321
59937A066321J800J431M95p93j812j880j063r7P84K156M240O207P154P026O119
$$ 1066321 1068121 1069552 1070047 1069254 1067442 1065562 1064499 1064402 1065186 1067342 1071582 1077789 1084943 1091969 1098088
59922A098088M645L175K483K303J375n57j988j748o42rN7p6p83k134k795j636
$$ 1098088 1102733 1105908 1108391 1110694 1112069 1111512 1109524 1107776 1107134 1107125 1107182 1107106 1106323 1104189 1101394 1099758
59906A099758L86J439J162M35k76q67q25p3K98k73m92O81J748P31j449k156r90
$$ 1099758 1100144 1101583 1102745 1103180 1102904 1102037 1101212 1101139 1101437 1101164 1100672 1101353 1103101 1103832 1102383 1100227 1099237
59889A099237p7n39j334j573j642j631r23K56Q32P33R28J416J239O72J205K959
$$ 1099237 1099160 1098621 1097287 1095714 1094072 1092441 1091518 1091774 1092606 1093339 1094267 1095683 1096922 1097594 1098799 1101758
59873A101758M302M564N012O444P927Q740R438J0145R917Q849Q727J0311J1940
$$ 1101758 1106060 1110624 1115636 1122080 1130007 1138747 1148185 1158330 1168247 1177096 1185823 1196134 1208074
59860A208074J2248J2184J2745J2660J0502P627O658P853R142R267Q822Q442P910
$$ 1208074 1220322 1232506 1245251 1257911 1268413 1276040 1282698 1290551 1299693 1308960 1317782 1326224 1334134
59847A334134P196O767O469N416L453J727J203J312Q00m38r74L91K871M281L595
$$ 1334134 1341330 1348097 1354566 1359982 1363435 1365162 1366365 1367677 1368477 1368039 1367065 1367456 1370327 1374608 1378203
59832A378203K272K429M215N990O723O950P313P498P112O585O531O903P249P230
$$ 1378203 1380475 1382904 1387119 1393109 1399832 1406782 1414095 1421593 1428705 1435290 1441821 1448724 1455973 1463203
59818A463203O623N375L883K602J464L24k71K20J013O52r13k324k915l353l944
$$ 1463203 1469826 1475201 1479084 1481686 1483150 1483474 1483203 1483423 1484436 1485088 1484175 1481851 1478936 1475583 1471639
59803A471639m021l653m105n605o258m505j402R11J947K617L207L223K845L001
$$ 1471639 1467618 1463965 1459860 1454255 1447997 1443492 1442090 1443001 1444948 1447565 1450772 1453995 1456840 1459841
59789A459841M001N129N609N287M579M314N360P731J0425J2538J3928J4334J2750
$$ 1459841 1463842 1468971 1474580 1479867 1484446 1488760 1494120 1501851 1512276 1524814 1538742 1553076 1565826
59776A565826Q690L506o18k661k975j987J9J968K102l65m237p503r310j0498j2227
$$ 1565826 1574516 1578022 1577404 1574743 1571768 1569781 1569800 1571768 1573870 1573505 1569268 1561765 1552455 1541957 1529730
59761A529730j4363j5526j4759j2672j0512q640o697m833l757l668m233n546p815
$$ 1529730 1515367 1499841 1485082 1472410 1461898 1453258 1446561 1441728 1437971 1434303 1430070 1424524 1416709
59748A416709j0029j0401q679o555n154l625j250N21j91k817m885n079m307l819
$$ 1416709 1406680 1396279 1387600 1381045 1375891 1372266 1371016 1371537 1371346 1368529 1363644 1358565 1354258 1350439
59734A350439l661l333k949l161m253n596o066n208l991l833m698n033m005k860
$$ 1350439 1346778 1343445 1340496 1337335 1333082 1327486 1321420 1316212 1312221 1308388 1303690 1298657 1294652 1291792
59720A291792l218m733n626n128m174l711l454k712j565o41j22M54J509K846L951
$$ 1291792 1288574 1283841 1278215 1273087 1268913 1265202 1261748 1259036 1257471 1256830 1256708 1257162 1258671 1261517 1265468
59705A265468M740N686P129Q698R803J0447J1082J1757J2081J2032J2250J3293
$$ 1265468 1270208 1275894 1283023 1291721 1301524 1311971 1323053 1334810 1346891 1358923 1371173 1384466
59693A384466J4978J6502J6891J5522J2803J0172Q802Q302P482O087M939M412
$$ 1384466 1399444 1415946 1432837 1448359 1461162 1471334 1480136 1488438 1495920 1502007 1506946 1511358
59681A511358L884K871J652M01j254l355n122n833n543m743l914l630m204n028
$$ 1511358 1515242 1518113 1519765 1520166 1518912 1515557 1510435 1504602 1499059 1494316 1490402 1486772 1482568 1477540
59667A477540n063m242l514l386l351k972k503k211j994j903j959j468K45K377
$$ 1477540 1472477 1468235 1464721 1461335 1457984 1455012 1452509 1450298 1448304 1446401 1444442 1442974 1443219 1445596
59653A445596L462L715M787O818P835O968O144P260R534J1315J2852J5231J7840
$$ 1445596 1449058 1452773 1457560 1464378 1472213 1479181 1485325 1492585 1502119 1513434 1526286 1541517 1559357
59640A559357J9030J8601J7777J7143J6340J5400J4724J3941J2243R793P553N861
$$ 1559357 1578387 1596988 1614765 1631908 1648248 1663648 1678372 1692313 1704556 1714349 1721902 1727763
59628A727763M217K352N10j086k274k832l011l566m553m998m723n308p805j0612
$$ 1727763 1731980 1734332 1734842 1733756 1731482 1728650 1725639 1722073 1717520 1712522 1707799 1702491 1694686 1684074
59614A684074j1460j0666j0247j0406r330o483l587j780n3K455M620N184M981
$$ 1684074 1672614 1661948 1651701 1641295 1631965 1625482 1621895 1620115 1620062 1622517 1627137 1632321 1637302
59601A637302N710P470R065J0157J1539J3340J4428J3997J2685J1493J0189P620
$$ 1637302 1643012 1650482 1659547 1669704 1681243 1694583 1709011 1723008 1735693 1747186 1757375 1764995
59589A764995L385j521n862r300j2170j4822j7738k1659k6540l0625l1680k9372
$$ 1764995 1768380 1766859 1760997 1751697 1739527 1724705 1706967 1685308 1658768 1628143 1596463 1567091
59577A567091k5560k2242k0045j8763j8104j7449j6028j4009j2628j2681j3665
$$ 1567091 1541531 1519289 1499244 1480481 1462377 1444928 1428900 1414891 1402263 1389582 1375917
59566A375917j4876j6316j7918j8926j8824j8057j7156j5983j4502j3307j2644
$$ 1375917 1361041 1344725 1326807 1307881 1289057 1271000 1253844 1237861 1223359 1210052 1197408
59555A197408j1915j0873j0127r628q059n030k477k160k908k242o1J390Q96m07
$$ 1197408 1185493 1174620 1164493 1154865 1146806 1141776 1139299 1137139 1134231 1131989 1131928 1133318 1134214 1133807
59541A133807j177j482j746j626p12N06J045L93j139k718l596l683l348k619j256
$$ 1133807 1132630 1131148 1129402 1127776 1127064 1127570 1128615 1129008 1127869 1125151 1121555 1117872 1114524 1111905 1110649
59526A110649K09N18n63j541j228m27n80j627k495k948l570m437n202n968o754
$$ 1110649 1110858 1111376 1110813 1109272 1108044 1107617 1107037 1105410 1102915 1099967 1096397 1091960 1086758 1080790 1074036
59511A074036o583m585j602N34J066M05j167l342m792m179k111n84m39p53o24
$$ 1074036 1067453 1062868 1061266 1061800 1062866 1063271 1062104 1058762 1053970 1049791 1047680 1047096 1046657 1045904 1045280
59496A045280j2J135K956M644M933M051L826N281P362Q596R050R886J1653J3626
$$ 1045280 1045268 1046403 1049359 1054003 1058936 1062987 1066813 1072094 1079456 1088052 1097102 1106988 1118641 1132267
59482A132267J4724J4868J5349J7431K0593K3098K4480K5901K7194K5621J9509
$$ 1132267 1146991 1161859 1177208 1194639 1215232 1238330 1262810 1288711 1315905 1341526 1361035
59471A361035J1594O140L664J364j786l715l247k186k163k291j469q52k042m484
$$ 1361035 1372629 1378769 1382433 1383797 1382011 1378296 1375049 1372863 1370700 1368409 1366940 1366088 1364046 1359562
59457A359562o489p647q524r132r451j0608j3547j6818j7613j5231j2090j0839
$$ 1359562 1353073 1345426 1336902 1327770 1318319 1307711 1294164 1277346 1259733 1244502 1232412 1221573
59445A221573j1516j2228j1791j0729r835q828o960m462k432j342n31M90J159
$$ 1221573 1210057 1197829 1186038 1175309 1165474 1156646 1149686 1145224 1142792 1141450 1140919 1141409 1142568
59432A142568R86P31J575L592N846P595Q518Q286P010N751N511N816N285L559
$$ 1142568 1143554 1144285 1145860 1149452 1155298 1162893 1171411 1179697 1186707 1192458 1197969 1203785 1209070 1212629
59418A212629J808J362K417M006M697L743K011J188J593J626Q1k025k912k272
$$ 1212629 1214437 1215799 1218216 1222222 1226919 1230662 1232673 1233861 1235454 1237080 1237161 1235136 1232224 1229952
59404A229952r08O67J948J990R55J042L862P817J0104J0457J0686J1266J1035
$$ 1229952 1229044 1229711 1231659 1233649 1234604 1235646 1239508 1247325 1257429 1267886 1278572 1289838 1300873
59391A300873R843Q823Q060O539M559L638L776L235J383o77k611n365q513r802
$$ 1300873 1310716 1319539 1327599 1334138 1338697 1342335 1346111 1349346 1350729 1350052 1347441 1342076 1333563 1323761
59377A323761q415o339n377m977m164l351k789j234K083N672P527P672P779R281
$$ 1323761 1315346 1309007 1303630 1298653 1294489 1291138 1288349 1287115 1289198 1294870 1302397 1310069 1317848 1327129
59363A327129J2556J6850K0278K1248K0518K0532K2343K4700K6477K8189L0609
$$ 1327129 1339685 1356535 1376813 1398061 1418579 1439111 1461454 1486154 1512631 1540820 1571429
59352A571429L3757L7486M0775M0150L1890J7128K185p631j2243j3827j2823q999
$$ 1571429 1605186 1642672 1683447 1723597 1755487 1772615 1774800 1767169 1754926 1741099 1728276 1719277
59340A719277l489K832J0614J8787K2386J7175N265o928j5308j9941k1704k0855
$$ 1719277 1715788 1718620 1729234 1748021 1770407 1787582 1792847 1785919 1770611 1750670 1728966 1708111
59328A708111j8684j7226j6705j5621j3537j1553r971p864n252l488k940k381
$$ 1708111 1689427 1672201 1655496 1639875 1626338 1614785 1604814 1596950 1591698 1588210 1585270 1582889
59316A582889j338j080k345l674l179q72J714L425M123M048L487L049L688O026
$$ 1582889 1581551 1580471 1578126 1574452 1571273 1570401 1572115 1575540 1579663 1583711 1587198 1590247 1593935 1599961
59302A599961R432J2087J2584J1554J0956J1717J3031J4163J5543J7425J8906
$$ 1599961 1609393 1621480 1634064 1645618 1656574 1668291 1681322 1695485 1711028 1728453 1747359
59291A747359J9386J9708K0710K1841K2500K3478K5384K6799K5892K3179K0751
$$ 1747359 1766745 1786453 1807163 1829004 1851504 1874982 1900366 1927165 1953057 1976236 1996987
59280A996987J9280J7706J5404J2668R192M192j762o867j0441j3612j7306k1030
$$ 1996987 2016267 2033973 2049377 2062045 2071237 2075429 2073667 2066800 2056359 2042747 2025441 2004411
59268B004411k4096k6619k8700k9894l0142l0196l0433l0208k9013k7550k6796
$$ 2004411 1980315 1953696 1924996 1895102 1864960 1834764 1804331 1774123 1745110 1717560 1690764
59257A690764k6578k5812k4008k1976k0912k0979k1036j9932j7958j6516j6242
$$ 1690764 1664186 1638374 1614366 1592390 1571478 1550499 1529463 1509531 1491573 1475057 1458815
59246A458815j6154j5002j2740j0110p446m733k313n77Q08K560M815P157R391
$$ 1458815 1442661 1427659 1414919 1404809 1397363 1392630 1390317 1389740 1390548 1393108 1397923 1405080 1414471
59233A414471J1736J4517J8079K2372K5957K6072K0903J1748K163m970q953j0407
$$ 1414471 1426207 1440724 1458803 1481175 1507132 1533204 1554107 1565855 1568018 1563048 1554095 1543688
59221A543688j0054q632p002n798m891l442o64L219O898R280J0768J2556J4785
$$ 1543688 1533634 1525002 1518000 1512202 1507311 1503869 1503205 1506424 1513322 1522602 1533370 1545926 1560711
59208A560711J6393J6843J6851J7023J6840J5569J3094R435M649j92l132l420
$$ 1560711 1577104 1593947 1610798 1627821 1644661 1660230 1673324 1682759 1687408 1687216 1684084 1680664
59196A680664k450j903k027k537l755n698p245p446o824o198n316l873k763k772
$$ 1680664 1678214 1676311 1674284 1671747 1667992 1662294 1655049 1647603 1640779 1634581 1629265 1625392 1622629 1619857
59182A619857k955j831N08K785M266M723L646J104j272j939j580k116m105o582
$$ 1619857 1616902 1615071 1615579 1618364 1622630 1627353 1630999 1632103 1630831 1628892 1627312 1625196 1621091 1614509
59168A614509q911j1135j2895j3695j3993j4562j5067j4709j3886j3660j3937
$$ 1614509 1605598 1594463 1581568 1567873 1553880 1539318 1524251 1509542 1495656 1481996 1468059
59157A468059j3669j2591j1223r552p320n318m619m688m015k517j499j211l83
$$ 1468059 1454390 1441799 1430576 1421024 1413704 1408386 1403767 1399079 1395064 1392547 1391048 1389837 1389454
59144A389454J442K935L050K598L049M805P263R643J1267J1770J1547J1449J1762
$$ 1389454 1390896 1393831 1396881 1399479 1402528 1407333 1414596 1424239 1435506 1447276 1458823 1470272 1482034
59131A482034J1948J1441J0255Q942Q255Q479Q704P476M653J806J49q21j904k858
$$ 1482034 1493982 1505423 1515678 1524620 1532875 1541354 1550058 1557534 1562187 1563993 1564142 1563321 1561417 1558559
59117A558559l709n811r733j3361j4310j3344j3090j4002j4098j2375r977p976
$$ 1558559 1554850 1549039 1539306 1525945 1511635 1498291 1485201 1471199 1457101 1444726 1434749 1426773
59105A426773o334n326n708o977p448o554n445m962m805m978o115p944r184r451
$$ 1426773 1420439 1415113 1409405 1402428 1394980 1388426 1382981 1378019 1373214 1368236 1362121 1354177 1344993 1335542
59091A335542r596r797r189p953p813r571j1722j2395j1449j0022r184r496j0607
$$ 1335542 1325946 1316149 1306960 1299007 1291194 1281623 1269901 1257506 1246057 1236035 1226851 1217355 1206748
59078A206748j0972r330o678n105m631l192j95K320L029L576N985R543J2012J2613
$$ 1206748 1195776 1186446 1179768 1174663 1170032 1166840 1166645 1168965 1171994 1175570 1181555 1191098 1203110 1215723
59064A215723J2218J1628J1198J1471J2772J4643J6691J9350K2793K5778K6734
$$ 1215723 1227941 1239569 1250767 1262238 1275010 1289653 1306344 1325694 1348487 1374265 1400999
59053A400999K5673K4055K3000K2338K1211J9046J6103J3456J2145J2056J1943
$$ 1400999 1426672 1450727 1473727 1496065 1517276 1536322 1552425 1565881 1578026 1590082 1602025
59042A602025J0669Q163N192K667R79m76k867o237q755q768p200o424o955o927
$$ 1602025 1612694 1620857 1626049 1628716 1629695 1629219 1626352 1620115 1611360 1602592 1595392 1588968 1582013 1575086
59028A575086n171l040k511l786n645p210q499r953j1930j4151j5626j5804j5645
$$ 1575086 1569915 1566875 1564364 1560578 1554933 1547723 1539224 1529271 1517341 1503190 1487564 1471760 1456115
59015A456115j6402j7467j6890j4256j1502j0340j0322j0177r706r478r575r600
$$ 1456115 1439713 1422246 1405356 1391100 1379598 1369258 1358936 1348759 1339053 1329575 1320000 1310400
59003A310400r313q710p983p610p854q065p398o191n549n535n043l684k446k076
$$ 1310400 1301087 1292377 1284394 1276784 1268930 1260865 1253467 1247276 1241727 1236192 1231149 1227465 1225019 1222943
58989A222943k066j690r12J65J581K867L243K879K800L222L223K437J758J862
$$ 1222943 1220877 1219187 1218275 1218440 1220021 1222888 1226131 1229010 1231810 1235032 1238255 1240692 1242450 1244312
58975A244312K293K590L144M278N623O946Q559J0500J2412J4491J7346K0486K2402
$$ 1244312 1246605 1249195 1252339 1256617 1262240 1269186 1277745 1288245 1300657 1315148 1332494 1352980 1375382
58962A375382K2656K2493K2765K2737K1551J9448J6683J2676P400K421o87k166
$$ 1375382 1398038 1420531 1443296 1466033 1487584 1507032 1523715 1536391 1543791 1546212 1545525 1543359
58950A543359l280m349m562l265q13J601K699K278J641K180L550M166L296J621
$$ 1543359 1540079 1535730 1531168 1527903 1527090 1528691 1531390 1533668 1535309 1537489 1541039 1545205 1548501 1550122
58936A550122j52j815k980l437m222o590r758j1455j1006j0042r769r515q539
$$ 1550122 1549970 1548155 1545175 1541738 1537516 1530926 1521168 1509713 1498707 1488665 1478896 1469381 1460842
58923A460842p274o007m210k076p81l45Q64L487N959P197Q469J1044J3735J4562
$$ 1460842 1453568 1447561 1443351 1441275 1440494 1440149 1441013 1444500 1450459 1457656 1466125 1477169 1490904 1505466
58909A505466J3609J2498J2015J1803J1562J1143J0088Q215O076M104K107R2j475
$$ 1505466 1519075 1531573 1543588 1555391 1566953 1578096 1588184 1596399 1602475 1606579 1608686 1608778 1607303
58896A607303k842n044q203j1201j3633j6332j9108j9982j8100j5650j5141j6125
$$ 1607303 1604461 1599417 1591214 1580013 1566380 1550048 1530940 1510958 1492858 1477208 1462067 1445942
58884A445942j6268j4618j2147r933q348p330o269m300j676N1O8n51o58p58j850
$$ 1445942 1429674 1415056 1402909 1392976 1384628 1377298 1371029 1366729 1365053 1365104 1365172 1364621 1363963 1363205 1361355
58869A361355l600m863n065m190k530j275k070m791o999o671m456k319j207r04
$$ 1361355 1357755 1352892 1347827 1343637 1341107 1339832 1337762 1332971 1325972 1319301 1314845 1312526 1311319 1310415
58855A310415q88k59J746M256N175M106L301M686P529J0179J2249J3870J4616
$$ 1310415 1309527 1309268 1311014 1315270 1320445 1324551 1327852 1332538 1340067 1350246 1362495 1376365 1390981
58842A390981J4815J6051J8715K0759K0641J9841K0434K1828K2120K1322K0997
$$ 1390981 1405796 1421847 1440562 1461321 1481962 1501803 1522237 1544065 1566185 1587507 1608504
58831A608504K1645K2605K3674K4999K6014K6157K5839K5373K4032K1553J9221
$$ 1608504 1630149 1652754 1676428 1701427 1727441 1753598 1779437 1804810 1828842 1850395 1869616
58820A869616J7921J6515J3871J0961R081P458M801J802j48j637m201p639j0453
$$ 1869616 1887537 1904052 1917923 1928884 1937965 1945423 1950224 1952026 1951878 1950241 1946040 1938401 1927948
58807A927948j2199j3344j3754j3428j3756j5889j8762k0723k2096k3862k5112
$$ 1927948 1915749 1902405 1888651 1875223 1861467 1845578 1826816 1806093 1783997 1760135 1735023
58796A735023k4460k3112k3631k6026k7705k7165k5342k3444k1720k0407j9747
$$ 1735023 1710563 1687451 1663820 1637794 1610089 1582924 1557582 1534138 1512418 1492011 1472264
58785A472264j9035j7434j5613j4945j5434j6079j6731j7660j7933j6341j3589
$$ 1472264 1453229 1435795 1420182 1405237 1389803 1373724 1356993 1339333 1321400 1305059 1291470
58774A291470j1524j0457r231p557o269n478m524l568l308l269k309p14J03n7
$$ 1291470 1279946 1269489 1260258 1252701 1246432 1240954 1236430 1232862 1229554 1226285 1223976 1223262 1223365 1223308
58760A223308N3J039K277L349M432N247N055L898K593J639J089J099J495J365
$$ 1223308 1223361 1224400 1226677 1230026 1234458 1239705 1244760 1248658 1251251 1252890 1253979 1255078 1256573 1257938
58746A257938Q4j772l436m797n449m465k380j664l450n541n593m567m629n280
$$ 1257938 1258022 1256250 1252814 1248017 1242568 1238103 1235723 1234059 1230609 1225068 1219475 1214908 1210279 1204999
58732A204999m443k181l31Q08K662N611Q501J0605J1908J2047J1017J0210J0676
$$ 1204999 1200556 1198375 1198044 1198852 1201514 1207125 1215626 1226231 1238139 1250186 1261203 1271413 1282089
58719A282089J1387J1246J1519J3669J6012J5499J1930P668L991N22k622n019
$$ 1282089 1293476 1304722 1316241 1329910 1345922 1361421 1373351 1381019 1385010 1385532 1382910 1377891
58707A377891p528j0797j3120j2730j1224j1550j3470j4366j3702j3030j2407
$$ 1377891 1370363 1359566 1346446 1333716 1322492 1310942 1297472 1283106 1269404 1256374 1243967
58696A243967j0629q563q230q763p262l718j171q39r06n09q36j740j077J660M539
$$ 1243967 1233338 1224775 1216545 1207782 1200520 1196802 1195631 1194792 1193886 1193377 1192541 1190801 1189724 1191384 1195923
58681A195923O715R257J1921J2793J1891J1589J2603J3156J2832J3443J5107J5391
$$ 1195923 1202638 1211895 1223816 1236609 1248500 1260089 1272692 1285848 1298680 1312123 1327230 1342621
58669A342621J3579J1913J1254R481N896L292L528M580M193L202K978K806K278
$$ 1342621 1356200 1368113 1379367 1388848 1394744 1398036 1401564 1406144 1410337 1413539 1416517 1419323 1421601
58656A421601L229O663J0157J0784Q540M946O50l560n955o417p641j1561j6588
$$ 1421601 1424830 1431493 1441650 1452434 1460974 1465920 1466570 1463010 1457055 1450638 1442997 1431436 1414848
58643A414848k0374k3078k5639k7195k6865k6317k7626k9820l0097k7674k4263
$$ 1414848 1394474 1371396 1345757 1318562 1291697 1265380 1237754 1207934 1177837 1150163 1125900
58632A125900k1365j9051j6974j5045j3299j2059j1778j2088j1774j0179p869
$$ 1125900 1104535 1085484 1068510 1053465 1040166 1028107 1016329 1004241 992467 982288 974419
58621I74419n641l868k872k674k369j209N1L41L30J289K633L016L216M907P100
$$ 974419 968778 964910 962038 959364 956995 955786 955837 956178 956508 957797 960430 963446 966662 971569 978669
58606I78669P323O248P164J0397J2343J1134R140Q274O744K727k101n186o598
$$ 978669 985992 992240 999404 1009801 1022144 1033278 1042418 1050692 1057436 1060163 1058062 1052876 1046278
58593A046278p664q540r138j0185j1522j1511r706p918p263o635n362m721n218
$$ 1046278 1038614 1030074 1020936 1010751 999229 987718 978012 970094 962831 956196 950834 946113 940895
58580I40895n139l461j667r93n03M40N89n90j400q16l36j089j790j328p34q11
$$ 940895 935756 932295 930628 929635 929132 929572 930161 929571 928171 927355 927019 925930 924140 922812 922078 921267
58564I21267o10j6q25l169l855o86M210P602R094R637Q955O962N263M724L863
$$ 921267 920657 920641 919816 916647 912792 912106 916316 923918 933012 942649 951604 958566 963829 968553 972416
58549I72416J824M22R96J886J448R29J802K808K320J363J653K789L682M516N143
$$ 972416 974240 974662 975658 977544 978992 979921 981723 984531 986851 988214 989867 992656 996338 1000854 1005997
58534A005997M143J814J347M511Q798J1334J2789J4727J6101J5496J4276J4280
$$ 1005997 1010140 1011954 1013301 1017812 1026610 1037944 1050733 1065460 1081561 1097057 1111333 1125613
58522A125613J4784J4570J4577J5617J6068J4778J3677J4483J5587J5259J5102
$$ 1125613 1140397 1154967 1169544 1185161 1201229 1216007 1229684 1244167 1259754 1275013 1290115
58511A290115J6906J9024J9523K0102K2897K6088K6867K6442K7814L0728L2960
$$ 1290115 1307021 1326045 1345568 1365670 1388567 1414655 1441522 1467964 1495778 1526506 1559466
58500A559466L4572L6459L6678L2798K6389K0840J6070R777K619k428n035p645
$$ 1559466 1594038 1630497 1667175 1699973 1726362 1747202 1763272 1773049 1775668 1773240 1768205 1760560
58488A760560j1229j4696j7726k0569k2012k1143k0145k1710k4801k6608k7347
$$ 1760560 1749331 1734635 1716909 1696340 1674328 1653185 1633040 1611330 1586529 1559921 1532574
58477A532574k9140l1340l1356k9318k7727k6971k5233k2422k0177j8301j5120
$$ 1532574 1503434 1472094 1440738 1411420 1383693 1356722 1331489 1309067 1288890 1270589 1255469
58466A255469j1231r165r357r846r844j0226j0711r987q431p611p215n665l396
$$ 1255469 1244238 1235073 1225716 1215870 1206026 1195800 1185089 1175102 1166671 1159060 1151845 1146180 1142784
58453A142784k441l003l426l253l375l637l149k499k724k781j018J500K192R43
$$ 1142784 1140343 1137340 1133914 1130661 1127286 1123649 1120500 1118001 1115277 1112496 1111478 1112978 1115170 1116113
58439A116113p2P6N65J158K231L115L065L120M458O052O540O941Q677J0626J1222
$$ 1116113 1116041 1116117 1116682 1117840 1120071 1123186 1126251 1129371 1133829 1139881 1146421 1153362 1162039 1172665 1183887
58424A183887J1801J4377J7731J9343J9675K0744K1939K1235J9340J8475J8055
$$ 1183887 1195688 1210065 1227796 1247139 1266814 1287558 1309497 1330732 1350072 1368547 1386602
58413A386602J5575J0911O007J341l523p172q203q712j1558j5198j5501j1953
$$ 1386602 1402177 1413088 1419095 1420436 1416913 1409741 1401538 1392826 1381268 1366070 1350569 1338616
58401A338616p717m407j162J794L189L960O274R502J1071J0719J0070Q831N631
$$ 1338616 1330899 1326492 1325330 1327124 1330313 1334273 1340547 1350049 1361120 1371839 1381909 1390740 1396371
58388A396371J844J43j78k133n773q298q877r129r230p877n700m584m075k585
$$ 1396371 1398215 1398358 1398180 1396047 1390274 1381976 1373099 1363970 1354740 1346863 1341163 1336579 1332504 1329919
58374A329919j212k065l572k235J565M202M787N726P749R153R763J0956J1830
$$ 1329919 1328707 1326642 1323070 1320835 1322400 1326602 1331389 1337115 1344864 1354017 1363780 1374736 1386566
58361A386566R952N870K602R53n42j766j627j750m746r331j1830j1847j1769j1527
$$ 1386566 1396518 1402388 1404990 1405943 1405401 1403635 1402008 1400258 1395512 1386181 1374351 1362504 1350735 1339208
58347A339208r194n953n127o429o430m412k694j606O76L669N073N293O472P805
$$ 1339208 1330014 1324061 1318934 1312505 1306075 1301663 1298969 1297363 1298039 1301708 1306781 1312074 1318546 1326351
58333A326351P027N539O543R031R370P752P114O873M251Q72R56L612M044K134
$$ 1326351 1333378 1338917 1345460 1354491 1363861 1371613 1378727 1385600 1389851 1390723 1391679 1395291 1399335 1401469
58319A401469K567O346R414J0101J0834J2017J1353R707J0538J2923J2333Q936
$$ 1401469 1404036 1410382 1419796 1429897 1440731 1452748 1464101 1473808 1484346 1497269 1509602 1518538
58307A518538P824J0264J2114J1804J2364J4437J4802J3283J3728J6579J7648
$$ 1518538 1526362 1536626 1548740 1560544 1572908 1587345 1602147 1615430 1629158 1645737 1663385
58296A663385J5717J4250J4255J2667R160P284P498O444M287N267R601J2586J2994
$$ 1663385 1679102 1693352 1707607 1720274 1729434 1736718 1744216 1750660 1754947 1760214 1769815 1782401 1795395
58283A795395J4507J7567J8118J6063J6512K0556K3176K2430K2347K4407K4640
$$ 1795395 1809902 1827469 1845587 1861650 1878162 1898718 1921894 1944324 1966671 1991078 2015718
58272B015718K1776K0002K0872K0554J7704J6073J6787J6044J2902J1294J2070
$$ 2015718 2037494 2057496 2078368 2098922 2116626 2132699 2149486 2165530 2178432 2189726 2201796
58261B201796J1349Q743Q668J1404J1870R427R630J3915J7028J7131J8731K2998
$$ 2201796 2213145 2221888 2230556 2241960 2253830 2263257 2272887 2286802 2303830 2320961 2339692 2362690
58249B362690K5105K4045K5062K9371L1691L0902L2587L7862M0503L8585L7949
$$ 2362690 2387795 2411840 2436902 2466273 2497964 2528866 2561453 2599315 2639818 2678403 2716352
58238B716352M0554M0683L6535L4130L5634L5448L2150L2307L7944M2228M2275
$$ 2716352 2756906 2797589 2834124 2868254 2903888 2939336 2971486 3003793 3041737 3083965 3126240
58227C126240M4036M9613N2479N0452N0539N5409N8150N6132N6592O2453O6406
$$ 3126240 3170276 3219889 3272368 3322820 3373359 3428768 3486918 3543050 3599642 3662095 3728501
58216C728501O5400O6928P4065P8778P7466P8541Q6652R4015R5690R8693J07306
$$ 3728501 3793901 3860829 3934894 4013672 4091138 4169679 4256331 4350346 4446036 4544729 4652035
58205D652035J14209J15265J18250J27618J35494J37145J40245J49321J56562
$$ 4652035 4766244 4881509 4999759 5127377 5262871 5400016 5540261 5689582 5846144
58196E846144J57570J60219J68157J72441J69716J71208J82743J93941J98451
$$ 5846144 6003714 6163933 6332090 6504531 6674247 6845455 7028198 7222139 7420590
58187G420590K06100K22968K39038K48637K63075K89002L14583L31995L52790
$$ 7420590 7626690 7849658 8088696 8337333 8600408 8889410 9203993 9535988 9888778
58178I888778L85229M17534M40271M64125M98396N33679N63534O00724O53531
$$ 9888778 10274007 10691541 11131812 11595937 12094333 12628012 13191546 13792270 14445801
58169A4445801P09068P58778Q15821Q87540R57018J013272J072609J147470J223193
$$ 14445801 15154869 15913647 16729468 17617008 18574026 19587298 20659907 21807377 23030570
58160B3030570J290169J368825J475757J595790J715499J851675K016335K187804
$$ 23030570 24320739 25689564 27165321 28761111 30476610 32328285 34344620 36532424
58152C6532424K349431K522245K726218K947948L183210L469744L837976M273236
$$ 36532424 38881855 41404100 44130318 47078266 50261476 53731220 57569196 61842432
58144F1842432M768506N364185O087954O909475P806742Q817605R970841J1238452
$$ 61842432 66610938 71975123 78063077 84972552 92779294 101596899 111567740 122806192
58136A22806192J2618993J4178079J5924405J7750486J9607284K1641847K4072392
$$ 122806192 135425185 149603264 165527669 183278155 202885439 224527286 248599678
58129B48599678K7085461L0917973L5560786L9787365M0689787L5185807K2712363
$$ 248599678 275685139 306603112 342163898 381951263 422641050 457826857 480539220
58122D80539220O283780r479794k1346369k8602525l2016785l2571913l1146042
$$ 480539220 486823000 477343206 455996837 427394312 395377527 362805614 331659572
58115C31659572k8561029k5389981k1914019j8509181j5851174j4466584j4205399
$$ 331659572 303098543 277708562 255794543 237285362 221434188 206967604 192762205
58108A92762205j4387652j4412001j4072627j3405767j2488518j1418864j0316082
$$ 192762205 178374553 163962552 149889925 136484158 123995640 112576776 102260694
58101A02260694r254691q251077p323226o501656n782964n135006m550523m046818
$$ 102260694 93006003 84754926 77431700 70930044 65147080 60012074 55461551 51414733
58093E1414733l618658l239869k905565k628449k400071k196670k016080j870446
$$ 51414733 47796075 44556206 41650641 39022192 36622121 34425451 32409371 30538925
58085C0538925j750371j632730j516267j415050j324847j229311j131866j049219
$$ 30538925 28788554 27155824 25639557 24224507 22899660 21670349 20538483 19489264
58077A9489264r80017r10102q41872p88883p47358p01435o51742o12337n84142
$$ 19489264 18509247 17599145 16757273 15968390 15221032 14519597 13867855 13255518 12671376
58068A2671376n56245n28570n09310m94594m73596m49117m31618m18061l97772
$$ 12671376 12115131 11586561 11077251 10582657 10109061 9659944 9228326 8810265 8412493
58059H412493l73698l56657l43930l24513l00706k83889k73257k58852k41502
$$ 8412493 8038795 7682138 7338208 7013695 6712989 6429100 6155843 5896991 5655489
58050E655489k30077k22799k10751j96574j90568j90996j86690j76822j70291
$$ 5655489 5425412 5202613 4991862 4795288 4604720 4413724 4227034 4050212 3879921
58041C879921j67545j60502j48917j40149j33984j23649j10633j03074j00626
$$ 3879921 3712376 3551874 3402957 3262808 3128824 3005175 2894542 2791468 2690842
58032B690842r5682q8159q4619q4084p9079o9821o3586o0997n6195m9387m6302
$$ 2690842 2595160 2507001 2422382 2338298 2259219 2189398 2125812 2064815 2008620 1959233 1912931
58021A912931m6353m3981m0409m1470m5266m4431l9367l6985l7742l6116l2442
$$ 1912931 1866578 1822597 1782188 1740718 1695452 1651021 1611654 1574669 1536927 1500811 1468369
58010A468369l1895l2962k9315k2349j9694k1904k2384j9960j9754k1992k1545
$$ 1468369 1436474 1403512 1374197 1351848 1332154 1310250 1287866 1267906 1248152 1226160 1204615
57999A204615j8588j8510k1247k1478j9201j9497k2096k1805j8976j8784k0496
$$ 1204615 1186027 1167517 1146270 1124792 1105591 1086094 1063998 1042193 1023217 1004433 983937
57988I83937j8441j3574j2872j6721j7960j4560j2439j4135j4990j2678j0908
$$ 983937 965496 951922 939050 922329 904369 889809 877370 863235 848245 835567 824659
57977H24659j1523j1690j0748j1560j3546j2519q723p153q874r827r045j0003
$$ 824659 813136 801446 790698 779138 765592 753073 744350 737197 728323 718496 709451 699448
57965F99448j2995j4071j2480j1537j1465r089n167m175o101o269l989l527n656
$$ 699448 686453 672382 659902 648365 636900 627811 622644 618469 612368 606099 602110 598583 592927
57952E92927o163l891k643l812m460l727m031m973l261L52J247j026j949j19R92
$$ 592927 586764 582873 580230 576418 571958 568231 564200 559227 555966 556318 557565 556539 554590 554471 555463
57937E55463J94L57K024K318J225K003M362M141R10j003m5P22K38R29K579J677
$$ 555463 555657 556014 558038 560356 561581 563584 567946 572087 572997 571994 571949 572671 572909 573838 576417 578094
57921E78094j796l693k902k682l784l112l08J109M16P75K541K395K89K71K896
$$ 578094 576298 572605 569703 567021 563237 560125 559817 560926 561342 562117 564658 567053 567342 567613 570509
57906E70509L856J679j16r3j105l687m385k680k700n745p840p003o314p374p387
$$ 570509 574365 576044 575928 575835 574730 571043 566658 563978 561278 555533 547693 540690 534376 527002 519615
57891E19615n269m176n312n525l689l115m962n527l041r70j498j733N02K921L936
$$ 519615 514346 510170 504858 499333 495644 492529 487567 482040 478999 478029 476531 474798 475300 478221 482157
57876D82157N738Q982J0123P609N296O210P952P707O710O326M708R67j971k260
$$ 482157 487895 496877 507000 514609 519905 526115 534067 541774 548484 554810 559518 560485 558514 556254
57862E56254k403m336n746m619l169l646m406l584k766l618m428l329j607q93
$$ 556254 553851 549515 543769 539150 535981 532335 527929 524345 521579 517961 513533 510204 508597 507704
57848E07704l94O10R70O51J809M489N252K599j79j40J043O91p22j723k650l733
$$ 507704 507310 507920 508890 509541 511350 515839 521091 523690 523511 523371 524414 525105 524383 522660 520010 516277
57832E16277l577j904o13k91R07L222M011K311O38M12k33k086k798j444q52k811
$$ 516277 512700 510796 510183 509892 510799 514021 518032 520343 520981 521393 521160 519074 516276 514832 513980 511169
57816E11169n102n704n885o704o633n125m430n305n248l377k684m664o141m417
$$ 511169 506067 500363 494478 487774 481141 476016 471586 466281 461033 457656 454972 450308 444167 439750
57802D39750j360N69K147M288N387M833N096P251Q599P690P252Q943R872Q036
$$ 439750 438390 438959 441106 445394 450781 455614 460710 467961 476560 484250 491502 500445 510317 518353
57788E18353O534Q118R930Q192M299J678J24k003l320k041l73j509m403n864n787
$$ 518353 524887 533005 542935 551127 555426 557104 557228 555225 551905 549864 549491 547982 543579 537715 531928
57773E31928o184o986o775o040o105o326n432m136l713l744l567l721l937k520
$$ 531928 525744 518758 511983 505943 499838 493512 488080 483944 480231 476487 472920 469199 465262 462742
57759D62742Q7M40k639n481n101l694m255n465m762l170k902l035j835q11k387
$$ 462742 462829 463269 460630 455149 450048 446354 442099 436634 431872 428702 425800 422765 420930 420119 417732
57744D17732n579p668q113p583n569k299m25j357k532j567k32p20j231O55L114
$$ 417732 412153 404485 396372 388789 383220 380921 380496 379139 376607 375040 374808 374088 372857 373512 376626
57729C76626L064J497J455K878L672L748M004L475J637J137L948P173P129N309
$$ 376626 379690 381187 382642 385520 389192 392940 396944 400419 402056 403193 407141 414314 421443 426752
57715D26752N577P576P923O286N115M580K814K93o77k82o65j733j582m66m34j595
$$ 426752 432329 439905 447828 454114 459229 463809 466623 466916 466239 465957 465292 463559 461977 461511 461077 459482
57699D59482k412k896l901m368k962j280j632k886k392q05p51j914j841o98p20
$$ 459482 457070 454174 450273 445905 442943 441663 440031 437145 434753 433948 433197 431283 429442 428744 428024
57684D28024j620j029Q08J139o33k413l326m203m443k558K19R30l53o30J006K375
$$ 428024 426404 425375 426183 427322 426689 424276 420950 416747 412304 409746 409965 410895 410542 409912 410918 413293
57668D13293K466K804L965M361L308K149J646J127O42J141K130J922N24k96o4
$$ 413293 415759 418563 422528 426889 430197 432346 433992 435119 435761 436902 439032 440954 441478 441182 441118
57653D41118r5q42j348j391j757k396k631l023m564o354o554n339m508m475m175
$$ 441118 441023 440181 438833 437442 435685 433289 430658 427635 423071 416717 410163 404824 400316 395841 391666
57638C91666l524l457l831l596k732j953j236o22j343l807n782n136k945j272
$$ 391666 388142 384685 380854 377258 374526 372573 371337 370715 369372 365565 359783 354647 351702 350430
57624C50430L58L125N437N163L851M694P354Q976R563J1964J6799K1583K5046
$$ 350430 350788 353913 359350 364513 368364 373058 380412 389388 398951 410915 427714 449297 474343
57611D74343K8521L2882L7532M2540M8524N4388N8065N8877N6166M6922K8998
$$ 474343 502864 535746 573278 615818 664342 718730 776795 835672 891838 938760 967758
57600I67758O079j4734l0069m1288m9131n2210n0829m7616m3713l8327l2458k8820
$$ 967758 973837 959103 929034 887746 838615 786405 735576 687960 644247 605920 573462 544642
57588E44642k7460k5550k2092j8930j6610j3507r740p690p689p232n497m479m721
$$ 544642 517182 491632 469540 450610 434000 420493 410753 403063 395374 388142 382645 378166 373445
57575C73445m101k171j474k975m180l526k819l558m451m380m396n009m891l909
$$ 373445 369344 367173 365699 362724 358544 355018 352199 348641 344190 339810 335414 330405 325514 321605
57561C21605m045n564n841l897k532l682n131m431k912k904l599k764p21K37p78
$$ 321605 317560 311996 306155 302258 299726 296044 290913 286482 283570 280666 277067 274303 273582 273819 273041
57546B73041k569l616l138j470k60r01k369k379q81n2n99r38n26q31k060k207
$$ 273041 270472 266856 263718 262248 261988 261087 258718 256339 255458 255406 254807 253869 253343 252512 250452 248245
57530B48245p05O9j453l573m255l828l262k374j320j297k239k295j044o44k341
$$ 248245 247540 247609 246156 242583 238328 234500 231238 228864 227544 226247 224008 221713 220669 220025 217684
57515B17684m482n399n642n887n488m640n113p039p824o081l896l280l307k739
$$ 217684 213202 207803 202161 196274 190786 186146 181033 173994 166170 160089 156193 152913 149606 146867
57501A46867k521l313l349j533j0r76k994l274j690pJ070J675J370L04M1J087
$$ 146867 144346 141033 137684 136151 136141 135165 132171 128897 127207 127200 128270 129945 131315 131619 131660 132747
57485A32747J523J38j158m35J002J104P38J852L701M145L330L008L210K645J661
$$ 132747 134270 134408 133250 132815 133817 134921 135659 137511 141212 145357 148687 151695 154905 157550 159211
57470A59211J694K248J412o54j485P7K265L052K705L000M820P110P909O492M425
$$ 159211 160905 163153 164565 163911 162426 162503 164768 167820 170525 173525 178345 185455 193364 199856 204281
57455B04281L736M120L417J097p44n86K49j32j595l091m611o322p217o528n349
$$ 204281 208017 212137 215554 216651 215907 215321 215570 215438 213843 210752 206141 199819 192602 186074 180725
57440A80725n153n680n827n599n611n593m966m137l883m127m376m492m199k833
$$ 180725 175572 169892 164065 158466 152855 147262 142296 138159 134276 130149 125773 121281 117082 114249
57426A14249o28R28R72M11K42k5j196k862m062m436l931k620j489j899l500m276
$$ 114249 113621 114549 115521 115932 116174 116149 114953 112091 108029 103593 99662 97042 95553 93654 90154 85878
57410H5878l437k425k193j654j07J012M92m56k68K92m95k396l592l116j423O02
$$ 85878 82441 80016 77823 76169 76062 77074 77566 77110 76842 77134 76639 74243 70651 67535 66112 66714
57394F6714K016K141J471J403K303L044K979K784K688J801N5j081r00n36o36q6
$$ 66714 68730 70871 72342 73745 76048 79092 82071 84855 87543 89344 89399 88318 87418 86882 86246 86160
57378H6160J686L220L320K861K814K533J591J276K506M023M381M045L935L703
$$ 86160 87846 91066 94386 97247 100061 102594 104185 105461 107967 111990 116371 120416 124351 128054
57364A28054L008K655K935K729J744J583K970M039L272J886J403R98n00j989j808
$$ 128054 131062 133717 136652 139381 141125 142708 145678 149717 152989 154875 156278 157276 156776 154787 152979
57349A52979l08J348L064M562M281J860k32J59J943L169M170N877P124O497N073
$$ 152979 152671 154019 157083 161645 165926 167786 167554 167713 169656 172825 176995 182872 189996 196493 201566
57334B01566M542M318L241K466L616N588O088N121M179L430K485K467M259O044
$$ 201566 206108 210426 213667 216133 219749 225337 231425 236546 240725 244155 246640 249107 253366 259410
57320B59410N685M365M707O349O746N612N160O297P637Q226Q529Q819Q812Q826
$$ 259410 265095 269460 274167 280516 287262 292874 298034 304331 311968 320194 328723 337542 346354 355180
57306C55180R259R459Q776Q034Q084Q054P073O293O989Q014P710P037Q049J0382
$$ 355180 364439 373898 382674 390708 398792 406846 413919 420212 427201 435215 442925 449962 458011 468393
57292D68393J1988J2330J2291J1969J1109J0587J0970J0866R328Q242R477J1371
$$ 468393 480381 492711 505002 516971 528080 538667 549637 560503 569831 578073 587550 598921
57280E98921J1324J0147J0183J0769R658P844Q406J1130J2656J1917J1250J1930
$$ 598921 610245 620392 630575 641344 651002 658846 667252 678382 691038 702955 714205 726135
57268G26135J2643J2786J3517J4862J5311J4882J5220J6181J5599J3146J1204
$$ 726135 738778 751564 765081 779943 795254 810136 825356 841537 857136 870282 881486
57257H81486J1133J1775J2329J3610J5576J6557J6031J5692J6701J8262J9536
$$ 881486 892619 904394 916723 930333 945909 962466 978497 994189 1010890 1029152 1048688
57246A048688K0721K1594K1351K0546K0931K2763K4294K4344K3465K2458K1712
$$ 1048688 1069409 1091003 1112354 1132900 1153831 1176594 1200888 1225232 1248697 1271155 1292867
57235A292867K1970K3530K4902K4486K3297K3627K5346K6341K6222K6614K7942
$$ 1292867 1314837 1338367 1363269 1387755 1411052 1434679 1460025 1486366 1512588 1539202 1567144
57224A567144K9028K9897L1636L3280L2256K8532K5226K4309K4585K4559K4413
$$ 1567144 1596172 1626069 1657705 1690985 1723241 1751773 1776999 1801308 1825893 1850452 1874865
57213A874865K4465K4494K5305K8233L2440L5366L6458L7618L9505M0336L9176
$$ 1874865 1899330 1923824 1949129 1977362 2009802 2045168 2081626 2119244 2158749 2199085 2238261
57202B238261L7461L6249L4795L2865L1894L2726L4458L6314L8512M0782M2361
$$ 2238261 2275722 2311971 2346766 2379631 2411525 2444251 2478709 2515023 2553535 2594317 2636678
57191B636678M3791M6206M8631M8714M6279M3251L9954L4756K7661K0731J4382
$$ 2636678 2680469 2726675 2775306 2824020 2870299 2913550 2953504 2988260 3015921 3036652 3051034
57180C051034O968j155o807q493q181p355m851NN720J1760J9777K9932L9375M6544
$$ 3051034 3058002 3056847 3050040 3041547 3033366 3026011 3021160 3021165 3026885 3038645 3058422 3088354 3127729 3174273
57166C174273N3634O2369P0313P4019P3515P1123O8056O4426O0718N6976N2052
$$ 3174273 3227907 3290276 3360589 3434608 3508123 3579246 3647302 3711728 3772446 3829422 3881474
57155C881474M5303L7707L0196K2804J6180J1589Q432M429o19l966m012k333m49
$$ 3881474 3926777 3964484 3994680 4017484 4033664 4045253 4053685 4058114 4057495 4053529 4049517 4047184 4046735
57142D046735K315O208R648J2308J6344K2489K8102L1377L4137L7795L9813L7392
$$ 4046735 4049050 4055258 4064906 4077214 4093558 4116047 4144149 4175526 4209663 4247458 4287271 4324663
57130D324663L2024K6944K2234J5770P260j858j1178k1025l0520l8430m4930n0507
$$ 4324663 4356687 4383631 4405865 4421635 4428895 4427037 4415859 4394834 4364314 4325884 4280954 4230447
57118D230447n4547n6915n9459o3828o9256p4310p9077q3877q7758r0369r3291
$$ 4230447 4175900 4118985 4059526 3995698 3926442 3852132 3773055 3689178 3601420 3511051 3417760
57107C417760r7356j00502j00597r8484r5976r2741q7613q1327p5521p0481o5924
$$ 3417760 3320404 3219902 3119305 3020821 2924845 2832104 2744491 2663164 2587643 2517162 2451238
57096B451238o2308n9381n5389m9982m5814m4990m5990m6711m8228n2504n8282
$$ 2451238 2388930 2329549 2274160 2224178 2178364 2133374 2087384 2040673 1992445 1939941 1881659
57085A881659o2609o5091o7683p1427p6188q2292q9493r5449r8072r8616r9990
$$ 1881659 1819050 1753959 1686276 1614849 1538661 1456369 1366876 1271427 1173355 1074739 974749
57074I74749j03158j07619j14125j24204j37884j54264F0166a34794k17450k39246
$$ 974749 871591 763972 649847 525643 387759 233495 60166 -134794 -352244 -591490
57064e91490k61121k84397l08530l32559l57280l83887m12546m44706m84511n34967
$$ -591490 -852611 -1137008 -1445538 -1778097 -2135377 -2519264 -2931810 -3376516 -3861027 -4395994
57054d395994n94820o62074p38082q24736r20175j021551j130185j250156j383892
$$ -4395994 -4990814 -5652888 -6390970 -7215706 -8135881 -9157432 -10287617 -11537773 -12921665
57045a2921665j533760j706406j910815k153260k438206k772429l164155l621428
$$ -12921665 -14455425 -16161831 -18072646 -20225906 -22664112 -25436541 -28600696 -32222124
57037c2222124m158021m798973n572292o493855p563799q771834j0093829j1483650
$$ -32222124 -36380145 -41179118 -46751410 -53245265 -60809064 -69580898 -79674727 -91158377
57029i1158377j2883534j4252379j5583163j6900750j8260809j9737533k1336948
$$ -91158377 -104041911 -118294290 -133877453 -150778203 -169039012 -188776545 -210113493
57022b10113493k2825873k3614513k2881751j9957028j4719353p721573L2340
$$ -210113493 -232939366 -256553879 -279435630 -299392658 -314112011 -321833584 -321801244
57015c21801244P466831J3728228J8302496K1018697K2010565K1643326K0395851
$$ -321801244 -314334413 -300606185 -282303689 -261284992 -239274427 -217631101 -197235250
57008a97235250J8730959J7007005J5448305J4152348J3112847J2256281J1487999
$$ -197235250 -178504291 -161497286 -146048981 -131896633 -118783786 -106527505 -95039506
57001i5039506J0731040R943896R119323Q273614P432790O620944N855894N150909
$$ -95039506 -84308466 -74364570 -65245247 -56971633 -49538843 -42917899 -37062005 -31911096
56993c1911096M515594L953811L463187L038119K671840K355796K080381J838389
$$ -31911096 -27395502 -23441691 -19978504 -16940385 -14268545 -11912749 -9832368 -7993979
56985g993979J626286J441090J277955J132167J001757f28068A58287O99567O24771
$$ -7993979 -6367693 -4926603 -3648648 -2516481 -1514724 -628068 158287 857854 1482625
56976A482625N59842N02076M49879M03751L64528L31342L02226K76094K53135
$$ 1482625 2042467 2544543 2994422 3398173 3762701 4094043 4396269 4672363 4925498
56967D925498K33617K16990K02174J88260J74958J62471J51180J42075J37281
$$ 4925498 5159115 5376105 5578279 5766539 5941497 6103968 6255148 6397223 6534504
56958F534504J38312J42034J39263J19894Q0642K7613k8044p6246j11358j33003
$$ 6534504 6672816 6814850 6954113 7074007 7154649 7182262 7154218 7077972 6966614 6833611
56948F833611j44955j52224j58182j64261j71391j80081j89392j97515k03748
$$ 6833611 6688656 6536432 6378250 6213989 6042598 5862517 5673125 5475610 5271862
56939E271862k08813k13150k16111k16953k15560k12068k06731k00032j92038
$$ 5271862 5063049 4849899 4633788 4416835 4201275 3989207 3782476 3582444 3390406
56930C390406j82040j69944j57380j46030j35410j24125j12971j04505r9448r5609
$$ 3390406 3208366 3038422 2881042 2735012 2599602 2475477 2362506 2258001 2158553 2062944
56920B062944r1026q6166q2165p8695p4830p0709o6975o3335n8944n3773m8571
$$ 2062944 1971918 1885752 1803587 1724892 1650062 1579353 1512378 1449043 1390099 1336326 1287755
56909A287755m3613l8459l3116k8718k6464k5972k5391k3507k1136j9647j8735
$$ 1287755 1244142 1205683 1172567 1143849 1117385 1091413 1066022 1042515 1021379 1001732 982997
56898I82997j7036j4745j3815j5302j8213k1596k5773l0476l3739l4176l2906
$$ 982997 965961 951216 937401 922099 903886 882290 856517 826041 792302 758126 725220
56887G25220l1644l0256k7757k4323k0758j7114j3386j0252p699m395j5L658N793
$$ 725220 693576 663320 635563 611240 590482 573368 559982 549730 542031 537636 537621 541279 547072
56874E47072Q579J3866J9666K2838K3416K2973K0237J2393J96j1974k1160k7613
$$ 547072 555651 569517 589183 612021 635437 658410 678647 691040 691236 679262 658102 630489
56862F30489l1663l2538l0860k8988k7844k5994k2643j8989j5796j2110p492l394
$$ 630489 598826 566288 535428 506440 478596 452602 429959 410970 395174 383064 375572 372178
56850C72178j235o49m85j80L28P85P22M96J706M873P563P086M586L763N724P879
$$ 372178 370943 370294 369809 369629 369957 370742 371464 371960 373666 378539 386102 393188 397774 401537 407261 415140
56834D15140Q035O810N646N038N385P135R463J0938J1788J3258J4569J3213Q783
$$ 415140 423175 429985 435631 440669 446054 453189 462652 473590 485378 498636 513205 526418 535201
56821E35201L863L58k471n461p619p924o917n287k796M00L195N252P643J0992
$$ 535201 539064 539422 536951 531490 523871 515947 509030 503743 500947 501347 504542 509794 517437 528429
56807E28429J4615J8065K1730K5407K8153L0233L3335L7935M1953M2591L8281
$$ 528429 543044 561109 582839 608246 636399 666632 699967 737902 779855 822446 860727
56796H60727K8761J5147L54j2235k1022k6013k7150k4741k1014j8473j6810j3816
$$ 860727 889488 904635 904989 892754 871732 845719 818569 793828 772814 754341 737531 723715
56784G23715r090m086J261Q534J7164K4294K9160L4337M1531M9160N5304N9775
$$ 723715 714625 710539 711800 720334 737498 761792 790952 825289 866820 915980 971284 1031059
56772A031059O1657N7637M5181K5787L823j6301l1232l9470m2406m2778m1457
$$ 1031059 1092716 1150353 1195534 1221321 1225144 1208843 1177611 1138141 1095735 1052957 1011500
56761A011500l7630l2117k7530k4505k0828j5348r676m919J64O350J2373J7664
$$ 1011500 973870 941753 914223 889718 868890 853542 843866 838947 839111 845461 857834 875498
56749H75498K3752L1128L7398M0120L8811L2892K0958M242j2196k4156l1879l7180
$$ 875498 899250 930378 967776 1007896 1046707 1079599 1100557 1104799 1092603 1068447 1036568 999388
56737I99388l9855l9234l6557l3236k8941k3652j9222j6619j3931r588n235k912
$$ 999388 959533 920299 883742 850506 821565 797913 778691 762072 748141 738553 733318 730406
56725G30406j582Q53M199P285J0539J4337J6514J4405Q209Qq913j7529k3786k6639
$$ 730406 728824 729677 733876 741161 751700 766037 782551 796956 805165 805173 796260 778731 754945 728306
56711G28306k7822k9054k9109k6350k2364j9948j8817j6568j3062j0555r988r991
$$ 728306 700484 671430 642321 615971 593607 573659 554842 538274 525212 514657 504669 494678
56699D94678r468q705p961p066o350o201n955m840l588l571m824o165o705o101
$$ 494678 485210 476505 468544 461478 455128 448927 442972 438132 434544 430973 426149 419984 413279 407178
56685D07178m306k227j524k588l884m311m652n566o021n139l810k896j798l57
$$ 407178 402872 400645 399121 396533 392649 388338 383686 378120 372099 366960 363150 360254 358456 358099
56671C58099lj048j189R41K926K048l89j168L1J003R50Q63Q91L88NR36K493K869
$$ 358099 358096 357048 355859 356800 359726 361774 361385 360217 360248 361251 362201 363064 363955 364343 364348 365284 367777 370646
56653C70646J974J267J203R62K90l46q56j125k50K006M013M239L331K521J452
$$ 370646 372620 373887 375090 376052 376342 375996 375140 374015 373765 375771 379784 384023 387354 389875 391327
56638C91327l86j618q53O10N40q71j827k010k295k340j177N76J539J894K588L072
$$ 391327 390941 389323 388470 389080 389620 388749 386922 384912 382617 380277 379100 379676 381215 383109 385697 388769
56622C88769K318J119Q89J129O79M52K050M476N270M303L544L532L167K614L229
$$ 388769 391087 392206 393095 394224 394903 395355 397405 401881 407151 411454 414998 418530 421697 424311 427540
56607D27540M575M657L454L270N034O950P532P521P932Q334Q058P392O763N998
$$ 427540 432115 436772 440226 443496 448530 455480 463012 470533 478465 486799 494857 502249 509012 515010
56593E15010N018M160L468K601J502L32r59k202k806k917l907o419q929r761r522
$$ 515010 520028 524188 527656 530257 531759 532091 531132 528930 526124 523207 519300 512881 503952 494191 484669
56578D84669r901j0893j0985r475p126n010l966m325n149m837l491k981l671l295
$$ 484669 474768 463875 452890 443415 436289 431279 427313 422988 417839 413002 409511 406530 402859 399564
56564C99564q20J183L72j581j952j514k574m321l988j602J83M03L52L49n75j930
$$ 399564 398744 399927 400299 398718 396766 395252 392678 388357 384369 382767 382950 383353 383705 384054 383479 381549
56548C81549j982p91j09k96j10N76O93M33R81J823J182p55j841j331p22r12j038
$$ 381549 379567 378776 378667 378371 378261 378837 379530 379963 380944 382767 383949 383194 381353 380022 379300 378388 377350
56531C77350m08N29J413K241K426J447J74k00j28p06j407r06N06J423J631J844
$$ 377350 376942 377471 378884 381125 383551 384998 385172 384972 384844 384138 382731 381825 382331 383754 385385 387229
56515C87229K034J975K428L676M115K725J486K720N369O736O537O319O305O028
$$ 387229 389263 391238 393666 397342 401457 404182 405668 408388 413757 420493 427030 433349 439654 445682
56501D45682O579Q847J0875J0560R441R979J0685Q467M449K530K915K282J07m64
$$ 445682 452261 461108 471983 482543 491984 501963 512648 521115 525564 528094 531009 533291 533398 532934
56487E32934J499L009K249Q10j62j651l552l845k287j106j023l47J145J282m20
$$ 532934 534433 537442 539691 540501 540339 538688 535136 531291 529004 527898 526875 526528 527673 528955 528535
56472E28535j690j625k212m394o287o589o322o070m922l330l316m714m793k896
$$ 528535 526845 525220 523008 518614 512327 505738 499416 493346 488424 485094 481778 477064 472271 469375
56458D69375j711k562l343k842l213n912q470p932m838j771j79l26k033l981m423
$$ 469375 467664 465102 461759 458917 455704 449792 441322 433390 428552 426781 426602 426276 424243 420262 415839
56443D15839l626l431l919l265j363l10n99k83J127J507R9r32k82N07K78P5M06
$$ 415839 412213 408782 404863 401598 400235 399925 399326 399043 400170 401677 401776 400844 400562 401069 401347 401422 401828
56426D01828J52m40O76L225L854J337j086o56J133J772J328N53j079l070k908
$$ 401828 401980 401540 402216 405441 409295 410632 409546 408890 410023 411795 413123 413676 412597 409527 406619
56411D06619q8J989P98j520j794m36M27P87J605J946M20j937k855j836o4J500
$$ 406619 406531 408520 409318 407798 406004 405568 405995 406782 408387 410333 410753 408816 405961 404125 404061 405561
56395D05561K459K683K836L672M190K488j007l560m015l781l440j676J334L013
$$ 405561 408020 410703 413539 417211 421401 423889 422882 419322 415307 411526 408086 406410 407744 410757
56381D10757K442J982L149M128L290J989J808J990J531J012N92q95l022l166o96
$$ 410757 413199 415181 418330 422458 425748 427737 429545 431535 433066 434078 434670 433775 430753 427587 426891
56366D26891J409J117L00R73J975J713J151J509J892J658K243M194N269L961K193
$$ 426891 428300 429417 429717 430690 432665 434378 435529 437038 438930 440588 442831 447025 452294 456255 458448
56351D58448K029K494K057J513J876K049J014q6l13p28j816j937m72M80l16j025
$$ 458448 460477 462971 465028 466541 468417 470466 471480 471394 471081 470353 468537 466600 466128 466608 466292 465267
56335D65267l06K29n32p05R74K327J457J00L38J074Q08Q88K743M620M293K636
$$ 465267 464961 465190 464658 463953 464927 467254 468711 468811 469149 470223 471031 471919 474662 479282 483575 486211
56319D86211J680J502J577K439L575K714j85j491P86L586L663K370K339K817J965
$$ 486211 487891 489393 490970 493409 496984 499698 499513 498022 498808 502394 506057 508427 510766 513583 515548
56304E15548O63M12K49q26j269j17M02j197k345p10J442J074n87q02j58n18r68
$$ 515548 516211 516623 516872 516046 514777 514660 515062 513865 511520 510810 512252 513326 512739 511937 511779 511261 510293
56287E10293J04J463J467J294K008J545j277l135j040K254K601J125J426K868
$$ 510293 510397 511860 513327 514621 516629 518174 516897 513762 512722 514976 517577 518702 520128 522996
56273E22996K256J46j22J754L292L993N095N812M581K827L099M603M807M097M555
$$ 522996 525252 525398 525276 527030 530322 534315 539410 545222 549803 552630 555729 560332 565139 569236 573791
56258E73791N530M856L241L054L839L258J507R06J957L411M949O509O503M299
$$ 573791 579321 584177 587418 590472 594311 597569 599076 599982 601939 605350 610299 616808 623311 627610
56244F27610K662M133O865P612O748O480O445N254M339N867Q638J0015J0124J0346
$$ 627610 630272 634405 641270 648882 655630 662110 668555 673809 678148 684015 692653 702668 712792 723138
56230G23138J0007Q527Q222J0663J2939J1994R927J0265J1879J1755J0912J2020
$$ 723138 733145 741672 749894 760557 773496 785490 795417 805682 817561 829316 840228 852248
56218H52248J3753J3286J2093J3316J5620J5654J4557J5821J8591J9503J9545
$$ 852248 866001 879287 891380 904696 920316 935970 950527 966348 984939 1004442 1023987
56207A023987K2396K7238K9741K9470K9967L2156L3932L5643L9811M5747N0384
$$ 1023987 1046383 1073621 1103362 1132832 1162799 1194955 1228887 1264530 1304341 1350088 1400472
56196A400472N4053N9597O6280P0635P3090P7833Q6116R5206J03718J12421J20111
$$ 1400472 1454525 1514122 1580402 1651037 1724127 1801960 1888076 1983282 2087000 2199421 2319532
56185B319532J24407J26517J29799J33856J35220J33166J29474J23381J12642
$$ 2319532 2443939 2570456 2700255 2834111 2969331 3102497 3231971 3355352 3467994
56176C467994R8867Q5693P2289N4724L3199J1816q204k8654m8257o3246p3982
$$ 3467994 3566861 3652554 3724843 3779567 3812766 3824582 3816378 3787724 3739467 3676221 3602239
56165C602239q4465r5079j02341j05908j09194j12605j12884j09864j07365j06373
$$ 3602239 3517774 3422695 3320354 3214446 3105252 2992647 2879763 2769899 2662534 2556161
56155B556161j03597r7868r2042q7541q2678p7338p3666p1252o7121o1202n6563
$$ 2556161 2452564 2354696 2262654 2175113 2092435 2015097 1941431 1870179 1803058 1741856 1685293
56144A685293n3817n0634m6780m4134m1855l7444l2397l0598l1089k8923k3401
$$ 1685293 1631476 1580842 1534062 1489928 1448073 1410629 1378232 1347634 1316545 1287622 1264221
56133A264221j8993j7655j6630j4406j2570j1182q572o100o952r873j0297p813
$$ 1264221 1245228 1227573 1210943 1196537 1183967 1172785 1164213 1158113 1151161 1141288 1130991 1123178
56121A123178o231o314n197k893k362l006j271K130K922J346J990N194O510N226
$$ 1123178 1116947 1110633 1105436 1102543 1100181 1097175 1095904 1098034 1100956 1102302 1104292 1109486 1115996 1121222
56107A121222N542Q316R584Q497Q848J1452J2793J2420J3969J7576J9225J8861
$$ 1121222 1126764 1135080 1144664 1153161 1162009 1173461 1186254 1198674 1212643 1230219 1249444 1268305
56095A268305K1003K5889K8380K7354K7893L2150L6276L8486M2015M7841N2479
$$ 1268305 1289308 1315197 1343577 1370931 1398824 1430974 1467250 1505736 1547751 1595592 1648071
56084A648071N5303O0258O8359P6158Q3334R3650J06777J17589J25306J34561
$$ 1648071 1703374 1763632 1831991 1908149 1991483 2085133 2191910 2309499 2434805 2569366
56074B569366J45600J52406J52485J49272J42991J29217J09382R2597Q3366P6736
$$ 2569366 2714966 2867372 3019857 3169129 3312120 3441337 3550719 3643316 3726682 3803418
56064C803418O8745O1791N5946M5126K6904P320q602k2621l5809m4385m7669n1734
$$ 3803418 3872163 3933954 3989900 4035026 4061930 4069250 4060648 4038027 4002218 3957833 3910164 3858430
56052C858430o0733p2312q4892j00760j18435j30878j35151j35460j33654j26085
$$ 3858430 3797697 3725385 3640493 3539733 3421298 3290420 3155269 3019809 2886155 2760070
56042B760070j12911j00561r1366q0679o7620n8087n3440m7207l7300l0179k8324
$$ 2760070 2647159 2546598 2455232 2374553 2306933 2248846 2195406 2148199 2110899 2080720 2052396
56031B052396k5044j7052j0671r852r241n114k044k502j068M669Q438O984O360
$$ 2052396 2027352 2010300 1999629 1989777 1980536 1975422 1973378 1970876 1969808 1974477 1982915 1989899 1996259
56018A996259J0132J2508J0036Q888J3439J8460J9622K0695K3770K3794J9647
$$ 1996259 2006391 2018899 2028935 2037823 2051262 2069722 2089344 2110039 2133809 2157603 2177250
56007B177250J8776K3775K6606K3382K2086K7759L3113L2422L1651L5525L7656
$$ 2177250 2196026 2219801 2246407 2269789 2291875 2319634 2352747 2385169 2416820 2452345 2490001
55996B490001L3383K9735L2467L5446L3006L0655L3386L5741L3657L3696M0048
$$ 2490001 2523384 2553119 2585586 2621032 2654038 2684693 2718079 2753820 2787477 2821173 2861221
55985B861221M5040M3126M1546M6445N1431N0824N0821N6249N9874N6674N4970
$$ 2861221 2906261 2949387 2990933 3037378 3088809 3139633 3190454 3246703 3306577 3363251 3418221
55974C418221O1391O8514O9495P0739P7793Q3484Q2820Q4453R3964J01526J00196
$$ 3418221 3479612 3548126 3617621 3688360 3766153 3849637 3932457 4016910 4110874 4212400 4312596
55963D312596J00250J10485J21661J24246J26089J35912J45831J47651J50105
$$ 4312596 4412846 4523331 4644992 4769238 4895327 5031239 5177070 5324721 5474826
55954E474826J61901J73890J76450J78352J89622K02167K06543K11327K26146
$$ 5474826 5636727 5810617 5987067 6165419 6355041 6557208 6763751 6975078 7201224
55945G201224K42479K51262K62074K84442L08249L23712L41824L72952M04822
$$ 7201224 7443703 7694965 7957039 8241481 8549730 8873442 9215266 9588218 9993040
55936I993040M24818M44082M75818N10842N39428N75012O29612O88417P36427
$$ 9993040 10417858 10861940 11337758 11848600 12388028 12963040 13592652 14281069 15017496
55927A5017496P86512Q52233R18240R69057J020962J092023J167726J231947J303750
$$ 15017496 15804008 16656241 17574481 18543538 19564500 20656523 21824249 23056196 24359946
55918B4359946J405207J521679J634329J761166J921962K094433K252796K417698
$$ 24359946 25765153 27286832 28921161 30682327 32604289 34698722 36951518 39369216
55910C9369216K618666K842821L075576L354768L724093M170949M674257N271482
$$ 39369216 41987882 44830703 47906279 51261047 54985140 59156089 63830346 69101828
55902F9101828O006511O856245P788283Q842670J0068184J1432125J2894593J4512919
$$ 69101828 75108339 81964584 89752867 98595537 108663721 120095846 132990439 147503358
55894A47503358J6359797J8412729K0664244K3253384K6312045K9780870L3562978
$$ 147503358 163863155 182275884 202940128 226193512 252505557 282286427 315849405
55887C15849405L7575281M1047038M1756646L6828493K5113716Q772779p915542
$$ 315849405 353424686 394471724 436228370 473056863 498170579 506943358 499027816
55880D99027816k1383488l0396660l5442510l7402356l7035994l5105456l2337095
$$ 499027816 477644328 447247668 411805158 374402802 337366808 302261352 269924257
55873B69924257k9211474k5987771k2880374k0059333j7550625j5298293j3304620
$$ 269924257 240712783 214725012 191844638 171785305 154234680 138936387 125631767
55866A25631767j1611513j0193489q976496p932019p064317o335064n683287n097184
$$ 125631767 114020254 103826765 94850269 86918250 79853933 73518869 67835582 62738398
55858F2738398m595281m159245l750316l370636l047055k772483k518444k287456
$$ 62738398 58143117 53983872 50233556 46862920 43815865 41043382 38524938 36237482
55850C6237482k100263j947489j802837j668923j564086j478359j386299j289904
$$ 36237482 34137219 32189730 30386893 28717970 27153884 25675525 24289226 22999322
55842B2999322j207637j134345j052095r68174r03272q52838p97059p38645o95039
$$ 22999322 21791685 20657340 19605245 18637071 17733799 16880961 16083902 15345257 14650218
55833A4650218o62720o23984n80797n48817n25387m95114m60318m35668m18963
$$ 14650218 13987498 13363514 12782717 12233900 11708513 11213399 10753081 10317413 9898450
55824I898450l96108l68972l50437l37638l16907k89894k69095k52946k30351
$$ 9898450 9502342 9133370 8782933 8445295 8128388 7838494 7569399 7316453 7086102
55815G086102k04487j87960j79632j69916j63396j72209j91627k05408k11166
$$ 7086102 6881615 6693655 6514023 6344107 6180711 6008502 5816875 5611467 5400301
55806E400301k18282k25409k22768k13056k07811k05743j95828j79150j67192
$$ 5400301 5182019 4956610 4733842 4520786 4312975 4107232 3911404 3732254 3565062
55797C565062j60870j51143j37984j29380j23919j13267r9770r3163r2068q6706
$$ 3565062 3404192 3253049 3115065 2985685 2861766 2748499 2648729 2555566 2463498 2376792
55787B376792p7496p3112p2543o7140n8258n5027n6426n3095m5286m1691m2049
$$ 2376792 2299296 2226184 2153641 2086501 2028243 1973216 1916790 1863695 1818409 1776718 1734669
55776A734669l8238l1347l0329l4544l4459k9196k6900k8188k5689j9848j8828
$$ 1734669 1696431 1665084 1634755 1600211 1565752 1536556 1509656 1481468 1455779 1435931 1417103
55765A417103k2422k2076j7497j7466k3198k6211k3990k2971k4651k3217j8424
$$ 1417103 1394681 1372605 1355108 1337642 1314444 1288233 1264243 1241272 1216621 1193404 1174980
55754A174980j6792j8484j6678j1329r853j2675j1756n240l87J7J111L980L256
$$ 1174980 1158188 1139704 1123026 1111697 1101844 1089169 1077413 1072173 1071786 1071803 1072914 1076894 1080150
55741A080150j029j833K021L344n27l984m609o811j1594j3964j3085j4047j7335
$$ 1080150 1079121 1077288 1079309 1082653 1082126 1078142 1073533 1066722 1055128 1041164 1028079 1014032 996697
55728I96697j7362j3745j2997j6479j7497j3125q510o859n410l871o357j2122
$$ 996697 979335 965590 952593 936114 918617 905492 896982 890123 884713 880842 874485 862363
55716H62363j4495j1907j0244j1681j1227p103m331m653k937K526N559K126l631
$$ 862363 847868 835961 825717 814036 802809 795706 791375 786722 783785 786311 791870 793996 790365
55703G90365p245r804j2532j3355j2155j2250j3889j3444j1002j1010j3699j4056
$$ 790365 783120 773316 760784 747429 735274 723024 709135 695691 684689 673679 659980 645924
55691F45924j1134r781j1083j0139n832l688n919p477n513m112n837o944n024
$$ 645924 634790 625009 613926 603787 597955 594267 588348 580871 575358 571246 565409 558465 553441
55678E53441l571m751n138k827j609l833n874m771l134l661m745m977o029q028
$$ 553441 549870 545119 539981 537154 535545 531712 525838 521067 517933 514272 509527 504550 498521 490493
55664D90493p984n566m487n660n396k723j713l899n303l773k326k366o73L589
$$ 490493 482509 476943 472456 466796 461400 458677 456964 453065 447762 443989 441663 439297 438624 442213
55650D42213O011M632L592N512O984N337L226K491K10m983q989r003q223r601
$$ 442213 448224 452856 456448 461960 468944 474281 477507 479998 480208 475225 466236 457233 449010 439409
55636D39409j0801r564q272q778q370n200k434k587k961j077O12k35j063P40K997
$$ 439409 428608 419044 410772 401994 393624 388424 385990 383403 380442 379365 379977 379742 378679 379419 382416
55621C82416L086K750M200N639M879L468L332L119J473O2O9l19j871k065k2R61
$$ 382416 385502 388252 392452 398091 402970 406438 409770 412889 414362 414424 414493 414174 412303 410238 410216 411177
55605D11177r50k529j031J213J310M72O38P93J43O79L025M170K679J692L299M646
$$ 411177 410227 407698 406667 407880 409190 409662 410300 411093 411236 411915 414940 419110 421789 423481 426780 431426
55589D31426L302J666J939J597j727n248n663m735n614p322p491p072p864q668
$$ 431426 434728 436394 438333 439930 438203 432955 427292 422557 416943 409621 402130 395058 387194 378526
55575C78526q144q193j0235j1416q818m476k081j659j331j254j923j681J72R44
$$ 378526 370382 362189 351954 340538 331720 327244 325163 323504 322173 320919 318996 317315 317487 318431
55561C18431j007k694j426K13j326m383m921k962j515j386j343j503k528l213
$$ 318431 317424 314730 313304 313517 312191 307808 302887 299925 298410 297024 295681 294178 291650 288437
55547B88437k419j589k177k774j851p89j185j786j244q50j462r95J416K377o13
$$ 288437 286018 284429 282252 279478 277627 276838 275653 273867 272623 271773 270311 269316 270732 273109 272496
55532B72496m270m212j532r7j50M97J315K95j406r25J360K605K087J179J80j130
$$ 272496 268226 264014 262482 262385 262235 262732 264047 264342 262936 262011 263371 265976 268063 269242 269422 268292
55516B68292j310O37K501J881L11P99K969M505N636P999J0473J0351P838N415
$$ 268292 266982 267619 270120 272001 272312 273111 276080 280585 286221 294220 304693 315044 322882 328297
55502C28297L652J299j261k296j953j982k843l714m494n188m594k379r34k287
$$ 328297 331949 333248 331987 329691 327738 325756 322913 319199 314705 309517 304923 302544 301610 299323
55488B99323m733n433m657m237l665j439J177J480m85k401l392m096m095k675
$$ 299323 294590 289157 284500 280263 276598 275159 276336 277816 277331 274930 271538 267442 263347 260672
55474B60672j217j628l094l375k395j721j490r50r74k898n613o788o314n845n731
$$ 260672 259455 257827 254733 251358 248963 247242 245752 244802 243828 240930 235317 228529 222215 216370 210639
55459B10639n188m516m404l962k054L51J671K365L536M194K854O14l44k35q33
$$ 210639 205451 200935 196531 192569 190515 190866 192537 194902 198438 202632 205486 206100 205756 205521 204688
55444B04688k144k709k261j445o7J836K543J030o57l03Q21L85n96M81K872L373
$$ 204688 202544 199835 197574 196129 196062 197898 200441 201471 200814 200511 201332 201717 201121 201602 204474 207847
55428B07847J503l4Q4L90j00n43n20q22j516j646j080o54l76N42J985K931K917
$$ 207847 209350 209316 209400 209790 209690 209147 208627 207805 206289 204643 203563 202909 202533 203075 205060 207991 210908
55411B10908K121O24j087j879j506j156j304q03N14O95j028k271j159N87Q04M60
$$ 210908 213029 213653 212566 210687 209181 208025 206721 205918 206432 207127 206099 203828 202669 203256 204060 204520
55395B04520J082J334k92j777o15J438Q62j938l620l283k729k332r63O94P02n23
$$ 204520 205602 206936 206644 204867 204252 205690 206552 204614 200994 197711 194982 192650 191687 192381 193083 192560
55379A92560p43L67J283J671K125J802j08j607l10K248K599P95k05J31m04k120
$$ 192560 191817 192184 193467 195138 197263 199065 198957 197350 197040 199288 201887 202682 202477 202608 202204 200084
55363B00084k773j756q62o44J53J309J066k92m62Q41J455P10L67J160J741J533
$$ 200084 197311 195555 194693 194049 194202 195511 196577 196285 195823 196664 198119 198829 199196 200356 202097 203630
55347B03630J405J251J22j081m86J067Q05j220j918k82J077M84m05KP11M91n6
$$ 203630 205035 206286 206408 205327 204841 205908 206713 205493 203575 203293 204370 204854 204449 204451 205162 205653 205597
55330B05597j08J08O08J819K774J662j133k980k629j506r50o61m47q46j442r66
$$ 205597 205489 205597 206205 208024 210798 212460 211327 208347 205718 204212 203262 202601 202154 201308 199866 198900
55314A98900L62Q39qr95j677k634l377k652j061o21j435j560l97N51N81O37J019
$$ 198900 199262 200101 200093 199098 197421 194787 191410 188758 187697 187076 185641 184081 183684 184235 184816 185453 186472
55297A86472R79Q50J659K600J856N9l38O38L47j788l117k176q55r51j692j965
$$ 186472 187451 188301 189960 192560 194416 194475 194137 194775 195122 193334 190217 188041 187186 186235 184543 182578
55281A82578k060j992p69J414K793K768K538K433J340n11j205m26j09r35j276
$$ 182578 180518 178526 177757 179171 181964 184732 187270 189703 191043 190532 189327 188901 188792 187857 186581
55266A86581o77j073l033l878j474K473M705M110J860k89q54L67J520P22j053
$$ 186581 185904 184831 181798 177920 176446 178919 183624 187734 189594 189305 188451 188818 190338 191060 190007
55251A90007j410n46p86k246k551j278p47j594j533J75R67n74k205j874p00j71
$$ 190007 188597 188051 187265 185019 182468 181190 180443 178849 177316 177491 178458 177884 175679 173805 173105 172934
55235A72934M01J514J787P18J87J123J698Q21L29J450K317J475P07J623K421J052
$$ 172934 173335 174849 176636 177354 177541 178664 180362 181183 181512 182962 185279 186754 187461 189084 191505 192557
55219A92557j078j676j359j591j255J238M259M862L097J252P3j167j999j376k34
$$ 192557 191479 189803 188444 186853 185598 186836 191095 195957 199054 200306 200379 199212 197213 195837 195603
55204A95603m67j754k009p98L8q20k637l829l297r33J999L499K910J700J323J474
$$ 195603 195136 193382 191373 190575 190613 189793 187156 183327 180030 179097 181096 184595 187505 189205 190528 192002
55188A92002J323J078J149J058M71Q1L01M05n1m33n53j238k381k397r54n5q61
$$ 192002 193325 194403 195552 196610 197081 197162 197463 197868 197817 197384 196831 195593 193212 190815 189861 189806 188945
55171A88945j694r66O1k94j017k46J421K143K017K375K869J944k36j770j745j094
$$ 188945 187251 186285 186346 186052 185035 184789 186210 188353 190370 192745 195614 197558 197322 195552 193807 192713
55155A92713q45j078j441j510r39j13k9p67j026l6J323K102K655L318L214J671
$$ 192713 191868 190790 189349 187839 186900 186787 186758 185991 184965 184929 186252 188354 191009 194327 197541 199212
55139A99212m04j765k272k137j169J95O89J43k1P30R32k76j489j341n05J13R96
$$ 199212 198808 197043 194771 192634 191465 191660 192349 192492 192471 193201 194133 193857 192368 191027 190522 190635 191631
55122A91631K217K179J77j828k101j830k673l670l013j195J89J227K727L970L943
$$ 191631 193848 196027 196204 194376 192275 190445 187772 184102 181089 179894 180083 181310 184037 188007 191950
55107A91950L401L173K007j054l671k853M22K375J678M65N20J376K220K937L181
$$ 191950 195351 198524 200531 199477 195806 192953 193375 195750 197428 197893 198413 199789 202009 204946 208127
55092B08127K533J654J416J205J9j412j636r74p63q18o2Q42K16j502k068r27J19
$$ 208127 210660 212314 213730 214935 214954 213542 211906 210932 210169 209351 209289 210131 210347 208845 206777 205850 205969
55075B05969m3n68q36j508k710l194k260r20l59m89o09m51m2N38J026J188J149
$$ 205969 205926 205358 204522 203014 200304 197110 194850 193930 193571 193082 192473 192022 191980 192518 193544 194732 195881
55058A95881R97M77k02r9R80J616O78p38q36K50R78R05R17J312J428R78L46k30
$$ 195881 196878 197355 197153 197054 198034 199650 200328 199590 198754 199004 199982 200887 201804 203116 204544 205522 205868 205638
55040B05638n65r1J147J767Q16m42k28R70J259N42O09K037L101K324M13r62j150
$$ 205638 205073 204982 206129 207896 208712 208270 208042 209012 210271 210813 211422 213459 216560 218884 219297 218335 217185
55023B17185p19n00p36q25O5J693K604J835J44j092j492j404j022n62n65j070
$$ 217185 216466 215966 215230 214405 214470 216163 218767 220602 220746 219654 218162 216758 215736 215174 214609 213539
55007B13539j342j037o29j47J023K430K451Q92l16k93p24k528l480j587J309K212
$$ 213539 212197 211160 210531 210384 211407 213837 216288 217180 216864 216571 215847 213319 209839 208252 209561 211773
54991B11773J444J279J606M95j642k048J44K607L038J405j028k814k587l37J738
$$ 211773 213217 214496 216102 216597 214955 212907 213051 215658 218696 220101 219073 216259 213672 213335 215073
54976B15073J525k79j435j374j052n24P77J984J608R6p68o24m58l57K39P11J50
$$ 215073 216598 216319 214884 213510 212458 211934 212711 214695 216303 216399 215631 215007 214549 214192 214431 215142 215292
54959B15292m76L48J941K545K357K566K374M31j676j251O39L26k393l737k039
$$ 215292 214816 215164 217105 219650 222007 224573 226947 227378 225702 224451 225090 225416 223023 219286 217247
54944B17247K3L75M55J582K328J604R15J383J624O64j7M97M21j405k837j706N66
$$ 217247 217270 217645 218100 219682 222010 223614 224529 225912 227536 228200 228183 228680 229101 227696 224859 223153 223719
54927B23719J387R93J166J736J303K11m8M50M64M2J68N13k07j775k416j307M33
$$ 223719 225106 226099 227265 229001 230304 230515 230467 230917 231381 231423 231591 232104 231897 230122 227706 226399 226832
54910B26832J333R47k41j261j104M21K348L621L997L568K307Q11L68J191J480
$$ 226832 228165 229112 228871 227610 226506 226927 229275 232896 236893 240461 242768 243579 243947 245138 246618
54895B46618l87l365m758l489j084N09R87J320K245L540M475M549L741K338Q01
$$ 246618 246231 242866 238108 234619 233535 234044 235031 236351 238596 242136 246611 251160 254901 257239 258040
54880B58040k04k27K19k9j159j778p11J280K535K679K537K494K347K425L348M841
$$ 258040 257836 257609 257828 257799 256640 254862 254151 255431 257966 260645 263182 265676 268023 270448 273796 278637
54864B78637O109P165Q424R370R247Q688Q879R352Q599O763N531N165L855O49
$$ 278637 284746 291911 300335 309705 318952 327640 336519 345871 354470 361233 366764 371929 375784 376433
54850C76433l078n790p586r015r779r544q661p417n861m708m848n613n234l536
$$ 376433 373355 367565 359979 350964 341185 331641 322980 315563 309702 304994 300146 294533 289299 285763
54836B85763k400k877l765l746l095k341j016J085K987L962M529N142N299M811
$$ 285763 283363 280486 276721 272975 269880 267539 266523 267608 270595 274557 279086 284228 289527 294338
54822B94338M521M832N086N155O062P995R473R610R460R787R242O504K702j55
$$ 294338 298859 303691 308777 313932 319994 327989 337462 347072 356532 366319 375561 382065 384767 384612
54808C84612k083m573p818j0380j1250j0755r635q389p427o921o527n824m847
$$ 384612 382529 377956 370138 359758 348508 337753 328118 319729 312302 305381 298854 293030 288183
54795B88183l927l380l503m202m484l289j077L41q6j641l020l465k652q20O92
$$ 288183 284256 280876 277373 273171 268687 265398 264321 264662 264576 262935 259915 256450 253798 252978 253670
54780B53670M70r88j719j044l28o21j305j659k030k572k438j263NN64P14O30j61
$$ 253670 254140 253152 251433 250389 250061 249440 248135 246476 244446 241874 239436 238173 238178 238742 239456 240086 239925
54763B39925j317j434k64N21o2p34l48j4j128k693k571m58K025L447L363J836
$$ 239925 238608 237174 236910 237431 237369 236635 236287 236273 235145 232452 229881 229423 231448 234895 238258 240094
54747B40094l48j622j017O64J907K039J239q0j103q81L47J071M93m00m65J07O92
$$ 240094 239746 238124 237107 237771 239678 241717 242956 242876 241773 240892 241239 242310 242803 242403 241938 242045 242737
54730B42737J400K396L121L120K740K330J775J259J264J532J360J205K146L592
$$ 242737 244137 246533 249654 252774 255514 257844 259619 260878 262142 263674 265034 266239 268385 271977
54716B71977L776L000L667O144P540O161M318M629O147O727O833Q066R727R946
$$ 271977 275753 278753 282420 288564 296104 302265 306583 311212 317359 324086 330919 338985 348712 358658
54702C58658Q961Q278P577N347J871j084l073m997o719p140o456o091o506o909
$$ 358658 367619 375897 383474 388821 390692 389608 386535 381538 374819 367679 361223 355132 348626 341717
54688C41717o940o783n988m117k278k115l392m262l777k517j076M13J407J212
$$ 341717 334777 327994 322006 317889 315611 313496 310104 305842 302065 299548 298472 298885 300292 301504
54674C01504J65p02r25n08P62K648L936M036M306O187Q770J0015R600Q754P861
$$ 301504 301669 300967 300042 299534 300296 302944 306880 310916 315222 321409 330179 340194 349794 358548 366409
54659C66409O331M433L211K649J672m9j876l606n590p643r185j0205j0802j0326
$$ 366409 372740 377173 380384 383033 384705 384656 382780 379174 373584 365941 356756 346551 335749 325423
54645C25423q353o019m823m719m699m643m912m930m011k922k710k699j566J17
$$ 325423 317070 311051 306228 301509 296810 292167 287255 282325 278314 275392 272682 269983 268417 268534
54631B68534O70J12LO66Q56J72l44j41J71J92Rq36k783m627m444k340m59q7m21
$$ 268534 269204 269316 269319 269985 270841 271013 270669 270528 270699 270891 270900 270064 267281 262654 258210 255870 255411 255324 254903
54612B54903l66J08P04J285J430P65j23l13J6km85j013j728k730l137k328j368
$$ 254903 254537 254645 255349 256634 258064 258829 258706 258393 258409 258407 257922 256909 255181 252451 249314 246986 245618
54595B45618j371j364L3J792J864O30J22M41P4n77N01K845L395J252p86o64J71
$$ 245618 244247 242883 242916 244708 246572 247202 247324 247765 247839 247262 247763 250608 254003 255255 254469 253805 253976
54578B53976j2l02N44J397P11o13n44J113K824L381K465L00k039k974k233j316
$$ 253976 253964 253662 254206 255603 256314 255701 255157 256270 259094 262475 264940 265240 263201 260227 257994 256678
54562B56678j375j765j533r48n99j77P62J866K680L173K993J452r45k273j429
$$ 256678 255303 253538 252005 251057 250458 250281 251043 252909 255589 258762 261755 263207 262262 259989 258560
54547B58560M83J715J725R01k57r70n30M56M74o03j053K13K056K881K455J284
$$ 258560 259043 260758 262483 263384 263127 262157 261627 262083 262557 261954 260901 261114 263170 266051 268506 269790
54531B69790k96j539j380j54K94p98j991k038j660j656j173N08K100K130J347
$$ 269790 269494 267955 266575 266421 266715 265917 263926 261888 260228 258572 257399 257907 260007 262137 263484
54516B63484J361K014K092J705J850K181J384m56j772j820j365r28LJ559K670
$$ 263484 264845 266859 268951 270656 272506 274687 276071 275615 273843 272023 270658 269730 269733 271292 273962
54501B73962K439J467J094J705K433K401J779J205N32j069l394m648l528j175
$$ 273962 276401 277868 278962 280667 283100 285501 287280 288485 289017 287948 284554 279906 276378 275203
54487B75203K87O12J202K411L074K873L037M050M674M014K770J547j47k225l192
$$ 275203 275490 276102 277304 279715 282789 285662 288699 292749 297423 301437 304207 305754 305607 303382 300190
54472C00190k335q98Q1J246K671K401n42l527l401r99K69m17n86J239L371L648
$$ 300190 297855 296957 297038 298284 300955 303356 302814 299287 295886 294887 295156 294739 294153 295392 298763 302411
54456C02411K031k33k210l238k838j567p91r45q89L52K106K926K341J193O59J297
$$ 302411 304442 304209 301999 298761 295923 294356 293565 292620 291731 292083 294189 297115 299456 300649 301308 302605
54440C02605K651L594L292J924L17q68j340j048m79o11j821l029k733p75J537
$$ 302605 305256 308850 312142 314066 314383 313515 312175 311127 310648 310037 308216 305187 302454 301679 303216
54425C03216K960L261K795J989J275R43Q51P65R33J832L230M096L643K206R31
$$ 303216 306176 309437 312232 314221 315496 316439 317290 318055 318988 320820 324050 328146 331789 333995 334926
54410C34926P08J455K366K781K756K684K654K497K305K307K288J802R77L72o5
$$ 334926 335634 337089 339455 342236 344992 347676 350330 352827 355132 357439 359727 361529 362506 362878 362813
54395C62813j050k647l765l461k089p53j58l97j138j615j139j82k49k091m528
$$ 362813 361763 359116 355351 351890 349801 349048 348890 348493 347355 345740 344601 344419 344170 342079 337551
54380C37551n681m921l113j384j62Q42K006K987K699P48j282j182J080L084K855
$$ 337551 331870 326949 323836 322452 322290 323132 325138 328125 330824 331572 330290 329108 330188 333272 336127
54365C36127R67p90j570j548j010l45p0o6L99J136P13j378l305k948n77J719K582
$$ 336127 337094 336304 334734 333186 332176 331831 331761 331695 332094 333230 333943 332565 329260 326312 325735 327454 330036
54348C30036K178J183K84K53J180J889J261j63r31o40o9L02P07J192J500J733
$$ 330036 332214 333397 333681 333934 335114 337003 338264 338101 337170 336530 336461 336763 337470 338662 340162 341895
54332C41895K058J856L18j952l040j853N46K114J958R79O15J099J208J1j482j370
$$ 341895 343953 345809 346127 344175 341135 339282 339828 341942 343900 344879 345494 346593 347801 347812 346330 344960
54316C44960M39J920J746J008J068J250K61j189j206K83J394J175P69J256K084
$$ 344960 345399 347319 349065 350073 351141 352391 352652 351463 350257 350540 351934 353109 353878 355134 357218
54301C57218K314K069J848J455O90L45J317K936L203J055k211m221m037k909k487
$$ 357218 359532 361601 363449 364904 365594 365939 367256 370192 373395 374450 372239 368018 363981 361072 358585
54286C58585k911l219l078l165l800m257l828k730j474j35J135J565N40j459l217
$$ 358585 355674 352455 349377 346212 342412 338155 334327 331597 330123 329988 331123 332688 333228 331769 328552
54271C28552l817l098j665p50j228k370k384o87J317K220K212J947J153l07j123
$$ 328552 324735 321637 319972 319222 317994 315624 313240 312553 313870 316090 318302 320249 321402 321095 319972
54256C19972k3J957K430P45j362k234k026j751j786j799j452p41k6K23J7n4K78
$$ 319972 319949 321906 324336 325081 323719 321485 319459 317708 315922 314123 312671 311930 311904 312127 312144 312090 312368
54239C12368M20j26p28m82L16M73l73j238j199o03n33j401k360k254j145n64j638
$$ 312368 312788 312662 311934 311452 311768 312241 311868 310630 309431 308828 308295 306894 304534 302280 301135 300571 298933
54222B98933l292l327j247J173K292K212J644P73j0J96J282J717Q05p1L10J001
$$ 298933 295641 292314 291067 292240 294532 296744 298388 299161 299151 299347 300629 302346 303151 303080 303390 304391
54206C04391P27K08P73J824J883J163R23J057N31l48m29M2mmJ471L626L903J900
$$ 304391 305118 305326 306099 307923 309806 310969 311892 312949 313480 313132 312703 312745 312741 312737 314208 317834 321737 323637
54188C23637J59L57J075M25j351l066m419n382n310m056k695k015j343Q9J739
$$ 323637 323796 324153 325228 325653 324302 321236 316817 311435 306125 302069 299374 297359 296016 296105 297844
54173B97844K580K418J560K66p47m35J050K095J628L79o01j332j884j424L88K166
$$ 297844 300424 302842 304402 304668 303921 303486 304536 306631 308259 308638 308037 306705 304821 303397 303785 305951
54157C05951K451J766J583J962J723M84j003k235l224l501k388m29P66N55K0K51
$$ 305951 308402 310168 311751 313713 315436 315920 314917 312682 309458 305957 303569 303140 303906 304461 304481 304732
54141C04732Q27P68J61k4N48J109Q99P5o87r99p22L57K146L623L415J443n84q62
$$ 304732 305559 306327 306488 306464 307012 308121 309020 309095 308408 307409 306687 307044 309190 312813 316228 317671 317087 316225
54123C16225N99K222K722K190J502J237J293J164O07Jj37p6o78k014k878k336
$$ 316225 316824 319046 321768 323958 325460 326697 327990 329154 329761 329762 329625 329549 328871 326857 323979 321643
54107C21643j140p33j277j619j013j2L97r8r13j115m55m0j270l596m456k442M58
$$ 321643 320503 319770 318493 316874 315861 315849 316246 316148 315235 314120 313665 313625 312355 308759 304303 301861 302319
54090C02319J211l78j848j657o98k28k00p3J97N73J147J473Q60k73n09O70K138
$$ 302319 303530 303152 301304 299647 298949 298721 298521 298448 298645 299218 300365 301838 302698 302425 301916 302586 304724
54073C04724K737K592K309J940J329O87K31j16l92n28p12r88o51R06K802L403
$$ 304724 307461 310053 312362 314302 315631 316318 316549 316433 316041 315513 314801 313813 313162 314068 316870 320273
54057C20273K545J671J614J756J650J738J938J385M08R06L414N510M756K033P3
$$ 320273 322818 324489 326103 327859 329509 331247 333185 334570 334978 335884 339298 344808 349564 351597 351670
54042C51670k76l66r34j045K0J566K590K991L258L823M915O295O914N582K399
$$ 351670 351394 351028 350094 349049 349069 350635 353225 356216 359474 363297 368212 374507 381421 387003 389402
54027C89402r74k778k806k443l093m578n170l545n72J406J166k76j241j202m39
$$ 389402 388428 385650 382844 380401 377308 372730 367560 364015 363443 364849 366015 365739 364498 363296 362857
54012C62857J028L050M497M155K446J084Q33O87k52j092l08J854L315K656P93
$$ 362857 363885 366935 371432 375587 378033 379117 379950 380637 380385 379293 378985 380839 384154 386810 387603
53997C87603l08K5Q54J209J026O28K70M31J586L280M230L864K975K364J814J171
$$ 387603 387295 387320 388174 389383 390409 391037 391307 391738 393324 396604 400834 404698 407673 410037 411851 413022
53981D13022J343L115N738P837R033R591R340Q309P648Q282R271R218Q681R164
$$ 413022 414365 417480 423218 431055 440088 449679 459019 467328 474976 483258 492529 501747 510428 519592
53967E19592J0290J0271R135Q858R875R999P860N163M241N095O143O370N379K791
$$ 519592 529882 540153 549288 558146 568021 578020 585880 591043 595284 600379 606522 612892 618271 621062
53953F21062q81l747m424l723l376l900m685n409o195o983p675q489r424r942
$$ 621062 620181 616434 612010 608287 604911 601011 596326 590917 584722 577739 570064 561575 552151 542209
53939E42209r649q721p319n565m340m779o363o878n252l136k618l589m564n027
$$ 542209 532560 523839 516520 510955 506615 501836 495473 488595 483343 480207 477589 474000 469436 464409
53925D64409n445n804n573m742l745k731j753j220j226j037j30P79N91o94k054
$$ 464409 458964 453160 447587 442845 439100 436369 434616 433396 432170 431133 431003 431782 432373 431679 429625
53910D29625k544j841k76J241K008K432L331M226L826K483K320M037N521M900
$$ 429625 427081 425240 424964 426205 428213 430645 433976 438202 442028 444511 446831 450868 456389 461289
53896D61289L306L060M559O578Q386R877J0820J1553J3195J5457J5611J1745N884
$$ 461289 464595 467655 472214 478792 487178 497055 507875 519428 532623 548080 563691 575436 581320
53883E81320J663n3r68j740j394L1J118J523K406M051N151M881L841K688J606
$$ 581320 582983 582930 581962 580222 578828 578859 579977 581500 583906 587957 593108 597989 601830 604518 606124
53868F06124J299K559M480N044L834K508K203K432L016M956Q428J1755J3502J4116
$$ 606124 607423 609982 614462 619506 623340 625848 628051 630483 633499 638455 646883 658638 672140 686256
53854F86256J4406J3952J2416J1095J1594J3472J4752J4414J3297J2537J2046
$$ 686256 700662 714614 727030 738125 749719 763191 777943 792357 805654 818191 830237
53843H30237J0774Q151M972K712J888J472K76j654l598n401p106p973p317o109
$$ 830237 841011 849162 854134 856846 858734 860206 860482 858828 855230 849829 842723 834750 827433 821324
53829H21324o252q108j0141j1255j2027j3297j4799j5799j5971j5156j3364j1461
$$ 821324 815072 806964 796823 785568 773541 760244 745445 729646 713675 698519 685155 673694
53817F73694j0785j1428j1881j0857q675o441m875m353n057o407p225p111o985
$$ 673694 662909 651481 639600 628743 620068 613627 608752 604399 599342 592935 585710 578599 571614
53804E71614p807r415j0894j1341j0185p781n819n937p496q027o332l850k460
$$ 571614 563807 554392 543498 532157 521972 514191 508372 502435 494939 486912 480580 476730 474270
53791D74270k335k723l363l980l746k511j562j888k660k716k444k717k940j935
$$ 474270 471935 469212 465849 461869 458123 455612 454050 452162 449502 446786 444342 441625 438685 436750
53777D36750k45L87l34q84l09O52J081J052Q17J09r87j555r40K85J060J006M64
$$ 436750 436505 436892 436558 435674 435365 436017 437098 438150 438967 439076 438089 436534 435594 435879 436939 437945 438409
53760D38409l0J00J239K916L863L302J949J186J483K089K171J812J765K617M281
$$ 438409 438379 438479 439718 442634 446497 449799 451748 452934 454417 456506 458677 460489 462254 464871 469152
53745D69152O136P511Q107Q095P852P673P722Q083Q765R618J0388J0898J1188
$$ 469152 475288 482799 490906 499001 506853 514526 522248 530331 539096 548714 559102 570000 581188
53732E81188J1283J0918R733P904O395O064O550O482N084L157J985J604P66j291
$$ 581188 592471 603389 613122 621026 627421 633485 640035 646517 651601 654758 656743 658347 659113 657822
53718F57822l739n248n595n630n912o198o309o611p223p465o860o218o779q363
$$ 657822 654083 648835 643240 637610 631698 625500 619191 612580 605357 597892 591032 584814 578035 569672
53704E69672r387q942p926p588p621o630m246j964j577l248n466o774p112p273
$$ 569672 560285 551343 543417 535829 528208 521578 517332 515368 513791 510543 505077 498303 491191 483918
53690D83918p390o711m990l281k623k601k148j390j379k088k207j241l64m68o94
$$ 483918 476528 469817 464827 461546 458923 456322 454174 452784 451405 449317 447110 445869 445505 445037 444343
53675D44343R1J441K121J883J262L55q89j705j297k13K98J41L14J098J600J161
$$ 444343 444434 445875 447996 449879 451141 451496 450607 448902 447605 447392 447690 447831 448145 449243 450843 452004
53659D52004J23q81j349p30R40K169J342q10j602J54K540L331L073L837N917P557
$$ 452004 452127 451246 449897 449167 450107 452276 453618 452808 451206 451360 453900 457231 460304 464141 470058 477615
53643D77615P744P455P644P489N781L197J884K797M589N522N492N433N477M901
$$ 477615 485359 492814 500458 507947 513728 516925 518809 521606 526195 531717 537209 542642 548119 553020
53629E53020L627K493J893J332O97Q20K045L243L169K115J233Q31L03o71j823
$$ 553020 556647 559140 561033 562365 563062 563882 565927 569170 572339 574454 575687 576518 576821 576150 574327
53614E74327k830l355k927j596l38pl24o05p32n94N53K755M131K799k47j944r43
$$ 574327 571497 568142 565215 563619 563281 563274 562950 562345 561613 561019 561572 564327 568458 571257 571010 569066 568123
53597E68123R38J265m22k912m715m735k800j65J408J448P92k2j060j656n23K117
$$ 568123 569061 570326 569904 566992 562277 557542 554742 554577 555985 557433 558225 558203 557143 555487 554964 557081
53581E57081M029L635K054J526K728M509N475M903K884N57m50M10J943K765K847
$$ 557081 561110 564745 566799 568325 571053 575562 581037 585940 588824 589381 588931 589341 591284 594049 596896
53566E96896K935L205L409L679M256M789M824M689M989N520N612N464O085P714
$$ 596896 599831 603036 606445 610124 614380 619169 623993 628682 633671 639191 644803 650267 656352 664066
53552F64066R199R402Q649Q073P883P087N185L338L138M570O163P092P929Q899
$$ 664066 673265 682667 691316 699389 707272 714359 719544 722882 726020 730590 736753 743845 751774 760673
53538G60673Q807O853M355L163K937J817l91j634o42J168J686P06m24q76j004
$$ 760673 769480 776333 780688 783851 786788 788605 788214 786580 785938 787106 788792 789498 789074 788198 787194
53523G87194j378k028k583k699k385j994j714j276n76l13j261l072m566n090m782
$$ 787194 785816 783788 781205 778506 776121 774127 772413 771137 770561 770248 768987 765915 761349 756259 751477
53508G51477l757k163q74q89j835k169j096O85K196K997K723J180p53j585r61
$$ 751477 747720 745557 744683 743794 741959 739790 738694 739379 741575 744572 747295 748475 747722 746137 745176
53493G45176J25J085K239L331L219J825R46J993M170N780O284O151N694N096M781
$$ 745176 745301 746386 748625 751956 755175 757000 757946 759939 764109 769889 776173 782324 788018 793114 797895
53478G97895M851M975N333O711Q979J0664J0895J0622J1072J2154J3367J4944
$$ 797895 802746 807721 813054 819765 828744 839408 850303 860925 871997 884151 897518 912462
53466I12462J6909J8240J8414J8701K0287K2118K2386K1573K2048K4816K8358
$$ 912462 929371 947611 966025 984726 1005013 1027131 1049517 1071090 1093138 1117954 1146312
53455A146312L0843L2006L2591L3170L4060L5581L7786M0139M1740M2035M1604
$$ 1146312 1177155 1209161 1241752 1274922 1308982 1344563 1382349 1422488 1464228 1506263 1547867
53444A547867M1985M3960M6061M6002M3737M1651M1235M1300M0547L9986M1026
$$ 1547867 1589852 1633812 1679873 1725875 1769612 1811263 1852498 1893798 1934345 1974331 2015357
53433B015357M2630M2656M1261M0560M1246M1691M0609L8689L7078L5789L4245
$$ 2015357 2057987 2100643 2141904 2182464 2223710 2265401 2306010 2344699 2381777 2417566 2451811
53422B451811L2337L0409K9013K8817K9913L1113L0948K9452K7973K7090K5726
$$ 2451811 2484148 2514557 2543570 2572387 2602300 2633413 2664361 2693813 2721786 2748876 2774602
53411B774602K2685J8187J3347Q899M900J355j480l463n206q004j2570j7772k1467
$$ 2774602 2797287 2815474 2828821 2837720 2842620 2843975 2842495 2839032 2833826 2825822 2813252 2795480 2774013
53398B774013k2924k3680k5349k7612k9267l0283l1463l2691l3069l2651l2575
$$ 2774013 2751089 2727409 2702060 2674448 2645181 2614898 2583435 2550744 2517675 2485024 2452449
53387B452449l3343l4166l4245l3697l2958l2185l1598l1616l2107l1903k9559
$$ 2452449 2419106 2384940 2350695 2316998 2284040 2251855 2220257 2188641 2156534 2124631 2095072
53376B095072k4705j8711j3865j1387j0236q505n972m174l661k717L03M616Q321
$$ 2095072 2070367 2051656 2037791 2026404 2016168 2007663 2001691 1997517 1993856 1991139 1991442 1996058 2004379
53363B004379J0999J3541J6297J9000K1916K5347K8474L0282L1303L2830L4839
$$ 2004379 2015378 2028919 2045216 2064216 2086132 2111479 2139953 2170235 2201538 2234368 2269207
53352B269207L6482L8324M1944M7165N1743N4336N6062N8533O1851O5214O8078
$$ 2269207 2305689 2344013 2385957 2433122 2484865 2539201 2595263 2653796 2715647 2780861 2848939
53341B848939P0136P1494P3394P7390Q3020Q7669Q9621R0056R1117R3224R5357
$$ 2848939 2919075 2990569 3063963 3141353 3224373 3312042 3401663 3491719 3582836 3676060 3771417
53330C771417R6999R8404R9549J00059R9986R9643R8810R6850R3607Q9703Q5837
$$ 3771417 3868416 3966820 4066369 4166428 4266414 4366057 4464867 4561717 4655324 4745027 4830864
53319D830864Q2220P8506P4122O8846O3232N8176N3853M9327M3468L6085K8047
$$ 4830864 4913084 4991590 5065712 5134558 5197790 5255966 5309819 5359146 5402614 5438699 5466746
53308E466746K0373J3226N665l526j4594k6593l8386m9464n9599o8395p5731q1941
$$ 5466746 5487119 5500345 5506010 5502484 5487890 5461297 5422911 5373447 5313848 5245453 5169722 5087781
53296E087781q6885q9608q9973q9899r1588r4778r7152r7420r6495r5516r4207
$$ 5087781 5000896 4911288 4821315 4731416 4639828 4545050 4447898 4350478 4253983 4158467 4064260
53285D064260r1929q9174q7196q6662q7187q7688q6975q4500q0788p6789p2857
$$ 4064260 3972331 3883157 3795961 3709299 3622112 3534424 3447449 3362949 3282161 3205372 3132515
53274C132515o8847o4933o1506n8396n5074n1471m7826m3936l9628l5690l3044
$$ 3132515 3063668 2998735 2937229 2878833 2823759 2772288 2724462 2680526 2640898 2605208 2572164
53263B572164l1179k8794k5992k4185k3653k2952k1260j9530j8511j7291j5065
$$ 2572164 2540985 2512191 2486199 2462014 2438361 2415409 2394149 2374619 2356108 2338817 2323752
53252B323752j2826j1850j1546j0342p952n149j945K351P223J0696J1472J0487
$$ 2323752 2310926 2299076 2287530 2277188 2269236 2264087 2262142 2264493 2271716 2282412 2293884 2304371
53240B304371R964J1492J5174J9973K4431K7426K8805K9457L0639L2985L6023
$$ 2304371 2314335 2325827 2341001 2360974 2385405 2412831 2441636 2471093 2501732 2534717 2570740
53229B570740L8709M0581M2009M3192M3368M1808L9226L7264L6535L6042L4712
$$ 2570740 2609449 2650030 2692039 2735231 2778599 2820407 2859633 2896897 2933432 2969474 3004186
53218C004186L2581L0145K7350K3806J9387J4232Q603L136j344m798q301j2884
$$ 3004186 3036767 3066912 3094262 3118068 3137455 3151687 3160290 3163426 3162082 3157284 3148983 3136099
53206C136099j8323k3372k7063k9564l2062l5869m1184m6678n0671n2892n4514
$$ 3136099 3117776 3094404 3067341 3037777 3005715 2969846 2928662 2881984 2831313 2778421 2723907
53195B723907n6335n7705n7670n6586n5933n6678n8252n9117n8100n5265n1752
$$ 2723907 2667572 2609867 2552197 2495611 2439678 2383000 2324748 2265631 2207531 2152266 2100514
53184B100514m8843m7228m6917m7481m8131m8107m7411m6820m6743m6479m5201
$$ 2100514 2051671 2004443 1957526 1910045 1861914 1813807 1766396 1719576 1672833 1626354 1581153
53173A581153m3188m1429m0192l8801l6607l3571l0083k6851k4657k3540k2653
$$ 1581153 1537965 1496536 1456344 1417543 1380936 1347365 1317282 1290431 1265774 1242234 1219581
53162A219581k1521k0878k1307k1891k1491k0759k1204k2619k3285k2699k2190
$$ 1219581 1198060 1177182 1155875 1133984 1112493 1091734 1070530 1047911 1024626 1001927 979737
53151I79737k2420k2236k0727j8851j7956j7870j7489j6338j4715j2985j1595
$$ 979737 957317 935081 914354 895503 877547 859677 842188 825850 811135 798150 786555
53140G86555j1096j1541j2266j2715j2967j3223j3435j3581j3590j2894j1033
$$ 786555 775459 763918 751652 738937 725970 712747 699312 685731 672141 659247 648214
53129F48214q780p651q031q871r364r618r411p885n301l703m572o699p509o013
$$ 648214 639434 631783 623752 614881 605517 595899 586488 578603 573302 569599 565027 558328 550819 544806
53115E44806l576k156k565m170n670o136n578m519l362k437k155k354k031p25
$$ 544806 541230 539074 536509 532339 526669 520533 514955 510436 507074 504637 502482 500128 498097 497372
53101D97372L94J0j280j874j565j357j334q49n55j778l753m064k376j068j325
$$ 497372 497766 497776 496496 494622 493057 491700 490366 489517 488962 487184 483431 479367 476991 475923 474598
53086D74598j432j77P58k73j972k243j388r53r98o53q5K02Q79K567M151M228L291
$$ 474598 473166 472989 473747 473474 471502 469259 467871 466918 465920 465267 465182 465384 466263 468830 472981 477209 480500
53069D80500K640K179J179J66Q3M60M21N41J588K450J709M97J166L514M850L909
$$ 480500 483140 485319 486498 486664 486747 487207 487628 488169 489757 492207 493916 494413 495579 499093 503943 507852
53053E07852K192J302J133J077Q96l7k417n233o109m223j500k40o65j493j706
$$ 507852 510044 511346 512479 513556 514452 514415 511998 506765 500656 496433 494933 494693 494028 492535 490829
53038D90829j220n72n55j536k892l647l644l473l480l603l886m293m236l214j630
$$ 490829 489609 489037 488482 486946 484054 480407 476763 473290 469810 466207 462321 458028 453792 450578 448948
53023D48948k23Q80J659J485J60r93m90J181K158J619K66j160k369k812k054p54
$$ 448948 448725 449605 451264 452749 452909 451916 451426 452607 454765 456384 456650 455490 453121 450309 448255 447501
53007D47501K0L22P65R24j30j917k936k904k918l410l657l352k896k034o8K219
$$ 447501 447521 447843 448608 449532 449402 447485 444549 441645 438727 435317 431660 428308 425412 423378 423310 425529
52991D25529K797J150p96j149j9J487K698L132K290N93o31p70o23r68j510j649
$$ 425529 428326 429476 428680 427531 427512 428999 431697 434829 437119 437712 437081 436311 435688 434720 433210 431561
52975D31561j249k68J258K544K601J699J088J024N01p01j332o94J80J18o44j354
$$ 431561 430312 430044 431302 433846 436447 438146 439234 440258 440759 440058 438726 438032 438212 438330 437686 436332
52959D36332j880k157j662l62Q29J216J104Q70L90j30j9M55Pj570k527j499N47
$$ 436332 434452 432295 430633 430271 431100 432316 433420 434290 434680 434550 434531 434986 434993 433423 430896 429397 429944
52942D29944J835K204K661L327L276J997J0j716k304j430J09Q97M99o3J83J013
$$ 429944 431779 433983 436644 439971 443247 445244 445254 443538 441234 439804 439913 440810 441309 441246 441429 442442
52926D42442J820K553L180L347L269L875N182N779M840L571L333L471K474M55
$$ 442442 444262 446815 449995 453342 456611 460486 465668 471447 476287 479858 483191 486662 489136 489591
52912D89591j150j769k062k336k046r30L76R15J39j628k849j784J270L622L105
$$ 489591 488441 486672 484610 482274 480228 479298 479674 480589 480728 479100 476251 474467 475737 479359 482464
52897D82464O84j065j182n90k4L84k3j812l721l595j562l17j591l904m692l228
$$ 482464 483148 482083 480901 480311 480287 480671 480648 478836 475115 471520 469958 469641 468050 464146 459454 456226
52881D56226n22K250M011L744J678k36l69M48J83j448k733k555j750j563k055
$$ 456226 455704 457954 461965 465709 467387 467151 466782 467230 467413 465965 463232 460677 458927 457364 455309
52866D55309k692l404m134m104k662n22Q75J129J061J191J039L05k47K84J675
$$ 455309 452617 449213 445079 440975 438313 437791 438666 439795 440856 442047 443086 443391 443144 443428 445103
52851D45103K937L414L013J822K24r48j174r66j186j859k366k508k484k020o06
$$ 445103 448040 451454 454467 456289 456513 455565 454391 453425 452239 450380 448014 445506 443022 441002 440396
52836D40396J238K055J252m9l88M20J558K331K488J961J032M78Q70J695J696K48
$$ 440396 441634 443689 444941 444892 444504 444924 446482 448813 451301 453262 454294 454772 455642 457337 459033 459281
52820D59281j761k626j481P47K254K266J693J715K314K711K668K558K531K533
$$ 459281 457520 454894 453413 454160 456414 458680 460373 462088 464402 467113 469781 472339 474870 477403
52806D77403K842L562L847K828J186M29N14j86k155l602l045j564j227k254l302
$$ 477403 480245 483807 487654 490482 491668 492097 492611 492425 490270 486668 483623 482059 480832 478578 475276
52791D75276l799m317m923m835m128m220n833p406o701l692q06r0j025j749j650
$$ 475276 471477 467160 462237 457402 453274 449054 443221 435815 429114 425422 424616 424526 423501 421752 420102
52776D20102j646k013j561L45K173J886l32k261k255o48J190K055J401j66j010
$$ 420102 418456 416443 414882 415227 417400 419286 418954 416693 414438 413790 414980 417035 418436 418270 417260
52761D17260j97J031Q54m04p71K08Q25J41n18J26J327J873K054K667L312L185
$$ 417260 417063 418094 418948 418544 417773 417981 418806 418947 418429 418555 419882 421755 423809 426476 429788 432973
52745D32973K523J822N79j679l849m359l394k561k588k691k185j376p81l88J0
$$ 432973 435496 437318 437897 436218 432369 428010 424616 422055 419467 416776 414591 413215 412434 412046 412056
52730D12056L72L56n09k241l764l574j580M59J070P27O20Q10P42O48R63J079L29
$$ 412056 412428 412784 412275 410034 406270 402696 401116 401575 402645 403372 403992 404802 405544 406192 407155 408234 408563
52713D08563l21O86K843L804K516N41k33K12P48Q02M87j39j046j872k140j746
$$ 408563 408242 408928 411771 415575 418091 418632 418399 418611 419359 420161 420648 420509 419463 417591 415451 413705
52697D13705r39j10M08O47J043J776K212J587J55j021j339j082n24N18K067L563
$$ 413705 412766 412656 413064 413711 414754 416530 418742 420329 420484 419463 418124 417042 416518 417036 419103 422666
52681D22666M380M329L550K390J586J935L332M436L706Q66k726n057m939k795
$$ 422666 427046 431375 434925 437315 438901 440836 444168 448604 452310 453176 450450 445393 440454 437659
52667D37659n3K107L289L450K628J360N96O16N88j49r56q13J0K08p33j881k073
$$ 437659 437606 439713 443002 446452 449080 450440 451036 451652 452240 452091 451135 450322 450332 450540 449807 447926 445853
52650D45853j148J75J048J104O41K23j29r64k279k948k127o67p9m03l02P47J707
$$ 445853 444705 444880 445928 447032 447673 447896 447767 446803 444524 441576 439449 438782 438703 438300 437998 438745 440452
52633D40452J719J355J440J610R29n75j857k046j174R0R07P24k16q91o00O0j71
$$ 440452 442171 443526 444966 446576 447505 446930 445073 443027 441853 441943 442850 443574 443358 442467 441867 441927 441756
52616D41756j453k309j370P27J780M89k062l566k695J04L371N573N710L935J578
$$ 441756 440303 437994 436624 437351 439131 439620 437558 433992 431297 431401 434772 440345 446055 449990 451568
52601D51568l9p06p71N3K200M759N860M835K936J571J016J242K510M370N309M453
$$ 451568 451529 450823 450052 450105 452305 457064 462924 467759 470695 472266 473282 474524 477034 481404 486713 491166
52585D91166K654R91o66k589l869l643k659k120j702m48J082J329J93r06j279
$$ 491166 493820 494811 494145 491556 487687 484044 481385 479265 477563 477115 478197 479526 479719 478813 477534
52570D77534j531j734q60J456L965N220M874L225O92j831l304l734m087m690m757
$$ 477534 476003 474269 473409 474865 478830 484050 488924 492149 492841 491010 487706 483972 479885 475195 470438
52555D70438l910k917k336j581k32Q25N98l58o86j60J99k04p21m78N03J542K233
$$ 470438 466528 463611 461275 459694 459462 460287 460885 460527 459841 459681 459880 459676 458955 458477 458980 460522 462755
52538D62755K741L228L336K520R07n64j140j010p47l54M48J235J127J70l29O60
$$ 462755 465496 468724 472060 474580 475487 474923 473783 472773 472026 471672 472120 473355 474482 474652 474323 474983
52522D74983K519L685L512K865K799L096K591R14p00r33k47l33j744l152l196
$$ 474983 477502 481187 484699 487564 490363 493459 496050 496964 496264 495331 495084 494751 493007 489855 486659
52507D86659k025n49P50J504J084m80k041k766l207l905m038k869j546j717k881
$$ 486659 484634 484085 484835 486339 487423 486943 484902 482136 478929 475024 470986 468117 466571 464854 461973
52492D61973l096j909o79n0P88K067K628J873Q67P60J412K114K467K070P27n38
$$ 461973 458877 456968 456289 456239 457027 459094 461722 463595 464462 465222 466634 468748 471215 473285 474012 473474
52476D73474j38J773L006K193N26j98J00M37N07N48M68K46M19J103J418R23O59
$$ 473474 473336 475109 478115 480308 480834 480636 480736 481173 481680 482228 482696 482942 483361 484464 485882 486805 487464
52459D87464J473K195J061j407k653j304J224K622K272J506J863L463M864M545
$$ 487464 488937 491132 492193 490786 488133 486829 488053 490675 492947 494453 496316 499779 504643 509188
52445E09188K616P82M15J101J417O01j046k843m097m281l555k851k812k878k121
$$ 509188 511804 512586 513001 514102 515519 516120 515074 512231 508134 503853 500298 497447 494635 491757 489636
52430D89636o79M21O74N32M92N19M71L90J09p28j877k252j111O85J422O32j58
$$ 489636 488957 489378 490052 490584 491076 491595 492066 492456 492565 491837 489960 487708 486597 487282 488704 489336 489178
52413D89178N81K236K824J753O65J064K364L127L273L682M286M021K568Q36l50
$$ 489178 489759 491995 494819 496572 497237 498301 500665 503792 507065 510747 515033 519054 521622 522458 522108
52398E22108q61p33k30l49j757l302l138j506n87j267k070j966k063l200l922
$$ 522108 521247 520514 520284 519935 518178 514876 511738 510232 509645 508378 506308 504342 502279 499079 495157
52383D95157k691n52M15K55N98J758K412J853O22r04k729m091l770j886O0J071
$$ 495157 492466 491914 492329 492584 493182 494940 497352 499205 499827 498923 496194 492103 488333 486447 486507 487578
52367D87578J456J632J548J379J499J519O88n62q49L8P56O77R51K453M036M168
$$ 487578 489034 490666 492214 493593 495092 496611 497299 496737 495888 495926 496682 497359 498310 500763 504799 508967
52351E08967L301L191M404N741N925M745K807J154J116L438P183J0126J0574Q503
$$ 508967 512268 515459 519863 525604 531529 536274 539081 540235 541351 544789 551972 562098 572672 581175
52337E81175N139J932j13r13j334k254l452l953l453k635j905q86L38O06o46j892
$$ 581175 586314 588246 588133 587220 585886 583632 580180 576227 572774 570139 568234 567348 567686 568292 567646 565754
52321E65754j233P39J447j07j918j761M1J637K258K400K372K223K696M554O971
$$ 565754 564521 565260 566707 566600 564682 562921 562962 564599 566857 569257 571629 573852 576548 581102 588073
52306E88073Q043P154N528M166K650O14r19p55P04J892K013J631J536J804K004
$$ 588073 596116 603270 608798 612964 615614 616228 615309 614554 615258 617150 619163 620794 622330 624134 626138
52291F26138J826J345P69J50n50j026o63O73K216L261M195N702P285P778P271
$$ 626138 627964 629309 630078 630228 629678 628652 627989 628662 630878 634139 638334 644036 651321 659099 666370
52276F66370P157P847P887O241M282M299O710R886J2309J3812J4964J6297J8110
$$ 666370 673527 681374 689261 695502 699784 704083 710793 720679 732988 746800 761764 778061 796171
52263G96171K0146K1323K0607J8383J6393J6043J7138J8448J9136J9301J9404
$$ 796171 816317 837640 858247 876630 893023 909066 926204 944652 963788 983089 1002493
52252A002493J9666K0116K0854K1862K2621K2449K1495K1006K2125K4690K7452
$$ 1002493 1022159 1042275 1063129 1084991 1107612 1130061 1151556 1172562 1194687 1219377 1246829
52241A246829K9203K9304K7793K5696K4655K5332K6372K5960K4041K1988K0387
$$ 1246829 1276032 1305336 1333129 1358825 1383480 1408812 1435184 1461144 1485185 1507173 1527560
52230A527560J8576J6253J4065J2262J0230P719N351L447J627l0p79o20n43q69
$$ 1527560 1546136 1562389 1576454 1588716 1598946 1606665 1612016 1615463 1617090 1617060 1616281 1615661 1615118 1614249
52216A614249q56m41o78j633j782o40Q5m21M5L430P656Q982P260N862O679Q139
$$ 1614249 1613393 1612952 1612274 1610641 1608859 1608219 1608304 1607883 1607928 1611358 1619014 1627996 1635256 1641118 1647797 1655936
52200A655936Q657R146J0925J3314J4813J5339J5828J6619J7465J8443J9678K0579
$$ 1655936 1664593 1673739 1684664 1697978 1712791 1728130 1743958 1760577 1778042 1796485 1816163 1836742
52188A836742K0361J9209J8117J7564J6920J5341J2831J0240Q298O944N711M527
$$ 1836742 1857103 1876312 1894429 1911993 1928913 1944254 1957085 1967325 1975623 1982567 1988278 1992805
52176A992805L706L185K288O18j333k778l486l757m030m858o675r006j0418r996
$$ 1992805 1996511 1999696 2001984 2002602 2001269 1998491 1995005 1991248 1987218 1982360 1975685 1966679 1956261 1946265
52162A946265q496p439p350p566p402o790n908m938m189l812l498k928k357k147
$$ 1946265 1937769 1930330 1922980 1915414 1908012 1901222 1895314 1890376 1886187 1882375 1878877 1875949 1873592 1871445
52148A871445j843m48K083M208M146K003J03P43L554N843N989N525O708R046J0107
$$ 1871445 1869602 1869154 1871237 1875445 1879591 1881594 1881697 1882440 1885994 1891837 1897826 1903351 1910059 1919105 1929212
52133A929212R409Q977R657R487P139M606M360N559N407L281R70n59k131m084
$$ 1929212 1938621 1947598 1957255 1966742 1973881 1978487 1982847 1988406 1993813 1997094 1998064 1997505 1995374 1991290
52119A991290n357n516n918p826j0363j1304r604o723n325o438q081p573n145
$$ 1991290 1985933 1980417 1974499 1966673 1956310 1945006 1935402 1928679 1923354 1916916 1908835 1901262 1896117
52106A896117l808n062o672o023l906k824k981k442o90Q01J311J765K504K443
$$ 1896117 1892309 1887247 1880575 1874552 1870646 1867822 1864841 1862399 1861709 1862510 1863821 1865586 1868090 1870533
52092A870533J106l18o07J75J429K663L080J991J80l67J195L520M587L621J439
$$ 1870533 1871639 1871321 1870714 1870889 1872318 1874981 1878061 1880052 1880232 1879865 1881060 1884580 1889167 1892788 1894227
52077A894227j82K51K389M042L701K452K172K854L540M781P698J1164J2953J3578
$$ 1894227 1894045 1894296 1896685 1900727 1904428 1906880 1909052 1911906 1915446 1920227 1927925 1939089 1952042 1965620
52063A965620J5896K0355K3756K3923K2749K3091K4963K6554K7033K6597K5404
$$ 1965620 1981516 2001871 2025627 2049550 2072299 2095390 2120353 2146907 2173940 2200537 2225941
52052B225941K3948K3176K2935K1800J9529J7909J7961J8300J7870J8076K0227
$$ 2225941 2249889 2273065 2296000 2317800 2337329 2355238 2373199 2391499 2409369 2427445 2447672
52041B447672K2630K2752K0916J9475J9205J8954J8009J6514J4075J0269O316
$$ 2447672 2470302 2493054 2513970 2533445 2552650 2571604 2589613 2606127 2620202 2630471 2636787
52030B636787L974K835P07l201p324j0057j1286j1373j0385q953q442r660j2099
$$ 2636787 2640761 2643596 2644303 2641102 2633778 2623721 2612435 2601062 2590677 2581724 2573282 2563622 2551523
52017B551523j4760j6787j7358j6046j3648j1661j0642r759q143n899l675j835
$$ 2551523 2536763 2519976 2502618 2486572 2472924 2461263 2450621 2440862 2432719 2426820 2423145 2421310
52005B421310k09J795M668P897R967J0057R313R554J1039J2591J3560J4279J4659
$$ 2421310 2421101 2422896 2427564 2435461 2445428 2455485 2464798 2474352 2485391 2497982 2511542 2525821 2540480
51992B540480J3854J1834J0011R545R798R164O897L573K22k420m099n028n769
$$ 2540480 2554334 2566168 2576179 2585724 2595522 2604686 2611583 2615156 2615378 2612958 2608859 2603831 2598062
51979B598062o886q602j0611j2176j2735j2648j2979j4188j5397j5603j5275j5821
$$ 2598062 2591176 2582574 2571963 2559787 2547052 2534404 2521425 2507237 2491840 2476237 2460962 2445141
51967B445141j7572j9278j9839j9640j9590j9596j8905j7686j7257j8433k0296
$$ 2445141 2427569 2408291 2388452 2368812 2349222 2329626 2310721 2293035 2275778 2257345 2237049
51956B237049k1236k0940k0648k1363k2503k2714k1535j9725j8291j7891j8845
$$ 2237049 2215813 2194873 2174225 2152862 2130359 2107645 2086110 2066385 2048094 2030203 2011358
51945B011358k0917k3108k4478k5286k6552k8464k9952l0078k9060k7746k6869
$$ 2011358 1990441 1967333 1942855 1917569 1891017 1862553 1832601 1802523 1773463 1745717 1718848
51934A718848k7004k8324k9922l0254k8873k7165k6784k7923k9477l0330l0018
$$ 1718848 1691844 1663520 1633598 1603344 1574471 1547306 1520522 1492599 1463122 1432792 1402774
51923A402774k8811k7577k7080k7027k6520k5592k5328k5986k6104k4279k0977
$$ 1402774 1373963 1346386 1319306 1292279 1265759 1240167 1214839 1188853 1162749 1138470 1117493
51912A117493j7616j4738j2044r598p752o249m433k207P1K313M475N941O079N326
$$ 1117493 1099877 1085139 1073095 1063497 1055745 1049496 1045063 1042856 1042927 1045240 1049715 1055656 1061735 1067061
51898A067061M834M848M208J787j891m898n718m780l855l895l906k523k7K119
$$ 1067061 1071895 1076743 1080951 1082738 1080847 1075949 1070231 1065451 1061596 1057701 1053795 1051272 1051245 1053364
51884A053364L369M388N577O823Q755J2327J6786J9837K0641K0889K2069K3501
$$ 1053364 1056733 1061121 1066698 1073521 1082276 1094603 1111389 1131226 1151867 1172756 1194825 1218326
51872A218326K4134K4302K4324K3183K0391J7521J5930J4524J1812Q553N831J984
$$ 1218326 1242460 1266762 1291086 1314269 1334660 1352181 1368111 1382635 1394447 1403000 1408831 1410815
51860A410815n468j5570k4572l0629l4935l8336l9872l9116l7219l4872l1615
$$ 1410815 1405347 1389777 1365205 1334576 1299641 1261305 1221433 1182317 1145098 1110226 1078611
51849A078611k7852k5070k3217k0315j5822j1935j0187q977o388l481k572l586
$$ 1078611 1050759 1025689 1002472 982157 966335 954400 944213 935236 928848 925367 922795 919209
51837I19209m552m894n919q194j0431j1390j1375j1366j1573j1443j0592r310
$$ 919209 914657 909763 903844 895650 885219 873829 862454 851088 839515 828072 817480 808170
51825H08170q210p443o359m270j574M35J110J264K151M040O117P514Q056Q326
$$ 808170 799960 792517 786158 781888 780314 780749 781859 783123 785274 789314 795431 802945 811001 819327
51811H19327R043J0128J0400Q696N224J385j672l632m385l847k605j808j979k637
$$ 819327 828370 838498 848898 857594 862818 864203 862531 858899 854514 850667 848062 846254 844275 841638
51797H41638l255l843m297m024k770j168m4L50R1q99k691n063p507r277r638q701
$$ 841638 838383 834540 830243 826219 823449 822281 822237 822587 822678 821779 819088 814025 806518 797241 787603 778902
51781G78902p762p967q743q562p085n416m291l418k761k740k766j287J731L957
$$ 778902 771140 763173 754430 745868 738783 733367 729076 725658 722897 720157 717391 716104 717835 721792
51767G21792L579J660K93l34j310k429k409j361j059k255l383k667m59J373J761
$$ 721792 725371 727031 727324 726990 725680 723251 720842 719481 718422 716167 712784 710117 709658 711031 712792
51752G12792J334J262J825K283J892Q03j72m82k13L37R89J462J437J105J137J682
$$ 712792 714126 715388 717213 719496 721388 722191 722019 721537 721324 721661 722650 724112 725549 726654 727791 729473
51736G29473J935J175q3o29j10M26l02k294l996l750j663K41K30j067j615o86
$$ 729473 731408 732583 732500 731871 731761 732187 731885 729591 725595 721845 720182 720423 720653 719586 717971 717285
51720G17285M50P16P06J410K618L545M152M753N025M479L597L431M311N716P162
$$ 717285 717735 718451 719157 720567 723185 726730 730882 735635 740660 745139 748736 752167 756478 762194 769356
51705G69356Q345Q749Q045O739N541M249K160n73k984m639n955p048p410p027
$$ 769356 777701 786450 794495 801234 806775 811024 813184 812611 809627 804988 799033 791985 784575 777548
51691G77548o822p481q527r077q887q155o909n166l260j503J06J462K159K172
$$ 777548 770726 763245 754718 745641 736754 728599 721690 716524 713264 711761 711867 713329 715488 717660
51677G17660K226K741L104K817K878M667P564R123Q028N567L591K339J374J383
$$ 717660 719886 722627 725731 728548 731426 736093 743657 752780 760808 766375 769966 772305 773679 775062
51663G75062L322O283Q078P926O945N775L544j20l674n305m952l627j924l67j73
$$ 775062 778384 784667 792745 800671 807616 813391 816935 816815 813141 807836 802884 799257 797333 796966 796793
51648G96793k014m502n523m781l743l350l164k639j855r86k62m25j851l303l082
$$ 796793 794779 790277 784754 779973 776230 772880 769716 767077 765222 764236 763974 763549 761698 758395 755313
51633G55313j558q21j435j318J108M144M537J143m155q451r828q064m628j688
$$ 755313 753755 752934 751499 750181 751289 755433 759970 761113 756958 748507 738679 730615 725987 724299
51619G24299l78k2O46J880K895K820J333j029k783k444r9K529L948M245M412N220
$$ 724299 723921 723899 724545 726425 729320 732140 733473 732444 729661 727217 727118 729647 733595 737840 742252 747472
51603G47472P158J0234J3224J4162J2525R860P440M516K18m129o369o522o437
$$ 747472 754630 764864 778088 792250 804775 814635 822075 826591 826809 822680 816311 809789 803352
51590H03352o702o016l765j343j80lK9l18j758m014o145p861r432j0447r770p146
$$ 803352 796650 790634 786869 785526 785346 785343 785372 785054 783296 779282 773137 765276 755844 745397 735627 728481
51574G28481m059k284j905j523l23Q75J050N32K62J71n08j582j970j542j335j633
$$ 728481 724422 722138 720233 718710 718387 719262 720312 720844 721106 721277 720769 719187 717217 715675 714340 712707
51558G12707j426n60o88k792n133n466m239l670m300m610l889l214l146k477l06
$$ 712707 711281 710721 710033 707241 702108 696642 692403 688733 684433 679823 675934 672720 669574 667097 666791
51543F66791K169L125K443J504J308J807K695L943N561P363Q989J0065J0546J0847
$$ 666791 668960 672085 674528 676032 677340 679147 681842 685785 691346 698709 707698 717763 728309 739156
51529G39156J1159J0701Q430M715J413k04p89j530k170j439R10L585N374O462
$$ 739156 750315 761016 769446 774161 775574 775370 774581 773051 770881 769442 770352 773937 779311 785773
51515G85773P854J0072J2842J5553J7630J8698J8835J8683J9063K0234K1588K2093
$$ 785773 793627 803699 816541 832094 849724 868422 887257 905940 925003 945237 966825 988918
51503I88918K1158J9241J7636J7481J8791K0665K2517K4800K8016L1278L2589
$$ 988918 1010076 1029317 1046953 1064434 1083225 1103890 1126407 1151207 1179223 1210501 1243090
51492A243090L0776K6551K1428J6190J0772M990j383q625j6338k3064k7579l0336
$$ 1243090 1273866 1300417 1321845 1338035 1348807 1353797 1352414 1343789 1327451 1304387 1276808 1246472
51480A246472l2710l4963l5990l5043l2648k9722k6836k4360k2222j9428j5024
$$ 1246472 1213762 1178799 1142809 1107766 1075118 1045396 1018560 994200 971978 952550 937526
51469I37526r875o195m918m815m642m666n353o118o465o992q136r072r172r276
$$ 937526 927651 921456 916538 911723 907081 902415 897062 890944 884479 877487 869351 860279 851107 841831
51455H41831j0141j0863j0379r468r396r598q805p577p473q065p314m974l248
$$ 841831 831690 820827 810448 800980 791584 781986 773181 765604 758131 750066 742752 737778 734530
51442G34530l575m837n427n276n001m594l811k734j410n2K66j394l846m478k552
$$ 734530 730955 726118 720691 715415 710414 705820 702009 699275 697865 697813 698079 696685 692839 688361 685809
51427F85809j03J060J437J998K196J299J43j36qo23j820k696l257l976m361l584
$$ 685809 685706 686766 688203 690201 692397 693696 693839 693703 693695 693072 691252 688556 685299 681323 676962 673378
51411F73378k183j550j933k247j844j161o62k72k1k39r38j654j986j831j341j088
$$ 673378 671195 669645 667712 665465 663621 662460 661798 661526 661505 661266 660328 658674 656688 654857 653516 652428
51395F52428j787l112l490j933M38J839K174K718L925N046N826O939Q513R658
$$ 652428 650641 647529 644039 642106 642544 644383 646557 649275 653200 658246 664072 671011 679524 689182
51381F89182R933J0059J0656J1212J0960R893Q414O711N001L847L632M027M247
$$ 689182 699115 709174 719830 731042 742002 751895 760309 767020 772021 775868 779500 783527 787774
51368G87774L568J754n73k183k609k997m608o703p308o096m993n454o641p063
$$ 787774 791342 793096 792523 790340 787731 784734 780126 773423 766115 760019 755026 749572 742931 735868
51354G35868o586n781m511k569q20l41p97r38l48L50P47J091J523J759J539R33
$$ 735868 729282 723501 718990 716421 715601 715260 714463 713525 713177 713527 714274 715365 716888 718647 720186 721119
51338G21119M79J189L698O857Q358P659P155R061J2193J3732J3388J3456J4974
$$ 721119 721598 722787 726485 733342 741700 749359 756514 765575 777768 791500 804888 818344 833318
51325H33318J6451J6917J7820K0625K4466K7685L0285L3315L6785L9812M2196
$$ 833318 849769 866686 884506 905131 929597 957282 987567 1020882 1057667 1097479 1139675
51314A139675M4501M6768M8236M8082M5650M0380L2400K2879J3089L443n959j4551
$$ 1139675 1184176 1230944 1279180 1327262 1372912 1413292 1445692 1468571 1481660 1485103 1479144 1464593
51302A464593k1950k8843l6039m2916m7861n0042m9943m8411m6153m3952m2227
$$ 1464593 1442643 1413800 1377761 1334845 1286984 1236942 1186999 1138588 1092435 1048483 1006256
51291A006256m0276l6983l2380k7777k4215k1544j9182j6953j4961j3363j2522
$$ 1006256 965980 928997 896617 868840 844625 823081 803899 786946 771985 758622 746100
51280G46100j2727j3470j3460j1839r164o948o192o368n926m030j692o27j036
$$ 746100 733373 719903 706443 694604 685440 678492 672300 665932 660006 655976 654284 653657 652621
51267F52621j386p04Q4k22j208j687j451r66j38J114J778R03n93j007m16l92j262
$$ 652621 651235 650531 650615 650393 649185 647498 646047 645081 644943 646057 647835 648738 648145 647138 646722 646330 645068
51250F45068j692j098n43p99j300j558j841j906q93P09Q55j217l498l775k343
$$ 645068 643376 642278 641735 640936 639636 638078 636237 634331 633438 634147 635002 633785 630287 626512 624169
51235F24169j033q35j637l030m053l342q97J211J261Q7l36M69J623K711L893M798
$$ 624169 623136 622301 620664 617634 613581 610239 609342 610553 611814 611901 611565 612034 613657 616368 620261 625059
51219F25059M878M560M791N720O706P243P038N849M148L113L013K600J148j4N17
$$ 625059 629937 634497 639288 645008 651714 658957 665995 671844 675992 679105 682118 684718 685866 685852 686369
51204F86369J926K453K101K106K526K406J702J022j34k628n337n879l940j851
$$ 686369 688295 690748 692849 694955 697481 699887 701589 702611 702477 699849 694512 688633 684693 682842
51190F82842j418k085k698l164l631l703l348l249l596l749l566l742m279m078
$$ 682842 681424 679339 676641 673477 669846 666143 662795 659546 655950 652201 648635 644893 640614 636536
51176F36536k652r58K10J193K137K094O67o23N7K493M714N273M439L448L158L184
$$ 636536 633884 632926 633136 634329 636466 638560 639227 638604 638661 641154 645868 651141 655580 659028 662186 665370
51160F65370K236k78l002l913k816j443q88k97J307L271M241L933L038K238K062
$$ 665370 667606 667328 664326 660413 657597 656154 655266 654969 656276 659547 663788 667721 670759 672997 675059
51145F75059K811L873L971K875J925K047K318J676R92J824L690M400L116J439
$$ 675059 677870 681743 685714 688589 690514 692561 694879 696555 697547 699371 703061 707461 710577 712016
51131G12016R43R93o3k243l579k534m7J397N75j180j785q39L02M97j74j211k353
$$ 712016 712959 713952 713889 711646 708067 705533 705486 706883 707458 706278 704493 703654 703956 704453 704279 703068 700715
51114G00715l212l209k396j467n90Q55K753L615K428M41j46J052K307K226J464
$$ 700715 697503 694294 691898 690431 689841 690696 693449 697064 699492 699933 699787 700839 703146 705372 706836
51099G06836J412J997J636n21l083l800k283m70q8o48p48m01o88j574j764q58
$$ 706836 708248 710245 711881 711360 708277 704477 702194 701724 701636 700988 700240 699839 699151 697577 695813 694955
51083F94955o7l21r90j093o62j57M74J420K430L222L761L797K920J443L36r9l84
$$ 694955 694888 694567 693577 692484 691822 691665 692139 693559 695989 699211 702972 706769 709689 711132 711468 711369 710985
51066G10985n21J71J463K167K377L941P375J0115R674P100N219M472L026N17r92
$$ 710985 710464 710635 712098 714265 716642 720583 727958 738073 747747 754847 760066 764538 767564 768081 767089
51051G67089j94J575K442K336K178K022J270R0m72J83J384J823R87j84k89P82
$$ 767089 766895 768470 770912 773248 775426 777448 778718 778808 778336 778519 779903 781726 782713 782529 782240 783022
51035G83022J607J106J6j57P36J378P42p87k078k293j257N29K119K750K446J836
$$ 783022 784629 785735 785751 785594 786330 787708 788450 787663 785585 783292 782035 782564 784683 787433 789879 791715
51019G91715J471J472J657J831K174L224M956O046N046K505P48J089K493L568
$$ 791715 793186 794658 796315 798146 800320 803544 808500 814546 819592 822097 822845 823934 826427 829995
51005H29995M416N481O042N563N317O825R372J1083J1900J3476J6207J8463J8935
$$ 829995 834411 839892 845934 851497 856814 863639 873011 884094 895994 909470 925677 944140 963075
50992I63075J8004J6429J4419J2352J0921J0140R506R297J0061J0722R192N428
$$ 963075 981079 997508 1011927 1024279 1035200 1045340 1054846 1064143 1074204 1084926 1094118 1099546
50980A099546J815l27k455n735q423q355o414n141m859l758j475l5q50k883m579
$$ 1099546 1101361 1101034 1098579 1092844 1084421 1076066 1069652 1064511 1059652 1055894 1054419 1054384 1053534 1050651 1046072
50965A046072n872p219q018p247m995k310O0J976L360M189M835N678O587P309
$$ 1046072 1040200 1032981 1024963 1017716 1012721 1010411 1010471 1012447 1015807 1019996 1024831 1030509 1037096 1044405
50951A044405Q139R454J0861J1776J2621J4179J5627J4876J1755R211R771J1944
$$ 1044405 1052544 1061998 1072859 1084635 1097256 1111435 1127062 1141938 1153693 1162904 1172675 1184619
50939A184619J2322J0524R373J0022R911O890K872J145J821K487K326K824M653
$$ 1184619 1196941 1207465 1216838 1226860 1236771 1243661 1246533 1247678 1249499 1251986 1254312 1257136 1261789
50926A261789O412P017P212Q087R717J2004J5288J9441K3574K7269L0855L3932
$$ 1261789 1268201 1275218 1282430 1290517 1300234 1312238 1327526 1346967 1370541 1397810 1428665 1462597
50914A462597L5219L4687L4230L5149L6446L7090L8430M2460M8514N3919N7600
$$ 1462597 1497816 1532503 1566733 1601882 1638328 1675418 1713848 1756308 1804822 1858741 1916341
50903A916341O0995O5302O9635P2572P4146P5527P7614Q0355Q2700Q2957Q0048
$$ 1916341 1977336 2042638 2112273 2184845 2258991 2334518 2412132 2492487 2575187 2658144 2738192
50892B738192P4803O9194O4116N8892N3155M7826M3508L9203L3819K8078K3518
$$ 2738192 2812995 2882189 2946305 3005197 3058352 3106178 3149686 3188889 3222708 3250786 3274304
50881C274304K0236J7137J4183J2699J3094J3628J2123Q070K506l394r051j4371
$$ 3274304 3294540 3311677 3325860 3338559 3351653 3365281 3377404 3385474 3387980 3384586 3375535 3361164
50869C361164j9551k4684k9347l3147l6842m1997m9031n6406o2411o6957p0716
$$ 3361164 3341613 3316929 3287582 3254435 3217593 3175596 3126565 3070159 3007748 2940791 2870075
50858B870075p3446p4347p3629p2415p1290p0039o8590o6962o4466o0317n5199
$$ 2870075 2796629 2722282 2648653 2576238 2504948 2434909 2366319 2299357 2234891 2174574 2119375
50847B119375n0815m7679m4601m0761l6918l3954l1475k8801k6241k4445k3179
$$ 2119375 2068560 2020881 1976280 1935519 1898601 1864647 1833172 1804371 1778130 1753685 1730506
50836A730506k1658j9539j6949j4162j1826j0620j0054q509n393k251q13p56o94
$$ 1730506 1708848 1689309 1672360 1658198 1646372 1635752 1625698 1617189 1611796 1609545 1608732 1607976 1607282
50823A607282l80l78j27J701M945P762R181J0415J2894J6150J8518J9340J9529
$$ 1607282 1606902 1606524 1606397 1608098 1613043 1620805 1629986 1640401 1653295 1669445 1687963 1707303 1726832
50810A726832K0258K1804K3836K6264K9239L2401L4806L6160L7721M0965M5538
$$ 1726832 1747090 1768894 1792730 1818994 1848233 1880634 1915440 1951600 1989321 2030286 2075824
50799B075824M9723N3146N7558O4196P1796P8434Q4315R1268J00106J09911J19547
$$ 2075824 2125547 2178693 2236251 2300447 2372243 2450677 2534992 2626260 2726366 2836277 2955824
50788B955824J28526J36732J44503J52678J61384J69158J74553J78190J81679
$$ 2955824 3084350 3221082 3365585 3518263 3679647 3848805 4023358 4201548 4383227
50779D383227J84801J85403J82040J75101J65311J52902J38558J23335J06980
$$ 4383227 4568028 4753431 4935471 5110572 5275883 5428785 5567343 5690678 5797658
50770E797658Q8094O6914M6548L0205J8223Q882J184m381p263p741o410l579N41
$$ 5797658 5885752 5952666 5999214 6029419 6047642 6056524 6057708 6053327 6046064 6038323 6031913 6028334 6028875
50757F028875N203Q714Q928M648l550j4442k7729m3619o1222p8775r5566j12182
$$ 6028875 6034078 6042792 6051720 6056368 6052818 6038376 6010647 5967028 5905806 5827031 5731465 5619283
50745E619283j28442j42620j53440j61489j67613j70911j69617j63432j53996
$$ 5619283 5490841 5348221 5194781 5033292 4865679 4694768 4525151 4361719 4207723
50736D207723j43355j32549j21312j08643r4188p9401o6542n6170m6531l6105
$$ 4207723 4064368 3931819 3810507 3701864 3607676 3528275 3461733 3405563 3359032 3322927
50726C322927k5723j7236j1013o050j943O85J534J128j32k421n653q922j1301
$$ 3322927 3297204 3279968 3268955 3262905 3260962 3261647 3263181 3264309 3264177 3261756 3256103 3247181 3235880
50713C235880j2809j4367j6823k0168k3722k7141l0944l5725m1081m6007n0205
$$ 3235880 3223071 3208704 3191881 3171713 3147991 3120850 3089906 3054181 3013100 2967093 2916888
50702B916888n4073n7355n8898n8150n5882n2915m9206m4843m0788l7525l3964
$$ 2916888 2862815 2805460 2746562 2688412 2632530 2579615 2530409 2485566 2444778 2407253 2373289
50691B373289k8945k3234j8456j4517r670l170L592R085J3558J8319K3935K9886
$$ 2373289 2344344 2321110 2302654 2288137 2278467 2275297 2278889 2287974 2301532 2319851 2343786 2373672
50679B373672L5614M1235M7226N3746O0342O6342P1538P6406Q1388Q6167Q9996
$$ 2373672 2409286 2450521 2497747 2551493 2611835 2678177 2749715 2826121 2907509 2993676 3083672
50668C083672R2694R4897R7127R8936R9258R7570R4489R0985Q7232Q2547P6440
$$ 3083672 3176366 3271263 3368390 3467326 3566584 3664154 3758643 3849628 3936860 4019407 4095847
50657D095847O9062O0281M9147L5237K0147O475m649j3895k1663k7085k9605l0057
$$ 4095847 4164909 4225190 4274337 4309574 4329721 4336196 4331547 4317652 4295989 4268904 4239299 4209242
50645D209242k9155k5958j9239r926r15N453Q991J0762J1484J0889Q125K637n335
$$ 4209242 4180087 4154129 4134890 4124964 4124049 4129502 4138493 4149255 4160739 4171628 4179753 4182390 4177055
50632D177055j5128k6324l8399m9876n8904o5045o9372p2209p2092o7930o1076
$$ 4177055 4161927 4135603 4097204 4047328 3988424 3923379 3854007 3781798 3709706 3641776 3580700
50621C580700n3730m6215l7458k7535j7845q750R50J1770K2432L1725M0164M8893
$$ 3580700 3526970 3480755 3443297 3415762 3397917 3389167 3390117 3401887 3424319 3456044 3496208 3545101
50609C545101N7948O6452P3780P9546Q3111Q4104Q3156Q1331P8923P5420P0563
$$ 3545101 3603049 3669501 3743281 3822827 3905938 3990042 4073198 4154529 4233452 4308872 4379435
50598D379435O4793N8720N2687M6926M1621L6575L1204K5247J9315J4410J0777
$$ 4379435 4444228 4502948 4555635 4602561 4644182 4680757 4711961 4737208 4756523 4770933 4781710
50587D781710P415L102k073o314p524n135n48M187Q084J1643J5827K0742K5427
$$ 4781710 4789125 4792227 4790154 4783840 4776316 4771181 4770633 4774820 4782904 4794547 4810374 4831116 4856543
50574D856543K8749L0310L0441K9626K8181K6253K3842K0858J7352J3554R564
$$ 4856543 4885292 4915602 4946043 4975669 5003850 5030103 5053945 5074803 5092155 5105709 5115273
50563E115273N418J582j434m711j1262k3047l7619m9306n4350n3725n0515m6038
$$ 5115273 5120691 5122273 5120839 5116128 5104866 5081819 5044200 4994894 4940544 4886819 4836304 4790266
50551D790266l9865l2333k5115j9455j5265j2164j0304r973j1254j4396j9888
$$ 4790266 4750401 4718068 4692953 4673498 4658233 4646069 4635765 4625792 4614538 4600142 4580254
50540D580254k7851l7781m8991o0835p2470q2800r0898r6358r9394j00764j01324
$$ 4580254 4552403 4514622 4465631 4404796 4332326 4249526 4158628 4062270 3962876 3862112 3760788
50529C760788j01211r9788r6805r3171q9977q7079q3479p8744p3208o6963n9839
$$ 3760788 3659577 3559789 3462984 3369813 3279836 3192757 3109278 3030534 2957326 2890363 2830524
50518B830524n2507m6284m1402l6465l0328k3652j7749j2655p299j174N204J1277
$$ 2830524 2778017 2731733 2690331 2653866 2623538 2599886 2582137 2569482 2562183 2561009 2566213 2577490
50506B577490J6823K1431K4710K7235L0254L4062L7594M0257M3220M7926N3995
$$ 2577490 2594313 2615744 2640454 2667689 2697943 2732005 2769599 2809856 2853076 2901002 2954997
50495B954997N9777O4603O9238P4222P9137Q3668Q8083R2188R5017R6188R6460
$$ 2954997 3014774 3079377 3148615 3222837 3301974 3385642 3473725 3565913 3660930 3757118 3853578
50484C853578R6249R4876R2380R0826R2214R5769R9004J00986J03005J06280J10763
$$ 3853578 3949827 4044703 4137083 4227909 4320123 4415892 4514896 4615882 4718887 4825167 4935930
50473D935930J16216J22541J28592J32318J32969J32175J32218J34153J37968
$$ 4935930 5052146 5174687 5303279 5435597 5568566 5700741 5832959 5967112 6105080
50464F105080J43304J49327J54767J58908J61827J63296J62232J57623J49170
$$ 6105080 6248384 6397711 6552478 6711386 6873213 7036509 7198741 7356364 7505534
50455G505534J36825J20742J02008Q2041O0678L6204Q200k0914m8154p2732r5411
$$ 7505534 7642359 7763101 7865109 7947150 8007828 8044032 8052232 8031318 7983164 7910432 7815021
50444G815021j16135j33693j47115j56138j60566j60160j54929j45011j30702
$$ 7815021 7698886 7565193 7418078 7261940 7101374 6941214 6786285 6641274 6510572
50435F510572j13168r4284p5097n5273l4909j5945p15J0076J6725J8633J4469
$$ 6510572 6397404 6303120 6228023 6172750 6137841 6121896 6121181 6131257 6147982 6166615 6181084
50424F181084L907j2093l2553n6841q3686j10712j35127j54702j68619j77841
$$ 6181084 6184991 6172898 6140345 6083504 5999818 5889106 5753979 5599277 5430658 5252817
50414E252817j84076j87749j87619j82930j75018j66100j57345j48918j40797
$$ 5252817 5068741 4880992 4693373 4510443 4335425 4169325 4011980 3863062 3722265
50405C722265j32493j23083j12825j03693r6797r0325q1871p2045o3673n7815
$$ 3722265 3589772 3466689 3353864 3250171 3153374 3063049 2981178 2909133 2845460 2787645
50395B787645n2646m6342l9114l1989k5236j8655j2319o463j379K516N265P865
$$ 2787645 2734999 2688657 2649543 2617554 2592318 2573663 2561344 2554881 2553502 2556018 2561283 2569148
50383B569148J1371J5688K0030K4187K8418L2489L5898L8450L9512L7559L2065
$$ 2569148 2580519 2596207 2616237 2640424 2668842 2701331 2737229 2775679 2815191 2852750 2884815
50372B884815K5217J9989J6906J4515J2519J2235J4046J6745J9740K3707K8516
$$ 2884815 2910032 2930021 2946927 2961442 2973961 2986196 3000242 3016987 3036727 3060434 3088950
50361C088950L2575L5106L7321M0458M4263M8182N2491N7310O1918O6077P0787
$$ 3088950 3121525 3156631 3193952 3234410 3278673 3326855 3379346 3436656 3498574 3564651 3635438
50350C635438P6785Q3339Q9273R4051R7195R8025R6841R5074R3244Q9858Q3477
$$ 3635438 3712223 3795562 3884835 3978886 4076081 4174106 4270947 4366021 4459265 4549123 4632600
50339D632600P4852O5764N6657M6566L4830K1635P150q808k6234m4596o2852p9526
$$ 4632600 4707452 4773216 4829873 4876439 4911269 4932904 4940054 4931246 4905012 4860416 4797564 4718038
50327D718038r3089j02689j08281j10156j08835j05193r9868r2570q2963p2087
$$ 4718038 4624949 4522260 4413979 4303823 4194988 4089795 3989927 3897357 3814394 3742307
50317C742307o1691n2150m2344l1857k1765j2993n478L27K759O59n270j3589k3410
$$ 3742307 3680616 3628466 3586122 3554265 3532500 3519507 3514029 3514356 3517115 3517774 3512504 3498915 3475505
50304C475505l3854m3702n2546o1111o9448p6065p9793q1296q1629q0630p7990
$$ 3475505 3441651 3397949 3345403 3284292 3214844 3138779 3058986 2977690 2896061 2815431 2737441
50293B737441p4549p1042o6654o0581n3981m8569m4088l9115l3916l0356k9097
$$ 2737441 2662892 2591850 2525196 2464615 2410634 2362065 2317977 2278862 2244946 2214590 2185493
50282B185493k8895k8912k9931l2452l5037l5564l3471l0070k7034k4904k2856
$$ 2185493 2156598 2127686 2097755 2065303 2030266 1994702 1961231 1931161 1904127 1879223 1856367
50271A856367j9776j5780j2393j0835j0419r292o547k912M16K887M526N608O620
$$ 1856367 1836591 1820811 1808418 1797583 1787164 1777872 1771325 1768413 1768829 1771716 1776242 1781850 1788470
50258A788470P930R335J0282J0695J1130J2014J3137J4147J5205J6670J8185J8634
$$ 1788470 1796400 1805735 1816017 1826712 1837842 1849856 1862993 1877140 1892345 1909015 1927200 1945834
50246A945834J7519J6101J6419J8917K1834K3451K4044K4720K5183K4250K2318
$$ 1945834 1963353 1979454 1995873 2014790 2036624 2060075 2084119 2108839 2134022 2158272 2180590
50235B180590K1476K2810K5006K6332K6892K8185L1155L4866L6271L1469J8980
$$ 2180590 2202066 2224876 2249882 2276214 2303106 2331291 2362446 2397312 2433583 2465052 2484032
50224B484032K362j2073k1047k6431l0943l3767l2303k6617j9779j4238r935n938
$$ 2484032 2486394 2474321 2453274 2426843 2395900 2362133 2329830 2303213 2283434 2269196 2259261 2253323
50212B253323k052J763O143J1622J7634K2786K6055K7765K9233L1231L3013L3758
$$ 2253323 2251271 2253034 2259177 2270799 2288433 2311219 2337274 2365039 2394272 2425503 2458516 2492274
50200B492274L4728L8394M5021N1808N6572O0643O6504P3748P9390Q1647Q1407
$$ 2492274 2527002 2565396 2610417 2662225 2718797 2779440 2845944 2919692 2999082 3080729 3162136
50189C162136Q0088P7763P3734O7684O0042N2086M5616M1483L8441L4276K8012
$$ 3162136 3242224 3319987 3393721 3461405 3521447 3573533 3619149 3660632 3699073 3733349 3761361
50178C761361K0027J0325j972j7081l3548m9278o2990p4400q3401q9382r1409
$$ 3761361 3781388 3791713 3789741 3772660 3739112 3689834 3626844 3552444 3469043 3379661 3288252
50167C288252q9287q4388p8692p2977o6887o1119n7931n8469o0885o2548o3006
$$ 3288252 3198965 3114577 3035885 2962908 2896021 2834902 2776971 2718502 2657617 2595069 2532063
50156B532063o3013o1802n7845n2012m7400m5497m4576m2643m0114l8355l7100
$$ 2532063 2469050 2407248 2349403 2297391 2249991 2204494 2159918 2117275 2077161 2038806 2001706
50145B001706l4799l0861k6356k2785k0871k0390k0492k0266j9322j7829j6034
$$ 2001706 1966907 1936046 1909690 1886905 1866034 1845644 1825152 1804886 1785564 1767735 1751701
50134A751701j4096j2332j1204j0950j1442j2262j2563j1334q477n451l976m078
$$ 1751701 1737605 1725273 1714069 1703119 1691677 1679415 1666852 1655518 1647041 1641590 1637614 1633536
50122A633536m166l066j235K18R05J230J616K136K718L458M624O278P875Q730
$$ 1633536 1629370 1626304 1625069 1625287 1626192 1627422 1629038 1631174 1633892 1637350 1641974 1648252 1656127 1664857
50108A664857R021R753J1335J2806J3130J2772J3214J5150J7860K0165K1373K1643
$$ 1664857 1673878 1683631 1694966 1707772 1720902 1733674 1746888 1762038 1779898 1800063 1821436 1843079
50096A843079K1954K3464K6301K9296L1426L3098L5550L9609M5498N2973O0733
$$ 1843079 1865033 1888497 1914798 1944094 1975520 2008618 2044168 2083777 2129275 2182248 2242981
50085B242981O6714P0209P3057P7549Q3869R0976R9153J09707J22294J34542J44575
$$ 2242981 2309695 2379904 2452961 2530510 2614379 2705355 2804508 2914215 3036509 3171051 3315626
50074C315626J52353J58158J61257J60746J56674J49878J41470J32682J24346
$$ 3315626 3467979 3626137 3787394 3948140 4104814 4254692 4396162 4528844 4653190
50065D653190J16353J08233R9791R0034P5999N4618K6151n598l6801o5968r2809
$$ 4653190 4769543 4877776 4977567 5067601 5143600 5198218 5224369 5218771 5181970 5116002 5023193
50054E023193j16652j36863j53322j65529j72386j73766j71152j65928j58106
$$ 5023193 4906541 4769678 4616356 4450827 4278441 4104675 3933523 3767595 3609489
$$ [...]
##END NTUPLES=NMR SPECTRUM
##END=
