
##TITLE=UV1129_M3-1004-1000_6274945_yLBTYzq93K
##JCAMPDX= 6.0         $$ Bruker NMR JCAMP-DX V2.0
##DATA TYPE= NMR SPECTRUM
##DATA CLASS= NTUPLES
##ORIGIN= BRUKER
##OWNER= Administrator
$$ 1.72 TOPSPIN		Version 2.1
$$ 2012-06-02 22:29:54.218 -0500  Administrator@TOPSPIN
$$ Compression mode = diff/dup
##.OBSERVE FREQUENCY= 400.13188235
##.OBSERVE NUCLEUS= ^1H
##.ACQUISITION MODE= SIMULTANEOUS (DQD)
##.ACQUISITION SCHEME= undefined
##.AVERAGES= 8
##.DIGITISER RES= 22
##SPECTROMETER/DATA SYSTEM= spect
##.PULSE SEQUENCE= zg30
##.SOLVENT NAME= COFFEE_meoh
##.SHIFT REFERENCE= INTERNAL, COFFEE_meoh, 1, 14.98061
##AUDIT TRAIL= $$ (NUMBER, WHEN, WHO, WHERE, PROCESS, VERSION, WHAT)
$$ ##TITLE= Audit trail, TOPSPIN		Version 2.1
$$ ##JCAMPDX= 5.01
$$ ##ORIGIN= Bruker BioSpin GmbH
$$ ##OWNER= Administrator
$$ $$ C:\Bruker\TOPSPIN/data/COFFEE/nmr/UV1129_M3-1004-1000_6274945_yLBTYzq93K/10/pdata/1/auditp.txt
$$ ##AUDIT TRAIL=  $$ (NUMBER, WHEN, WHO, WHERE, PROCESS, VERSION, WHAT)
(   1,<2012-06-02 22:29:46.187 -0500>,<Administrator>,<TOPSPIN>,<go>,<TOPSPIN 2.1>,
      <created by zg
	started at 2012-06-02 22:28:39.578 -0500,
	POWCHK enabled, PULCHK disabled,
       configuration hash MD5:
       D5 CA 7A 23 FE 6B EE E2 50 67 74 61 24 F7 5E 3B
       data hash MD5: 64K
       83 C8 F3 8E 77 BC 3A AA AB 69 BE 49 50 91 79 17>)
(   2,<2012-06-02 22:29:50.156 -0500>,<Administrator>,<TOPSPIN>,<proc1d>,<TOPSPIN 2.1>,
      <Start of raw data processing
       efp LB = 0 FT_mod = 6 PKNL = 1 PHC0 = 0 PHC1 = 0 SI = 32K 
       data hash MD5: 32K
       53 A0 75 45 02 0A 26 83 F7 0C 5F 53 F1 BB D7 68>)
(   3,<2012-06-02 22:29:50.515 -0500>,<Administrator>,<TOPSPIN>,<proc1d>,<TOPSPIN 2.1>,
      <pk PHC0 = 211.9812 PHC1 = 0 
       data hash MD5: 32K
       D2 DC 54 A3 A1 60 BF AE 6D 9D 47 9E C8 A9 E0 C3>)
(   4,<2012-06-02 22:29:50.578 -0500>,<Administrator>,<TOPSPIN>,<proc1d>,<TOPSPIN 2.1>,
      <abs ABSG = 1 
       data hash MD5: 32K
       CC AB 14 73 AF CD 0A 03 CE 4A 62 79 14 1E 33 6F>)
(   5,<2012-06-02 22:29:50.609 -0500>,<Administrator>,<TOPSPIN>,<proc1d>,<TOPSPIN 2.1>,
      <abs ABSG = 2 
       data hash MD5: 32K
       2D 0E BF A8 A7 14 C0 89 B5 96 73 81 0D 01 1D C1>)
(   6,<2012-06-02 22:29:50.640 -0500>,<Administrator>,<TOPSPIN>,<proc1d>,<TOPSPIN 2.1>,
      <abs ABSG = 3 
       data hash MD5: 32K
       D2 EC 4A 3E 20 C7 C4 68 81 F1 1A 69 57 CD 87 2C>)
(   7,<2012-06-02 22:29:50.671 -0500>,<Administrator>,<TOPSPIN>,<proc1d>,<TOPSPIN 2.1>,
      <abs ABSG = 4 
       data hash MD5: 32K
       E8 F0 38 6B 91 01 75 50 D0 55 1B 6E A7 A3 70 62>)
(   8,<2012-06-02 22:29:50.703 -0500>,<Administrator>,<TOPSPIN>,<proc1d>,<TOPSPIN 2.1>,
      <abs ABSG = 5 
       data hash MD5: 32K
       44 73 E6 40 5A DB A4 B6 EE 1F 7C B7 72 5A 11 F2>)
$$ ##END=
$$ 
$$ $$ hash MD5
$$ $$ 95 04 65 06 29 44 05 49 F7 56 14 9A 19 AA 19 B3
##$RELAX= 
##$RELAX= 
##$RELAX= 
##$RELAX= 
##$RELAX= 
##$RELAX= 
##$RELAX= 
$$ Bruker specific parameters
$$ --------------------------
$$ [...]
##$TP= (0..7)
150 150 150 150 150 150 150 150
##$TP07= 0
##$TPNAME0= <>
##$TPNAME1= <>
##$TPNAME2= <>
##$TPNAME3= <>
##$TPNAME4= <>
##$TPNAME5= <>
##$TPNAME6= <>
##$TPNAME7= <>
##$TPOAL= (0..7)
0.5 0.5 0.5 0.5 0.5 0.5 0.5 0.5
##$TPOFFS= (0..7)
0 0 0 0 0 0 0 0
##$TUNHIN= 0
##$TUNHOUT= 0
##$TUNXOUT= 0
##$USERA1= <user>
##$USERA2= <user>
##$USERA3= <user>
##$USERA4= <user>
##$USERA5= <user>
##$V9= 5
##$VALIST= <valist>
##$VCLIST= <CCCCCCCCCCCCCCC>
##$VD= 0
##$VDLIST= <DDDDDDDDDDDDDDD>
##$VPLIST= <PPPPPPPPPPPPPPP>
##$VTLIST= <TTTTTTTTTTTTTTT>
##$WBST= 2048
##$WBSW= 25
##$XGAIN= (0..3)
0 0 0 0
##$XL= 0
##$YL= 0
##$YMAX_a= 538253
##$YMIN_a= -648262
##$ZGOPTNS= <>
##$ZL1= 120
##$ZL2= 120
##$ZL3= 120
##$ZL4= 120
##$ABSF1= 14.98061
##$ABSF2= -5.57192
##$ABSG= 5
##$ABSL= 3
##$ALPHA= 0
##$AQORDER= 0
##$ASSFAC= 0
##$ASSFACI= 0
##$ASSFACX= 0
##$ASSWID= 0
##$AUNMP= <proc_prof1d_extract_pilot.lims>
##$AXLEFT= 0
##$AXNAME= <>
##$AXNUC= <1H>
##$AXRIGHT= 0
##$AXTYPE= 0
##$AXUNIT= <>
##$AZFE= 0.1
##$AZFW= 0.1
##$BCFW= 0
##$BC_mod= 0
##$BYTORDP= 0
##$COROFFS= 0
##$CY= 15
##$DATMOD= 1
##$DC= 0
##$DFILT= <>
##$DTYPP= 0
##$F1P= 0
##$F2P= 0
##$FCOR= 0.5
##$FTSIZE= 32768
##$FT_mod= 6
##$GAMMA= 0
##$GB= 0
##$INTBC= 1
##$INTSCL= 1
##$ISEN= 128
##$LB= 0
##$LEV0= 0
##$LPBIN= 0
##$MAXI= 10000
##$MC2= 0
##$MEAN= 0
##$ME_mod= 0
##$MI= 0
##$NCOEF= 0
##$NC_proc= -8
##$NLEV= 6
##$NOISF1= 0
##$NOISF2= 0
##$NSP= 0
##$NTH_PI= 0
##$NZP= 0
##$OFFSET= 14.98061
##$PC= 1
##$PHC0= 211.9812
##$PHC1= 0
##$PH_mod= 1
##$PKNL= yes
##$PPARMOD= 0
##$PPDIAG= 0
##$PPIPTYP= 0
##$PPMPNUM= 2147483647
##$PPRESOL= 1
##$PSCAL= 4
##$PSIGN= 0
##$PYNMP= <proc.py>
##$REVERSE= no
##$SF= 400.13
##$SI= 32768
##$SIGF1= 0
##$SIGF2= 0
##$SINO= 400
##$SIOLD= 32768
##$SPECTYP= <>
##$SREGLST= <1H.CDCl3>
##$SSB= 0
##$STSI= 32768
##$STSR= 0
##$SW_p= 8223.68421052632
##$SYMM= 0
##$S_DEV= 0
##$TDeff= 65536
##$TDoff= 0
##$TI= <>
##$TILT= no
##$TM1= 0
##$TM2= 0
##$TOPLEV= 0
##$USERP1= <user>
##$USERP2= <user>
##$USERP3= <user>
##$USERP4= <user>
##$USERP5= <user>
##$WDW= 1
##$XDIM= 32768
##$YMAX_p= 461250693
##$YMIN_p= -680815
##$CURPLOT= <Network HP LaserJet P1505>
##$CURPRIN= <$Network HP LaserJet P1505>
##$DFORMAT= <normdp>
##$LAYOUT= <+/1D_H.xwp>
##$LFORMAT= <normlp>
##$PFORMAT= <normpl>
##$SURQMSG= 1
$$ End of Bruker specific parameters
$$ ---------------------------------
##NTUPLES= NMR SPECTRUM
##VAR_NAME=  FREQUENCY,     SPECTRUM/REAL,   SPECTRUM/IMAG
##SYMBOL=    X,             R,               I
##VAR_TYPE=  INDEPENDENT,   DEPENDENT,       DEPENDENT
##VAR_FORM=  AFFN,          ASDF,            ASDF
##VAR_DIM=   32768,         32768,           32768
##UNITS=     HZ,            ARBITRARY UNITS, ARBITRARY UNITS
##FACTOR=    0.250966925370066, 1,           1
##FIRST=     8223.43324360095, -56465,       -89386
##LAST=      0,             112568,          -48896
##MIN=       0,             -680815,         0
##MAX=       8223.43324360095, 461250693,    0
$$ Real data points
##PAGE= N=1
##DATA TABLE= (X++(R..R)), XYDATA
$$ [...]
19517b94923c6644A86033b41363B6944a73847j79565J47637P035o7808g9963B77886
$$ -294923 -36644 186033 -241363 26944 -173847 -353412 -205775 -198740 -266548 -79963 277886
19505I0730b81473a02520A20670J92998a02304B01178a22798k2624D1072a5481
$$ 90730 -281473 -102520 120670 313668 -102304 201178 -122798 -145422 41072 -15481
19494A13231J36740J5889c03050A51788d26537C3710c2062A10217h2543K3689
$$ 113231 249971 265860 -303050 151788 -426537 33710 -32062 110217 -82543 -58854
19484e8854k51686O3543D0298O2137A8383d3313a2968A53450c659q8676j64059
$$ -58854 -310540 -246997 40298 102435 18383 -43313 -12968 153450 -3659 -92335 -256394
19473b56394c7105C94747d03378d8644k43767b0332j73091c2738B26544a07778
$$ -256394 -37105 394747 -403378 -48644 -292411 -20332 -193423 -32738 226544 -107778
19462b23466A23603P5627A2267b06117j45932B1185a59100K5964m7858A7473a77963
$$ -223466 123603 199230 12267 -206117 -352049 21185 -159100 -133136 -180994 17473 -177963
19450i7805I6321c09710i2826G5145K19294a12218K4570G8799g2049o8630C6020
$$ -97805 96321 -309710 -92826 75145 294439 -112218 -87648 78799 -72049 -140679 36020
19438b31642g3288C30952r5816h6740c7426r8189o9538a1798m0912J1361C9139
$$ -231642 -73288 330952 235136 -86740 -37426 -135615 -205153 -11798 -52710 -41349 39139
19426D4908K8352a86957f4184A05486l7061a33834C08866a73837j14654f4825
$$ 44908 73260 -186957 -64184 105486 68425 -133834 308866 -173837 -288491 -64825
19415b01302b6071A66299l2549B2673a71406L1707n9611B11635a10199G8082i9935
$$ -201302 -26071 166299 133750 22673 -171406 -139699 -199310 211635 -110199 78082 -99935
19403B793R5930J65095c13855B6442C429a00294C9813J98177g6204l7297l23846
$$ 2793 98723 263818 -313855 26442 3429 -100294 39813 237990 -76204 -113501 -437347
19392d37347F4511a67569P0410j15897m0079J19359H7100R2283b00325A78538
$$ -437347 64511 -167569 -97159 -213056 -253135 -133776 87100 179383 -200325 178538
19381e5525H0337K76610b31359l1715R5389B1799L00842a98916i1468n52548d3272
$$ -55525 80337 356947 -231359 -263074 -167685 21799 322641 -198916 -91468 -644016 -43272
19369d67818M0659D9572g116j60997q3752h6907o9175j01931H3764i7629j9687
$$ -467818 -427159 49572 -7116 -168113 -251865 -86907 -156082 -258013 83764 -97629 -117316
19358a17316A8326K22957e20198H3289J18516e13825G9670f2159k17361O7113
$$ -117316 18326 241283 -520198 83289 201805 -513825 79670 -62159 -279520 -212407
19348b12407B0398J27409C8280k311J73518F9468j4383A1332L00705e5106A2824
$$ -212407 20398 147807 38280 35969 209487 69468 55085 11332 312037 -55106 12824
19336A25670f1904p4441l03345C94035a32073K3180A85280f4426j04324C43980
$$ 125670 -61904 -136345 -439690 394035 -132073 -108893 185280 -64426 -168750 343980
19325B86564b16407G6166Q1328c47645n9908e0768r0828I8298a79127A39901H942
$$ 286564 -216407 76166 157494 -347645 -407553 -50768 -141596 98298 -179127 139901 8942
19313A01361a41380e2178p1582l01202e0664C4890L2891L55269h9227C42166G8839
$$ 101361 -141380 -52178 -123760 -424962 -50664 34890 67781 423050 -89227 342166 78839
19301B8130f9980j63577h9639h088k26333N2914M7488E159N9243J93958C2181
$$ 28130 -69980 -233557 -89639 -8088 -234421 -181507 -134019 5159 64402 258360 32181
19289C07343q9018o6763m2541B3124a26428B1123J8613h4588b109A90320c0327
$$ 307343 218325 151562 109021 23124 -126428 21123 39736 -84588 -2109 190320 -30327
19277D8372f5849B38165j05200l1408J05272G1526b39169A19363J32368A04097
$$ 48372 -65849 238165 132965 101557 206829 71526 -239169 119363 251731 104097
19266b04243B15114i4902A46429a20358A04798b7442A61254a82179k10824p6012
$$ -204243 215114 -94902 146429 -120358 104798 -27442 161254 -182179 -393003 -469015
19256d69015F1295a83296M3610K5373k0299l52855J83645A81417E5991L2158K5957
$$ -469015 61295 -183296 -139686 -114313 -134612 -487467 -303822 181417 55991 88149 114106
19245A14106a65798j52683E1192a19113j05137c5127A78963f1528A58172A5782
$$ 114106 -165798 -318481 51192 -119113 -224250 -35127 178963 -61528 158172 15782
19234A81570c19554J39836N0043e8475j28366K3396G6404B5448J3725m437e6776
$$ 181570 -319554 -179718 -129675 -58475 -186841 -163445 76404 25448 39173 34736 -56776
19222a67494r172C3369g2475p1513p6787e5313B32797p0287g5972F8313i3038
$$ -167494 -176666 33369 -72475 -143988 -220775 -55313 232797 162510 -75972 68313 -93038
19210H2231b66986A03825a36695o2486c3790k64245a26847k38168G4975l5892
$$ 82231 -266986 103825 -136695 -199181 -33790 -298035 -126847 -365015 74975 39083
19200C9083a0325j03520R984B33218d80595I9369a02387C10255a50541B16012
$$ 39083 -10325 -113845 -103861 233218 -480595 99369 -102387 310255 -150541 216012
19189A70810o0625M4011b76484e3511l94010A6886b46613a21194k22955J47069
$$ 170810 110185 154196 -276484 -53511 -447521 16886 -246613 -121194 -344149 -197080
19179a97080j12841A03015A9249a72936C850J20311j3594e9615j99618F3765a1837
$$ -197080 -309921 103015 19249 -172936 3850 124161 110567 -59615 -259233 63765 -11837
19167A74685n9740B9408J81381c5275j83432b8179k5714B16247n6310E0637a42101
$$ 174685 114945 29408 210789 -35275 -218707 -28179 -53893 216247 159937 50637 -142101
19155d2545b1026C30201c68226H4069c4538E3916b12145a8097j7145j69297j48730
$$ -42545 -21026 330201 -368226 84069 -34538 53916 -212145 -18097 -35242 -204539 -353269
19144c53269A12209a73036A81862b71076k52659i5030j94495i8730D2569a42883
$$ -353269 112209 -173036 181862 -271076 -523735 -95030 -289525 -98730 42569 -142883
19133A49027d4215j15320e9709m90672b04267A45616a24969K8242B3613M2675
$$ 149027 -44215 -159535 -59709 -550381 -204267 145616 -124969 -96727 23613 66288
19123F6288K2423G400e8584l8985M7517n7355n7749A22560b5439k2007A01574
$$ 66288 88711 7400 -58584 -97569 -50052 -107407 -165156 122560 -25439 -47446 101574
19111b54731J732C51108i0099K9211C3603Q4761a58846c7397L474q2722m9261
$$ -254731 -252999 351108 -90099 -60888 33603 118364 -158846 -37397 -33923 -116645 -165906
19100a65906e402n3782J5700D0206b89335e1826A0149a15710D6230J99285F5665
$$ -165906 -5402 -59184 -43484 40206 -289335 -51826 10149 -115710 46230 245515 65665
19088a26954e0963c747A7660b53947l0140e3504j3941H0319J80431a34740E8224
$$ -126954 -50963 -3747 17660 -253947 -284087 -53504 -67445 80319 260750 -134740 58224
19076G0916f189p3455j0317N432j33499C1901c6267C13611h9114N718m1227F7962
$$ 70916 -6189 -79644 -89961 -84529 -218028 31901 -36267 313611 -89114 -83396 -124623 67962
19063c19606E5155e1507j27430B1774d6974A82329A390K8168L37109a01210o790
$$ -319606 55155 -51507 -178937 21774 -46974 182329 1390 29558 366667 -101210 -108000
19052a08000q7078i0944q9759C9876b83071E8262b20009n8956K2028B09182p3102
$$ -108000 -195078 -90944 -180703 39876 -283071 58262 -220009 -278965 -256937 209182 136080
19041A36080O8597q9000b40091C24130a11748E2197d7587A12318l36M6239A8860
$$ 136080 204677 115677 -240091 324130 -111748 52197 -47587 112318 111982 158221 18860
19029C19974a84153A66758a28567c5480j68077k10539A86726c26310L4839k38466
$$ 319974 -184153 166758 -128567 -35480 -203557 -414096 186726 -326310 -291471 -529937
19019e29937E6710a36045A61313D6524f8719m7646B35627g1497k8629A99723a54163
$$ -529937 56710 -136045 161313 46524 -68719 -116365 235627 -71497 -100126 199723 -154163
19007b45153g9874A10614k2317J97779J11921b27907c0225Q132F7345L3915a67927
$$ -245153 -79874 110614 88297 286076 397997 -227907 -30225 -22093 67345 101260 -167927
18995h3165b875B36577a5775j50901g3837A67271a16340B41160j08716a69040
$$ -83165 -2875 236577 -15775 -166676 -73837 167271 -116340 241160 132444 -169040
18984B59623b50075A65073a54150K7533K9837B0034P5045B7466J04933m0860K2885
$$ 259623 -250075 165073 -154150 -126617 -96780 20034 95079 27466 132399 91539 114424
18973A14424b4716j31864f8755j23775M9163D3770h4470G0572g2936j08518M5014
$$ 114424 -24716 -156580 -68755 -192530 -143367 43770 -84470 70572 -72936 -181454 -136440
18962a36440h985l01976f7798j39379b6389A14439c14176A33537e5561j69011
$$ -136440 -8985 -310961 -67798 -207177 -26389 114439 -314176 133537 -55561 -224572
18952b24572B88201a91269F6564b53400d3928C39030a57098e1995A74436b52068
$$ -224572 288201 -191269 66564 -253400 -43928 339030 -157098 -51995 174436 -252068
18941b00165h7312j16291B43591J48337h1685r8014g3169j1915j9140L8645p1177
$$ -200165 -87312 -203603 243591 391928 -81685 -179699 -73169 -85084 -104224 -65579 -136756
18930a36756H1608J03700a27514c1713K160C1287j1329d7909l0493A11026b88954
$$ -136756 81608 185308 -127514 -31713 -29553 31287 19958 -47909 -78402 111026 -288954
18918A93545a98742F97K43061D0988a6739k51389a01898j24232a00917A7946b5358
$$ 193545 -198742 697 243758 40988 -16739 -268128 -101898 -226130 -100917 17946 -25358
18906b25581D2128j7123d56923C0516h6555m3237j32177a8770k49366J00695i488
$$ -225581 42128 25005 -456923 30516 -86555 -129792 -261969 -18770 -268136 -167441 -9488
18894b9184E1594a65665B7103a63070A20249a9696F9265J29373b50473L8621J02025
$$ -29184 51594 -165665 27103 -163070 120249 -19696 69265 198638 -250473 -211852 -109827
18883a09827D09397D6789K10018n9603m3244L0129d5917A12841e378k13058a07297
$$ -109827 409397 46789 256807 197204 153960 184089 -45917 112841 -5378 -218436 -107297
18871a02755J0535J146k9612F522d8348k62347A84271C2092g529j67352b441A19181
$$ -102755 -92220 -91074 -120686 6522 -48348 -310695 184271 32092 -7529 -174881 -2441 119181
18858a48456E2723M07479H2720C2845a45758l9569A31527a22524j8159p9599J03279
$$ -148456 52723 460202 82720 32845 -145758 -185327 131527 -122524 -140683 -220282 -117003
18847a17003c8705j20389B9937a52684E6549a01575A1475c837A79696a35547k7574
$$ -117003 -38705 -159094 29937 -152684 56549 -101575 11475 -3837 179696 -135547 -163121
18836a63121c9194j85845B27090a33585A71180c13176A1572O4456a6684H2863
$$ -163121 -39194 -225039 227090 -133585 171180 -313176 11572 76028 -16684 82863
18825a68438k7372E8891i4182A13363a63789A3751d6537A79667a65270I1914a55310
$$ -168438 -195810 58891 -94182 113363 -163789 13751 -46537 179667 -165270 91914 -155310
18813a40100E5841J85963I9221a48851L6011G7237R8603M9654Q6449b3180A71628
$$ -140100 55841 241804 99221 -148851 -112840 77237 175840 225494 311943 -23180 171628
18801a07810B0060R358a19436N7739A70876i5075C8073b89331a4859j53503o0702
$$ -107810 20060 29418 -119436 -61697 170876 -95075 38073 -289331 -14859 -168362 -229064
18790b29064e6514B383J70889a11512k66397a34568j37717j88164K0492G7878
$$ -229064 -56514 2383 173272 -111512 -377909 -134568 -272285 -460449 -439957 77878
18779H5511O017e0877J5862p4646a8915A69787c10662a04277A26114b36204B55293
$$ 85511 91528 -50877 -35015 -109661 -18915 169787 -310662 -104277 126114 -236204 255293
18767b09972f8163o0805L8311A93747a34457j20005A61476A5419M410a63132o6329
$$ -209972 -68163 -128968 -90657 193747 -134457 -254462 161476 15419 19829 -163132 -229461
18756b29461D2246b13571B1530g9315q0967j08384O0943r8027f3887K6867q9257
$$ -229461 42246 -213571 21530 -79315 -160282 -268666 -207723 -305750 -63887 -37020 -126277
18745a26277A58929a43100A50933b06279A9063O112a51900A49a83039N1396I7643
$$ -126277 158929 -143100 150933 -206279 19063 25175 -151900 149 -183039 -131643 97643
18733e3102C4280a48559r8740j76398e166B69746i3963A4218b23298Q9584A29726
$$ -53102 34280 -148559 -247299 -423697 -5166 269746 -93963 14218 -223298 -133714 129726
18721C9412A199a12727A09006b23303o004b6593q3245A52037c96923A04776l7211
$$ 39412 1199 -112727 109006 -223303 -229307 -26593 -109838 152037 -396923 104776 67565
18710F7565b19078A15878j3272a71969B98565d3754B3874a26748R607A37034b54086
$$ 67565 -219078 115878 102606 -171969 298565 -43754 23874 -126748 -117141 137034 -254086
18698H9003a93905A76157c42472J35513A9602a1034A6295a45892J3887F7395c335
$$ 89003 -193905 176157 -342472 -206959 19602 -11034 16295 -145892 -132005 67395 -3335
18686d0279i055H6269j7558i276k54479J4957J05044n4776d8935j32786A71122
$$ -40279 -9055 86269 68711 -9276 -263755 -248798 -143754 -198530 -48935 -181721 171122
18674a12450B0906b27416O1512a3971k75472e0581k0767C8035K472N4378D2756
$$ -112450 20906 -227416 -165904 -13971 -289443 -50581 -71348 38035 40507 94885 42756
18662E7158b02685j02034a35199N3164m8990A12716f8803k3976C5560a52712j11210
$$ 57158 -202685 -304719 -135199 -82035 -131025 112716 -68803 -92779 35560 -152712 -263922
18651b63922c3700r3038B91852A33167c47912P3060a9272q2332b6238B0763K01427
$$ -263922 -33700 -126738 291852 133167 -347912 -274852 -19272 -101604 -26238 20763 222190
18640B22190a52931o8244o479A33958K02111b80741O5228M1114n4369k36889A55235
$$ 222190 -152931 -221175 -227654 133958 336069 -280741 -215513 -174399 -228768 -465657 155235
18628a20775D7836f5612j974l69379J59157N6888R750h8984A20185l2436a51371
$$ -120775 47836 -65612 -67586 -436965 -277808 -220920 -211170 -88984 120185 87749 -151371
18616b22289Q0278G5880b51700j9596A01024a51553J5716j14592K5908E2082b52132
$$ -222289 -142011 75880 -251700 -271296 101024 -151553 -135837 -250429 -224521 52082 -252132
18604B64112A6073a41571B1688d09085E1310c366k83826j88796b2760A43169a68409
$$ 264112 16073 -141571 21688 -409085 51310 -3366 -287192 -475988 -22760 143169 -168409
18592B12866I2001i2090R876c589C6430b69296e6388o2278b2391j86295b2972
$$ 212866 92001 -92090 -82214 -3589 36430 -269296 -56388 -118666 -22391 -208686 -22972
18580h5043A17044d11522a41087F4885b38090H7165N0414f2875l1434j11966A08535
$$ -85043 117044 -411522 -141087 64885 -238090 87165 137579 -62875 -94309 -206275 108535
18568a6928A55616k4225h8323G2655h6815d2726j49785j5355Q1603A12220a5716
$$ -16928 155616 131391 -88323 72655 -86815 -42726 -192511 -207866 -126263 112220 -15716
18556d6932o2859k3317j84419A30491a48767q2219h5612K0223B32406a07267k1811
$$ -46932 -109791 -133108 -317527 130491 -148767 -230986 -85612 -65389 232406 -107267 -129078
18545a29078N5041L6443k51729A20236K83147b29395B64296h517l7716k04414
$$ -129078 -74037 -37594 -289323 120236 403383 -229395 264296 -8517 -46233 -250647
18535b50647h353D8147e75545C2378c68049A8278P012L8394b45915D40709b20374
$$ -250647 -8353 48147 -575545 32378 -368049 18278 25290 63684 -245915 440709 -220374
18523e9264o5174a8119B1819a30677j7229m6753r5298d6852C59462A01909l7504
$$ -59264 -124438 -18119 21819 -130677 -147906 -194659 -289957 -46852 359462 101909 64405
18512F4405c9770B89912A04562Q572K09277i9555q9688i2102P427A7590a79065
$$ 64405 -39770 289912 104562 113134 322411 -99555 -189243 -92102 -84675 17590 -179065
18500c35042C4375c04190C1821b46692J6677B4516a0393g35p6931o32A52458b82569
$$ -335042 34375 -304190 31821 -246692 -230015 24516 -10393 -735 -77666 -78298 152458 -282569
18487E6012a23017j08125m2949f2958l2046J8763p1956f0847j66542J04656j15021
$$ 56012 -123017 -231142 -274091 -62958 -95004 -76241 -148197 -60847 -227389 -122733 -237754
18476b37754J08008K1158p1003P174A45140F6919d0812k3269C5024G205b06359
$$ -237754 -129746 -108588 -179591 -172417 145140 66919 -40812 -64081 35024 7205 -206359
18464b84881J04929o0153B88833n1241j06647K3172a03621D5998M4466g6924o0970
$$ -284881 -179952 -240105 288833 237592 130945 154117 -103621 45998 90464 -76924 -137894
18453a37894P316C70430A05032Q6280p1654D4335R3919D6007a85527F4362K24593
$$ -137894 -130578 370430 105032 191312 119658 44335 138254 46007 -185527 64362 288955
18442B88955b52527G1580N4967E7089P903J2217a14973j12420k01439A82330B9041
$$ 288955 -252527 71580 126547 57089 64992 77209 -114973 -227393 -428832 182330 29041
18430a4654j56315Q0828L7308B11491b45745g6684D96512a01839A81868c10909
$$ -14654 -170969 -90141 -52833 211491 -245745 -76684 496512 -101839 181868 -310909
18419A45378c59555g6210b7907E6962J55794D7117a81760k0937g5678j5672i747
$$ 145378 -359555 -76210 -27907 56962 212756 47117 -181760 -202697 -75678 -91350 -9747
18407b73530B14596i1921B24619J40915G8520c5468j53589r8942R3611I607a68549
$$ -273530 214596 -91921 224619 365534 78520 -35468 -189057 -287999 -194388 9607 -168549
18395a52416O9274n2230J4328A01420J23031e7834E1871B42J05229a05220C34881
$$ -152416 -83142 -135372 -121044 101420 224451 -57834 51871 242 105471 -105220 334881
18383A75014G6023J6465b2336C55020a73630N9763B23173i250j24706l11030h7480
$$ 175014 76023 92488 -22336 355020 -173630 -113867 223173 -9250 -133956 -444986 -87480
18371a33980j08131f0490j81413d370p70n8066j11217C6540Q0993a38119M037
$$ -133980 -242111 -60490 -241903 -4370 -5140 -63206 -174423 36540 117533 -138119 -134082
18360a34082G7790M7564J54549a64661q3505J16399l319j14390B88830a3657B10157
$$ -134082 77790 125354 279903 -164661 -248166 -131767 -135086 -249476 288830 -13657 210157
18348e4735H6682k1681d31202A44431K5951p1760a29614l1336g6442M007r7507
$$ -54735 86682 65001 -431202 144431 170382 98622 -129614 -160950 -76442 -72435 -169942
18337a69942I6136M3867j2542b99515K3488m3000a04276b201k07544N2603r3007
$$ -169942 96136 140003 127461 -299515 -276027 -319027 -104276 -2201 -209745 -157142 -250149
18326b50149j57108a66987B37775c82447P5601R0070C1082a58086d5257D9394
$$ -250149 -407257 -166987 237775 -382447 -306846 -216776 31082 -158086 -45257 49394
18315i1197B19300D197b40604j73603a44457A57862j2246e2896k05568D5160J53453
$$ -91197 219300 4197 -240604 -414207 -144457 157862 145616 -52896 -258464 45160 198613
18304A98613D4003a65957N8950D43791d32906J15316a13058k6223A07611A5083
$$ 198613 44003 -165957 -107007 443791 -432906 -317590 -113058 -139281 107611 15083
18293A00705J47961b47882H0068f9434j47556H7907b24641A39595c6785O245j16843
$$ 100705 248666 -247882 80068 -69434 -216990 87907 -224641 139595 -36785 -30540 -147383
18282a47383M482o9710i8089r6014B6634d32837E7318J05123d274n00134C172
$$ -147383 -142901 -212611 -98089 -194103 26634 -432837 57318 162441 -4274 -504408 3172
18270b21912o3574J38334J4648A15462k0718a8601B06090a82727B41294C8983
$$ -221912 -285486 -147152 -132504 115462 94744 -18601 206090 -182727 241294 38983
18259a92722l7946C00298a22039F5610A411a79109O1742D2913k184b63394L7794
$$ -192722 -230668 300298 -122039 65610 1411 -179109 -117367 42913 40729 -263394 -225600
18248b25600E1460a16082B81140g9697j87934i1059c970m41292B65760A31115
$$ -225600 51460 -116082 281140 -79697 -267631 -91059 -3970 -445262 265760 131115
18237i3498a7666B83327g9816A77356d2425G8144b35862a11635D8045j9826Q3785
$$ -93498 -17666 283327 -79816 177356 -42425 78144 -235862 -111635 48045 28219 112004
18226A12004d9497k80202a5735H9139B7965c9169C47591a24231j20717d8906j03384
$$ 112004 -49497 -329699 -15735 89139 27965 -39169 347591 -124231 -244948 -48906 -152290
18215a52290E1645c13122h5615A17901E5553K18260c9969J2825A98732i0217k8070
$$ -152290 51645 -313122 -85615 117901 55553 273813 -39969 -27144 198732 -90217 -118287
18204a18287A2118b56272i7297a0927k5481B69051b23749D2072a31675D6287o788
$$ -118287 12118 -256272 -97297 -10927 -36408 269051 -223749 42072 -131675 46287 39499
18193C9499i9988P737l1358B16553l5581a08523E4900a4591C15446c4194B94179
$$ 39499 -99988 -92251 -123609 216553 180972 -108523 54900 -14591 315446 -34194 294179
18181e5992E9354L5436a73821N478O094K3619A09868d4662A7705Q3242J28625
$$ -55992 59354 94790 -173821 -168343 -162249 -138630 109868 -44662 17705 100947 229572
18170B29572c78093C60689b36335a2866j764k18075D6436c13096f7885b9982A85731
$$ 229572 -378093 360689 -236335 -12866 -14630 -232705 46436 -313096 -67885 -29982 185731
18158c50316d9629A53217a3424C1313J46037e3474j12787C722d1039j54674j34125
$$ -350316 -49629 153217 -13424 31313 177350 -53474 -166261 3722 -41039 -195713 -329838
18147c29838I4741N9764e5215A83676m3217c3819k74708a08251j5522H2197l4812
$$ -329838 94741 154505 -55215 183676 140459 -33819 -308527 -108251 -123773 82197 47385
18136D7385L24437E322M6340a26510F517J57743F5209O6660N2373A2702J02414
$$ 47385 371822 5322 51662 -126510 6517 164260 65209 131869 184242 12702 115116
18125A15116a16925m0043D3630g3842n7860c1548C45747A67728D455a59973j46931
$$ 115116 -116925 -156968 43630 -73842 -131702 -31548 345747 167728 4455 -159973 -306904
18114c06904C23104A632J4207i2183k05477D6367J07N381f9500k91416C31818
$$ -306904 323104 1632 15839 -92183 -297660 46367 46474 51855 -69500 -360916 331818
18102a21905C6520d9032j68253D8018c01436P3394o706I7639B8658a33170j33024
$$ -121905 36520 -49032 -217285 48018 -301436 -228042 -234748 97639 28658 -133170 -266194
18091b66194F12249a11941C4045a72175E4782a57142D2562R9179o3444A6250R0866
$$ -266194 612249 -111941 34045 -172175 54782 -157142 42562 141741 78297 16250 107116
18080A07116R6293a06856A54403c1913r3460C3706d9127j51791j90469A48009
$$ 107116 203409 -106856 154403 -31913 -125373 33706 -49127 -200918 -391387 148009
18069h2844b5085j55571M6551f3666k1403k5027j78649d3477D4009b46897D8838
$$ -82844 -25085 -180656 -134105 -63666 -85069 -110096 -288745 -43477 44009 -246897 48838
18057A05585b02302c1073C6682F745e3618D4702J06573b02207P0239j36177d1980
$$ 105585 -202302 -31073 36682 6745 -53618 44702 151275 -202207 -131968 -268145 -41980
18045a12990a6517k82822A85556m5647J39675b20668L9287B98996C1588d9722
$$ -112990 -16517 -299339 185556 139909 279584 -220668 -181381 298996 31588 -49722
18034e3653C0508O4321O4980D6954b11051B12067d19186c5536d172k66423J00897
$$ -53653 30508 94829 159809 46954 -211051 212067 -419186 -35536 -4172 -270595 -169698
18023a69698e5091A53723b20531K3726a8701F9624c02809a3124k58861D0936J36305
$$ -169698 -55091 153723 -220531 -196805 -18701 69624 -302809 -13124 -271985 40936 177241
18012A77241a01223C9993J48711E5423a81026b811A78873a42392I0582J35652
$$ 177241 -101223 39993 188704 55423 -181026 -2811 178873 -142392 90582 226234
18002B26234g7859B00902b78260A24168G468c80355Q0345J08199L9944o2449B35874
$$ 226234 -77859 200902 -278260 124168 7468 -380355 -300010 -191811 -151867 -214316 235874
17990F391O0702j8282L46334a62335C16194a27527j49108d8022p8757D65146b59895
$$ 6391 67093 48811 395145 -162335 316194 -127527 -276635 -48022 -126779 465146 -259895
17978D29601h1769I8485a69450d2370j02718l07537A12666b30982A20477b67349
$$ 429601 -81769 98485 -169450 -42370 -145088 -452625 112666 -230982 120477 -267349
17967B61456b75939a11506N5478p8792A69922A9791a05369K2651n782M0165B47364
$$ 261456 -275939 -111506 -56028 -134820 169922 19791 -105369 -82718 -88500 -48335 247364
17955h3193J4533l0361B27289E1181E034M931K415b06929A65036b2142k13847
$$ -83193 -68660 -99021 227289 51181 5034 9965 12380 -206929 165036 -22142 -235989
17944b35989c5416C5470j0184p949J38688a06716L2257D6270d8586I2704e0911
$$ -235989 -35416 35470 25286 17337 156025 -106716 -74459 46270 -48586 92704 -50911
17932c56484a41532A42019e5328C29701I8829k6691a66803H4351A4157c650m0559
$$ -356484 -141532 142019 -55328 329701 98829 72138 -166803 84351 14157 -3650 -44209
17921d4209B95955a64064P3574A4371a48594C2900A3353d5940q1800f1323k03956
$$ -44209 295955 -164064 -90490 14371 -148594 32900 13353 -45940 -127740 -61323 -265279
17910b65279I5231M24076c58859a06838D22663G4401b70863B69696b37034D5011
$$ -265279 95231 519307 -358859 -106838 422663 74401 -270863 269696 -237034 45011
17899F3578b84224R93A2740d0951o3301A72468h6638k9916I9044a02933b3208
$$ 63578 -284224 -283231 12740 -40951 -104252 172468 -86638 -116554 99044 -102933 -23208
17887A4161l239P8742C6307f0817K9213j63284F5594a67201j25169A40817b83399
$$ 14161 10922 89664 36307 -60817 -31604 -194888 65594 -167201 -292370 140817 -283399
17875A25250a91097A16369b77827B74779j17644h1070B05651k9253a71345h4863
$$ 125250 -191097 116369 -277827 274779 157135 -81070 205651 176398 -171345 -84863
17864A89843o8840l9027A3354Q3473J8628b58515B64617b81518g8641j64491A7236
$$ 189843 121003 81976 13354 96827 115455 -258515 264617 -281518 -78641 -243132 17236
17852c1011p5054A10544b4318l0803j12065B39144j16690a90389C09757C0213
$$ -31011 -106065 110544 -24318 -55121 -167186 239144 122454 -190389 309757 30213
17841a09010p9259p1690e2531k8537G1558b92108J35798A78731K6279H5072a52434
$$ -109010 -188269 -259959 -52531 -81068 71558 -292108 -156310 178731 205010 85072 -152434
17829c6843F2565J57620a44658f9507l90048b01363K7185N8003D3676O029M2218
$$ -36843 62565 220185 -144658 -69507 -459555 -201363 -174178 -116175 43676 49705 91923
17818I1923c03168b3970B43868n6640Q3649n0478a52244l40365D8956J23297q5081
$$ 91923 -303168 -23970 243868 187228 270877 220399 -152244 -492609 48956 172253 87172
17807H7172a27983j69485E0124a76946Q8056E2489h686l714p500E4579f175r7631
$$ 87172 -127983 -297468 50124 -176946 -88890 52489 -8686 -12400 -19900 54579 -6175 -103806
17795a03806j76693i008A58875J604a37541N2538B77000j15251M2578i4240P664
$$ -103806 -280499 -9008 158875 160479 -137541 -85003 277000 161749 204327 -94240 -86576
17784h6576k3771P522F7124J48527b40800i9432l9411A93513g4309C07244o7467
$$ -86576 -110347 -102825 67124 215651 -240800 -99432 -138843 193513 -74309 307244 239777
17773B39777A07644n1825b39368P8916G8855C5478a10846A37133b9092A25925
$$ 239777 107644 55819 -239368 -160452 78855 35478 -110846 137133 -29092 125925
17762c8930k01179E0578a2329p1924B12882a89590A5935a28040c8046j75278m5109
$$ -38930 -240109 50578 -12329 -84253 212882 -189590 15935 -128040 -38046 -213324 -258433
17751b58433C4351K56523p654c4400j0828G0263K2287b84878A37356b1112l28730
$$ -258433 34351 290874 283220 -34400 -45228 70263 92550 -284878 137356 -21112 -349842
17740c49842E9328b39192r885A48421a35337e473D8423g7130A76815O5992L4864
$$ -349842 59328 -239192 -249077 148421 -135337 -5473 48423 -77130 176815 242807 277671
17729B77671d5650o3442I026M074K86322a1089m4785j39395C6092Q8781J940C1960
$$ 277671 -45650 -109092 9026 13100 299422 -11089 -55874 -195269 36092 124873 126813 31960
17716A96877b04902B54691p3774d3569B00815a98070M6629k5645B19990a06478
$$ 196877 -204902 254691 180917 -43569 200815 -198070 -151441 -177086 219990 -106478
17705G8257K7012d7641B21363a39578j18644E2448J29960R515J83770A04675k4352
$$ 78257 105269 -47641 221363 -139578 -258222 52448 182408 191923 375693 104675 80323
17694H0323h6494j01673A14110i2545j54946j04606H5877K1269a37093l33896
$$ 80323 -86494 -188167 114110 -92545 -247491 -352097 85877 107146 -137093 -470989
17684d70989K31848o059A6767K61885F5778M8397i3939I2305D4411J68914a12715
$$ -470989 -239141 -245200 16767 278652 65778 114175 -93939 92305 44411 213325 -112715
17672B60510C8559j0993J74362B8746K23328E6151e2389k1332p0374m0747A33398
$$ 260510 38559 27566 201928 28746 252074 56151 -52389 -73721 -144095 -184842 133398
17660I599J7190a09285B266Q5935P7668K45305F96K5834e007G7372K06619q1277
$$ 9599 26789 -109285 2266 88201 165869 411174 696 26530 -5007 77372 283991 202714
17648B02714a88447J2349B41270J17176i5571p0702B08180b90947A88014F3873
$$ 202714 -188447 -176098 241270 358446 -95571 -166273 208180 -290947 188014 63873
17637B63626H6420a05440B3886d4191k18794f4497B49763o0376Q4140a15666B9791
$$ 263626 86420 -105440 23886 -44191 -262985 -64497 249763 189387 273527 -115666 29791
17625b6944G7040d1482A76111g8006E4665h1731I052d2782I0863J04096C34M4558
$$ -26944 77040 -41482 176111 -78006 54665 -81731 9052 -42782 90863 194959 334 44892
17613D4892j9405M6397J53736k8468b93129A36893R6559b48747P4844R664A32871
$$ 44892 25487 71884 225620 197152 -293129 136893 233452 -248747 -173903 -164239 132871
17601e4070C16079i0344o7727H1571A83K81722f9272A2355J30510C2616d1479
$$ -54070 316079 -90344 -158071 81571 183 281905 -69272 12355 142865 32616 -41479
17589h9128A00311B2827J83464c11940A68460b18065N0940I7215O2865d5643l16469
$$ -89128 100311 22827 206291 -311940 168460 -218065 -167125 97215 160080 -45643 -362112
17578c62112G4180J16028d4418G5345b02784E9762O4313k0611f1844m569l8115
$$ -362112 74180 190208 -44418 75345 -202784 59762 124075 103464 -61844 -66413 -104528
17567a04528B4077K43424E5016e9984j9216A05669c6309j53188B65211E6583i6610
$$ -104528 24077 267501 55016 -59984 -79200 105669 -36309 -189497 265211 56583 -96610
17555A79725D9991L9266f1542B53613c5226G2952O5358J86568j13943a0273A4787
$$ 179725 49991 89257 -61542 253613 -35226 72952 138310 324878 210935 -10273 14787
17543G1650a43758p4731E5531J04478J29174j3750A20897n8064a7121C37071A52874
$$ 71650 -143758 -218489 55531 160009 289183 275433 120897 62833 -17121 337071 152874
17531C53020a5306A61621c78020f2273A00548O0158J59085a61393q0630c7626
$$ 353020 -15306 161621 -378020 -62273 100548 160706 319791 -161393 -242023 -37626
17520B46273a29975H8556a089A71396d9781B17763g1282A62117K64782A17219
$$ 246273 -129975 88556 -1089 171396 -49781 217763 -71282 162117 426899 117219
17509B73060F108d4872A04629d2305p8131b1875A77442K43884j52830j20814e271
$$ 273060 6108 -44872 104629 -42305 -120436 -21875 177442 421326 268496 147682 -5271
17497A70567J15105a31039N6780a0530A73520J16070H4943C4101b44151F6811
$$ 170567 285672 -131039 -74259 -10530 173520 289590 84943 34101 -244151 66811
17486H1199c1514A41284L9858L8168O2036a90917A10426P5560B1028J45237a5251
$$ 81199 -31514 141284 181142 219310 281346 -190917 110426 185986 21028 166265 -15251
17474G4420a53428E6451L65359j77591n0710q4978K1508b6930B2518K06744a99281
$$ 74420 -153428 56451 421810 244219 193509 108531 130039 -26930 22518 229262 -199281
17462a06192B48504r8565i6652C32826j65459O7717l169a42586B88183a91039
$$ -106192 248504 149939 -96652 332826 167367 235084 231915 -142586 288183 -191039
17451A89092k9084E979J53282c3103j69854D20682A18249L25892A74961i13B72492
$$ 189092 160008 5979 159261 -33103 -202957 420682 118249 444141 174961 -913 272492
17439H9740L23469A44893n6059L62164J1476H6826K13072O8161g9882B59908m7129
$$ 89740 413209 144893 88834 450998 462474 86826 299898 368059 -79882 259908 212779
17428B12779a5901D01638D8477J31326K90599A86037K51377E4891f9860B8029
$$ 212779 -15901 401638 48477 179803 470402 186037 437414 54891 -69860 28029
17417E83194A08925J38614j01682m085L3154J09363j23479M7035K45407j97490
$$ 583194 108925 247539 145857 141772 174926 284289 160810 207845 453252 255762
17407B55762o2483O0833k637a61791A58935j5650N4342J65569j19549l4547J01230
$$ 255762 193279 254112 251475 -161791 158935 143285 197627 363196 243647 209100 310330
17396C10330c57165E11982E3732J55639J44801Q9942B06826d8838b042o5828A19929
$$ 310330 -357165 511982 53732 209371 354172 444114 206826 -48838 -2042 -67870 119929
17384f4238A1009K47471I2128J12788J98142j79945l197i1468A80156H9044K01256
$$ -64238 11009 258480 92128 204916 403058 223113 219916 -91468 180156 89044 290300
17373B90300e2731A59484J01896O926I5819L62642f2552C6429J08844K15439p6007
$$ 290300 -52731 159484 261380 268306 95819 458461 -62552 36429 145273 360712 284705
17362B84705H3454g9690C36555J73593A51850C7332M0458J38087G793J02729D7116
$$ 284705 83454 -79690 336555 510148 151850 37332 77790 215877 7793 110522 47116
17350a9435A55064h4280C92879c5283A37883e9797A46824R3931a26483A09625
$$ -19435 155064 -84280 392879 -35283 137883 -59797 146824 240755 -126483 109625
17339e9897A81187i25F3250b00297A79293J7659N0975J31416j41686J96568j40261
$$ -59897 181187 -925 63250 -200297 179293 196952 247927 379343 237657 434225 293964
17328B93964J29381q0916H8558J71875a45017b6940o7398A25027L31117a95298
$$ 293964 423345 342429 88558 260433 -145017 -26940 -94338 125027 456144 -195298
17317f4391I6853K06667K9924C1887K3688J85417E9484h2935B38391P0420j32410
$$ -64391 96853 303520 333444 31887 55575 240992 59484 -82935 238391 308811 176401
17306A76401K49583B08982c7359C48891b369E3960a11945e0896I3616e667C64222
$$ 176401 425984 208982 -37359 348891 -2369 53960 -111945 -50896 93616 -5667 364222
17294D27590A14224a0810n6412A55008f1595C02305b2714C89555C1782L5169N8625
$$ 427590 114224 -10810 -67222 155008 -61595 302305 -22714 389555 31782 66951 125576
17283A25576L01245I0228K51511o5096b6413l9341B95207H2808L5426M4245a13241
$$ 125576 426821 90228 341739 276643 -26413 -65754 295207 82808 118234 162479 -113241
17271C38823R1913B14369o5077E5102K55700j31529l2070C8298K58011N5287j02838
$$ 338823 430736 214369 149292 55102 310802 179273 147203 38298 296309 351596 248758
17260B48758a00263A20332b53114G5059M4559J22672O9583A03490Q1991J47716
$$ 248758 -100263 120332 -253114 75059 119618 242290 311873 103490 185481 333197
17250C33197K2378j1238j01084I3127O6986Q8807K4430J6837O0674j47603q8606
$$ 333197 355575 344337 243253 93127 160113 248920 273350 290187 350861 203258 114652
17239A14652N8295q503F0145J98870f1407B39931G0995b05733B40175j14696F1235
$$ 114652 172947 164444 60145 259015 -61407 239931 70995 -205733 240175 125479 61235
17227A38186J11777m0142Q8327C961K56363J90750j90699m0033p6991P1081K1340
$$ 138186 249963 209821 298148 3961 260324 451074 260375 220342 143351 214432 235772
17216B35772R4479C4836J13016O3681K600j04727K57942b3598B89818C6981K97814
$$ 235772 330251 34836 147852 211533 214133 109406 367348 -23598 289818 36981 334795
17205C34795o1271Q6963A31332l2495j3666N9058m7088K58185q1257Q4499j20953
$$ 334795 273524 360487 131332 98837 85171 144229 97141 355326 274069 358568 237615
17194B37615A16350L24738j53698G6824M34K01936K22545B25127J08927j6775
$$ 237615 116350 441088 287390 76824 77258 279194 501739 225127 334054 317279
17184C17279j35806J87230H454L39662A67505K45219B00522L83968A37434l1447
$$ 317279 181473 368703 8454 348116 167505 412724 200522 584490 137434 105987
17174A05987J7948K31584j42074R5254j03347j6930M9230m3194J84519O9042l2870
$$ 105987 123935 355519 213445 308699 205352 188422 237652 194458 378977 448019 415149
17163D15149F5295L03337o5650j30339J41420A09188j9270M96970A74339K96450
$$ 415149 65295 368632 302982 172643 314063 109188 89918 586888 174339 470789
17153D70789B29170K48136B38542R2655j60675m6959J83810J33493A50146G409
$$ 470789 229170 477306 238542 331197 170522 123563 307373 440866 150146 7409
17142B97731d3601C04248q946k9814K11625j5623B16160R2462M73257k50523f2840
$$ 297731 -43601 304248 295302 265488 477113 461490 216160 308622 781879 531356 -62840
17130A76325M22691j26144h6657B71581J40899O3979j36056A33939K86207j53547
$$ 176325 599016 472872 -86657 271581 412480 476459 340403 133939 420146 266599
17120B66599f1161A31228J30413J37105j0278Q5461k25491Q9511q5881L40579
$$ 266599 -61161 131228 261641 398746 388468 473929 248438 337949 252068 592647
17110E92647j70089j76085J69403I1573J61517J37978j53308K52462B14423L62217
$$ 592647 422558 246473 415876 91573 253090 391068 237760 490222 214423 576640
17100E76640H1758L87173j48582O7616j72359J94108A37863K28700J33758A19673
$$ 576640 81758 468931 320349 387965 215606 409714 137863 366563 500321 119673
17089B58456J39489j66379K46171j19582J07403K4912H2406O02017B14364M74685
$$ 258456 397945 231566 477737 358155 465558 490470 82406 684423 214364 689049
17079F89049j18414j56036K01993j8920j92037J55725j56500K40294j34814k40686
$$ 689049 570635 414599 616592 597672 405635 561360 404860 645154 510340 269654
17069B69654L18704P9129J44574k39360j80453J51038k2554Q5119k37131K34481
$$ 269654 588358 667487 812061 572701 392248 543286 520732 605851 368720 603201
17059F03201B52985J93244B15817J79289K40547A96048n8227L91205o3401J99172
$$ 603201 252985 446229 215817 395106 635653 196048 137821 529026 465625 664797
17049F64797C05861L7339O34751B84825J50398J39255j2544M7993B97630J68549
$$ 664797 305861 343200 977951 284825 435223 574478 561934 609927 297630 466179
17039D66179J02433L13414j94343j79961L80526B96320J88824k3283R5267j55641
$$ 466179 568612 882026 687683 507722 888248 296320 485144 461861 557128 401487
17029D01487o4103K44714q6848J0474K94960j10143n9865k62968L49859j3016
$$ 401487 337384 582098 495250 505724 800684 690541 630676 367708 717567 704551
17019G04551k26927M85626o2746k93707o3079K5065K80415j63418j11611L61420
$$ 704551 477624 963250 900504 606797 543718 568783 849198 685780 574169 935589
17009I35589m4763j41313J56759q2106j24405P6619j12498j85508P4220K19913
$$ 935589 890826 749513 906272 824166 699761 776380 663882 478374 552594 772507
16999G72507J32900j55471J57683j23667p6666K77125k16426C04058M90426N4568
$$ 772507 905407 749936 907619 783952 707286 984411 767985 304058 794484 849052
16989H49052n6033j443l3042j69279L20129N2565j25877N34735n51685l56165
$$ 849052 793019 791576 758534 589255 909384 961949 836072 1370807 819122 462957
16979D62957J42708K67135J89815l1984l92917J19619P4625J09452j31955r1082
$$ 462957 605665 872800 1062615 1030631 637714 757333 831958 941410 809455 718373
16969G18373r3931M27317N7435j78919j90640K52634m2429Q7192l9878J59179
$$ 718373 624442 1051759 1109194 930275 739635 992269 949840 1037032 997154 1156333
16959A156333k63538K90400n3055j12586l11515J90420N05998l66869Q4722p7401
$$ 1156333 892795 1183195 1130140 1017554 706039 896459 1402457 1035588 1120310 1042909
16949A042909Q738j62151J13375K30564j09727l6710N9090p4690k18751K91433
$$ 1042909 1051647 889496 1002871 1233435 1123708 1086998 1146088 1071398 852647 1144080
16939A144080j59342K74572l14001K18113K36028m48049N49224m22651L8160J37277
$$ 1144080 984738 1259310 945309 1163422 1399450 951401 1500625 1077974 1116134 1253411
16929A253411k81347N60594L1733k66966P119J46240j44545Q8984k29344P0636
$$ 1253411 972064 1532658 1564391 1297425 1304544 1450784 1306239 1395223 1165879 1236515
16919A236515K43911l6916j30314K48083j43804l3735L5858l5661l9179j94683
$$ 1236515 1480426 1443510 1313196 1561279 1417475 1383740 1419598 1383937 1344758 1150075
16909A150075R2937R5221K09106k0107K96271k35880J05122j4916k7531k63758
$$ 1150075 1243012 1338233 1547339 1527232 1823503 1587623 1692745 1677829 1650298 1386540
16899A386540L48052l94394K04435J93998R3042j60010M22664j08788m8924M188
$$ 1386540 1734592 1340198 1544633 1738631 1831673 1671663 2094327 1985539 1936615 1940803
16889A940803K6142J6892j12823m2371j10547m9472K55129J07830L91571k78430
$$ 1940803 1966945 1983837 1871014 1828643 1718096 1668624 1923753 2031583 2423154 2144724
16879B144724j45793P8193J08240k44105N56218k48402K18513k03709R3259K17151
$$ 2144724 1998931 2077124 2185364 1941259 2497477 2249075 2467588 2263879 2357138 2574289
16869B574289o0466l64081J43593K42971R4951k98855K70748j37020M1461j63219
$$ 2574289 2513823 2149742 2293335 2536306 2631257 2332402 2603150 2466130 2507591 2344372
16859B344372J21103P7106K25387k88925O51908k76283J61338k12757P794j0166
$$ 2344372 2465475 2542581 2767968 2479043 3130951 2854668 3016006 2803249 2811043 2800877
16849B800877K95764r1116j34986K45115N25862p21691J29611K84307K88814j44173
$$ 2800877 3096641 3005525 2870539 3115654 3641516 2919825 3049436 3333743 3622557 3478384
16839C478384o2217L81832m06690K09852M57547n84521N69523j71819j6347K52680
$$ 3478384 3416167 3797999 3391309 3601161 4058708 3474187 4043710 3871891 3855544 4108224
16829D108224m792m2323J26083K813R2447j5177M72074l7196j59004k98342P35823
$$ 4108224 4103432 4061109 4187192 4190005 4282452 4267275 4739349 4702153 4543149 4244807 4980630
16818D980630r7477M06925j16153K1451K13670J11890k62221M63365r3770P9283
$$ 4980630 4883153 5290078 5173925 5195376 5409046 5520936 5258715 5722080 5628310 5707593
16808E707593K34458M18427N240O5452M4103j04442L18345K67134K91951k79027
$$ 5707593 5942051 6360478 6365718 6431170 6475273 6370831 6689176 6956310 7248261 6969234
16798F969234J81745L03549L04188K61580j24956R0277M33265J66990K57357J4857
$$ 6969234 7150979 7454528 7758716 8020296 7895340 7985617 8418882 8585872 8843229 8858086
16788H858086K69656j10024M35601J46278N57459M9447L21485N51045k0649N79309
$$ 8858086 9127742 9017718 9453319 9599597 10157056 10206503 10527988 11079033 11058384 11637693
16778A1637693O0233L59038M51390L25020J26827M11893N45571L63481O12626
$$ 11637693 11697926 12056964 12508354 12833374 12960201 13372094 13917665 14281146 14893772
16769A4893772K94844L53571Q14835K13275N44422Q99431J01378O61759P21259
$$ 14893772 15188616 15542187 16357022 16570297 17114719 18014150 18115528 18777287 19498546
16760A9498546N53198R14061N60653R36337N72518R19433Q44548J027826R40933
$$ 19498546 20051744 20965805 21526458 22462795 23035313 23954746 24799294 25827120 26768053
16751B6768053J307198J058696J259999J261947J141191J716743J199203J576141
$$ 26768053 28075251 29133947 30393946 31655893 32797084 34513827 35713030 37289171
16743C7289171J589564K058988J626318K256469K445553J956520K523948K255548
$$ 37289171 38878735 40937723 42564041 44820510 47266063 49222583 51746531 54002079
16735E4002079L205567K801450L033097L567375L535692L939822L869650M052540
$$ 54002079 57207646 60009096 63042193 66609568 70145260 74085082 77954732 82007272
16727H2007272M469137M668464M954749N621406N444653N801221N796142O136008
$$ 82007272 86476409 91144873 96099622 101721028 107165681 112966902 118763044 124899052
16719A24899052N986072O350547O136742O207463O081464N857166M789078N118640
$$ 124899052 130885124 137235671 143372413 149579876 155661340 161518506 166307584 171426224
16711A71426224L568041L461732K676727J720266M40291k18460j455441k101429
$$ 171426224 174994265 178455997 181132724 182852990 183293281 183074821 181619380 179517951
16703A79517951l237577l775643m943166n044126n358082o151080o171458o084356
$$ 179517951 176280374 172504731 167561565 162517439 157159357 151008277 144836819 138752463
16695A38752463o349140o272952o412978o148334n602402n560356n378303n375491
$$ 138752463 132403323 126130371 119717393 113569059 107966657 102406301 97027998 91652507
16687I1652507m738415m489790m469362m164304m216044l347091l030838l587302
$$ 91652507 86914092 82424302 77954940 73790636 69574592 66227501 63196663 59609361
16679E9609361k838008l145955k395865k600026k489195k056473k023046k006950
$$ 59609361 56771353 53625398 51229533 48629507 46140312 44083839 42060793 40053843
16671D0053843j747834k049531j383128j356793j852381j050356j139741j309728
$$ 40053843 38306009 36256478 34873350 33516557 31664176 30613820 29474079 28164351
16663B8164351j320909j000082j099255q62598r79337r70729p42536o40628o43379
$$ 28164351 26843442 25843360 24744105 23881507 22902170 21931441 21188905 20548277 19904898
16654A9904898r54121m79132n97715o35427n37809n07202n51595m76266n45996
$$ 19904898 18950777 18471645 17873930 17238503 16700694 16193492 15641897 15165631 14619635
16645A4619635k47163o35838k49963o29273m39082m6600l34434n61078j95436
$$ 14619635 14372472 13736634 13486671 12857398 12418316 12371716 12037282 11476204 11280768
16636A1280768m47630j69866n84262j8611k62555N005m22123j51317l02321m79159
$$ 11280768 10833138 10663272 10079010 10060399 9797844 9802849 9380726 9229409 8927088 8447929
16626H447929O2596l36819k9872l23697j99782O314J6946p44424q982l5818k64369
$$ 8447929 8510525 8173706 8143834 7820137 7620355 7626669 7643615 6899191 6890209 6854391 6590022
16615F590022j76616J33377l05030j89441M9971k66810j99219p5222k46712J43089
$$ 6590022 6413406 6546783 6241753 6052312 6102283 5835473 5636254 5561032 5314320 5457409
16605E457409k42690J37811O90m38265M1217j56492j69793J1241k04283j67823
$$ 5457409 5214719 5352530 5353220 4914955 4956172 4799680 4629887 4641128 4436845 4269022
16595D269022P9263L053l088l63283K70134j6526n16027l3694l5292K30195j60518
$$ 4269022 4348285 4351338 4348250 3984967 4255101 4238575 3722548 3688854 3653562 3883757 3723239
16584C723239K00092l45500q3232M0862j39781J09256j88972l41962p939l9316
$$ 3723239 3923331 3577831 3494599 3535461 3395680 3504936 3315964 2974002 2966063 2926747
16574B926747K24507l91177K12084R2299j99025J25996l54015J76991J08745j65155
$$ 2926747 3151254 2760077 2972161 3064460 2865435 2991431 2637416 2814407 2923152 2757997
16564B757997k40861j11816K3203L06695n0140k64680L3132l18989M65483n95844
$$ 2757997 2517136 2405320 2428523 2735218 2685078 2420398 2453530 2134541 2600024 2004180
16554B004180K44385J90592j33271K15138m4253n29001P9331K93745m17057L60023
$$ 2004180 2248565 2439157 2305886 2521024 2476771 1947770 2027101 2320846 1903789 2263812
16544B263812k16742m84582L27112K19636k42573P7701n5194J83521m35227m8411
$$ 2263812 2047070 1562488 1889600 2109236 1866663 1944364 1889170 2072691 1637464 1589053
16534A589053j42434K4694N7896K57225l22201N76212l36016L1274m26941J45006
$$ 1589053 1446619 1471313 1529209 1786434 1464233 2040445 1704429 1735703 1308762 1453768
16524A453768n2466M61367m85623J93832j94853q1243j1183j18437M61864j18569
$$ 1453768 1401302 1862669 1377046 1570878 1376025 1294782 1283599 1165162 1627026 1508457
16514A508457k5902l96189K70181k19928L23949n8912k16375J05463N2247j17819
$$ 1508457 1482555 1086366 1356547 1136619 1460568 1401656 1185281 1290744 1342991 1225172
16504A225172R1825m400K62003l26669J49390l28501J13128j60782O3632M59510
$$ 1225172 1316997 1312597 1574600 1247931 1397321 1068820 1181948 1021166 1084798 1544308
16494A544308n24187o3164J9680K83456j75088L1794o6392j79350J75978K39799
$$ 1544308 1020121 956957 976637 1260093 1085005 1116799 1050407 871057 1047035 1286834
16484A286834o35538N13458k05260n9422K7526k69386K08986K01874L25056l06600
$$ 1286834 651296 1164754 959494 900072 927598 658212 867198 1069072 1394128 1087528
16474A087528j08866m12399J61048J55474J26395m6019k19545J01852k25112K56068
$$ 1087528 978662 566263 727311 882785 1009180 963161 743616 845468 620356 876424
16464H76424l9483j75554J02666J09286l63639K76484k71350M97593q5463k79654
$$ 876424 836941 661387 764053 873339 509700 786184 514834 1012427 926964 647310
16454F47310B93040M27104k18417P0598L14356j64238J3399l5548L9009j39783
$$ 647310 293040 720144 501727 572325 886681 722443 735842 700294 739303 599520
16444E99520M8990J1366K19596j68639K0054j21187J59633m0750J41303j84919
$$ 599520 648510 659876 879472 710833 730887 609700 769333 728583 869886 684967
16434F84967p5916J9945N0593P2956j49079k95052K84060J775O8572k09255A74083
$$ 684967 609051 628996 679589 752545 603466 308414 592474 594249 662821 453566 174083
16422G27853j91130N9761k43770K8K68945J95819l58480m5457j24723M96770O4532
$$ 727853 536723 596484 352714 352742 621687 817506 459026 413569 288846 785616 850148
16411H50148l53814B44636K90956j5279j60316K2576j199L60893l69031p9752
$$ 850148 496334 244636 535592 520313 359997 382573 381374 742267 373236 293484
16401B93484L86345n2915j15004J74265k7419C27809J06322N1447B16404C7777
$$ 293484 679829 626914 511910 686175 658756 327809 434131 485578 216404 37777
16390G33666j47423B16056L03560j23964A07848O77473B75669L32315A27753L84108
$$ 733666 586243 216056 519616 395652 107848 785321 275669 607984 127753 511861
16380E11861N6796k02691r5262K83339j65271H0054K16784J3657m4423j363L63478
$$ 511861 568657 365966 270704 554043 388772 80054 296838 310495 266072 264709 628187
16369F28187k71421A74202L28557k06866o505P012j21246K12035j9662q8619K03769
$$ 628187 356766 174202 502759 295893 289388 296400 175154 387189 367527 278908 482677
16358D82677m7694N0215j20817P1066A77679K47701p7294E4978L18678o7226A37094
$$ 482677 434983 485198 364381 435447 177679 425380 348086 54978 373656 306430 137094
16346C0129N0602j7228J02549O3917J73639N7474K35505a22285A46653b14098
$$ 30129 80731 63503 166052 229969 403608 461082 696587 -122285 146653 -214098
16335H0930J93112F4535L66727A90440N3558L21751k66551G0119L59216d0996
$$ 80930 274042 64535 431262 190440 243998 565749 299198 70119 429335 -40996
16324B55898E2168Q5564J22265J35290a53589I9590K48527j61280N4708p0138
$$ 255898 52168 137732 259997 395287 -153589 99590 348117 186837 241545 171407
16314A71407P0537J11791A68977F2004J20924o2038L11880B11198K79558k28958
$$ 171407 241944 353735 168977 62004 182928 120890 432770 211198 490756 261798
16304B61798b446B54525R5736j24283K77189O4596H9718Q6784H1574L82522m3323
$$ 261798 -2446 254525 350261 225978 503167 567763 89718 176502 81574 464096 420773
16293D20773c837B92530l7318k4424J32127K30993j76442M2784k11584j13567
$$ 420773 -3837 292530 255212 230788 362915 593908 417466 460250 248666 135099
16283A35099f184A02027J30936M9928j27464C7646P5539K20868q8009k6053M032
$$ 135099 -6184 102027 232963 282891 155427 37646 113185 334053 246044 219991 224023
16272B24023K11471A16695J91192A6528g5877E09740m8191A4791R7764K44183
$$ 224023 435494 116695 307887 16528 -75877 509740 461549 14791 112555 356738
16262C56738j26868C9568n322P3807l7466N3568k5227d2815C38895J8337j62445
$$ 356738 229870 39568 34246 108053 70587 124155 98928 -42815 338895 357232 194787
16251A94787d1851J0439D7614J65210b60981E7443J13500C248J05653k8747b45823
$$ 194787 -41851 -31412 47614 212824 -260981 57443 170943 3248 108901 80154 -245823
16239C16977M5391f7242A31190N7288f6064E41056j23669I4887K2266d6037A15757
$$ 316977 362368 -67242 131190 188478 -66064 541056 417387 94887 117153 -46037 115757
16227C25062l5619j17132B2491b4613C67851J0399a71809B12298J98580A93211
$$ 325062 289443 172311 22491 -24613 367851 378250 -171809 212298 410878 193211
16216A50435i8068B6540a31348j76537C06501o1289a87920I9105K04602J01574
$$ 150435 -98068 26540 -131348 -307885 306501 245212 -187920 99105 303707 405281
16206D05281a54017p7396A55545a50945C2181e8108G3441k8975M12938j1737G1533
$$ 405281 -154017 -231413 155545 -150945 32181 -58108 73441 44466 457404 445667 71533
16194a942j79805C22921a50294f9242G8829J43714F1079G787J31813D5027b94037
$$ -1942 -181747 322921 -150294 -69242 78829 222543 61079 7787 139600 45027 -294037
16182B91542c16077B44826o0311b56956A85205h2698I1701J8914K7943R5305a23212
$$ 291542 -316077 244826 184515 -256956 185205 -82698 91701 110615 138558 233863 -123212
16170b62444b9901B06296E7896c6578H4916a77357B8909M5824L9069K7153m3781
$$ -262444 -29901 206296 57896 -36578 84916 -177357 28909 74733 113802 140955 97174
16159I7174D8082Q0690a3446o3330A816M74492j39698H4549K1349K9778E7376
$$ 97174 48082 128772 -13446 -76776 1816 476308 336610 84549 105898 135676 57376
16147a41070C76563j14832a1330C42521Q704c53000b2259A43773a32121B15933
$$ -141070 376563 261731 -11330 342521 351225 -353000 -22259 143773 -132121 215933
16136A70615b50494A99587l285H6595a65067A21890K19397A40757P2504h31j4989
$$ 170615 -250494 199587 196302 86595 -165067 121890 341287 140757 213261 -831 -15820
16125a5820H3103n283J75890f7336j36039A3418K39665n7398I4023J8015e1543
$$ -15820 83103 77820 253710 -67336 -203375 13418 253083 195685 94023 112038 -51543
16113e4883I5539A0405b13352h3190B81266O4502j66225b23814O8392I928R3265
$$ -54883 95539 10405 -213352 -83190 281266 345768 179543 -223814 -155422 9928 103193
16102A03193D1502K10400D231J11238A6932a08147G7441O0205F976c2483j5612
$$ 103193 41502 251902 4231 115469 16932 -108147 77441 137646 6976 -32483 -48095
16091d8095i448B0731J74896c2842q1579H5748a99863C42951g0652A5253J11003
$$ -48095 -9448 20731 195627 -32842 -114421 85748 -199863 342951 -70652 15253 126256
16080A26256g9738a4509l76077a37016L8650C6626f6686D1115a30040I6045D571
$$ 126256 -79738 -14509 -390586 -137016 -98366 36626 -66686 41115 -130040 96045 4571
16068b08363R4551j08469N458a7213k52337A66240A2964J37594L1845A5222a45450
$$ -208363 -113812 -222281 -216823 -17213 -269550 166240 12964 150558 182403 15222 -145450
16056H3275c0343A7223b50116a11776d8356B69996p6939a83224C7772n382L20831
$$ 83275 -30343 17223 -250116 -111776 -48356 269996 193057 -183224 37772 32390 353221
16045C53221c4200o4804A23634c27731A31207a09096d3320B991K52037a49306
$$ 353221 -34200 -99004 123634 -327731 131207 -109096 -43320 2991 255028 -149306
16034e5853m5732D0292a71571I9409N6958a85450k9386I2300Q6839a88209C6363
$$ -55853 -101585 40292 -171571 99409 156367 -185450 -214836 92300 179139 -188209 36363
16022I8888B8501L7254d18996i6510o4682K5179q043K9335m2317M2198K0362A99996
$$ 98888 28501 65755 -418996 -96510 -161192 -136013 -144056 -114721 -157038 -114840 -94478 199996
16009a46929e6113j84080j57614a67365b0924A12444a47319a3747k46001e0937
$$ -146929 -56113 -240193 -397807 -167365 -20924 112444 -147319 -13747 -259748 -50937
15998a35896A56843C0430a88842D7298a01657a1862I2192a92427B08746a0130
$$ -135896 156843 30430 -188842 47298 -101657 -11862 92192 -192427 208746 -10130
15987b67341J23696K806A11215b53293D55856j53913a97577m0020A04994c43728
$$ -267341 -143645 -140839 111215 -253293 455856 301943 -197577 -237597 104994 -343728
15976B75326A19573M500J9669l6532A1971L3439b09596d895C06632K58647k59727
$$ 275326 119573 124073 143742 107210 11971 45410 -209596 -4895 306632 565279 305552
15965C05552K49180E2949K15516G1097a94834Q1534E62918F4396J42883R0989
$$ 305552 554732 52949 268465 71097 -194834 -113300 562918 64396 207279 298268
15955B98268G7782H174J21487a67842B85200I0992Q8102b70652b7236A21376a66225
$$ 298268 77782 8174 129661 -167842 285200 90992 179094 -270652 -27236 121376 -166225
15943D730L09730E940b34303B80363G6371K01182A29742g8519A05153f1289a2700
$$ 4730 314460 5940 -234303 280363 76371 277553 129742 -78519 105153 -61289 -12700
15931C48459C1575c92517i2205k00081A7258a58193A01051a04110A12544a76514
$$ 348459 31575 -392517 -92205 -292286 17258 -158193 101051 -104110 112544 -176514
15920B90128F960a38986l53004A76806f4820K9986B67403c5818r502j67067i204
$$ 290128 6960 -138986 -491990 176806 -64820 -34834 267403 -35818 -45320 -212387 -9204
15908a27540m7254h2190r074A65463a95776a5295q0715j44k41478a39953A08022
$$ -127540 -174794 -82190 -91264 165463 -195776 -15295 -96010 -96154 -337632 -139953 108022
15896H2214c5341A88418i4180b2012j02569e0690q7606J4392l1252J5566b2535
$$ 82214 -35341 188418 -94180 -22012 -124581 -50690 -138296 -123904 -155156 -139590 -22535
15884C8595N5110a70716m1987a6730A33476P8056O8402r8885b57811A95788p5630
$$ 38595 93705 -170716 -212703 -16730 133476 211532 279934 181049 -257811 195788 120158
15873A20158b82966C87908A03157a27893M1094j59562I7281d7816A46743k4595
$$ 120158 -282966 387908 103157 -127893 -86799 -246361 97281 -47816 146743 122148
15863A22148n8484l0310h3008E21961b04355p0911g8080F794L0349J27608D77
$$ 122148 63664 33354 -83008 521961 -204355 -275266 -78080 6794 37143 164751 477
15851E8453a12642m5119f6037n3646C6849L4277k1841K11513j05644E6254i9007
$$ 58453 -112642 -157761 -66037 -119683 36849 71126 49285 260798 155154 56254 -99007
15839E9129P7848C3341f1326j94209O2936j6610A04366a18526A45912O9224G3373
$$ 59129 136977 33341 -61326 -255535 -192599 -209209 104366 -118526 145912 215136 73373
15827C2494a75628e5062B74379M4129A29443P0308C7905d25337a73088n493G0387
$$ 32494 -175628 -55062 274379 318508 129443 199751 37905 -425337 -173088 -178581 70387
15815A23973c06139g5729A74836a18121I1154b47632I6398a47860e3869A46560
$$ 123973 -306139 -75729 174836 -118121 91154 -247632 96398 -147860 -53869 146560
15804a02188j05405Q4505k0860c426A98502n1377N8457a92960B9263P607d4919
$$ -102188 -207593 -123088 -143948 -3426 198502 147125 205582 -192960 29263 36870 -44919
15792a35964N9590L3174l3150j27399j40979a13526p9722l8849p2989I6734f9939
$$ -135964 -76374 -43200 -76350 -203749 -344728 -113526 -193248 -232097 -305086 96734 -69939
15780b00585e940m6242l03594f424G2587E538a7787j71317j09737C6886B223c6447
$$ -200585 -5940 -52182 -355776 -6424 72587 5538 -17787 -189104 -298841 36886 2223 -36447
15767A47198a55446D6897L8339a84052d5460J4878m40013b26236E8540a31342
$$ 147198 -155446 46897 85236 -184052 -45460 -30582 -470595 -226236 58540 -131342
15756C01118a1257l7431j11688G8001a60700N1634F1798b74915J08624K5835q1925
$$ 301118 -11257 -48688 -160376 78001 -160700 -109066 61798 -274915 -166291 -140456 -222381
15745b22381B1299a49362A32097J11003R1087j30679b70742A48993m7659C7809
$$ -222381 21299 -149362 132097 243100 334187 203508 -270742 148993 101334 37809
15734b94028D9622a83417j88769I2456J86071a1537F2229K06197F2838b61455
$$ -294028 49622 -183417 -372186 92456 278527 -11537 62229 268426 62838 -261455
15723A13998e8312l4980D1044L1621K6272b35867I4459j0671a87169n4559A68397
$$ 113998 -58312 -93292 41044 72665 98937 -235867 94459 83788 -187169 -241728 168397
15711f7239q0211f6948A34350c07363a29519A64223f1313a5729B04883J348a54557
$$ -67239 -147450 -66948 134350 -307363 -129519 164223 -61313 -15729 204883 206231 -154557
15699F9505a13667j69647A09735i4327G1949A2581c49214a19488A10212J26973
$$ 69505 -113667 -283314 109735 -94327 71949 12581 -349214 -119488 110212 237185
15689B37185F900N8158a91928A10819e3532G1404d0476p4076J5203l9738B3015
$$ 237185 6900 65058 -191928 110819 -53532 71404 -40476 -114552 -99349 -139087 23015
15677e4744B24577A396L08302a37725d3759B3533J73792p1594B2582c60308b6597
$$ -54744 224577 1396 309698 -137725 -43759 23533 197325 125731 22582 -360308 -26597
15665h6455A82484J18860A35207c59612f828A82786f3578E7923c85075a62466
$$ -86455 182484 301344 135207 -359612 -6828 182786 -63578 57923 -385075 -162466
15654a57646L3062k08694E03331h6735o9419d63B80965I1394O1347D2679c36794
$$ -157646 -124584 -333278 503331 -86735 -156154 -463 280965 91394 152741 42679 -336794
15642h2234B43590b29168F8734K5502l9115a36314C4746g4905m7349c2814B02726
$$ -82234 243590 -229168 68734 94236 55121 -136314 34746 -74905 -122254 -32814 202726
15630E701e1196A11759J37196a71164j10044G3975O2712J65430a63278B79164
$$ 5701 -51196 111759 248955 -171164 -281208 73975 136687 302117 -163278 279164
15619f0748j61762F5761a33126A12054a43379F4790k1843d79962b34196B8564
$$ -60748 -222510 65761 -133126 112054 -143379 64790 42947 -479962 -234196 28564
15608A35244a00213c9584j05447C44749b29651I0837J23124B521K6586a5357F5068
$$ 135244 -100213 -39584 -145031 344749 -229651 90837 213961 2521 29107 -15357 65068
15596g2658F8581e6668j86937i3477j41056P9354O7335B44705b77215a24591L7221
$$ -72658 68581 -56668 -243605 -93477 -234533 -155179 -87844 244705 -277215 -124591 -87370
15585h7370K389A97834a0113k73021G3069L9013b0967B20200J5236E3246i9730
$$ -87370 -84981 197834 -10113 -283134 73069 112082 -20967 220200 235436 53246 -99730
15573g2783L3484l8432C41493E5218a30363N5917b1178H1895b81822A65282b3806
$$ -72783 -39299 -77731 341493 55218 -130363 -74446 -21178 81895 -281822 165282 -23806
15561a76924j3031P1865C13334i7108j63014A03618K01342c907A28478Q7031d93668
$$ -176924 -189955 -118090 313334 -97108 -260122 103618 304960 -3907 128478 215509 -493668
15549a46534l0879C89089j49352H2662L45230A4367J42371F9178b21228B68426
$$ -146534 -177413 389089 239737 82662 427892 14367 156738 69178 -221228 268426
15538A32059d5723A08042a94911Q5731c3297A34217J57157j37786c06704B20289
$$ 132059 -45723 108042 -194911 -109180 -33297 134217 291374 153588 -306704 220289
15527a45900A75759i6799c8605j25976P2574b3814A4553J49543a02570c1561p6249
$$ -145900 175759 -96799 -38605 -164581 -92007 -23814 14553 164096 -102570 -31561 -107810
15516a07810j68590H0160p188h5748a1700j01655B83724p3057a40683A17549m2683
$$ -107810 -276400 80160 72972 -85748 -11700 -113355 283724 210667 -140683 117549 74866
15505G4866J38132L3147q9347a26977M0136B5850c5465B51933c16227A55290b03442
$$ 74866 212998 246145 156798 -126977 -86841 25850 -35465 251933 -316227 155290 -203442
15493a3334A21786M40a03679F8221g6381Q352B33845c6032j50160A52673a41169
$$ -13334 121786 122226 -103679 68221 -76381 -68029 233845 -36032 -186192 152673 -141169
15481b59699H1907j6489a71195j2776g5506j26143I0622j5447J97503a06345k13346
$$ -259699 81907 65418 -171195 -183971 -75506 -201649 90622 75175 272678 -106345 -319691
15470c19691J45436e3533m3659A48097F5734b2787j20946A92822D1889h601j0656
$$ -319691 -174255 -53533 -97192 148097 65734 -22787 -143733 192822 41889 -8601 -19257
15459a9257j40563A22960b17338B18769a19014A01368l4436O6834A9328G151L4093
$$ -19257 -159820 122960 -217338 218769 -119014 101368 66932 133766 19328 7151 41244
15448D1244J38786O4615B591a79555a224p7146B1513J72604H93d8964B1590a86924
$$ 41244 180030 244645 2591 -179555 -1224 -78370 21513 194117 893 -48964 21590 -186924
15435A10509a05576C60283A40258e6882l82913J65315e620C6027e1682D44155
$$ 110509 -105576 360283 140258 -56882 -439795 -274480 -5620 36027 -51682 444155
15424A46917L5429e3325r5134b6762A72767d9998D63808c7618l8731j16660A97366
$$ 146917 182346 -53325 -148459 -26762 172767 -49998 463808 -37618 -76349 -193009 197366
15412c5476m1943l47735b09716A231K22315f1135j68129O0415k64666a09624o2831
$$ -35476 -77419 -425154 -209716 1231 223546 -61135 -229264 -168849 -433515 -109624 -172455
15401a72455A0734J63908p4288b84752b9496k77860J52254m4600B13992b85743
$$ -172455 10734 174642 100354 -284752 -29496 -307356 -155102 -199702 213992 -285743
15390D6460J66330H29K13779a39319m8362B07586A877Q3868O4610h394E3112c4052
$$ 46460 212790 829 214608 -139319 -187681 207586 1877 85745 150355 -8394 53112 -34052
15377a68081A41168F0184l027a38632A87897R7787E1117b9177A86234a71497A98180
$$ -168081 141168 60184 57157 -138632 187897 285684 51117 -29177 186234 -171497 198180
15365B12281j0631l240H3094C0353a18399M5648B80668A04956c22817J17412A79795
$$ 212281 201650 198410 83094 30353 -118399 -72751 280668 104956 -322817 -205405 179795
15353D7351a06461l6693b3271B60952a13970M4381e885k33856j0289h1904b1513
$$ 47351 -106461 -143154 -23271 260952 -113970 -69589 -5885 -239741 -250030 -81904 -21513
15341b24763h1377q0721g8093C9313M3432n391d59252A3321J77227c31860B22051
$$ -224763 -81377 -162098 -78093 39313 82745 77354 -459252 13321 190548 -331860 222051
15329B80880B0108J26682a88305E28633A64107i7843p5810G3672J71492o5615
$$ 280880 20108 146790 -188305 528633 164107 -97843 -173653 73672 245164 179549
15319A79549O0532c55805a75135e4591j7212j08009A31334E0774K59651f1330
$$ 179549 240081 -355805 -175135 -54591 -71803 -179812 131334 50774 310425 -61330
15308C483f2262A41729L7915d6678C9827A0856R1826B757b64996J00201A61771
$$ 3483 -62262 141729 179644 -46678 39827 10856 102682 2757 -264996 -164795 161771
15296D9471g7559l7707M1294a6627k4440D10209b48981I3705a56792B07690d2411
$$ 49471 -77559 -115266 -73972 -16627 -41067 410209 -248981 93705 -156792 207690 -42411
15284F1431j2925a7951B43109a4652E374J8469N0337a52694A82462n3195b6912
$$ 61431 48506 -17951 243109 -14652 5374 23843 74180 -152694 182462 129267 -26912
15272A07680b23865C48157A460N45387A42687b41789A72368d5003b2440B85783
$$ 107680 -223865 348157 1460 546847 142687 -241789 172368 -45003 -22440 285783
15261A60461c8494B46744b00993C62809j37377r6821h6145D5010i0258A00114
$$ 160461 -38494 246744 -200993 362809 225432 128611 -86145 45010 -90258 100114
15250H3033h1891n1396d4575p948B57587c072A54744F1937e5111k33080D88141
$$ 83033 -81891 -133287 -44575 -52523 257587 -3072 154744 61937 -55111 -288191 488141
15238d8072g496I0369M0946L74654A33341Q10315J74608N85915j96592J98590
$$ -48072 -7496 90369 131315 505969 133341 943656 1118264 1704179 1507587 1706177
15228A706177n34150m94738B50250J620j15454C8784b15930C31722f6978B17370
$$ 1706177 1172027 677289 250250 251870 136416 38784 -215930 331722 -66978 217370
15217A56770R482g7932A42043a4725A55485m2230J67591E3029d1388C52821j39991
$$ 156770 166252 -77932 142043 -14725 155485 113255 280846 53029 -41388 352821 212830
15206B12830b10041J02395D29361A03229J27715A4853J52805b69676J33329J2756
$$ 212830 -210041 -107646 429361 103229 230944 14853 167658 -269676 -136347 -123591
15196a23591d9590H4982a6877C4487J1990b49854P467A99494N6392p2456a18867
$$ -123591 -49590 84982 -16877 34487 46477 -249854 -242387 199494 255886 183430 -118867
15184d56790a13765E8806J53639f770j74845b0195A57922a27962B29866A5281
$$ -456790 -113765 58806 212445 -6770 -181615 -20195 157922 -127962 229866 15281
15173B08856F9559K06949N4507A43587M0048P683D2905K20791P4613E3766N1181
$$ 208856 69559 276508 331015 143587 183635 191318 42905 263696 338309 53766 104947
15162A04947I364i2487A22367g9070j7032A4395L11937O9442b0781B25106l4895
$$ 104947 9364 -92487 122367 -79070 -96102 14395 326332 395774 -20781 225106 190211
15151A90211b8140B23875m9418E3069J8743c8801A30365J18016O970E3756K32694
$$ 190211 -28140 223875 174457 53069 71812 -38801 130365 248381 255351 53756 286450
15140B86450B8835P929J42345P1200K4314C4222L49645D8725A1598J11100c9781
$$ 286450 28835 36764 179109 250309 274623 34222 383867 48725 11598 122698 -39781
15128I2654l821A499b53308H9398a5690F5265A3200L8616a37557D28465I3672
$$ 92654 88833 1499 -253308 89398 -15690 65265 13200 51816 -137557 428465 93672
15116d2941A00719K9227J9138J78228B6979J65357p1453K56825A01462J41521
$$ -42941 100719 129946 149084 327312 26979 192336 120883 377708 101462 242983
15106B42983a07804A15416f6726C71762A10403l9464f6179k934j8151C98857d6938
$$ 242983 -107804 115416 -66726 371762 110403 70939 -66179 -69113 -87264 398857 -46938
15094A84342l565k035K11790H0058E491K65949g0103C80785a30682B32208b6406
$$ 184342 180777 178742 390532 80058 5491 271440 -70103 380785 -130682 232208 -26406
15082A77640m5636M2860m2967b9724B27059D6040K02019A02408L92410B00731
$$ 177640 132004 174864 131897 -29724 227059 46040 248059 102408 494818 200731
15071e1685j44984f1369a8483q2556d952E434K76777C0333J67488m0533f6950
$$ -51685 -196669 -61369 -18483 -101039 -4952 5434 282211 30333 197821 157288 -66950
15059C01130H6786J5997K65437m5899o6764m832D890R0132K90736I7129K31562
$$ 301130 86786 102783 368220 322321 255557 250725 4890 95022 385758 97129 328691
15048C28691M9248e8241C23041J0271F9960O5276J39410I0174J88691m1289j01149
$$ 328691 377939 -58241 323041 333312 69960 135236 274646 90174 278865 237576 136427
15037A36427a3981A55572G0050J75199F4133J28465D4468J29944J41721P373Q8963
$$ 136427 -13981 155572 70050 245249 64133 192598 44468 174412 316133 323506 412469
15026D12469A23830K9578J58833E5951K0194N6992J43418D5541K36226Q2575L3846
$$ 412469 123830 153408 312241 55951 76145 133137 276555 45541 281767 364342 398188
15015C98188o0470k7060K0645I5630J38238F7189J57543a06986C22279r2154A03320
$$ 398188 337718 310658 331303 95630 233868 67189 224732 -106986 322279 230125 103320
15003B11896O898H9557N29545a09287B63041A17848e4603B46490J18122b2726
$$ 211896 218794 89557 619102 -109287 263041 117848 -54603 246490 364612 -22726
14992b03572B7705I702J15534J17963j05067K80269j42629o2806a23291B10058
$$ -203572 27705 9702 125236 243199 138132 418401 275772 212966 -123291 210058
14981c72969A51779B3307L61914j65792P1521A38512q690g6275B18122J95692
$$ -372969 151779 23307 385221 219429 290950 138512 129822 -76275 218122 413814
14971D13814J0446E4252K35408G4305J18539N792A7605L26881A30221R3080M13560
$$ 413814 424260 54252 289660 74305 192844 198636 17605 344486 130221 223301 636861
14960F36861A29278L73554k24146J57662J74810k34928G2106N01137k77352o0245
$$ 636861 129278 502832 278686 436348 611158 376230 72106 573243 295891 235646
14950B35646O2675j05746m6395J44910k0154H9543J26463J54727A01855J47622
$$ 235646 298321 192575 146180 291090 270936 89543 216006 370733 101855 249477
14940B49477J7361G7141K36118G8515M1457J72872J94628A10319K79229j47360
$$ 249477 266838 77141 313259 78515 119972 292844 487472 110319 389548 242188
14930B42188J52608f2906A51912K9747J7757L69588A70925K892J69823N1055J02860
$$ 242188 394796 -62906 151912 181659 199416 569004 170925 173817 343640 394695 497555
14919D97555A56754K08538J15931k21360I665J32267J09293M2982N4791J2845
$$ 497555 156754 365292 481223 259863 9665 141932 251225 294207 348998 361843
14909C61843I7344K74771l8110j44869K09286A76952K35603D8787K01853m0442
$$ 361843 97344 372115 334005 189136 398422 176952 412555 48787 250640 210198
14899B10198J29352j33876K9738K39717r5674q3406N6710M6380j81566j00237
$$ 210198 339550 205674 235412 475129 379455 296049 352759 399139 217573 117336
14889A17336N20326k54403J51206E3943L81035O8015B02495L31451k34365A2322
$$ 117336 637662 383259 534465 53943 434978 502993 202495 533946 299581 12322
14878B2955K39175J09765q2836L31797B07390J22403n3327Q23j36465J8079J06405
$$ 22955 262130 371895 289059 620856 207390 329793 276466 277289 140824 158903 265308
14867B65308A9047K15441N7037Q0277K16245P9227l8024B14221L26578B15227
$$ 265308 19047 234488 291525 371802 588047 667274 629250 214221 540799 215227
14856E80895k39678P7409o6919L18087j71938J39345n3718B54947K0731J7061
$$ 580895 341217 418626 351707 669794 497856 637201 583483 254947 275678 292739
14846B92739N3185J67219B01839J46678K0943j59642J73361K06500j86207j09421
$$ 292739 345924 513143 201839 348517 369460 209818 383179 589679 403472 294051
14836B94051J59410J66251n7200o4480Q0967j18926m6813P9805Q2467K7583R1865
$$ 294051 453461 619712 562512 498032 578999 460073 413260 493065 575532 603115 694980
14825F94980k74286J6371P1359J56210C30689M55256D2571L92223j88007J74628
$$ 694980 420694 437065 508424 664634 330689 785945 42571 434794 246787 421415
14815D21415p9495K94773k49232J39833j59402J58598o8571J7048m776J57366
$$ 421415 341920 636693 387461 527294 367892 526490 457919 474967 470191 627557
14805F27557j16898O1898P8290B51537J49846J20836k05246M62435l49087k4631
$$ 627557 510659 572557 650847 251537 401383 522219 316973 779408 430321 405690
14795D05690m9228j12441M08220p2624n6448J43476j4018k24319A73798M84365
$$ 405690 356462 244021 652241 579617 523169 666645 652627 428308 173798 658163
14785F58163j23195J30013k07401A90730N81187k32127o3958L23154B54013M39541
$$ 658163 534968 664981 457580 190730 771917 539790 475832 798986 254013 693554
14775F93554k85258p0707L61304k21520J62581l14883M20438j5066j8258C42692
$$ 693554 408296 337589 698893 477373 639954 325071 745509 730443 712185 342692
14764C28914O6497N61268k59926K16878B60290N42534j09586j87514K36642j80224
$$ 328914 395411 956679 696753 913631 260290 802824 693238 505724 742366 562142
14754E62142l1020K74686m6047J85723k09872j14153J08365C56521K83164p5197
$$ 562142 531122 805808 759761 945484 735612 621459 729824 356521 639685 564488
14744E64488R8316j01491J3595J99813N6038k44087n1817j31617K85295j83722
$$ 564488 662804 561313 574908 774721 830759 586672 534855 403238 688533 504811
14734E04811J63476J52423l65957J67836K1365l5138j35478L89554Q5621l04528
$$ 504811 668287 820710 454753 622589 643954 608816 473338 862892 948513 643985
14724F43985M1308J71634j88167L55446E10577L01806n5914o8471J26834K0739
$$ 643985 685293 856927 668760 1024206 510577 812383 756469 687998 814832 835571
14714H35571L03424k83817j06073R9006k23257l07930M44823J35644l87878M80022
$$ 835571 1138995 855178 749105 848111 624854 316924 761747 897391 509513 989535
14704I89535j09682j00496J23314l10392N11203l29239M5994n8747M2880J26139
$$ 989535 879853 779357 902671 592279 1103482 774243 820237 761490 804370 930509
14694I30509K9973o7868J72304p1178k83236K34627D66689N92786m4510L7118
$$ 930509 960482 892614 1064918 993740 710504 945131 466689 1059475 1014965 1052083
14684A052083N7820n9367k08867K83338k07651Q2104l97406L00308L61702m31344
$$ 1052083 1109903 1050536 841669 1125007 917356 999460 602054 902362 1264064 832720
14674H32720R9636K5697o9612L11080k59681P6680k037j74530j84839J54206K84540
$$ 832720 932356 958053 888441 1199521 939840 1016520 1014483 839953 655114 809320 1093860
14663A093860K7520j86457L27659m68696N41571k59388J19749q2928j67621P9992
$$ 1093860 1121380 934923 1262582 793886 1335457 1076069 1195818 1112890 945269 1025261
14653A025261n7757J85362K14365l29411j48095L50045j17459j72581J40947K39460
$$ 1025261 967504 1152866 1367231 1037820 889725 1239770 1122311 949730 1090677 1330137
14643A330137l23612k3186K27519L3874l70847N7294K04396L6166K99459n20580
$$ 1330137 1006525 983339 1210858 1244732 873885 931179 1135575 1171741 1471200 950620
14633I50620M67344k95563J45110Q3886j16503k58299M99410j72110j25438M54243
$$ 950620 1417964 1122401 1267511 1351397 1234894 976595 1476005 1303895 1178457 1632700
14623A632700k69400L8518p506k09728j73931K42084r5807K63475P408k42782
$$ 1632700 1363300 1401818 1394312 1184584 1010653 1252737 1156930 1420405 1427813 1185031
14613A185031L03021j48517k39074J13161K37578j41337j65895K89311N1366j67801
$$ 1185031 1488052 1339535 1100461 1213622 1451200 1309863 1143968 1433279 1484645 1316844
14603A316844o786k6257N2573K29102K3587k61285J89451P9126m81931O10533
$$ 1316844 1310058 1283801 1336374 1565476 1589063 1327778 1517229 1596355 1114424 1724957
14593A724957k98275M13476k40029J58139m998j45128j60039M15552l00011K47579
$$ 1724957 1426682 1840158 1600129 1758268 1753270 1608142 1448103 1863655 1563644 1811223
14583A811223j60546J28132j01329J11572n267M56096m51892n893l70204N23300
$$ 1811223 1650677 1778809 1677480 1789052 1783785 2239881 1787989 1782096 1411892 1935192
14573A935192p9420K42786j08189k94761R6619N20387m66002M34984l20466N29365
$$ 1935192 1855772 2098558 1990369 1695608 1792227 2312614 1846612 2281596 1961130 2490495
14563B490495n97527L38279J23351M6083j45441O745Q1383k24931L11333J27986
$$ 2490495 1892968 2231247 2354598 2400681 2255240 2261985 2343368 2118437 2429770 2557756
14553B557756k01617M11973k03245j79126L98877k72939Q5530K65255J76172L24213
$$ 2557756 2356139 2768112 2564867 2385741 2784618 2511679 2597209 2862464 3038636 3362849
14543C362849J7458K93105K57358K48134J27797M07355O06814J148373J270856
$$ 3362849 3380307 3673412 3930770 4178904 4306701 4714056 5320870 6469243 7740099
14534G740099K127403M075408O921046J0595577r83817j1815170o555325k315949
$$ 7740099 9867502 13942910 20863956 31459533 30475716 18660546 12105221 9789272
14526I789272l385636j852438m12466p91717k87623o38926N30432k15819l96488
$$ 9789272 6403636 4551198 4138732 3347015 3059392 2420466 2950898 2735079 2338591
14517B338591J62616p298K6334P0550j82883j96741J12294L11010o3404J65897
$$ 2338591 2501207 2493909 2520243 2590793 2407910 2211169 2323463 2634473 2571069 2736966
14507B736966k18326J76270k63253j80605O19263J02963J91066n46480K5810J88194
$$ 2736966 2518640 2694910 2431657 2251052 2870315 2973278 3164344 2617864 2643674 2831868
14497B831868j16684K06052l1883N7508n4134K73981l78782K40760M7453j67267
$$ 2831868 2715184 2921236 2889353 2946861 2892727 3166708 2787926 3028686 3076139 2908872
14487B908872L70184J52816j01481K2980p7062J90106o8864K30165p7213M6171
$$ 2908872 3279056 3431872 3330391 3353371 3276309 3466415 3397551 3627716 3550503 3596674
14477C596674J9289n4913r0384j81L23009l52168L93332n9314J43798l06048M68064
$$ 3596674 3615963 3561050 3470666 3470485 3793494 3441326 3834658 3775344 3919142 3613094 4081158
14466D081158p4914J28163R2631J02681l73458N00587j2200l76532R9872J69647
$$ 4081158 4006244 4134407 4227038 4329719 3956261 4456848 4444648 4068116 4167988 4337635
14456D337635M6215L19104l49718j30342L67274M14387j01025m22528N77614l6352
$$ 4337635 4383850 4702954 4353236 4222894 4590168 5004555 4903530 4481002 5058616 5022264
14446E022264l31679K37828J83824O383J20954l37563K07755K87975J29331l69988
$$ 5022264 4690585 4928413 5112237 5118620 5239574 4902011 5109766 5397741 5527072 5157084
14436E157084M07730J27058l8422J53767J2868K40475O7677l42651M20890J57097
$$ 5157084 5564814 5691872 5653450 5807217 5820085 6060560 6128237 5785586 6206476 6363573
14426F363573p7506K13564j40335K1316J7588L53814M8939k4122M2707J63289
$$ 6363573 6286067 6499631 6359296 6380612 6398200 6752014 6800953 6776831 6819538 6982827
14416F982827K82828l1935L85147N3284k78531M24399l34834J36285J87081L06176
$$ 6982827 7265655 7233720 7618867 7672151 7393620 7818019 7483185 7619470 7806551 8112727
14406H112727J6712J86826k37095N00686r1033M33759O3974j12594K8794L55727
$$ 8112727 8129439 8316265 8079170 8579856 8488823 8922582 8986556 8873962 8902756 9258483
14396I258483m57274M63508J71702L54393j66345L90320L14071l9189K17274K43553
$$ 9258483 8801209 9264717 9436419 9790812 9624467 10014787 10328858 10289669 10506943 10750496
14386A0750496K26980Q4477K93586j41083K89197M12277r8028N43692j05557K73452
$$ 10750496 10977476 11061953 11355539 11214456 11503653 11915930 11817902 12361594 12256037 12529489
14376A2529489L65887K35352N9545K40504l6209N96852J63406K12863L29186K48023
$$ 12529489 12895376 13130728 13190273 13430777 13394568 13991420 14154826 14367689 14696875 14944898
14366A4944898k2783O64367j50173P95788K14355L01753J74167M75203K68666
$$ 14944898 14922115 15586482 15436309 16232097 16446452 16748205 16922372 17397575 17666241
14357A7666241J65738O99765J77916O0100P51815M48772M30778L56648M09994
$$ 17666241 17831979 18531744 18709660 18769760 19521575 19970347 20401125 20757773 21167767
14348B1167767M89855M94733L64137P52253M47149M88375N62958N25511N18031
$$ 21167767 21657622 22152355 22516492 23268745 23715894 24204269 24767227 25292738 25810769
14339B5810769M78791Q55979O77790O31995N36716P16630Q29333O30011Q44304
$$ 25810769 26289560 27145539 27823329 28455324 28992040 29708670 30538003 31168014 32012318
14330C2012318R41640R66363Q05112J030884J144804J125244P47688J029297R02393
$$ 32012318 32953958 33920321 34725433 35756317 36901121 38026365 38774053 39803350 40705743
14321D0705743J552318J159857J383574J251509J513706J505960J483610J869639
$$ 40705743 42258061 43417918 44801492 46053001 47566707 49072667 50556277 52425916
14313E2425916J474943J408218J977131J824030K064689K237042K545523J912868
$$ 52425916 53900859 55309077 57286208 59110238 61174927 63411969 65957492 67870360
14305F7870360K671526K500134K814631K776251L058791K745915L598943L822678
$$ 67870360 70541886 73042020 75856651 78632902 81691693 84437608 88036551 91859229
14297I1859229L220869L969572M067319M658201M678883M918028N030982N667102
$$ 91859229 95080098 99049670 103116989 107775190 112454073 117372101 122403083 128070185
14289A28070185N849028N782789O838097O816326P616493P889313Q111062Q498374
$$ 128070185 133919213 139702002 146540099 153356425 160972918 168862231 176973293 185471667
14281A85471667R048539R896565J0308166J0979010J1325453J2152276J2192142
$$ 185471667 194520206 204416771 214724937 225703947 237029400 249181676 261373818
14274B61373818J3236684J4236965J4469828J4287907J4547435J3554069J2841440
$$ 261373818 274610502 288847467 303317295 317605202 332152637 345706706 358548146
14267C58548146J2584138J1929617J1361316J1337955J0732260R805266Q597389
$$ 358548146 371132284 383061901 394423217 405761172 416493432 426298698 434896087
14260D34896087Q013508P407224N303482K445926J049818K134648k662238o486238
$$ 434896087 442909595 450316819 455620301 458066227 459116045 461250693 458588455 452102217
14252D52102217n896834p881708j0873642j0850941r440811j1127760j2974230
$$ 452102217 446205383 438323675 427450033 416599092 407158281 396030521 383056291
14245C83056291j4338901j3868577j4162457j3829030j3537115j3760688j3393301
$$ 383056291 368717390 354848813 340686356 326857326 313320211 299559523 286166222
14238B86166222j2174746j1778233j2320028j1571989j1193992j0670158j0152327
$$ 286166222 273991476 262213243 249893215 238321226 227127234 216457076 206304749
14231B06304749r364567q822672q861736q418390q135303q005315p015055o522101
$$ 206304749 196940182 188117510 179255774 170837384 162702081 154696766 147681711 141159610
14223A41159610o633149n943883n938872n169103n256465m854209m149350m075017
$$ 141159610 134526461 128582578 122643706 117474603 112218138 107363929 103214579 99139562
14215I9139562m113353l869148l389467l967263k664822l299392k660804k820382
$$ 99139562 95026209 91157061 87767594 83800331 81135509 77836117 75175313 72354931
14207G2354931k692425j937865k554231k300502j821968j953616k109050j600922
$$ 72354931 69662506 67724641 65170410 62869908 61047940 59094324 56985274 55384352
14199E5384352j290965j811218j804591j333824j830570j009697j591803q50807
$$ 55384352 54093387 52282169 50477578 49143754 47313184 46303487 44711684 43860877
14191D3860877j268390j323878j175020r15151j069817j192802n46982j430210
$$ 43860877 42592487 41268609 40093589 39178438 38108621 36915819 36368837 34938627
14183C4938627r09514p65982q35196p93002p55381m87621j024671o25325o72985
$$ 34938627 34029113 33263131 32427935 31634933 30879552 30391931 29367260 28741935 28068950
14174B8068950p76533p16637n19198q45353j60908o93409l39064m39534j120332
$$ 28068950 27292417 26575780 26056582 25211229 25050321 24356912 24017848 23578314 22457982
14165B2457982k67928m79176k78211p25667J14493o74209m31191k25794o99708
$$ 22457982 22190054 21710878 21432667 20707000 20821493 20147284 19716093 19490299 18790591
14156A8790591j66461m73357k34997l92775l20043m36902q4614l63008k64580
$$ 18790591 18624130 18150773 17915776 17523001 17202958 16766056 16681442 16318434 16053854
14147A6053854m61543j49203k96251j47067k21603m72823Q13l61213k58349k84085
$$ 16053854 15592311 15443108 15146857 14999790 14778187 14305364 14306177 13944964 13686615 13402530
14137A3402530l56291J5894l37214j89993j90663m36260o9134J76496m24339O7628
$$ 13402530 13046239 13062133 12724919 12534926 12344263 11908003 11838869 12015365 11591026 11658654
14127A1658654k79093j44523l73450k1969l29437j84158k01120j51993J6023j17557
$$ 11658654 11379561 11235038 10861588 10839619 10510182 10326024 10124904 9972911 9988934 9871377
14117I871377j61953O4555l76927J00526q1567o90425M63722k15230m51491k09510
$$ 9871377 9709424 9773979 9397052 9497578 9416011 8725586 9189308 8974078 8522587 8313077
14107H313077J84972J27320m02473R3457m77904J78915k87425j21918J03486l53473
$$ 8313077 8498049 8625369 8222896 8316353 7838449 8017364 7729939 7608021 7711507 7358034
14097G358034J16189n69781N25636l64700p255k47700K508P7115k96807M0016
$$ 7358034 7474223 6904442 7430078 7065378 7058123 6810423 6812931 6890046 6593239 6633255
14087F633255p2105m59724L40197k53974J06285J32941m34947j71200P553Q5699
$$ 6633255 6561150 6101426 6441623 6187649 6293934 6426875 5991928 5820728 5828281 5913980
14077E913980M0916j58978O4615l49073o1290K24214n06567L46891k83207l86294
$$ 5913980 5954896 5795918 5860533 5511460 5450170 5674384 5167817 5514708 5231501 4845207
14067D845207J93065J28225o0022M9106k22886K43446k14621J13008l84657K11855
$$ 4845207 5038272 5166497 5106475 5155581 4932695 5176141 4961520 5074528 4689871 4901726
14057D901726k54816o2342K13517j01710k59225J26783j73280J28383j86702o0501
$$ 4901726 4646910 4584568 4798085 4696375 4437150 4563933 4390653 4519036 4332334 4271833
14047D271833n6784J12025j90395P5121r6178J92082k64n32999M54222m36271
$$ 4271833 4215049 4327074 4136679 4211800 4115622 4307704 4307440 3774441 4228663 3792392
14037C792392J55981L8984j89013J94025l17553j34267J48798k71887Q9281M64291
$$ 3792392 3948373 3987357 3798344 3992369 3674816 3540549 3689347 3417460 3506741 3971032
14027C971032r45172M27341l5994Q058J66602k91380n7848J34963M9963k82026
$$ 3971032 3025860 3453201 3417207 3425265 3591867 3300487 3242639 3377602 3427565 3145539
14017C145539j70262M73912l09749K78976k88864M5445n1414n0605m16447O62556
$$ 3145539 2975277 3449189 3139440 3418416 3129552 3174997 3123583 3072978 2656531 3319087
14007C319087o03085L58575k87658O3564N8701M5077j8390j64056O4770n47850
$$ 3319087 2716002 3074577 2786919 2850483 2909184 2954261 2935871 2771815 2836585 2288735
13997B288735L18446J9115P5484M7611j77093k03721M2627Q3833P7768p6517j84398
$$ 2288735 2607181 2626296 2701780 2749391 2572298 2368577 2411204 2495037 2572805 2496288 2311890
13986B311890j5002J60037K83447l07173J78432r1886K00015M33956j4103L56364
$$ 2311890 2296888 2456925 2740372 2433199 2611631 2519745 2719760 3153716 3139613 3495977
13976C495977P77127L75402J715127L231418O195331J1090729N002640r868598
$$ 3495977 4273104 4648506 6363633 9595051 15790382 26881111 31883751 22015153
13968B2015153p166828m447527k686116j610246r26892l91911p67394m72106p6365
$$ 22015153 14848325 10400798 7714682 6104436 5177544 4785633 4018239 3546133 3469768
13959C469768l52851K29179k75290m3445l38976j9144R644n3061K9618k90791
$$ 3469768 3116917 3346096 3070806 3027361 2688385 2669241 2678885 2625824 2655442 2364651
13949B364651J14199l38770L25259m88181M46079j35249q1814J65721j78385K38416
$$ 2364651 2478850 2140080 2465339 1977158 2423237 2287988 2206174 2371895 2193510 2431926
13939B431926m17190q1542J54586k60770J46506P2932j30016J17906k44497M8794
$$ 2431926 2014736 1933194 2087780 1827010 1973516 2046448 1916432 2034338 1789841 1838635
13929A838635J44756P1943k63051O0293N9869j66282K63508k24790J77068l08468
$$ 1838635 1983391 2055334 1792283 1852576 1912445 1746163 2009671 1784881 1961949 1653481
13919A653481L9604K25958L868J28059n34136L66830k3189o9390j25149Q3753
$$ 1653481 1693085 1919043 1922911 2050970 1516834 1883664 1860475 1791085 1665936 1749689
13909A749689L2319l03458M27800k30758j52830L61635m18392k3276l6431K2337
$$ 1749689 1782008 1478550 1906350 1675592 1522762 1884397 1466005 1442729 1406298 1428635
13899A428635k30126M769M73648L2856m35795K36657j83941J04150p5664J82228
$$ 1428635 1198509 1203278 1676926 1709782 1273987 1510644 1326703 1430853 1355189 1537417
13889A537417k40959J0248N00927m98059J71037j81733K5243J96610m4461r992
$$ 1537417 1296458 1306706 1807633 1309574 1480611 1298878 1324121 1520731 1476270 1466278
13879A466278j34980O5859M4773j27651k43510M09725L70621n7907m27836k75547
$$ 1466278 1331298 1397157 1441930 1314279 1070769 1480494 1851115 1793208 1365372 1089825
13869A089825M11616m71813L31503k18153m6130K74422k76672J80730P1459J17367
$$ 1089825 1501441 1029628 1361131 1142978 1096848 1371270 1094598 1275328 1346787 1464154
13859A464154n9170j37225j40347J05842K16581l15238K39809k12576J53828k1693
$$ 1464154 1404984 1267759 1127412 1233254 1449835 1134597 1374406 1161830 1315658 1293965
13849A293965J8926j77729m3954j04364j1017K65130j03736k40113J79942p5017
$$ 1293965 1312891 1135162 1091208 986844 975827 1240957 1137221 897108 1077050 1002033
13839A002033L63835k09718p2766J1399K0605Q4223K5029l08402J71009l12843
$$ 1002033 1365868 1156150 1083384 1094783 1115388 1199611 1224640 916238 1087247 774404
13829G74404j5882K82753j16847j36147L24568J58881j51437p3717R4704n20529
$$ 774404 758522 1041275 924428 788281 1112849 1271730 1120293 1046576 1141280 620751
13819F20751M23104j16542P8357Q9867k10137L50162n10481L15114Q1348k29628
$$ 620751 1043855 927313 1005670 1095537 885400 1235562 725081 1040195 1121543 891915
13809H91915K85079j43683j38128j12353K51640L5629j1088l96689J42288K39622
$$ 891915 1176994 1033311 895183 782830 1034470 1070099 1059011 662322 804610 1044232
13799A044232j17828k00570L57067j34420k03672M00046j27891k12860R6696j8943
$$ 1044232 926404 725834 1082901 948481 744809 1144855 1016964 804104 900800 881857
13789H81857K74211k70760k45297K86604j24182N4368j19539J8715L95970l86929
$$ 881857 1156068 885308 640011 926615 802433 856801 737262 755977 1151947 765018
13779G65018k75343L25101J15984k61164K5920J20316J56072j15352J89613k86499
$$ 765018 489675 814776 930760 669596 695516 815832 971904 856552 1046165 759666
13769G59666M0903j36543p548N4956K27912K42949m45098j98954K77319O2458
$$ 759666 800569 664026 656478 711434 939346 1182295 737197 538243 815562 878020
13759H78020j39834r7786J52719j17728k05062K79265J32092J00527m18879j37356
$$ 878020 738186 640400 793119 675391 470329 749594 881686 982213 563334 425978
13749D25978K35338J03928K35809l72983K07066k07245m2285K27518j91381K87621
$$ 425978 661316 765244 1001053 628070 835136 627891 585606 813124 621743 909364
13739I09364k25524j71128J93308k55247J050J68964M7339Q6431j86311j21155
$$ 909364 683840 512712 706020 450773 451823 620787 668126 754557 568246 447091
13729D47091K95132P8011q1431J29961j02054J37826l66415P6341p937J05379
$$ 447091 742223 820234 738803 868764 766710 904536 538121 614462 606525 711904
13719G11904j70476j7654j37294K90710l01645J71191O8665k5681M41821m39562
$$ 711904 541428 523774 386480 677190 375545 546736 615401 589720 1031541 591979
13709E91979L93354C05685L45043O6340k44406L24463k16769K77733j51748J57402
$$ 591979 985333 305685 650728 717068 472662 797125 580356 858089 706341 863743
13699H63743j41694l6408l28592M5951L93548l46966K98403j46242j68488J61181
$$ 863743 722049 685641 357049 403000 796548 449582 747985 601743 433255 594436
13689E94436k18232K55630l1411J1729K7424j84881L05944M4496n995l01383l3341
$$ 594436 376204 631834 600423 612152 639576 454695 760639 805135 799140 497757 464416
13678D64416K12131q7188j61350J57057k30297J402J11930J73012H5720K83763
$$ 464416 676547 589359 428009 585066 354769 356171 468101 641113 85720 369483
13668C69483J42611L14131k80998r0986J18728K16140B2377J31698K39743K63920
$$ 369483 512094 826225 545227 454241 572969 789109 22377 154075 393818 657738
13658F57738J3611J87236k55496J91150l10065L3548l7324j19537Q8545K67697
$$ 657738 671349 858585 603089 794239 484174 517722 480398 360861 449406 717103
13648G17103k49978J42157J17003j19319j91534L8213j41294L24673J7992B89699
$$ 717103 467125 609282 726285 606966 415432 453645 312351 637024 655016 289699
13637B16051L32475L9795A10080M49830j89849p732H1399M9719L33689J36357
$$ 216051 548526 588321 110080 559910 370061 362329 81399 131118 464807 601164
13627F01164A96100J84525M879K42751M5681j46987p8995r3244j75883M67227
$$ 601164 196100 380625 385504 628255 673936 526949 447954 354710 178827 646054
13617F46054j41678j69478J22517o3081R9233q922A82619Q76K58721L51368B79250
$$ 646054 504376 334898 457415 394334 493567 484645 182619 183495 442216 793584 279250
13605F03284k95072L2243K77625B95516M7648j05105L33764A64208N69879B57039
$$ 603284 308212 340455 618080 295516 343164 238059 571823 164208 734087 257039
13594C41329K2363J83420B63127K91067k63413J28746l1408p1266K02815J05006
$$ 341329 363692 547112 263127 554194 290781 419527 388119 316853 519668 624674
13584F24674N4229A98025p2422n1546O36505A67271m8765K00262l7405A29726
$$ 624674 678903 198025 125603 74057 710562 167271 118506 318768 281363 129726
13573C71846m3930L51221k71864A75650M09365A60926M34666j27634k08505N7715
$$ 371846 327916 679137 407273 175650 585015 160926 595592 467958 259453 317168
13563C17168L70041A97196L03533N55409B45696c0837A63622K08727k0679q5838
$$ 317168 687209 197196 500729 1056138 245696 -30837 163622 372349 351670 265832
13553B65832I0614K20893N7006m2768e2055F83905B33452J08610P680j25971L7312
$$ 265832 90614 311507 368513 325745 -52055 683905 233452 342062 349742 223771 261083
13542B61083L418M2863m1057N14120B30411L4304j6757Q5959O5539A9219L53580
$$ 261083 264501 307364 266307 780427 230411 264715 247958 333917 399456 19219 372799
13531C72799J07711A09560J58521J02238J3374j04776c6481D65145j76670J47065
$$ 372799 480510 109560 268081 370319 383693 278917 -36481 465145 288475 435540
13521D35540j63912J24386j07926o6398L82575k20577K59189r6881o892k02289
$$ 435540 271628 396014 288088 221690 604265 383688 642877 545996 539104 336815
13511C36815I5131M07920B34510K3310j7387f7336A66254A8193K12184G0545L44473
$$ 336815 95131 503051 234510 257820 240433 -67336 166254 18193 230377 70545 415018
13500D15018m9262p0333o1497Q9696j39777L25846N1980B36126M7981j8471O1405
$$ 415018 365756 295423 233926 323622 183845 509691 561671 236126 284107 265636 327041
13489C27041J243m6255K98586j83347D132J92037a56955B98950A46827J66543
$$ 327041 328284 282029 580615 397268 4132 196169 -156955 298950 146827 313370
13479C13370E5976M80829J78279l31141P1114q3944J4020r6954A26378K96868
$$ 313370 55976 536805 715084 383943 455057 371113 385133 288179 126378 423246
13469D23246A35144J35861h5891B24834R6908j29344K10549j75414E1892J87368
$$ 423246 135144 271005 -85891 224834 321742 192398 402947 227533 51892 239260
13459B39260Q3306j52079k0809L95759c223E22479A974L37779E879J18153J62091
$$ 239260 322566 170487 149678 545437 -3223 522479 1974 339753 5879 124032 286123
13448B86123a49037B81975P1060A55953K66388J2334M4599B28853K25943p3113
$$ 286123 -149037 281975 353035 155953 422341 434675 479274 228853 454796 381683
13438C81683A42613M10355n3865j76022Q0663I400J35117n7873J94566L536J93036
$$ 381683 142613 552968 499103 323081 403744 9400 144517 86644 281210 284746 477782
13427D77782L5267A37138J6470c6344E7678f1416B69875q439n9146K5183J16967
$$ 477782 513049 137138 153608 -36344 57678 -61416 269875 261436 202290 227473 344440
13416C44440k0731A11066R1474J88161j85692J0208J4228J46135D6581L58449
$$ 344440 323709 111066 202540 390701 205009 215217 229445 375580 46581 405030
13406D05030p2908A42818K33578j56077r0600J47930K15216j50962p3893P3320
$$ 405030 332122 142818 376396 220319 129719 277649 492865 341903 268010 341330
13396C41330j3243O5371j37413A0229L55954A11032m5951a41564C32438R560k153
$$ 341330 328087 393458 256045 10229 366183 111032 65081 -141564 332438 341998 339845
13385C39845I5280K06660A14567i9577C89892j53156d0856E51668k31797k2012
$$ 339845 95280 301940 114567 -99577 389892 236736 -40856 551668 319871 297859
13375B97859J66725A73533J39938l0996b7572A53187J45180J33965A60980k6530
$$ 297859 464584 173533 313471 282475 -27572 153187 298367 432332 160980 134450
13365A34450K17330p9621R2102J7088j43209A1086K07473M2837K6055j41514Q2646
$$ 134450 351780 272159 364261 381349 238140 11086 218559 261396 287451 145937 228583
13354B28583b0190B80251j20373L3591e7813j90594B40474E0826M28530j31323
$$ 228583 -20190 280251 159878 193469 -57813 -248407 240474 50826 479356 348033
13344C48033j12655M6182J800R7985K20425A73161L3441O11415H6940b21837A78587
$$ 348033 235378 281560 283360 381345 601770 173161 206602 818017 86940 -221837 178587
13332C18064L726P9822k1376b820D92091K2505H0901K59154P381j48873O7056
$$ 318064 321790 401612 380236 -2820 492091 514596 80901 340055 347436 198563 265619
13321B65619J03200o4117m2041a24217A06894B5916d2503E82213c5501B07103
$$ 265619 368819 304702 262661 -124217 106894 25916 -42503 582213 -35501 207103
13310a99348B52471D6911K75771k3042N289J4586j21098c7401A7641N21485A26188
$$ -199348 252471 46911 322682 299640 304929 319515 198417 -37401 17641 539126 126188
13298A46372F6958J73786O4661K50777k20201g1306A83886J99360c4082A49195
$$ 146372 66958 240744 305405 556182 335981 -71306 183886 383246 -34082 149195
13287C83630i287C68624j21378r6275J2472M5025J72394j81165M3471J8349E8113
$$ 383630 -9287 368624 247246 150971 163443 208468 380862 199697 243168 261517 58113
13275A95600k231L8074j11646d4347A58637k1884L5737L4548N9440r6469L6490
$$ 195600 193369 231443 119797 -44347 158637 136753 172490 207038 266478 170009 206499
13264B06499D8595J13300a05661D26777A00709b33339Q8996C94525r2773o7155
$$ 206499 48595 161895 -105661 426777 100709 -233339 -144343 394525 301752 234597
13254B34597m7567a27184F4654J97701I5739L9148g9167D9975K19085r7987K7696
$$ 234597 187030 -127184 64654 262355 95739 134887 -79167 49975 269060 171073 198769
13243A98769D8670B0599P3348A2408i4616D21251j89852r8387J68555j35191K09191
$$ 198769 48670 20599 93947 12408 -94616 421251 231399 133012 301567 166376 375567
13232C75567a24829B50433E587d3460A92304D2827J19194D8808J47950j1905c7763
$$ 375567 -124829 250433 5587 -43460 192304 42827 162021 48808 196758 184853 -37763
13220D2798K72794J14431g8201A22962n0198K7669K6564B3973J10217G065a57331
$$ 42798 315592 430023 -78201 122962 72764 100433 126997 23973 134190 7065 -157331
13208a03078B08027p8887c36162d2739A84674a9779A76868c06387B12780M8258
$$ -103078 208027 129140 -336162 -42739 184674 -19779 176868 -306387 212780 261038
13198B61038f2142B47579a36447c8570C60645I4919Q4486m4954K50419I5792L44203
$$ 261038 -62142 247579 -136447 -38570 360645 94919 179405 134451 384870 95792 439995
13187D39995j76542p1655p2571l4510K3352K81510b22702g7394A9129L22323d2767
$$ 439995 263453 191798 119227 84717 108069 389579 -222702 -77394 19129 341452 -42767
13175c4542A7975d1533j45582A74145a33637A37807a9982A9792O1980K4791J74355
$$ -34542 17975 -41533 -187115 174145 -133637 137807 -19982 19792 81772 106563 280918
13164B80918J50665A84933F0212g4521B51792j22722d2578B57231H9047Q191a71100
$$ 280918 431583 184933 60212 -74521 251792 129070 -42578 257231 89047 97238 -171100
13152e0011F1350k4202r286K06060D1006J99057K39156j85212j3107o0963b88518
$$ -50011 61350 37148 27862 233922 41006 240063 479219 294007 280900 219937 -288518
13140D97390a76754G0914d5078B47640C1033j4136M5860J71942N649e6591I8345
$$ 497390 -176754 70914 -45078 247640 31033 16897 62757 234699 240348 -56591 98345
13128a37222J2808B40413E5346K10874G891J87381b7342E4886J90033f4933A47058
$$ -137222 -124414 240413 55346 266220 7891 195272 -27342 54886 244919 -64933 147058
13116d9572C82259N4910A11034J25604A08330R6463A4104a96914H1156J75331
$$ -49572 382259 437169 111034 236638 108330 204793 14104 -196914 81156 256487
13106B56487l368j03019N7630I5698D2332K11362e3629I000Q8734h3239I724e4598
$$ 256487 253119 150100 207730 95698 42332 253694 -53629 9000 97734 -83239 9724 -54598
13093A82850m9737a265A90402a58672A06370c5510A55410b41041N4052h3128k06540
$$ 182850 133113 -1265 190402 -158672 106370 -35510 155410 -241041 -186989 -83128 -289668
13082b89668M8038B82725b7415a2000A05327j4630O3007b47504A77202H6753n369
$$ -289668 -241630 282725 -27415 -12000 105327 90697 153704 -247504 177202 86753 81384
13071H1384L8463b82753f122A21291J53460I1823N10275A12879H772K9213b75356
$$ 81384 119847 -282753 -6122 121291 274751 91823 602098 112879 8772 37985 -275356
13059A57521f0077B09909b38122B26212H0472e3548A73851b9552j21243A68571
$$ 157521 -60077 209909 -238122 226212 80472 -53548 173851 -29552 -150795 168571
13048C8678h612D5340a5006A87801K87937B37753F2707q793L1659B0773L0429
$$ 38678 -8612 45340 -15006 187801 475738 237753 62707 53914 85573 20773 51202
13037E1202a23123j69710A86416k9378B0666P8450K0837C4935J06584D0696e0605
$$ 51202 -123123 -292833 186416 157038 20666 99116 119953 34935 141519 40696 -50605
13025A24732R8641o597L03434B25684f7012E8055b1967k66488A23822l4047f6960
$$ 124732 223373 216776 520210 225684 -67012 58055 -21967 -288455 123822 89775 -66960
13013b3735B3314L07007a28872n6015B96946E920J99332G5249K0532l3763P3613
$$ -23735 23314 330321 -128872 -184887 296946 5920 205252 75249 95781 62018 135631
13002A35631M4997A0583a27708D4594N3672h9729H2423f3917C27462a00975m3523
$$ 135631 180628 10583 -127708 44594 98266 -89729 82423 -63917 327462 -100975 -144498
12991a44498B713b0523j29813A56855j0526g6872B78104J84736k10217C8917J17080
$$ -144498 2713 -20523 -150336 156855 146329 -76872 278104 462840 252623 38917 155997
12980A55997m598o6519a78843f6828B06336E0453J45263a27923A61717O4142c5403
$$ 155997 151399 84880 -178843 -66828 206336 50453 195716 -127923 161717 225859 -35403
12968b4228A12363a71783I9842J11450O6745C2804K8632L48763M6579a44319C35943
$$ -24228 112363 -171783 99842 211292 278037 32804 61436 410199 456778 -144319 335943
12956I7195J72301E4020j5519J44192a4055j3512B41061m5121n2674K54116j25132
$$ 97195 269496 54020 38501 182693 -14055 -27567 241061 195940 143266 397382 272250
12945B72250b41816A29373j7865J7038K16345j52963j6598M6047G8075c7031A02240
$$ 272250 -241816 129373 111508 128546 344891 191928 175330 221377 78075 -37031 102240
12933C0269Q3899K36634G8805j5634f8646a227A02038J19990E2808c5438B28853
$$ 30269 114168 350802 78805 63171 -68646 -1227 102038 222028 52808 -35438 228853
12921A16698a3428B97520n6720f2871A85056B4001a11570d9319H6365f6941j68265
$$ 116698 -13428 297520 240800 -62871 185056 24001 -111570 -49319 86365 -66941 -235206
12910b35206A82118a03580A26316a32948K4247c7402C1152J52136e7460A68351
$$ -235206 182118 -103580 126316 -132948 -108701 -37402 31152 183288 -57460 168351
12899A00946c23046a40313E2569K5937a78642H0536b0206n543k66822a01596B45889
$$ 100946 -323046 -140313 52569 78506 -178642 80536 -20206 -25749 -292571 -101596 245889
12887C39871a66391c3586A24128m9060K6070r911a12758A69011q0075P5953i1231
$$ 339871 -166391 -33586 124128 75068 101138 91227 -112758 169011 88936 164889 -91231
12875B71104o5704a00101B81569G2265b72592A84260a29309m25f2418B889i2336
$$ 271104 205400 -100101 281569 72265 -272592 184260 -129309 -129734 -62418 2889 -92336
12863a32121j07118B91231j14317f9543A18148l2814J25131c11932P8738B95564
$$ -132121 -239239 291231 176914 -69543 118148 85334 210465 -311932 -233194 295564
12852g0387C31059c8328B42311j18285j4222A6165K68906d644j67991A5025d6954
$$ -70387 331059 -38328 242311 124026 109804 16165 285071 -4644 -172635 15025 -46954
12840c6815l7099B03471J33380G9054J05425m9339d0841j34087H1453d0277j85203
$$ -36815 -73914 203471 336851 79054 184479 135140 -40841 -174928 81453 -40277 -225480
12829b25480c21C87270j09507e71I5032J8615C5220L29561A46433b82959E5096
$$ -225480 -321 387270 277763 -571 95032 113647 35220 364781 146433 -282959 55096
12817A54034b20078A79586j1951p0155J4143e9300F4677K0954P0829J6558K30272
$$ 154034 -220078 179586 167635 97480 111623 -59300 64677 85631 156460 173018 403290
12806D03290A76296f3417j8468j2252H3198f2946K4364j30762e2923k86665D30093
$$ 403290 176296 -63417 -81885 -94137 83198 -62946 -38582 -169344 -52923 -339588 430093
12794b20908D05530D0368b1251j06606J8915b1532k41940j49994a48651F2904
$$ -220908 405530 40368 -21251 -127857 -108942 -21532 -263472 -413466 -148651 62904
12783A2415a7581E9939d1870A15033m1998a9367G9032c42015G7400P5455J79078
$$ 12415 -17581 59939 -41870 115033 73035 -19367 79032 -342015 77400 152855 331933
12772C31933g024o3181B55194D9513a88811B88623O9008H5021J47856G3792b52598
$$ 331933 -7024 -70205 255194 49513 -188811 288623 357631 85021 232877 73792 -252598
12760e5986A89512c32173P2916f9076o2404A94648F7558c3904j0106k29146B60190
$$ -55986 189512 -332173 -259257 -69076 -131480 194648 67558 -33904 -44010 -273156 260190
12748a60523B41297a60925B56523b89614A0302b01004n8866I4926e5547p5j16580
$$ -160523 241297 -160925 256523 -289614 10302 -201004 -259870 94926 -55547 -55622 -172202
12737a72202j61705f4355B36903a59161b50H7556b00912j23329E9727O5117b82957
$$ -172202 -333907 -64355 236903 -159161 -250 87556 -200912 -324241 59727 124844 -282957
12725i1758A1615K34625a48950A17983N4314J5411l7108A0052J18324i3111B73380
$$ -91758 11615 246240 -148950 117983 172297 187708 150600 10052 128376 -93111 273380
12713C32971E2972e9921B6538J13522a51892F842a1422A93185K2934f3535k31707
$$ 332971 52972 -59921 26538 140060 -151892 6842 -11422 193185 216119 -63535 -295242
12702b95242b8719j07638O7488C01290A09887b77998H9991k4289K09401r3699
$$ -295242 -28719 -136357 -68869 301290 109887 -277998 89991 65702 275103 181404
12692A81404K86451A12420L1155K305g3010C7824N8725K05463C9546L53480h3003
$$ 181404 467855 112420 143575 145880 -73010 37824 96549 302012 39546 393026 -83003
12680C51587j52180F1491a07307A85441i55I732J13128q149c0416A75115B0895
$$ 351587 199407 61491 -107307 185441 -955 9732 122860 114711 -30416 175115 20895
12668B60557e2306B19331K03193B2725K45818A27956K32192j01061j04743d755
$$ 260557 -52306 219331 422524 22725 268543 127956 360148 259087 154344 -4755
12657B01071a96018A48451c22628C9205J28428f2123B44027c63572a4161E9139
$$ 201071 -196018 148451 -322628 39205 167633 -62123 244027 -363572 -14161 59139
12646c2505l15226I4925k3770J9783D893P4192f1276a744A92815M592o1166n4389
$$ -32505 -347731 94925 71155 90938 4893 79085 -61276 -1744 192815 197407 136241 81852
12634H1852j5095K88786a6753L875q5986j29112e5940B73579g2290F7922i374
$$ 81852 66757 355543 -16753 -12878 -98864 -227976 -55940 273579 -72290 67922 -9374
12622I503L4078K3687a33525B4627L2735J83697f909C64745A66581F6176a84986
$$ 9503 43581 67268 -133525 24627 57362 241059 -6909 364745 166581 66176 -184986
12610D24026C1333L87924F9966J10357N3589a75717C2386J4510b8764A12080P7003
$$ 424026 31333 419257 69966 180323 233912 -175717 32386 46896 -28764 112080 189083
12599A89083b24323D6033g7691e268A68060a22795A03692C3821L2479L38356F8286
$$ 189083 -224323 46033 -77691 -5268 168060 -122795 103692 33821 66300 404656 68286
12587D1074a49047G1514a45764A34948e7535C6032K54030a45324A15444n0456
$$ 41074 -149047 71514 -145764 134948 -57535 36032 290062 -145324 115444 64988
12577F4988c03573a31522F7365L13275l3103a93595P1259l5467B59961G2743L35228
$$ 64988 -303573 -131522 67365 380640 347537 -193595 -122336 -157803 259961 72743 407971
12566D07971F1195J05989G1832K8854D2795J28314A7395Q5353b18869N023I1493
$$ 407971 61195 167184 71832 100686 42795 171109 17395 102748 -218869 -213846 91493
12554B86049l2750a05360A27178O6549P2047g4600d99B6603c15935A11603O7625
$$ 286049 253299 -105360 127178 193727 265774 -74600 -499 26603 -315935 111603 179228
12543A79228g8094I4097N9349F0514a48037N4120I0131A8227J6146K54030n7503
$$ 179228 -78094 94097 153446 60514 -148037 -93917 90131 18227 34373 288403 230900
12532B30900h2410c0802n3949j68352C419b59614H337J93835E444K40719A4618
$$ 230900 -82410 -30802 -84751 -253103 3419 -259614 8337 202172 5444 246163 14618
12520d3882f404B62703b31238g0037A39063A3637J22151K73854a31651C0281c3713
$$ -43882 -6404 262703 -231238 -70037 139063 13637 135788 409642 -131651 30281 -33713
12508f0031C41793a88812C20726j23132K82372B3272K28018Q858f7458j92289
$$ -60031 341793 -188812 320726 197594 479966 23272 251290 260148 -67458 -259747
12498b59747g3459A95706i3611A86794J74720A36195a47673A16724L5822l0872
$$ -259747 -73459 195706 -93611 186794 361514 136195 -147673 116724 152546 121674
12488A21674a35520M5631A45580K3410n2150J56810K50056G6535J81580b50737
$$ 121674 -135520 -89889 145580 168990 116840 273650 523706 76535 258115 -250737
12477f9501F7782K7624a44718A65247Q580q5519M1598b93089a3011A75480b9088
$$ -69501 67782 95406 -144718 165247 173827 88308 129906 -293089 -13011 175480 -29088
12465a09323j68608J20282q9323l9370a05275N1023B60158I8836N2401P3137A09104
$$ -109323 -277931 -157649 -246972 -286342 -105275 -54252 260158 98836 151237 224374 109104
12453a73163A25778d2743j11382A25706R171L99921a05574B19420o1898K66298
$$ -173163 125778 -42743 -154125 125706 134877 534798 -105574 219420 157522 423820
12443D23820a51025B14204C197R3056a11120b3722j88133G2673K8148k9666d49199
$$ 423820 -151025 214204 3197 96253 -111120 -23722 -211855 72673 100821 71155 -449199
12431A64494E941a69576m6530l6858A06910g2750A1029J28560a97249A41903E2485
$$ 164494 5941 -169576 -216106 -252964 106910 -72750 11029 139589 -197249 141903 52485
12419H4774J8802a73956d656p687A48233h2444D0260a79123h6429c1632A94265
$$ 84774 103576 -173956 -4656 -12343 148233 -82444 40260 -179123 -86429 -31632 194265
12407b53002E7581e224l05317I8712A2812a44601o3940B38372J41838a82561G8706
$$ -253002 57581 -5224 -310541 98712 12812 -144601 -208541 238372 380210 -182561 78706
12395e3683n0277A47558a82188A3478J79575f4533j2132q6690F6739d5528k18399
$$ -53683 -103960 147558 -182188 13478 193053 -64533 -76665 -163355 66739 -45528 -263927
12384b63927D3372a16285K3465o8736L9744B8431L3450e9147B38732a08005a3323
$$ -263927 43372 -116285 -92820 -161556 -121812 28431 61881 -59147 238732 -108005 -13323
12372a8639j50248g1652C4856a63654g9338A89909a11163k90353B5485P2085K096
$$ -18639 -168887 -71652 34856 -163654 -79338 189909 -111163 -401516 25485 97570 99666
12361I9666J7396O8229a30315C04985a06890k2691B87921o5313H8720c28992a25140
$$ 99666 117062 185291 -130315 304985 -106890 -129581 287921 222608 88720 -328992 -125140
12349a09127C3279i8477j9666L6622l10426b3758n2793k43674C18254A02770a20359
$$ -109127 33279 -98477 -118143 -81521 -391947 -23758 -76551 -320225 318254 102770 -120359
12337c29487B3565a07542r7536h4139n2700M9856D5514d667j22145J3894A38900
$$ -329487 23565 -107542 -205078 -84139 -136839 -86983 45514 -4667 -126812 -112918 138900
12325c7432p8513c9502j2914D4549K24408j09604a47114B62330A08068E0516e9369
$$ -37432 -115945 -39502 -52416 44549 268957 159353 -147114 262330 108068 50516 -59369
12313B2712a63948j71772f430A52827b98918B46778b19249i3126C60225A12440
$$ 22712 -163948 -335720 -6430 152827 -298918 246778 -219249 -93126 360225 112440
12302A72518m682L4595a9875j6451m8030E5321c8505G0152e7696I5803K43227
$$ 172518 167836 202431 -19875 -36326 -84356 55321 -38505 70152 -57696 95803 339030
12291C39030B190K57622i6068j71028H4974J39020F8216b73457a20886C29966
$$ 339030 2190 259812 -96068 -267096 84974 223994 68216 -273457 -120886 329966
12280a49179B84851K2124a66352I4986b89962B00581a07000D7797h4026I262a2761
$$ -149179 284851 306975 -166352 94986 -289962 200581 -107000 47797 -84026 9262 -12761
12268a15531M8889o9490E1714b09992j5514A75371g158C60671a8894A08266J26793
$$ -115531 -66642 -136132 51714 -209992 -225506 175371 -7158 360671 -18894 108266 235059
12257B35059l6916d9899o6574a7433D0486L69697o3784Q8018E9846J34096g7191
$$ 235059 198143 -49899 -116473 -17433 40486 410183 346399 434417 59846 193942 -77191
12245D7236d0393D11755A21846n6314K63410a1791D9139I725i9562K9255A35108
$$ 47236 -40393 411755 121846 65532 328942 -11791 49139 9725 -99562 -70307 135108
12233a84999B44429A8865b9943C23202r0391c5324A94381G6733e7608k5297j74775
$$ -184999 244429 18865 -29943 323202 232811 -35324 194381 76733 -57608 -82905 -257680
12222b57680F2149K92050A45844K28994f2722A82649L28315h6212g715k5801A28209
$$ -257680 62149 354199 145844 374838 -62722 182649 510964 -86212 -7715 -33516 128209
12210A56429J58523j45108n1310A1178K12729R265A07903Q8392B0657J28395r093
$$ 156429 314952 169844 118534 11178 223907 233172 107903 196295 20657 149052 139959
12199A39959E4712J6020L38721A67971n8268K50416A17779a4069j5084C02860
$$ 139959 54712 70732 409453 167971 109703 360119 117779 -14069 -29153 302860
12188A21858m1523J97445E9092a0712B22375A05107a8192A00814l8306a45948
$$ 121858 80335 277780 59092 -10712 222375 105107 -18192 100814 62508 -145948
12177B99775n1510e5945r3028c5789E0763K41803E9383N5812k0750j8662a74503
$$ 299775 248265 -55945 -148973 -35789 50763 292566 59383 115195 94445 75783 -174503
12165B77019D0423K66671b7370B59771L4508L9377B6293N53331A90556K09732
$$ 277019 40423 307094 -27370 259771 294279 333656 26293 579624 190556 400288
12155D00288A17026L31249a11621B38246h3761j7216o9828B85861K5169J10384
$$ 400288 117026 448275 -111621 238246 -83761 -100977 -170805 285861 311030 421414
12145D21414B379K7879J01355c4653A45102J28729L5720A53617F5473O7595M9530
$$ 421414 2379 30258 131613 -34653 145102 273831 309551 153617 65473 133068 182598
12134A82598b2930A08235f6209B02753d1531A18115a26829A42720d5503B99306
$$ 182598 -22930 108235 -66209 202753 -41531 118115 -126829 142720 -45503 299306
12123I0386M33779A87884L6534Q9452C0250O2908l744L540A3675b58913A46095
$$ 90386 524165 187884 224418 313870 30250 93158 89414 92954 13675 -258913 146095
12111B24936l707c88329C40770j23143R365E5754K7523J40778a53951j78791i3194
$$ 224936 221229 -388329 340770 217627 226992 55754 83277 224055 -153951 -332742 -93194
12099C13333C3694K13452j07314c4576G9591k5946j2073e006k52523I4358c0815
$$ 313333 33694 247146 139832 -34576 79591 53645 41572 -5006 -257529 94358 -30815
12087b74803M2094B56327D504e9938b715l6865A15989M99c5846A87914D2949a20150
$$ -274803 -232709 256327 4504 -59938 -2715 -39580 115989 116488 -35846 187914 42949 -120150
12074b3799A13572l7984a33398a4617E4542Q3209a05943j01290e2504k7602q5844
$$ -23799 113572 75588 -133398 -14617 54542 137751 -105943 -207233 -52504 -80106 -165950
12063a65950A29584a1517C45859A70948M01251P38309m80846k16187A15722J00626
$$ -165950 129584 -11517 345859 170948 572199 1310508 829662 613475 115722 216348
12053B16348a76176G8201K04476j38708C9107M0255b3826q1768A7031a5383A17233
$$ 216348 -176176 78201 282677 143969 39107 79362 -23826 -105594 17031 -15383 117233
12041A87901a44545g517j19107o4993D1K24286D1338J24061b19615B69918I9004
$$ 187901 -144545 -7517 -126624 -191617 41 224327 41338 165399 -219615 269918 99004
12029a79822F0464B8535M6956J56876d64184a11095C15087A13187b50676d5030
$$ -179822 60464 28535 75491 232367 -464184 -111095 315087 113187 -250676 -45030
12018c28097a55009E01930E5615e9928l5770j3885L4547c050j63474g4627l2160
$$ -328097 -155009 501930 55615 -59928 -95698 -109583 -75036 -3050 -166524 -74627 -106787
12007a06787I5523a8399A72556a5086B5158a38620M999l2382B03145N6150J59996
$$ -106787 95523 -18399 172556 -15086 25158 -138620 -133621 -166003 203145 259295 419291
11996D19291a41149K3902A92810A0823a21403l7258n9399A92499e568k6256j42121
$$ 419291 -141149 -117247 192810 10823 -121403 -158661 -218060 192499 -5568 -31824 -173945
11985a73945b2853E965a23830k08492h473B27715D9284j7187N86a5018l3566B50102
$$ -173945 -22853 5965 -123830 -332322 -8473 227715 49284 32097 32683 -15018 -48584 250102
11972a51607A17457a58805d845D3531i6029A4980R4564c7070H8793a43795B47688
$$ -151607 117457 -158805 -4845 43531 -96029 14980 109544 -37070 88793 -143795 247688
11960a4685j39900i076l97113D52249b15345L3743A77038b06548f7308A34576
$$ -14685 -154585 -9076 -406189 452249 -215345 -181602 177038 -206548 -67308 134576
11949a26837c9395H72O1672e02958N4576B00593R255b53768J01337N4726q241
$$ -126837 -39395 872 62544 -502958 -448382 200593 209848 -253768 -152431 -97705 -105946
11938a05946B04994a52839j62290A4139J76722B7624O4684a11478j5135k15276
$$ -105946 204994 -152839 -315129 14139 190861 27624 92308 -111478 -126613 -341889
11928c41889H8764c32145a1831A46g6373b5503j89124a01947b4073R743A53943
$$ -341889 88764 -332145 -11831 146 -76373 -25503 -214627 -101947 -24073 -14330 153943
11916E1038i6547D5449c5365C90348a53231b1674F3523k3498J7996K19709G9126
$$ 51038 -96547 45449 -35365 390348 -153231 -21674 63523 40025 58021 277730 79126
11904a27279c3824k0957E525Q6995L244L5750b74552I688a83913C49320c57411
$$ -127279 -33824 -54781 5525 92520 95764 131514 -274552 9688 -183913 349320 -357411
11892h3076i205C33J6826Q9201D5845R6492c36195D334J07075O1214e2667a1160
$$ -83076 -9205 333 17159 106360 45845 142337 -336195 4334 111409 172623 -52667 -11160
11879b23177B14721G1844R255B4360b0699A41346m3718a5372j96979O0907N211
$$ -223177 214721 71844 81099 24360 -20699 141346 97628 -15372 -212351 -151444 -146233
11868a46233K1061p5378q1455A08994a95819h7048j52642i9273o5706F4749j5292
$$ -146233 -125172 -200550 -282005 108994 -195819 -87048 -239690 -99273 -164979 64749 49457
11857D9457c573k62255K9048B1423J66738C1891d879j05122B65862G7177N6711
$$ 49457 -3573 -265828 -236780 21423 188161 31891 -4879 -110001 265862 77177 133888
11846A33888H491J61424B4934a89188b9507j32022P5920I4926d28096O6613J72343
$$ 133888 8491 169915 24934 -189188 -29507 -161529 -85609 94926 -428096 -361483 -189140
11835a89140i662k20721b9299r2767k4612d887r1695n9577a8757A99848H7354
$$ -189140 -9662 -230383 -29299 -122066 -146678 -4887 -96582 -156159 -18757 199848 87354
11823c31880a2842j0253o3321H7382b70550I079d1496l00505B2087a58521D448
$$ -331880 -12842 -23095 -86416 87382 -270550 9079 -41496 -342001 22087 -158521 4448
11811D078g2613j25478l7387c8953j14606A42246b11183I5202b40264j98776a08225
$$ 4078 -72613 -198091 -235478 -38953 -153559 142246 -211183 95202 -240264 -439040 -108225
11799D7360f5718l348n2847j04914A85515c7063b091n2797j49563E4391i496j31094
$$ 47360 -65718 -69066 -121913 -226827 185515 -37063 -2091 -54888 -204451 54391 -9496 -140590
11787a40590j44188a07951B1303J84479B8448b08712A68507D1255i4642G0753
$$ -140590 -284778 -107951 21303 205782 28448 -208712 168507 41255 -94642 70753
11776g4309B26676j583A11628J38782b99131B67154j24928c32513a41348n8162
$$ -74309 226676 225093 111628 250410 -299131 267154 142226 -332513 -141348 -199510
11766a99510Q3286k10309C46120E4428e9232J8037k4272H2639f8953j80526B33849
$$ -199510 -116224 -326533 346120 54428 -59232 -41195 -65467 82639 -68953 -249479 233849
11754A04971a35894A67498J49315j25690b20464b6781B78037a31700H0557o165
$$ 104971 -135894 167498 316813 191123 -220464 -26781 278037 -131700 80557 74392
11744G4392f0387k46669A67378b99938g5039l58386A83287J89211e3969b3600
$$ 74392 -60387 -307056 167378 -299938 -75039 -433425 183287 372498 -53969 -23600
11733D4618e56528A44018C6708a64882C51739b2048k4787A94178J37388j00234
$$ 44618 -556528 144018 36708 -164882 351739 -22048 -46835 194178 331566 231332
11723B31332b0450D66318a98469F514J79330q4189a8419D6729a93629P4361D8342
$$ 231332 -20450 466318 -198469 6514 185844 101655 -18419 46729 -193629 -119268 48342
11711c14271a5244B78675G2658J77775O1143n0801c4396j64282b5382A08374O4638
$$ -314271 -15244 278675 72658 250433 311576 260775 -34396 -198678 -25382 108374 173012
11700A73012b23158G6167a85177L6921K4026j64823J30328K0828F4788i0075B00952
$$ 173012 -223158 76167 -185177 -148256 -124230 -289053 -158725 -137897 64788 -90075 200952
11688C6807j4822c41128B18023A3909J33811m1367A4147c71579D36104A15129
$$ 36807 21985 -341128 218023 13909 147720 106353 14147 -371579 436104 115129
11677a35855L3671C1339O4539i46l7434a743E938K82578a1882H1864P1715O4707
$$ -135855 -102184 31339 95878 -946 -38380 -1743 5938 288516 -11882 81864 153579 218286
11665B18286J98072b2288j11342B23727J76134a92956C39042a06772j44153d264
$$ 218286 416358 -22288 -133630 223727 399861 -192956 339042 -106772 -250925 -4264
11654g142k9256l5136D887K77502d6532l44933A27695a1915o1058A34628C4943
$$ -7142 -36398 -71534 4887 282389 -46532 -391465 127695 -11915 -72973 134628 34943
11642A02928a51425j1866M3941C79270b2622A4820a39197A48830a02802A7826
$$ 102928 -151425 -163291 -119350 379270 -22622 14820 -139197 148830 -102802 17826
11631g3216B98474A1056b50559A12652c9969A01276c91559a36721G0464b59313
$$ -73216 298474 11056 -250559 112652 -39969 101276 -391559 -136721 70464 -259313
11620c89069D8216a53939P6209E0768O1924L9471b44721P3513j00614R0261j9252
$$ -389069 48216 -153939 -77730 50768 112692 152163 -244721 -171208 -271822 -181561 -200813
11609b00813A60979a67748A2944K44633F3155Q100K09956m6802r865b01031a00421
$$ -200813 160979 -167748 12944 257577 63155 71255 281211 234409 224544 -201031 -100421
11597G3847b30794j54770f3152l38586B8486A0147b65510h4106A41558j8276K00372
$$ 73847 -230794 -385564 -63152 -401738 28486 10147 -265510 -84106 141558 123282 323654
11586C23654a83300o5274A95492B8784R7016r56g1044k36522A71421H2391a36919
$$ 323654 -183300 -248574 195492 28784 125800 124844 -71044 -307566 171421 82391 -136919
11574F1699p515a99333B67457b4033B70703f841o4897e685m1017A60140I226b20038
$$ 61699 54184 -199333 267457 -24033 270703 -6841 -71738 -5685 -46702 160140 9226 -220038
11561I9273B1431c1390j04472O7622A02971a08418A23976k5095K00647j13644
$$ 99273 21431 -31390 -135862 -68240 102971 -108418 123976 98881 299528 185884
11551A85884a29691D69188j35895A60537i912A00133a89983A38187M9092E2995
$$ 185884 -129691 469188 333293 160537 -9912 100133 -189983 138187 187279 52995
11540c3037C28200c14958A83799K1799a98394M4075j8000B66920r2911a43434
$$ -33037 328200 -314958 183799 205598 -198394 -154319 -172319 266920 174009 -143434
11529g9913K6166m2717E6469C38L13139A8742a9897C52889L4875A29806a72512
$$ -79913 -53747 -96464 56469 338 313477 18742 -19897 352889 387764 129806 -172512
11517B43879J66863I7821K20663g7514c2403D80511e5314A16743b24544B25290
$$ 243879 410742 97821 318484 -77514 -32403 480511 -55314 116743 -224544 225290
11506a07676B92164a8939B88457j2884j2557F6101J1434M4480K00778j09232b84414
$$ -107676 292164 -18939 288457 275573 263016 66101 77535 122015 322793 213561 -284414
11494A84403J1754a13875C38160j17178A04559Q8358F2554L64477a56218C03776
$$ 184403 196157 -113875 338160 220982 104559 192917 62554 427031 -156218 303776
11483C1688L73266B881J44430a14128D1699i0947H0005a05290A09364P110b29432
$$ 31688 404954 2881 147311 -114128 41699 -90947 80005 -105290 109364 116474 -229432
11471G809a38232a5576B68751n7428p2021f8924A9699J61364p197J97066H5680
$$ 7809 -138232 -15576 268751 211323 139302 -68924 19699 181063 173866 370932 85680
11459A76213Q1625J08715H0534K07798b76096C24969j11732C213a24235D23138
$$ 176213 257838 366553 80534 288332 -276096 324969 213237 3213 -124235 423138
11448a70432A35599h2449B48218q9201j0122h3267r4846C43785j60069b4939A04241
$$ -170432 135599 -82449 248218 159017 148895 -83267 -178113 343785 183716 -24939 104241
11436A79921N8224K7420H910J56881J05201e6040A55683B8642J28621K39898E1387
$$ 179921 238145 265565 8910 165791 270992 -56040 155683 28642 157263 397161 51387
11424C98020a1522k38352M1195A68721M3358J1211a6915k50937C23645a10403
$$ 398020 -11522 -249874 -208679 168721 212079 223290 -16915 -267852 323645 -110403
11413a35791D2862K21453a50412m9328H145i508H0499o48a23921A08236I265a35554
$$ -135791 42862 264315 -150412 -199740 8145 -9508 80499 79851 -123921 108236 9265 -135554
11400b2325A91356r5400j4406l6311M5911a70820L6237N9925r6460D5527a34648
$$ -22325 191356 95956 81550 45239 91150 -170820 -134583 -74658 -171118 45527 -134648
11388A13083K57759G6353M3004a01196B70669C2952L61228H0501Q0604E2451J87996
$$ 113083 370842 76353 119357 -101196 270669 32952 394180 80501 161105 52451 240447
11377B40447a11609K6175D3501i1208B33037J3331d7304k09817A49111C5255J07022
$$ 240447 -111609 -85434 43501 -91208 233037 246368 -47304 -257121 149111 35255 142277
11366A42277g4581B8321b69145d9093n0736B92528K0349n8132a03948d5702o9834
$$ 142277 -74581 28321 -269145 -49093 -99829 292528 312877 254745 -103948 -45702 -115536
11355a15536A22423B8003H299f966j6750A72218D595a35667a7458C1758i3787
$$ -115536 122423 28003 8299 -6966 -23716 172218 4595 -135667 -17458 31758 -93787
11343a77720e5435o3077A55445e4445B13465g0446G8853a1782A45234b26775b109
$$ -177720 -55435 -118512 155445 -54445 213465 -70446 78853 -11782 145234 -226775 -2109
11331A65569F6430c08599a1239E3760J26065m325b34532A36229D1562f7957A3103
$$ 165569 66430 -308599 -11239 53760 179825 175500 -234532 136229 41562 -67957 13103
11319D4688J23090a54511A15974B1084b10770k1247d8636n1515K9687D0466O843
$$ 44688 167778 -154511 115974 21084 -210770 -232017 -48636 -100151 -70464 40466 47309
11308D7309c6308q3362e1707D6042J23338o5063a43739C7923J2901b59057A26023
$$ 47309 -36308 -119670 -51707 46042 169380 104317 -143739 37923 50824 -259057 126023
11296I583J92035a80199A8765a66597P0325b1623I5893C8292Q2714d0070A41069
$$ 9583 201618 -180199 18765 -166597 -96272 -21623 95893 38292 121006 -40070 141069
11284C76086q3145c40789J34877a5616B52133d5109p1156J8834K0827A15189b98118
$$ 376086 292941 -340789 -205912 -15616 252133 -45109 -116265 -97431 -76604 115189 -298118
11272g5036F7660N6784a33264A05686a89976B14909J0465a01271F7326a14288
$$ -75036 67660 124444 -133264 105686 -189976 214909 225374 -101271 67326 -114288
11261B23594e9895I0679b73535a4159j40082A02071J0090C4720a45716D056J34513
$$ 223594 -59895 90679 -273535 -14159 -154241 102071 112161 34720 -145716 4056 138569
11250A38569B9262J95259A8242b48186a08503j6856A32019f970j11949l33752
$$ 138569 29262 224521 18242 -248186 -108503 -125359 132019 -6970 -118919 -452671
11240d52671J65982N629A32436c07863B28058b862F396a59216B07768g900B20646
$$ -452671 -286689 -281060 132436 -307863 228058 -2862 6396 -159216 207768 -7900 220646
11228E0709c66196E3365b06368i1471j36806j04508H8407h5278d1607l29380H5727
$$ 50709 -366196 53365 -206368 -91471 -228277 -332785 88407 -85278 -41607 -370987 85727
11216b49446j60988f8265I1782H568R9985K26653j01927F4263f1629D7325b69664
$$ -249446 -410434 -68265 91782 8568 108553 335206 233279 64263 -61629 47325 -269664
11204b11478Q0285A10898a66083c4055p5961j14924H9132h7466M2699A06369a18284
$$ -211478 -131193 110898 -166083 -34055 -110016 -224940 89132 -87466 -44767 106369 -118284
11192f7154B28382j7837q2532n032j2018b15511I7229l1583k5329a29093B97869
$$ -67154 228382 210545 128013 122981 110963 -215511 97229 65646 40317 -129093 297869
11180C02803E0851J34098a94918A5113h4537D3890N8882P7007d502l6648m38937
$$ 302803 50851 184949 -194918 15113 -84537 43890 102772 179779 -4502 -41150 -480087
11169d80087f550j43386K2417j7110F7094b53045a3168l22158a23909B42187j14851
$$ -480087 -6550 -149936 -127519 -144629 67094 -253045 -13168 -335326 -123909 242187 127336
11158A27336j6677d1977j51575O6830o2461Q7508j09372j56915A7776a4063A38004
$$ 127336 110659 -41977 -193552 -126722 -189183 -101675 -211047 -367962 17776 -14063 138004
11146b03889g3092k56072i9983B29052a68145l5734n9805A6355b97214B25695
$$ -203889 -73092 -329164 -99983 229052 -168145 -203879 -263684 16355 -297214 225695
11135i6335O469k3078N2397A54203a08898K6329F4858K28373I0663a5055B43396
$$ -96335 -89866 -112944 -60547 154203 -108898 -82569 64858 293231 90663 -15055 243396
11123b05268A77202c10965d8420E3087J50973a08343A64497a7024a240j1337m1793
$$ -205268 177202 -310965 -48420 53087 204060 -108343 164497 -17024 -1240 -12577 -54370
11112e4370J1650o4789O646d1059j71540A3222M7118n10J95873A06322l9919J54305
$$ -54370 -42720 -107509 -100863 -41059 -212599 13222 60340 59830 255703 106322 66403 220708
11100B20708o203D2906b52083G0444K95253a73717K9631B2449a20535A67025a14187
$$ 220708 214505 42906 -252083 70444 365697 -173717 -144086 22449 -120535 167025 -114187
11088B98838H8763J01006R569D3163b13454D23647H9108L252B7157P6255L47869
$$ 298838 88763 189769 199338 43163 -213454 423647 89108 92360 27157 103412 451281
11077D51281A3034R1949J8644A5265R2565P7480P6226n9159C1682K8305K57333
$$ 451281 13034 104983 123627 15265 107830 185310 261536 202377 31682 59987 317320
11066C17320F0409k9640J65945a178D40283F1737L53283j2725b320A1973K10417
$$ 317320 60409 30769 196714 -1178 440283 61737 415020 402295 -2320 11973 222390
11055B22390o6446K17523j49021M12710p9680j52706L22777C30113P4016P9804
$$ 222390 155944 373467 224446 637156 557476 404770 727547 330113 404129 483933
11045D83933k407M8056j82127L13236l243j6364j98203K24212j22094M41126k12047
$$ 483933 481526 529582 347455 660691 657448 641084 442881 667093 544999 986125 774078
11034G74078N4143j89095K7338K26180l4261k83297K44579N9096l84006M85810
$$ 774078 828221 639126 666464 892644 858383 575086 819665 878761 494755 980565
11024I80565j28377j24113J59668j71742N0363J56835j51719R0929k50007M39466
$$ 980565 852188 728075 887743 716001 766364 923199 771480 862409 612402 1051868
11014A051868l61814K21503p1036J61058D83215M63054r8996D23002K02948K39182
$$ 1051868 690054 911557 840521 1001579 483215 946269 847273 423002 625950 865132
11004H65132k88513K23099k4504C71535M28430o680n4386Q9193p6964j18305J39890
$$ 865132 576619 799718 775214 371535 799965 793285 738899 828092 751128 632823 772713
10993G72713j76581j57300J25256j75424L37698j57560K26221J50963j46338C87056
$$ 772713 596132 438832 564088 388664 726362 568802 795023 945986 799648 387056
10982A064999m78413M7987J53385O701j37813j84532M05087M5952q0496J43849
$$ 1064999 586586 634573 787958 794659 656846 472314 877401 923353 842857 986706
10972I86706N6292J30110l18402k66307L79809M7846R3691J09018L95455M8450
$$ 986706 1042998 1173108 854706 588399 968208 1016054 1109745 1218763 1614218 1662668
10962A662668K82400l62734N75505j16506O64317j13264L91239M19470m82703
$$ 1662668 1945068 1582334 2157839 2041333 2705650 2592386 2983625 3403095 2920392
10953B920392J69683l38462n4275O9870l32338m31492r1475k31550L4337r4475
$$ 2920392 3090075 2751613 2697338 2767208 2434870 2003378 1911903 1680353 1714690 1620215
10943A620215L1714j7598J89770K60313p20967J4591j56654k86564L74471m97774
$$ 1620215 1651929 1634331 1824101 2084414 1363447 1378038 1221384 934820 1309291 811517
10933H11517j05945k3822M2677j67849B06770M65078k51360k0478O0518A75613
$$ 811517 705572 681750 724427 556578 206770 671848 420488 400010 460528 175613
10922A15193J46273o1424a37042D9846K52984i6726a1942m4923A43791k050C3432
$$ 115193 261466 200042 -137042 49846 302830 -96726 -11942 -56865 143791 141741 33432
10910A33151K38387I7571O8516K54400F541K63508F89M899c8777l3472D0122a69657
$$ 133151 371538 97571 166087 420487 6541 270049 689 5588 -38777 -72249 40122 -169657
10897a8790C96206j95041f3391A42250k8234e8738B5485b29995R4497j6972P0078
$$ -18790 396206 201165 -63391 142250 114016 -58738 25485 -229995 -135498 -152470 -82392
10886h2392C5419d0084j46990O7112G9928P7625k9113g0949H8844B0157J05241
$$ -82392 35419 -40084 -187074 -119962 79928 157553 128440 -70949 88844 20157 125398
10875A25398a00589q3874b4674K128B06512a36094b4252F0411a16330A38436a99312
$$ 125398 -100589 -184463 -24674 -22546 206512 -136094 -24252 60411 -116330 138436 -199312
10863D6619b04026D1198c4310A20939J13366J5451A7221D97a26469B26127E6706
$$ 46619 -204026 41198 -34310 120939 234305 249756 17221 497 -126469 226127 56706
10851E7641a42177b6743B572b19982m4169J24334j28530A08027M1534J05961B5236
$$ 57641 -142177 -26743 2572 -219982 -264151 -139817 -268347 108027 149561 255522 25236
10839f8835A90857b84459L5259H9547a8843k2197B87961a80291B75384a38762
$$ -68835 190857 -284459 -249200 89547 -18843 -41040 287961 -180291 275384 -138762
10828A21435J37697c5856j6112k15995j1556a36534I5596b22955q2745a24391
$$ 121435 259132 -35856 -51968 -267963 -279519 -136534 95596 -222955 -305700 -124391
10817I9180l4131a83530K1864A23624a51121K6500c0526B4845a91140A55550J4776
$$ 99180 65049 -183530 -161666 123624 -151121 -124621 -30526 24845 -191140 155550 170326
10806A70326A175f322j65798A36235c9328A75995E0936L7607d56574J09049J62572
$$ 170326 1175 -6322 -172120 136235 -39328 175995 50936 88543 -456574 -347525 -184953
10795a84953D5479b27653B20275c2629J628n6859A69285b94702K9131E7368a00226
$$ -184953 45479 -227653 220275 -32629 -31001 -87860 169285 -294702 -265571 57368 -100226
10783h7044A16857J45783a33254J159n4212h4199A97175a52630C3667d2213o0623
$$ -87044 116857 262640 -133254 -132095 -186307 -84199 197175 -152630 33667 -42213 -102836
10772a02836A50545j9753a58351M7477j13635C1683J01128b60732P0190B0274
$$ -102836 150545 130792 -158351 -110874 -224509 31683 132811 -260732 -190542 20274
10761a21133A3277c06263d4778D6350q190a79612A77001a46094o6828A25871b51006
$$ -121133 13277 -306263 -44778 46350 38160 -179612 177001 -146094 -212922 125871 -251006
10749C10913a41413C35603E2779h0759b0657Q68B56068q7648l5784b94710A52011
$$ 310913 -141413 335603 52779 -80759 -20657 -19789 256068 168420 132636 -294710 152011
10737a72765h0396j51184A75113f9211E2733a96301B610L6249b9673A8209R9250
$$ -172765 -80396 -231580 175113 -69211 52733 -196301 2610 38859 -29673 18209 117459
10726A17459j8755j4863M3147b85809A21267i3492o4324A98144a14958D1883R8000
$$ 117459 98704 83841 126988 -285809 121267 -93492 -157816 198144 -114958 41883 139883
10715A39883b5310j07757G767a7800A5539J24743N6551h0060K311C28818A28024
$$ 139883 -25310 -133067 7767 -17800 15539 140282 196833 -80060 -77749 328818 128024
10703C18423g6048q626A54902e2790j36358A20893B3692a01076q3773l86997g8586
$$ 318423 -76048 -84674 154902 -52790 -189148 120893 23692 -101076 -184849 -571846 -78586
10691b45716A09745c28032a59626B75876a78860P9585k85010b9500l4842b6095
$$ -245716 109745 -328032 -159626 275876 -178860 -99275 -384285 -29500 -64342 -26095
10680E8512k8057J39154B6584c4946A90481a9592H6719f7190M944G4425K2257
$$ 58512 30455 169609 26584 -34946 190481 -19592 86719 -67190 -62246 74425 96682
10669I6682f4962a9556j6585o7971D0293d13847a27106b9513m31410h9994j91508
$$ 96682 -64962 -19556 -36141 -104112 40293 -413847 -127106 -29513 -460923 -89994 -281502
10658b81502M1950N1172R0881A46088g3234A3820N7048b14146j45489B4686b95755
$$ -281502 -239552 -188380 -97499 146088 -73234 13820 70868 -214146 -359635 24686 -295755
10646h0487j05588B4446i2313A02005h9124H8178l7529d1732k60476D5662L760
$$ -80487 -186075 24446 -92313 102005 -89124 88178 50649 -41732 -302208 45662 49422
10635D9422K97559E6121b88752A05379a57637d7750l01448J73338n1114e3911
$$ 49422 346981 56121 -288752 105379 -157637 -47750 -349198 -175860 -226974 -53911
10624B1650b7215k34018J23728j91253F6104K0964b16833J06849l43713F8811
$$ 21650 -27215 -261233 -137505 -328758 66104 87068 -216833 -109984 -453697 68811
10613B0585a48395K7674l4224J5665A30634b65859f7851k97987J9112R4894B37705
$$ 20585 -148395 -120721 -154945 -139280 130634 -265859 -67851 -365838 -346726 -251832 237705
10601A80551c7514j34157j44336O6057j25507A29986l4882b56822A94877a39318
$$ 180551 -37514 -171671 -316007 -249950 -375457 129986 95104 -256822 194877 -139318
10590A32169m8021b1169m3706C54281a9700j9670p8168C48138J27518a33250j13625
$$ 132169 84148 -21169 -64875 354281 -19700 -39370 -117538 348138 475656 -133250 -246875
10579b46875D9444b75331A90247a16185A16396d8072A01655P2176Q3077G9899
$$ -246875 49444 -275331 190247 -116185 116396 -48072 101655 173831 256908 79899
10568b8862r3795A321a13351a4379j04558R066n5949O0377N0367k17082I2904
$$ -28862 -122657 1321 -113351 -14379 -118937 -109871 -165820 -105443 -55076 -272158 92904
10556c44701A21406i5662L7111b4847k58876a06787A49538b01247d5208B05899
$$ -344701 121406 -95662 -58551 -24847 -283723 -106787 149538 -201247 -45208 205899
10545c00806a31855n38883b83927a40111B13477b73512D0525K31922a89153A17551
$$ -300806 -131855 -670738 -283927 -140111 213477 -273512 40525 272447 -189153 117551
10534a5943B85060b676k88040g3100B98525C0337c67679j03051d4006k30055A96038
$$ -15943 285060 -2676 -290716 -73100 298525 30337 -367679 -470730 -44006 -274061 196038
10522b5263j60667F5165a48655F131R5778d23490A29788a44755D4625c53730b7238
$$ -25263 -185930 65165 -148655 6131 101909 -423490 129788 -144755 44625 -353730 -27238
10510b0951k70037A13950a76184f7967B96523C1339G674g7657A1739a40844j21771
$$ -20951 -290988 113950 -176184 -67967 296523 31339 7674 -77657 11739 -140844 -262615
10499b62615g4840m3785j45174G7974a14135C5497L4753K4182R2138F0158O1287
$$ -262615 -74840 -118625 -263799 77974 -114135 35497 70250 94432 186570 60158 121445
10488A21445J14501H364K05322r2205k5583a22026H9515m611B4458a46981j01362
$$ 121445 235946 8364 213686 121481 95898 -122026 89515 84904 24458 -146981 -248343
10477b48343g4202p0908B3739a6901o352r1755a8174j1725A05638J37330e2145
$$ -248343 -74202 -145110 23739 -16901 -23253 -115008 -18174 -29899 105638 242968 -52145
10465B1135L58874A12837A3805K44509J42168B9449J96003m9762B5406g8039A84261
$$ 21135 380009 112837 13805 258314 400482 29449 225452 175690 25406 -78039 184261
10453c59389b2855j3971C32698j36875b57659d4360k69187D0981P6825D4318a16832
$$ -359389 -22855 -36826 332698 195823 -257659 -44360 -313547 40981 117806 44318 -116832
10441a31737B1093g5105j73191C93341a99554b7586F6218i9106F1230b2840j5410
$$ -131737 21093 -75105 -248296 393341 -199554 -27586 66218 -99106 61230 -22840 -38250
10430c8250A22410J48771f5688H2011M093a46677j06600e4361b4688j21292E0095
$$ -38250 122410 271181 -65688 82011 86104 -146677 -253277 -54361 -24688 -145980 50095
10418b30118l3216g2349j41897A17838a45735c519l82578B0958h6300C66192a8358
$$ -230118 -263334 -72349 -214246 117838 -145735 -3519 -386097 20958 -86300 366192 -18358
10406B6948q79K06996a86261o4506A41335l0369b12665F7127b18126B09317K12714
$$ 26948 26069 233065 -186261 -250767 141335 110966 -212665 67127 -218126 209317 422031
10395D22031e9633n9181A92380A0585e484j37726C0618K9980a47547D2779N1797
$$ 422031 -59633 -118814 192380 10585 -5484 -143210 30618 60598 -147547 42779 94576
10384I4576m3876O2396a5945k57153g005m30146A73697i9914C33066a54141B4601
$$ 94576 50700 113096 -15945 -273098 -7005 -437151 173697 -99914 333066 -154141 24601
10372B05147J78949j25617A24738b9858q6063C48068j2177a29236A86954J93155
$$ 205147 384096 258479 124738 -29858 -115921 348068 335891 -129236 186954 380109
10362C80109G6145N9670J09859H9766K45866j02715q197Q2964R0689A01386K01072
$$ 380109 76145 135815 245674 89766 335632 232917 224720 307684 398373 101386 302458
10351C02458K32820j50977j01647K1025p2465L82006B60301n2656L2539J17312
$$ 302458 535278 384301 282654 303679 231214 613220 260301 207645 240184 357496
10341C57496A19435L5212K04288A76961K8406K19991M98667C97208M1697j62216
$$ 357496 119435 154647 358935 176961 205367 425358 924025 397208 438905 276689
10331B76689E6690K25279J16855j46898N1687M196K30320A19815J05672j6940
$$ 276689 56690 281969 398824 251926 303613 307809 538129 119815 225487 208547
10321B08547c3546H7506g8629C01738J03708f775D32578A42492E1487a09433C939
$$ 208547 -33546 87506 -78629 301738 405446 -6775 432578 142492 51487 -109433 3939
10309A47918i86B82773M00057C36396F7379L40357h2731A68496F0747K69038q5473
$$ 147918 -986 282773 682830 336396 67379 407736 -82731 168496 60747 329785 244312
10298B44312a91712N9803f1552m8108F3623k0330a81418b689F5944i6470A85233
$$ 244312 -191712 -131909 -61552 -109660 63623 43293 -181418 -2689 65944 -96470 185233
10286b94199B77018j35927c56922A16584C346L07420p0974A05316b56240B5682
$$ -294199 277018 141091 -356922 116584 3346 310766 239792 105316 -256240 25682
10275A08544a40265k05632A4848a31097N4891D92071F263a47600O0469j09940
$$ 108544 -140265 -345897 14848 -131097 -76206 492071 6263 -147600 -87131 -197071
10265a97071N5332A1786K15904g0879d022j59813O0271B05230d44963a19843A31529
$$ -197071 -141739 11786 227690 -70879 -4022 -163835 -103564 205230 -444963 -119843 131529
10253E315J11195e801j30137e0569I5860a44464m73F3385K2063a43012D19763
$$ 5315 116510 -5801 -135938 -50569 95860 -144464 -144937 63385 85448 -143012 419763
10241A32893K61044I8857M30851B21452q5078F4121g5327A2688c6360B55449a26480
$$ 132893 393937 98857 529708 221452 136374 64121 -75327 12688 -36360 255449 -126480
10229B14661J1288l9676c9351k1833A73875a04416j98918A66027b46426h9097
$$ 214661 225949 186273 -39351 -61184 173875 -104416 -303334 166027 -246426 -89097
10218b53200F7748f7515A25815b70994A5349a07420H289b69015A74075l8482P1358
$$ -253200 67748 -67515 125815 -270994 15349 -107420 8289 -269015 174075 135593 206951
10207B06951d9371K0010h008q8270n1223A7815c0581k07073D9652c45523a51403
$$ 206951 -49371 -29361 -8008 -96278 -147501 17815 -30581 -237654 49652 -345523 -151403
10195A97659H862c3538A01605K34727b49461K6763B9560e9479A67707a36577N329
$$ 197659 8862 -33538 101605 336332 -249461 -222698 29560 -59479 167707 -136577 -131248
10184a31248d8700o9136l9194c5239k3336k30170j24581c4437B02846a75971O2066
$$ -131248 -48700 -117836 -157030 -35239 -58575 -288745 -413326 -34437 202846 -175971 -113905
10173a13905A29406J09955p8314a31109k6057P1866F9347c08281d5807A25867
$$ -113905 129406 239361 161047 -131109 -157166 -85300 69347 -308281 -45807 125867
10162I9419c085j61944f2070m6894c6984C8723a94298Q2184j64930h0016A529
$$ 99419 -3085 -165029 -62070 -108964 -36984 38723 -194298 -112114 -277044 -80016 1529
10150c59070h1955B32290h5544a2893D1512a27479L9009j86037a23719G8466b25930
$$ -359070 -81955 232290 -85544 -12893 41512 -127479 -88470 -274507 -123719 78466 -225930
10138b01923g2161F594g8099n6980c788F3943e9982G7293d05797A48480b77402
$$ -201923 -72161 6594 -78099 -135079 -3788 63943 -59982 77293 -405797 148480 -277402
10126A23316L2481n3125a057I299a29031D2480a39889d9066E9048e4835l5133
$$ 123316 155797 102672 -1057 9299 -129031 42480 -139889 -49066 59048 -54835 -89968
10115h9968A54608a01045L7313k02747g6729m6027n4523j04325J04750d9773j48964
$$ -89968 154608 -101045 -63732 -266479 -76729 -122756 -177279 -281604 -176854 -49773 -198737
10104a98737h5447k8924M1589j22773j542Q2553F8226a1759p36F5230b8970C1229
$$ -198737 -85447 -114371 -72782 -195555 -197097 -114544 68226 -11759 -12495 65230 -28970 31229
10091b8695G6138M7104a85339A39841n5767J8666J07693c8509j85910C2300a09560
$$ -28695 76138 123242 -185339 139841 84074 102740 210433 -38509 -224419 32300 -109560
10079a71435M1740e7792k07470i0763b0j07591a5972C065a11439H7643c4280k01007
$$ -171435 -129695 -57792 -265262 -90763 -20 -107611 -15972 3065 -111439 87643 -34280 -235287
10067b35287E914K4657R4368D5364d0578D2187K5050a03646A14953b85421f6990
$$ -235287 5914 30571 124939 45364 -40578 42187 67237 -103646 114953 -285421 -66990
10055A66224J9127b25939P1602A6555K9927d665j63157F0775M3906I697N8946
$$ 166224 185351 -225939 -154337 16555 46482 -4665 -167822 60775 104681 9697 68643
10044F8643Q0303F0394a97086J3081c9095H5268k1093j9556b32911j97405A53136
$$ 68643 148946 60394 -197086 -184005 -39095 85268 64175 44619 -232911 -430316 153136
10032a29003D6179c32309F9361c33537A99290a20438D58681D3598a96018A95333
$$ -129003 46179 -332309 69361 -333537 199290 -120438 458681 43598 -196018 195333
10021c16721A98559h5641j38553g6113a5142l80240B87944F7309b37260C0417
$$ -316721 198559 -85641 -224194 -76113 -15142 -395382 287944 67309 -237260 30417
10010c03818a19701A28742m5744k3057L6633a62117H2483b22210a08207J9515
$$ -303818 -119701 128742 82998 59941 96574 -162117 82483 -222210 -108207 -88692
10000h8692H1385a71437C1608c13608J04377m6326M158j18851J31128J18903A75493
$$ -88692 81385 -171437 31608 -313608 -209231 -255557 -251399 -370250 -239122 -120219 175493
9988a59829e9255A5168g0577j00962A85188e160A27602b27786a1565j21338m9720
$$ -159829 -59255 15168 -70577 -171539 185188 -5160 127602 -227786 -11565 -132903 -182623
9977a82623P678G3389a69492k14234e4492j63850h7447q8168j44890B58682A5043
$$ -182623 -174945 73389 -169492 -383726 -54492 -218342 -87447 -175615 -320505 258682 15043
9965b27104M1035D0011a77789Q344Q131k5020A13397b72397A69991b0748k811
$$ -227104 -186069 40011 -177789 -169445 -161314 -186334 113397 -272397 169991 -20748 -23559
9954b3559j36827j63822g6901P396a1535j71037c9770q0212M9786B57959A1117
$$ -23559 -160386 -324208 -76901 -69505 -11535 -182572 -39770 -119982 -70196 257959 11117
9942a8913j26947b9616G7513d5970j19355M9918q2505n9727B49645b4737n3895
$$ -18913 -145860 -29616 77513 -45970 -165325 -115407 -197912 -257639 249645 -24737 -78632
9931g8632j74203B5208a6333A12517P7173a96970o9368A35973D5226a21495B558
$$ -78632 -252835 25208 -16333 112517 189690 -196970 -266338 135973 45226 -121495 2558
9919a42452j48816G3213i8867J8753k1990A16198a91309H6375h4634m42807A62631
$$ -142452 -291268 73213 -98867 -80114 -102104 116198 -191309 86375 -84634 -527441 162631
9907a07129j48284k4337Q9313A07055N0465a33488A577a67277B1347J24256a37249
$$ -107129 -255413 -279750 -190437 107055 157520 -133488 1577 -167277 21347 145603 -137249
9895E8048a1133p163j52002c7789I5518k225d12777b2147E4561b19302C88226
$$ 58048 -11133 -18296 -170298 -37789 95518 93293 -412777 -22147 54561 -219302 388226
9883b64098a20394o350m1720N5178D9864b91253j2869r3686H2026a25007R402
$$ -264098 -120394 -126744 -168464 -113286 49864 -291253 -304122 -397808 82026 -125007 -115605
9872a15605A18301n387E599c63635G5720j6557g2621i552F5742d43606a23456
$$ -115605 118301 112914 5599 -363635 75720 59163 -72621 -9552 65742 -443606 -123456
9860c6560A18375n3610K06847D383a82875n9721P0576r3152d8200m6362k15367
$$ -36560 118375 64765 271612 4383 -182875 -242596 -172020 -265172 -48200 -94562 -309929
9849c09929l849A19422a62664O6753E02737a69115P3530l0412A41959b41050Q1030
$$ -309929 -313778 119422 -162664 -95911 502737 -169115 -95585 -125997 141959 -241050 -160020
9838a60020I7970d8591j27364g849H1950J26239a86297c8747A64362b49126B12219
$$ -160020 97970 -48591 -175955 -7849 81950 208189 -186297 -38747 164362 -249126 212219
9826C17612c32528J01533A86613p3953b50947J11804j58377c5446B850a32599
$$ 317612 -332528 -230995 186613 112660 -250947 -139143 -297520 -35446 2850 -132599
9815c22591R5007A84377g5306G5727g7231A29960A8401a87743a1317k00268A17687
$$ -322591 -227584 184377 -75306 75727 -77231 129960 18401 -187743 -11317 -211585 117687
9803A211b09105D66935B12584m8597c00960e2493d121n6272j88842b1867m20846
$$ 1211 -209105 466935 212584 163987 -300960 -52493 -4121 -60393 -249235 -21867 -442713
9792d42713d8883k35636j43564B28208h1732k29650J13038a503j21929j64375
$$ -442713 -48883 -284519 -428083 228208 -81732 -311382 -198344 -1503 -123432 -287807
9782b87807A71917m4971D8810q410J33863c53164a56225j22287m42B24851c72203
$$ -287807 171917 126946 48810 40400 174263 -353164 -156225 -278512 -278954 224851 -372203
9770a85686j56611J54997L9199l2401H9496b25282j5364A12515b2788E1180J10100
$$ -185686 -342297 -187300 -148101 -180502 89496 -225282 -240646 112515 -22788 51180 161280
9759A61280d1297n4237L3353j42118F6132a86203C13228a47582L4913A21110a07262
$$ 161280 -41297 -95534 -62181 -204299 66132 -186203 313228 -147582 -112669 121110 -107262
9747B78272a51421B62857a58924B0936c99418e8959r2353F7024f8960k50494O9860
$$ 278272 -151421 262857 -158924 20936 -399418 -58959 -151312 67024 -68960 -319454 -249594
9736b49594a03876A41941k6398e2522E0433b42004B8483a56746D9203a01511l8848
$$ -249594 -103876 141941 115543 -52522 50433 -242004 28483 -156746 49203 -101511 -140359
9725a40359e5262A14466a29087j51829a9992m48919A20576F676J38959b6821k87739
$$ -140359 -55262 114466 -129087 -280916 -19992 -468911 120576 6676 145635 -26821 -314560
9714c14560C72165a18333K720N5136j62861d11A23680c17404P5673E7133d06606
$$ -314560 372165 -118333 -115613 -60477 -223338 -411 123680 -317404 -241731 57133 -406606
9702a9289F8297b30301a8122r8904B25898b35624g2059j07684A23872a53880E7821
$$ -19289 68297 -230301 -18122 -117026 225898 -235624 -72059 -179743 123872 -153880 57821
9690b41470A72013m4903a71189A94414a53809A82421O520b53708A0041c62889
$$ -241470 172013 127110 -171189 194414 -153809 182421 188941 -253708 10041 -362889
9679a48468A68246G6142a97493F1447c28706B2818E811f2695k49354C8674K29765
$$ -148468 168246 76142 -197493 61447 -328706 22818 5811 -62695 -312049 38674 268439
9668B68439b64733f5984A20828h6382J0313K5812A72805e2144m8208B82855A32958
$$ 268439 -264733 -65984 120828 -86382 -76069 -50257 172805 -52144 -100352 282855 132958
9656i3600j84885Q8858l9137P3931A391a14881G7781b15819F164O9901i6240E6806
$$ -93600 -278485 -189627 -228764 -154833 1391 -114881 77781 -215819 6164 76065 -96240 56806
9643B4388L2990b21881B8932a35738l3581a5726A88372n5414K9188a80856O9191
$$ 24388 57378 -221881 28932 -135738 -169319 -15726 188372 132958 162146 -180856 -111665
9632a11665I2804d4488j85096d4296n0157n6828r8534G7376e0361n5704B4299
$$ -111665 92804 -44488 -229584 -44296 -94453 -151281 -249815 77376 -50361 -106065 24299
9620A30109C045K43276a54552A54206h0734k01918b9821A35350i3726k48808g8127
$$ 130109 3045 246321 -154552 154206 -80734 -282652 -29821 135350 -93726 -342534 -78127
9608a35685d7830B73903A3498N896P8579a4405A48344E670a91189P0360A30345
$$ -135685 -47830 273903 13498 19394 97973 -14405 148344 5670 -191189 -120829 130345
9596b05389C3141J02298h1155c4253l66655Q534A10424c783k10539c7881B65933
$$ -205389 33141 135439 -81155 -34253 -400908 -392374 110424 -3783 -214322 -37881 265933
9584f2095a2800l13930a63235A2567a70331F1230a60428c1416j71130F916O1827
$$ -62095 -12800 -326730 -163235 12567 -170331 61230 -160428 -31416 -202546 6916 68743
9573F8743a35217l6499O3978C3840J07868d91124e1186A14334a52225j1980j50270
$$ 68743 -135217 -171716 -107738 33840 141708 -491124 -51186 114334 -152225 -164205 -314475
9562c14475h615k0562k16213g0799l5684K9284j96291A58672d1363A11778d7387
$$ -314475 -8615 -29177 -245390 -70799 -106483 -77199 -273490 158672 -41363 111778 -47387
9550e6926n3334B57878A21003a39818o4208f3766B1825L0537a48964K0058N0899
$$ -56926 -110260 257878 121003 -139818 -204026 -63766 21825 52362 -148964 -128906 -78007
9539g8007j57818B08998a47278k19233A81827q9316a63068F099b55388B0113O5584
$$ -78007 -235825 208998 -147278 -366511 181827 92511 -163068 6099 -255388 20113 85697
9528H5697a60736L2268l11877c4757D9592h3801j85716B0567b2309i313k81082
$$ 85697 -160736 -128468 -440345 -34757 49592 -83801 -269517 20567 -22309 -9313 -290395
9517b90395L0187A6945a61437j0472j09449G4840c49894d4884A92891a14469A64922
$$ -290395 -260208 16945 -161437 -171909 -281358 74840 -349894 -44884 192891 -114469 164922
9505D5823a37739k97723g2194r4970D0802b30859F7664a27636k4238k14373F7602
$$ 45823 -137739 -435462 -72194 -167164 40802 -230859 67664 -127636 -151874 -366247 67602
9493d6575A76550a17841q1771a8539k6441A99566d23206c8413J5594E7329b7298
$$ -46575 176550 -117841 -199612 -18539 -44980 199566 -423206 -38413 -22819 57329 -27298
9481C2672a43040c6250B81479h2350b6965j31753E0665d1424A86859b16284G7679
$$ 32672 -143040 -36250 281479 -82350 -26965 -158718 50665 -41424 186859 -216284 77679
9469a25268D8264c4836l46485C03369a84861A68483G0769a14787j55989a21486
$$ -125268 48264 -34836 -381321 303369 -184861 168483 70769 -114787 -270776 -121486
9458c26164m6472f3814N369A21379b19480c7745A41427i4168p1052M397Q772k18508
$$ -326164 -372636 -63814 -58445 121379 -219480 -37745 141427 -94168 -165220 -160823 -152051 -370559
9446c70559Q0977a21115A41441i2289b7328C01356a02743A9622a12910j22379
$$ -370559 -289582 -121115 141441 -92289 -27328 301356 -102743 19622 -112910 -235289
9436b35289j52886g5799E5851J6090a86560R1542j09522Q3266d2526C21558E2079
$$ -235289 -388175 -75799 55851 71941 -186560 -95018 -204540 -121274 -42526 321558 52079
9424a58269e8764n6017A54998b48817P1500O1256K3465F2616b27661c2318j55496
$$ -158269 -58764 -114781 154998 -248817 -177317 -116061 -92596 62616 -227661 -32318 -187814
9413a87814K9723j38990J12461B08228a90996B34765i5889p5915E2748R7793b42612
$$ -187814 -158091 -297081 -184620 208228 -190996 234765 -95889 -171804 52748 150541 -242612
9401b53156A72841b06881m9034d9691l7694M1920G897b49604F7722M4492a22650
$$ -253156 172841 -206881 -255915 -49691 -87385 -45465 7897 -249604 67722 112214 -122650
9389c14381A67695F7387c7968q4611A21830D0424g0750m6175A2297b858A5099
$$ -314381 167695 67387 -37968 -122579 121830 40424 -70750 -116925 12297 -2858 15099
9377a21872d6028m1195m2804H5463a86960F0788b82439i9627l2735A31200b22686
$$ -121872 -46028 -87223 -130027 85463 -186960 60788 -282439 -99627 -132362 131200 -222686
9365b33674L4664P6957B13909J0612N1991a58857D574e48766K18365J49000e1752
$$ -233674 -199010 -122053 213909 224521 276512 -158857 4574 -548766 -330401 -181401 -51752
9353C00137b34208A4003J06646b4070A01041b74342h3240j96853r0969C6929a48846
$$ 300137 -234208 14003 120649 -24070 101041 -274342 -83240 -280093 -371062 36929 -148846
9341b65380I1172b20929h3152m6854n2625B08J41045a76256b9041j23071B3290
$$ -265380 91172 -220929 -83152 -130006 -182631 208 141253 -176256 -29041 -152112 23290
9329e7695A21665a62886a0201D3012J16064i2374E6629K8641m2079J12875b3158
$$ -57695 121665 -162886 -10201 43012 159076 -92374 56629 85270 43191 156066 -23158
9317B02773a9399B05900f6067a6657m1765j23969Q8120F5139J06685b41421l8142
$$ 202773 -19399 205900 -66067 -16657 -58422 -182391 -94271 65139 171824 -241421 -279563
9306b79563d846k3440m4248l24244i5933l5939Q308j56140A03754c34222R6478
$$ -279563 -4846 -28286 -72534 -396778 -95933 -131872 -123564 -279704 103754 -334222 -237744
9295b37744j62443a26970j87282J29579O9661k9277j91746M2116A19404i8778
$$ -237744 -400187 -126970 -314252 -184673 -115012 -144289 -336035 -293919 119404 -98778
9284b80676R7083h0518H7215J712a04556F9837b30587c8045o1902F9988b42282
$$ -280676 -183593 -80518 87215 88927 -104556 69837 -230587 -38045 -99947 69988 -242282
9272A51628c11047R8140M0956B68724a17968c130l06326K0026M4602A09882L189
$$ 151628 -311047 -212907 -171951 268724 -117968 -3130 -309456 -289430 -244828 109882 113071
9261A13071a33860J0621j80348Q1501J8157g8228A42127o9644h4919k93155f7502
$$ 113071 -133860 -123239 -303587 -222086 -203929 -78228 142127 72483 -84919 -378074 -67502
9249F2250a77642B76698d6406j57707l376C01992b2080j93371J03315D29230c37113
$$ 62250 -177642 276698 -46406 -204113 -207489 301992 -22080 -215451 -112136 429230 -337113
9237A88856b45343c3748A71415a9718A87636m4840b5774q5218j76976f8123G1308
$$ 188856 -245343 -33748 171415 -19718 187636 142796 -25774 -110992 -287968 -68123 71308
9225A68201F3915b8268j54115m7586i6763F3931J8333b34956j8060A28880a87032
$$ 168201 63915 -28268 -182383 -229969 -96763 63931 82264 -234956 -253016 128880 -187032
9213c36896a15066B2547a39972C3943d04905H1536K4810J36896D5129K69419b7503
$$ -336896 -115066 22547 -139972 33943 -404905 81536 106346 243242 45129 314548 -27503
9201e4180l9443L7668j15498n5374A38368d4486C82879A47713B5718a74595q3338
$$ -54180 -93623 -55955 -171453 -226827 138368 -44486 382879 147713 25718 -174595 -257933
9190b57933J20572o1584A72249F5310c30349r0827a95867C9914a53973A89197
$$ -257933 -137361 -198945 172249 65310 -330349 -421176 -195867 39914 -153973 189197
9179a25500j97742P5991a04601I4064a34698B81672f6989A23214b19683B53695
$$ -125500 -323242 -247251 -104601 94064 -134698 281672 -66989 123214 -219683 253695
9168A02430b03019R00c9485l29987A83495a69449c1661j41959P6631j23386a02436
$$ 102430 -203019 -202119 -39485 -369472 183495 -169449 -31661 -173620 -96989 -220375 -102436
9156A38499K16468b02796A87691e3379p7409j06144j98316C264m41c15493A67041
$$ 138499 354967 -202796 187691 -53379 -130788 -236932 -435248 3264 2823 -315493 167041
9144B12662H7925a86805A40277e3969D97363A54251a33495E5193b13390Q2931
$$ 212662 87925 -186805 140277 -53969 497363 154251 -133495 55193 -213390 -130459
9134a30459B377b22861e8943E1403a23694L0411F3991d49929g3510D7735a39270
$$ -130459 2377 -222861 -58943 51403 -123694 -93283 63991 -449929 -73510 47735 -139270
9122c1443G9691a73844B16003g9863D222i8208m457A4994a7444G7992J20578b81312
$$ -31443 79691 -173844 216003 -79863 4222 -98208 -102665 14994 -17444 77992 198570 -281312
9109a206H799a059j66432B23621b19023L7711m2468A10645a54672q6469K4323
$$ -1206 8799 -1059 -167491 223621 -219023 -181312 -223780 110645 -154672 -241141 -216818
9098b16818B79860G1884e5480H5645c0690j01143n442D25582a64466H7138N659
$$ -216818 279860 71884 -55480 85645 -30690 -131833 -137275 425582 -164466 87138 92797
9087I2797b37521A02388B6893M9128K10934B6175I062l078c12366Q1343A23367
$$ 92797 -237521 102388 26893 76021 286955 26175 9062 5984 -312366 -231023 123367
9075G33K89160h6226q334j67626A62779J24338c26045l6552a50228L1507N4899
$$ 733 289893 -86226 -94560 -262186 162779 287117 -326045 -362597 -150228 -118721 -63822
9064f3822n1075j73114P8380A33812d7546m7708R117J1869j55806q0649I9579
$$ -63822 -114897 -288011 -209631 133812 -47546 -95254 -86137 -74268 -230074 -310723 99579
9052a87545a1478j37204C6609c5455A07302b28419G9436J47069G4465J11608a26710
$$ -187545 -11478 -148682 36609 -35455 107302 -228419 79436 226505 74465 186073 -126710
9040b57675C0528e28205d0092j08614o5535a9393H1250b05114A14343r505L0094
$$ -257675 30528 -528205 -40092 -148706 -214241 -19393 81250 -205114 114343 104838 134932
9029A34932f9399J9766j69432R0666j32995H2008l0973l483M1054b81279i9377
$$ 134932 -69399 -49633 -219065 -128399 -261394 82008 51035 47552 88606 -281279 -99377
9017B48516J36366d8757k6762k4305A36878b75168B15797d02443a9481K585j35069
$$ 248516 384882 -48757 -75519 -99824 136878 -275168 215797 -402443 -19481 -16896 -151965
9006a51965o6784A94357e5289R029I4474c32294A21955i3207j27308F4928c9295
$$ -151965 -218749 194357 -55289 -46260 94474 -332294 121955 -93207 -220515 64928 -39295
8994c89310a92788e5249I336a65151F07P3773B1837b22680b6468A59253g221o6090
$$ -389310 -192788 -55249 9336 -165151 607 74380 21837 -222680 -26468 159253 -7221 -73311
8982g3311n9834n6065B9605K16473b06959Q1444B0700b13504A07956e316G3080
$$ -73311 -133145 -189210 29605 246078 -206959 -125515 20700 -213504 107956 -5316 73080
8970b5370k10019B53835a08826M9430F8336b63701g3962G0335b00337e6446D7662
$$ -25370 -235389 253835 -108826 -59396 68336 -263701 -73962 70335 -200337 -56446 47662
8958E4348a82538c338l2056D48a46629F7591e5461p6864A6110b35941J02218C434
$$ 54348 -182538 -3338 -35394 448 -146629 67591 -55461 -132325 16110 -235941 -133723 3434
8945b30993K26C44818D0479h129A50145b95370O3218e6270j93068J16408C80718
$$ -230993 -230767 344818 40479 -8129 150145 -295370 -232152 -56270 -249338 -132930 380718
8933B94999l4881j11701r710a30857n7107l26710C29878a3378j45039A97494c13948
$$ 294999 260118 148417 138707 -130857 -187964 -514674 329878 -13378 -158417 197494 -313948
8921C88936c5015F0254K5307J70251r2298L40376B51023l0733A1225K70020J85686
$$ 388936 -35015 60254 85561 255812 163514 503890 251023 220290 11225 281245 466931
8910D66931R3524K11648J044658Q07522K298527O232313E458267k429742j262659
$$ 466931 560455 772103 1816761 2624283 4922810 11155123 5458267 3028525 1765866
8901A765866p99780j10495k61097j64469j85711L3482N3781n0956J1144j28447
$$ 1765866 966086 855591 594494 430025 244314 277796 331577 280621 291765 163318
8891A63318f3941A7158e20102b08387B745Q3972P2464n8194J30D605M26734b93254
$$ 163318 -63941 17158 -520102 -208387 2745 86717 159181 100987 101117 4605 431339 -293254
8878A76380K2431a8546n5640j01711F7576b25391o6961R8677j44641J20921J7216
$$ 176380 198811 -18546 -74186 -175897 67576 -225391 -292352 -193675 -338316 -217395 -200179
8867b00179Q9856N3348l3615o8855E7698a21001A7167c3859q2952D1272J90561
$$ -200179 -110323 -56975 -90590 -159445 57698 -121001 17167 -33859 -116811 41272 231833
8856B31833b42095A51743a10246n2598p624d7192C1650b52986J07915r0133g4202
$$ 231833 -242095 151743 -110246 -162844 -170468 -47192 31650 -252986 -145071 -235204 -74202
$$ [...]
##END NTUPLES=NMR SPECTRUM
##END=
