
##TITLE=UV1129_M3-1004-1000_6274945_yLBTYzq93K
##JCAMPDX= 6.0         $$ Bruker NMR JCAMP-DX V2.0
##DATA TYPE= NMR SPECTRUM
##DATA CLASS= NTUPLES
##ORIGIN= BRUKER
##OWNER= Administrator
$$ 1.72 TOPSPIN		Version 2.1
$$ 2012-06-02 22:42:58.265 -0500  Administrator@TOPSPIN
$$ Compression mode = diff/dup
##.OBSERVE FREQUENCY= 400.13188235
##.OBSERVE NUCLEUS= ^1H
##.ACQUISITION MODE= SIMULTANEOUS (DQD)
##.ACQUISITION SCHEME= undefined
##.AVERAGES= 64
##.DIGITISER RES= 22
##SPECTROMETER/DATA SYSTEM= spect
##.PULSE SEQUENCE= noesygpps1d.comp
##.SOLVENT NAME= COFFEE_meoh
##.SHIFT REFERENCE= INTERNAL, COFFEE_meoh, 1, 14.96716
##AUDIT TRAIL= $$ (NUMBER, WHEN, WHO, WHERE, PROCESS, VERSION, WHAT)
$$ ##TITLE= Audit trail, TOPSPIN		Version 2.1
$$ ##JCAMPDX= 5.01
$$ ##ORIGIN= Bruker BioSpin GmbH
$$ ##OWNER= Administrator
$$ $$ C:\Bruker\TOPSPIN/data/COFFEE/nmr/UV1129_M3-1004-1000_6274945_yLBTYzq93K/12/pdata/1/auditp.txt
$$ ##AUDIT TRAIL=  $$ (NUMBER, WHEN, WHO, WHERE, PROCESS, VERSION, WHAT)
(   1,<2012-06-02 22:42:52.937 -0500>,<Administrator>,<TOPSPIN>,<go>,<TOPSPIN 2.1>,
      <created by zg
	started at 2012-06-02 22:31:22.593 -0500,
	POWCHK enabled, PULCHK disabled,
       configuration hash MD5:
       D5 CA 7A 23 FE 6B EE E2 50 67 74 61 24 F7 5E 3B
       data hash MD5: 64K
       72 10 80 7E D1 BE 2E AB E8 AB 41 5C 94 8F F9 C6>)
(   2,<2012-06-02 22:42:55.875 -0500>,<Administrator>,<TOPSPIN>,<proc1d>,<TOPSPIN 2.1>,
      <Start of raw data processing
       efp LB = 0.3 FT_mod = 6 PKNL = 1 PHC0 = 0 PHC1 = 0 SI = 128K 
       data hash MD5: 128K
       2B 2E C5 2A 56 F1 D7 83 53 C4 3F CF FE 44 06 12>)
(   3,<2012-06-02 22:42:57.171 -0500>,<Administrator>,<TOPSPIN>,<proc1d>,<TOPSPIN 2.1>,
      <pk PHC0 = 34.43115 PHC1 = 0 
       data hash MD5: 128K
       10 FC 18 76 70 58 C2 71 AF 6B C0 8B 7D 33 2E 8F>)
(   4,<2012-06-02 22:42:57.890 -0500>,<Administrator>,<TOPSPIN>,<proc1d>,<TOPSPIN 2.1>,
      <abs ABSG = 1 
       data hash MD5: 128K
       6B 2D 6F CC 4B 9E 05 4A B4 33 23 6B 3C 27 7C BD>)
(   5,<2012-06-02 22:42:57.968 -0500>,<Administrator>,<TOPSPIN>,<proc1d>,<TOPSPIN 2.1>,
      <abs ABSG = 2 
       data hash MD5: 128K
       81 F6 7E E6 12 61 2A 2C 0D 31 68 09 FF 5F A7 9D>)
(   6,<2012-06-02 22:42:58.031 -0500>,<Administrator>,<TOPSPIN>,<proc1d>,<TOPSPIN 2.1>,
      <abs ABSG = 3 
       data hash MD5: 128K
       3A 6F 39 14 A1 AA 14 28 03 12 3A B4 89 1C 0C 1B>)
(   7,<2012-06-02 22:42:58.093 -0500>,<Administrator>,<TOPSPIN>,<proc1d>,<TOPSPIN 2.1>,
      <abs ABSG = 4 
       data hash MD5: 128K
       DE D7 4A C2 57 24 8B 74 59 A3 D6 08 57 CB 50 3E>)
(   8,<2012-06-02 22:42:58.156 -0500>,<Administrator>,<TOPSPIN>,<proc1d>,<TOPSPIN 2.1>,
      <abs ABSG = 5 
       data hash MD5: 128K
       C3 36 6A 59 69 C9 3C 8F D8 DF 4B 1F 3A 04 8B 1D>)
$$ ##END=
$$ 
$$ $$ hash MD5
$$ $$ 6F E0 79 4A 1B 3A 20 02 58 A6 80 3C E9 EC 87 F7
##$RELAX= 
##$RELAX= 
##$RELAX= 
##$RELAX= 
##$RELAX= 
##$RELAX= 
##$RELAX= 
##$RELAX= 
$$ Bruker specific parameters
$$ [...]
##$TP07= 0
##$TPNAME0= <>
##$TPNAME1= <>
##$TPNAME2= <>
##$TPNAME3= <>
##$TPNAME4= <>
##$TPNAME5= <>
##$TPNAME6= <>
##$TPNAME7= <>
##$TPOAL= (0..7)
0.5 0.5 0.5 0.5 0.5 0.5 0.5 0.5
##$TPOFFS= (0..7)
0 0 0 0 0 0 0 0
##$TUNHIN= 0
##$TUNHOUT= 0
##$TUNXOUT= 0
##$USERA1= <user>
##$USERA2= <user>
##$USERA3= <user>
##$USERA4= <user>
##$USERA5= <user>
##$V9= 5
##$VALIST= <valist>
##$VCLIST= <CCCCCCCCCCCCCCC>
##$VD= 0
##$VDLIST= <DDDDDDDDDDDDDDD>
##$VPLIST= <PPPPPPPPPPPPPPP>
##$VTLIST= <TTTTTTTTTTTTTTT>
##$WBST= 2048
##$WBSW= 25
##$XGAIN= (0..3)
0 0 0 0
##$XL= 0
##$YL= 0
##$YMAX_a= 11678939
##$YMIN_a= -6718826
##$ZGOPTNS= <>
##$ZL1= 120
##$ZL2= 120
##$ZL3= 120
##$ZL4= 120
##$ABSF1= 14.96716
##$ABSF2= -5.58537
##$ABSG= 5
##$ABSL= 3
##$ALPHA= 0
##$AQORDER= 0
##$ASSFAC= 0
##$ASSFACI= 0
##$ASSFACX= 0
##$ASSWID= 0
##$AUNMP= <proc_prof1d_extract.lims>
##$AXLEFT= 0
##$AXNAME= <>
##$AXNUC= <1H>
##$AXRIGHT= 0
##$AXTYPE= 0
##$AXUNIT= <>
##$AZFE= 0.1
##$AZFW= 0.1
##$BCFW= 0
##$BC_mod= 0
##$BYTORDP= 0
##$COROFFS= 0
##$CY= 15
##$DATMOD= 1
##$DC= 0
##$DFILT= <>
##$DTYPP= 0
##$F1P= 0
##$F2P= 0
##$FCOR= 0.5
##$FTSIZE= 131072
##$FT_mod= 6
##$GAMMA= 0
##$GB= 0
##$INTBC= 1
##$INTSCL= 1
##$ISEN= 128
##$LB= 0.3
##$LEV0= 0
##$LPBIN= 0
##$MAXI= 10000
##$MC2= 0
##$MEAN= 0
##$ME_mod= 0
##$MI= 0
##$NCOEF= 0
##$NC_proc= -3
##$NLEV= 6
##$NOISF1= 0
##$NOISF2= 0
##$NSP= 0
##$NTH_PI= 0
##$NZP= 0
##$OFFSET= 14.96716
##$PC= 1
##$PHC0= 34.43115
##$PHC1= 0
##$PH_mod= 1
##$PKNL= yes
##$PPARMOD= 0
##$PPDIAG= 0
##$PPIPTYP= 0
##$PPMPNUM= 2147483647
##$PPRESOL= 1
##$PSCAL= 4
##$PSIGN= 0
##$PYNMP= <proc.py>
##$REVERSE= no
##$SF= 400.130005380714
##$SI= 131072
##$SIGF1= 0
##$SIGF2= 0
##$SINO= 400
##$SIOLD= 131072
##$SPECTYP= <>
##$SREGLST= <1H.CDCl3>
##$SSB= 0
##$STSI= 131072
##$STSR= 0
##$SW_p= 8223.68421052632
##$SYMM= 0
##$S_DEV= 0
##$TDeff= 65536
##$TDoff= 0
##$TI= <>
##$TILT= no
##$TM1= 0
##$TM2= 0
##$TOPLEV= 0
##$USERP1= <user>
##$USERP2= <user>
##$USERP3= <user>
##$USERP4= <user>
##$USERP5= <user>
##$WDW= 1
##$XDIM= 131072
##$YMAX_p= 488255736
##$YMIN_p= -317589841
##$CURPLOT= <Network HP LaserJet P1505>
##$CURPRIN= <$Network HP LaserJet P1505>
##$DFORMAT= <normdp>
##$LAYOUT= <+/1D_H.xwp>
##$LFORMAT= <normlp>
##$PFORMAT= <normpl>
##$SURQMSG= 1
$$ End of Bruker specific parameters
$$ ---------------------------------
##NTUPLES= NMR SPECTRUM
##VAR_NAME=  FREQUENCY,     SPECTRUM/REAL,   SPECTRUM/IMAG
##SYMBOL=    X,             R,               I
##VAR_TYPE=  INDEPENDENT,   DEPENDENT,       DEPENDENT
##VAR_FORM=  AFFN,          ASDF,            ASDF
##VAR_DIM=   131072,        131072,          131072
##UNITS=     HZ,            ARBITRARY UNITS, ARBITRARY UNITS
##FACTOR=    0.0627417313425165, 1,          1
##FIRST=     8223.62146879498, 1373,         -117114
##LAST=      0,             5104,            -117461
##MIN=       0,             -317589841,      0
##MAX=       8223.62146879498, 488255736,    0
$$ Real data points
##PAGE= N=1
##DATA TABLE= (X++(R..R)), XYDATA
$$ [...]
67111 224311 226987 230172 233516 236406 238191 239335 241552 245880 251022 254543 255487 254985 254461 254307 254455
67096 254455 255289 257405 260841 264880 268432 270660 271537 271759 271936 272126 272408 273332 275061 276605 277001 276986 278224
67079 278224 280860 283292 284779 286793 290857 296130 300312 302220 302378 301692 300906 301077 303149 306765 310561
67064 310561 313936 317558 321664 324930 325990 325592 326192 329292 333830 337406 338636 337997 336862 336285 336737
67049 336737 338356 340997 344293 348126 352855 358507 363788 366712 366678 365436 365410 367371 370214 372672 374500
67034 374500 376067 377658 379468 381747 384568 387736 391090 394563 397893 400777 403471 406612 410035 412345
67020 412345 412395 410949 410236 411838 415399 419343 422456 424905 428098 433363 440313 446812 451202 454265 458068
67005 458068 463081 467682 470773 473462 477333 482171 486527 489706 491987 493520 494579 496552 500902 506912
66991 506912 512082 515325 518386 523308 529839 536484 542961 550017 557335 563297 567022 569520 572530 576975
66977 576975 582687 588836 594378 598778 602654 607218 612968 619449 626360 634201 643473 653833 664470 674926
66963 674926 685149 694999 704030 711641 717435 721775 726009 731600 738834 746888 755271 764421 774487 784388
66949 784388 792986 800677 808882 818187 827896 837362 846821 856755 867199 878066 889475 901316 912964
66936 912964 923858 934182 944570 955358 966396 977479 988720 1000550 1013383 1027089 1040820
66925 1040820 1053809 1066444 1080090 1095500 1111865 1127905 1143480 1159436 1176115 1192887 1209295
66914 1209295 1225945 1243838 1263241 1283600 1304192 1324479 1344106 1363156 1382371 1402719 1424532
66903 1424532 1447233 1469938 1492225 1514402 1537253 1561436 1586899 1612886 1638849 1665344 1693600
66892 1693600 1723936 1754920 1784558 1812273 1839403 1867734 1897957 1929705 1962595 1996661 2031868
66881 2031868 2067927 2104924 2143594 2184301 2225939 2266669 2306013 2345538 2386884 2429641 2471987
66870 2471987 2513238 2554805 2598374 2643981 2690518 2737507 2785425 2834439 2883824 2933022 2982580
66859 2982580 3033435 3085515 3137686 3189133 3240414 3293033 3348050 3405058 3462265 3517734 3570968
66848 3570968 3623308 3676314 3729677 3781418 3830541 3878719 3928363 3979363 4028954 4075041 4118554
66837 4118554 4161862 4205693 4248509 4288450 4324969 4358746 4390862 4422031 4451967 4479428 4503416
66826 4503416 4524235 4542842 4559360 4573081 4583820 4592123 4597814 4599438 4595903 4588036 4577748 4566000
66814 4566000 4552127 4534818 4513240 4487587 4459051 4428958 4397506 4363710 4326966 4288078 4248144
66803 4248144 4206987 4163571 4117573 4069587 4020066 3969192 3917782 3867157 3817620 3767825 3716081
66792 3716081 3661814 3605592 3548416 3491343 3435119 3379633 3324094 3268111 3212339 3157821 3105064
66781 3105064 3053967 3004154 2955080 2906243 2857668 2809774 2762441 2714736 2666101 2617443 2570414
66770 2570414 2525711 2482537 2439584 2396105 2352155 2308395 2265725 2224677 2184967 2145814 2106724
66759 2106724 2067858 2029804 1993306 1959034 1927156 1897010 1867507 1837989 1808480 1779007 1749031
66748 1749031 1717979 1686391 1656200 1629350 1605942 1583989 1561336 1537620 1513899 1490585 1466668
66737 1466668 1441286 1415150 1389588 1364809 1340227 1316303 1294713 1276234 1259387 1241918 1222992
66726 1222992 1203222 1183156 1162880 1143010 1124774 1108489 1092732 1075851 1057967 1040777 1025564
66715 1025564 1012116 999480 986878 973652 959267 944077 929535 916781 905165 892854 878847
66704 878847 863800 848996 835277 823063 812507 803075 793454 782537 770394 758059 746517 736157
66692 736157 726948 718764 711485 704829 698084 690322 681343 672275 664489 657798 650540 641729 632254 623300
66678 623300 614552 605073 595406 587417 581976 577968 573837 569059 563687 557490 550403 543242 536971 531409
66664 531409 525338 517943 509701 501807 495103 489607 484797 480212 475824 471768 467689 462701 456397 449739
66650 449739 444376 440886 438087 434346 429324 424071 419596 415810 411955 407603 402937 398284 393749 389256
66636 389256 384688 380013 375452 371417 368008 364654 360718 356437 352742 349972 347315 343913 340001 336373
66622 336373 333166 329962 326925 324832 323730 322477 320179 317469 315631 314794 313807 311823 309242 306866 304826
66607 304826 302749 300529 298411 296492 294706 293210 292265 291621 290455 288174 285002 281637 278640 276376 275121
66592 275121 274695 274152 272360 269051 265027 261289 258258 255921 254383 253965 254705 255827 255931 254068 250785
66577 250785 247739 245992 245023 243775 242124 240570 238917 236501 233819 232675 234017 236478 237796 237154 235423
66562 235423 233671 232340 231598 231539 231891 232134 232058 231769 231056 229221 225830 221559 218121 217085 218393 220057
66546 220057 219937 218029 216426 216613 217404 216244 212181 206811 202472 200223 199447 198694 196752 193458 189762
66531 189762 186897 185518 185626 186823 188319 189199 189282 189361 190120 191249 192147 192873 193607 193824 193084 192048 191380
66514 191380 190087 186624 181698 178188 177708 178721 178825 177591 176233 175637 175870 176827 178091 178602 177546 175404
66498 175404 173412 172255 171999 172902 175324 178766 181731 182752 181311 177948 173857 170249 167732 166316 166056
66483 166056 167240 169649 172146 173540 173618 172997 172223 171313 169876 167394 163789 159978 157382 156540 156725 157171
66467 157171 157923 159078 160095 160716 161696 163533 165043 164499 161951 159210 157589 156724 155729 154386 152912 151401
66451 151401 149907 148503 146973 144937 142386 139681 137183 135529 136043 139798 145958 151833 154993 154902 152547
66436 152547 149301 146307 144019 141914 139353 136995 136461 138164 140484 141807 142525 144009 146339 148285 149190
66421 149190 149577 149773 149118 147030 144111 141636 140352 140182 140752 141730 142777 143540 143810 143678 143603 144238 145782
66404 145782 147329 147280 144918 141462 139065 138656 139177 139172 138652 138958 140939 143849 146129 146863 146296 145252 144288
66387 144288 143296 141774 139692 138037 138111 140124 142886 145094 146526 147607 148305 148158 147232 146360 146204 146402
66371 146402 145869 143902 141034 138836 138566 139861 141145 141594 142130 143875 146144 147007 145757 143904 143327 144102
66355 144102 144542 143051 139732 136397 135031 135894 137167 136873 135066 133569 133706 135051 136444 137269 137319 136391
66339 136391 134799 133682 133900 134844 135074 134038 132580 131781 131818 132047 131761 130810 129776 129609 130862 133150 135463
66322 135463 136969 137429 137019 136100 135261 135240 136421 138223 139262 138533 136570 135035 134879 135331 135084 134003 132886
66305 132886 131873 130307 128340 127469 128773 131464 134005 135983 137907 139647 140263 139375 137699 136059 134685
66290 134685 133700 133470 133984 134542 134678 134891 135887 137355 138220 138059 137585 137577 137892 137941 137744 138028 139414 141866 144796
66271 144796 147223 147919 146097 142316 138349 135825 135156 135838 137250 138823 139978 140472 140469 139877 138124 135211
66255 135211 132463 131275 131463 131849 132136 132892 133790 133502 131890 130813 131843 134185 135926 136356 135926 134722
66239 134722 132500 129966 128593 128960 130178 131099 131284 130747 129691 128690 128364 128504 128179 127039 126013 126367
66223 126367 128424 131448 134330 136160 136593 136054 135318 134596 133339 131329 129680 130126 133178 137390 140671
66208 140671 142116 142300 142091 141768 141466 141779 143283 145625 147765 149095 149788 150009 149407 147638 144897 141769
66192 141769 139019 137601 138143 140107 142133 143504 144516 145155 144526 142356 140055 139196 139668 140478 141616 143628
66176 143628 145784 146447 145448 144568 145252 147047 148775 150032 150793 150580 148953 146353 143807 142136 141736 142565
66160 142565 143940 144915 145246 145490 145930 146048 145460 144616 144119 143997 144136 144704 145455 145313 143450 140325 136954
66143 136954 133682 130537 128237 127729 128809 130240 131251 132078 133032 133998 135113 136993 139732 142196 142944
66128 142944 141674 139490 137951 138023 139713 142346 145149 147542 148898 148407 145739 141816 138317 136247 135460
66113 135460 135640 136917 139009 140499 139989 137781 135503 134071 132984 131873 131625 133156 135798 137928 138820
66098 138820 138901 138489 137538 136772 137610 140249 142800 143205 141390 138859 136934 136234 137038 138868 140228 140157 139775
66081 139775 140897 143265 144808 144789 144878 146434 148382 148880 147771 146074 144219 142295 141232 141932 143482 143911
66065 143911 142917 142436 144058 147062 149552 150692 151139 151913 153491 155761 158291 160629 162539 163902 164438
66050 164438 163835 162194 160159 158558 158038 158871 160712 162618 163644 163533 162664 161524 160517 160017 160147 160629
66034 160629 161241 162171 163423 164202 163696 162381 161684 162272 163525 164875 166696 169346 172043 173432 172950 171233
66018 171233 169481 168693 168995 169361 168532 166656 165447 166163 168034 169450 170064 170665 171309 170973 169316 167631
66002 167631 167419 168798 170941 173436 176400 179606 182364 184343 185908 187459 188783 189216 188324 186451 184819
65987 184819 184897 187163 190373 192485 192653 192109 192810 195322 198336 200250 200933 201767 204106 207899 211843 214693
65971 214693 216220 217011 217749 218890 220709 223125 225615 227783 229993 232886 236195 238782 240164 241261 242974
65956 242974 244708 245289 244949 245279 247233 250302 253788 257696 261857 265300 267455 269251 272022 275680 278897
65941 278897 280859 282026 283336 285487 289017 294227 300760 307696 314161 319428 322637 323241 321872 320024
65927 320024 318561 317085 314974 312277 309148 305132 299846 294081 289363 286321 284052 281285 277750 274131
65913 274131 270919 267725 263850 259433 255773 254344 255477 258122 260863 263007 264733 266542 268732 271158
65899 271158 273274 274513 274819 274806 275277 276608 278540 280403 281495 281613 281464 282322 284879 288517 292108 295489
65883 295489 299599 304969 310548 314621 316701 317977 319893 322840 326365 330064 333783 337367 340837 344623
65869 344623 349017 353415 356659 358142 358108 356971 355165 353771 354312 357347 361865 366643 371536 376781 381717
65854 381717 385235 387203 388444 389426 389967 390215 390879 392171 393428 394207 395058 396715 399074 401401 403125 403921
65838 403921 403410 401267 397547 392646 387092 381369 375604 369303 361869 353554 345466 338433 332361 326895
65824 326895 321993 317406 312243 305835 298734 292230 287024 282850 279129 275451 271665 268088 265516 264436
65810 264436 264252 263781 262456 260596 258675 256967 255812 255458 255458 254915 253659 252646 252805 253904 254932 255296
65794 255296 255218 255168 255462 256386 258258 261068 264164 266575 267840 268556 269928 272537 275558 277453 277476 276332
65778 276332 275303 275035 275323 275784 276301 276921 277717 278871 280586 282769 285111 287786 291780 297980 305852 313514
65762 313514 319410 323624 327343 331379 335615 339561 342819 344994 345730 344996 342953 339500 334440 328252 322144
65747 322144 316949 312373 307761 303262 299710 297458 295848 293913 291299 288368 285545 282726 279444 275718
65733 275718 272551 271168 271714 273078 274198 275161 276858 279968 284528 290058 295697 300672 305176 310478 317599
65718 317599 325975 333920 340212 344789 348048 350031 350377 348735 345217 340637 336014 331558 326595 320967
65704 320967 315966 313038 311828 310503 308016 305143 303245 302908 304049 306427 309601 313130 317308 323119
65690 323119 331042 340444 350517 361098 372006 382281 390896 397811 403600 408300 411319 412257 411155
65677 411155 408079 403163 396917 389826 381673 371928 360840 349470 338510 327772 317119 307193 298651
65664 298651 291116 283633 276079 269471 264668 261213 257819 253788 249489 245413 241236 236216 230398 224935
65650 224935 221135 219467 219603 220971 222895 224450 224753 223593 221567 219485 217793 216615 216120 216521 217645
65635 217645 218821 219605 220690 223681 229510 237050 243679 247446 248649 249408 251841 256469 261980 266493 269343
65620 269343 271746 275586 281690 289569 298504 308233 318645 329629 341459 354600 368812 383152 397255
65607 397255 411832 427267 442438 455813 467230 477624 487200 494833 499376 500937 500895 501222 503580
65594 503580 508179 513307 516510 516487 513652 509319 505041 502361 501941 502587 501976 498712 493055 485550 475992
65579 475992 464260 451256 438119 424940 410966 395866 380240 365017 350794 337688 325583
65568 325583 314547 304972 297063 290345 284176 278673 274353 270837 266847 261759 256174 250546 244452 238068
65554 238068 233176 231340 231707 231925 230931 229617 229077 229498 230599 231817 231984 230180 227217 225099 224604 224461
65538 224461 223378 221826 221188 221994 223682 225507 227096 228597 230666 233770 237386 240695 244223 249621 257265
65523 257265 265332 272108 278055 284519 291554 298566 306298 316307 328646 341696 354360 366959 379792
65510 379792 392226 403584 413651 421933 427673 431119 433421 434542 432566 426174 416797 406966 397191
65497 397191 385882 372124 357227 343331 331485 321395 312325 303834 295989 289121 283211 277566 271397
65484 271397 264716 258441 253676 251086 250705 251958 253914 255847 257441 258339 257969 256232 253909 251775 249667
65469 249667 247199 244954 243864 243463 242021 238790 235053 232367 230737 229379 228463 228759 229852 229924 227720
65454 227720 224011 220724 219053 218755 218891 218776 218279 217643 217272 217585 218736 220328 221563 222046 222309 223162 224544
65437 224544 225585 226049 227080 229974 234547 239321 243101 245812 247980 250133 252693 255672 258191 258989 257895
65422 257895 256378 256167 257613 259778 261775 263383 264499 264725 263795 261973 259658 256764 252848 247863 242515
65407 242515 237729 233879 230750 228278 227020 227542 229390 231094 231476 230727 229873 229331 228424 226363 223335 220460
65391 220460 218893 219084 220535 222017 222267 221032 219492 219377 221570 225733 231066 236862 242198 245860 247323
65376 247323 247606 248442 250532 253039 254803 255392 254843 253164 250644 248033 245677 242893 239092 235341 233788
65361 233788 235281 238427 241337 243405 244816 245290 244479 243172 242842 243946 245699 247667 250406 253952 256685
65346 256685 256833 254708 252564 252339 254230 257293 260587 263544 266052 268584 271803 275700 279462 282385 284455
65331 284455 285824 286265 285649 284464 283314 282204 280964 280121 280552 282300 284473 286465 288626 291445 294586
65316 294586 297178 298771 299753 300993 303168 306088 308678 309991 310345 310959 312544 315014 318637 324258 331707
65301 331707 339133 345132 350820 358369 367843 377091 384810 392101 400419 409348 417273 423230 427110 428802
65287 428802 428219 425827 422317 417960 412804 407051 400645 393112 384627 376689 370683 366116 361289 355421
65273 355421 348940 341950 333930 325183 317137 310622 305111 300328 297298 296614 296585 294613 290205 285427 282405
65258 282405 281378 281216 280792 279409 276660 272568 267770 263229 259700 257324 255510 253329 250434 247671 246463
65243 246463 247484 250086 253062 255714 258120 260533 262787 264486 265861 268027 271726 275841 278006 277155
65229 277155 274760 272873 271729 270319 268719 268295 269543 271173 271871 271852 272058 272819 274040 275753 277513 277996
65213 277996 276415 273968 272608 272432 271453 268280 264079 261401 261587 263640 265211 264388 261062 257069 254790
65198 254790 255190 257094 258384 257807 255785 253896 253637 255312 257889 260038 261217 261483 260584 258110 254645
65183 254645 251793 250455 249754 248370 246383 244942 244563 244755 245160 245862 246445 245896 243947 241593 239706 237944
65167 237944 235720 233454 231872 230651 228926 226884 225698 225858 226655 227469 228468 229700 230552 230731 231022 232316
65151 232316 234474 236709 238572 239895 240405 240150 239868 240057 239958 238376 235446 232850 232283 234177 237632 241011
65135 241011 242974 243765 245169 248341 252056 254213 254703 255319 256879 258118 257843 256557 255178 253747 252534
65120 252534 253068 256505 261711 266390 269674 272414 275429 278832 282737 287193 291392 294152 295399 296335 298181
65105 298181 301583 306927 313986 321293 327215 331923 337124 343539 349946 355293 360580 367716 377358 388771
65091 388771 401256 414835 429851 446588 465152 485344 506957 530489 556959 586503 617481
65080 617481 647510 675111 700119 723048 744519 764810 783439 799517 812930 824600 834976
65069 834976 842823 846294 844870 839490 831079 819885 806158 790482 773135 753846 732547 709903
65057 709903 686754 663299 639102 613838 587925 562490 538625 516581 495824 475908 457007
65046 457007 439470 423290 408317 394668 382572 372155 363616 357027 351543 345513 338201 330835 325047
65033 325047 320725 316525 312145 308707 306877 305921 304938 303738 302116 299592 296606 294763 294881 295746 295892
65018 295892 295756 296719 298603 299639 298903 297341 296067 294914 293270 291476 290569 291059 292498 294030 294910 294807
65002 294807 294004 293267 293179 293618 293982 293854 293391 293220 293994 295767 297725 298803 298742 298268 298062 297881 297000 295238
64984 295238 293005 290368 286605 281109 274578 268957 265943 265520 266036 265741 264132 261833 259613 258000 257541
64969 257541 258603 260600 262108 262287 261777 261677 262064 262207 261817 261159 260138 258441 256671 256177 257233 258404
64953 258404 258486 258158 258803 260441 262023 263300 265118 268056 271971 276820 282538 287939 291202 292132 292755 294904
64937 294904 298210 301292 303750 305760 306587 305274 302575 300579 300095 299757 298301 296633 296817 299634 303938
64922 303938 308132 311543 314395 316965 319098 320468 321062 321159 320757 319464 317161 314352 311370 307725 303048
64907 303048 298345 295178 293567 291828 288828 285366 282752 281129 280036 279690 280570 282263 283803 284754 284796
64892 284796 282735 277546 270546 264867 262028 260308 257511 254251 253106 255109 258662 261924 264747 267651
64878 267651 270166 271349 271440 271855 273472 275730 277558 278510 278690 278164 276984 275475 274006 272662 271542 271138
64862 271138 271900 273525 275250 276826 278572 280469 282054 283522 286021 290064 294240 296526 296722 296676 298059
64847 298059 300795 303899 306923 309936 312697 314754 316379 318808 323304 330132 338475 347193 355558 363278
64833 363278 369937 374765 377409 378777 380495 383273 386324 388646 390251 391519 391936 390445 386995 382828
64819 382828 378964 375057 370143 364147 358294 354186 352537 352558 352625 351882 351020 350971 351013 349198 344850 339562 335177
64802 335177 331816 328840 326701 326288 326765 325725 321847 316215 310568 305327 300007 294753 290540 288127 287435
64787 287435 287775 288381 288922 289718 291173 292909 293979 294083 293889 293816 293279 291832 290396 290444 292249 294765 297029
64770 297029 298928 300750 302775 305326 308425 311255 312669 312497 311895 312232 314103 317578 322834 330076 339041
64755 339041 348800 358080 365919 372325 378246 384513 390855 396265 400206 402968 404904 405944 405957 405022 403141
64740 403141 400177 396268 391814 386885 381175 374814 368678 363554 359428 355982 353242 351227 349395 347152
64726 347152 344766 343154 342704 342829 342833 342838 343578 345440 347985 350524 353074 356467 361375 367474 373881 380198
64710 380198 386665 393378 400052 406706 413831 421385 428044 432170 433471 433391 433880 435989 439468 443373 446983
64695 446983 450139 452817 454719 455660 456070 456428 456270 454618 451473 447883 444181 439362 432973 426480 421434
64680 421434 416988 410851 402548 394214 387924 383677 380518 378329 377445 377291 376549 374586 372009 369882 368870
64665 368870 369125 370498 372768 375799 379430 383115 385910 387122 386941 386268 385951 386276 387048 387947 388713 388993
64649 388993 388213 385884 382273 378509 375681 373862 372243 370005 366670 361941 355947 349709 344641 341276
64635 341276 339057 337582 337353 338837 341380 343726 345295 346444 347728 349412 351445 353480 355216 357242
64621 357242 361065 367648 376198 385181 394167 403673 413373 421830 428346 433885 439501 444755 448436 449980
64607 449980 449370 446420 441324 435406 430056 425096 419342 412751 406860 402970 401001 400331 400516 400756 399979
64592 399979 398326 397584 399091 402001 404679 407143 410729 415797 421271 426589 432677 440493 449638 459052
64578 459052 468306 477521 486581 495064 502697 509289 514351 517200 517577 516101 514078 512582 511413 509172
64564 509172 504721 498275 490610 481745 471473 460889 451962 445225 439174 432486 425666 419819 415015 410961
64550 410961 408257 407568 408067 408064 407028 406001 406299 408790 413951 421272 428712 434174 437697 440993 444705 447628
64534 447628 449073 450439 453338 457217 460058 460810 459964 458153 455459 452176 449159 447101 446106 446247 447822
64519 447822 450550 453063 453950 453297 452569 452854 453769 454424 454800 455310 455262 452903 447517 440688 434767 430505 426860
64502 426860 422687 417674 411765 404747 396878 389418 384063 381806 382129 383052 382344 379340 375441 372363 370283
64487 370283 368548 367720 369401 373743 378493 381272 381821 381259 380135 378393 376541 375434 374920 373885 371866
64472 371866 369748 368559 368171 367600 366158 363907 361408 359467 359041 360827 364612 369131 372835 374980 375909
64457 375909 376325 376590 377003 378429 381990 387917 395095 401973 407699 412302 416169 419720 423453 427968 433848
64442 433848 441417 450332 459390 467030 472246 474933 475466 474319 472159 469830 467882 466258 464563 462487
64428 462487 459966 457280 455079 453926 453650 453416 452536 450879 448399 444737 439578 433234 426722 421469 418756
64413 418756 418803 420261 421195 420844 419975 419458 419260 419216 419946 422237 426012 430615 435841 442009 449152 456614 463367
64396 463367 468456 471536 473398 475655 479386 484252 489254 493991 498794 504072 510096 517093 525058 533729
64382 533729 543103 553541 565001 576867 589211 603483 620954 641064 662552 685815 712661 743613
64370 743613 776904 810708 845383 882974 925330 973303 1027085 1086543 1151472 1222114 1299470
64359 1299470 1384895 1479140 1581150 1687202 1791753 1890406 1982380 2069334 2151666 2226924 2291909
64348 2291909 2344894 2384954 2410382 2419230 2411231 2388070 2351851 2303943 2245037 2175436 2095316 2005554
64336 2005554 1908537 1807689 1706146 1606224 1509849 1418496 1332543 1251543 1175647 1106093 1043737
64325 1043737 987672 936186 888892 847006 811371 781025 754194 730041 708680 689809 672261
64314 672261 655161 638814 624017 610809 598305 585493 571885 557661 543659 531121 521042
64303 521042 513594 508212 504010 500031 495546 490688 486574 484193 483212 482443 481571 481822 484639 490000 496237
64288 496237 501261 503859 504295 504060 504924 507717 511698 515056 516177 514731 511685 508247 504828 501387 498671
64273 498671 498352 501255 505971 510051 512464 514069 515796 517468 518790 520449 523225 526340 527679 525839
64259 525839 521515 516608 512311 508401 504241 499819 495395 490507 484284 476988 470355 465670 462051 457544
64245 457544 451622 445561 440408 435709 430597 425200 420396 416743 414239 412747 412241 412863 414905 418343 422267
64230 422267 425388 427495 429852 433763 439195 445274 451615 458538 466242 474392 482451 490014 496912 503264
64216 503264 509363 515285 520703 525171 528312 529738 529235 527230 524562 521579 518033 514188 511329 510531 511424
64201 511424 512884 514519 516596 518728 519593 518154 514528 509390 503038 495411 486813 478343 471416 466641
64187 466641 463088 458977 453337 446815 440735 435848 432353 430442 429979 429908 428901 426854 425126 425113 426995
64172 426995 430015 433491 437280 441502 446009 450069 452732 453906 455039 458094 463517 469489 473496 474569
64158 474569 473892 473520 474758 477644 481564 486104 491209 496620 501422 504515 505690 506049 507067 509103 511046
64143 511046 511598 510763 509689 509105 508459 506863 504313 501520 499028 497279 497151 499454 503907 509564 516302
64128 516302 524883 535333 546355 556696 565959 573504 577855 578292 576113 573027 568967 562749 554300 544705
64114 544705 534344 522639 509897 497935 488278 480764 474424 468771 463650 458681 453777 449807 447946
64101 447946 448424 450300 452406 454127 455277 455451 453851 450139 445528 442455 442468 444629 446581 447145 447272 448522
64085 448522 451326 454836 457807 459310 459117 457753 456049 454533 453380 452720 452576 452680 452808 453146 453869 454621
64069 454621 455081 455817 457783 461016 464598 467792 470413 472249 473323 474927 479238 487226 497495 507589
64055 507589 516017 522972 529799 537902 547407 556754 564257 569947 574960 579406 582419 584372 587129 591319
64041 591319 595189 597441 599757 604835 612846 621379 628244 632854 635389 636212 635960 634893 632215 627148 620473
64026 620473 613878 607913 601796 595106 588428 582194 575991 569307 562140 554765 547652 541585 536999 533210
64012 533210 529061 524277 519420 514801 510541 507464 506577 507551 508962 510212 511903 514112 515831 516770 518319
63997 518319 521759 526467 530828 534126 536736 539273 542518 547554 554888 563635 572276 580075 587430 595327
63983 595327 604819 616359 629096 641454 652879 664242 675913 686551 694805 701265 707202 711996
63971 711996 713528 711166 706817 702668 699120 695466 691546 687932 685128 683242 682150 681495 680705 679251 676690
63956 676690 672544 666671 659939 653956 649666 646488 643137 639140 635249 632484 631050 630333 629922 630411 632852
63941 632852 637367 642850 648297 653875 660136 666794 673240 679933 688150 698296 709502 721124 733584
63928 733584 747291 761736 776372 791693 808626 827348 847415 868671 891402 915916 942559
63917 942559 971713 1003019 1034978 1066276 1097490 1130652 1167120 1206678 1248747 1293464 1341103
63906 1341103 1391353 1443975 1499698 1559479 1622945 1688504 1755550 1826104 1903699 1990683 2087068
63895 2087068 2192141 2306669 2433042 2573492 2728872 2899501 3086783 3293531 3522668
63886 3522668 3775773 4052919 4353865 4679171 5029573 5403814 5797503 6204930 6621917
63877 6621917 7045874 7472846 7895614 8305313 8693780 9053385 9375750 9652511 9877448
63868 9877448 10046834 10158016 10209092 10199927 10131822 10005635 9821593 9581744 9291617 8958858
63858 8958858 8591405 8197818 7787840 7370611 6952262 6536355 6126593 5728156 5346397
63849 5346397 4985184 4646577 4331337 4039498 3771019 3526106 3304658 3105430 2926097
63840 2926097 2763988 2616554 2481631 2357980 2245301 2143069 2049545 1962593 1881190 1805414
63830 1805414 1735315 1670757 1611996 1559032 1510312 1463470 1417783 1374721 1335666 1300382 1268401
63819 1268401 1240543 1217733 1199217 1183365 1169776 1159296 1152271 1148070 1146386 1147759 1152517 1160150
63807 1160150 1170082 1182383 1197319 1214786 1234452 1255988 1278901 1302632 1326941 1351714 1376180
63796 1376180 1398950 1419141 1436875 1452311 1464803 1473580 1478746 1480886 1479969 1475464 1467401 1456422 1442608
63783 1442608 1425029 1402925 1376830 1348046 1317371 1284874 1250561 1214602 1177027 1137991 1098565
63772 1098565 1060572 1025135 991697 958833 925689 892303 859094 826828 796842 770268 746804
63761 746804 724997 704069 684823 668282 654020 640506 626802 613354 601280 591414 583755 577260
63749 577260 570285 561873 552680 544105 536548 529214 521670 514720 509259 504974 500905 496839 493285 490182
63735 490182 486542 481723 476423 471923 468615 465662 461947 457025 451351 446016 442148 440024 438596 436342
63721 436342 432835 429149 426439 424542 422438 419805 417463 416355 416761 418610 421841 425942 429494 430798
63707 430798 429180 425712 422651 421881 423456 425595 426450 425814 424686 423461 421533 418879 416891 416882 418604 421081
63691 421081 424123 427834 431152 432400 431418 429978 429785 431016 433150 436108 439937 444164 448291 452570 457646
63676 457646 463772 470779 478458 486452 494096 500896 507008 512824 518371 523590 529029 535657 543971 553575
63662 553575 563626 573315 582014 589334 595184 599570 602310 603093 601917 599433 596790 594926 593724 592001
63648 592001 588791 584636 581030 578492 576003 572755 569626 568056 568073 568544 569121 570613 573193 575557 576667
63633 576667 577558 580393 585914 592589 598273 602154 604950 607673 610551 613015 614484 614989 615033 615027 615185 615946
63617 615946 618017 621663 626196 630612 634644 638696 642772 646143 648500 650870 654604 659498 663717 665874
63603 665874 666567 667277 668136 667581 664194 658221 651108 644101 637660 631760 626217 620715 614851 608222 600623
63588 600623 592511 585305 580655 579022 579304 580192 581481 583497 585696 586818 586596 586657 589330 595821 605653
63573 605653 617445 629872 641993 653067 662479 670305 677996 687892 701414 717847 735480 753835
63561 753835 774197 797920 824841 853571 882821 912286 942701 975202 1010179 1046657 1083355
63550 1083355 1120446 1159476 1201128 1243703 1284288 1320765 1352141 1377729 1397122 1410780 1419718
63539 1419718 1424511 1425244 1422359 1416840 1409550 1400954 1391527 1381673 1371051 1358512 1343062 1324604 1303735
63526 1303735 1281240 1257902 1234303 1210664 1187238 1164963 1145278 1129038 1115898 1104817 1094867
63515 1094867 1085649 1077581 1071987 1070335 1073002 1079035 1087234 1096910 1107438 1117856 1127562 1136995 1147005
63502 1147005 1157744 1168706 1179785 1191875 1206390 1224310 1245515 1268864 1293250 1318867 1347228
63491 1347228 1379742 1416575 1456994 1500299 1546005 1593440 1641365 1687426 1727768 1758259 1777175
63480 1777175 1786313 1788775 1786181 1778917 1768211 1756291 1744467 1732462 1719791 1706411 1691629 1673803
63468 1673803 1651944 1626603 1598504 1567293 1532513 1494954 1456052 1416584 1376885 1337719 1299879
63457 1299879 1263410 1228274 1195296 1165263 1137414 1110233 1083780 1059877 1039629 1021987 1005290
63446 1005290 989164 974134 960306 947501 936089 926597 918603 911005 903495 896905 891799 887376 882344
63433 882344 876566 871292 867813 866313 866070 866279 866420 866316 866411 867841 871544 877156 883295 889085 894700 900160
63417 900160 904450 906760 907987 909814 912303 913574 912138 908539 904199 899535 894069 887716 880878 873497
63403 873497 865130 856168 848095 842003 837445 833325 829564 827201 826949 828413 830972 834792 840427 847793
63389 847793 856229 865516 876054 887882 900302 913050 927181 943908 962862 982481 1002291 1023859
63377 1023859 1049027 1077938 1109522 1143394 1180051 1218847 1256694 1289778 1316682 1339271 1360397
63366 1360397 1381446 1402654 1425052 1450654 1480399 1513098 1547293 1583418 1623002 1666062 1710423
63355 1710423 1753560 1794041 1830907 1862656 1887499 1904225 1912507 1912969 1907290 1897668 1885636 1871560
63343 1871560 1855366 1837195 1817204 1795465 1772364 1748300 1722424 1692573 1657425 1618303 1578042
63332 1578042 1538501 1500181 1463808 1430874 1402172 1376781 1353104 1330498 1309587 1291379 1276417
63321 1276417 1264592 1255607 1249650 1247389 1248935 1253068 1258206 1264239 1272778 1285304 1301579 1320129 1339805
63308 1339805 1360424 1382262 1405435 1429758 1454983 1481160 1508845 1538780 1571366 1606695 1645002
63297 1645002 1686433 1729983 1773158 1813306 1849180 1880704 1907411 1927909 1941172 1947738 1948979 1945404
63285 1945404 1936360 1921579 1902455 1881281 1859377 1836399 1811390 1783932 1754115 1721956 1687407
63274 1687407 1650773 1612701 1573862 1534948 1496794 1460096 1425046 1391721 1360781 1333243 1309397
63263 1309397 1288480 1269876 1254238 1242694 1234745 1227353 1216582 1200350 1179608 1156944 1134295 1112120
63251 1112120 1090411 1069705 1050693 1033240 1016532 1000261 985192 972316 961737 952631 944138 936025
63239 936025 928522 921682 915010 907705 899344 890313 881509 873559 866270 858755 850144 840319 830123 820690
63225 820690 812491 805108 798010 791250 785169 779612 773983 768137 762876 759197 757091 755239 752065 747159
63211 747159 741700 737505 735640 735840 736826 736926 734950 731333 728377 728388 731155 734032 734918 734381 734234 734997
63195 734997 735916 736948 739294 743873 750384 758010 766095 773914 780825 787266 794937 805336 818317 832320
63181 832320 845805 858466 871461 886391 903664 922051 940450 959759 981895 1006975 1032739
63170 1032739 1057167 1080541 1104377 1129386 1155238 1181410 1207269 1232038 1255721 1279634 1305070
63159 1305070 1331697 1358099 1383577 1408513 1433034 1456316 1477442 1496373 1513738 1529839 1543921
63148 1543921 1554423 1560148 1561157 1558140 1551018 1538978 1522123 1502121 1480716 1458543 1436173 1415375
63136 1415375 1398112 1384707 1374115 1365674 1359577 1355911 1354365 1354868 1357647 1362619 1369535 1378560 1389948
63123 1389948 1403319 1418074 1434305 1452350 1471697 1491385 1511310 1531965 1553001 1573413 1593332
63112 1593332 1614222 1636756 1659573 1680711 1699354 1715662 1729706 1741135 1749162 1752495 1750066 1742281
63100 1742281 1730645 1715641 1695768 1669320 1636501 1599253 1559676 1519224 1478796 1438915 1400063
63089 1400063 1363119 1328965 1297437 1267504 1238896 1212792 1190425 1171760 1156044 1142864 1131976
63078 1131976 1122799 1114741 1107504 1100713 1094097 1088481 1085529 1085688 1087454 1089511 1092507 1097580 1104247 1111179
63064 1111179 1118187 1125889 1134080 1142110 1150333 1159360 1168169 1174897 1179604 1184351 1190193 1195821 1199716 1202074
63050 1202074 1203838 1205261 1206327 1207457 1208857 1210056 1210870 1211934 1213466 1214399 1213763 1212313 1211842 1213247 1216134
63035 1216134 1219967 1224722 1230406 1236528 1242162 1246438 1249236 1251541 1254661 1258787 1262648 1264828 1265120 1264608
63021 1264608 1264928 1267363 1271814 1276509 1279666 1281727 1284976 1290583 1297270 1303545 1309968 1318045 1327922 1338609
63007 1338609 1349852 1362316 1376239 1391395 1408336 1428354 1452006 1478668 1507708 1539165 1573187
62996 1573187 1609811 1649498 1692941 1739979 1789401 1840039 1891500 1943868 1997590 2053628 2112544
62985 2112544 2173084 2232852 2290887 2348508 2406886 2465036 2521322 2575971 2630440 2684628 2736428
62974 2736428 2784394 2829427 2872961 2914385 2951264 2981779 3005999 3024609 3037081 3041476 3035830 3019467
62962 3019467 2993183 2958566 2917262 2870563 2819325 2764214 2706168 2646783 2588244 2532818 2482223
62951 2482223 2437188 2397498 2362609 2332501 2308062 2290639 2281272 2280200 2286744 2299409 2316410 2336543
62939 2336543 2359680 2386374 2417152 2452181 2491067 2532418 2573977 2613951 2652410 2690793 2729823
62928 2729823 2768358 2804490 2837304 2867103 2894041 2916921 2933439 2941582 2940787 2931744 2915129 2890799
62916 2890799 2858213 2817047 2767014 2707828 2640398 2567760 2493558 2419373 2344623 2269381 2195868
62905 2195868 2126182 2059620 1993744 1927821 1863941 1804645 1750388 1699539 1650125 1601308 1553746
62894 1553746 1508807 1467221 1428496 1391892 1357563 1326081 1297064 1269221 1241781 1214995 1189106
62883 1189106 1163916 1139853 1118351 1100193 1084142 1068325 1052667 1038776 1027390 1017030 1005733
62872 1005733 993409 981773 972247 964617 957771 951204 945309 940377 935903 931234 926537 922399 918405
62859 918405 912991 905404 897270 891214 887957 885642 882226 877579 872745 868079 863191 858243 853994 850404
62845 850404 846285 840938 835419 831488 829756 829573 830437 832607 836234 840608 844671 847945 850685 853380 856320
62830 856320 859424 862319 864792 867300 870727 875337 880198 883936 885930 886476 885991 884531 882131 879128 875912
62815 875912 872576 868999 865101 860830 856058 850774 845422 840816 837534 835353 833433 831155 828696 826591
62801 826591 824725 822120 817917 812365 806627 801790 798395 796654 796435 796912 796838 795677 794225 793734 794533 795823
62785 795823 796635 796581 795765 794469 793058 791733 790209 787997 785273 783132 782671 784079 786909 790796 795324
62770 795324 799483 802209 803659 805228 807959 811553 815326 819424 824334 829691 834453 838201 841505 845171
62756 845171 849902 856497 865262 874935 883293 889488 894978 901463 908652 915085 920753 927798 938345 952224
62742 952224 966979 979929 990331 999875 1010924 1024175 1038429 1052851 1068615 1087550 1109871 1134389
62730 1134389 1160536 1188888 1219789 1252893 1288415 1327624 1371494 1419829 1472215 1528849 1589830
62719 1589830 1654588 1722791 1794886 1870794 1948868 2027268 2105733 2184674 2262868 2337416 2405926
62708 2405926 2467438 2521030 2564801 2596777 2615945 2621877 2614204 2593138 2560016 2516690 2464648 2405061
62696 2405061 2339217 2268494 2194223 2117937 2041328 1965568 1891041 1818170 1748077 1681863 1619601
62685 1619601 1560753 1505400 1454281 1407575 1364379 1323692 1285408 1250034 1217984 1189559 1165204
62674 1165204 1145080 1128444 1114034 1101083 1089438 1078624 1067711 1056772 1047915 1043698 1044372 1047492
62662 1047492 1050536 1053124 1056298 1060677 1066464 1074651 1086644 1102407 1120169 1138556 1158195 1180570
62650 1180570 1206046 1233901 1263853 1296515 1332399 1371336 1413173 1458482 1508291 1563357 1623821
62639 1623821 1689270 1758982 1832298 1908806 1988106 2069565 2152589 2236916 2322069 2406448 2487424
62628 2487424 2562424 2629544 2687042 2732886 2765224 2782952 2785525 2772770 2745413 2705309 2654353
62617 2654353 2593302 2522546 2444063 2361644 2278522 2195299 2110782 2024553 1938157 1854053 1774137
62606 1774137 1699337 1629899 1565577 1505835 1450286 1398912 1351673 1307999 1266916 1227819 1191133
62595 1191133 1158154 1129983 1106230 1084757 1063119 1040537 1018405 998718 982225 968252 955824
62584 955824 944481 934125 924781 916724 910412 905894 902408 898782 894228 888742 882950 877739 873840 871462
62570 871462 870253 869716 869562 869628 869500 868492 866161 862897 859864 858115 857699 857774 857785 858330 860546 864733 869997
62553 869997 875301 880465 885897 891796 898050 904704 912024 920041 928443 937205 947166 959718 975748 994871
62539 994871 1015772 1037483 1060270 1085214 1113033 1143562 1176249 1210664 1246301 1282366 1318212
62528 1318212 1353781 1389205 1423992 1456719 1485350 1507793 1522717 1530380 1532314 1529608 1521691 1507476
62516 1507476 1487462 1463839 1438513 1411843 1383430 1353184 1321197 1287441 1252313 1216891 1182087
62505 1182087 1148122 1115426 1085276 1058563 1034467 1011567 990031 971437 956351 943313 930666
62494 930666 918311 907114 897535 889625 883602 879475 876530 874030 872060 870892 869910 868251 866357 865766
62480 865766 867150 869696 872894 877829 885622 895120 903273 908019 910151 912324 916900 925028 937014 952569
62466 952569 970498 988845 1006070 1022361 1039552 1059645 1083527 1111130 1142358 1177285 1215551
62455 1215551 1256301 1299047 1344132 1391938 1442081 1493998 1548086 1605288 1665244 1725466 1782927
62444 1782927 1836232 1885755 1931892 1973801 2009998 2039663 2062964 2080431 2092558 2100181 2104926 2109062
62432 2109062 2114908 2124284 2138182 2156578 2178583 2203066 2229450 2258097 2290060 2326364 2367002 2410108
62420 2410108 2452110 2489159 2518728 2539882 2552308 2555684 2550010 2535645 2512229 2477931 2430761 2370911
62408 2370911 2301345 2225870 2146974 2065592 1982396 1898761 1816698 1738210 1664734 1596936 1534962
62397 1534962 1478849 1428573 1383753 1343699 1307934 1276380 1248810 1224466 1202570 1182955 1165744
62386 1165744 1150618 1136937 1124569 1114053 1105848 1099832 1095668 1093144 1091856 1090913 1089391 1086910 1083481
62373 1083481 1079042 1073538 1067377 1061321 1055789 1050428 1044430 1037164 1028555 1019174 1010008 1001824 994528 987251
62359 987251 979192 970320 961200 952265 943437 934388 925053 915954 908112 902487 899217 897356 895563 893137
62345 893137 890388 888107 886936 887201 888913 891604 894412 896789 899140 902516 907715 914948 924207 935224
62331 935224 946794 956919 964523 971000 979285 991148 1005782 1021073 1035625 1049288 1062454 1075710
62319 1075710 1090009 1106413 1125323 1146226 1168152 1190196 1211872 1233625 1256994 1283568 1313424
62308 1313424 1345105 1377509 1411324 1448301 1489673 1535837 1586900 1642400 1700713 1760122 1821051
62297 1821051 1886372 1958690 2037589 2119919 2202233 2282282 2358618 2429769 2493931 2548922 2592420
62286 2592420 2623014 2641342 2649669 2649936 2642449 2626589 2602316 2570537 2532360 2488518 2439506 2385939
62274 2385939 2328850 2270007 2211844 2156491 2104520 2054840 2006131 1958292 1912320 1868887 1827489
62263 1827489 1787181 1747746 1709566 1672336 1634693 1595734 1556601 1519748 1486525 1456047 1426612
62252 1426612 1397563 1369369 1342576 1317597 1295241 1276415 1260946 1247320 1234072 1221167 1209778
62241 1209778 1201003 1195075 1191459 1189204 1187274 1185115 1183162 1182580 1184139 1187313 1190683 1193413 1196248 1200806
62227 1200806 1207817 1216339 1224878 1232965 1241273 1250504 1260871 1272580 1285895 1300215 1313931 1326176
62215 1326176 1338547 1354098 1374470 1398608 1424401 1450784 1477833 1505739 1534831 1566542 1603220
62204 1603220 1646258 1694637 1745787 1798041 1852122 1910278 1974162 2043721 2118081 2197026 2280975
62193 2280975 2369276 2459004 2545955 2626743 2699589 2763410 2817006 2859370 2890093 2908940 2915434
62182 2915434 2909364 2891359 2862417 2823088 2773785 2715705 2650686 2580177 2505239 2427814 2351067
62171 2351067 2277648 2207972 2140822 2075395 2012213 1952380 1896738 1845771 1799629 1757922 1719866
62160 1719866 1684832 1652571 1622937 1595826 1571441 1550202 1532175 1516917 1503967 1493071 1483777
62149 1483777 1475419 1467954 1462383 1459668 1459299 1459602 1459736 1460957 1465508 1474321 1486038 1498344 1509999 1521351
62135 1521351 1532996 1544556 1555315 1565834 1578144 1593955 1613053 1633813 1654905 1676002 1697095
62124 1697095 1717896 1738183 1758235 1778441 1798482 1817225 1833651 1847890 1861165 1874581 1888176
62113 1888176 1901642 1915916 1933285 1955446 1982019 2011681 2044328 2081156 2122690 2167871 2215453
62102 2215453 2265236 2317073 2369181 2418347 2461630 2497227 2524003 2541243 2549251 2549409 2542894 2529464
62090 2529464 2507969 2478138 2441577 2400866 2357776 2312595 2265200 2216458 2168084 2121120 2075226
62079 2075226 2029912 1986052 1945365 1908540 1874665 1842778 1813210 1786928 1764223 1744761 1728464
62068 1728464 1715207 1703622 1691400 1677584 1663961 1653293 1646275 1640978 1635410 1629908 1626659 1627349 1631770
62055 1631770 1638374 1645572 1652647 1660143 1669568 1682068 1696873 1711262 1722429 1729210 1731845 1730716 1726215
62042 1726215 1719741 1713699 1709865 1708088 1706854 1704624 1700177 1692394 1680830 1666641 1652234 1639711 1630002
62029 1630002 1623408 1620185 1620246 1622957 1627887 1635395 1646060 1659893 1676678 1696613 1719768 1745111 1771162
62016 1771162 1797828 1826594 1858404 1892206 1926379 1960874 1996820 2034257 2071502 2107060 2141284
62005 2141284 2175684 2211201 2247563 2283715 2318150 2349152 2375414 2396492 2412354 2422716 2427152
61994 2427152 2425546 2417897 2403925 2383466 2357005 2325001 2286904 2242007 2191512 2138524 2085239 2031129
61982 2031129 1974922 1917567 1861786 1809056 1758555 1709308 1661874 1617234 1575271 1535515 1498740
61971 1498740 1466569 1439523 1416285 1394982 1374631 1355362 1337793 1322257 1308186 1294190 1279152
61960 1279152 1263311 1247847 1233397 1219416 1205094 1190348 1175663 1161385 1147624 1134745 1123523
61949 1123523 1114673 1108195 1103236 1098783 1094704 1092027 1091931 1094606 1099372 1105696 1113423 1121898 1129547 1134818
61935 1134818 1137408 1138309 1138895 1139946 1141042 1140512 1136368 1127780 1115603 1101272 1085536 1068610 1051195
61922 1051195 1034691 1020283 1008067 997102 986232 975184 965136 957873 953967 952066 950398 948600
61910 948600 947401 946822 945839 943985 942268 941902 942879 944532 947068 951617 958807 967986 977918 987686 996862
61895 996862 1005540 1014681 1025953 1040480 1057774 1076405 1095820 1116983 1141097 1168268 1197927 1230097
61883 1230097 1265491 1304533 1347022 1392769 1441640 1492681 1544059 1594555 1644509 1694678 1744744
61872 1744744 1793830 1841915 1889501 1935881 1978889 2016727 2049125 2076411 2098330 2114389 2124584
61861 2124584 2129098 2127871 2121401 2111764 2101955 2094016 2088198 2083991 2081574 2082143 2087104 2097161 2112150 2131692
61847 2131692 2155760 2184189 2215536 2246793 2274601 2296725 2312495 2322330 2327076 2327268 2322421 2311230
61835 2311230 2293002 2268888 2241361 2212432 2182577 2151315 2118580 2085481 2053725 2024104 1995624
61824 1995624 1966568 1936509 1906692 1878119 1850011 1820933 1790894 1761298 1733055 1705868 1679598
61813 1679598 1655280 1634203 1616659 1602229 1590867 1583077 1579220 1579172 1582561 1588943 1597846 1609175 1623733
61800 1623733 1643057 1668441 1700100 1737306 1779351 1826348 1879139 1938415 2003929 2074497 2148605
61789 2148605 2224891 2302186 2379443 2455797 2530589 2603047 2671794 2734712 2789515 2834626 2869489
61778 2869489 2893988 2907916 2911501 2906319 2895009 2879782 2861836 2842695 2825458 2813647 2808709 2809411
61766 2809411 2813939 2821988 2834220 2849941 2865975 2878128 2883672 2882125 2873725 2857674 2832444 2797463
61754 2797463 2753542 2701546 2641781 2575413 2505463 2435012 2364761 2293673 2221919 2151743 2085054
61743 2085054 2021565 1960222 1901453 1846820 1796841 1750317 1705845 1663151 1622744 1584855 1549153
61732 1549153 1515229 1482972 1452388 1423276 1395366 1368851 1344579 1323440 1305654 1290845 1278503
61721 1278503 1267954 1258136 1248169 1238199 1229058 1220944 1213174 1205544 1199217 1195584 1194627 1194984 1195462 1196051 1197596
61706 1197596 1200990 1206847 1215571 1227384 1241946 1257933 1273529 1287905 1301936 1316655 1331018 1342103
61694 1342103 1347757 1348341 1345669 1341112 1335180 1327962 1319126 1308077 1295008 1281385 1268621 1256583 1244056
61681 1244056 1230354 1215845 1201305 1187575 1175537 1165532 1156800 1148218 1139669 1132199 1126892 1124035
61669 1124035 1123047 1122604 1121137 1118055 1114550 1112625 1113169 1115331 1117565 1118862 1119250 1119621 1120836 1122551 1123367
61654 1123367 1122663 1121498 1120778 1119303 1115062 1108051 1100112 1092043 1082697 1071437 1059756 1049484 1040597 1031782
61640 1031782 1022224 1011895 1000949 989860 979545 970348 961352 951511 940969 930488 920148 909698
61628 909698 899886 892308 887781 885496 883680 880568 875103 867710 860438 855445 853008 851570 849807 847901
61614 847901 846503 845233 843029 839753 836710 835353 835844 837217 838740 840659 843458 846962 850665 854660
61600 854660 859487 865027 870252 874399 877802 881314 885469 890529 896701 903738 910877 917817 925317 934032
61586 934032 943176 951261 958004 964592 971902 979380 985955 991327 995826 999515 1002084 1003433 1003834 1003464 1002089
61571 1002089 999386 995403 990547 985135 979143 972510 965511 958550 951604 944245 936318 928345 921182 915514
61557 915514 911639 909234 907178 904181 899996 895573 891581 887216 880948 872107 861181 848942 835938
61544 835938 822684 809659 797204 785857 776452 769159 762710 755590 748046 741937 738219 735384 730887
61531 730887 723616 714632 706057 699633 695837 693771 692087 690238 688611 687415 686149 684533 683231 682855
61517 682855 682633 680993 677403 672949 669089 666539 665514 666230 668621 671967 675404 678683 682026 685323 687898
61502 687898 689125 688994 688030 687067 687233 689678 694713 701116 706690 709753 710195 709267 708670 709761 713070 718094
61486 718094 723562 728114 730987 732229 732559 732926 733881 735178 736251 737130 738616 741432 745522 750388 755689
61471 755689 761225 766589 771244 774770 776841 777322 776653 775649 774514 772516 769312 766082 764380 764001 763074
61456 763074 760414 756844 753879 752066 751264 751757 754102 758027 762263 765569 767617 768993 770684 773541 777796
61441 777796 782859 787581 790862 792303 792673 793644 796504 800957 805684 810247 815670 822536 829224 833124 833489
61426 833489 832055 830793 830177 830221 831967 836565 843151 849070 852653 854797 857256 860236 862748 864781 867543
61411 867543 871200 873701 872959 869585 866228 864280 862371 858468 852570 846574 841950 838443 835066 831599
61397 831599 828669 826716 825476 824578 824235 825014 827139 830363 834480 839532 845422 851768 858376 865483 873182
61382 873182 880956 888216 895092 902246 909962 917831 925214 931766 937767 944375 953175 964659 977100 987680
61368 987680 994959 999793 1003861 1007975 1011994 1015547 1018265 1019883 1020730 1021825 1023978 1026905 1029533 1030878
61354 1030878 1030308 1027390 1022177 1015598 1008997 1003063 997438 991390 984693 977813 971415 965832 961001 956879
61340 956879 953638 951211 948798 945385 940821 935998 931903 929013 927723 928564 931392 934811 937167 937972 937927
61325 937927 937848 938163 939207 941177 943686 945964 947759 949734 952891 957957 965273 974704 985447 996328
61311 996328 1006608 1016292 1025556 1034184 1041713 1047823 1052408 1055654 1058343 1061819 1067123 1074208 1082195 1090380
61297 1090380 1098682 1107251 1116143 1125550 1135943 1147617 1160336 1173827 1188511 1205156 1223648 1242636
61285 1242636 1260754 1277741 1293889 1308876 1322045 1333706 1345068 1356462 1366521 1373812 1378621 1382230
61273 1382230 1384824 1385200 1382562 1377523 1370936 1362617 1352022 1339786 1327824 1317863 1310250 1304126 1298366
61260 1298366 1292286 1285842 1279436 1273583 1268772 1265569 1264478 1265391 1267428 1269798 1272710 1276929 1282490 1288576
61246 1288576 1294929 1302530 1312297 1323711 1335665 1348045 1361160 1373548 1381847 1383764 1380362 1374755 1369196
61233 1369196 1364084 1358910 1352899 1345116 1335226 1324240 1313584 1303549 1293727 1284869 1278822 1276042 1274494
61220 1274494 1272028 1269151 1268379 1271278 1277044 1283861 1290831 1298502 1308019 1319931 1333652 1348223 1363536
61207 1363536 1380293 1398553 1417135 1435040 1452888 1472076 1492992 1515026 1538061 1562712 1588860
61196 1588860 1614937 1639042 1660102 1677671 1691448 1701590 1708843 1713629 1715317 1713035 1706945 1698102
61184 1698102 1687162 1673964 1658433 1641278 1623383 1605017 1586200 1567675 1550849 1536554 1524183
61173 1524183 1512393 1500506 1488954 1478536 1469638 1462228 1456247 1451805 1449127 1448241 1448375 1447684 1444290 1438169
61159 1438169 1431612 1427184 1425259 1424065 1421984 1419055 1416151 1413564 1411067 1408796 1407256 1406559 1406397 1406796 1408080
61144 1408080 1409830 1410723 1410159 1409642 1411709 1417558 1426469 1437397 1450131 1464697 1480746 1498280 1518121
61131 1518121 1540530 1563687 1584577 1601417 1614515 1624872 1632803 1638106 1640870 1641811 1642212 1643359 1645370
61118 1645370 1646615 1645148 1640861 1635496 1630462 1625614 1620336 1614580 1608198 1600343 1590550 1579638 1568512
61105 1568512 1556580 1542386 1525480 1506706 1487040 1467238 1448446 1431816 1417184 1403158 1389000
61094 1389000 1375695 1364670 1356150 1349417 1344116 1340393 1337844 1335198 1331459 1326916 1322511 1318348 1313321
61081 1313321 1306298 1297144 1286342 1274146 1260790 1247287 1235247 1225763 1218983 1214760 1213031 1213417 1215230
61068 1215230 1218351 1223581 1231671 1242413 1255089 1269339 1285072 1301853 1318948 1335933 1353069 1371296
61056 1371296 1391933 1415871 1442706 1470910 1499039 1526488 1553094 1578669 1603182 1626718 1648965
61045 1648965 1669337 1687883 1705283 1721507 1735180 1744736 1749435 1748832 1742411 1730683 1715765 1699650
61033 1699650 1682363 1662842 1641167 1618770 1596714 1574889 1552890 1530795 1509024 1488119 1468648
61022 1468648 1450855 1434469 1419241 1405306 1392722 1381323 1371551 1364576 1360689 1358375 1356107 1354492
61010 1354492 1355357 1359121 1364303 1369509 1374714 1380710 1388458 1399000 1412947 1429742 1448041 1466835 1485808
60997 1485808 1505109 1525559 1548649 1575395 1605499 1638277 1673890 1712752 1754481 1798644 1846071
60986 1846071 1898271 1955937 2019031 2087669 2161598 2239312 2319097 2400638 2484534 2570945 2659958
60975 2659958 2752405 2848804 2948370 3050688 3157312 3269709 3386777 3506853 3631260 3762959
60965 3762959 3902411 4047962 4200129 4362104 4535678 4719899 4914324 5120577 5340053
60956 5340053 5573270 5822373 6091112 6381463 6693511 7029802 7396373 7798005 8235853
60947 8235853 8711587 9230942 9802149 10435105 11144293 11948599 12865839 13911412 15104643
60938 15104643 16471342 18036733 19820564 21841550 24119002 26667347 29502933 32662402
60930 32662402 36178690 39977544 43773485 47113633 49599847 51115575 51850927 52125538
60922 52125538 52209434 52290302 52514588 52944475 53434106 53603147 53017835 51452329 48999484
60913 48999484 45957749 42636997 39253080 35936124 32769173 29802476 27058085 24544427
60905 24544427 22268009 20229855 18419532 16819836 15413803 14183175 13104489 12152377
60897 12152377 11305780 10548629 9867120 9249643 8687726 8174207 7701524 7263494 6857105
60888 6857105 6480793 6132616 5811585 5518349 5252110 5008362 4781715 4569343 4369676
60879 4369676 4179718 3996572 3820624 3654508 3499482 3354822 3219969 3094868 2978551
60870 2978551 2869556 2767587 2673028 2585168 2502738 2425820 2355249 2290257 2228707 2169874 2115165
60859 2115165 2065724 2020952 1979821 1942109 1907585 1875237 1844188 1814629 1787153 1761745 1738000
60848 1738000 1715854 1695578 1677272 1660720 1645625 1631743 1618729 1605800 1591749 1575766 1558381
60837 1558381 1541040 1524373 1507404 1489032 1469834 1451681 1435699 1421106 1406068 1389330 1371111
60826 1371111 1352748 1335413 1319073 1302850 1286242 1269533 1252997 1236389 1219425 1202149 1184529
60815 1184529 1166388 1148024 1130233 1113396 1097254 1081974 1068562 1057683 1048816 1041173 1034664 1029290
60803 1029290 1024408 1019536 1015211 1012120 1009865 1007645 1005886 1006211 1009695 1015688 1022238 1027321 1030032 1031081
60789 1031081 1031926 1033168 1034265 1034961 1036064 1038167 1040554 1042259 1043385 1044266 1043968 1040985 1035243 1028282 1021521
60774 1021521 1015348 1009888 1005552 1002483 1000092 997464 994005 989836 985956 983620 982925 982234 979649 974934
60760 974934 969429 964353 959851 955474 950864 946035 941551 938183 935705 932258 925769 915987 904467 892691
60746 892691 881105 870089 860808 854365 850446 847352 843445 838386 832915 827638 822444 817308 813020 810213
60732 810213 807933 804450 799705 795698 793830 793124 791873 789837 787704 785514 783126 781398 781229 781964 782338
60717 782338 782584 783847 785817 786999 787538 789672 794565 800363 804475 806525 807981 809914 812392 815399 819075
60702 819075 823132 826841 829566 830954 830959 830165 829760 830622 832600 834946 837015 838122 837335 834273 830048 826580
60686 826580 824780 823896 822804 821391 820247 819336 817604 814014 808519 801747 794125 785828 777505 770444 765625
60671 765625 762686 759970 755693 749442 742895 738680 737874 738742 738647 737013 735383 734676 733822 731673 728894 726941
60655 726941 726174 726053 726335 726902 727149 726958 727741 730928 735675 739592 741851 744153 748324 754266 760729 766879
60639 766879 772346 776625 779446 781492 784024 787676 791756 794817 796157 796853 798868 802795 807095 810141
60625 810141 812300 814946 818011 820002 820439 820886 823152 827485 832808 837829 841599 843941 845754 848060 850377
60610 850377 850868 848572 844609 840570 836398 830708 822919 814430 807627 803769 801691 798679 793069 785964
60596 785964 779968 776394 774351 772446 770440 768996 768672 769529 771114 772476 772744 772073 771546 771855 772427 772035
60580 772035 769937 766394 762418 759048 756543 754421 752611 752001 753122 754856 755594 755407 755786 757301 758924
60565 758924 759798 760301 760949 761535 761918 762502 763370 764016 764441 765450 767299 769213 770895 773261 776823 780550
60549 780550 783374 785816 788916 792418 795330 797592 799890 802238 804167 806115 809405 814628 820928 827064
60535 827064 832584 837883 843556 849733 855887 861528 867140 873804 881552 888811 894034 897367 900191 903737
60521 903737 908756 915676 924021 932099 938331 942835 947122 952567 959713 968542 978690 989861 1002727
60508 1002727 1018774 1038390 1059753 1080803 1101954 1125509 1152553 1181649 1210650 1238421 1264295
60497 1264295 1286888 1304351 1315455 1320074 1318972 1313598 1306064 1298979 1294805 1294711 1297839 1302229 1306898 1312682
60483 1312682 1320918 1332046 1345963 1362914 1383264 1407087 1434933 1468286 1508142 1553674 1603637
60472 1603637 1658609 1720108 1787276 1855898 1921223 1980612 2032972 2076870 2110338 2132049 2141828
60461 2141828 2140296 2128638 2108669 2082703 2053126 2021921 1990434 1959671 1930925 1905721 1884758
60450 1884758 1867419 1853042 1842422 1837288 1838497 1845653 1858327 1876644 1900560 1929744 1964652 2006830
60438 2006830 2057652 2117348 2185649 2262373 2346568 2435712 2526833 2618305 2709637 2799342 2883698
60427 2883698 2958135 3019710 3068093 3104636 3131258 3150478 3165805 3181070 3199046 3220937 3246730
60416 3246730 3274925 3301610 3320904 3327183 3316653 3286804 3235839 3163761 3073158 2967728 2850676
60405 2850676 2725675 2598246 2473985 2355437 2242377 2135169 2035902 1945853 1863788 1787863
60395 1787863 1717860 1654624 1598422 1548868 1505472 1467245 1432429 1399605 1368544 1339433 1312001
60384 1312001 1286111 1262326 1241030 1221687 1203778 1187728 1174021 1162073 1150989 1140780 1131869
60373 1131869 1124037 1116917 1110870 1106098 1101328 1094797 1086335 1077248 1068407 1059857 1052151 1046306 1041977 1037206
60359 1037206 1030759 1023636 1017538 1012808 1008793 1005365 1002984 1001578 1000356 998719 996787 995067 994018 993839
60345 993839 994351 995258 996818 999923 1005001 1011015 1016124 1019433 1021677 1024111 1027057 1029766 1031450 1032197 1032935
60330 1032935 1034774 1038404 1043752 1049873 1055302 1059105 1061775 1064674 1068351 1071868 1074256 1075990 1078266 1081160
60316 1081160 1083653 1085416 1087511 1090955 1095542 1100539 1105571 1110223 1113704 1115820 1117656 1120291 1123375 1125918
60302 1125918 1128040 1130785 1134521 1138888 1144290 1152001 1162381 1174104 1185697 1196845 1207778 1218548
60290 1218548 1229671 1242406 1257270 1272866 1287155 1299389 1309959 1318956 1325979 1330854 1333299 1332237
60278 1332237 1326970 1319044 1311463 1305510 1299497 1291239 1280792 1270025 1260365 1251858 1243912 1236097 1228402
60265 1228402 1221307 1215422 1210649 1205978 1200555 1194702 1189521 1185721 1183216 1181657 1181062 1182109 1185895 1192893
60251 1192893 1201997 1211402 1220961 1233027 1250273 1273232 1300609 1331176 1364143 1398180 1431675 1464099
60239 1464099 1495682 1525257 1549609 1565799 1573329 1573197 1565528 1549237 1523953 1491462 1455056 1417793
60227 1417793 1381304 1345853 1311415 1278820 1249751 1225451 1205660 1189110 1174810 1162415 1151502
60216 1151502 1141197 1130868 1120794 1111731 1103884 1096534 1088623 1079591 1069837 1060643 1053529 1049236 1047099
60203 1047099 1045560 1043412 1040437 1036954 1033273 1029831 1027284 1025832 1024643 1022666 1020068 1018244 1018193 1019448
60189 1019448 1020909 1022284 1024237 1027341 1031285 1035074 1037823 1039452 1040684 1042197 1043847 1045053 1045897 1047317
60175 1047317 1050046 1054008 1058972 1065110 1072408 1080146 1087589 1094800 1102145 1109487 1116592 1123874 1131809 1139851
60161 1139851 1146884 1152752 1158482 1164977 1172315 1180403 1189387 1199123 1209068 1219023 1229276 1239656 1249191
60148 1249191 1257229 1264306 1271353 1278644 1286115 1294109 1302937 1311885 1319536 1325101 1328860 1331332 1332692 1333215
60134 1333215 1333717 1335036 1337229 1339460 1340611 1340012 1337855 1335074 1332604 1330640 1328788 1326951 1325707 1325516 1325952
60119 1325952 1326134 1325730 1324984 1323963 1322560 1321383 1321760 1324337 1328279 1332473 1336876 1341919 1347123 1351410 1354498
60104 1354498 1356770 1357821 1356497 1352605 1347309 1341365 1334347 1326445 1319696 1316055 1314986 1314284 1312875 1311586
60090 1311586 1311490 1312780 1315287 1318976 1323766 1329515 1336191 1343489 1350639 1357395 1364826 1374004 1384152 1393297
60076 1393297 1400608 1406852 1412556 1417208 1420615 1423617 1426884 1430197 1433599 1437962 1443535 1449007 1453149 1456632
60062 1456632 1461048 1466660 1472328 1477454 1482984 1490361 1500104 1511266 1521770 1529628 1534655 1538897 1544546
60049 1544546 1551450 1557446 1561303 1564555 1569893 1578237 1587981 1597052 1605129 1613559 1623323 1633664 1642950 1650423
60035 1650423 1656475 1661279 1664031 1664022 1661924 1659307 1656942 1654030 1649165 1641765 1632497 1622537 1612526 1602083
60021 1602083 1590217 1576217 1560328 1543770 1528034 1513807 1500293 1485851 1469570 1452028 1434201
60010 1434201 1416100 1397180 1377876 1359712 1343568 1328654 1313784 1299215 1286518 1276642 1268683 1260789
59998 1260789 1252025 1242970 1234408 1226001 1217056 1208415 1202327 1199644 1198070 1194401 1188088 1181370 1176260 1172868
59984 1172868 1170691 1169783 1169965 1170234 1170001 1169985 1170942 1172251 1172672 1171944 1170680 1169067 1166603 1162947 1158347 1153274
59968 1153274 1148163 1143397 1139170 1135451 1132226 1129415 1126481 1122864 1119076 1116496 1115381 1113798 1109402 1101872
59954 1101872 1092964 1084780 1078746 1075483 1074297 1072963 1069441 1064121 1059544 1057668 1058173 1059581 1061128 1063024
59940 1063024 1065516 1068427 1071447 1074410 1077215 1079609 1081190 1081727 1081467 1080861 1079935 1078414 1076856 1077130 1080920
59925 1080920 1087743 1095063 1100548 1103837 1105978 1107668 1108504 1107860 1106088 1104553 1104376 1105349 1106250 1106092 1104696
59910 1104696 1102213 1098814 1095194 1092837 1093079 1095898 1099893 1103454 1105885 1107512 1108904 1110030 1110428 1110270 1110711
59895 1110711 1112486 1114506 1114855 1113156 1110941 1109537 1108788 1108168 1107790 1107588 1106784 1105260 1104414 1105385 1107301 1108681
59879 1108681 1109853 1112282 1115835 1118532 1119252 1119226 1120378 1123430 1128124 1134210 1141446 1149415 1158028 1167795 1179099
59864 1179099 1191686 1205263 1219987 1235820 1251789 1266712 1280614 1294856 1310628 1327645 1344520
59853 1344520 1360118 1374101 1386229 1395841 1402511 1406816 1409775 1411768 1412697 1412897 1412915 1412421 1410574 1407638
59839 1407638 1404871 1402364 1398472 1392325 1385573 1380424 1377035 1374206 1371629 1369802 1368526 1367382 1367281 1369610
59825 1369610 1373861 1377889 1380746 1383650 1387858 1393138 1398810 1404920 1411715 1419059 1426913 1435390 1443872 1450950
59811 1450950 1455766 1458661 1460341 1461246 1461822 1462287 1462037 1460464 1458455 1457634 1457862 1457267 1455385 1454380 1455946 1458606
59795 1458606 1459664 1458647 1457025 1455497 1453538 1451323 1450117 1450474 1451531 1452535 1453942 1456452 1459880 1463769
59781 1463769 1468652 1475907 1486110 1497752 1507869 1514230 1516943 1517782 1518219 1518727 1519760 1522148 1525856 1529150
59767 1529150 1529791 1526663 1519737 1509313 1496256 1482457 1469864 1459081 1449749 1442057 1436859 1434287 1433280
59754 1433280 1432799 1432620 1432532 1431589 1428874 1424566 1419623 1414610 1409476 1404343 1399758 1395846 1391722 1386315 1379575
59739 1379575 1372302 1364814 1356573 1347475 1338753 1331812 1326428 1320910 1313953 1305674 1296956 1288627 1281360 1275479
59725 1275479 1270429 1264990 1258261 1250117 1240867 1231364 1223393 1218648 1216782 1215543 1213535 1211877 1212338 1214860
59711 1214860 1218109 1221624 1225921 1230862 1235444 1239363 1243559 1248956 1255732 1264066 1274488 1286812 1299499
59698 1299499 1310876 1320706 1330046 1339849 1350210 1360750 1371188 1381326 1390761 1398856 1405041 1409136 1411307
59685 1411307 1411779 1410798 1408971 1407349 1406785 1407066 1406750 1403955 1397652 1388662 1379490 1372640 1368612 1365719 1362053
59670 1362053 1357395 1352971 1349780 1347683 1345888 1343723 1340963 1337851 1334916 1332509 1330522 1328748 1327351 1326650
59656 1326650 1326659 1327290 1328906 1332119 1336954 1342624 1348292 1353807 1359719 1366956 1376533 1389106 1404451 1421521
59642 1421521 1439196 1456872 1474342 1491427 1507993 1524125 1540046 1555887 1571670 1587375 1602661
59631 1602661 1616477 1627295 1634142 1637479 1638847 1639634 1640360 1641109 1641970 1642530 1641328 1636740 1628759 1619387 1610923
59616 1610923 1604140 1598301 1592399 1585824 1578208 1569479 1560340 1552142 1545783 1540843 1536169 1531415 1527753 1526839
59602 1526839 1529203 1533932 1539863 1546609 1554304 1562996 1572838 1584375 1597710 1611373 1622946 1631140 1636738
59589 1636738 1641119 1644376 1645287 1642678 1636260 1626322 1613165 1596984 1578196 1557806 1537289 1517788 1499322
59576 1499322 1481041 1462262 1443016 1423736 1404998 1387611 1372250 1358613 1345466 1331881 1318025
59565 1318025 1304321 1290323 1275030 1258237 1241145 1225547 1212371 1200754 1188623 1174655 1159846
59554 1159846 1146636 1136413 1128432 1121352 1114868 1109347 1104742 1100817 1097860 1096197 1095266 1094039 1092189 1090068
59540 1090068 1087783 1085352 1083751 1084637 1088455 1093422 1096960 1097833 1096605 1094427 1091939 1089349 1087052 1085702
59526 1085702 1085466 1085518 1084768 1083117 1081365 1079730 1077174 1072859 1067599 1062928 1059087 1055018 1050316 1045958 1042740
59511 1042740 1040029 1036763 1032942 1029306 1026083 1023003 1020359 1019080 1019564 1021106 1022746 1024077 1024995 1025314 1025287
59496 1025287 1026014 1028453 1032065 1035254 1037392 1039749 1044000 1050392 1057954 1066050 1074978 1085157 1096456 1108636
59482 1108636 1122150 1138205 1157766 1180178 1203053 1224504 1245784 1270359 1299113 1327249 1347608
59471 1347608 1356936 1357660 1354021 1348583 1342778 1338333 1336285 1335691 1334895 1333554 1332323 1331185 1329375 1326521 1322663
59456 1322663 1317400 1310182 1301405 1292233 1283212 1273821 1263415 1251931 1239654 1226954 1214355 1202293
59444 1202293 1190688 1179126 1167532 1156372 1146305 1137857 1131184 1125941 1121693 1118782 1118271 1120566 1124561
59431 1124561 1128703 1132427 1135928 1139186 1142174 1145582 1150050 1154767 1158003 1159362 1160559 1163458 1168100 1173199
59417 1173199 1178048 1183089 1188601 1193552 1196367 1196838 1196693 1197818 1200269 1202660 1204174 1205128 1205659 1205266 1204181
59402 1204181 1203852 1205215 1207544 1210027 1213353 1218492 1224902 1231543 1238956 1248497 1259851 1271130 1281443
59389 1281443 1291511 1301481 1309952 1315957 1320394 1324491 1327912 1329438 1328746 1326426 1322741 1317371 1310373 1302712
59375 1302712 1295644 1289781 1284780 1279913 1274998 1270714 1267981 1267404 1269511 1274861 1283274 1293416 1304081 1315701
59361 1315701 1329830 1347296 1367701 1390428 1415116 1441126 1467528 1493852 1520305 1547472 1576406
59350 1576406 1608171 1641607 1671639 1691763 1699106 1696337 1688568 1679679 1671752 1666093 1663561 1664868 1671299
59337 1671299 1683747 1699875 1713403 1717978 1711774 1697711 1679997 1661510 1643713 1627244 1612108 1598233
59325 1598233 1586189 1576884 1570539 1566567 1564503 1564394 1566004 1568062 1568886 1567870 1566233 1565968 1567871 1570753
59311 1570753 1572736 1573060 1572370 1571824 1572588 1575572 1580471 1585208 1587691 1588382 1590024 1594487 1601095 1608464 1616544
59296 1616544 1625878 1636105 1646541 1657645 1670632 1685838 1702433 1719572 1737065 1755194 1774646
59285 1774646 1796423 1821056 1847891 1875591 1903038 1929311 1953206 1973542 1989778 2001918 2010208
59274 2010208 2015460 2019071 2021662 2021785 2016861 2005614 1989195 1969975 1949725 1928811 1906590 1882555
59262 1882555 1857421 1832895 1809851 1786986 1761923 1733745 1703948 1674909 1647835 1622396 1597899
59251 1597899 1574463 1552907 1533612 1515998 1499549 1484893 1472778 1462064 1450185 1436382 1423288
59240 1423288 1414192 1409614 1407839 1408019 1411023 1417430 1426452 1437184 1449582 1463821 1479927 1498433 1519798
59227 1519798 1542134 1560536 1570079 1569381 1560730 1547462 1532190 1516909 1503185 1491754 1482632 1475909
59215 1475909 1471950 1470836 1472302 1476408 1483534 1493379 1504675 1516478 1529215 1543715 1559456 1574498
59203 1574498 1587061 1596526 1602945 1606431 1607362 1606469 1604175 1600224 1594360 1587021 1578944 1570586 1562523 1556014
59189 1556014 1552089 1549944 1547055 1541540 1534269 1528276 1526036 1527373 1530003 1532025 1533659 1536406 1540862 1546049
59175 1546049 1550919 1555582 1560492 1565246 1569088 1572092 1574814 1576887 1576950 1574025 1568250 1560272 1550771 1540640
59161 1540640 1530794 1521474 1512265 1502881 1493390 1483643 1473195 1461961 1450403 1439099 1428651 1419928 1413496
59148 1413496 1408779 1404535 1400200 1395913 1391390 1386117 1380998 1378517 1380321 1385370 1391159 1396275 1401206 1407234
59134 1407234 1415111 1424480 1434203 1443527 1452905 1463195 1474274 1485313 1496350 1508317 1521195 1533361
59122 1533361 1543261 1550732 1556270 1560128 1562575 1563753 1562756 1558413 1551838 1546412 1543778 1541248 1534979 1524718
59108 1524718 1513563 1503885 1495594 1488087 1481607 1476215 1471083 1465523 1459682 1453842 1447890 1441660 1434940 1427069
59094 1427069 1417464 1406621 1395671 1384825 1373236 1360620 1347970 1336156 1324586 1311916 1297763
59083 1297763 1283328 1270460 1260208 1252130 1245044 1238477 1232953 1228670 1224714 1220368 1216573 1214925 1215489
59070 1215489 1216722 1217652 1219112 1222636 1228927 1237600 1247801 1258868 1270848 1284360 1299607 1315870 1332599
59057 1332599 1350428 1370134 1391074 1412045 1433385 1456556 1481412 1505606 1527410 1547553 1567326
59046 1567326 1586257 1603078 1617866 1631549 1643803 1653142 1659054 1662483 1663970 1662884 1659200 1654777 1651600
59033 1651600 1649404 1646227 1641030 1634596 1627885 1620857 1613409 1606148 1599152 1590836 1579505 1565830 1552351
59020 1552351 1540422 1528872 1516039 1501754 1486595 1470324 1452342 1433178 1414508 1397819 1383621
59009 1383621 1371560 1360579 1349435 1337882 1327060 1317947 1309806 1301066 1291522 1282634 1275647 1270318 1265619
58996 1265619 1260748 1255215 1248797 1242005 1236028 1231661 1228521 1225735 1223174 1221587 1221529 1222598 1224022 1225724
58982 1225724 1228274 1231678 1234988 1237809 1241484 1247539 1255101 1261392 1265216 1268487 1273544 1280390 1287879 1296467
58968 1296467 1307935 1322758 1339389 1356250 1373317 1391623 1412083 1434728 1458295 1480753 1501155
58957 1501155 1520669 1540692 1560205 1576283 1587187 1593706 1597381 1598893 1598559 1596945 1594170 1589695 1583814
58944 1583814 1578589 1576309 1577353 1580331 1584003 1588236 1593112 1597836 1600890 1601131 1598506 1593679 1587122 1578938
58930 1578938 1569575 1560077 1551071 1541814 1530926 1518045 1504290 1491207 1479791 1470416 1463130 1457869 1454737
58917 1454737 1454026 1455642 1458762 1462522 1466887 1472330 1478943 1486446 1494844 1504304 1514534 1525023 1535805
58904 1535805 1547093 1558135 1567391 1574233 1579641 1584624 1588484 1589243 1585686 1578434 1569010 1558177 1545430
58891 1545430 1530069 1512429 1493884 1475836 1459105 1444011 1430316 1417000 1402971 1388395 1374811
58880 1374811 1363592 1354897 1348314 1343697 1340822 1338923 1337170 1335156 1332663 1329690 1326876 1324883 1323003 1319625
58866 1319625 1314586 1309619 1305723 1301727 1296540 1291090 1286449 1281707 1275836 1270359 1267820 1268428 1270561 1273909
58852 1273909 1279473 1286745 1293538 1298898 1303975 1309760 1316296 1324453 1336086 1351500 1368783 1386550 1405561
58839 1405561 1426600 1448406 1468981 1487762 1505511 1523047 1540947 1559627 1578975 1598605 1618786
58828 1618786 1640269 1663056 1686398 1710039 1734087 1757480 1778170 1795358 1810189 1823826 1836252
58817 1836252 1847446 1858028 1867846 1875168 1878165 1876349 1870285 1861186 1851094 1841859 1833237 1823361 1811582
58804 1811582 1799253 1787165 1774104 1758902 1742096 1724318 1704784 1682937 1660234 1638571 1617895
58793 1617895 1596864 1575050 1553102 1531383 1509837 1488772 1468669 1449485 1430878 1412684 1394737
58782 1394737 1376912 1359683 1343644 1328192 1312137 1296210 1283222 1274565 1268082 1260767 1252240 1244052
58770 1244052 1236861 1230170 1223986 1218876 1214748 1211159 1208542 1207809 1208967 1211239 1214145 1217404 1220285 1222250
58756 1222250 1223853 1225868 1227924 1229108 1229455 1229689 1229793 1229042 1227346 1225518 1224192 1223211 1221970 1219818 1216364
58741 1216364 1211896 1207191 1202575 1197867 1193568 1191025 1190579 1190495 1188830 1185709 1182832 1181439 1181770 1183809 1187296
58726 1187296 1191426 1195605 1200309 1206446 1214295 1223690 1234587 1246676 1259149 1271634 1284632 1298087
58714 1298087 1310392 1319847 1326465 1331271 1334482 1335450 1333716 1329042 1321039 1309998 1297549 1285316 1273329
58701 1273329 1260780 1247885 1235986 1226259 1219297 1215209 1212967 1210297 1205670 1200162 1196203 1194679 1194301
58688 1194301 1193491 1191869 1190108 1189269 1190180 1192866 1196883 1202475 1210440 1220313 1230091 1238855 1248374 1260591
58674 1260591 1274648 1288199 1300808 1313986 1328251 1342201 1354564 1365416 1375052 1383126 1389356 1394120
58662 1394120 1398134 1402197 1407129 1413132 1419426 1425210 1430574 1435875 1440991 1446100 1452094 1458758 1463339 1462784
58648 1462784 1457113 1449052 1440526 1430998 1419029 1403790 1384889 1362187 1336307 1308512 1279981 1251728
58636 1251728 1224704 1199012 1173537 1147551 1122165 1099055 1078382 1059495 1043050 1030468 1021300
58625 1021300 1012979 1003630 993775 984887 977429 970732 963991 957050 950735 946295 944054 943058 942540 942908 944572
58610 944572 946980 950049 955265 963591 973298 981960 989929 999552 1011276 1022754 1031792 1038006 1041473 1041901
58596 1041901 1039662 1035781 1030455 1023204 1014779 1007071 1000605 993874 985755 976934 968237 959254 949684 940808
58582 940808 934471 931206 929988 929173 927447 924679 922179 921390 922205 923254 923652 923476 922808 921722 921126 922113
58566 922113 924175 925394 924706 922788 920573 918368 916812 917246 920272 924897 929717 934295 939068 944626 951331
58551 951331 958949 966462 972795 977659 981179 983227 984091 985231 988068 992275 996498 1000399 1004607 1009023
58537 1009023 1012766 1015795 1019005 1022650 1026174 1029749 1034550 1041236 1049295 1058014 1067133 1076758 1087734 1101631
58523 1101631 1118920 1137642 1155484 1172711 1191113 1210525 1228606 1244068 1257844 1270904 1283341
58512 1283341 1296161 1311607 1330517 1351124 1371539 1392103 1414436 1439426 1466882 1496074 1525991
58501 1525991 1556040 1586752 1618825 1651385 1682356 1710380 1734996 1755191 1769630 1778356 1782559 1782614
58489 1782614 1778105 1769669 1758636 1744758 1726661 1704953 1682502 1660821 1638416 1613563 1586656 1558744
58477 1558744 1529830 1499912 1470040 1441095 1412822 1385087 1358717 1334265 1311347 1289977 1271131
58466 1271131 1255179 1241207 1228626 1217963 1209292 1201420 1193571 1186487 1180959 1176434 1171839 1166682 1160872
58453 1160872 1154701 1149426 1146352 1144926 1143139 1140204 1137207 1134751 1131865 1127987 1124309 1122229 1121799 1122277
58439 1122277 1122959 1123193 1123058 1124139 1127875 1133070 1137026 1139231 1141694 1145451 1149448 1153481 1159442 1168519 1179555
58424 1179555 1191335 1204246 1218617 1233738 1249785 1268460 1290394 1313905 1337335 1360260 1381330
58413 1381330 1397629 1407866 1413875 1417268 1416979 1411998 1404255 1396469 1388995 1380923 1372692 1365405 1358873 1352376
58399 1352376 1346426 1342123 1339755 1339325 1341292 1345573 1350985 1356670 1362684 1368363 1371942 1372862 1372652 1372340 1370862
58384 1370862 1367150 1361794 1355398 1347457 1338331 1330190 1324326 1319441 1314257 1309975 1308463 1309762 1312931 1317541
58370 1317541 1322911 1327850 1332792 1340259 1351623 1365288 1379456 1394372 1410187 1424995 1437013 1446657
58358 1446657 1454445 1458991 1459168 1456189 1451482 1444543 1435040 1424911 1416013 1407558 1398216 1388872 1380887 1373470
58344 1373470 1365365 1357665 1352483 1350106 1349611 1350982 1354501 1359269 1364265 1369768 1376251 1383242 1390458 1398188
58330 1398188 1405325 1409213 1408941 1406567 1403859 1400537 1397104 1396078 1398219 1400715 1401572 1402761 1406450 1411434
58316 1411434 1416373 1423293 1434226 1447015 1458223 1467950 1478331 1489504 1500597 1512659 1527023 1542593
58304 1542593 1557877 1573686 1590717 1606904 1620588 1633894 1649270 1665115 1678728 1691269 1705478
58293 1705478 1720500 1733286 1743562 1753255 1762601 1770992 1780096 1791875 1804807 1816280 1827432 1841487
58281 1841487 1858470 1875817 1893181 1912417 1933565 1954960 1976718 2000344 2025326 2049529 2072406
58270 2072406 2094788 2116355 2136212 2154783 2172387 2187540 2199610 2211327 2225583 2241681 2257648
58259 2257648 2273799 2290731 2306600 2320159 2333845 2350017 2367046 2383160 2400853 2422841 2446882
58248 2446882 2469784 2493371 2520968 2550998 2580085 2609843 2644146 2681858 2718636 2754059 2790532
58237 2790532 2826896 2859808 2890237 2922268 2956584 2991248 3027523 3068450 3112749 3156518 3200164
58226 3200164 3247627 3299809 3354668 3412417 3474496 3538939 3603132 3669612 3742657 3820823 3899565
58215 3899565 3979383 4064256 4153820 4244614 4337542 4436515 4541074 4647974 4758537 4876787
58205 4876787 5002047 5131506 5268110 5417044 5575939 5737853 5902770 6076848 6261351
58196 6261351 6452130 6649450 6858542 7080648 7313307 7559528 7827134 8118879 8432189
58187 8432189 8767948 9130011 9517037 9924863 10356183 10817826 11309935 11828440 12376270
58178 12376270 12960356 13579322 14226653 14904457 15620828 16374921 17158463 17971090 18820161
58169 18820161 19706881 20627982 21590083 22606306 23679381 24804807 25990019 27252655
58161 27252655 28600161 30029696 31548136 33172992 34913925 36774113 38769928 40927366
58153 40927366 43258562 45764388 48459765 51371783 54513850 57889623 61523457 65459992
58145 65459992 69737753 74398766 79524866 85229067 91614265 98784331 106895688 116150106
58137 116150106 126739400 138856288 152758037 168740867 187026851 207726225 230895210
58130 230895210 256557026 284743570 315700146 349888449 387091567 424869297 458030257
58123 458030257 480456431 488255736 481583077 463765223 439018720 410853449 381749856
58116 381749856 353326690 326469918 301598673 279061516 259193633 241917605 226479861
58109 226479861 211809363 197176208 182485393 168048222 154219390 141231045 129202219
58102 129202219 118175515 108134497 99021940 90760813 83270723 76480738 70333216 64775806
58094 64775806 59756727 55231626 51165526 47520749 44249772 41304551 38644451 36230786
58086 36230786 34023858 31991959 30115645 28378675 26763168 25257673 23860396 22568612
58078 22568612 21372062 20260439 19229022 18272669 17382310 16551775 15780796 15067232 14402832
58069 14402832 13779606 13193565 12639918 12112184 11608754 11132956 10684046 10255297 9843134
58060 9843134 9450351 9077822 8720967 8377468 8050886 7743322 7451470 7173006 6910037
58051 6910037 6663159 6428618 6204175 5991393 5789712 5594959 5406261 5227555 5059611
58042 5059611 4897502 4738931 4588028 4447484 4313602 4182901 4057310 3938942 3825497
58033 3825497 3714781 3608470 3507752 3410344 3315140 3224776 3140299 3058293 2976454 2897030 2821664
58022 2821664 2747937 2674308 2603317 2536234 2469406 2399876 2330357 2264716 2202409 2141031 2080795
58011 2080795 2022999 1967257 1913383 1862971 1816453 1771706 1727889 1687162 1650420 1615047 1579325
58000 1579325 1545305 1514788 1486148 1457655 1430246 1404453 1378271 1350736 1324127 1299946 1276222
57989 1276222 1251506 1228153 1208788 1192529 1177297 1162810 1148861 1133762 1117030 1100874 1086828
57978 1086828 1073704 1060583 1048555 1037672 1025714 1011986 998740 986864 974007 959137 944842
57967 944842 932614 919956 905091 890467 878416 867208 854875 843187 834067 825522 815124 804440
57955 804440 796062 789066 781419 774197 769221 764854 758489 751425 747071 745660 744548 742655 741127 740602
57941 740602 740985 742992 746928 750829 752503 752482 752639 753176 753372 753839 755511 757636 759110 760357 761635 761158
57925 761158 757347 751403 745198 738343 729922 721354 714608 709028 702816 696351 691188 687044 682710 678895
57911 678895 677203 677117 676825 676312 677019 679077 681325 683285 684722 684072 679985 673857 668394 664118 659563 654329
57895 654329 649497 645373 641170 636767 632707 628665 623775 618309 613322 608955 604753 601323 600106 601723
57881 601723 605663 610994 616290 619899 621753 623980 628401 634532 641433 649961 661171 673696 684879
57868 684879 693609 700112 703986 704825 704118 704221 705665 707198 707949 707710 705669 700973 694414 687850 682081
57853 682081 676655 671407 666830 663361 661501 661966 664405 666788 667481 667171 667320 667687 667029 665365 663614 661564
57837 661564 658061 652891 646865 640241 632561 623915 615217 607460 601549 598269 597551 598320 599640 600956 600761
57822 600761 596944 589824 583173 580514 581581 583777 585441 585979 584484 580634 575947 572123 569058 566214
57808 566214 564580 565228 567197 568975 570922 573946 577039 578641 579456 581406 584685 588473 593523 601127 610082
57793 610082 617738 623808 630271 637595 643979 648538 652308 655527 656526 654219 649586 643948 637635 630967
57779 630967 624668 618561 611431 602912 594103 585894 578068 570495 563836 558447 553756 549214 545051 541720
57765 541720 539193 536795 533404 528409 523083 520023 520149 521229 520596 518188 515486 512918 510374 509021 509935
57750 509935 511684 511935 511048 511283 512581 511988 507670 500931 493672 486317 479072 473033 468859 465940 463766
57735 463766 462757 463042 463805 464458 465441 467434 470692 475146 480014 483603 485041 485992 488997 494211 499577
57720 499577 504069 508679 514093 519658 525168 531463 538326 543703 546203 547006 548275 550728 553556 555710
57706 555710 556603 556273 555279 553792 550889 545680 538816 531596 523945 514931 505101 496348 489263 482560 475557
57691 475557 469407 465210 462563 460704 459649 459438 459537 459771 460892 463566 467594 472256 476622 479660 481148
57676 481148 482282 484136 485919 486381 486470 488498 492727 496934 499533 500943 501657 501350 500546 500781 502189 503058
57660 503058 502743 502905 504629 506344 506000 503570 499969 495175 489102 483008 478305 474842 471619 468369 465263
57645 465263 461954 458056 453840 449624 445283 441106 438042 436150 433804 429463 423522 417655 413157 410646
57631 410646 410417 412194 415152 418737 422759 426433 428576 429235 429882 431487 433697 436542 441348 449035 458912
57616 458912 470303 484112 501681 523250 548768 579170 615497 657528 704436 756128 812616
57605 812616 872239 931037 983368 1022944 1044621 1046640 1031032 1001571 961911 915529 865837 815374
57593 815374 765717 718563 675669 637304 602300 570400 543063 521112 503207 487783 474940
57582 474940 465047 456852 448649 440406 433266 427699 423345 419741 416064 411187 405351 400739 398860 398219
57568 398219 396120 391999 387353 383037 378365 372655 366086 359068 352042 345808 340945 336881 332472 327437
57554 327437 322521 318466 315495 313438 311746 309762 307546 305935 305319 305012 304217 302689 300018 295653 290421
57539 290421 286567 285039 284007 281603 278945 278529 280334 281524 279834 275659 270851 266840 263953 261431
57525 261431 258073 253715 249787 247591 246625 245653 244768 244896 245641 245204 242527 238223 233263 227938 222390 217195
57509 217195 212948 209737 207200 204783 202061 199013 195780 192083 187581 182952 179608 177852 176351 174039
57495 174039 171371 169054 166955 165307 165376 167327 168767 167411 164329 162590 163302 164927 165995 166368 166054
57480 166054 164940 163998 164849 167603 170537 172344 173569 175573 179198 184520 190718 195974 198637 198798 197906
57465 197906 196840 195316 193085 190634 188613 187372 186990 186979 186265 184365 182230 180965 180182 178717 176419
57450 176419 173993 171662 169460 168267 168806 170000 170149 169442 169261 169145 166884 162108 157545 155656 155796 155789
57434 155789 154712 152899 150454 147245 143805 141080 139480 138725 138313 137881 137439 137244 136983 135428 131815 127308
57418 127308 123978 122431 121662 120940 120309 119253 116679 112658 108605 105199 101603 97386 93640 91286 89590
57403 89590 87411 84950 83333 83203 84318 85761 86190 84956 83386 83642 85777 87334 86705 85334 85395 86619
57387 86619 86989 85707 83918 82887 82881 83615 84645 85279 84994 84056 83199 82794 82603 82120 80969 79430 78737 80179
57369 80179 83629 87663 91334 94907 98479 101054 101707 100758 98980 96498 93394 90633 89433 90089 92072
57354 92072 94641 96795 97383 96217 94535 93699 94039 95480 98311 102364 106323 109045 110911 112816 114503
57339 114503 115139 114916 114692 114481 113833 113465 114874 118121 121440 123514 125045 127525 131390 135925 140268 143975
57323 143975 147072 150014 153266 156755 160128 163661 168355 174804 182346 189769 196682 203863 212259 221740
57309 221740 230999 238805 245380 252232 260487 269738 278792 287165 295351 303859 312631 321447 330369 339552
57295 339552 348948 358489 368475 379473 391679 404428 416640 427803 438221 448149 457232 465386 473745
57282 473745 483788 495594 507794 519224 529796 539773 549328 558964 569211 579511 588592 596443
57270 596443 604652 614071 623431 631300 638217 645594 653563 661385 669226 677848 687059 696169 705680 716708
57256 716708 728664 739252 747309 754207 761846 770478 779282 788019 797217 807367 818687 831191 844395
57243 844395 857360 869603 881597 893838 905746 916102 924605 932512 941609 952703 965214 978110
57231 978110 990970 1003944 1016915 1029363 1041254 1053534 1067301 1082922 1100352 1119802 1141417
57220 1141417 1164672 1188831 1213814 1240027 1267512 1295846 1324502 1352671 1379088 1402947 1424774
57209 1424774 1445521 1465080 1482672 1498461 1513606 1528722 1543516 1558076 1573319 1589821 1607355
57198 1607355 1625980 1646392 1668599 1691325 1713477 1735301 1757347 1779322 1800896 1822799 1845876
57187 1845876 1869525 1892327 1914071 1936127 1959673 1984422 2009389 2034370 2060238 2087885 2117126
57176 2117126 2146961 2177121 2209025 2244401 2282974 2322406 2360910 2398888 2437334 2475563 2511783
57165 2511783 2545540 2578411 2612200 2647265 2682719 2717573 2751455 2784741 2818193 2852217 2886572
57154 2886572 2921108 2956679 2994803 3036414 3081261 3128471 3177312 3227384 3278437 3330116 3381768
57143 3381768 3432637 3482416 3531495 3580543 3630036 3680242 3731230 3782473 3832739 3880859 3926743
57132 3926743 3971729 4018016 4067276 4118906 4169698 4216305 4258542 4299391 4341342 4383885 4425340
57121 4425340 4465812 4506766 4548250 4588097 4623918 4654814 4681203 4703872 4723280 4739168 4750892
57110 4750892 4758371 4762129 4762131 4757741 4749548 4739738 4729240 4715937 4697710 4676139 4654808 4634682 4613866
57097 4613866 4591605 4569526 4548503 4527183 4504630 4482082 4461014 4441746 4425339 4415019 4414287 4424911
57085 4424911 4447481 4481997 4526602 4577232 4629589 4680061 4724293 4757376 4776978 4784328 4780576 4763901
57073 4763901 4731504 4682073 4614199 4524210 4407866 4262988 4088571 3882633 3642683 3366975
57063 3366975 3053740 2700622 2306285 1870868 1393441 871079 301734 -314857 -981470
57054 -981470 -1706326 -2500164 -3373776 -4341344 -5422951 -6640066 -8010707 -9551715 -11282698
57045 -11282698 -13224985 -15401327 -17841814 -20587683 -23686586 -27189812 -31159809 -35675300
57037 -35675300 -40822604 -46687266 -53361205 -60950525 -69564231 -79296528 -90222265 -102389226
57029 -102389226 -115787745 -130332874 -145911610 -162474911 -180093826 -198934568 -219147425
57022 -219147425 -240630533 -262661200 -283608553 -301113083 -312869771 -317589841 -315455792
57015 -315455792 -307785156 -296272061 -282399588 -267277731 -251735423 -236398538 -221665010
57008 -221665010 -207655654 -194237384 -181140078 -168111666 -155030422 -141931586 -128968793
57001 -128968793 -116356438 -104317104 -93037153 -82638366 -73175141 -64649199 -57024474
56994 -57024474 -50238691 -44217775 -38889260 -34185359 -30039175 -26385235 -23164255 -20323493
56986 -20323493 -17813210 -15586893 -13604709 -11833347 -10243209 -8809166 -7512985 -6341019
56978 -6341019 -5279406 -4313939 -3433035 -2626987 -1885264 -1198453 -562482 22868 559620
56969 559620 1052669 1506126 1922590 2306180 2662511 2995090 3304963 3594648 3869529 4134793
56959 4134793 4393886 4650477 4908240 5165803 5412669 5631506 5805263 5924310 5989926 6011731
56949 6011731 6000518 5963232 5904865 5832494 5754183 5674683 5595289 5517784 5445562 5380728 5322899
56938 5322899 5271524 5227178 5190108 5159555 5134754 5114475 5095327 5072899 5045302 5013814 4979496
56927 4979496 4941013 4896169 4843775 4783339 4714260 4635736 4546346 4443995 4327924 4200630 4066214
56916 4066214 3927089 3783997 3638587 3493543 3350309 3209138 3071473 2939832 2814968
56907 2814968 2695427 2580188 2469419 2362447 2257780 2156061 2060581 1973807 1895285 1823635
56897 1823635 1758224 1697703 1639070 1579786 1519526 1458924 1398076 1337085 1276566 1216811 1157967
56886 1157967 1101643 1050635 1006209 967097 931692 899568 870514 844222 821780 805374 795423
56875 795423 789822 786871 786982 790585 796614 804116 812900 820853 822996 815537 799432 778082 753236 725274
56861 725274 695820 667245 640184 613887 588687 566138 546927 530301 515357 501581 488534
56850 488534 476427 466606 460030 455533 450936 445590 440518 436245 431838 426165 419128 411551 404628 399429
56836 399429 396296 394781 394620 396367 400592 406979 414848 424049 434651 446177 457808 468966 479226
56823 479226 488055 495052 499898 501824 500002 494993 488890 483404 478577 474035 470444 468862 469525 472313
56809 472313 477686 486146 497341 510725 526625 545719 567887 592518 619675 650038 683708 719325
56797 719325 753813 782576 800883 806333 800200 786176 768194 749393 731971 716936 704321 694212
56785 694212 687283 684135 684910 689971 700165 715894 736708 762313 793119 829197 869487 912663
56773 912663 957817 1003339 1045640 1079848 1101693 1108875 1101678 1082855 1056145 1024370 989374 953504
56761 953504 919632 889374 862722 839910 822125 809746 801660 797356 798237 805681 819159 837348
56749 837348 859723 885784 914002 942765 970868 995636 1012169 1016514 1008873 992243 969073 940937
56737 940937 910180 879436 849843 821503 795213 772134 752402 735792 723134 715187 710686 707577
56725 707577 705891 707388 712604 720319 729877 741750 755224 767347 774915 776212 770480 757349 737711
56712 737711 714028 688832 663388 638134 613664 590775 569971 551239 534104 517985 502688
56701 502688 488296 474516 461001 448689 439554 433959 429311 422753 414447 406765 400886 395858 390618
56688 390618 385227 380215 376148 373754 372997 372105 369036 364048 359460 356736 355152 353481 351567 349772 348115
56673 348115 346629 345782 345938 346799 347609 347624 346529 344835 343675 343719 344577 345587 346581 347444 347797 347798 348383 349839
56655 349839 351145 351654 352267 353764 355199 355490 355391 356049 356686 355873 354292 353944 355061 356149 356764 357786 358908
56638 358908 358422 355970 353316 351675 350083 347113 342659 337509 332691 329586 329034 329852 329747 328139 326621
56623 326621 326381 326841 327344 328435 330667 333480 335977 337647 337920 336348 333734 331808 331329 331626 332199 333373
56607 333373 335072 336519 337673 339514 342301 344879 346262 346731 346904 346983 347265 348114 349109 349508 349780 351172
56591 351172 353542 355274 355738 356147 357521 359565 362080 365599 369769 372903 374158 374601 375167 375150 373747 371530
56575 371530 369166 366131 362010 357906 355270 354191 353837 353665 353357 352542 351401 350549 349729 347888 345206 343614
56559 343614 344292 345981 346748 346088 344250 340964 336311 331804 329123 328396 328655 329209 329657 329568 329119 329188 329952
56542 329952 330394 330012 329858 330985 333085 335676 339273 344110 348860 351985 353379 353485 352039 349205 346823
56527 346823 346761 348684 351049 353596 357140 361433 365010 367115 368341 369293 369867 369921 369705 369544 369752 370654 372029
56510 372029 372817 372172 370647 369844 371138 375086 381481 389440 397965 406838 416492 426822 437141 447574
56496 447574 459082 471171 480822 485079 484106 480697 477543 475942 476376 478832 482622 486745 490454 493149
56482 493149 494346 494260 493783 493332 492351 490345 487608 484440 480639 476362 472450 469186 465727 461537 457385
56467 457385 454075 451153 447800 444068 440397 436790 433279 430232 427357 423393 417602 410654 403284 395377
56453 395377 387280 380722 377110 375812 375178 374322 373027 371089 368876 367376 366659 365482 363493 362387 363490
56438 363490 365623 366964 367737 369282 371625 373877 376081 378696 380987 381883 381965 382748 384359 385633 386183 386764
56422 386764 387793 388973 390136 391239 391860 391926 392430 394168 396281 397403 397759 398784 401120 404267 407746
56407 407746 411245 414004 415299 415347 414820 413985 413082 412671 412612 411734 409761 408476 409529 412030 413840 414328 414305
56390 414305 414137 413643 413095 412695 411889 410801 411388 415268 421143 426247 429593 431950 433522 433982 434161 435309
56374 435309 436828 436969 435688 434664 434429 433568 431113 427974 425558 424334 423957 423738 423063 422434 423602 427379
56358 427379 431808 433924 432918 430303 427759 426313 426772 428990 431177 431791 431635 432401 433816 434197 433258 432212
56342 432212 431532 430709 430036 430515 432071 433603 434594 435008 434169 431718 429159 428413 429320 430543 432217 435226
56326 435226 438491 439697 438634 437319 436881 436820 437264 439257 442577 445760 448494 451607 454517 455286 453650
56311 453650 451591 450479 449952 449945 451237 453306 454048 452531 450138 448423 447817 448819 452252 457629 463098 467503
56295 467503 470810 472584 472297 471234 471609 473466 474885 475505 477070 479978 482202 482667 482951 484381 485905
56280 485905 486246 485914 485757 485597 485711 487674 492192 497735 502631 507045 511698 516172 519802 523099 527215
56265 527215 532812 539901 547706 554490 558955 561929 565226 568895 571498 573022 575167 578477 581542 583534
56251 583534 585229 586962 588021 588835 591419 596623 602969 609030 614990 621121 626862 632271 638347 645180
56237 645180 651735 658106 665702 674514 682429 688162 692799 697787 703552 710690 720058 730884 741155 750668
56223 750668 761299 773465 784995 794594 803847 814588 826578 838961 851733 864717 877321 890199
56211 890199 904805 920593 935337 949149 965288 985694 1008412 1030747 1052426 1074553 1098214
56200 1098214 1125389 1158360 1196694 1237423 1279428 1324842 1374982 1428256 1483773 1543778 1610457
56189 1610457 1683280 1761508 1846271 1937882 2033822 2131728 2231850 2334450 2437358 2538234
56179 2538234 2636656 2731755 2820377 2899803 2969795 3029776 3076647 3107681 3123089 3123525 3107885 3076155
56167 3076155 3031818 2978696 2917594 2848448 2773384 2695067 2614291 2531619 2449143 2368273 2288130
56156 2288130 2208435 2131492 2058921 1989024 1919847 1852381 1788261 1726981 1667924 1612420 1561262
56145 1561262 1512989 1467124 1425916 1390020 1355935 1321145 1288514 1261777 1239777 1219328 1200795
56134 1200795 1186216 1174208 1161691 1149090 1139372 1133030 1128036 1123511 1119605 1114985 1108403 1101804 1098212
56121 1098212 1097312 1096457 1095059 1094712 1095931 1097888 1100542 1104205 1108077 1111818 1117154 1125357 1134670 1142851 1150462
56106 1150462 1159001 1167904 1176329 1185786 1197860 1211316 1224471 1238279 1254098 1270856 1287667 1306596
56094 1306596 1329336 1353813 1377835 1403388 1433219 1465834 1498313 1531718 1569159 1610726 1654984
56083 1654984 1703446 1758806 1820590 1887298 1961191 2046200 2142512 2247629 2361201 2484242 2614975
56072 2614975 2749628 2885624 3019782 3145730 3258191 3358395 3450816 3536516 3614129 3684542
56062 3684542 3748659 3802291 3839121 3857714 3860618 3848498 3820961 3781666 3736388 3686343 3628458
56051 3628458 3561144 3484752 3397846 3298792 3190247 3077107 2961473 2844671 2732017 2629323
56041 2629323 2536194 2448877 2368174 2298093 2238195 2184301 2135961 2096373 2065325 2038771 2015099
56030 2015099 1995634 1979635 1965228 1954562 1951378 1953920 1956815 1959379 1965365 1975217 1985629 1996368
56018 1996368 2010385 2027226 2043302 2058440 2075228 2092317 2105822 2117215 2132329 2152463 2173724
56007 2173724 2195005 2218838 2244436 2268070 2290806 2317799 2349184 2379676 2408073 2439059 2474371
55996 2474371 2509969 2543379 2576426 2609537 2640622 2670682 2703400 2738526 2772749 2807312 2847260
55985 2847260 2893125 2941094 2990929 3045461 3102756 3157869 3212095 3271254 3335211 3398950 3463587
55974 3463587 3535492 3614289 3692956 3770608 3853749 3943648 4034294 4124698 4221431 4326667 4435404
55963 4435404 4547029 4667798 4799036 4934623 5073214 5221240 5380827 5546639 5717906
55954 5717906 5901709 6101225 6312856 6537979 6784865 7055548 7343459 7647301 7974166
55945 7974166 8325850 8696021 9084410 9499435 9942891 10406936 10890399 11402829 11947943
55936 11947943 12518709 13113457 13740481 14401437 15086789 15793150 16528555 17295851 18089101
55927 18089101 18911756 19779165 20697049 21657414 22662047 23729006 24869000 26077523 27357910
55918 27357910 28729107 30202711 31777011 33462391 35286515 37264784 39393102 41679799
55910 41679799 44155066 46838189 49728344 52841365 56222697 59912623 63938761 68360579
55902 68360579 73282405 78807729 85027915 92075184 100133979 109377491 119954339 132069087
55894 132069087 146010981 162067407 180474819 201473911 225305072 252111753 281973607
55887 281973607 314977499 350719096 387115837 419730497 442991041 452867747 448792615
55880 448792615 433264398 409914120 381930171 351665309 320837197 290658093 261899099
55873 261899099 235054253 210478948 188376606 168762906 151529380 136515072 123499448
55866 123499448 112199564 102337741 93694872 86084829 79325156 73264193 67801409 62853112
55858 62853112 58326834 54149911 50292006 46736580 43455472 40428363 37657502 35140201
55850 35140201 32848130 30750848 28837288 27097177 25503396 24030876 22674179 21430192
55842 21430192 20281331 19211103 18219103 17305415 16455750 15656038 14906986 14211047 13559267
55833 13559267 12943503 12367650 11834343 11333711 10857164 10409661 9996927 9612796 9250180
55824 9250180 8912474 8603071 8315117 8042436 7789533 7560310 7347650 7144577 6955261
55815 6955261 6784589 6626657 6473498 6325223 6181234 6030960 5864378 5684164 5498064
55806 5498064 5307136 5110621 4914264 4724128 4539057 4357806 4186262 4028967 3880713
55797 3880713 3735187 3595213 3466087 3345552 3228841 3117267 3013388 2913559 2813435 2715457
55787 2715457 2623418 2535122 2447528 2363424 2285830 2211518 2137182 2066263 2002523 1942605 1882302
55776 1882302 1824571 1773805 1727370 1680327 1633566 1589960 1547324 1502759 1459588 1422540 1389872
55765 1389872 1357003 1323962 1292725 1261406 1227955 1195660 1168138 1142515 1114121 1084426 1057873
55754 1057873 1034345 1011139 989122 970714 954887 940014 928374 922126 918194 912905 908221 907663
55742 907663 909830 911851 915404 922819 930645 933625 932074 929041 923428 912736 899803 889711 881890
55729 881890 871795 858629 845235 832098 817725 803594 792663 783940 773883 762158 751040 740583
55717 740583 729396 718699 710595 703754 695680 687742 683113 681372 680048 679817 682888 687443 688821 685426
55703 685426 679001 670242 658718 646081 634791 624505 613638 603209 595104 588101 579795 570890 563369
55690 563369 556161 547077 537352 529505 522226 512232 500068 489282 480804 472659 464340 457027 450338 443194
55676 443194 437029 433898 432317 429178 424712 421337 418749 414735 409952 407165 406250 404317 400467 396250
55662 396250 391884 386147 379690 374482 370308 365483 360507 357361 355965 355127 355981 360355 366466 370557 372300
55647 372300 374487 377898 380649 382174 383486 383738 380812 375362 370171 365402 358477 348877 339204 331212
55633 331212 324389 318611 314641 311775 308413 305117 303893 304635 305575 306878 310099 314382 317081 318176 320145
55618 320145 323246 324804 323706 321989 321284 320982 320485 320099 319159 316289 312044 308575 306504 304786 303382
55603 303382 303080 303059 302003 301313 303609 308114 311231 311796 312049 313189 314017 314662 317554 323342 329246 332840
55587 332840 334456 334734 332834 328534 323546 319309 315480 311480 307498 303290 298057 292116 286853 282722
55573 282722 279074 275764 272931 269597 264881 260116 257167 255193 252073 248488 247175 248159 248201 245368 240910
55558 240910 236260 231424 226920 224085 222602 220484 217267 214647 213444 212538 211234 210089 209056 207352
55544 207352 205380 204187 203040 200354 196879 194868 194200 192743 190570 190096 191605 192416 191295 190017 189544
55529 189544 188226 185065 181462 178494 175601 173151 173041 175348 177381 177492 177039 177316 177568 177372 178081 180421
55513 180421 183377 186818 192401 200405 208424 214733 220326 226169 231140 234296 236726 239577 242543 245526
55499 245526 249185 252579 253050 249974 245967 242852 239287 234166 229445 227263 226536 224651 220656 214994 208123
55484 208123 201261 196475 194165 192229 189274 186647 185738 185475 184329 182824 182127 182028 182132 183215 185466 187038
55468 187038 186263 183929 181782 180258 179140 178787 179143 179020 177773 176125 174186 170533 164674 158500 153878
55453 153878 150641 148358 147984 150014 152956 155456 158146 161613 164399 164937 163803 162207 159986 157032 154904
55438 154904 154728 154896 153202 150147 147980 147363 147098 146608 146821 148836 152841 157885 161996 163423 162458 161008
55422 161008 159918 158267 155803 154017 153783 153885 153139 152156 151882 152264 153456 156169 159574 161186 160431 160020
55406 160020 162019 164810 165809 164934 163235 160476 156588 153475 152599 152371 150609 148120 147240 148176 149421 150554
55390 150554 151932 152708 151835 150228 149472 149207 148244 147276 147882 149589 150561 150683 151336 152497 152620 151339 149916
55373 149916 148967 147822 146219 144732 143544 142461 142038 143023 144851 146261 147160 148313 149568 150132 150347 151438
55357 151438 153560 155654 157152 158405 159567 160508 161648 163493 165428 166303 166108 165900 166127 166075 164840 162014
55341 162014 157835 153514 150878 150679 151652 152039 151487 150763 150443 150693 151352 151423 149601 146241 143534 142699 142427
55324 142427 141284 140085 140344 141909 143810 146067 148795 150943 151866 152845 154897 156431 155495 153161 152050
55309 152050 152290 151706 149459 146775 144372 141876 139781 139333 140067 139879 138138 136720 137266 139143 140758 141452
55293 141452 141439 140988 140250 139277 138121 137330 137749 139123 139824 139072 138367 139298 141003 141544 140824 140171 139791 138828
55275 138828 137426 136522 135941 134846 133808 134288 136124 137571 137806 137442 136782 135694 135118 136409 138956 140558
55259 140558 140461 140084 140500 141254 141928 142748 143182 142045 139680 138085 138153 138614 138418 138290 139004 139907 140322 140953
55241 140953 142704 145306 148207 151731 156113 160138 161919 160798 157865 154870 152932 151915 150873 149414
55227 149414 148440 148920 150300 151102 150929 150779 151440 152660 153935 154969 155207 154015 151647 149255 147835 147770
55211 147770 149140 151529 153647 154185 153070 151176 149090 147071 145822 146164 148019 150548 152921 154255 153696
55196 153696 151812 151004 152913 156079 157856 157947 158017 158473 158064 156635 155705 155795 155488 153920 152214 151466 151083
55179 151083 150243 149580 150153 151640 152580 151927 149823 147412 146151 146673 148210 149726 151348 153783 156689 158900
55163 158900 160074 160863 161634 162364 163535 165586 167578 168027 167027 165955 165181 163852 161933 160424 159368
55148 159368 157706 155578 154706 155767 157275 157931 158297 159216 160294 160963 161481 161791 160834 158253 155552 154392
55132 154392 154631 155049 155067 154942 155116 156042 157665 158568 156983 153367 150595 150640 152390 153780 154718 156375 158660
55115 158660 160165 160173 159224 157849 156002 153876 152253 151692 151817 151657 150679 149509 149546 151552 154765 157785 160030
55098 160030 161665 162500 162026 160494 158889 157737 156887 156516 157210 158821 160331 161127 161527 161892 162149 162244 162086
55081 162086 161064 158808 156351 155234 155436 155663 155704 156673 158522 159215 157334 154017 151348 150141 150248 151755
55065 151755 154589 157735 159932 160822 160952 161281 162909 166279 170208 172690 173032 172215 170993 169103 166865
55050 166865 165963 167561 170693 173445 174858 175014 174395 173906 174509 175966 176871 176624 176374 177276 178883 180077
55034 180077 180519 180321 179463 178560 179080 181564 184477 186036 186461 187162 188385 189030 188535 187579 186909 186480 185988
55017 185988 185566 185596 186054 186248 185407 183673 182220 181940 182343 182443 182354 182970 184263 185091 184797 183790 182419 180475
54999 180475 178090 176075 175039 175073 176249 178283 179845 179670 178386 177723 177806 177029 174787 172403 170870 169660
54983 169660 168441 167979 168360 168202 166743 165124 164592 165083 166493 169410 173397 176403 177317 177447 178137 178822
54967 178822 178940 179685 181780 183298 182116 179216 177189 176602 176352 176608 178641 182010 184457 184744 183585 181788
54951 181788 179463 177232 176344 177163 178908 181097 183923 187093 189655 191197 192034 192088 190791 188352 186115
54936 186115 185428 186792 189940 193742 196212 195857 193395 191329 191550 193842 196647 198611 199370 199411 199342 199117
54920 199117 198222 196753 195732 195886 196699 197138 196711 195436 193620 192303 192874 195391 198086 199532 200446 202274
54904 202274 204758 206241 205941 204746 204019 204646 206924 210344 213593 215571 216331 216573 216773 217239 218188 219035
54888 219035 218550 216729 215574 216767 219206 220146 218336 214970 212047 210954 212178 215106 218273 220714 222820
54873 222820 225202 227515 229441 231929 235993 240831 244702 247436 250559 254984 259991 264720 269561 275683
54859 275683 283882 293989 304834 314810 322921 329258 334235 337872 340049 340650 338960 333871 325421 315291
54845 315291 305085 295071 285322 276829 270347 265299 261001 257894 256162 254316 250895 246797 244206 243820
54831 243820 244649 245838 247059 247805 248140 249589 253393 258212 261356 262117 262246 263501 266524 271771 279494
54816 279494 288643 297575 305977 314537 322785 329122 333153 336175 338929 340483 339686 336219 329832 320185
54802 320185 308158 296089 286004 278412 273016 269344 266339 262584 257578 252056 246774 241863 237608
54789 237608 234818 233839 233813 233256 231108 227379 223320 220710 220319 221180 221807 221616 220662 218912 216656 214769
54773 214769 213457 211650 208890 206775 206978 208712 209867 209809 209194 207945 205722 203744 203633 204631 204512 203207
54757 203207 202929 204443 205824 205625 204886 205037 205909 206862 208048 209559 210843 211884 213474 215531 216645 216063
54741 216063 214772 214021 214224 215762 219117 223450 226682 227767 227386 225986 223138 219653 218028 219323 221444
54726 221444 222252 222754 225248 229590 233425 235542 237079 239565 243157 246853 249376 249936 248859 247535 247460
54711 247460 249635 254816 263250 273685 283646 291551 297923 304091 310545 317096 323627 329869 335196 339316
54697 339316 342433 344208 343488 339813 334377 328713 323087 316860 309753 302110 294562 288036 283446 280785
54683 280785 279085 277653 276590 275721 274056 271112 267982 266236 266277 267434 269153 271359 273932 276448 278510
54668 278510 280248 282505 286146 290759 294612 296777 298757 302905 309690 317805 326321 334788 341476 343866
54654 343866 341492 336496 330816 324619 317971 311926 306877 301648 295401 288982 283387 278388 273663 269666
54640 269666 266259 262146 256967 252400 249756 247982 245675 243557 243020 243368 242660 240638 238933 238593 239028
54625 239028 239196 238492 236605 233711 230824 229143 229096 230356 232182 233374 232916 231326 230402 230956 231866 231989
54609 231989 231537 230788 229192 227121 226682 228899 231530 231850 230449 229948 230864 231394 230827 230424 230701 230436 229011
54592 229011 227624 227198 226871 225639 224147 223469 223056 221273 217869 214855 214576 217227 220664 222732 223368 223890
54576 223890 224538 223967 221527 218761 217588 217899 218096 217552 217270 218169 219709 220430 219497 217736 217222 219272 222783
54559 222783 225318 225987 226117 226815 227478 227576 228194 230282 232653 233540 233320 233926 236088 238858 241451 243883 245963
54542 245963 247236 247938 248693 249238 248545 246225 242878 239390 236863 236616 238876 241745 242911 242232 241446 241699
54526 241699 242868 244950 248217 251728 253464 252648 250765 249630 249488 249525 249318 249064 248908 248643 247941 246752
54510 246752 245659 245541 246582 247996 249138 250309 251882 253419 254489 255580 257148 258482 258730 258341 258167
54495 258167 257879 256981 256727 258901 262876 266003 267196 268067 269993 272012 272639 272134 271847 272515 274302 277484
54479 277484 281815 285899 288376 289471 290472 291838 292568 291518 288896 286213 284814 284577 284317 283479 282851
54464 282851 283187 283813 283410 281686 279335 276680 273488 270097 267680 267254 269094 272935 277862 282145 284370
54449 284370 284830 284911 285080 284489 282634 280285 278485 277589 277638 278738 280674 282785 284530 285602 285544 284146 282391
54432 282391 282036 283828 286762 289387 291185 292464 293674 295246 297494 300168 302387 303338 303019 302390 302925
54417 302925 305523 309411 312554 313832 314328 315737 318058 319955 320962 322040 323978 326471 328842 330684
54403 330684 331759 332256 333139 335200 337814 339637 340439 341011 341400 340665 338609 336255 334134 331425 327521 323441
54387 323441 320918 320695 322137 323878 324661 324284 323856 324370 325004 323839 320272 315624 311431 308475 307562 309393
54371 309393 312828 314800 313261 309461 306399 305695 306730 308183 309448 310847 313056 316224 319527 321921
54357 321921 323160 323411 322243 319319 316096 315213 317583 321230 323633 324082 323291 322099 321461 322354 324401 325456
54341 325456 323870 320656 318392 318363 319717 321001 321644 322080 323100 324990 327103 328531 329204 329619 329580 328415
54325 328415 326775 326721 329052 331742 332133 329886 326689 323961 322098 321294 321626 322557 323469 324473 325713 326325
54309 326325 325376 323693 323418 325477 328478 330473 331054 331319 332290 333759 334613 334186 333301 333617 335673 338041
54293 338041 338874 337933 336474 335530 335094 334829 334675 334556 334184 333436 332454 331068 328562 324492 319651 315765 314030
54276 314030 314027 314183 313125 310426 306420 302024 298761 297951 299196 300400 300104 299196 299298 300151 299997 298263 296167
54259 296167 294592 293101 291521 290747 291073 291275 290599 290337 291945 294514 295749 294994 293759 293376 293517 293148
54243 293148 291945 290461 289576 289839 290782 290993 289547 287317 286157 286813 288237 288893 288065 285961 283341 281316
54227 281316 280706 281090 280883 278950 276084 274505 275733 279073 282243 283393 282408 280430 278561 277263 276603
54212 276603 276495 276679 276810 276658 276101 275138 274092 273420 272997 272109 270771 270423 272343 275758 278672 280403 282006
54195 282006 284162 286066 286825 286741 286629 286802 287181 287532 287197 285584 283313 281887 281799 282043 281879 281780 281995 281664
54177 281664 280311 278946 278491 278247 277262 276200 276354 277495 278266 278220 278062 278123 277993 277593 277428 277744 278350 279215
54159 279215 280431 281754 282905 283992 284891 284754 283048 280598 278551 276859 274992 273589 273818 275226 275905
54144 275905 275026 273816 273649 274378 275072 275290 275038 274387 273707 273621 274197 274834 275284 276093 277619 279299 280437 281134
54126 281134 281864 282545 282652 282045 281199 280669 280657 281058 281738 282681 283840 284828 285000 284119 282813 282060 282207 282693
54108 282693 282622 281454 279367 277220 275904 275404 274775 273347 271552 270124 268994 267754 266881 267583 270387 274513
54092 274513 278586 281294 281548 279063 275129 271988 270955 271502 272381 273082 273864 274900 275924 276551 276569 276080
54076 276080 275503 275307 275596 276047 276265 276070 275568 275311 276201 278646 281727 283762 284110 283969 284970 287277 289546
54059 289546 290686 291074 291864 293534 295515 297094 298200 299211 300450 302086 304179 306373 307836 308049 307526
54044 307526 307255 307502 307820 308170 309141 310838 312412 313223 313815 315142 317369 320045 322938 325931 328495 330207
54028 330207 331639 333970 337692 342327 347370 352707 358006 362497 365750 368161 370228 371791 372449 372426 372399
54013 372399 372441 371695 369370 365731 361835 358577 356386 355595 356311 357847 359022 359379 359493 359593 358702 356034
53997 356034 352720 351018 351894 354338 356998 359442 361729 363747 365443 367003 368519 370049 372122 375460
53983 375460 380073 385242 390463 395722 400976 406298 412534 420682 430441 440413 449922 459438 469089 478185
53969 478185 486687 495616 505170 513759 519997 524698 529902 536605 544109 550796 555012 556272 556212 557179 559212
53954 559212 559729 557074 552833 549481 547283 545091 542859 541276 539648 536140 529998 522168 513995 506532
53940 506532 500584 496064 491615 486036 479614 473090 466217 458792 452192 447969 445310 441754 436395 430778
53926 430778 426576 423844 421663 419233 416197 412813 409730 406839 402990 397870 393284 391079 390556 389732 388510
53911 388510 388507 390008 391331 391392 390972 391060 391617 392332 393130 393738 394133 395368 398368 401966 404039 404673 406293 410388
53893 410388 416052 422063 428326 434623 439990 444237 448389 452925 457298 461805 468006 476498 486297 497315
53879 497315 511186 528260 546042 562478 578876 597175 615705 630219 638608 642479 644377 645338
53867 645338 645188 643636 640828 637820 636332 637108 638885 640084 641172 644188 650071 657583 664895 671335 677534
53852 677534 684678 693689 704444 715736 726396 736401 746527 757274 768501 779616 789484 796633
53840 796633 800364 801516 801585 801278 800388 798597 795701 791387 785606 779089 772862 767159 761227 754146 745480
53825 745480 735239 723568 710538 696123 680620 665073 650843 638565 627922 618517 610300 602808
53813 602808 594745 585035 574015 563026 552994 543742 534494 524800 515165 506913 501074 497305 494308
53800 494308 491241 487962 483824 477402 468241 458273 450541 446575 445395 444829 443410 441230 439315 438089
53786 438089 436494 433087 428106 423757 422062 422883 424407 425090 424634 423494 422006 420088 417680 415455 414732
53771 414732 416165 418669 420409 420824 420892 421357 421688 421117 419835 418536 417410 416179 414712 413196 411990 411584
53755 411584 412385 414400 417358 421019 424918 428171 430327 432257 435298 439701 444900 451083 459139 468843
53741 468843 478450 486538 493245 499476 505981 513454 522182 531222 539147 546082 553663 562517 571121 577785
53727 577785 582463 585955 588769 591538 595080 598971 601293 600851 598569 595907 593175 590335 587866 585475
53713 585475 581285 573913 564433 555013 546616 539356 533792 530071 526571 521255 514029 506485 499875 494497
53699 494497 490227 486295 481327 475030 469004 464452 460230 454930 449709 446664 445065 441828 435711 428671
53685 428671 422875 418626 415674 414376 414638 415387 416019 417092 418880 420454 420793 419736 417408 413982 410615
53670 410615 409330 410979 414000 415896 415489 413512 411716 411709 413852 416914 419378 421155 423337 426397 429752
53655 429752 433070 436656 440148 442299 442814 443250 445135 448049 450529 452167 453771 455979 458862 462685 467810
53640 467810 473548 478070 480260 481247 483324 487237 491314 493732 495034 497428 501814 506742 510625 513776
53626 513776 517465 521855 525843 528438 529494 529566 529758 531063 533061 533978 533038 531912 532599 534574 535661 535228
53610 535228 534651 534635 534004 531734 528719 526768 526759 528226 529884 530267 528861 527004 526733 528350 530008 530040 528725
53593 528725 527282 526164 525084 523942 522852 521648 520133 518667 518038 518717 520345 521845 522148 521144 519828
53578 519828 519296 519874 521616 525092 530779 537882 544667 550001 553921 556891 559304 561544 563655 565118 565831
53563 565831 567049 570175 574716 578761 581619 584653 589195 594967 601143 607755 615128 622762 629727 635808
53549 635808 641648 647992 655091 662478 669184 674560 678954 683131 687195 690851 694646 699869 706776 713675
53535 713675 718265 719578 718578 717337 717546 719258 721153 722427 723778 725807 727354 727020 725654 725304 725920
53520 725920 725466 723698 723217 725439 727683 726266 721217 716050 713632 714013 715725 717442 718378 718514 718785 720183
53504 720183 722429 724062 723899 722067 719717 718114 717800 718352 719113 720161 722124 725034 728136 731018 734041
53489 734041 737317 740236 742551 745033 748365 752203 756040 760195 765182 770810 776754 783418 791349 800383
53475 800383 810090 820434 831197 841565 851368 862076 875305 890734 906752 922896 940231 959289
53463 959289 979051 998531 1018425 1040448 1065446 1092652 1120682 1148987 1178204 1209018 1240869
53452 1240869 1272453 1303629 1336087 1371558 1409935 1449773 1490120 1530984 1572429 1614121 1655668
53441 1655668 1696745 1737135 1777353 1818916 1863008 1908918 1954612 1998786 2041599 2083473 2124179
53430 2124179 2163348 2200993 2237174 2271819 2305231 2338193 2371161 2403810 2435678 2466791 2497284
53419 2497284 2526895 2555359 2582967 2610193 2636917 2662471 2686410 2708729 2729278 2747415 2762469
53408 2762469 2774169 2782259 2786001 2784724 2778958 2770337 2759973 2747315 2731185 2711541 2689536 2666011
53396 2666011 2640847 2613881 2585502 2555832 2524095 2489591 2452930 2415607 2378593 2342025 2306206
53385 2306206 2272078 2240287 2210175 2180174 2149302 2118139 2088357 2061401 2037738 2017204 1999629
53374 1999629 1984843 1972384 1961766 1953035 1946643 1942690 1940706 1940348 1942035 1946691 1955097 1967541 1983840
53361 1983840 2003483 2025847 2050488 2077337 2106769 2139391 2175363 2213880 2253845 2295315 2339540
53350 2339540 2387104 2436796 2487248 2538948 2593434 2650992 2710671 2772425 2837462 2906197 2977494
53339 2977494 3050681 3126798 3206864 3290131 3375344 3462823 3553872 3648537 3745193 3842173 3938819
53328 3938819 4035037 4130750 4225916 4320365 4413473 4504433 4592871 4678741 4761613 4840499 4914535
53317 4914535 4983640 5048245 5108331 5162864 5210559 5251483 5287340 5319463 5346866 5367144 5378981
53306 5378981 5382497 5377156 5360975 5332619 5293086 5244348 5187236 5121570 5047605 4966364 4879191 4787869
53294 4787869 4694469 4599933 4503321 4403640 4302104 4201458 4103338 4007453 3913349 3821618 3732887
53283 3732887 3646471 3560754 3474611 3388236 3302826 3219677 3139482 3062429 2988791 2919003 2853039
53272 2853039 2790341 2730827 2675542 2625674 2581167 2540735 2503071 2467668 2434720 2404626 2377339
53261 2377339 2351923 2327171 2303124 2281552 2264340 2251638 2241934 2233526 2225432 2217336 2209557 2203073
53249 2203073 2198982 2197733 2199030 2202429 2207992 2216552 2229189 2245828 2264413 2282367 2299281 2317379
53237 2317379 2338943 2364130 2391793 2421342 2452847 2486047 2520399 2555841 2592716 2631236 2671436
53226 2671436 2713012 2754714 2794760 2832572 2869211 2905263 2939514 2970844 3000178 3028729 3055170
53215 3055170 3076665 3092358 3103719 3111453 3114336 3111701 3105001 3095780 3083500 3066531 3044248 3017050
53203 3017050 2985149 2948458 2907268 2862248 2814092 2763670 2711912 2658921 2603792 2546070 2487047
53192 2487047 2428802 2372219 2316747 2261915 2208118 2155650 2103844 2051891 2000086 1949446 1900066
53181 1900066 1850663 1800162 1749128 1698997 1650318 1602695 1556227 1511811 1469725 1428918 1388344
53170 1388344 1348272 1309738 1273422 1239736 1209318 1182496 1158544 1136113 1114170 1092162 1069846
53159 1069846 1047559 1026052 1005436 984926 964250 944488 926488 909248 891108 872058 853580
53148 853580 836435 819850 802845 785337 768023 752098 738817 728214 718402 707291 694947 683245
53136 683245 673404 665017 657357 650194 643128 635457 627113 618766 610806 603119 595858 589194 582256 573749
53122 573749 564046 555332 549079 544580 540507 536590 532866 528498 522679 516018 509868 504570 499384 493997
53108 493997 489170 485709 483383 481210 478663 476336 475171 475102 474945 473903 472521 471548 470576 468888 467095
53093 467095 466509 466993 466874 465189 462621 459935 456922 453490 450498 448696 447848 447533 447760 448166 447737 446225
53077 446225 444843 444606 444997 445306 446273 448970 452683 455390 456219 456164 456354 456699 456512 455726 455203 456148 459116
53060 459116 463282 466935 469151 470664 472741 475608 478483 480694 482046 482492 482164 481496 480709 479558 478206
53045 478206 477782 478959 480382 479795 476838 473508 471583 470686 469417 467326 464990 462918 461329 460551 460666
53030 460666 460949 460470 459168 457517 455191 451142 445415 439957 436703 435380 434102 431937 429866 429092 429371
53015 429371 429565 429161 428507 427880 426989 425415 423110 420496 418298 417212 417441 418578 420018 421319 422090 421944
52999 421944 420787 418920 416686 414347 412344 411038 409995 408327 406212 405182 406127 407693 407750 405973 403961
52984 403961 403165 403815 405617 408100 410092 410085 407729 404332 401551 400075 399667 399765 399826 399630 399575 400341 402174 404741
52966 404741 407410 409298 409471 407824 405511 403822 403031 402988 404075 406244 407701 406402 402902 400053 399467
52951 399467 399898 399653 398979 399055 399925 400723 401191 401823 402880 404137 405391 406656 408015 409563 411172 412303
52935 412303 412628 412851 414012 415848 416894 416567 416118 416897 418669 420323 421430 422344 423469 425108 427356 429494
52919 429494 430202 429184 427981 428451 430867 434157 437332 440050 442311 444439 446838 449034 449417 446948 442887
52904 442887 439966 439782 441506 443035 442875 441004 438497 436513 435447 434894 434357 433847 433903 435201 437852 440619
52888 440619 441289 438702 434323 430903 429593 429244 428514 427501 427056 427510 428443 428872 427605 424514 421512 420909
52872 420909 422432 423368 422145 420291 420050 421493 423060 423637 422971 421084 418481 416111 414145 411716 408736
52857 408736 406688 406472 406708 405647 403658 402232 401499 400603 399863 400556 402773 405235 407198 408911 410173 410071
52841 410071 408611 407267 407318 408403 409162 408818 408004 408368 411110 415479 419186 420870 421525 422722 424290 424920
52825 424920 424335 423354 422150 420133 417650 416350 417335 419873 422303 423538 423546 423067 423031 423813 424999 426085 426965
52808 426965 427418 426975 426115 426672 429841 434360 437922 440035 442098 444954 447731 449035 448132 445051 440673
52793 440673 436584 433756 431528 428910 426334 424679 423148 420085 415767 412337 410562 408570 404506 398765
52779 398765 392856 387673 383904 382659 384279 387384 390171 392058 393251 393615 393013 392146 391969 392539 393225 393772
52763 393772 394414 395197 395829 396052 395610 393981 390743 386316 382186 380265 381854 386722 393043 398548 402040
52748 402040 403842 405023 406538 408839 411605 413768 414267 412924 410321 407029 403440 400125 397555 395386
52734 395386 392730 389319 385937 383580 382548 382341 382007 380628 378043 375217 373577 373900 375966 378879 381511
52719 381511 383062 383690 384109 384221 382928 379913 376654 374740 374035 373726 374245 376561 380194 383741 386958 390397
52703 390397 393221 393561 391413 389102 388259 388125 387533 386784 386530 386387 385890 385656 386409 387702 388538 388570 388062 387573
52685 387573 388171 390824 394876 398360 400620 403317 407800 412765 415999 417433 418764 420581 421599 420854 419304
52670 419304 418840 420308 422801 424658 425118 424990 425411 426154 425983 424593 422990 421676 419850 417075 414374 412726
52654 412726 411686 410666 410350 411422 412855 413042 411897 410332 408436 406000 404342 405392 408755 411637 412185
52639 412185 411350 410871 411001 411136 411262 411474 410926 408718 405623 403729 404129 405721 406671 406609 406856 408570 411239
52622 411239 413389 414408 414824 414726 413029 409240 405188 403585 404817 406387 405957 403907 402201 401621 401251 400356
52606 400356 399516 399588 400425 401189 401532 401898 402930 405094 408659 413353 418002 421306 423347 425708 429601 434376
52590 434376 438505 441551 444215 446689 448050 447552 445665 443428 441393 439688 438549 438153 438088 437499 435870
52575 435870 433553 431500 430439 430255 430363 430832 432673 436521 441426 445740 448983 451808 454147 454668 452646
52560 452646 449383 446832 445369 443826 441394 438589 436212 434086 431352 427872 424943 424321 426522 430275
52546 430275 433675 435526 435517 433877 431505 429871 429728 430063 429195 426928 424664 423396 422612 421473 420225 419976
52530 419976 421614 425140 429533 433157 435015 435658 436279 437013 437087 436607 436935 438941 441970 444946 447451 449272
52514 449272 450015 449849 449655 449733 449262 447767 446178 445606 445934 446509 447420 448982 450527 450838 449503 447012 443791
52497 443791 440008 436143 432990 431042 430251 430226 430398 430283 429816 429154 428116 426485 424881 424458 425469 426985
52481 426985 428328 429686 430945 431157 429980 428597 428305 429082 430348 432170 434751 437666 440563 443722 446913
52466 446913 448745 448385 447061 446531 446830 446904 446655 446804 447372 448032 449554 453108 458143 462599 465357 467112
52450 467112 468697 469933 470408 470217 469639 469043 469197 470637 472577 473469 472787 471384 470124 469176 468633 468585 468391
52433 468391 467027 464507 461982 460160 458647 457201 456553 457390 459283 461174 462344 462542 461790 460532 459427
52418 459427 458613 457586 456086 454700 454299 455196 457019 459105 460932 462488 464306 466978 470638 474997 479483
52403 479483 483187 485307 486136 487068 489020 491435 493395 494847 495742 494916 491309 485931 481078 477801 475498
52388 475498 473734 472767 472150 470558 467683 465005 464023 464651 465733 466269 465853 464960 464993 466859 469238 469549 467033
52371 467033 463600 461244 460130 459911 461112 463865 466548 467347 466446 465315 464532 463779 463515 464960 468343 472506
52355 472506 476432 480106 483668 486849 489690 492859 496623 500167 502791 505372 509725 516392 523762 529869
52341 529869 534639 539696 546028 552591 557522 560082 560786 560055 557665 553646 548910 544594 541141 538263 535585
52326 535585 533048 530852 529172 527956 527036 526419 526266 526574 527209 528420 530777 534251 537904 541034 544145
52311 544145 548099 552752 557257 561394 565692 570347 574855 578643 581298 582381 581948 581199 581559 582947 583854
52296 583854 583379 582341 582112 583135 584961 587058 589074 590693 591678 592046 592273 593395 596426 601203 606298
52281 606298 610711 615078 620383 626184 631409 636417 642743 650931 660097 669571 679332 688747 696683 703420
52267 703420 710887 720360 731350 743359 757054 772757 789269 805400 821506 838333 855415 871926
52255 871926 888234 905297 923185 941409 960183 980116 1000999 1021908 1042197 1061646 1080191
52244 1080191 1098431 1117888 1139624 1162796 1185413 1206412 1226362 1246518 1267833 1290403 1313045
52233 1313045 1333798 1351634 1367314 1381879 1394887 1405141 1412721 1419104 1425341 1431159 1435891 1439395
52221 1439395 1441855 1443393 1444167 1444449 1444554 1444958 1446325 1448943 1452166 1454794 1456053 1456197 1456418 1458142 1461877
52206 1461877 1466646 1471219 1475907 1482138 1489978 1497516 1503563 1509682 1518171 1528958 1540114 1550890 1562625
52193 1562625 1576695 1593053 1610950 1629813 1649014 1667807 1685890 1703404 1720152 1735348 1748253
52182 1748253 1758572 1766437 1772629 1778557 1785155 1791883 1797475 1801472 1804239 1805896 1806368 1806263 1806281 1805615 1802359
52167 1802359 1796136 1789134 1783669 1779535 1774601 1767609 1759629 1752954 1749067 1747559 1746620 1744585 1741150 1737199
52153 1737199 1733784 1731556 1730833 1731531 1733099 1735130 1737941 1742050 1747217 1752706 1758177 1763386 1767316 1769103
52139 1769103 1770076 1773285 1780122 1788632 1796244 1803005 1810597 1818969 1826000 1830700 1834993 1841373 1849837 1858131
52125 1858131 1864353 1868256 1870283 1870589 1869379 1867313 1864744 1860862 1854380 1845133 1834500 1824106 1814522 1805486
52111 1805486 1796968 1789487 1783481 1778768 1774855 1771618 1769494 1768807 1768897 1768204 1765624 1761658 1757828 1755113 1753509
52096 1753509 1753027 1754092 1756473 1758659 1759203 1758335 1757556 1757842 1758943 1760296 1761928 1764373 1768096 1772975 1778043
52081 1778043 1781937 1784007 1784775 1785047 1785028 1784851 1785306 1787065 1789388 1790718 1790729 1791078 1794001 1800747 1811187 1823999
52065 1823999 1837125 1849116 1860501 1873208 1888443 1905886 1925053 1946192 1969142 1992327 2013990
52054 2013990 2034008 2053651 2073896 2094778 2115984 2137105 2157358 2176026 2193335 2210281 2227425
52043 2227425 2244440 2261017 2277586 2294751 2312383 2329641 2345744 2360502 2374295 2387610 2400340
52032 2400340 2411421 2419482 2424061 2425927 2426024 2424438 2420653 2414372 2405583 2394167 2380260 2365011 2350237
52019 2350237 2337112 2325718 2315887 2307509 2299624 2290354 2278939 2267348 2258575 2253348 2249584 2245224 2240517
52006 2240517 2237154 2236213 2237571 2240543 2244297 2248144 2252180 2257363 2264382 2272759 2281527 2290393 2299570 2308865
51992 2308865 2317722 2326109 2334668 2343789 2352894 2360606 2365467 2366837 2365453 2362794 2359492 2354835 2348305 2340883
51978 2340883 2333789 2326419 2316941 2305014 2292566 2281383 2271061 2260100 2248040 2235515 2222757 2209204
51966 2209204 2194431 2178552 2161681 2143897 2125977 2109259 2094199 2079544 2063656 2046405 2029117
51955 2029117 2012794 1997172 1981667 1966343 1951335 1936030 1919683 1902523 1885340 1868069 1849735
51944 1849735 1829880 1809017 1787305 1763708 1737189 1708199 1678461 1649699 1622903 1598123 1574368
51933 1574368 1550288 1525626 1501516 1478737 1456287 1432538 1407352 1382066 1357686 1333987 1310214
51922 1310214 1285826 1260694 1235313 1210567 1186568 1162167 1136675 1111711 1089944 1072018 1056094
51911 1056094 1040670 1026536 1015513 1008491 1005270 1005108 1006600 1008016 1008747 1009763 1011946 1014720 1017189 1019780
51897 1019780 1023579 1028479 1033161 1036638 1038692 1038917 1036641 1032145 1026927 1022272 1018293 1014910 1013037 1013904
51883 1013904 1017469 1022423 1027928 1034692 1043942 1055816 1069387 1083989 1099697 1116341 1132949 1148782
51871 1148782 1164243 1179756 1194058 1204798 1211143 1214753 1217659 1220007 1220608 1219040 1216224 1213292 1210907
51858 1210907 1209734 1210516 1213141 1216107 1217268 1214895 1207892 1195571 1177796 1155287 1129461 1101938 1074298
51845 1074298 1047988 1023966 1002443 983312 966831 953472 942997 934223 925982 917821 909363 899688
51833 899688 888318 876428 865691 855660 843708 828390 811734 796957 784784 773661 763250
51822 763250 755679 752715 753354 755262 757509 760628 764771 769368 774435 780750 788336 795832 801955 806906
51808 806906 811713 816580 820433 821852 820105 815580 809708 804252 800147 797012 794051 791155 788687 786629
51794 786629 784758 783497 783517 784310 784296 782810 780790 778602 774437 766461 755910 746186 738919 732725 726159
51779 726159 719987 715501 712161 708420 703953 699545 695355 690915 686749 684561 685389 688449 692097 695210
51765 695210 697447 698845 699516 699426 698318 696201 693789 691946 690733 689603 688633 688846 690939 694024 696020
51750 696020 695262 691788 687347 684228 683702 685323 687728 690026 692269 694695 696879 697888 697249 695609 694261
51735 694261 693871 693931 693656 693014 692386 691653 690601 689973 690825 692663 693556 692651 691207 690438 689850 688849 688444 689532
51717 689532 690632 689583 687045 686011 687733 690310 691916 693534 697418 704175 712477 720828 728588 735801
51703 735801 742801 749806 756497 762258 766894 770678 773592 775002 774179 770702 764610 756718 748568 741251
51689 741251 734489 727586 720842 714920 709364 703244 697110 692574 689890 687705 685575 684843 686408 689367
51675 689367 692808 697308 703509 710703 718119 726208 735106 743024 747925 750198 752058 754727 757596 759870
51661 759870 761595 763196 765027 767270 769389 770018 768307 765079 761762 758714 755592 752739 750774 749132
51647 749132 746593 743249 740455 738565 736257 732723 729325 728143 729570 732225 734686 736478 737528 737460 735822
51632 735822 732851 729779 728066 728113 728834 728772 727573 726102 725156 724404 722736 719457 715014 710561 706905 704051
51616 704051 701853 700705 701058 702376 703359 703483 703778 705765 710026 715986 722587 728896 734611 740295 746727
51601 746727 753886 761108 768157 775064 780619 782390 779269 773199 767336 763139 760236 758367 757965 758921 760088
51586 760088 760329 759385 757598 755320 752519 748479 742224 733868 725118 717593 710936 703582 695190 687250 681245
51571 681245 677197 674329 672231 670951 670493 670679 671286 672139 673235 674673 676231 677263 677448 677359 677766 678574
51555 678574 679052 678919 678517 677995 676989 675158 672586 669723 667317 666067 665784 665229 663538 661540 660827 661747
51539 661747 663336 665157 668047 672742 678737 685023 691321 698132 706082 715539 726372 737617 747646
51526 747646 754994 759053 760217 759768 759386 760035 761228 761975 762572 764760 769867 777417 786025 795259 806056
51511 806056 819383 834861 851057 867159 884089 903396 925003 946801 966854 985288 1003347
51500 1003347 1021462 1039500 1058440 1080342 1106464 1136453 1169402 1204385 1239494 1271581 1297900
51489 1297900 1317600 1331112 1338584 1339336 1332400 1317311 1294837 1267134 1236667 1204702 1171242 1136383
51477 1136383 1100961 1065801 1031413 998847 969826 945145 923683 903861 885598 869962 857287
51466 857287 846712 837555 830241 825559 823460 822918 822637 821728 819901 817330 814465 811884 809887 807877 804311
51451 804311 797974 789419 780570 772682 765338 757828 750546 743998 736955 727132 714166 700915 690995 685483
51437 685483 682636 680356 677885 675278 672505 669800 668134 668284 669545 670092 668683 665484 661436 657581 654978
51422 654978 654242 654727 654903 653971 652514 651215 649733 647463 644663 642067 640040 638895 639445 642097 645734
51407 645734 648519 649698 649769 649104 647486 645053 642641 640866 639550 638293 637091 636210 635881 636163 636760 637131
51391 637131 637164 637506 638758 640760 643274 646850 652177 658969 666396 674209 682474 690745 698740 707302 717082
51376 717082 726451 732667 735437 737603 741674 747223 752361 756158 758489 758778 756357 751494 745116 738041
51362 738041 731190 725816 722641 721134 720229 719256 717795 715391 712065 708512 705315 702659 701129 701666 704065
51347 704065 706500 707476 707439 707722 708770 710261 712052 714070 716059 718445 722528 728705 735319 740487 744380
51332 744380 748515 753717 760205 768818 780296 793796 807908 822770 839316 856795 873470 890124
51320 890124 910541 937472 969926 1005477 1043549 1084963 1129597 1176234 1223931 1271812 1317703
51309 1317703 1358415 1391555 1416224 1432042 1438567 1435847 1424721 1406140 1380604 1348476 1310554 1268231
51297 1268231 1223395 1178152 1134185 1092097 1051558 1012251 974538 939134 906419 876416 849380
51286 849380 825951 806356 789544 773601 757239 740719 725173 711431 699781 690361 682899 676079
51274 676079 668133 658645 649318 642308 637997 634900 631555 627799 624178 620924 618031 615752 614230 612823
51260 612823 610647 607959 606258 606615 608491 610716 613096 616234 620161 624051 627291 629933 631962 633001
51246 633001 633062 632793 632480 631433 628882 625016 620741 616962 614433 613536 613433 612130 608313 602810 597508 593286
51230 593286 589934 587534 586498 586247 585353 583464 581972 582216 584036 586833 591040 597312 604659 610684 613908
51215 613908 615146 616344 618612 621609 624347 626118 626854 627024 627385 628648 631115 634502 638123 641381 644114
51200 644114 646509 648824 651316 654196 657266 659616 660205 658924 656727 654417 651762 648347 644981 643366
51186 643366 644072 645507 645436 643197 639761 635844 630875 624370 617681 613409 612859 614648 616238 616472 616089 615912
51170 615912 615417 613571 610617 608202 607643 608675 610162 611499 612895 614718 617162 620317 623901 627065 629229
51155 629229 631133 634223 638746 643312 646781 649703 653127 656706 659149 660283 661550 664258 668230 672443
51141 672443 676320 679965 683582 687070 689987 691730 691961 690957 689433 687953 686695 685565 684236 682250
51127 682250 679576 676998 675464 675022 674827 674201 673290 672625 672437 672497 672393 672030 672002 673141 675335 677248 677787
51110 677787 677360 676947 676438 674953 672460 669860 667610 665601 664388 665070 667594 670540 673113 676038 679858
51095 679858 683649 686207 687400 687542 686678 685427 685235 686475 687245 685517 681650 677440 673506 669348 665384
51080 665384 662940 662180 661797 661065 660746 661556 663027 664410 665604 666687 667504 668250 669649 672091 675340 679402
51064 679402 684635 690445 694951 697019 698034 700602 705670 711795 717050 720759 723381 725658 728376 732259
51050 732259 737330 742445 746025 747448 747566 747842 749261 751975 755483 758777 760775 761268 761292 761996 763242 764000
51034 764000 764062 764438 765669 766612 765629 762625 759260 757352 757463 758809 760162 760902 761374 762116 762832 762739 761905
51017 761905 761410 761886 762736 763309 763999 765503 767756 770390 773544 777323 781057 784172 787325 791743 797758
51002 797758 804887 812889 821720 830894 840158 850541 863437 878646 894437 909496 923651 936765
50990 936765 948383 958842 969453 981042 993196 1005267 1017106 1028378 1038255 1046314 1052769 1057212
50978 1057212 1058055 1054171 1046499 1037368 1028665 1021211 1015349 1011233 1008661 1007050 1005440 1002506 997264 990247
50964 990247 983479 978700 976002 974589 974281 975555 978476 982391 986635 990932 995067 998754 1002114 1005984
50950 1005984 1011501 1019297 1029082 1040004 1051471 1063618 1076921 1091546 1107151 1123081 1138432 1152301
50938 1152301 1164525 1175997 1187608 1198987 1208953 1217163 1224405 1231124 1236636 1240311 1242761 1245142 1247849
50925 1247849 1250589 1253521 1257666 1264275 1274231 1287959 1305482 1326455 1350206 1375665 1401303 1425723
50913 1425723 1448691 1471423 1495507 1521738 1550247 1581416 1616034 1654343 1695294 1737381 1780584
50902 1780584 1827265 1880496 1941026 2006297 2072870 2139414 2206751 2275439 2344368 2411662 2475862
50891 2475862 2535881 2590819 2640496 2685599 2726788 2764023 2797117 2826439 2852633 2876186 2897742
50880 2897742 2918463 2939541 2961468 2983887 3005610 3024503 3038179 3045627 3047959 3046974 3043203 3035743
50868 3035743 3023543 3006034 2982716 2953027 2916920 2875172 2828894 2778960 2725831 2669663 2610531
50857 2610531 2548756 2485118 2420708 2356683 2294064 2233369 2174364 2116735 2061332 2010203 1964689
50846 1964689 1923800 1885225 1847821 1812431 1780296 1751495 1725148 1700413 1676877 1654577 1634183
50835 1634183 1616701 1602318 1589894 1578270 1567864 1560073 1555055 1551072 1546582 1542142 1539538 1539559 1541598
50822 1541598 1545105 1550257 1556915 1563926 1570102 1575521 1581488 1589537 1600586 1614521 1630304 1646896 1664233
50809 1664233 1682868 1702792 1723620 1746214 1772861 1804934 1841222 1879493 1918957 1960257 2003942
50798 2003942 2050347 2100402 2154946 2213515 2275321 2341424 2414296 2494982 2582278 2675274 2775131
50787 2775131 2883389 2999687 3122398 3250807 3385367 3526034 3671371 3819430 3968855
50778 3968855 4118877 4268526 4415932 4558245 4692140 4814505 4922964 5016323 5094751 5159197
50768 5159197 5210366 5248784 5276190 5295981 5311390 5323786 5333731 5343053 5354504 5369592 5388050 5409145
50756 5409145 5431871 5453694 5470738 5479816 5479164 5467012 5441018 5399753 5343370 5272088 5185245 5082830
50744 5082830 4966919 4840832 4707748 4570741 4432898 4296430 4162557 4033103 3911169
50735 3911169 3799327 3698127 3607331 3527500 3459228 3401898 3354714 3318212 3293150 3278199 3270095
50724 3270095 3265948 3264360 3264596 3265931 3267878 3270165 3272347 3273917 3274487 3273325 3269250 3261632 3250894 3237283
50710 3237283 3219840 3197456 3170246 3138794 3102806 3061745 3016167 2967006 2914090 2857032 2797418
50699 2797418 2738351 2681595 2626631 2572872 2521423 2473953 2430867 2391398 2355054 2322455 2295055
50688 2295055 2274161 2259922 2251270 2247094 2247145 2251516 2260059 2273187 2292460 2319019 2351781 2388676 2429555
50675 2429555 2476355 2530215 2589908 2653615 2720998 2792774 2869168 2949396 3032012 3115331 3198155
50664 3198155 3280369 3362185 3442715 3520238 3594015 3664615 3731927 3793932 3848186 3893509 3929388
50653 3929388 3954655 3968179 3970599 3964382 3952253 3936347 3918733 3901835 3887858 3878256 3873984 3875894
50641 3875894 3884379 3898547 3916065 3934194 3951072 3965812 3977454 3984407 3985174 3979021 3965500 3943973
50629 3943973 3914441 3878319 3837425 3792575 3744350 3695087 3648677 3608050 3573863 3545885 3524421
50618 3524421 3509977 3502851 3503937 3514896 3536529 3567807 3607435 3655661 3713443 3780548 3855751 3938409
50606 3938409 4028213 4123215 4219488 4313287 4402657 4486658 4564248 4634858 4699306 4759029 4814638
50595 4814638 4865983 4913235 4956628 4994843 5024817 5044159 5053452 5055542 5052850 5046105 5035488 5022035
50583 5022035 5007469 4993425 4981401 4973032 4969621 4971351 4977404 4986990 4999960 5016309 5035273 5055235
50571 5055235 5074643 5092875 5109870 5124858 5136036 5142035 5143372 5141831 5138614 5133678 5126277 5114722
50559 5114722 5095560 5064816 5021368 4968582 4911993 4856012 4803209 4755365 4713717 4678584 4649912
50548 4649912 4628034 4613040 4603653 4597447 4591787 4583953 4571038 4550804 4522286 4484757 4436747 4377150
50536 4377150 4306760 4227570 4141155 4048987 3953592 3857543 3761583 3665522 3570870 3480503 3395395
50525 3395395 3313704 3233879 3157045 3085381 3019695 2959745 2905631 2857544 2814961 2777354 2745190
50514 2745190 2719318 2699842 2686389 2678870 2677153 2680497 2688140 2700000 2716090 2735781 2758520 2784835
50502 2784835 2815598 2850409 2887705 2926748 2968963 3016946 3072311 3134611 3202347 3274969 3353575
50491 3353575 3439338 3531547 3627841 3726271 3826349 3927999 4030375 4132200 4232767 4332201
50481 4332201 4431147 4530295 4629849 4729505 4829559 4931806 5038317 5149350 5263615 5380668
50471 5380668 5501536 5626375 5753069 5879343 6005339 6133068 6264149 6399241 6538858
50462 6538858 6683241 6831429 6981423 7131097 7278221 7419937 7553199 7675614 7785061
50453 7785061 7878572 7952404 8003376 8029721 8030768 8006343 7956492 7881568 7782893 7663545 7528044
50442 7528044 7380820 7225491 7066073 6908093 6757473 6618396 6492919 6382461 6288958 6214525
50432 6214525 6160292 6125330 6106481 6099661 6101675 6110233 6121761 6129937 6127169 6107193 6065977 6001226
50420 6001226 5912409 5800946 5669342 5520263 5357130 5184948 5009090 4833027 4658040 4485048
50410 4485048 4315841 4152550 3996756 3849246 3710075 3579010 3456638 3344778 3244991 3156773
50400 3156773 3077919 3006424 2941186 2881273 2825865 2775032 2729413 2688957 2653005 2621785 2596622
50389 2596622 2578184 2565455 2556881 2551679 2549674 2550824 2555549 2564688 2578444 2595976 2616599 2640718
50377 2640718 2668843 2700102 2732328 2763267 2791403 2816252 2838558 2859828 2881146 2902762 2925177
50366 2925177 2949929 2978538 3011118 3046744 3084775 3125043 3167187 3210899 3256811 3306149 3359334
50355 3359334 3415764 3475144 3538184 3605677 3677640 3753870 3834523 3919401 4007246 4096653 4187345
50344 4187345 4279451 4371440 4459781 4541173 4614578 4680692 4740129 4792571 4836882 4870871 4891132
50333 4891132 4894267 4878755 4845229 4795111 4729877 4651744 4563808 4468690 4367863 4263239 4158625
50322 4158625 4058260 3964081 3875722 3793408 3719576 3657051 3606653 3567470 3538674 3519811 3509385
50311 3509385 3504304 3501148 3497329 3490703 3478746 3458986 3430108 3392034 3344900 3288605 3223689 3152205
50299 3152205 3077102 3000657 2923619 2845744 2766924 2687962 2610626 2537035 2468700 2405963 2348309
50288 2348309 2295114 2246092 2201345 2161232 2125882 2094567 2065981 2039694 2016896 1998975 1985430
50277 1985430 1973956 1962340 1949431 1934429 1916652 1896564 1875939 1856190 1837223 1818497 1800500
50266 1800500 1784444 1771221 1761426 1755757 1754305 1755793 1758378 1761121 1764201 1768189 1773873 1782223 1793433
50253 1793433 1806227 1818929 1831104 1843393 1856211 1869586 1883887 1899494 1915952 1932700 1950547
50242 1950547 1970879 1993224 2015085 2034801 2053338 2072668 2093570 2115752 2138897 2162451 2185180
50231 2185180 2206129 2225658 2244936 2265063 2287259 2312463 2338978 2361087 2372092 2369440 2356013
50220 2356013 2336529 2314149 2290849 2269048 2250954 2236784 2225266 2216198 2211451 2212805 2219457 2228526
50208 2228526 2237979 2248336 2261164 2276562 2292920 2309136 2326234 2346338 2370554 2398472 2429390
50197 2429390 2463222 2500200 2540534 2584794 2634114 2689430 2750638 2816890 2887609 2962862 3042760
50186 3042760 3126765 3213427 3300325 3384280 3462417 3533738 3599554 3661831 3720955 3775333 3823027
50175 3823027 3863108 3895061 3917405 3927614 3923394 3903556 3867724 3815942 3749036 3669009 3578701
50164 3578701 3481274 3380294 3279767 3183201 3092433 3007615 2928156 2853029 2780421 2708306 2636110
50153 2636110 2565211 2497146 2431846 2368316 2306451 2247127 2190873 2137791 2088744 2045156 2006995
50142 2006995 1972137 1938576 1906496 1877341 1851644 1828778 1808216 1789796 1772977 1756970 1741588
50131 1741588 1727100 1713288 1699538 1685865 1673017 1661644 1652136 1645040 1640479 1637223 1633684 1630093
50119 1630093 1628315 1629022 1630455 1630919 1631243 1633448 1637766 1642502 1646613 1651081 1657553 1666507 1677048 1687953
50105 1687953 1698747 1710098 1723154 1738306 1754776 1771750 1789524 1808994 1830272 1852465 1874896
50094 1874896 1898094 1923498 1952369 1984872 2019951 2056227 2093219 2131565 2171980 2214521 2259323
50083 2259323 2307620 2361412 2422101 2489721 2563330 2641954 2725607 2815975 2915855 3027393 3150893
50072 3150893 3285593 3431155 3587660 3754108 3927367 4102720 4275369 4441833 4600521
50063 4600521 4751214 4894036 5029027 5156363 5275991 5386289 5483371 5562048 5617174 5644024
50053 5644024 5638684 5599534 5528346 5429149 5305995 5162271 5001677 4828720 4648014 4463798
50043 4463798 4280218 4101207 3929472 3765848 3610155 3462839 3325538 3199749 3084767
50034 3084767 2977489 2875045 2777640 2688042 2608218 2537419 2473670 2415773 2363220 2315506 2272672
50023 2272672 2235477 2203628 2174677 2146174 2118404 2093570 2072799 2055432 2040765 2028577 2017996
50012 2017996 2007788 1998145 1990538 1985275 1980683 1975361 1969890 1965596 1962785 1960996 1959899 1959057 1957633 1955209
49998 1955209 1952421 1950286 1949439 1950231 1952553 1955083 1955834 1954281 1952215 1951659 1952633 1953563 1953117 1950867 1947102 1943101
49982 1943101 1941061 1942566 1947255 1953744 1961540 1971318 1983711 1998824 2016713 2037399 2060267 2084262
49970 2084262 2108880 2134590 2162199 2192215 2224749 2259594 2296324 2334548 2374105 2414909 2456980
49959 2456980 2500766 2547088 2596495 2649177 2705850 2768180 2837648 2914298 2996993 3084372 3174916
49948 3174916 3266662 3357781 3447119 3533187 3613010 3683493 3744320 3798378 3848614 3895219 3936291
49937 3936291 3970091 3995268 4009150 4007117 3984270 3937634 3867132 3775375 3666870 3546771 3419595
49926 3419595 3288748 3156871 3026150 2898274 2774661 2656954 2546750 2444669 2350229 2263043
49916 2263043 2183488 2111602 2046061 1985280 1929204 1878863 1834271 1794020 1757040 1723522 1693603
49905 1693603 1666391 1641065 1617901 1597259 1578320 1559861 1541807 1525132 1510637 1498586 1489065
49894 1489065 1481925 1476767 1473633 1473043 1474547 1476055 1475851 1474706 1474642 1476034 1477420 1477893 1478028 1478263 1477917 1476270
49878 1476270 1473403 1469465 1464117 1457089 1448389 1437715 1424686 1409948 1394974 1380296 1364927 1348052
49866 1348052 1330468 1313804 1299081 1286434 1275519 1265737 1256757 1249181 1243926 1240680 1237828 1234439 1231544
49853 1231544 1230942 1233267 1237615 1242470 1246708 1250247 1253953 1258397 1262977 1267144 1272170 1280196 1291336 1303322
49839 1303322 1314444 1325192 1336256 1346585 1354734 1360825 1365807 1369769 1372387 1374160 1375641 1375911 1373293
49826 1373293 1367419 1359479 1350496 1340367 1328618 1315350 1301486 1288387 1276872 1266121 1254250 1240613
49814 1240613 1226962 1215629 1207253 1201029 1196382 1193221 1191065 1189257 1187905 1187638 1188503 1190063 1192466 1196523
49800 1196523 1202621 1210200 1218345 1226353 1233906 1241272 1249315 1258874 1270155 1282845 1296339 1309553 1321117
49787 1321117 1330338 1337600 1343511 1348208 1351874 1355101 1358031 1359780 1359299 1356201 1350333 1341583 1330952 1320770
49773 1320770 1312622 1305744 1298540 1291090 1285041 1281548 1280357 1280344 1280030 1278337 1275995 1275399 1277830 1281619 1284469
49758 1284469 1286656 1290111 1295130 1300231 1304993 1310622 1317530 1324562 1331150 1338134 1345605 1351799 1355288 1356829
49744 1356829 1357895 1358576 1358064 1356227 1353505 1349865 1344848 1338222 1329959 1320159 1309645 1299952 1291939 1284920
49730 1284920 1277801 1270527 1263661 1256996 1249527 1240734 1231344 1222851 1216570 1212927 1211198 1210080 1208865 1208013
49716 1208013 1208355 1209886 1211690 1213043 1214344 1216747 1220813 1225782 1230524 1235147 1241073 1249246 1258822 1268049
49702 1268049 1275922 1282459 1287935 1292537 1296410 1299359 1300922 1301311 1301702 1302697 1303010 1300612 1294796 1286210 1275653
49687 1275653 1264207 1253906 1246375 1240814 1235119 1229093 1224764 1223192 1222862 1222054 1220959 1220281 1219273 1216775
49673 1216775 1213339 1210752 1209854 1209987 1210391 1211196 1213190 1217365 1224432 1233965 1244129 1252891 1259762 1266189 1274297
49658 1274297 1285271 1298613 1312685 1326141 1338799 1350944 1362155 1371554 1378947 1384801 1389136 1391571
49646 1391571 1392623 1393653 1394963 1394957 1391948 1386020 1378656 1371474 1365995 1363481 1363898 1365549 1366672 1366943 1366860 1366510
49630 1366510 1365983 1366277 1368519 1372505 1377086 1381872 1387577 1394708 1402817 1411141 1419389 1427886 1437510 1449334
49616 1449334 1463658 1479387 1495008 1510357 1526885 1545962 1567123 1587982 1605574 1617920 1624774
49605 1624774 1627199 1626607 1624254 1621319 1618771 1617027 1616245 1617014 1619933 1624178 1627256 1626828 1622199 1613598 1600965
49590 1600965 1584515 1565842 1547141 1529404 1512362 1496130 1481838 1470416 1461617 1454544 1448506 1443186
49578 1443186 1438661 1435598 1434920 1436794 1440150 1443362 1445158 1444874 1442399 1438271 1433517 1428876 1424070 1418060
49564 1418060 1410216 1401255 1392975 1386969 1383625 1382360 1382459 1383263 1383820 1383263 1381820 1380798 1381088 1382289 1383698
49549 1383698 1385415 1387660 1389692 1390591 1390869 1392028 1394522 1397354 1399995 1403360 1408127 1413127 1416578 1418365
49535 1418365 1419972 1422386 1425269 1428225 1431694 1436051 1440762 1445218 1449909 1455846 1462875 1469346 1473639 1475611
49521 1475611 1476546 1478164 1481640 1486842 1492250 1496207 1498698 1501401 1505576 1510513 1514747 1518275 1522538 1528392
49507 1528392 1535228 1542333 1550098 1559251 1569578 1580165 1590553 1600929 1611293 1620999 1629221 1635517 1639902
49494 1639902 1642688 1644400 1645498 1645934 1645145 1642808 1639580 1636733 1634825 1633058 1630416 1627257 1625146 1625050 1626361
49479 1626361 1627957 1629563 1631524 1633873 1636461 1639729 1644521 1651083 1658782 1666779 1674617 1682466 1691445 1703425
49465 1703425 1719607 1739261 1760565 1782734 1806607 1833131 1862054 1892228 1922297 1950638 1975287
49454 1975287 1994562 2007768 2015453 2019434 2022374 2026390 2031710 2037131 2041702 2045193 2046879 2045091 2038508
49441 2038508 2027207 2011957 1993358 1972340 1950746 1930320 1911223 1892142 1871828 1850178 1828113
49430 1828113 1806938 1787726 1770949 1756578 1744473 1734512 1726426 1719912 1714907 1711340 1708713 1706438 1704547
49417 1704547 1703406 1702780 1702021 1701218 1701224 1702270 1703510 1704255 1704732 1705247 1705716 1706654 1709429 1714487 1720171 1724444 1727162
49400 1727162 1729565 1732135 1734303 1735969 1737891 1740470 1743304 1746261 1749893 1754209 1757700 1758314 1755238 1749445
49386 1749445 1742824 1737002 1732756 1729995 1728065 1726200 1724001 1721699 1719952 1719315 1719992 1722110 1725802 1730718
49372 1730718 1735919 1740941 1746714 1754659 1765027 1777007 1790353 1805747 1823369 1842314 1861903 1882452
49360 1882452 1904120 1926184 1948297 1971262 1995020 2016582 2031800 2039442 2042386 2044473 2047125 2049422
49348 2049422 2050599 2051541 2053901 2058466 2064897 2073010 2083605 2097515 2114180 2132110 2150776 2171127 2193904
49335 2193904 2218208 2242272 2265020 2286425 2306842 2326481 2345074 2361646 2375054 2384940 2391593 2394787
49323 2394787 2393792 2389006 2382502 2376127 2369750 2362158 2352918 2342565 2331665 2320749 2310699 2302248 2295400
49310 2295400 2289988 2286363 2284869 2285175 2286859 2290021 2294472 2298957 2302182 2304176 2305709 2306878 2307235 2306823 2305915
49295 2305915 2304110 2300800 2296282 2291257 2285483 2278193 2269868 2262397 2257194 2253947 2251457 2249034 2246944 2245975
49281 2245975 2246605 2248237 2249501 2249692 2249435 2249375 2248935 2247147 2243960 2239677 2233752 2225593 2216245 2207838 2201299
49266 2201299 2195750 2190110 2184274 2178836 2174813 2173554 2175677 2180018 2184765 2189595 2195469 2202453 2209452 2216497
49252 2216497 2225674 2238779 2255073 2272240 2288759 2304424 2318928 2330882 2338435 2340695 2338413 2332910
49240 2332910 2324187 2310874 2292809 2272838 2254662 2239306 2225213 2211568 2199544 2189859 2181073 2171528
49228 2171528 2161659 2153055 2145990 2139062 2130924 2121415 2111218 2101159 2091842 2083512 2076242 2070160 2065206
49215 2065206 2060796 2056344 2052080 2048664 2046032 2043554 2041538 2041557 2044699 2050096 2055574 2059176 2059883 2057757 2053955
49200 2053955 2050018 2046604 2043229 2039314 2034919 2030428 2026488 2024497 2026028 2031082 2037852 2044954 2053050 2063254
49186 2063254 2074488 2083477 2087260 2085112 2078252 2068465 2056992 2044185 2029985 2014733 1999365 1984706
49174 1984706 1970945 1957958 1945858 1935049 1926220 1920488 1919035 1922107 1928488 1936171 1943446 1949591 1955198
49161 1955198 1961961 1971432 1983470 1996232 2008010 2018704 2029286 2040276 2051213 2061368 2070652 2079846
49149 2079846 2089955 2101183 2112649 2123426 2133691 2144425 2156243 2169192 2183517 2199670 2217431
49138 2217431 2235877 2254550 2273970 2294706 2316565 2338915 2361130 2382344 2401505 2418291 2433701
49127 2433701 2449378 2466425 2484728 2502986 2519627 2534418 2549118 2565793 2584728 2604984 2626851
49116 2626851 2652104 2681365 2712758 2744255 2776411 2811735 2852098 2897759 2948246 3002756 3059483
49105 3059483 3115262 3166205 3208865 3241472 3264636 3280647 3291791 3299566 3305305 3310436 3315556 3319986
49093 3319986 3322968 3324762 3326118 3327312 3328369 3329585 3331208 3333254 3336405 3342385 3352356 3365376 3379469
49080 3379469 3394036 3410134 3428515 3448597 3469648 3491995 3516473 3543364 3572391 3603265 3635527
49069 3635527 3668138 3700081 3731532 3763786 3797640 3832407 3867133 3902414 3939950 3980306 4022208
49058 4022208 4064551 4108222 4155384 4207721 4265994 4330270 4399685 4473079 4551276 4637950 4736771
49047 4736771 4848320 4971668 5108557 5263581 5438977 5629462 5822041 6001438 6159288
$$ [...]
##END NTUPLES=NMR SPECTRUM
##END=
