
##TITLE=UV1130_M4-1010-1000_6275044_VrdjKuWxyS
##JCAMPDX= 6.0         $$ Bruker NMR JCAMP-DX V2.0
##DATA TYPE= NMR SPECTRUM
##DATA CLASS= NTUPLES
##ORIGIN= BRUKER
##OWNER= Administrator
$$ 1.72 TOPSPIN		Version 2.1
$$ 2012-06-03 03:17:52.843 -0500  Administrator@TOPSPIN
$$ Compression mode = diff/dup
##.OBSERVE FREQUENCY= 400.13188235
##.OBSERVE NUCLEUS= ^1H
##.ACQUISITION MODE= SIMULTANEOUS (DQD)
##.ACQUISITION SCHEME= undefined
##.AVERAGES= 8
##.DIGITISER RES= 22
##SPECTROMETER/DATA SYSTEM= spect
##.PULSE SEQUENCE= zg30
##.SOLVENT NAME= COFFEE_meoh
##.SHIFT REFERENCE= INTERNAL, COFFEE_meoh, 1, 14.98061
##AUDIT TRAIL= $$ (NUMBER, WHEN, WHO, WHERE, PROCESS, VERSION, WHAT)
$$ ##TITLE= Audit trail, TOPSPIN		Version 2.1
$$ ##JCAMPDX= 5.01
$$ ##ORIGIN= Bruker BioSpin GmbH
$$ ##OWNER= Administrator
$$ $$ C:\Bruker\TOPSPIN/data/COFFEE/nmr/UV1130_M4-1010-1000_6275044_VrdjKuWxyS/10/pdata/1/auditp.txt
$$ ##AUDIT TRAIL=  $$ (NUMBER, WHEN, WHO, WHERE, PROCESS, VERSION, WHAT)
(   1,<2012-06-03 03:17:45.125 -0500>,<Administrator>,<TOPSPIN>,<go>,<TOPSPIN 2.1>,
      <created by zg
	started at 2012-06-03 03:16:38.625 -0500,
	POWCHK enabled, PULCHK disabled,
       configuration hash MD5:
       D5 CA 7A 23 FE 6B EE E2 50 67 74 61 24 F7 5E 3B
       data hash MD5: 64K
       04 5A 69 07 9C B1 15 E7 A0 95 FA C7 0B 40 33 91>)
(   2,<2012-06-03 03:17:48.625 -0500>,<Administrator>,<TOPSPIN>,<proc1d>,<TOPSPIN 2.1>,
      <Start of raw data processing
       efp LB = 0 FT_mod = 6 PKNL = 1 PHC0 = 0 PHC1 = 0 SI = 32K 
       data hash MD5: 32K
       6C 76 F2 BC A2 48 28 EB 3D 46 BB A1 07 A9 D6 76>)
(   3,<2012-06-03 03:17:48.984 -0500>,<Administrator>,<TOPSPIN>,<proc1d>,<TOPSPIN 2.1>,
      <pk PHC0 = 209.5862 PHC1 = 0 
       data hash MD5: 32K
       11 49 B1 0F 8D 1B 27 F3 F8 53 FF 7D 1C 0E B7 2D>)
(   4,<2012-06-03 03:17:49.046 -0500>,<Administrator>,<TOPSPIN>,<proc1d>,<TOPSPIN 2.1>,
      <abs ABSG = 1 
       data hash MD5: 32K
       CA 20 25 4C F4 3B 5D 5D 16 F9 1C 9D F1 22 C6 92>)
(   5,<2012-06-03 03:17:49.078 -0500>,<Administrator>,<TOPSPIN>,<proc1d>,<TOPSPIN 2.1>,
      <abs ABSG = 2 
       data hash MD5: 32K
       6B 1E 98 02 34 6E F4 7A C6 7C F4 FE 9C 9D 36 28>)
(   6,<2012-06-03 03:17:49.109 -0500>,<Administrator>,<TOPSPIN>,<proc1d>,<TOPSPIN 2.1>,
      <abs ABSG = 3 
       data hash MD5: 32K
       04 11 91 01 0B 69 32 25 E0 20 94 3F 53 21 CC B9>)
(   7,<2012-06-03 03:17:49.140 -0500>,<Administrator>,<TOPSPIN>,<proc1d>,<TOPSPIN 2.1>,
      <abs ABSG = 4 
       data hash MD5: 32K
       2A C8 27 31 D5 EA 0D 8B 27 09 3C BB DA 0F D1 EF>)
(   8,<2012-06-03 03:17:49.156 -0500>,<Administrator>,<TOPSPIN>,<proc1d>,<TOPSPIN 2.1>,
      <abs ABSG = 5 
       data hash MD5: 32K
       29 2F 02 47 69 6D F1 85 D5 AD 82 75 A8 83 F3 B7>)
$$ ##END=
$$ 
$$ $$ hash MD5
$$ $$ E0 05 2E D6 83 C2 1A 31 0C 7F 10 3B D6 8C 78 AC
##$RELAX= 
##$RELAX= 
##$RELAX= 
##$RELAX= 
##$RELAX= 
##$RELAX= 
##$RELAX= 
$$ Bruker specific parameters
$$ --------------------------
$$ [...]
150 150 150 150 150 150 150 150
##$TP07= 0
##$TPNAME0= <>
##$TPNAME1= <>
##$TPNAME2= <>
##$TPNAME3= <>
##$TPNAME4= <>
##$TPNAME5= <>
##$TPNAME6= <>
##$TPNAME7= <>
##$TPOAL= (0..7)
0.5 0.5 0.5 0.5 0.5 0.5 0.5 0.5
##$TPOFFS= (0..7)
0 0 0 0 0 0 0 0
##$TUNHIN= 0
##$TUNHOUT= 0
##$TUNXOUT= 0
##$USERA1= <user>
##$USERA2= <user>
##$USERA3= <user>
##$USERA4= <user>
##$USERA5= <user>
##$V9= 5
##$VALIST= <valist>
##$VCLIST= <CCCCCCCCCCCCCCC>
##$VD= 0
##$VDLIST= <DDDDDDDDDDDDDDD>
##$VPLIST= <PPPPPPPPPPPPPPP>
##$VTLIST= <TTTTTTTTTTTTTTT>
##$WBST= 2048
##$WBSW= 25
##$XGAIN= (0..3)
0 0 0 0
##$XL= 0
##$YL= 0
##$YMAX_a= 533847
##$YMIN_a= -648094
##$ZGOPTNS= <>
##$ZL1= 120
##$ZL2= 120
##$ZL3= 120
##$ZL4= 120
##$ABSF1= 14.98061
##$ABSF2= -5.57192
##$ABSG= 5
##$ABSL= 3
##$ALPHA= 0
##$AQORDER= 0
##$ASSFAC= 0
##$ASSFACI= 0
##$ASSFACX= 0
##$ASSWID= 0
##$AUNMP= <proc_prof1d_extract_pilot.lims>
##$AXLEFT= 0
##$AXNAME= <>
##$AXNUC= <1H>
##$AXRIGHT= 0
##$AXTYPE= 0
##$AXUNIT= <>
##$AZFE= 0.1
##$AZFW= 0.1
##$BCFW= 0
##$BC_mod= 0
##$BYTORDP= 0
##$COROFFS= 0
##$CY= 15
##$DATMOD= 1
##$DC= 0
##$DFILT= <>
##$DTYPP= 0
##$F1P= 0
##$F2P= 0
##$FCOR= 0.5
##$FTSIZE= 32768
##$FT_mod= 6
##$GAMMA= 0
##$GB= 0
##$INTBC= 1
##$INTSCL= 1
##$ISEN= 128
##$LB= 0
##$LEV0= 0
##$LPBIN= 0
##$MAXI= 10000
##$MC2= 0
##$MEAN= 0
##$ME_mod= 0
##$MI= 0
##$NCOEF= 0
##$NC_proc= -8
##$NLEV= 6
##$NOISF1= 0
##$NOISF2= 0
##$NSP= 0
##$NTH_PI= 0
##$NZP= 0
##$OFFSET= 14.98061
##$PC= 1
##$PHC0= 209.5862
##$PHC1= 0
##$PH_mod= 1
##$PKNL= yes
##$PPARMOD= 0
##$PPDIAG= 0
##$PPIPTYP= 0
##$PPMPNUM= 2147483647
##$PPRESOL= 1
##$PSCAL= 4
##$PSIGN= 0
##$PYNMP= <proc.py>
##$REVERSE= no
##$SF= 400.13
##$SI= 32768
##$SIGF1= 0
##$SIGF2= 0
##$SINO= 400
##$SIOLD= 32768
##$SPECTYP= <>
##$SREGLST= <1H.CDCl3>
##$SSB= 0
##$STSI= 32768
##$STSR= 0
##$SW_p= 8223.68421052632
##$SYMM= 0
##$S_DEV= 0
##$TDeff= 65536
##$TDoff= 0
##$TI= <>
##$TILT= no
##$TM1= 0
##$TM2= 0
##$TOPLEV= 0
##$USERP1= <user>
##$USERP2= <user>
##$USERP3= <user>
##$USERP4= <user>
##$USERP5= <user>
##$WDW= 1
##$XDIM= 32768
##$YMAX_p= 461208675
##$YMIN_p= -771471
##$CURPLOT= <Network HP LaserJet P1505>
##$CURPRIN= <$Network HP LaserJet P1505>
##$DFORMAT= <normdp>
##$LAYOUT= <+/1D_H.xwp>
##$LFORMAT= <normlp>
##$PFORMAT= <normpl>
##$SURQMSG= 1
$$ End of Bruker specific parameters
$$ ---------------------------------
##NTUPLES= NMR SPECTRUM
##VAR_NAME=  FREQUENCY,     SPECTRUM/REAL,   SPECTRUM/IMAG
##SYMBOL=    X,             R,               I
##VAR_TYPE=  INDEPENDENT,   DEPENDENT,       DEPENDENT
##VAR_FORM=  AFFN,          ASDF,            ASDF
##VAR_DIM=   32768,         32768,           32768
##UNITS=     HZ,            ARBITRARY UNITS, ARBITRARY UNITS
##FACTOR=    0.250966925370066, 1,           1
##FIRST=     8223.43324360095, -344121,      -311153
##LAST=      0,             31658,           -120348
##MIN=       0,             -771471,         0
##MAX=       8223.43324360095, 461208675,    0
$$ Real data points
##PAGE= N=1
##DATA TABLE= (X++(R..R)), XYDATA
$$ [...]
$$ plain form
19546 -258450 115130 12977 190243 -103519 -155265 -11775 -210979 415159 -80157 94261
19535 -188779 -66568 -490002 -163100 -221659 -38264 131754 -158241 41962 108229 -37063 112373
19523 -331320 27892 -38225 -21095 -85124 -116668 52905 50057 30838 234633 -30226 -291914
19512 -291914 19695 -117562 210714 -158812 153454 50722 -197555 -257055 151910 -49207
19501 28114 130780 -473072 -111037 5607 60982 -771471 62760 6287 -1281 72694 -288369
19489 -123720 -102401 17811 168463 -109534 16188 -293108 41302 102028 -22245 -282382 -90718
19477 -262602 -88818 79760 -118841 -76136 56372 -40003 -159170 74140 -33116 -74024 182798
19465 -271399 296875 -193339 -95351 190456 -173331 207109 -78865 -445328 157987 186026
$$ packed form
19546b58450A15130A2977J77266a03519n1746a1775j99204D15159h0157I4261
19535a88779f6568m23434a63100n8559c8264A31754a58241D1962O6267c7063A12373
19523c31320B7892c8225J7130o4029l1544E2905k848j9219K03795c0226k61688
19512b91914A9695a17562B10714a58812A53454E0722a97555n9500A51910d9207
19501B8114J02666d73072a11037E607N5375g71471F2760F287a281G2694b88369
19489a23720K1319A7811J50652a09534A6188b93108D1302O0726b2245k60137i0718
19477b62602h8818G9760a18841M2705E6372d0003j19167G4140c3116m0908A82798
19465b71399B96875a93339i5351A90456a73331B07109g8865l66463A57987K8039
$$ plain form
19455 186026 -215378 56584 -194621 -34567 -202524 -143232 72523 -237498 -502623 -253190
19445 -253190 -173893 -20317 83182 -146943 91768 -190477 -86153 -426801 -420508 -229067 -153345
19434 -153345 -178030 -138408 97785 25254 208170 -109092 77707 95047 -177344 201013 4120
19422 -217420 -38628 137497 48989 -378194 252709 -212153 -398724 8334 -40618 -39895 -9409
19410 98608 -27212 -224516 -278255 -1923 -333578 76714 -61347 -93487 -17295 -108129 204388
19398 -269318 -276161 -315393 -35535 -37447 375065 223383 -79634 205782 -156460 -18644 -537940
19387 -537940 245520 -340934 -131244 -375325 148587 -270473 140338 -374806 18601 83957
19377 83957 -546912 264335 4248 27240 108859 433789 -35529 -199193 11595 -3202 155247
$$ packed form
19455A86026b15378E6584a94621c4567j67957N9292G2523b37498k65125K49433
19445b53190P9297b0317H3182a46943I1768a90477h6153l40648O293J91441P5722
19434a53345k4685L9622I7785B5254J82916a09092G7707J7340a77344B01013D120
19422b17420c8628A37497D8989c78194B52709b12153j86571H334d0618P23i409
19410I8608b7212j97304n3739a923l31655G6714f1347l2140a7295r0834B04388
19398b69318o843l9232c5535j912C75065j51682g9634B05782a56460a8644n19296
19387e37940B45520c40934a31244k44081A48587b70473A40338c74806A8601O5356
19377H3957e46912B64335D248K2992Q1619L24930c5529j63664A1595c202A55247
$$ plain form
19365 2256 -151222 -88485 10916 216876 97211 -221260 -120356 -167851 -160326 -521186 164600
19353 -125868 -250428 -22658 -127576 -113011 106211 -121565 -135514 172400 -110098 -137901
19343 -137901 -238104 242989 51596 -360796 -223610 -110149 -150557 -236500 83277 -123124
19332 -93858 -251572 -162121 -176612 -127059 -310582 -137113 -351524 -355400 26456 -98807 68818
19320 18744 53500 -240996 194139 -160287 47266 16654 -196077 66722 -223177 44757 -51219
19308 127748 176428 11452 -168266 -167581 175996 -182079 -2773 -87995 37640 -22372 216760
19296 -106560 -206829 18478 -212551 102192 -165703 -93881 -79054 -155568 -404223 -368323
19286 -368323 -107353 77064 -387266 -204825 -141070 170820 -83728 386727 -132895 112970
$$ packed form
19365B256a51222O2737A0916K05960I7211b21260J00904m7495P525l60860A64600
19353a25868j24560b2658j04918J4565A06211a21565j3949A72400a10098k7803
19343a37901j00203B42989E1596c60796J37186a10149m0408q5943H3277a23124
19332i3858j57714Q9451j4491M9553j83523a37113k14411l876B6456i8807F8818
19320A8744L4756b40996A94139a60287D7266A6654a96077F6722b23177D4757e1219
19308A27748M8680A1452a68266O85A75996a82079b773q5222C7640b2372B16760
19296a06560j00269A8478b12551A02192a65703P1822J4827p6514k48655L5900
19286c68323a07353G7064c87266J82441O3755A70820h3728C86727a32895A12970
$$ plain form
19275 -245569 144590 -340024 236399 -195372 -105511 -253399 206302 -69254 -198129 -258014
19265 -258014 65551 -134118 -161940 -396247 -22168 -267593 -187126 -67407 -135424 -44420 -381947
19254 -381947 163721 152986 6965 119169 186433 -159680 -178615 -139187 -104509 -39219 -134571
19243 -134571 -296701 -140793 205674 -81688 20643 130342 15215 338833 -38096 -327054
19233 -327054 -235033 -196497 -53616 117897 -95041 -253509 -117750 157113 56805 -205896
19222 136627 -108793 -56489 250455 -366917 -81520 -299051 -383822 62685 -181551 221663
19211 -208759 -103174 2500 -65727 -34273 -372322 -43834 -50792 -284610 -129998 234914 -101224
19199 -44181 -187855 28181 -271811 81050 -390736 -105258 207296 322677 -182091 -141093
$$ packed form
19275b45569A44590c40024B36399a95372Q9861j47888B06302f9254j28875n9885
19265b58014F5551a34118k7822k34307b2168k45425Q0467f7407o8017d4420l37527
19254c81947A63721j0735F965J12204O7264a59680j8935L9428L4678c9219r5352
19243a34571j62130a40793B05674h1688B0643J09699A5215L23618c8096k88958
19233c27054R2021L8536e3616A17897i5041j58468a17750A57113E6805b05896
19222A36627a08793N2304B50455c66917h1520k17531q4771F2685a81551B21663
19211b08759a03174B500f5727L1454l38049d3834o958k33818a29998B34914a01224
19199d4181j43674B8181b71811H1050c90736a05258B07296J15381a82091M0998
$$ plain form
19189 -141093 301643 -13694 11002 -167722 -173755 -154814 -101826 -2979 -202949 186828 -9312
19177 80734 -9194 -129214 -1306 18886 369037 -87355 -119111 261712 -101029 -15614 -81855
19166 -81855 -62202 -403503 -101883 -12431 -246489 132698 35555 65676 -17716 -147147 -183548
19155 -183548 -102253 -64893 -208889 19624 -29337 162230 71034 -164369 -29432 31126 -18091
19143 -81573 -84170 67632 -259803 112111 37445 -182659 41706 20635 -144057 145638 -326193
19131 -14663 -291128 -333889 -139424 -36568 -88334 -9784 152398 -207595 -106477 129098 -67363
19119 64695 109367 260533 -1000 -69628 -157420 -201643 12099 -4895 31935 -64594 -209335 -272699
19107 -272699 -125961 215226 -60769 -50517 -70976 214829 189668 -364858 -39641 -20900 -131451
$$ packed form
19189a41093C01643a3694A1002a67722o033J8941N2988b979j99970A86828i312
19177H0734i194j20020a306A8886L50151h7355l1756B61712a01029a5614o6241
19166h1855J9653l41301a01883a2431k34058A32698C5555L0121a7716j29431l6401
19155a83548Q1295L7360j43996A9624b9337A62230G1034a64369b9432C1126a8091
19143h1573k597F7632b59803A12111C7445a82659D1706B0635a44057A45638c26193
19131a4663k76465m2761a39424c6568n1766i784A52398b07595J01118A29098f7363
19119F4695M4672J51166a000o8628q7792m4223A2099d895C1935f4594j44741o3364
19107b72699a25961B15226f0769J0252k0459B14829k5161c64858c9641J8741j10551
$$ plain form
19096 -131451 -120190 20036 65700 -199311 71903 54906 142347 -482593 406047 -356449 -23134
19084 -40620 140092 47961 -239745 -227315 -290855 -196652 32756 -317791 3629 154598 -158497
19072 -241162 43472 -151685 142166 39300 -135703 286553 -206487 172796 -256492 186177
19061 -103158 -157208 180062 224930 -231773 -19017 -111469 -161927 56549 -183336 -105767 -164941
19050 -164941 -187214 -120550 71966 -78424 -169809 -318342 -65374 -45860 -502070 35893 209632
19039 209632 529240 -165906 -216060 15347 -193752 -307480 -188198 -115229 163998 128747
19029 128747 -103833 -28823 194428 -121236 331727 108299 130739 -115001 -114616 -219257
19019 -219257 36194 208976 -280536 3596 163292 238403 -289210 153989 200525 7861 259046
$$ packed form
19096a31451J1261B0036M5664a99311G1903j6997Q7441d82593D06047c56449b3134
19084d0620A40092D7961b39745J2430o3540R4203C2756c17791C629J50969a58497
19072b41162D3472a51685A42166C9300a35703B86553b06487A72796b56492A86177
19061a03158n4050A80062M4868b31773a9017r2452n0458E6549a83336P7569n9174
19050a64941k2273O6664G1966g8424r1385j48533f5374J9514m56210C5893J73739
19039B09632L19608a65906n0154A5347a93752j13728J19282P2969A63998l5251
19029A28747a03833b8823A94428a21236C31727A08299K2440a15001L85j04641
19019b19257C6194J72782b80536C596J59696P5111b89210A53989M6536G861K51185
$$ plain form
19008 259046 129309 -224528 29206 95425 -44840 -124960 -126655 -76016 -149631 55996 112808
18997 112808 -271286 149001 51213 -259551 -18490 95525 -189321 -9749 -125321 36118 -7245
18985 -8796 170279 57455 108676 -27999 -9380 -244655 -347640 45421 -28742 -31884 -35020 -345316
18973 -345316 -90621 40652 -29882 -254498 -73576 103948 -263365 -45574 -32666 -88231 200639
18961 -142748 215472 -68851 306898 -562618 -321114 -54526 114529 60982 -33967 118862
18950 -263938 61381 -161693 352258 143353 24684 -215611 15243 -204998 -74675 -225992
18940 -225992 114735 31761 93527 -226927 188930 127911 -162340 -62749 262012 119919
18929 -63999 320082 79024 -264645 -28934 242139 -380477 -230214 84949 -4669 -242221 18795
$$ packed form
19008B59046A29309b24528B9206O6219d4840q0120j695N0639p3615E5996N6812
18997A12808b71286A49001E1213b59551a8490I5525a89321i749j15572C6118g245
18985h796A70279E7455N1221b7999i380k35275j02985D5421b8742l142l136l10296
18973c45316i0621D0652b9882k24616g3576A03948b63365d5574J2908n5565B00639
18961a42748B15472f8851C06898e62618K41504e4526A14529n3547c3967A18862
18950b63938F1381a61693C52258A43353B4684b15611A5243b04998g4675j51317
18940b25992A14735C1761O1766b26927A88930o1019a62340f2749B62012A19919
18929f3999C20082G9024b64645b8934B42139c80477J50263H4949d669k37552A8795
$$ plain form
18917 -96643 -215550 -215386 -79377 -69766 29194 241384 -19660 118318 -22874 -40723 169778
18905 231486 -49707 93140 -71841 34577 -178026 -173291 -228565 -198437 -91375 126283 -130258
18893 110586 -256945 -150958 -137918 -62097 10017 152 -88284 8333 85648 175073 -165813
18881 264046 54629 -201572 -336209 276424 -80060 -198708 -164525 -58450 -7305 19793 -493711
18869 70867 158769 359251 -106912 -340605 -225133 22739 68268 -174694 -455338 40462
18858 -229330 -208291 -225516 143712 -185205 -94805 -229691 -60137 107797 -104184 6995 -84900
18846 -256686 -83893 -35200 -163356 -123961 -117629 229620 159799 157236 -15310 -143644 27996
18834 100825 -117069 -132441 -268459 -281683 -109831 193060 -29156 -128624 -247098 -65362
$$ packed form
18917i6643j18907J64g9377R611B9194K12190a9660A18318b2874j7849A69778
18905B31486d9707I3140g1841C4577a78026M735n5274L0128i1375A26283a30258
18893A10586b56945J05987J3040f2097A0017A52h8284H333P7315Q9425a65813
18881B64046E4629b01572j34637B76424h0060j18648L4183e8450g305A9793d93711
18869G0867Q7902K00482a06912k33693J15472B2739M5529a74694k80644D0462
18858b29330K1039j7225A43712a85205R0400j34886f0137A07797a04184F995h4900
18846b56686h3893c5200j28156L9395O332B29620o9821k563a5310j28334B7996
18834A00825a17069j5372j36018j3224a09831A93060b9156r9468j18474f5362
$$ plain form
18823 -265955 -139074 80368 50843 -62856 406267 -230582 132226 54887 -474585 5 204133
18812 204133 183606 53299 -64886 -72553 -99162 147589 130629 189894 114707 -326732 203196
18800 -22499 102063 -83750 126840 39381 -79174 133521 350173 173930 553967 138212
18789 -164952 39374 25752 403456 -268169 -275763 93072 -280726 159580 -147245 -103813 -31136
18777 47772 34482 -84466 -134906 171748 -248203 -144917 126231 -150727 -86348 -108982 -110681
18766 -110681 104484 -167130 -32899 179700 44285 19084 -39526 -168183 221377 46341
18755 -616 -492262 -170901 25366 -113498 -194994 129660 136261 -51388 343696 162488 -248782
18743 -122234 5947 -16283 -33702 56039 63127 -198543 -502953 -59919 145513 -210391 -213486
$$ packed form
18823b65955J26881H0368k9525f2856D06267b30582A32226E4887d74585EK04128
18812B04133k0527E3299f4886p667k6609A47589j6960N9265p5187c26732B03196
18800b2499A02063h3750A26840C9381g9174A33521K16652A73930L80037A38212
18789a64952C9374j3622L77704b68169p594I3072b80726A59580a47245M3432c1136
18777D7772j3290h4466n0440A71748b48203J03286A26231a50727O4379k2634j699
18766a10681A04484a67130c2899A79700D4285A9084c9526j28657B21377D6341
18755f16m91646a70901B5366a13498q1496A29660O601e1388C43696A62488b48782
18743a22234E947a6283j7419E6039P088a98543l04410e9919A45513b10391l095
$$ plain form
18732 -213486 262754 75793 53378 34488 59788 115869 202683 -20977 -7021 -260928 -159325
18721 -159325 113325 206175 82542 -83089 -171298 -157873 -267019 3247 -103690 -213040 108173
18709 -28482 -176890 353886 -425257 -289952 14041 -258614 5131 -158626 11532 -6797 73287
18697 -37204 128601 175434 103988 -125263 -262244 -322541 -10476 -16941 -48578 -125118 -10990
18685 -111095 -68144 -254377 162048 -342673 49320 215502 -492841 135309 220295 -98366
18674 234567 68453 -7831 -241755 -12425 -160220 332430 -125806 -78534 -289062 215519
18663 -181211 -106954 78945 -235114 41012 -65284 61810 -214021 -350385 13425 128487 -109879
18651 91959 -58153 -82598 -186325 -243352 -11001 -205572 -155925 292748 72352 -50743 -23220
$$ packed form
18732b13486B62754G5793k2415j8890K5300N6081Q6814b0977g021k53907J01603
18721a59325A13325R2850H2542h3089q8209J3425j09146C247a03690j09350A08173
18709b8482j48408C53886d25257J35305A4041b58614E131a58626A1532f797G3287
18697c7204A28601M6833p1446a25263j36981o0297a0476o465l1637p6540a0990
18685a11095M2951j86233A62048c42673D9320J66182d92841A35309Q4986i8366
18674B34567F8453g831k33924a2425j47795C32430a25806M7272k10528B15519
18663a81211P4257G8945b35114D1012f5284F1810b14021j36364A3425J15062a09879
18651I1959e8153k4445j03727n7027a1001j94571M9647B92748G2352e0743b3220
$$ plain form
18639 51970 -173772 -18103 186859 -221348 -170400 -97802 190167 -85004 286958 -331727
18628 -160205 -62829 -192326 -172040 -158559 -232553 -159214 -135498 -145789 -99985 214361 33094
18616 -68691 -24520 -43278 -15802 -101009 -26580 189599 -74702 -66826 -111089 -195644 -223895 -147229
18604 -147229 -217615 -93516 -73978 -105673 77427 201622 -80108 85587 100038 -170482 -232637
18593 -232637 -299073 -50975 391759 30357 -126981 -40066 -211283 -21568 282206 183114 104477
18582 104477 -137923 -169677 39781 3437 -48421 -32003 -94511 -6544 -73313 45227 -136488
18570 -183214 -146581 -256871 -169817 -171536 297656 72665 48556 -29793 -265721 -307606 32203
18558 86765 -320449 -105634 -197655 82772 -43068 70909 53268 -371435 -210960 113059 -96869
$$ packed form
18639E1970a73772a8103A86859b21348N0948P2598A90167h5004B86958c31727
18628a60205f2829j29497K0286J3481p3994P3339K3716j0291M5804B14361C3094
18616f8691b4520j8758a5802q5207b6580A89599g4702P876m4263q4555k8251P6666
18604a47229p0386i3516J9538l1695G7427J24195h0108H5587J4451a70482o2155
18593b32637o6436e0975C91759C0357a26981d0066j71217b1568B82206r9092p8637
18582A04477a37923l1754C9781C437d8421J6418o2508f544o6769D5227a36488
18570a83214L6633j10290Q7054j719B97656G2665k4109b9793k35928m1885C2203
18558H6765c20449a05634r2021H2772d3068G0909j7641c71435J60475A13059i6869
$$ plain form
18546 -206665 128805 309755 -161512 28205 -43787 -36508 -26034 60779 -168173 -189430 -193840
18535 -193840 -369822 45705 -177275 -371989 -71099 5586 -61919 -84941 -347497 29444 -128340
18523 -281065 -79980 43891 5950 -155399 -184054 -85677 -201925 1847 -245981 165990 73655
18511 212278 -218209 80788 -80695 237006 -53454 68182 -184364 11909 -11005 112846 -122491
18499 336287 249254 853 -143245 -28612 -51561 -97674 -65098 -191589 -226931 -159567 145510
18487 -38337 251358 54615 -37447 -51570 -70833 -67628 -243132 12337 -61560 85384 -93065
18475 -343022 -147323 163215 69708 222341 -269160 -145766 117572 12915 -75508 274925
18464 -8381 97703 119711 21762 -95481 -183485 -486385 -160676 -44290 48779 65973 -27025
$$ packed form
18546b06665A28805J80950a61512B8205d3787P279J0474F0779a68173k1257m410
18535a93840j75982D5705a77275j94714g1099E586f1919k3022k62556B9444a28340
18523b81065g9980D3891E950a55399k8655h5677j16248A847b45981A65990G3655
18511B12278b18209H0788h0695B37006e3454F8182a84364A1909a1005A12846a22491
18499C36287q7033H53a43245b8612k2949m6113L2576j26491l5342O7364A45510
18487c8337B51358E4615c7447j4123j9263L205j75504A2337f1560H5384i3065
18475c43022a47323A63215F9708J52633b69160J23394A17572A2915g5508B74925
18464h381I7703K2008B1762i5481q8004l02900a60676d4290D8779J7194b7025
$$ plain form
18452 -122763 -50207 -424807 -94972 -27035 48295 91713 318235 33795 380820 -509421 -209180
18440 -182096 -153748 160409 -200292 56016 241633 31790 -288081 73456 -182631 -119373
18430 -119373 -281738 -149371 218707 46926 -75919 215547 -172918 -59122 2236 -34158 -162972
18419 -162972 103802 -16852 -57966 -117258 61203 161100 -48297 -132071 162578 90965 -18989
18407 39532 18627 142143 483004 -246588 -44821 -181501 233917 -114241 113337 -317693
18396 144870 -81664 -198963 439479 373202 76600 22025 -296593 -62113 -60333 224968 -117449
18384 129775 88378 68073 -7107 53299 322148 -177980 -199562 228771 54265 188595 -272661
18372 -113566 -267747 -219323 -291396 -74792 55748 99453 -14409 -300592 -178916 114516 -292033
$$ packed form
18452a22763e0207l74600i4972b7035D8295M3418K26522C3795L47025e09421b09180
18440a82096K8348A60409b00292E6016J85617C1790b88081G3456a82631O3258
18430a19373j62365J32367B18707D6926g5919B15547a72918e9122B236c4158j28814
18419a62972A03802a6852m1114n9292F1203R9897d8297q3774A62578p1613a8989
18407C9532A8627J23516L40861b46588d4821j36680B33917a14241A13337c17693
18396A44870h1664j17299D39479o6277G6600B2025b96593f2113J780B24968a17449
18384A29775m1397k0305g107E3299K68849a77980k1582B28771E4265J34330b72661
18372a13566j54181M8424p2073g4792E5748M3705a4409k86183J21676A14516b92033
$$ plain form
18360 -65904 -39751 27699 -46578 -321660 -191547 142222 329134 -339360 -99805 -111188 149915
18348 -37935 62156 -148043 117737 -364170 136876 -184952 -10124 76576 94247 24592 209890
18337 209890 172001 -78788 97272 -254717 -284293 162603 -237744 -85251 -447871 -227857
18327 -227857 -225218 7867 -19434 25407 -299615 127576 -172603 15811 -63730 292532 -11792
18315 87220 -188019 -163438 105780 215310 -23045 -145509 -59351 -107584 -58725 82215 134324
18304 134324 -105413 -163924 -378101 -77802 -201414 -193027 -101649 -212215 105198 199108 -266703
18292 -349568 90061 38484 -225365 53739 -369371 179417 91917 -245313 -193209 279413
18281 -226181 -122852 -238874 129952 46180 -409580 -378079 151503 -81207 64811 -88858
$$ packed form
18360f5904K6153B7699d6578k75082J30113A42222J86912c39360i9805j1383A49915
18348c7935F2156a48043A17737c64170A36876a84952a0124G6576J7671B4592J85298
18337B09890l7889g8788I7272b54717k9576A62603b37744h5251l62620K20014
18327b27857K639G867a9434B5407b99615A27576a72603A5811f3730B92532a1792
18315H7220a88019K4581A05780J09530b3045j22464e9351m8233M8859H2215N2109
18304A34324a05413n8511k14177g7802j23612Q387R1378j10566A05198R3910b66703
18292c49568I0061C8484b25365E3739c69371A79417q7500b45313N2104B79413
18281b26181J03329j16022A29952D6180d09580L1501A51503h1207F4811h8858
$$ plain form
18270 -103280 -135968 7419 51131 -190313 -98298 -12241 183934 8083 -113171 -140191 -80973
18259 -80973 115777 62428 92027 -107357 -159048 -55725 128720 -128855 65515 104855 214705
18248 214705 107219 58713 -101034 -358839 11787 -75828 189860 -27052 291196 108592
18237 -193964 192459 -156295 -32471 -190429 -206354 -377 436745 -17406 -111760 -391394 15684
18225 -202551 73621 -167673 -66024 -94770 113311 -83413 119906 124088 72969 -250664 270373
18213 137134 323558 -17131 -7171 -148217 204432 59864 -219587 115519 200915 153278 -235064
18201 -130083 -168946 -217712 -56418 38868 -26117 111491 -109718 85658 -17525 -49068 171399
18189 24862 43067 -939 -233385 -249184 -216225 -189547 -346090 151717 320211 57992 -64988
$$ packed form
18270a03280l2688G419M3712a90313R2015a2241A83934H083a13171k7020N9218
18259h0973A15777n3349K9599a07357n1691e5725A28720a28855F5515L9340J09850
18248B14705A07219m8506a01034k57805A1787g5828A89860b7052B91196A08592
18237a93964A92459a56295c2471j57958j5925c77D36745a7406r4354k79634A5684
18225b02551G3621a67673f6024k8746A13311h3413A19906M182n1119b50664B70373
18213A37134J86424a7131g171j41046B04432E9864b19587A15519Q5396m7637b35064
18201a30083l8863m8766e6418C8868b6117A11491a09718H5658a7525l1543A71399
18189B4862J8205i39k32446j5799L2959K6678j56543A51717J68494E7992f4988
$$ plain form
18177 -132647 -182065 -30738 16152 -14461 10957 -304482 -26903 -263464 -146425 78334 -168015
18165 14071 -114895 -91060 233567 -20901 198118 -442935 307022 -44488 62593 65611 11908
18153 -58452 91608 -215060 -180803 3718 -14443 72055 -129452 276487 -55195 -21513 -197334
18142 -197334 163975 38633 -189471 158608 99259 122501 -360158 -354491 68547 -208986 298190
18130 50062 -227916 -365643 -166627 -282945 51929 -226023 -179668 -192358 -77970 11483 -205974
18118 203062 -143284 -150257 34048 -25078 -65477 -293853 -125476 -128800 -3483 106339 -203564
18106 -180681 -22477 279883 -72477 -54868 -6794 -275128 22432 63416 -151567 -66014 260724
18094 67801 42908 -243296 -370524 -240394 -130843 -70533 -45522 188177 130402 -97188 134616
$$ packed form
18177a32647m9418c0738A6152a4461A0957c04482b6903k36561J17039G8334a68015
18165A4071a14895K3835B33567b0901A98118d42935C07022d4488F2593L018A1908
18153e8452I1608b15060L4257C718a4443G2055a29452B76487e5195b1513j75821
18142a97334A63975C8633a89471A58608n9349K3242c60158N667F8547b08986B98190
18130E0062b27916j37727a66627j16318E1929b26023M6355j2690g7970A1483b05974
18118B03062a43284o973C4048b5078m0399k28376a25476l324c483A06339b03564
18106a80681b2477B79883g2477J7609f794k68334B2432M0984a51567f6014B60724
18094F7801k4893b43296j27228J30130J09551O0310K5011A88177n7775i7188A34616
$$ plain form
18082 -26576 -131398 -39602 117481 18659 5606 -28368 -147318 -16932 87339 128065 163488
18071 163488 -238698 -42501 -9454 -7540 32787 -202121 290926 126649 -126378 6840 59670
18060 59670 258372 -58401 -51020 7931 51888 -261210 -187543 -48453 -256870 -45713 -66827
18049 -66827 -87588 -18620 -199601 265560 76211 -77310 185312 55037 -451664 236677 79110
18037 -16263 -38843 56398 110462 -186796 218482 -318440 3702 -72087 -64605 -246893 307149
18025 -352827 -315073 -238114 -34052 -179249 -337251 -246332 -74246 226311 -160421 -55065 -183098
18014 -183098 119609 -194386 -424525 60192 -179391 39413 91853 -21729 -356615 110542
18003 74754 -46090 -45714 409662 37485 -19788 -134547 64124 -121066 -39200 -7974 -141922
$$ packed form
18082b6576j04822c9602A17481A8659E606b8368j18950a6932H7339M0726L5423
18071A63488b38698d2501i454J914C2787b02121B90926A26649a26378F840N2830
18060E9670J98702e8401P381G931M3957b61210P3667d8453k08417d5713k1114
18049f6827k0761a8620j80981B65560G6211g7310A85312E5037d51664B36677G9110
18037a6263k2580E6398N4064a86796B18482c18440C702g2087P482j82288C07149
18025c52827L7754P6959c4052j45197j58002R0919g4246B26311a60421e5065j28033
18014a83098A19609a94386k30139F0192a79391C9413N2440b1729l34886A10542
18003G4754d6090L76D09662C7485a9788j14759F4124a21066c9200g974j33948
$$ plain form
17992 -141922 -206547 -294299 -48808 174248 -18355 62755 -5465 11591 357152 -128917 220961
17980 -262382 -176587 -156429 54473 73709 111616 -45996 -90399 -181437 -384253 72676 -28818
17968 219927 106870 -123073 216300 351531 375367 -197138 4273 215575 -41004 3366 240587
17957 240587 -105907 308909 94240 6232 -1639 -116705 -13917 48490 -65760 47204 15720
17945 -96896 242665 -57939 43820 92288 95729 -94471 -225295 -2409 -368812 -109069 187648
17933 42662 104188 -81322 -138607 -112220 -58220 -4240 108742 -56052 363731 157821 37960
17921 141808 -42487 90405 -120883 151945 152799 -287389 -110589 -267919 97357 84259 -47634
17909 161487 286939 83888 -36453 209822 27875 -146990 128843 -197317 283124 -320630
$$ packed form
17992a41922o4625q7752d8808A74248a8355F2755e465A1591L45561a28917B20961
17980b62382Q5795K0158E4473J9236L7907d5996m4403r1038k02816G2676b8818
17968B19927A06870a23073B16300J35231K3836a97138D273K11302d1004C366K37221
17957B40587a05907C08909I4240F232a639j15066a3917D8490f5760D7204A5720
17945i6896B42665e7939D3820M8468L441i4471j30824b409l66403a09069A87648
17933D2662O1526h1322n7285K6387N4000d240A08742e6052C63731A57821C7960
17921A41808d2487I0405a20883A51945Q54b87389a10589j57330I7357j3098d7634
17909A61487J25452H3888c6453B09822B7875a46990A28843a97317B83124c20630
$$ plain form
17898 85470 -182924 -174045 161042 -76433 117530 59038 -106731 -117267 -92726 -390703 -163250
17886 -185310 -149934 -281959 -2309 -350790 139394 102243 -18029 40855 -108510 21968 -309175
17874 -188289 -251401 -187146 65067 -101369 -329537 258313 272847 7295 -230179 -217666 -78081
17862 -228592 -113159 182006 286456 -153127 177187 -273715 97387 36183 104941 -113022
17851 -132228 150725 -242772 321276 137720 33625 -23547 239467 47137 294942 38182
17840 -224097 -146944 91827 96243 45062 -141754 -58367 -196242 -65525 -143731 193818 23513
17828 -42211 209232 249553 216860 -446 97329 100290 201357 -115897 125520 -97498 -214450
17817 -214450 36892 49711 -229955 -371176 -34748 336935 -126673 110830 -123962 49032
$$ packed form
17898H5470a82924Q879A61042g6433A17530n8492a06731j0536K4541k97977a63250
17886a85310L5376j32025b309l48481A39394l7151a8029D0855a08510B1968c09175
17874a88289o3112O4255F5067a01369k28168B58313J4534G295b30179J2513g8081
17862b28592a13159A82006J04450a53127A77187b73715I7387C6183O8758a13022
17851a32228A50725b42772C21276A37720C3625b3547B39467D7137K47805C8182
17840b24097P7153I1827M416D5062a41754e8367j37875f5525p8206A93818B3513
17828d2211B09232M0321l2693d46I7329K961J01067a15897A25520i7498j16952
17817b14450C6892J2819b29955j41221c4748C36935a26673A10830a23962D9032
$$ plain form
17806 6156 -9962 20230 384089 119181 -102857 236324 -67947 249969 -120690 28638 -23046
17794 -339655 -293117 237426 276324 262535 113631 79183 -223071 -272570 297597 -244263
17783 -108481 418729 -46068 30786 -54232 -114188 23520 -365009 250753 -118432 -56746 73130
17771 334875 -14486 23665 -13179 -33585 44798 135457 91444 -29249 405370 399699 83784
17759 -13975 23969 -96578 -170767 143658 -53285 -42104 -211042 -495334 -296655 105237 -196534
17747 37130 297 80816 -104567 111664 -82244 237109 -63371 -292816 -123081 -137874 -222450
17736 -222450 111244 3573 -128518 4469 -92068 286231 68256 126975 -238205 -91017 167255
17724 -88206 -178795 333531 93913 -115720 -167813 -78738 63871 98908 152489 -55207 157105
$$ packed form
17806F156i962B0230L63859A19181a02857B36324f7947B49969a20690B8638b3046
17794c39655M6538B37426L8898j3789A13631l4448b23071m9499B97597b44263
17783a08481D18729d6068C0786e4232n9956B3520c65009B50753a18432e6746G3130
17771C34875a4486B3665a3179k0406D4798R0659m4013b9249D05370n671H3784
17759a3975B3969i6578p4189A43658e3285J1181j68938k84292J98679A05237a96534
17747C7130B97Q0519a04567A11664h2244B37109f3371k29445a23081j4793q4576
17736b22450A11244C573a28518D469i2068B86231F8256N8719b38205i1017A67255
17724h8206r0589C33531I3913a15720n2093g8738F3871L5037N3581e5207A57105
$$ plain form
17712 -37599 -199486 105929 118815 -266509 -15865 35121 417713 67827 -126450 38842 115095
17701 115095 84427 240597 94565 26615 -5032 218825 286499 -95135 145560 -507814 290755
17689 -65070 -181959 78590 -4507 97139 -44880 -232824 -124083 -31650 90764 -27659 73550
17677 -34425 -113182 6549 136525 177370 199151 373438 -255002 2660 221346 -189515 380831
17665 -126232 -35896 166051 120834 104975 -120452 272249 -136613 244019 48799 106518
17655 106518 44890 -40712 -128555 -214508 -72042 -133498 98353 56685 -135601 111334 -8373
17643 279059 107531 168186 -8207 -56638 -10462 -18439 176649 -42670 61417 -280564 116222
17631 180950 -69145 6894 48388 415428 156475 3811 -174395 166785 -188449 171046 -195716
$$ packed form
17712c7599j61887A05929J2886b66509a5865C5121L82592F7827a26450C8842P6253
17701A15095l0668J56170I4565B6615e032B18825O7674i5135A45560e07814B90755
17689f5070j16889G8590d507I7139d4880j87944J08741c1650I0764b7659G3550
17677c4425p8757F549J29976M0845K1781J74287b55002B660K18686a89515C80831
17665a26232c5896A66051m5217j5859a20452B72249a36613B44019D8799N7719
17655A06518D4890d0712q7843q5953g2042o1456I8353m1668a35601A11334h373
17643B79059A07531O0655h207m8431a0462p977A76649d2670F1417b80564A16222
17631A80950f9145F894M1494L67040A56475C811a74395A66785a88449A71046a95716
$$ plain form
17619 184184 -222605 364802 -69114 -100648 -12291 103396 103231 250087 -184691 -3119 49771
17607 -312504 229769 -166096 -48071 100209 11090 14729 83872 -169984 35951 192267 33927
17595 -101656 146 161164 -291135 -81532 166358 -203424 7739 87021 69404 -206783 182645
17583 32657 -185695 222016 -35011 -85010 197129 101288 -13523 -334596 -122090 25339 64381
17572 64381 222371 -267357 72283 102409 94419 -302207 84868 -9697 70332 -48014 95752
17560 218991 56851 -128104 -197947 78227 82462 39773 -81956 -220436 104420 -104495 200466
17548 19171 414762 104484 293775 296866 -105867 -44574 -39350 1177 212291 32190 -171339
17536 39392 97517 1176 -98110 135848 -220665 -124636 -34241 -351733 187944 50072 67372
$$ packed form
17619A84184b22605C64802f9114l1534a2291A03396j65J46856a84691c119D9771
17607c12504B29769a66096d8071A00209A1090L639O9143a69984C5951J56316C3927
17595a01656A46J61018b91135h1532A66358b03424G739P9282j7617b06783A82645
17583C2657a85695B22016c5011m9999A97129r5841a3523l21073a22090B5339L9042
17572F4381J57990b67357G2283L0126p990c02207H4868i697G0332d8014I5752
17560B18991E6851a28104o9843G8227M235C9773h1956j38480A04420a04495B00466
17548A9171L95591A04484J89291L091a05867d4574N224A177K11114C2190a71339
17536C9392N8125A176i8110A35848b20665R6029c4241l17492A87944E0072J7300
$$ plain form
17525 67372 108582 -145557 82729 -123730 -73523 -165106 -239634 -146600 121277 47987 236849
17514 236849 -46102 76265 271570 71043 -2040 -60697 142056 -146097 71926 10361 131376
17503 131376 30508 -69344 397837 414027 -20224 89506 170950 56702 271385 401759 100335
17491 6574 419248 233607 264994 161064 2298 -124341 188533 93518 -191626 -109057 122393
17479 465144 98888 269428 253363 79484 267985 87546 -25755 -60425 204496 261468 97707
17467 178616 -213575 92652 216702 159923 62304 198846 212049 -13647 139642 61072 -217400
17455 79650 219597 157459 66686 83838 155216 190187 -25004 -94970 51972 274491 -233421
17443 8091 612275 -26920 74934 453608 314646 87031 257818 204794 195641 603368 -13766
$$ packed form
17525F7372M1210a45557H2729a23730N0207r1583p4528R3034A21277D7987J88862
17514B36849d6102G6265J95305G1043b040n8657A42056a46097G1926A0361J21015
17503A31376C0508f9344C97837J6190b0224H9506Q1444E6702K14683J30374A00335
17491F574M12674j85641L1387j03930B298a24341A88533I3518a91626Q2569A22393
17479D65144I8888J70540j6065G9484J88501H7546b5755l4670B04496N6972I7707
17467A78616b13575I2652J24050n6779F2304J36542J3203a3647A39642F1072b17400
17455G9650J39947o2138F6686J7152P1378L4971b5004o9966E1972K22519b33421
17443H091O04184b6920G4934L78674j38962H7031J70787n3024r153M07727a3766
$$ plain form
17431 251623 347562 22749 432274 496627 263733 138827 80256 511336 218573 143471
17421 143471 201962 92122 227921 -8656 147079 183562 169827 103730 188515 292903 85652
17409 372872 455942 451235 267579 238259 389383 442356 475336 347109 436812 191669 199558
17398 199558 9176 83642 122273 3800 121040 493132 246159 -131246 36001 159063 142287
17387 142287 335290 -1916 -121183 337564 143763 6137 289940 301675 150854 -22751 129658
17375 62157 146697 169785 80791 -62461 483506 -95276 129447 -48425 182838 556403 439935
17364 439935 134609 202955 325875 -126970 266348 181162 341666 284143 139827 80440
17354 80440 419977 210289 210681 23525 139343 167302 -174425 243825 286487 -23338 295652
$$ packed form
17431B51623R5939B2749M09525O4353k32894j24906n8571M31080B18573p5102
17421A43471N8491I2122J35799h656A47079L6483j3735o6097Q4785J04388H5652
17409C72872Q3070m707j83656k9320J51124N2973L2980j28227Q9703A91669P889
17398A99558I176P4466L8631C800J17240L72092B46159a31246C6001J23062j6776
17387A42287J93003a916j19267C37564A43763F137K83803J1735j50821b2751A29658
17375F2157Q4540K3088H0791f2461D83506i5276A29447d8425A82838L73565j16468
17364D39935A34609O8346J22920a26970B66348q5186J60504n7523A39827n9387
17354H0440L39537k09688L92B3525J15818K7959a74425B43825M2662b3338B95652
$$ plain form
17342 140947 105625 304611 391262 312708 261674 395845 186668 105805 206491 -17065 -85197
17331 -85197 -535554 -294260 114313 290878 17113 68844 -65988 44918 352274 -71036 -109229
17320 -109229 -64611 -208886 150756 -9242 -69371 -96762 146813 230795 50740 56487 127649
17309 127649 213092 156133 239693 -37953 291591 -119699 -173738 310447 157626 268447
17299 268447 212488 281468 -94232 229478 140677 137724 90954 -79832 311353 182129 284596
17288 284596 415230 575933 -11168 178084 191517 100558 169417 -161088 46374 -59932 312438
17276 -180595 140203 332425 -36486 244327 232241 92095 564480 -152540 52659 106198
17266 106198 41296 380141 124244 207170 311918 105585 497644 234056 -124967 139457
$$ packed form
17342A40947l5322J98986Q6651p8554n1034J34171A86668q0863J00686a7065o8132
17331h5197m50357K41294A14313J76565A7113N1731f5988D4918L07356g1036l8193
17320a09229M4618j44275A50756i242o0129k7391A46813Q3982E0740N747P1162
17309A27649Q5443n6959Q3560c7953B91591a19699n4039C10447j52821J10821
17299B68447n5959O8980i4232B29478q8801k953m6770g9832C11353j29224J02467
17288B84596J30634J60703a1168A78084J3433r0959O8859a61088D6374e9932C12438
17276a80595A40203J92222c6486B44327j2086I2095M72385a52540E2659N3539
17266A06198D1296L38845A24244Q2926J04748A05585L92059B34056a24967A39457
$$ plain form
17255 211811 230392 324351 287179 37130 427846 -2905 449849 546982 -87510 94276 45035
17243 296000 19821 117002 168654 325199 168443 295711 201712 353281 -18984 46648 479244
17232 479244 -27565 175539 434462 -27659 36261 253344 468504 -16599 316835 107128
17221 442106 235555 376091 270366 -10436 318469 522283 455774 442338 270431 111229
17210 -11713 -52831 216355 389907 47347 169211 67409 138664 265541 381924 197702
17200 197702 342890 10332 215374 -26905 242109 50954 -2909 172364 77738 98624 276017
17189 276017 255377 185759 333195 -22547 279458 168793 242131 38310 239765 287875 376399
17178 376399 204283 417335 65830 -60129 408979 301588 250902 294745 142670 167146
$$ packed form
17255B11811J8581R3959l7172C7130L90716b905D49849R7133h7510I4276D5035
17243B96000A9821R7181N1652J56545j56756J27268r3999J51569a8984D6648M32596
17232D79244b7565A75539K58923b7659C6261K17083K15160a6599C16835A07128
17221D42106k06551J40536j05725a0436C18469K03814o6509j3436j71907A11229
17210a1713m1118B16355J73552D7347J21864F7409P1255J26877J16383j84222
17200A97702J45188A0332K05042b6905B42109E0954b909A72364G7738K0886J77393
17189B76017k0640o9618J47436b2547B79458j10665P3338C8310K01455M8110Q8524
17178C76399j72116K13052F5830f0129D08979j07391n0686M3843A42670K4476
$$ plain form
17168 167146 639163 142823 199638 483578 714712 180654 392069 481342 492474 251523
17158 251523 39309 364931 130968 324666 92700 41900 278546 290425 90831 285149
17148 285149 529503 552294 581203 -17158 266440 30938 225740 313328 419957 224102
17138 224102 273042 148942 393937 310056 25900 261519 348275 67013 564928 286629
17128 286629 380814 216563 340352 267456 329385 652675 324657 28011 314675 237071
17118 237071 347134 487243 242780 147659 -34989 569504 68627 217832 56862 -18123
17107 332809 437004 740488 251050 224978 472200 372388 304488 368063 116594 359422
17097 359422 418341 218681 523149 228222 289412 444045 120154 477599 401114 234983
$$ packed form
17168A67146M72017A42823N6815K83940K31134A80654K11415Q9273J1132k40951
17158B51523C9309L25622A30968J93698I2700D1900K36646J1879I0831J94318
17148B85149K44354K2791K8909a7158B66440C0938J94802Q7588J06629j95855
17138B24102M8940j24100K44995q3881B5900K35619Q6756F7013M97915k78299
17128B86629R4185j64251J23789p2896O1929L23290C24657B8011K86664p7604
17118B37071J10063J40109B42780r5121c4989E69504F8627J49205E6862a8123
17107C32809J04195L03484B51050k6072K47222r9812o7900O3575A16594K42828
17097C59422N8919j99660L04468B28222O1190J54633A20154L57445p6485j66131
$$ plain form
17087 234983 430786 542076 557095 321563 562002 218956 492983 210234 531675 635962
17077 635962 497524 551082 255536 227109 420986 210580 274938 445732 401376 243736
17067 243736 556428 279350 294344 356925 363684 182390 471098 515574 488469 444950 427283
17056 427283 396906 281804 407692 325243 588829 363954 674525 219811 583038 828522
17046 828522 468005 394774 312510 106901 520488 367500 47708 209005 423911 731261
17036 731261 643840 202809 547282 452457 803644 417738 415481 670020 656834 319323
17025 252773 279784 426430 580245 477038 634559 668908 691963 553710 495790 446475
17015 446475 934949 573836 638102 595813 331288 582860 607955 678699 786424 628776
$$ packed form
17087B34983J95803J11290J5019k35532K40439B18956K74027B10234L21441J04287
17077F35962j38438N3558B55536k8427J93877k10406O4358J70794m4356j57640
17067B43736L12692k77078J4994O2581O759j81294K88708M4476k7105m3519j7667
17056D27283l0377j15102J25888q2449K63586k24875L10571B19811L63227K45484
17046H28522l60517p3231q2264A06901M13587j52988D7708J61297K14906L07350
17036G31261q7421B02809L44473r4825L51187l85906k257K54539j3186C19323
17025B52773K7011J46646J53815j03207J57521L4349K3055j38253n7920m9315
17015D46475M88474l61113O4266m2289k64525K51572K5095P0744J07725j57648
$$ plain form
17005 628776 684718 266530 872863 837317 695152 567098 361178 753109 882675 1025486
16995 1025486 655257 765111 716543 894976 734229 535349 906415 1009785 438516 631515
16985 631515 1169156 888289 633221 528754 935142 449194 803694 838280 907048 554787
16975 554787 1064865 848964 1055985 939755 744032 551351 1015441 667466 823063 588058
16965 588058 992842 656741 846910 738204 1207259 930184 778011 892001 891354 1088098
16955 1088098 708609 1018976 943043 965916 715053 723086 710417 1088850 1127777 693710
16945 693710 946554 984606 1112839 992140 930497 608008 832598 946994 854157 824894
16935 824894 1200760 1084797 1197389 963830 1189858 1070266 1549496 934240 1009527 1137830
$$ packed form
17005F28776N5942B66530O06333l5546j42165j28054k05920L91931J29566J42811
16995A025486l70229J09854m8568J78433j60747j98880L71066J03370D38516J92999
16985F31515N37641k80867k55068j04467M06388D49194L54500L4586O8768l52261
16975E54787N10078k15901K07021j16230j95723j92681M64090l47975J55597k35005
16965E88058M04784l36101J90169j08706M69055k77075j52173J13990o47J96744
16955A088098l79489L10367p5933K2873k50863Q033j2669L78433L8927m34067
16945F93710K52844L8052J28233j20699o1643l22489K24590J14396r2837k9263
16935H24894L75866j15963J12592k33559K26028j19592M79230o15256P5287J28303
$$ plain form
16925 1137830 1405207 1307919 1337545 1210595 881574 1196704 1188933 1434528 1376600 1204559
16915 1204559 1038842 1393505 1264895 1243330 1271808 1475676 1478318 796594 1180951 1326263
16905 1326263 1320551 1035543 1200198 1476274 1600028 1374277 1712797 1464134 1525727 1368439
16895 1368439 1403926 1596346 1506795 1646387 1947335 1837129 1509346 1575296 1709454 1579426
16885 1579426 1712368 1746457 1782330 1514713 2046556 1684138 1925038 1596141 1670565 1661015
16875 1661015 1999886 1617624 1818310 2311628 1920870 2239211 1863360 1950042 2088297 2243871
16865 2243871 2133152 2136852 2258565 2353307 2080404 2052751 2341886 2148010 2573533 2171393
16855 2171393 2732068 2722944 2534679 2369673 2646864 2279226 2733962 2497607 2896587 2626983
$$ packed form
16925A137830K67377r7288K9626j26950l29021L15130p771K45595n7928j72041
16915A204559j65717L54663j28610k1565K8478K03868K642o81724L84357J45312
16905A326263n712k85008J64655K76076J23754k25751L38520k48663O1593j57288
16895A368439L5487J92420q9551J39592L00948j10206l27783O5950J34158j30028
16885A579426J32942L4089L5873k67617N31843l62418K40900l28897P4424r550
16875A661015L38871l82262K00686M93318l90758L18341l75851Q6682J38255J55574
16865B243871j10719L700J21713R4742k72903k7653K89135j93876M25523m02140
16855B171393N60675r124j88265j65006K77191l67638M54736k36355L98980k69604
$$ plain form
16845 2626983 2692657 2754331 2618222 2821047 2952425 3368533 2989292 2892229 3097501 3018940
16835 3018940 2997381 3168977 3340457 3383704 3416559 3886330 3485785 3745205 3638646 3643755
16825 3643755 3712122 3607489 4144126 3822307 3966325 3955459 4024230 4166061 4028633 4189116
16815 4189116 4555265 4556505 4539782 4437948 4816606 4764789 5021044 4945895 5131250 5208927
16805 5208927 5405859 5251912 5380112 5325767 5769647 5563638 6266480 5907818 5867422 6532891
16795 6532891 6381924 6450706 6874259 6939189 6992528 7368227 7410734 7254971 7650387 7856043
16785 7856043 8259419 8202472 8444285 8439829 8766612 8879433 9079710 9622271 9539229 10246535
16775 10246535 10522560 10607837 11098999 11365687 11789414 11649954 12135698 12907302 13237004
$$ packed form
16845B626983O5674O1674j36109K02825J31378M16108l79241r7063K05272p8561
16835C018940k1559J71596J71480M3247L2855M69771m00545K59420j06559N109
16825C643755O8367j04633N36637l21819J44018j0866O8771J41831j37428J60483
16815D189116L66149J240j6723j01834L78658n1817K56255p5149J85355P7677
16805E208927J96932j53947J28200n4345M43880k06009P02842l58662m0396O65469
16795F532891j50967O8782M23553O4930N3339L75699M2507j55763L95416K05656
16785G856043M03376n6947K41813m456L26783J12821K00277N42561q3042P07306
16775A0246535K76025Q5277M91162K66688M23727j39460M85744P71604L29702
$$ plain form
16766 13237004 13242624 13944849 14717436 15231951 15546934 16423515 16246375 16936141 17626660 18308677
16756 18308677 18889473 19793966 20216614 21255728 22179853 22797350 23468426 24350367 25590458
16747 25590458 26821810 27824540 29134728 30705573 32074304 33488925 34949706 36779476
16739 36779476 38545592 41087555 43012589 45025318 47544357 50271823 53510881 56240921
16731 56240921 59831447 63278958 67210305 71507377 75860722 80698650 86400681 92138368
16723 92138368 98110022 105038688 112265299 120115808 128065628 136290781 145349982 153974386
16715 153974386 163208188 172460883 181278591 190056882 197801217 204680456 211100937 215777248
16707 215777248 218973621 220780836 220569101 218242549 215074647 209820726 203347576 195336694
$$ packed form
16766A3237004N620P02225P72587N14515L14983Q76581j77140O89766O90519O82017
16756A8308677N80796R04493M22648J039114R24125O17497O71076Q81941J240091
16747B5590458J231352J002730J310188J570845J368731J414621J460781J829770
16739C6779476J766116K541963J925034K012729K519039K727466L239058K730040
16731E6240921L590526L447511L931347M297072M353345M837928N702031N737687
16723I2138368N971654O928666P226611P850509P949820Q225153R059201Q624404
16715A53974386R233802R252695Q817708Q778291P744335O879239O420481M676311
16707B15777248L196373J807215k11735k326552l167902n253921o473150q010882
$$ plain form
16699 195336694 186670992 177576057 168461596 158990618 149574877 140264619 131796683 123147143
16691 123147143 115088004 107939293 100726936 94026128 87836814 82232052 77202963 71779187
16683 71779187 67399862 63313185 59776240 55944758 52583064 49326663 46644431 43925271
16675 43925271 41625930 39294947 37127341 35361964 33618128 31777367 30325042 28837763
16667 28837763 27350174 26138893 24752143 23802576 22609980 22061347 20670552 19776620
16659 19776620 19188909 18122642 17545639 17087748 16414291 15788206 15216676 14811561 14329258
16650 14329258 13732300 13302202 12393454 12129936 12033186 11210224 11329041 10927547 10378870
16641 10378870 9912311 9641407 9187509 9072758 8765200 8766844 8412843 7865543 7573807 7679960
$$ packed form
16699A95336694q665702r094935r114461r470978r415741r310258q467936q649540
16691A23147143q059139p148711p212357o700808o189314n604762n029089n423776
16683G1779187m379325m086677l536945l831482l361694l256401k682232k719160
16675D3925271k299341k330983k167606j765377j743836j840761j452325j487279
16667B8837763j487589j211281j386750r49567j192596n48633j390795q93932
16659A9776620n87711j066267n77003m57891o73457o26085n71530m05115m82303
16650A4329258n96958m30098r08748k63518r6750q22962J18817m01494n48677
16641A0378870m66559k70904m53898j14751l07558J644l54001n47300k91736J06153
$$ plain form
16631 7679960 7839465 7265200 6827188 6663638 6657029 6696351 6457091 6312418 6117301 6220170
16621 6220170 5514487 5289287 5323755 5313989 5075735 4969139 4581179 4984069 4688772 4852023
16611 4852023 4686907 4439041 4288063 4203963 3877854 3712988 4093871 3721444 3948072 3740886
16601 3740886 3675057 3706688 3461034 3583840 3086351 3385753 3227721 3381449 3435391 3116157
16591 3116157 3212443 3010402 2884964 2547140 2832800 2605321 3080039 2837984 2820292 2537478
16581 2537478 2385106 2279270 2466250 2420002 2301177 2032309 1999199 2301101 2081687 1860239
16571 1860239 2078942 1891117 2074579 1866581 2284792 1781012 1742025 1919365 1890305 1709696
16561 1709696 1722028 1867292 1804754 1903545 1410500 1985725 1739891 1447145 1550472 1628526
$$ packed form
16631G679960J59505n74265m38012j63550o609L9322k39260j44673j95117J02869
16621F220170p05683k25200L4468r766k38254j06596l87960M02890k95297J63251
16611D852023j65116k47866j50978q4100l26109j64866L80883l72427K26628k07186
16601C740886o5829L1631k45654J22806m97489K99402j58032J53728N3942l19234
16591C116157R6286k02041j25438l37824K85660k27479M74718k42055j7692k82814
16581B537478j52372j05836J86980m6248j18825k68868l3110L01902k19414k21448
16571A860239K18703j87825J83462k07998M18211n03780l8987J77340k9060j80609
16561A709696J2332J45264o2538R8791m93045N75225k45834k92746J03327P8054
$$ plain form
16551 1628526 1353589 1641981 1593820 1624005 1639806 1671265 1304879 1424658 1254445 1019649
16541 1019649 1333487 1120509 1518076 1231148 1412187 1249737 1278231 1105804 1131609 1317955
16531 1317955 1285736 1077207 1289612 857694 1094219 1147441 1224738 877166 810058 965259
16521 965259 980254 736339 994407 872538 1021182 1211596 1043867 1379576 1060038 950358
16511 950358 1165642 704914 891848 885688 1073356 952221 519024 336125 713248 854382
16501 854382 673580 603239 817935 639095 776815 672879 694695 1103275 850481 629852
16491 629852 385219 172279 893560 453225 622511 741742 455365 858108 871691 396123
16480 565978 725119 574897 912668 578889 793786 496446 221282 416401 757938 771430
$$ packed form
16551A628526k74937K88392m8161L0185J5801L1459l66386J19779j70213k34796
16541A019649L13838k12978L97567k86928J81039j62450K8494j72427K5805J86346
16531A317955l2219k08529K12405m31918K36525N3222P7297l47572o7108J55201
16521I65259J4995k43915K58068j21869J48644J90414j67729L35709l19538j09680
16511I50358K15284m60728J86934o160J87668j21135m33197j82899L77123J41134
16501H54382j80802p0341K14696j78840J37720j03936K1816M08580k52794k20629
16491F29852k44633A72279P21281m40335J69286J19231k86377M02743J3583C96123
16480E65978J59141j50222L37771l33779K14897k97340B21282J95119L41537J3492
$$ plain form
16470 771430 647245 786614 441470 571208 496279 354932 809023 541824 570681 393813
16460 393813 522705 391229 520694 543565 461247 704053 450547 502310 656078 196874
16449 318422 66406 246807 419251 434070 327651 469783 418855 528519 549897 535149
16439 535149 284881 492485 346077 80552 560218 518477 232267 189873 214661 64437
16428 455686 57114 344253 360016 170288 310328 440167 278198 754903 395055 515695
16418 515695 82486 376800 1911 384339 147294 260430 83821 233706 481730 255190
16408 255190 216252 132712 307288 163421 235167 344204 340589 273138 240033 267350 60542
16396 88060 163798 283363 471049 158958 232873 146760 79623 37444 134750 569396 104360
$$ packed form
16470G71430j24185J39369l45144J29738p4929j41347M54091k67199K8857j76868
16460C93813J28892j31476J29465K2871q2318K42806k53506N1763J53768A96874
16449C18422F6406J80401J72444J4819j06419J42132n0928J09664K1378j4748
16439E35149k50268K07604j46408H0552M79666m1741B32267m2394K4788F4437
16428D55686E7114K87139J5763A70288J40040J29839j61969M76705l59848J20640
16418E15695H2486K94314A911L82428A47294J13136H3821J49885K48024k26540
16408B55190l8938q3540J74576j43867P1746J09037l615o7451l3105K7317F0542
16396H8060P5738J19565J87686A58958P3915q6113o7137C7444R7306M34646A04360
$$ plain form
16384 637945 146490 92809 29232 305861 60192 267965 82842 285495 315879 64963 168274
16373 168274 461937 72263 92878 507643 449823 -135717 559010 -160608 299487 135076
16362 -58243 179705 235920 280943 233181 360460 373552 183417 186594 24751 -30296 289517
16350 -9548 230627 242779 -110268 113201 -30313 159462 357227 -42927 47712 544495 -24944
16338 -89282 -158376 200879 184057 87216 -6901 300744 281193 31110 245523 362974 209373
16327 209373 15062 -85025 105385 143510 492539 248049 161190 246537 247062 229190 133957
16316 133957 -184886 -43526 97742 -218465 55088 -312848 128718 -33468 28167 32325 232667
16305 232667 45694 37271 148429 -75832 287515 83876 200968 353514 -340711 8490 -180872
$$ packed form
16384F37945A46490n3681B9232K76629F0192K07773H2842K02653L0384F4963J03311
16373A68274K93663G2263K0615M14765n7820a35717E59010a60608B99487A35076
16362e8243A79705N6215M5023m7762J27279J3092A83417L177B4751c0296B89517
16350i548B30627J2152a10268A13201c0313A59462J97765d2927D7712M96783b4944
16338h9282o9094B00879j6822H7216f901C00744j9551C1110K14413J17451j53601
16327B09373A5062h5025A05385L8125L49029k44490q6859Q5347N25j7872r5233
16316A33957a84886d3526I7742b18465E5088c12848A28718c3468B8167M158K00342
16305B32667D5694q423J11158g5832B87515H3876J17092J52546c40711H490a80872
$$ plain form
16293 -15430 432665 246 72837 319333 408504 -217977 146440 -169733 -139642 37138 134315
16282 134315 161130 345252 -201760 -21356 -33164 -18452 77413 236223 -71392 -34878 -112213
16271 -112213 562589 -15634 19958 29090 -131989 -5110 -56266 461923 -273456 202489 205195
16260 205195 -124018 393111 -22298 56671 246065 131037 77366 59733 80821 164062 164930
16249 164930 6787 -306106 -192230 -142907 43460 149654 83828 -67182 95075 -87234 -126591
16238 -126591 -66790 145402 363550 -133412 53034 -278664 240224 -131798 87476 86648 466179
16227 466179 -175470 -116496 -170169 -238623 211671 216535 17945 -17290 -254560 182390 1982
16215 -132878 -6171 8960 245371 -155904 27127 44603 277110 -138750 -153588 33837 120250
$$ packed form
16293a5430D32665B46P2591K46496Q9171b17977A46440a69733L0091C7138R7177
16282A34315K6815J84122b01760b1356j1808J4712G7413J58810g1392c4878p7335
16271a12213E62589a5634A9958R132a31989e110n1156D61923b73456B02489K706
16260B05195a24018C93111b2298E6671J89394j15028n3671j7633K1088Q3241Q68
16249A64930F787c06106J13876M9323D3460J06194o5826f7182I5075h7234l9357
16238a26591N9801A45402K18148a33412E3034b78664B40224a31798H7476q28L79531
16227D66179a75470N8974n3673o8454B11671M864A7945a7290k37270A82390A982
16215a32878f171H960K36411a55904B7127J7476K32507a38750j4838C3837Q6413
$$ plain form
16204 120250 25821 273929 -55511 38963 6263 120402 -212338 -117638 445553 58010 -186557
16192 247760 -11756 123869 13466 32267 206052 141436 -60126 -199540 11615 51833 -17559
16180 96685 143357 170361 -215016 -7273 -128984 -57559 56423 251335 -119435 -127986 150075
16168 71565 8985 120292 8458 -293042 -250035 167443 -59313 -37041 352339 17573 10518
16157 10518 -237575 206746 208161 77875 98368 -411255 -271852 -318682 -64589 -138693 76468
16145 131617 -48426 -450145 223664 570894 70687 80916 -47332 44393 -370963 -47257 -255384
16134 -255384 -83121 -117940 -329618 -3672 -182747 -124579 164775 -186546 -65565 -73916 47321
16122 -269757 -59894 172478 -81284 -164089 88974 214466 -103769 54490 43448 82430 233442
$$ packed form
16204A20250B5821K48108e5511C8963F263J14139b12338R4700D45553E8010a86557
16192B47760a1756A23869A3466J8801J73785o4616f0126j39414A1615M0218a7559
16180I6685M6672K7004b15016g273j21711e7559E6423J94912a19435q551A50075
16168G1565H985J11307H458b93042M3007A67443e9313K2272C52339A7573p055
16157A0518b37575B06746J415G7875K0493d11255J39403m6830f4589p4104G6468
16145A31617d8426m01719B23664L47230G0687J0229d7332D4393c70963d7257k08127
16134b55384h3121l4819k11678c672j79075N8168A64775a86546f5565q351D7321
16122b69757e9894A72478h1284q2805H8974J25492a03769E4490j1042L8982J51012
$$ plain form
16111 233442 599861 93249 -9314 81146 40535 -152696 32652 344644 98156 58267 -128804
16099 -86359 -29147 585117 -159277 -223370 112682 -67486 39594 -223571 -16374 318590 -237445
16087 148444 139352 59722 91743 -93055 -80537 -220191 -195371 -81530 28687 133501 -92821
16075 120750 73603 -457669 -39313 -20695 147399 -281876 64214 -93593 166504 -69077 -41327
16064 -41327 -54448 31729 70382 -80344 319544 8275 -14534 -105701 -53256 72832 271962
16053 271962 8002 138350 -118810 -165401 -264799 -205093 287028 -23572 -223121 -82579 341647
16041 -302692 -398315 -251632 309624 -275093 -109371 153797 -290268 129511 -446550 -529400
16031 -529400 -220115 -113908 210678 78873 -37349 29647 -62762 -323519 13997 131378
$$ packed form
16111B33442L66419I3249i314H1146D0535a52696C2652L11992I8156l9889a28804
16099h6359b9147E85117a59277o4093A12682f7486C9594b23571a6374C18590b37445
16087A48444r092E9722L2021i3055J2518j39654K4820h1530B8687J04814i2821
16075A20750m7147d57669c9313J8618A47399b81876F4214i3593A66504f9077K7750
16064d1327j3121C1729L8653h0344C19544H275a4534r1167N2445G2832J99130
16053B71962H002J30348a18810m6591r9398N9706B87028b3572j99549h2579C41647
16041c02692r5623J46683C09624b75093a09371A53797b90268A29511d46550q2850
16031e29400b20115J06207B10678G8873c7349B9647f2762k60757A3997J17381
$$ plain form
16021 131378 -119710 -178305 -136696 1292 -206624 -173510 -74196 -158124 12896 33648 -47513
16009 -63990 56598 -48974 64237 33055 29352 136738 149318 -115394 59439 36872 44708 -47827
15996 40815 160757 11624 3808 187158 31034 -284652 33532 214921 57335 -124424 27640
15984 -261499 -86417 15096 -62742 237786 -337649 -47212 69351 101813 182561 -99239 -175561
15973 -175561 -8861 2777 78778 76192 254328 409721 58720 63113 182049 -71563 292554
15961 167832 43275 77933 -90796 -174718 5729 168105 -177169 -57589 167694 -220416 234017
15949 98673 183118 -53720 -127153 33843 44300 86222 -32008 169635 -156572 -5209 -232209
15938 -232209 -161872 -189020 80822 -135103 -17223 228830 166586 142605 -230210 -152660 -164170
$$ packed form
16021A31378a19710n8595M1609A292b06624L3114g4196q3928A2896K0752d7513
16009f3990E6598d8974F4237l1182l703J07386J2580a15394E9439k2567P836d7827
15996D0815J19942A1624C808J83350C1034b84652C3532J81389E7335a24424B7640
15984b61499h6417A5096f2742B37786c37649d7212F9351L2462Q0748i9239p6322
15973a75561h861B777P6001k586J78136J55393E8720M393J18936g1563B92554
15961A67832D3275L4658i0796q3922E729J62376a77169e7589A67694b20416B34017
15949I8673Q4445e3720p3433C3843J0457M1922c2008A69635a56572e209k27000
15938b32209P0337k7148H0822a35103a7223B28830o2244k3981b30210P7550j1510
$$ plain form
15927 -164170 -65722 -208563 -450005 -353789 55546 238247 -181119 -169568 939 -59777 -265176
15916 -265176 156407 -89781 24740 -172863 -191153 -238738 33888 -205198 -462646 -362030
15906 -362030 -181801 64558 -311614 -104596 115808 -81452 -459748 -45517 -263192 138117
15895 48317 186456 -260810 -123017 -266095 -144505 -49099 -19782 -386315 -67756 -84458
15885 -84458 126041 36439 109328 48660 -20927 -200827 273676 -43829 -229638 -29810 -148036
15874 -148036 -60933 -34736 182572 -204076 -114800 10116 -100177 -77077 -303419 189470
15863 -66733 -345096 -289306 -90328 -133803 -239605 -101308 99842 6741 109378 -82051 385209
15851 -28703 243744 81361 -76854 297812 41017 44615 -143819 155941 440431 -226785 236191
$$ packed form
15927a64170f5722j42841k41442R6216E5546J82701a81119J1551I39e9777k05399
15916b65176A56407h9781B4740a72863j8290m7585C3888b05198k57448J00616
15906c62030J80229F4558c11614a04596A15808h1452l78296d5517k17675A38117
15895D8317J38139b60810a23017j43078J21590d9099a9782l66533f7756j6702
15885h4458A26041C6439P2889D8660b0927j79900B73676d3829j85809b9810j18226
15874a48036f0933K6197A82572b04076Q9276A0116a00177K3100k26342A89470
15863f6733k78363N5790i0328m3475j05802a01308I9842F741J02637h2051C85209
15851b8703B43744H1361g6854B97812D1017L598a43819A55941K84490b26785B36191
$$ plain form
15839 134752 585258 -129422 39415 23768 -20505 398023 -10765 -108256 -20418 -391786 -81566
15827 -92601 55863 -211594 -259057 -88739 -65158 -115146 1251 95950 89823 -126524 -85491 -136503
15815 -136503 -62764 -121480 -154880 -623309 106922 181942 33533 -26319 -196383 -60786 -66821
15804 -66821 164729 -280168 -52506 294938 -151124 -17686 -247800 -26114 97318 -235872
15793 -197454 145563 -15971 188658 -67891 131661 -17177 -104479 3869 270956 -95110 -330293
15782 -330293 340616 -137445 -224009 -38483 -72317 -1969 -33085 -45364 119081 -93044 61841
15770 6778 387262 -108406 261246 24923 -118586 -85983 -171427 -67021 -135093 -301506 -27592
15758 -153856 -283597 -106742 314046 -13462 48935 189886 -15837 2469 579185 177510
$$ packed form
15839A34752M50506a29422C9415j5647b0505C98023a0765r7491b0418l71368h1566
15827i2601E5863b11594m7463h8739K3581m9988A251R4699o127a26524M1033n1012
15815a36503f2764n8716l3400m68429A06922P5020C3533b6319j70064f0786o035
15804f6821A64729b80168e2506B94938a51124a7686k30114b6114I7318b35872
15793a97454A45563a5971A88658f7891A31661a7177q7302C869K67087i5110k35183
15782c30293C40616a37445q6564c8483l3834a969l1116j2279A19081i3044F1841
15770F778L80484a08406B61246B4923a18586L2603q5444f7021o8072j66413b7592
15758a53856j29741a06742C14046a3462D8935J40951a5837B469N76716A77510
$$ plain form
15747 -146731 189118 -56267 -201309 -363743 238131 -109729 155314 -101836 -16143 34161
15736 112139 79884 -264809 -250819 -21966 -142348 135893 167599 160967 -81482 -332553 -77685
15724 13327 -268395 259965 -79027 130310 28019 18013 -50063 423195 -123383 -154679 53273
15712 38844 96110 99189 105241 -290230 -43246 -83350 -211970 143937 -209374 -91903 167652
15700 252967 197949 -233279 59591 -38682 -114134 -172192 26232 -1152 -269022 91702 -11514
15688 -79513 434 202503 4017 59749 -125025 -1827 -165760 162003 -3630 -35450 -165713 -58354
15675 -211970 -175219 145042 132207 -53394 26931 -169327 145628 114464 -164345 265761
15664 -361985 -205749 -73209 -296536 -25918 24594 -116290 159073 140277 -59313 71794 272552
$$ packed form
15747a46731A89118e6267j45042j62434B38131a09729A55314a01836a6143C4161
15736A12139l2255b64809J3990b1966j20382A35893L1706o632h1482k51071g7685
15724A3327b68395B59965g9027A30310B8019j0006e0063D23195a23383l1296E3273
15712C8844N7266L079O052b90230d3246m0104j28620A43937b09374i1903A67652
15700B52967n5018b33279E9591c8682p5452n8058B6232a152k67870I1702a1514
15688g9513D34K02069D017N5732a25025a827j63933A62003c630l1820j30263e8354
15675b11970L6751A45042j2835e3394B6931a69327A45628l1164a64345B65761
15664c61985J56236g3209k23327b5918B4594a16290A59073j8796e9313G1794K00758
$$ plain form
15653 272552 194776 -363545 68568 2103 -34779 -184197 42833 -422324 -119749 13561 -45399
15641 -162746 18269 139898 -181757 380747 -16079 -53304 58184 -251952 -35000 238606
15630 -103429 348438 58544 -223947 -50796 -75671 23473 -161826 -297598 -120180 -94566
15620 -94566 145267 62438 -1410 161291 114082 -12185 284977 -182025 44261 -124530 -31542
15608 -355187 20549 -149214 -126313 174001 140279 101381 -364643 152731 -169454 41619
15597 -131463 -153040 402654 82003 -205251 333212 -30825 84718 112245 -232477 -35104 36953
15585 -288780 -168994 -132738 -20773 -198626 -467128 110274 155185 -126944 -254465 219852
15574 -15579 -350147 -33907 312567 -195535 89341 -282162 -139020 222135 189305 364956
$$ packed form
15653B72552p7776c63545F8568B103c4779j49418D2833d22324a19749A3561d5399
15641a62746A8269J21629a81757C80747a6079l7225E8184b51952c5000B38606
15630a03429C48438E8544b23947e0796k4875B3473a61826j35772a20180K5614
15620i4566A45267F2438a410A61291m7209a2185B84977a82025D4261a24530c1542
15608c55187B0549a49214K2901A74001l3722l8898c64643A52731a69454D1619
15597a31463k1577D02654H2003b05251C33212c0825H4718K7527b32477c5104C6953
15585b88780J19786L6256b0773j77853k68502A10274M4911a26944j27521B19852
15574a5579l34568c3907C12567a95535H9341b82162a39020B22135l2830J75651
$$ plain form
15564 364956 -104128 -193413 -8926 115044 -103697 238871 52842 -133597 -67052 -249016
15554 -249016 80489 111024 97016 -67439 -155303 -195383 -122009 -200082 161506 54394 -136446
15542 210734 -264847 -60891 -6031 92537 -30195 -166446 294718 10440 -67599 -74468 156063
15530 -144263 -36463 -1809 340805 -210180 -125600 -137234 -126640 156172 -169816 269182 59392
15518 -415223 -119687 192785 -225270 140431 -564 55503 -18749 -122723 134920 14161 -115881
15506 187467 48848 -172051 -295105 9044 32614 -50551 49800 100526 97755 125208 152792
15495 152792 330708 203417 73434 74466 351364 240601 -14742 -189833 54446 99611 -189323
15483 19052 -187790 89636 -266558 29052 -92839 1519 -146740 82448 -30864 -184387 -58617
$$ packed form
15564C64956a04128q9285h926A15044a03697B38871E2842a33597O6545j81964
15554b49016H0489L0535j4008f7439q7864m0080P3374p8073A61506E4394a36446
15542B10734b64847f0891f031I2537c0195j36251B94718A0440f7599o869A56063
15530a44263c6463a809C40805b10180Q4580j1634J0594A56172a69816B69182E9392
15518d15223a19687A92785b25270A40431e64E5503a8749j03974A34920A4161a15881
15506A87467D8848a72051j23054I044K3570e0551D9800N0726k771K7453K7584
15495A52792J77916j27291G3434J032K76898j10763a4742j75091E4446M5165a89323
15483A9052a87790H9636b66558B9052i2839A519a46740H2448c0864j53523e8617
$$ plain form
15471 -311487 11400 78249 134936 -225343 -79304 104901 -32433 8414 -194018 -111874 -84699
15460 -84699 -114903 -241390 -259430 -67245 193247 203493 -50173 1486 -96670 -45009 -233120
15449 -233120 38748 -12872 61205 382391 249840 106024 -126195 235390 151675 121980
15439 121980 -264773 222253 71177 308185 -75785 48452 117969 1635 190104 -122409 191746
15427 -263126 148756 33497 -134874 -130747 -58576 -231578 -239640 -8945 48350 -112879 -103286
15416 -103286 -29437 48254 210993 184730 -129418 -26500 -94818 -85170 -75536 -201680 -236959
15405 -236959 97568 131115 32330 -98610 60673 18900 -186260 7873 118879 -316844 182773
15393 287573 -232877 65100 5377 -163906 -47218 90587 -148091 -91154 212610 140409 166958
$$ packed form
15471c11487A1400O6849N6687b25343g9304A04901c2433H414a94018Q2144K7175
15460h4699l0204j26487j8040f7245A93247J0246e0173A486i6670d5009j88111
15449b33120C8748a2872F1205L21186j32551A06024a26195B35390q3715k9695
15439A21980b64773B22253G1177K37008g5785D8452O9517A635J88469a22409A91746
15427b63126A48756C3497a34874M127e8576j73002q062h945D8350a12879R593
15416a03286b9437D8254J62739k6263a29418b6500o8318R648R634j26144l5279
15405b36959I7568L3547C2330i8610F0673A8900a86260G873J11006c16844A82773
15393B87573b32877F5100E377a63906d7218I0587a48091N6937B12610p2201K6549
$$ plain form
15382 166958 149808 -216873 -195951 177842 209016 22557 -8699 -65041 10742 -175542 226595
15370 40376 -70907 -151038 106948 301183 -285061 -76734 -282908 -274993 -101009 90496 -270530
15358 -220464 75033 -59863 -110208 -238871 139889 92013 -10401 -175796 49339 323766 260524
15347 260524 -175002 -3508 421925 156388 58050 61729 -247686 187382 -17281 -191456 187591
15335 270627 1583 19675 53334 59470 -189858 -30105 -56097 -159086 -227235 14156 395499
15324 395499 -142946 -45979 -387478 9025 333100 -70800 -139265 -9740 157499 -133968 -48957
15312 259515 111147 -110508 -3403 30122 361312 88997 178741 -358364 -259526 -122546 85154
15300 49844 -66005 155270 -131237 -26473 389510 51991 -261477 200185 127027 -136815
$$ packed form
15382A66958j7150b16873K0922A77842L1174B2557h699n6342A0742a75542B26595
15370D0376g0907q0131A06948J94235b85061g6734k06174P915a01009I0496b70530
15358b20464G5033e9863n0345j28663A39889m7876a0401j65395D9339K74427o3242
15347B60524a75002c508D21925A56388E8050L679b47686A87382a7281j74175A87591
15335B70627A583J8092L3659O136a89858c0105k5992j02989o8149A4156L81343
15324C95499a42946d5979l41499I025L24075g0800o8465i740A57499a33968d8957
15312B59515A11147a10508c403C0122L31190H8997Q9744c58364R8838a22546H5154
15300D9844f6005A55270a31237b6473C89510E1991b61477B00185p3158a36815
$$ plain form
15289 265704 64138 -161390 19186 -16628 55714 -262089 202818 93252 40284 75290 90488
15278 90488 -53154 -7200 475447 -105648 258868 -18545 86083 36396 -239316 212236 -93746
15266 144543 202918 -82198 177159 155396 -300026 123991 224654 -23782 371619 -9712 440095
15254 -51836 -130515 125744 200592 274984 -95071 -71069 251647 -127316 64521 266027 214542
15243 214542 -23216 170374 -68467 325335 176792 75486 252809 438960 60974 612521
15233 612521 1007438 1505294 990499 1168362 750091 398298 100784 23042 75235 244528
15223 244528 178898 131241 259214 224623 143490 506 85749 134141 28940 -95367 109480
15211 -148201 134205 -141302 93408 28710 -43957 -14951 193196 423582 93643 6981 -21068
$$ packed form
15289B65704F4138a61390A9186a6628E5714b62089B02818I3252D0284L5006J5198
15278I0488e3154g200D75447a05648B58868a8545H6083C6396b39316B12236i3746
15266A44543N8375h2198A77159k1763c00026A23991J00663b3782C71619i712D40095
15254e1836p8679A25744P4848P4392i5071K4002B51647a27316F4521K01506n1485
15243B14542b3216A70374f8467C25335j48543G5486J77323J86151F0974N51547
15233F12521L94917M97856n14795J77863m18271l51793A00784B3042N2193J69293
15223B44528o5630m7657J27973l4591q1133E06Q5243M8392B8940i5367A09480
15211a48201A34205a41302I3408B8710d3957a4951A93196K30386I3643F981b1068
$$ plain form
15199 -149253 207024 250167 -9735 252474 266087 238297 57068 -46966 171341 357582 -135932
15187 44740 14950 -175565 -138181 111004 -92924 -99457 190893 472773 -44782 279236 119061
15175 96801 87119 186834 -115470 96891 116337 97533 69432 67666 315253 -123729 96202
15163 57660 -28544 421082 278415 -41482 112609 -40162 36135 -6361 -25342 349563 -86196
15151 -69488 -14769 170656 -188181 215278 31432 198839 -49404 11088 221210 163395 286751
15140 286751 -3594 195963 66154 208011 221753 397694 168289 -9154 48373 19654 -296188
15128 207434 282386 -7626 308628 133811 -73792 -146303 105864 410099 228228 321037 325006
15117 325006 26874 540910 109242 113463 227375 -116185 225840 85357 -82992 208670
$$ packed form
15199a49253B07024M3143i735B52474J3613k7790E7068d6966A71341J86241a35932
15187D4740A4950a75565L7384A11004i2924o533A90893K81880d4782B79236A19061
15175I6801r682R9715a15470I6891J9446j8804k8101j766K47587a23729I6202
15163E7660b8544D21082j42667d1482A12609d0162C6135f361j8981C49563h6196
15151f9488a4769A70656a88181B15278C1432J67407d9404A1088K10122n7815J23356
15140B86751c594A95963F6154J41857J3742J75941A68289i154D8373A9654b96188
15128B07434P4952g626C08628A33811g3792p2511A05864L04235j81871R2809L969
15117C25006B6874N14036A09242M221J13912a16185B25840H5357h2992B08670
$$ plain form
15106 351544 71990 115103 27703 -68127 137792 463716 277819 127123 364958 302700
15096 302700 328853 66049 168097 72288 179753 -729 185270 -251764 143683 75254 246981
15085 246981 281669 3792 484007 369789 331727 -116629 88879 116339 280188 244462 46612
15073 117873 259347 268448 192517 -46071 683295 -80170 432826 -188029 294858 -12016 429258
15061 52844 127885 -147845 234406 153411 -167623 92668 -27885 142052 207829 357034 257771
15050 257771 4336 -157194 345796 374405 74335 272963 133415 143313 343709 272425 13241
15038 297492 -270487 209190 284969 227818 373544 -81191 -90367 244222 -112813 -44586 -116134
15027 -116134 -48832 380407 202138 69149 218211 99078 44366 -122468 -49517 383556
$$ packed form
15106C51544G1990M3113B7703f8127A37792L25924j85897A27123K37835o2258
15096C02700K6153F6049J02048G2288J07465g29A85270b51764A43683o8429J71727
15085B46981L4688C792M80215j14218l8062a16629H8879K7460J63849l5726D6612
15073A17873J41474R101p5931d6071F83295h0170D32826a88029B94858a2016D29258
15061E2844P5041a47845B34406q0995a67623I2668b7885A42052O5777J49205r9263
15050B57771D336a57194C45796K8609G4335J98628A33415R898K00396p1284A3241
15038B97492b70487B09190P5779n7151J45726h1191r176B44222a12813d4586p1548
15027a16134d8832C80407j78269F9149J49062I9078D4366a22468d9517C83556
$$ plain form
15016 -134471 225586 32066 -135424 239325 109715 537362 131562 -19954 193784 279618
15006 279618 139278 40700 262614 18329 508902 -19857 40321 31598 200034 203605 305442
14995 305442 145437 353511 57167 -8116 350981 336508 589682 80322 255162 286212 224007
14984 224007 534642 58213 298686 -247168 427415 236917 156227 423124 299549 323695
14974 323695 280366 28544 48303 88053 -95418 -63358 248807 392531 394359 487849 236822
14962 255304 289241 353421 143319 149943 254450 99339 319635 225137 -50883 276057 103163
14950 389674 49808 355882 182810 586682 26222 266353 458562 251491 296532 234319
14940 234319 372275 255147 325303 139135 11678 182038 458760 303048 349665 356221
$$ packed form
15016a34471B25586C2066a35424B39325A09715M27647A31562a9954A93784Q5834
15006B79618A39278D0700K21914A8329M90573a9857D0321q723J68436L571J01837
14995C05442A45437K08074E7167h116C50981j4473K53174H0322J74840L1050o2205
14984B24007L10635E8213K40473b47168D27415j90498q0690K66897j23575K4146
14974C23695m3329B8544J9759L9750i5418L2060B48807J43724J828R3490B36822
14962B55304L3937O4180A43319O624J04507I9339K20296r4498e0883B76057A03163
14950C89674D9808L06074j73072M03872B6222K40131J92209k07071M5041o2213
14940B34319J37956j17128P0156A39135A1678J70360K76722j55712M6617O556
$$ plain form
14930 356221 -51411 214986 540907 162688 384366 336212 216857 167606 233507 245441
14920 245441 235902 357135 203039 157513 332050 747036 363511 233484 267098 476379
14910 476379 423289 39724 343602 516583 192334 323147 -12665 167367 416188 342136
14900 342136 220133 534913 404928 419534 414750 310782 373407 427231 97255 341114 243420
14889 243420 834271 467158 348513 569254 400602 250973 318769 323253 261698 635085
14879 635085 205567 202278 338894 391363 161480 354172 184796 316641 570363 107513
14868 143759 442742 581034 237364 400932 427887 350912 463316 708658 432596 -16072
14857 209929 511871 502540 513 349866 447570 241906 475073 570993 417806 508598 452048
$$ packed form
14930C56221e1411B14986L25921A62688K21678m8154j19355m9251O5901J1934
14920B45441r539J21233j54096m5526J74537M14986C63511j30027L3614K09281
14910D76379n3090C9724L03878J72981A92334J30813a2665A67367K48821p4052
14900C42136j22003L14780j29985J4606m784j03968O2625N3824I7255K43859r7694
14889B43420N90851l67113j18645K20741j68652j49629O7796M484o1555L73387
14879F35085B05567l289J36616N2469A61480J92692j69376J31845K53722A07513
14868A43759K98983J38292B37364J63568K6955p6975J12404K45342k76062a6072
14857B09929L01942r331E13L49353R7704k05664K33167R5920j53187R0792n6550
$$ plain form
14846 452048 577002 217314 629798 750011 692906 658769 401535 105987 393796 510150
14836 510150 617270 514633 709908 490469 187162 451475 683900 501103 443454 399873
14826 399873 400995 -62047 397409 627534 721663 733033 516815 577933 234599 535753 428299
14815 428299 560617 628412 491495 449392 381725 362542 230104 196392 477647 420919 516168
14804 516168 484107 482727 421437 478845 580312 573531 665662 608219 391254 555020 514813
14793 514813 526887 587490 596476 940334 342735 306581 359052 956246 465072 413398 457844
14782 457844 753105 571919 743146 392227 721719 505442 359573 864680 705057 778740
14772 778740 450309 653667 556165 621780 438882 405547 537637 760161 677253 515036
$$ packed form
14846D52048J24954B17314M12484J20213n7105l4137k57234A05987K87809J16354
14836E10150J07120j02637J95275k19439A87162K64313K32425j82797n7649m3581
14826C99873J122f2047C97409K30125R4129J1370k16218O1118B34599L01154j07454
14815D28299J32318O7795j36917m2103o7667j9183j32438l3712K81255n6728R5249
14804E16168l2061j380o1290N7408J01467o781R2131n7443k16965J63766m0207
14793E14813J2074O0603Q986L43858C42735l6154N2471N97194D65072n1674M4446
14782D57844K95261j81186J71227l50919L29492k16277j45869N05107j59623P3683
14772G78740l28431K03358r7502O5615j82898l3335J32090K22524q2908j62217
$$ plain form
14762 515036 536077 644448 311026 738400 473705 709732 595036 578692 275440 849664
14752 849664 773018 1043660 595558 755959 341970 693208 1043029 605836 499188 512674
14742 512674 504380 441888 507129 341603 743497 594904 419746 695391 627472 289110
14731 528776 557011 783609 676488 1005017 569766 526509 704907 1005397 692816 989929
14721 989929 961339 903177 595319 830283 891020 946873 679886 678645 731790 1136905 894083
14710 894083 922372 1215809 838061 821702 817724 927131 1096768 491024 664338 850341
14700 850341 1189313 603481 833956 1271389 1042238 939984 907722 709902 1002035 791669
14690 791669 853973 716843 820656 843474 1017971 1043461 710657 739794 883464 634302
$$ packed form
14762E15036K1041J08371C11026M27374k64695K36027j14696j6344B75440N74224
14752H49664p6646K70642m48102J60401C41970L51238L49821m37193j06648J3486
14742E12674q294o2492O5241j65526M01894j48593j75158K75645o7919B89110
14731E28776K8235K26598j07121L28529m35251m3257J78398L00490l12581K97113
14721I89929k8590n8162l07858K34964O0737N5853k66987j241N3145M05115k42822
14710H94083K8289K93437l77748j6359l978J09407J69637D91024J73314J86003
14700H50341L38972n85832K30475M37433k29151j02254l2262j97820K92133k10366
14690G91669O2304j37130J03813K2818J74497K5490l32804K9137J43670k49162
$$ plain form
14680 634302 923003 790207 1071971 614963 791722 935876 1036847 1072909 952829 688367
14670 688367 792537 896886 852626 755219 1016167 1271707 895654 1016849 1172353 1078942
14660 1078942 1101817 969315 965261 993084 1254303 936124 1110514 943318 1023549 1214585
14650 1214585 1334164 1107867 1041144 1203956 769215 1255860 1228581 1128528 1035055 990031
14640 990031 1378829 1163538 1256778 932380 1378109 1185439 1299093 1183529 1111413 986747
14630 986747 1005925 1265093 1209622 1187100 1142057 1300671 1493024 1276607 1465803 1530601
14620 1530601 1162863 1226239 1282113 1231048 1633443 1460891 1565226 1453382 1432569 1698020
14610 1698020 1157780 1539468 1049026 1184540 1213739 1525763 1506533 1574757 1328964 1852268
$$ packed form
14680F34302K88701j32796K81764m57008J76759J44154J00971L6062j20080k64462
14670F88367J04170J04349m4260r7407K60948K55540l76053J21195J55504r3411
14660A078942K2875j32502m054K7823K61219l18179J74390j67196Q0231J91036
14650A214585J19579k26297o6723J62812m34741M86645k7279j00053r3473m5024
14640I90031L88798k15291R3240l24398M45729j92670J13654j15564p2116j24666
14630I86747J9178K59168n5471k2522m5043J58614J92353k16417J89196O4798
14620A530601l67738O3376N5874n1065M02395j72552J04335j11844k0813K65451
14610A698020n40240L81688m90442J35514K9199L12024j9230O8224k45793N23304
$$ plain form
14600 1852268 1341468 1438599 1404105 1426630 1432984 1774770 1584816 1606743 1414141 1635374
14590 1635374 1499312 1538933 1367039 1560679 1901163 1700696 1548018 1559622 1987998 1729210
14580 1729210 1634323 1788257 1656817 1721205 1784671 1668179 1954618 1886109 2196589 1823585
14570 1823585 1608992 1875099 2000995 2182514 2187063 1762053 1947873 2041327 2016541 2159334
14560 2159334 2197922 2039143 2295340 2051016 2280295 1799049 2038239 2427663 2531788 2281944
14550 2281944 2384327 2631250 2687093 2801006 2735882 2895623 3223157 3150072 3624254 3819626
14540 3819626 3916488 4358857 4866982 5326065 6343256 8069742 11441289 15092091 21245923
14531 21245923 32451121 35274620 17694231 10948854 6218229 4509832 3631683 2915231
$$ packed form
14600A852268n10800R7131l4494K2525O354L41786j89954K1927j92602K21233
14590A635374j36062L9621j71894J93640L40484k00467j52678J1604M28376k58788
14580A729210r4887J53934j31440O4388O3466j16492K86439o8509L10480l73004
14570A823585k14593K66107J25896J81519M549m25010J85820R3454k4786J42793
14560B159334L8588j58779K56197k44324K29279m81246K39190L89424J04125k49844
14550B281944J02383K46923N5843J13913o5124J59741L27534p3085M74182J95372
14540C819626R6862M42369N08125M59083J017191J726486L371547L650802O153832
14531B1245923J1205198K823499j7580389o745377m730625j708397q78149p16452
$$ plain form
14523 2915231 3078281 2873724 2490330 2592466 2533653 2412937 2331081 2597884 2622896 2203502
14513 2203502 2360197 2357679 2395744 2464458 2674413 2835079 2335230 2685543 2495831 2811049
14503 2811049 2574348 2733865 2417093 2609494 2525630 2875267 2783605 2901850 3077939 2755650
14493 2755650 2819500 3012594 3202439 3152982 3185843 3253506 3057914 3515965 2805275 3116317
14483 3116317 3396176 3442957 3561495 3447603 3402834 3653776 3558933 3351709 3659684 3737623
14473 3737623 3673775 3690360 3855626 3692425 3703267 3805427 4090814 4061626 3823576 3637751
14463 3637751 3931798 4281970 4215445 4126928 4528418 4173086 3712789 4372688 4610314 4363865
14453 4363865 4543193 4472210 4967714 4603152 4934003 5022685 4958951 4864871 5271602 5524701
$$ packed form
14523B915231J63050k04557l83394J02136n8813j20716q1856K66803K5012m19394
14513B203502J56695k518L8065O8714K09955J60666m99849L50313j89712L15218
14503B811049k36701J59517l16772J92401q3864L49637r1662J18245J76089l22289
14493B755650O3850J93094J89845m9457L2861O7663j95592M58051p10690L11042
14483C116317K79859M6781J18538j13892m4769K50942r4843k07224L07975P7939
14473C737623o3848J6585J65266j63201J0842J02160K85387k9188k38050j85825
14463C637751K94047L50172o6525q8517M01490l55332m60297O59899K37626k46449
14453D363865J79328p0983M95504l64562L30851Q8682o3734r4080M06731K53099
$$ plain form
14443 5524701 5073403 4998746 4896045 5330631 5172596 5182894 5562228 5665922 5755721 5754708
14433 5754708 5304945 5456191 5724926 6172608 5536390 5922583 6109893 5985903 6522223
14424 6522223 6223115 6378528 6513534 6709744 6903163 6991968 6576396 6920577 7083044 7397643
14414 7397643 7001737 7255269 7491862 7544061 7492619 7675183 7889776 7797219 8459262 8389556
14404 8389556 8394646 8542724 8748101 8662449 8792675 9305565 9176987 9149224 9878790 9341318
14394 9341318 9557109 9434967 10144292 9874987 10202037 10486930 10412688 10735795 10563870 11033457
14384 11033457 11432324 11521558 11631914 11637027 11787640 12101182 12501275 12764638 12831886 12939240
14374 12939240 13509995 13781018 13742225 14050262 14028346 14410819 14750054 15183889 15040853 15244307
$$ packed form
14443E524701m51298p4657j02701M34586j58035J0298L79334J03694Q9799j013
14433E754708m49763J51246K68735M47682o36218L86193J87310j23990N36320
14424F522223k99108J55413J35006J96210J93419Q8805m15572L44181J62467L14599
14414G397643l95906K53532K36593N2199n1442J82564K14593r2557O62043o9706
14404H389556N090J48078K05377q5652J30226N12890j28578k7763P29566n37472
14394I341318K15791j22142P09325k69305L27050K84893p4242L23107j71925M69587
14384A1033457L98867Q9234J10356N113J50613L13542M00093K63363O7248J07354
14374A2939240N70755K71023l8793L08037k1916L82473L39235M33835j43036K03454
$$ plain form
14364 15244307 15578655 16031254 16268701 16763049 17251600 17722411 17693058 18160242 18348215
14355 18348215 18885936 19336007 19475929 20203343 20337977 20864282 21332858 21538248 22113503
14346 22113503 22492733 23259508 23660980 23967686 24794016 25242055 25994772 26962406 27340699
14337 27340699 28110999 28673093 29450508 30266358 30991857 31382124 32330883 32985705 33964018
14328 33964018 34935422 35814934 37103243 38081887 39113097 39893611 41321935 42277932 43653984
14319 43653984 45069581 46153709 47813679 49294130 50932488 52444232 54281104 55842106
14311 55842106 57839238 59521946 61725704 63836173 65975416 68392991 70849558 73495529
14303 73495529 76115482 79313767 82550063 85852591 88758401 92373988 96556007 100143645
$$ packed form
14364A5244307L34348M52599K37447M94348M88551M70811k9353M67184J87973
14355A8348215N37721M50071J39922P27414J34634N26305M68576K05390N75255
14346B2113503L79230P66775M01472L06706Q26330M48039P52717R67634L78293
14337B7340699P70300N62094P77415Q15850P25499L90267R48759O54822R78313
14328C3964018R71404Q79512J288309R78644J031210P80514J428324R55997J376052
14319D3653984J415597J084128J659970J480451J638358J511744J836872J561002
14311E5842106J997132J682708K203758K110469K139243K417575K456567K645971
14303G3495529K619953L198285L236296L302528K905810L615587M182019L587638
$$ plain form
14295 100143645 104718881 109188731 113600118 118809493 124015385 129491073 135632996 141794555
14287 141794555 148114159 155502274 162954313 170826247 178853507 187935747 197019149 206896193
14279 206896193 217728693 228665740 240544899 252943525 265617880 278948040 293013608
14272 293013608 307850857 322546072 337776192 353115665 367985235 382173160 394238304
14265 394238304 405251974 416261136 426785876 436439780 445224062 452404698 456018755
14258 456018755 456568256 456829044 458506829 461208675 461096029 452986077 444800491 436471624
14250 436471624 425441563 413489371 399939326 385851563 371861749 357670799 343318127
14243 343318127 329696608 315768390 302127796 288991486 276709967 263884684 251981036
$$ packed form
14295A00143645M575236M469850M411387N209375N205892N475688O141923O161559
14287A41794555O319604P388115P452039P871934Q027260R082240R083402R877044
14279B06896193J0832500J0937047J1879159J2398626J2674355J3330160J4065568
14272B93013608J4837249J4695215J5230120J5339473J4869570J4187925J2065144
14265C94238304J1013670J1009162J0524740R653904Q784282P180636L614057
14258D56018755N49501K60788J677785K701846j12646q109952q185586q328867
14250D36471624j1030061j1952192j3550045j4087763j3989814j4190950j4352672
14243C43318127j3621519j3928218j3640594j3136310j2281519j2825283j1903648
$$ plain form
14236 251981036 240197830 229106643 218451621 208130343 198305518 188328781 178952193
14229 178952193 170324041 161872256 154103942 146739944 139931207 133378716 127814412 121948015
14221 121948015 116509114 111739829 106363145 102156330 98107667 94817173 90603226 87189996
14213 87189996 83452084 80624509 77242264 74777140 71912906 69497427 66973827 64880811
14205 64880811 62839009 60679883 58412060 56461430 54581701 52956159 51170403 50011355
14197 50011355 48891161 47078429 45754936 44339644 43012084 42257724 40806765 39792126
14189 39792126 38542650 37461190 36534275 35624747 35041453 33472403 32969733 31936799 31290346
14180 31290346 30229793 29635998 29222438 28498972 27604795 26947408 26195816 25695222 25167493
$$ packed form
14236B51981036j1783206j1091187j0655022j0321278r824825r976737r376588
14229A78952193q628152q451785p768314p363998o808737o552491n564304n866397
14221A21948015n438901m769285n376684m206815m048663l290494m213947l413230
14213H7189996l737912k827575l382245k465124k864234k415479k523600k093016
14205F4880811k041802k159126k267823j950630j879729j625542j785756j159048
14197E0011355j120194j812732j323493j415292j327560p54360j450959j014639
14189C9792126j249476j081460r26915r09528n83294j569050n02670j032934o46453
14180C1290346j060553n93795m13560p23466q94177o57387p51592n00594n27729
$$ plain form
14171 25167493 24428618 24202332 23571432 22723598 22667459 21842446 21326299 21088839 20545566
14162 20545566 20053305 19661652 19347754 19364945 18561904 18150739 17887218 17967085 17502548 16778094
14152 16778094 16547880 16416820 16120640 15622967 15416628 15178231 14975243 14699110 14458599
14143 14458599 14235057 14096714 13547974 13512158 13029884 13047940 12775992 12785407 12502428 12307977
14133 12307977 12089436 11953159 11776677 11147188 11321061 10951781 11192843 10377437 10493004
14124 10493004 10703258 10112885 9837995 9857477 9892797 9933282 9689417 9307226 9504705 9410243
14114 9410243 8954668 8714801 8746786 8437221 8756251 8467074 8457019 8165899 7977294 7981277
14104 7981277 7944489 7721384 7558425 7771554 7457002 7323002 7434344 7455002 7242225 7019551
$$ packed form
14171B5167493p38875k26286o30900q47834n6139q25013n16147k37460n43273
14162B0545566m92261l91653l13898J7191q03041m11165k63521P9867m64537p24454
14152A6778094k30214j31060k96180m97673k06339k38397k02988k76133k40511
14143A4458599k23542j38343n48740l5816m82274J8056k71948R415k82979j94451
14133A2307977k18541j36277j76482o29489J73873l69280K41062q15406J15567
14124A0493004K10254n90373k74890J9482L5320M0485k43865l82191J97479r4462
14114I410243m55575k39867L1985l09565L19030k89177j0055k91120j88605L983
14104G981277l6788k23105j62959K13129l14552j34000J11342K0658k12777k22674
$$ plain form
14094 7019551 6945882 6996978 7022563 6815576 6728676 6383563 6661658 6439956 6406878 6400783 5978641
14083 5978641 6291276 6179816 5937051 5938753 5781080 5878433 5684649 5628357 5645323 5717794
14073 5717794 5665848 5429019 5411303 5564737 5233981 5363135 4706773 5030018 4826261 4964872
14063 4964872 4901271 5009038 5056889 4831130 4725339 4437302 4668279 4409162 4438891 4512930
14053 4512930 4603587 4682362 4425385 4305877 4103749 4044551 4035613 4055581 4189764 4221028 4385075
14042 4385075 4326211 4209996 4295924 4076530 3862134 3799222 3696842 4064580 3560156 3747831
14032 3747831 3542773 3738553 3437186 3504742 3570645 3856262 3442005 3090067 3270743 3301003
14022 3301003 3030284 3134282 3057824 2904505 2832842 3504883 3337768 3105240 2922518 3081773
$$ packed form
14094G019551p3669N1096K5585k06987q6900l45113K78095k21702l3078o095m22142
14083E978641L12635j11460k42765J702j57673R7353j93784n6292J6966P2471
14073E717794n1946k36829j7716J53434l30756J29154o56362L23245k03757J38611
14063D964872o3601J07767M7851k25759j05791k88037K30977k59117K9729P4039
14053D512930R0657P8775k56977j19508k02128n9198q938J9968J34183L1264J64047
14042D385075n8864j16215Q5928k19394k14396o2912j02380L67738n04424J87675
14032C747831k05058J95780l01367O7556O5903K85617m14257l51938J80676L0260
14022C301003k70719J03998p6458j53319p1663O72041j67115k32528j82722J59255
$$ plain form
14012 3081773 2881306 2630781 3104837 2780198 2916467 2828120 2627719 2728534 2939935 2945989
14002 2945989 2508729 2743203 2491416 2779780 2763943 2623740 2705705 2506593 2617646 2580512
13992 2580512 2458386 2441287 2189298 2499742 2358417 2144623 2057467 1954130 2285311 2438457
13982 2438457 2530246 2963163 2685215 2527105 3138572 3164580 3832775 4677975 7464265 10658423
13972 10658423 15744905 27340184 36690168 20859240 13139103 8815128 6873595 5344630
13964 5344630 4841350 3961114 3902908 3466207 3272010 3199492 3383691 3056087 3105117 2698977
13954 2698977 2418264 2785551 2591821 2549952 2626485 2256316 2503994 2520086 2416597 2086967
13944 2086967 2379870 2260922 2035209 2240112 2216320 2009347 1775315 2429073 2214196 2138178
$$ packed form
14012C081773k00467k50525M74056l24639J36269q8347k00401J00815K11401O054
14002B945989m37260K34474k51787K88364j5837j40203Q1965j99112J11053l7134
13992B580512j22126j7099k51989L10444j41325k13794q7156j03337L31181J53146
13982B438457R1789M32917k77948j58110O11467K6008O68195Q45200K786290L194158
13972A0658423N086482J1595279R349984j5830928p720137m323975j941533j528965
13964E344630n03280q80236n8206m36701j94197p2518J84199l27604M9030m06140
13954B698977k80713L67287j93730m1869P6533l70169K47678J6092j03489l29630
13944B086967K92903j18948k25713K04903k3792k06973k34032O53758k14877p6018
$$ plain form
13934 2138178 2013373 1778332 1906074 1889433 1833904 2008689 1792812 2058444 1550067 1697022
13924 1697022 1975214 1666457 1770263 2299296 1756667 1825100 2000414 1749619 1637231 1638987
13914 1638987 1881769 1691510 1795317 1764138 1833255 1499838 1682552 1665774 1614316 1398482
13904 1398482 1552897 1444493 1150901 1694642 1431952 1715262 1283252 1630901 1660645 1440812
13894 1440812 1566224 1774505 1413029 1411856 1199886 1494921 1212318 1452094 1308090 1238604
13884 1238604 1149537 1407129 1624281 1346029 1523184 1391024 1394677 1489770 1111292 1515046
13874 1515046 1265486 1240049 1144958 1412033 1232509 1276539 1506971 1202918 1306797 1175446
13864 1175446 1358697 1228231 1313246 1426799 958128 1402076 1551031 1267671 987777 1243546
$$ packed form
13934B138178j24805k35041J27742j6641n5529J74785k15877K65632n08377J46955
13924A697022K78192l08757J03806N29033n42629O8433J75314k50795j12388J756
13914A638987K42782j90259J03807l1179O9117l33417J82714j6778n1458k15834
13904A398482J54415j08404k93592N43741k62690K83310m32010L47649K9744k19833
13894A440812J25412K08281l61476j173k11970K95035k82603K39776j44004o9486
13884A238604q9067K57592K17152k78252J77155j32160L653R5093l78478M03754
13874A515046k49560k5437r5091K67075j79524M4030K30432l04053J03879j31351
13864A175446J83251j30466Q5015J13553m68671M43948J48955k83360k79894K55769
$$ plain form
13854 1243546 1228654 1264520 1010221 835171 1136888 1635766 1584958 1074353 1366881 993834
13844 993834 1057856 994078 1354730 1299625 1105636 770448 1114907 971982 1057303 1125880
13834 1125880 976419 803055 1112905 1000136 1016190 1039691 1006670 879362 1156507 1031312
13824 1031312 740345 1197705 942499 967381 822425 1201555 1248942 1068952 922509 1019781
13814 1019781 1026449 1035524 1001325 1029987 1040953 803048 1091789 953256 844728 919727 911671
13803 911671 1068771 534311 947989 634886 956057 1039247 898450 723795 706756 804922
13793 804922 789214 952415 1051061 993184 741766 790576 746522 924830 778681 865935 701547
13782 701547 685940 886408 776927 934648 851291 523061 809795 848013 736473 974488
$$ packed form
13854A243546j4892L5866k54299j75050L01717M98878n0808n10605K92528l73047
13844I93834O4022o3778L60652n5105j93989l35188L44459j42925Q5321O8577
13834A125880j49461j73364L09850j12769J6054K3501l3021j27308K77145j25195
13824A031312k90967M57360k55206K4882j44956L79130M7387j79990j46443R7272
13814A019781O668R075l4199K8662J0966k37905K88741j38533j08528P4999q056
13803I11671J57100E34311M13678l13103L21171Q3190j40797j74655j7039R8166
13793H04922j5708J63201R8646n7877k51418M8810m4054J78308j46149Q7254j64388
13782G01547j5607K00468j09481J57721q3357l28230K86734L8218j11540K38015
$$ plain form
13772 974488 934005 603896 1048138 898371 875344 729822 462527 480473 707207 797811
13762 797811 670535 889014 837970 845329 794608 473464 713771 665927 605023 764261 773374
13751 773374 875410 696238 659736 582658 921507 800552 558772 641448 734727 1253214
13741 1253214 609016 364041 418632 309217 805367 710436 806196 508341 604440 680763
13731 680763 667869 747107 533870 678372 626461 876355 851795 671198 705228 808300
13721 808300 503277 553689 218226 678765 472603 764481 750802 481921 589931 506557
13711 506557 697583 658781 536988 620729 680895 634332 580431 394458 731572 634870 408415
13700 408415 663667 488484 596990 920900 645974 437754 514856 578981 712893 396044
$$ packed form
13772I74488m0483l30109M44242j49767k3027j45522k67295J7946K26734R0604
13762G97811j27276K18479n1044P359n0721l21144K40307m7844o0904J59238R113
13751G73374J02036j79172l6502p7078L38849j20955k41780Q2676R3279N18487
13741A253214F09016k44975N4591j09415M96150r4931R5760k97855R6099P6323
13731F80763j2894P9238k13237J44502n1911K49894k4560j80597L4030J03072
13721H08300l05023N0412B18226M60539k06162K91878j3679k68881J08010q3374
13711E06557J91026l8802j21793Q3741O0166m6563n3901j85973L37114r6702k26455
13700D08415K55252j75183J08506L23910k74926k08220P7102O4125J33912l16849
$$ plain form
13690 396044 721341 928694 484620 407478 736840 489420 471919 325634 544496 506228
13680 506228 452481 782055 728471 587458 847480 742189 365661 267156 433728 421748
13670 421748 520475 401239 675763 772487 283825 536331 509609 389010 501207 629670
13660 629670 403041 362370 478920 278264 348393 600123 426806 539501 307226 438657
13650 438657 436794 541183 728145 345950 560818 465105 852434 397643 554090 642679
13640 642679 748468 534197 684446 568946 294132 447162 657562 331503 435267 498514
13630 498514 357861 304534 408735 509769 751185 633936 495489 637808 477815 507143
13620 507143 180912 388484 456657 348495 519873 300193 628840 581257 389410 104319
$$ packed form
13690C96044L25297K07353m44074p7142L29362k47420j7501j46285K18862l8268
13680E06228n3747L29574n3584j41013K60022j05291C65661r8505J66572j1980
13670D21748R8727j19236K74524R6724B83825K52506k6722j20599J12197J28463
13660F29670k26629m0671J16550k00656P0129K51730j73317J12695k32275J31431
13650D38657j863J04389J86962C45950K14868r5713L87329C97643J56447Q8589
13640F42679J05789k14271J50249j15500k74814J53030K10400l26059J03764O3247
13630D98514j40653n3327J04201J01034K41416j17249j38447J42319j59993K9328
13620E07143A80912K07572O8173j08162J71378k19680L28647m7583j91847A04319
$$ plain form
13609 743095 295080 437274 365936 489213 389199 378894 159048 520926 246775 465871
13599 465871 540481 355081 563650 108384 490136 263222 482898 513942 248523 511240
13589 511240 498995 287281 286721 393811 136636 500608 85070 273007 421960 583936
13579 583936 400672 235678 444765 336820 314611 475360 433421 448203 460720 322292
13569 322292 485979 710104 336755 385514 350970 188773 485294 350584 385592 393292
13559 393292 64305 123284 266450 378487 621385 311663 287047 161645 428184 445455
13549 445455 489697 178093 79714 283844 -103424 421872 514964 477330 134385 501741
13539 501741 317774 440921 467041 193206 315135 304586 252050 94948 302765 130983
$$ packed form
13609G43095B95080J42194p1338J23277j00014j0305A59048L61878B46775K19096
13599D65871P4610j85400K08569A08384L81752k26914K19676L1044B48523K62717
13589E11240j2245k11714n60J07090A36636L63972H5070J87937J48953J61976
13579E83936j83264j64994K09087j07945k2209J60749m1939J4782J2517j38428
13569C22292J63687K24125C36755M8759l4544j62197K96521j34710L5008P700
13559C93292F4305N8979J43166J12037K42898l09722k4616j25402K66539J7271
13549D45455M4242A78093G9714K04130a03424D21872R3092l7634A34385L67356
13539E01741j83967J23147K6120A93206J21929j0549n2536I4948K07817A30983
$$ plain form
13528 481020 339517 582704 338238 1481 283057 483738 324602 564846 248234 236008
13518 236008 -271 34079 136656 259586 462304 136742 272949 271877 424048 295612 484429
13507 484429 319601 300410 300741 313671 444120 83193 376748 5881 330018 295863 21400
13495 248552 207809 174592 185489 226478 231402 204179 222613 171959 550397 155972 180752
13484 180752 239880 561901 380512 225379 34751 207636 444854 14473 -63774 162637
13473 246297 308742 112830 -72986 152859 208104 345969 435423 195319 412680 497823
13463 497823 291431 433562 41473 495424 314582 302900 257354 227490 173210 234309 141990
13452 141990 305977 -16520 136558 125299 290284 -109061 114752 353386 282746 239289
$$ packed form
13528D81020j41503K43187k44466A481K81576K00681j59136K40244B48234j2226
13518B36008b71C4079J02577J22930K02718A36742J36207j072J52171j28436J88817
13507D84429j64828j9191L31J2930J30449H3193K93555E881L24137l4155B1400
13495B48552m0743l3217J0897M0989M924k7223J8434n0654L78438A55972K4780
13484A80752N9128L22021j81389j55133C4751J72885K37218A4473f3774A62637
13473B46297O2445A12830g2986A52859N5245J37865Q9454A95319K17361Q5143
13463D97823k06392J42131D1473M53951j80842j1682m5546k9864n4280O1099r2319
13452A41990J63987a6520A36558j1259J64985a09061A14752K38634p0640m3457
$$ plain form
13442 239289 497653 407739 170395 403792 414650 265263 46761 161580 670816 897 155410
13431 155410 504308 256276 456786 351384 163829 327097 217968 200163 -55713 253377
13420 -120097 170999 -148876 259150 108870 212824 344514 573210 275912 335327 -249492
13409 304157 178343 94705 596234 241492 -45965 397759 131949 205968 207123 240242 338558
13398 338558 154442 -165492 279873 194455 59095 481247 207265 500238 104787 25674
13387 311565 459681 792952 139826 412127 218305 199857 470860 347758 219135 168036
13377 168036 171842 259500 230863 475205 -101138 161312 308130 154815 450567 274888
13367 274888 270768 311060 279738 281845 101825 183812 -134351 -129810 165923 301102 420761
$$ packed form
13442B39289K58364q9914A70395K33397J0858j49387D6761J14819N09236H97J54513
13431A55410L48898k48032K00510j05402A63829J63268j09129j7805e5713B53377
13420a20097A70999a48876B59150A08870J03954J31690K28696B75912N9415b49492
13409C04157j25814q3638N01529B41492d5965C97759A31949P4019J155L3119R8316
13398C38558A54442a65492B79873q5418E9095M22152B07265K92973A04787B5674
13387C11565J48116L33271A39826K72301j93822j8448K71003j23102j28623n1099
13377A68036L806Q7658k8637K44342a01138A61312J46818j53315K95752j75679
13367B74888m120M0292l1322K107A01825Q1987a34351M541A65923J35179J19659
$$ plain form
13356 420761 50732 274227 409235 255914 134656 178444 38189 -42670 51516 170224
13346 170224 480310 32765 296331 -135282 217081 68910 363057 498621 23117 280741
13336 280741 190823 587389 358981 99725 115192 404117 -17268 403747 93335 434659
13326 434659 282700 325325 429980 102761 579230 134800 703726 275709 476902 185406
13315 222245 475332 165400 54242 187413 228164 446723 -194199 60819 221156 453102
13305 453102 116269 337919 -29198 296094 248086 158926 68000 60027 411752 17770 510917
13294 510917 53687 193090 -17397 -49007 -19596 180726 164802 81098 246739 2662 377429
13283 377429 331759 68693 207765 11719 59511 92936 -57520 428978 -26384 35177 417384
$$ packed form
13356D20761E0732K23495J35008j53321j21258M3788C8189d2670E1516J18708
13346A70224L10086C2765K63566a35282B17081F8910K94147J35564B3117K57624
13336B80741q9918L96566k28408I9725J5467K88925a7268D03747I3335L41324
13326D34659j51959M2625J04655A02761M76469A34800N68926B75709K01193A85406
13315B22245K53087A65400E4242J33171M0751K18559a94199F0819J60337K31946
13305D53102A16269K21650b9198B96094m8008q9160F8000p973L51725A7770M93147
13294E10917E3687J39403a7397l1610a9596A80726j5924H1098J65641B662L74767
13283C77429m5670F8693J39072A1719M7792L3425e7520D28978b6384C5177L82207
$$ plain form
13272 417384 166167 220681 263569 234715 -4036 -39521 -138434 138831 181128 145751 466322
13261 466322 70104 187482 -117549 169237 275303 259073 -102196 30880 80276 -138393
13250 82091 -78981 145931 -15354 224974 4605 -26123 198131 415315 385573 131751 3749
13238 369414 184916 93344 320031 155248 -113589 185388 207944 150103 -46600 342540
13227 112373 264841 164480 246281 88225 174376 264345 169282 62164 232589 -80892 211986
13215 136217 289713 56598 90317 157392 -138525 -183755 222474 -57677 195966 569443
13205 569443 168183 206839 251608 107734 87711 -78385 473442 72070 413661 273733
13195 273733 239555 47810 110280 224442 237479 375015 354588 330463 214953 151449 470753
$$ packed form
13272D17384A66167N4514M2888k8854d036l5485r8913A38831M2297l5377L20571
13261D66322G0104J17378a17549A69237J06066j6230a02196C0880M9396a38393
13250H2091g8981A45931a5354B24974D605b6123A98131K17184k9742A31751C749
13238C69414j84498r1572K26687A55248a13589A85388K2556n7841d6600C42540
13227A12373J52468j00361Q1801H8225Q6151Q9969r5063F2164J70425h0892B11986
13215A36217J53496E6598L3719O7075a38525m5230B22474e7677A95966L73477
13205E69443A68183L8656M4769A07734k0023g8385D73442G2070L41591j39928
13195B73733l4178D7810O2470J14162J3037J37536k0427k4125j15510o3504L19304
$$ plain form
13184 470753 -119015 38878 -163237 -170572 299351 269056 157866 -36137 357895 159283
13173 243486 -28235 -113298 -182712 310989 139819 10826 208279 -166755 -77742 -37943 76103
13161 -130152 -6339 13079 20226 273609 298059 -78472 -50277 -174707 138091 122802 -290451
13149 316647 309065 148452 -8051 -142725 202482 196022 244306 305009 -78317 135636 146660
13138 146660 177484 132358 327320 -74202 39907 121540 237216 118750 174957 -45098 48930
13126 121284 317902 126088 378904 -67579 232295 47901 -82192 58014 -26152 259786
13115 -300137 -165936 -6347 52252 254474 -74424 45687 77275 289582 170943 74545 -65659
13103 150512 94719 229608 91112 -99973 263056 15963 216384 142795 44404 54692 -59241
$$ packed form
13184D70753a19015C8878a63237p335B99351l0295j11190c6137C57895A59283
13173B43486b8235q5063o9414C10989A39819A0826J97453a66755g7742c7943G6103
13161a30152f339A3079P147K53383K4450g8472K8195j24430A38091j5289b90451
13149C16647p582A48452h051j34674B02482o460M8284O0703g8317A35636J1024
13138A46660L0824m5126J94962g4202C9907Q1633J15676j18466N6207d5098D8930
13126A21284J96618A26088K52816f7579B32295D7901h2192E8014b6152B59786
13115c00137J34201f347E2252K02222g4424D5687L1588K12307j18639G4545f5659
13103A50512n5793J34889I1112i9973B63056A5963K00421p3589D4404J0288e9241
$$ plain form
13091 108581 92951 106189 -34993 -106534 93206 -125289 234217 185698 -60402 -19220 164076
13079 -24564 263027 404024 167283 49467 -44523 139674 131064 131230 382717 66519 -188581
13067 -193244 69319 106353 278124 48223 32058 123674 221660 308719 87634 120411 -177128
13055 100779 232049 177420 -5448 -192204 158950 120378 180759 77773 338373 146104 26380
13043 270873 -13628 299335 23340 -124125 -182586 481205 230964 334952 176300 96165
13033 96165 238179 223385 150471 19766 -48536 -237550 -77040 774400 -64245 260005 -150710
13021 123930 -134078 230867 355873 95059 -35944 79157 321843 -149899 71728 138082
13011 138082 100830 -83445 101592 302618 128852 464223 293146 -96491 236519 105077
$$ packed form
13091A08581j5630J3238c4993p1541I3206a25289B34217m8519f0402a9220A64076
13079b4564B63027J40997A67283D9467d4523A39674q610J66K51487F6519a88581
13067a93244F9319L7034J71771D8223j6165R1616R7986Q7059H7634L2777a77128
13055A00779J31270n4629e448j86756A58950l8572O0381G7773K60600A46104B6380
13043B70873a3628B99335B3340a24125n8461D81205B30964J03988j58652q0135
13033I6165J42014j4794p2914A9766d8536j89014g7040G74400f4245B60005a50710
13021A23930a34078B30867J25006I5059c5944G9157K42686a49899G1728O6354
13011A38082l7252h3445A01592K01026A28852L35371j71077i6491B36519A05077
$$ plain form
13000 88346 265802 117492 300076 -51100 258334 19507 29687 -190836 185630 -80064
12989 -142462 276970 -192405 189033 87247 383193 118395 186884 200550 117634 -179783
12978 180820 59255 242175 273593 71636 -104956 40237 66509 179593 238220 265597 -136717
12966 -27498 81748 151178 228334 77853 441644 -25612 -297214 182960 -225212 -4184 408143
12954 -296577 -17967 243770 -24305 110378 -97184 109577 125858 72986 186859 231232 -250051
12942 249620 -127047 261562 282689 312037 166744 120371 -154999 38871 -51434 75608 62140
12931 62140 53952 -95461 319147 -117113 190056 197271 141004 261741 172967 -236570 -103044
12919 42401 -72219 57650 -210975 323109 366060 76368 -77777 -304531 152671 -159596 102164
$$ packed form
13000H8346J77456A17492J82584e1100B58334A9507J0180a90836A85630h0064
12989a42462B76970a92405A89033H7247K95946A18395O8489J3666q2916a79783
12978A80820E9255J82920L1418G1636a04956D0237K6272J13084N8627K7377a36717
12966b7498H1748O9430P7156G7853L63791b5612k71602A82960b25212d184D08143
12954b96577a7967B43770b4305A10378i7184A09577J6281n2872J13873M4373b50051
12942B49620a27047B61562K1127K9348j45293m6373a54999C8871e1434G5608j3468
12931F2140q188i5461C19147a17113A90056P215n6267J20737q8774b36570a03044
12919D2401g2219E7650b10975C23109M2951G6368g7777k26754A52671a59596A02164
$$ plain form
12907 105417 64396 -300698 -240289 -28635 85462 37226 -42169 157531 102320 288789 -50599
12895 -340519 -378626 76345 -327764 34862 -218521 -118223 -204287 60548 -183507 -212697 -6403
12883 -128270 -72650 180443 101445 596987 -241849 167385 154114 221801 -2248 160400 62197
12871 -265010 -135293 103167 286334 -1433 172419 123503 445066 -41411 -69433 156370
12860 91038 184988 111694 -190559 150066 27761 -75696 -12496 274896 109081 159237 302832
12849 302832 145991 -48731 9442 -451161 60706 210433 130832 -61746 -557 7447 -6519 171301
12836 178166 51088 -165961 87919 -27738 286289 -276863 163404 -28280 88115 122395 180037
12825 180037 79391 79513 -11054 -140739 249115 66407 137855 -37601 288683 276536 -277633
$$ packed form
12907A05417m1021c00698O0409b8635H5462C7226d2169A57531n5211J86469e0599
12895c40519l8107G6345c27764C4862b18521J00298q6064F0548a83507k9190f403
12883a28270N5620A80443p8998M95542b41849A67385j3271O7687b248A60400F2197
12871b65010J29717A03167J83167a433A72419m8916L21563d1411k8022A56370
12860I1038R3950p3294a90559A50066B7761g5696a2496B74896A09081N0156J43595
12849C02832A45991d8731I442d51161F0706J49727p9601f1746e57G447f519A71301
12836A78166E1088a65961H7919b7738B86289b76863A63404b8280H8115L4280N7642
12825A80037G9391J22a1054j29685B49115F6407P1448c7601B88683j2147b77633
$$ plain form
12813 339914 60722 52535 -348721 144288 26546 -261955 100595 -180905 -9335 -146118 -22248
12801 96378 -321533 -29498 -41799 -43801 -256543 118259 51027 -124997 242163 -236259 49751
12789 356201 -7575 251569 52174 174644 94193 139346 -35449 14802 197674 -19256 31001
12777 9455 205392 -82371 -187804 -42529 -113608 5685 411684 14235 114338 248026 254611
12766 254611 -193536 -126398 -123492 -79723 11885 -4996 -174492 22496 123219 278303 352012
12755 352012 72030 122680 42523 107831 194792 -68096 940 -42292 -9411 23360 -18044 396294
12742 482931 -65061 184315 32394 -73193 316100 262175 -76201 -179383 -313025 85836 -45655
12730 180753 -125655 16391 108901 -53672 383725 53774 -22719 217227 42035 229615 171915
$$ packed form
12813C39914F0722q187c48721A44288B6546b61955A00595a80905i335j36783b2248
12801I6378c21533b9498j2301k002k12742A18259E1027a24997B42163b36259D9751
12789C56201g575B51569E2174J22470q0451M5153c5449A4802J82872a9256C1001
12777I455J95937h2371j05433d2529p1079E685M05999A4235J00103J33688O585
12766B54611a93536O7138K906M3769A1885d996j69496B2496J00723J55084P3709
12755C52012G2030N0650D2523O5308Q6961f8096I40d2292i411B3360a8044C96294
12742D82931f5061A84315C2394g3193C16100n3925g6201j03182j33642H5836d5655
12730A80753a25655A6391R2510e3672C83725E3774b2719B17227D2035J87580n7700
$$ plain form
12719 171915 165467 286597 -26114 178213 357676 118111 -232874 -103190 138280 100720
12709 100720 -16045 -223707 207375 -83140 -110233 2196 -277487 116955 43937 39038 -123347
12697 -144660 72441 -35793 -267545 115359 142068 195878 160728 92321 379289 211910 198905
12686 198905 49912 408888 162924 -272960 -207861 -158933 -136296 229365 -68459 258172
12675 143773 -190082 117684 126139 228925 -24761 428542 90652 161186 241661 161654 -24278
12663 1006 117157 191790 463592 72984 -151244 307681 219334 -6624 218623 202971 106643
12652 106643 103493 52381 -214610 -79596 -51738 158693 187711 -226130 -160755 476239 172883
12640 202982 65760 -176409 331455 237206 147833 -95045 -214821 63299 -47139 392638 -47935
$$ packed form
12719A71915o448J21130b6114A78213J79463A18111b32874a03190A38280l7560
12709A00720a6045k07662B07375h3140k7093B196b77487A16955D3937m899a23347
12697a44660G2441c5793k31752A15359K6709N3810l5150o8407K86968j67379j3005
12686A98905D9912L58976A62924b72960O5099M8928K2637B29365f8459B58172
12675A43773a90082A17684Q455J02786b4761D28542I0652P0534Q0475q0007b4278
12663A006J16151P4633K71802G2984a51244C07681q8347f624B18623j5652r6328
12652A06643l150n1112b14610g9596K7858A58693K9018b26130O5375D76239A72883
12640B02982F5760a76409C31455r4249q9373i5045j19776F3299d7139C92638d7935
$$ plain form
12628 -160750 279734 -330371 -119414 -20030 -60533 113397 81169 308407 139112 -301554
12617 279528 26761 52636 -69169 322594 -184825 -83727 533332 178246 182473 422514 -31009
12605 224971 -94143 77255 362788 -51258 187096 -194425 208531 -148625 58375 111333
12595 111333 -107230 212679 -282365 40884 508012 -219031 -170237 128207 203495 228483
12585 228483 6890 -6743 146016 -259868 330063 -187308 -23283 1699 352975 51711 -6241
12573 60978 180220 -64490 -159232 103268 -143340 -34549 -301853 -123700 -314741 210099
12562 -454001 251283 -296123 -5018 -144139 -92244 140522 -70463 163477 -117024 -6481 284805
12550 32397 278940 -33088 260746 -17364 150658 296619 20825 81136 -187282 -177926 61225
$$ packed form
12628a60750B79734c30371a19414b0030m0503A13397l2228K27238A39112c01554
12617B79528B6761K5875f9169C22594a84825h3727E33332A78246M227K40041c1009
12605B24971i4143G7255K85533e1258A87096a94425B08531a48625E8375N2958
12595A11333a07230B12679b82365D0884M67128b19031M8794A28207P5288K4988
12585B28483F890f743A46016b59868C30063a87308b3283A699L51276E1711f241
12573F0978J19242f4490r4742A03268a43340c4549k67304a23700j91041B10099
12562d54001B51283b96123e018j39121N1895A40522g0463A63477a17024f481B84805
12550C2397K46543c3088B60746a7364A50658J45961B0825O0311a87282R356F1225
$$ plain form
12538 -42265 178620 6461 -29894 397383 139278 209052 7570 2488 -70414 85656 152266 -196421
12525 -58554 -51769 -207647 196946 140503 -69450 237238 -14055 225422 41293 -264782 196510
12513 122902 -191598 -166073 121472 -121586 -411497 -88651 230742 50430 377334 47429
12502 6553 134990 102917 7399 44310 77605 -369422 17034 -5091 34952 124478 48598 -30155
12489 -127415 24747 174196 133632 -173465 55427 -117162 298322 230875 163064 29232 149467
12478 149467 326173 -19825 -43660 17089 -306346 81038 -210491 275813 85896 -283871
12467 381508 45616 -14615 252410 -87016 6102 104722 137080 -62199 208579 102917 181254
12456 181254 -25502 275487 151031 213844 225621 110198 -52201 -128201 96951 -76460 -145642
$$ packed form
12538d2265A78620F461b9894C97383A39278O9774G570B488g0414H5656O6610a96421
12525e8554O785j55878A96946n6443f9450B37238a4055B25422D1293b64782A96510
12513A22902a91598K5525A21472a21586k89911h8651B30742E0430L26904D7429
12502F553J28437l2073G399L6911L3295c69422A7034e091C4952Q9526D8598c0155
12489a27415B4747J49449m0564a73465E5427a17162B98322o7447o7811B9232J20235
12478A49467J76706a9825k3835A7089c06346H1038b10491B75813H5896b83871
12467C81508D5616a4615B52410h7016F102R8620L2358f2199B08579A02917P8337
12456A81254b5502B75487j24456O2813J1777A10198e2201p6000I6951g6460o9182
$$ plain form
12445 -145642 -197615 264076 -24640 -126446 -194408 -122690 100097 -167578 -114742 -36199 463076
12433 33455 76818 -410202 -225566 -295979 -165091 169508 -185509 147542 13066 -195616
12422 -114502 97969 -166691 -164867 -117601 -94115 -231753 -264866 1908 165101 135422 183754
12411 183754 -129028 -303651 -21364 37091 190665 3288 83494 -191037 197387 234644 290965
12400 290965 212976 -217541 305674 141177 62415 -37039 -52432 -202667 98774 -198099
12389 50421 145821 -137433 81394 -191646 -159491 81205 216400 99490 -66377 -146119 39737
12377 -25611 48797 106420 -73206 -140508 97499 -52125 -35332 118679 -212064 -1252 -343187
12366 -343187 50051 -40615 332415 29274 -37612 -225198 378870 302087 -165975 -129356 -38427
$$ packed form
12445a45642n1973B64076b4640j01806o7962P1718A00097a67578N2836c6199D63076
12433C3455M3363d10202J84636p0413J30888A69508a85509A47542A3066a95616
12422a14502I7969a66691J824M7266K3486j37638l3113A908J63193k9679M8332
12411A83754a29028j74623b1364C7091J53574C288Q0206a91037A97387L7257N6321
12400B90965p7989b17541C05674A41177F2415c7039j5393j50235I8774a98099
12389E0421R5400a37433H1394a91646L2155H1205J35195I9490f6377p9742C9737
12377b5611D8797N7623g3206o7302I7499e2125J6793A18679b12064a252l41935
12366c43187E0051d0615C32415B9274c7612j87586C78870p6783a65975L6619c8427
$$ plain form
12354 -196451 107049 -113274 51006 57724 -243558 -53027 114074 55029 160506 177092 110191
12343 110191 99011 144913 52593 241900 32638 -7858 -117520 50800 18811 -37513 -92159
12332 -92159 19668 216218 -67809 57738 -26940 6047 -39964 -240377 -291738 -174339 14331
12320 -233279 -147516 14519 219877 -56435 165915 -49153 -346256 -106342 -173358 200134
12309 -30603 125055 -359869 31481 208910 -44167 -50378 213404 254028 307327 -69675 343770
12297 -189343 -7396 351254 308459 -118520 22632 -83164 -226973 -41760 35297 -25184 -98163
12286 -98163 -28399 -274077 76357 -24515 -3943 350013 62274 199823 14961 68875 91327
12275 91327 -95991 174509 149748 63148 19653 408183 84650 78956 91750 -34382 72171
$$ packed form
12354a96451A07049a13274E1006O718b43558e3027A14074E5029J05477J6586o6901
12343A10191j1180M5902E2593J89307C2638g858j09662E0800A8811c7513n4646
12332i2159A9668J96550f7809E7738b6940F047c9964k00413n1361J17399A4331
12320b33279Q5763A4519K05358e6435A65915d9153k97103a06342o7016B00134
12309c0603A25055c59869C1481J77429d4167o211B13404M0624N3299f9675C43770
12297a89343g396C51254m2795a18520B2632h3164j43809d1760C5297b5184p2979
12286i8163b8399k45678G6357b4515c943C50013F2274J37549A4961N3914K2452
12275I1327i5991A74509k4761F3148A9653L88530H4650n694J2794c4382G2171
$$ plain form
12263 -127397 -52552 141882 352847 125410 106135 200697 264378 71093 96610 -61309 -155587
12252 -155587 508333 204834 -6910 168163 -151916 11451 -52743 28047 73502 -94880 107331
12240 267794 -128091 -23578 -107733 309000 -237152 33876 -215546 171274 251019 -6358 350769
12228 -118302 5077 122492 -205402 135479 28583 117086 -101541 -64751 66170 147000 15392
12216 -287065 14712 64879 176619 210268 242053 238152 14649 322761 286001 121160 193314
12205 193314 125799 272176 323204 199633 350422 131160 -33957 102607 294167 103133
12194 534430 108595 55961 -88097 207042 137668 265008 126852 462345 247609 360101
12184 360101 377870 168612 250621 123500 91915 115681 484496 271207 286727 12433 179802
$$ packed form
12263a27397e2552A41882K10965A25410j9275R4562O3681G1093K5517f1309r4278
12252a55587E08333B04834f910A68163a51916A1451e2743B8047M5455i4880A07331
12240B67794a28091b3578q4155C09000b37152C3876b15546A71274P9745f358C50769
12228a18302E077J17415b05402A35479B8583Q8503a01541L6790F6170Q0830A5392
12216b87065A4712N0167J11740L3649L1785l901A4649L08112l6760A21160P2154
12205A93314o7515J46377N1028j23571J50789A31160c3957A02607J91560A03133
12194E34430A08595n2634h8097B07042o9374J27340A26852L35493k14736J12492
12184C60101J7769A68612Q2009A23500l1585K3766L68815k13289J5520A2433J67369
$$ plain form
12173 179802 320259 -23276 118102 178747 319046 -121499 192184 151715 83707 204171
12163 204171 -207022 216276 11991 445682 46605 317140 103713 72979 -28982 93186
12152 94385 17652 19269 222689 103870 127183 -139745 311852 85212 -277691 61649 -29846
12140 -132414 -72138 175463 54288 243780 105542 -69226 442585 -393351 248181 412837
12130 412837 108360 -204869 109570 20940 -189228 67529 20348 -146603 12849 101761
12120 101761 269938 -290975 -126190 21763 -34207 -164448 -89528 63562 68466 -57467 317194
12108 -122415 -31299 842 34189 37613 153940 427492 208588 -143310 -103158 50435 -124910
12096 -153127 6968 -348111 206730 -112639 59519 -42051 210476 -85205 -43508 -74053 -92016
$$ packed form
12173A79802J40457b3276A18102O0645J40299a21499A92184m0469o8008J20464
12163B04171b07022B16276A1991M33691D6605K70535A03713l0734b8982I3186
12152I4385A7652J617K03420A03870K3313a39745C11852H5212b77691F1649b9846
12140a32414O0276A75463E4288J89492A05542f9226D42585c93351B48181J64656
12130D12837A08360b04869A09570B0940a89228F7529B0348a46603A2849Q8912
12120A01761J68177b90975a26190B1763c4207j30241P4920F3562M904e7467C17194
12108a22415c1299H42L3347L424J16327K73552B08588a43310M0152E0435a24910
12096a53127F968c48111B06730a12639E9519d2051B10476h5205M1697l0545j7963
$$ plain form
12085 -92016 -106462 -44039 112229 213970 178066 194914 117631 148246 188030 -169275 -49852
12073 -86276 242459 156876 195272 -131270 185825 97134 371452 435217 378858 700451 586237
12062 586237 1500726 1076517 392345 204641 97561 367775 203468 173729 44182 536587
12052 536587 -9033 86838 -55750 226762 252457 -144852 -120251 46283 90622 -70037 79433
12040 88885 -12683 321196 -315846 -205888 211109 -173704 187555 40020 125384 -263164
12029 56955 -201791 122734 14737 93490 86212 142307 246799 132432 119861 166641 98903
12018 98903 -83367 71943 49786 80363 147025 -65260 198466 -151839 -229310 -33725 309934
12006 103734 -50011 -36771 171827 227826 -85879 154866 -23475 289792 9182 -173033 -201485
$$ packed form
12085i2016j4446d4039A12229J01741l5904J6848p7283L0615L9784a69275d9852
12073h6276B42459q5583L8396a31270A85825q8691K74318O3765n6359L21593j14214
12062E86237R14489m24209C92345j87704I7561K70214j64307k9739D4182M92405
12052E36587i033H6838e5750B26762K5695a44852K4601D6283M4339g0037G9433
12040H8885a2683C21196c15846J09958B11109a73704A87555D0020Q5364b63164
12029E6955b01791A22734A4737P8753p278N6095J04492j14367j2571M6780o7738
12018I8903h3367G1943k2157L0577O6662f5260A98466a51839p7471c3725C09934
12006A03734e0011J3240A71827N5999h5879A54866b3475B89792I182a73033k8452
$$ plain form
11995 -201485 -140934 -37153 60641 323962 70502 -41071 86726 -150755 -8978 -110181 315924
11983 -36971 133892 -248648 -53145 -134072 -158307 -93587 -147747 63507 -174901 61929 -62873
11971 185333 -110749 5560 195248 -37053 -75097 -223892 -159629 115631 69497 30099 106910
11960 106910 209726 41505 102360 406427 8211 -293438 -77387 -150923 278108 150266 -86527
11948 102608 -144547 147915 25841 80267 -28869 -141214 51046 44418 -112284 -58434 -217242
11937 -217242 17818 -280975 151947 -172371 10431 -232278 -233902 452495 -4234 -196442 -98774
11926 -98774 -84122 27710 19447 -139626 43638 -241551 133129 -196893 -196586 -188454 51920 16745
11913 84999 210939 -79702 220224 -113350 95147 -94203 -238147 216013 156906 -208435
$$ packed form
11995b01485O0551c7153F0641K63321G0502d1071H6726a50755h978j01203C15924
11983c6971A33892b48648e3145q0927k4235O4720n4160F3507a74901F1929f2873
11971A85333a10749E560J89688c7053l8044j48795O4263A15631m6134C0099P6811
11960A06910J02816D1505O0855L04067H211b93438g7387p3536B78108j27842h6527
11948A02608a44547A47915B5841N4426b8869j12345E1046o628a12284N3850j58808
11937b17242A7818b80975A51947a72371A0431b32278j624D52495d234j92208R7668
11926i8774J4652B7710q263a39626D3638b41551A33129a96893L07Q132E1920A6745
11913H4999J25940g9702B20224a13350I5147i4203j43944B16013n9107b08435
$$ plain form
11902 -213411 -59540 -66042 159601 -159510 92571 -53038 180962 -140537 -32810 -205929 -395534
11891 -395534 36956 -170661 69948 138982 -76111 -91543 188754 56500 212844 -182699 -384410
11880 -384410 154386 76804 244100 69374 -68265 41019 104711 -9842 34027 -348604 97950
11868 -88207 -94947 -285165 -266326 88682 91562 -101428 -27958 15977 -323738 228163 -261844
11856 -96493 -70185 -267628 -38623 316368 161554 -146895 -84246 -169246 -35646 163949 -63447
11844 -314509 -47872 127360 22778 -13869 72301 -55128 -203641 -168709 171880 -96879 -181476
11833 -181476 129763 427764 -189036 -28609 -85008 3667 232999 -27879 33554 -69125 352669
11821 308665 152786 137480 -107161 -228964 217052 -8988 59504 -226947 38733 -14369 -95668
$$ packed form
11902b13411e9540o502A59601a59510I2571e3038A80962a40537c2810j73119j89605
11891c95534C6956a70661F9948O9034g6111j5432A88754E6500J56344a82699k01711
11880c84410A54386G6804J67296F9374f8265D1019O3692i842C4027c48604I7950
11868h8207o740j90218J8839H8682K880a01428b7958A5977c23738B28163b61844
11856i6493K6308j97443c8623C16368j54814a46895O2649q5000c5646A63949f3447
11844c14509d7872A27360B2778a3869G2301e5128j48513L4932A71880i6879q4597
11833a81476A29763K98001a89036b8609n6399C667K29332b7879C3554f9125C52669
11821C08665A52786j5306a07161j21803B17052h988E9504b26947C8733a4369q1299
$$ plain form
11810 -95668 139486 105564 -85671 87266 37962 -188090 -241052 255498 196079 -170456 14871
11798 -103255 100953 -154800 -12985 74645 197888 -65749 -346264 4886 88197 149648 65864
11786 147433 -210423 188715 179485 -210277 135931 -237905 -11637 -94234 51154 -60828 6093
11774 2371 -233819 100018 112290 11137 -57656 253 -56546 92343 17566 182763 -126389
11762 -105194 70794 20097 171915 -56260 -162442 34084 226538 -9464 -69076 -207104 62547
11750 -271262 40679 48338 153288 227687 -23854 -311371 9222 59114 -196450 130473 170290
11739 170290 69660 -227510 -264534 49395 235313 167108 224630 17852 -272086 -119074 -174654
11728 -174654 235890 -182158 -2098 11547 165367 76619 84335 -71800 30580 20799 171648
$$ packed form
11810i5668A39486l3922h5671H7266C7962a88090n2962B55498n9419a70456A4871
11798a03255A00953a54800a2985G4645J23243f5749k80515D886Q3311O1451F5864
11786A47433b10423A88715r230b10277A35931b37905a1637q2597E1154f0828F093
11774B371b33819A00018J2272A1137e7656B53e6546I2343A7566J65197a26389
11762a05194G0794B0097J51818e6260j06182C4084J92454i464n9612j38028F2547
11750b71262D0679P659J04950P4399b3854k87517I222M9892a96450A30473L9817
11739A70290F9660b27510l7024D9395J85918o8205N7522A7852b72086a19074n5580
11728a74654B35890a82158b098A1547J53820G6619P716g1800C0580r781J50849
$$ plain form
11717 171648 234188 163922 269430 200900 118519 -77389 104237 -450908 -42701 9771 -161950
11705 150908 172218 167920 84839 -282803 304183 -102403 -119225 65793 300049 92029 -150448
11693 686 3661 -55245 -132946 -9611 97779 284158 -193435 -268838 -32350 -91226 -81906 18442
11680 -47519 39626 -8136 60516 195728 -73452 17560 196574 62818 74685 13712 -133517
11668 -167548 -36979 -36010 -27560 264184 -246484 205903 33160 59942 144020 77678 -57546
11656 -332021 44816 166097 -295132 110934 -3805 25601 -136251 -87774 -260840 334412
11645 186140 287388 13225 -53113 44977 233042 10964 10289 -124984 270822 46099 -155342
11633 -73079 -171693 -58664 -296222 88961 -372571 -7989 173031 -378705 -200169 62913 -203385
$$ packed form
11717A71648O2540p0266J05508o8530q2381g7389A04237d50908d2701I771a61950
11705A50908K1310m298q3081b82803C04183a02403j6822F5793K34256I2029a50448
11693F86K975e5245p7701i611I7779J86379a93435p5403c2350n8876R320A8442
11680d7519C9626h136F0516J35212g3452A7560J79014F2818J1867A3712a33517
11668a67548c6979R69Q450B64184b46484B05903C3160K6782Q4078o6342e7546
11656c32021D4816J21281b95132A10934c805B5601a36251M8477j73066C34412
11645A86140J01248A3225e3113D4977J88065A0964o75a24984B70822D6099a55342
11633g3079r8614e8664k37558H8961c72571g989A73031c78705J78536F2913b03385
$$ plain form
11621 105198 -213881 -124170 233820 238497 62832 314125 -14152 76108 391783 249770 206590
11610 206590 120523 220518 -192390 192346 2712 100761 -77679 169060 -192116 18891 -161077
11598 -291246 293562 127503 -190610 277566 73386 163884 13754 20676 158669 -79848 151252
11586 204393 72127 -107167 -205187 148888 301641 -29262 66182 -100260 -27414 384487
11575 -9673 205210 197043 7781 8319 99437 121042 91832 -343411 314637 -153453 -8891 13699
11562 40953 -182622 -3239 67677 101429 -268967 123884 264111 -48088 165447 -136852 93339
11550 117642 271895 -208930 109457 61099 8233 41936 -369019 381955 278104 -37260
11539 24970 -427159 -25721 -182300 23334 -16678 -72291 -164590 467768 163521 32242 259900
$$ packed form
11621A05198b13881Q9711B33820M677F2832K51293a4152G6108L15675j42013m3180
11610B06590q6067R9995a92390A92346B712R8049g7679A69060a92116A8891a61077
11598b91246B93562A27503a90610B77566G3386R0498A3754O922J37993g9848A51252
11586B04393G2127a07167r8020A48888J52753b9262F6182a00260b7414C84487
11575i673B05210q167G781N38R1118K1605k9210c43411C14637a53453h891A3699
11562D0953a82622c239F7677L3752b68967A23884J40227d8088A65447a36852I3339
11550A17642J54253b08930A09457m8358H233L3703c69019C81955j03851c7260
11539B4970d27159b5721j56579B3334a6678n5613r2299D67768A63521C2242K27658
$$ plain form
11528 259900 76825 134528 -26096 -141638 51039 69411 118285 146673 216616 17809 214615
11517 214615 -8013 24635 184283 301835 274916 -157886 389412 308353 155342 158010 -8371
11505 151274 13993 22932 81749 33605 -84317 284597 -24197 -108728 71989 38648 39970 452069
11493 452069 -82213 529014 114597 19389 119735 113868 221643 206759 -181276 395467
11482 -113219 119587 315769 182174 241087 108371 107267 261352 -105078 134419 36513
11471 118580 294771 255799 70944 136150 188865 339092 154885 247602 53955 56807 527190
11460 527190 -110576 63294 160339 322032 -10215 104636 117022 120339 92592 241193 -126947
11448 6199 -82853 884 -14298 -90197 -2000 423573 -13760 -183353 228480 144875 329947 213689
$$ packed form
11528B59900G6825N7703b6096j15542E1039J8372M8874K8388O9943A7809J96806
11517B14615h013B4635J59648J17552k6919a57886C89412q1059j53011K668h371
11505A51274A3993Q939N8817C3605h4317B84597b4197q4531G1989l3341J322M12099
11493D52069h2213E29014A14597A9389J00346n867J07775j4884a81276C95467
11482a13219A19587J96182j33595N8913A08371j104J54085a05078A34419C6513
11471A18580J76191l8972G0944O5206N2715J50227A54885R2717E3955K852M70383
11460E27190a10576F3294R7045J61693a0215A04636J2386L317k7747J48601a26947
11448F199h2853H84a4298p5899b000D23573a3760j69593B28480q3605J85072j16258
$$ plain form
11436 213689 307869 359515 -19601 -73994 -204288 236059 -75324 -84532 220015 -67987 308393
11424 -66189 105959 185226 23713 100483 7971 -65999 164798 55398 377697 -173705 466831
11412 -85873 -228561 -61162 -228525 174976 82338 -72088 87840 48163 -229146 86988 -164169
11400 -46997 212293 80096 -236787 333105 147644 -26679 -180025 198874 -92235 -305580
11390 -305580 -63641 327879 200486 -374765 7450 222388 206316 30213 125551 172010 -206431
11378 -252722 -69694 -5633 115409 -164533 251861 -37388 10174 -195805 -7929 103936 175920
11367 175920 -187199 123435 -229911 833 147904 122529 -104547 141256 -142980 10295
11356 300226 -311369 230003 -117998 58164 79025 -70766 -40243 17050 -269885 -12812 20001
$$ packed form
11436B13689R4180N1646a9601n4393j30294B36059g5324r208B20015f7987C08393
11424f6189A05959P9267B3713P6770G971f5999A64798E5398L22299a73705D66831
11412h5873j42688f1162j67363A74976H2338g2088H7840l9677b29146H6988a64169
11400d6997B12293H0096b36787C33105A47644b6679j53346A98874i2235k13345
11390c05580f3641C27879j27393c74765G450K14938j6072C0213R5338M6459b06431
11378b52722f9694e633A15409a64533B51861c7388A0174a95805g929A03936P1984
11367A75920a87199A23435b29911H33J47071k5375a04547A41256a42980A0295
11356C00226c11369B30003a17998E8164K0861g0766L0523A7050b69885a2812B0001
$$ plain form
11344 -106452 143118 -108612 -49904 123254 131432 -56704 -80813 87713 -362998 -192921 356099
11332 -275385 -156840 40819 -158047 -1282 149977 -113487 -48680 39388 11272 24804 -166726
11320 -185215 46372 160793 -287001 -173485 -76428 -64652 -408056 -97883 10213 -212413
11309 90808 -98488 68781 209990 49215 -264975 -57133 -60631 208554 -96699 -2729 166586
11297 -54450 -125269 -177102 -269968 187473 201860 196067 -73999 -370816 -214424 77516 132303
11286 132303 -92594 -234610 10105 -89584 31887 84178 65444 -52636 -247336 -64140 8018
11274 -16263 76144 -79327 -67209 -68842 -331914 -37880 -255908 -151009 -283395 49660 -29339
11262 -31886 265459 -259382 160278 -80877 140841 76627 -368406 -476 58843 476408 131516
$$ packed form
11344a06452A43118a08612d9904A23254Q178e6704k4109H7713c62998J70077C56099
11332b75385J18545D0819a58047a282A49977a13487d8680C9388A1272J3532a66726
11320a85215D6372J14421b87001J13516g6428J1776l43404i7883A0213b12413
11309I0808i8488F8781J41209D9215b64975e7133l498B08554i6699b729A66586
11297e4450p0819n1833r2866A87473J4387n793g3999k96817J56392G7516N4787
11286A32303i2594j42016A0105h9584C1887N2291j8734e2636j94700f4140H018
11274a6263G6144g9327J2118j633k63072c7880k18028J04899j32386D9660b9339
11262c1886B65459b59382A60278h0877A40841o4214c68406d76E8843M17565A31516
$$ plain form
11250 97123 22421 4230 135494 -366048 -87575 72338 3746 8562 -69352 -73199 -319362 80686
11237 235592 -273776 -82893 83315 -84021 -12635 -15779 -98514 -202468 231212 251225 -114224
11225 -66102 121356 137820 -67579 -12220 -535719 271861 34129 -14755 195908 185896 31700
11213 83890 -373317 -104437 -185748 -72737 -2815 413628 -9303 -4688 -241998 55726 -28493
11201 -3406 22119 -145754 -121690 -276855 105012 -280284 40963 7706 -274280 -354217 -21015
11189 -194057 24460 51608 -2906 -134734 8184 -179178 -37137 -42078 -51209 -122676 -241318 66776
11176 -129622 136653 78733 -144005 -56168 103883 -25488 -147093 -183017 209013 -199636
11165 -272450 -103479 -60030 -360900 92915 -25502 -11684 182319 106021 -209320 -77554 -36421
$$ packed form
11250I7123B2421D230J31264c66048h7575G2338C746M816f9352l847k46163H0686
11237B35592b73776h2893H3315h4021a2635l144q2735j03954B31212K0013a14224
11225f6102A21356J6464f7579a2220n23499B71861C4129a4755A95908j0012C1700
11213H3890c73317a04437q1311g2737b815D13628i303M615k37310E5726b8493
11201c406B2119a45754K4064j55165A05012b80284D0963G706b74280p9937b1015
11189a94057B4460K7148b906j31828H184a79178c7137m941r131p1467j18642F6776
11176a29622A36653n7920a44005e6168A03883b5488j21605l5924B09013a99636
11165b72450a03479M3449l00870I2915b5502a1684A82319p6298b09320g7554c6421
$$ plain form
11153 -471281 196160 114231 -69970 -408234 -100563 -54462 84502 450949 -144280 -56248
11142 -113094 8013 -163395 170302 -92909 188908 11582 12113 -258531 -228791 -83610 -53517
11131 -53517 221168 -192681 96065 117157 -211078 -326282 142503 -195640 -14938 367579
11120 43113 79897 120929 -36548 323547 112050 17125 208272 -81003 -57247 -69121 156817
11108 353598 -43280 -207742 237951 76773 178563 193951 65636 -416815 -50354 194813
11097 66320 273262 5370 208114 208923 140462 35445 87897 104659 115336 223396 3805 108771
11085 108771 86936 103115 407182 325920 14026 104116 76482 433209 165321 267119 134424
11074 134424 -14811 377225 -39724 -25684 319723 143894 87408 173596 -162768 96114 -57580
$$ packed form
11153d71281A96160q1929f9970l38264a00563M6101H4502L66447a44280e6248
11142a13094H013a63395A70302i2909A88908A1582N31b58531K9740h3610L0093
11131e3517B21168a92681I6065K1092b11078j15204A42503a95640a4938C67579
11120D3113L6784M1032c6548C23547A12050A7125J91147h1003K3756j1874A56817
11108C53598d3280j64462B37951G6773J01790J5388F5636d16815e0354A94813
11097F6320K06942E370K02744Q09o8461C5445N2452J6762J0677J08060C805J04966
11085A08771k1835J6179L04067q1262A4026R0090k7634L56727A65321J01798j32695
11074A34424a4811C77225c9724J4040C19723A43894n6486Q6188a62768I6114e7580
$$ plain form
11062 87799 250138 342999 190519 -48992 184229 467355 211075 189481 340911 200574
11052 200574 251339 476723 122585 488076 603990 125879 511650 378988 793781 647255
11042 647255 307974 885747 771840 605859 551891 788997 475773 675892 739624 855367
11032 855367 638179 935229 515099 670779 673587 806908 501057 483385 883361 637784
11022 637784 662512 761054 523423 714672 634463 220904 590151 380348 841123 429556
11012 429556 599622 727826 812898 697358 731479 612932 664653 798292 740822 701878
11002 701878 844526 646607 403908 639555 660742 779916 543140 556049 765395 835955
10992 835955 467858 737712 509058 319040 559438 415022 648675 814072 690396 611224
$$ packed form
11062H7799J62339R2861j52480d8992A84229K83126B11075k1594J51430j40337
11052B00574N0765K25384A22585L65491J15914A25879L85771j32662M14793j46526
11042F47255C07974N77773j13907j65981n3968K37106l13224K00119O3732J15743
11032H55367k17188K97050m20130J55680K808J33321l05851j7672L99976k45577
11022F37784K4728R8542k37631J91249q0209B20904L69247k09803M60775m11567
11012D29556J70066J28204Q5072j15540L4121j18547N1721J33639n7470l8944
11002G01878J42648j97919k42699K35647K1187J19174k36776J2909K09346P0560
10992H35955l68097K69854k28654j90018K40398j44416K33653J65397j23676p9172
$$ plain form
10982 611224 776281 493555 648945 734671 721505 628824 839223 837767 600124 917830
10972 917830 729609 906024 969562 965486 1228132 1265036 725834 1098784 1492443 1384860
10962 1384860 2004474 1999590 2225365 2382613 2142568 2654828 2659125 2756787 2496367 2479214
10952 2479214 1833705 1919433 1706510 1774918 1537462 1429272 1528807 1446152 1480483 1783021
10942 1783021 1811090 1529435 1514343 1416754 1211615 1112118 792106 970785 462240 720112
10932 720112 520826 538100 475577 175386 183292 392914 401617 349788 103827 314379 602236
10921 602236 42065 -51125 -19025 185427 157318 -190459 -14571 237016 389789 224036
10911 224036 165240 90424 -130262 100063 -138553 29814 440754 -252275 142885 14680
$$ packed form
10982F11224J65057k82726J55390Q5726j3166r2681K10399j456k37643L17706
10972I17830j88221J76415O3538m076K62646L6904n39202L72950L93659j07583
10962A384860O19614m884K25775J57248k40045N12260M297R7662k60420j7153
10952B479214o45509Q5728k12923O8408k37456j08190R9535q2655L4331L02538
10942A783021K8069k81655j5092r7589k05139r9497l20012J78679D62240K57872
10932G20112j99286J7274o2523A75386P906K09622Q703n1829A03827K10552K87857
10921F02236D2065e1125a9025A85427k8109a90459a4571B37016J52773j65753
10911B24036n8796p4816a30262A00063a38553B9814M10940b52275A42885A4680
$$ plain form
10900 55422 69067 -10149 -437851 -63047 -110080 270905 208887 -73574 65616 -106035 -43454
10888 -8236 241534 76056 -30750 -108935 -235909 -296323 -317789 75604 88952 -44113 -105778
10877 -105778 166383 14565 384148 157256 214067 81881 99793 122286 -303440 11650 127011
10866 127011 -224291 -40459 109685 178817 -101748 39411 -71141 -343771 66973 -105467
10855 172085 -228865 218393 -110349 210426 83466 -58438 -171428 -47759 75500 160072
10845 160072 -238096 151576 -258590 327146 20776 -8499 -37465 210696 -110840 127762
10834 -49526 17662 -212926 15584 43264 -12927 143225 -73831 -190868 -409733 -103653 -141687
10823 -141687 198339 -53544 46319 -403573 -169520 -129702 29225 -262813 170025 379829
$$ packed form
10900E5422J3645a0149m27702f3047m7033B70905o2018g3574F5616a06035d3454
10888h236B41534G6056c0750p8185j26974o0414k1466G5604J3348d4113o1665
10877a05778A66383A4565L69583A57256N6811H1881J7912K2493c03440A1650J15361
10866A27011b24291d0459A09685O9132a01748C9411g1141k72630F6973a05467
10855A72085b28865B18393a10349B10426H3466e8438j12990d7759G5500Q4572
10845A60072b38096A51576b58590C27146B0776h499k8966B10696a10840A27762
10834d9526A7662b12926A5584K7680a2927A43225g3831j17037k18865a03653l8034
10823a41687A98339e3544D6319d03573a69520L9818B9225b62813A70025K09804
$$ plain form
10813 379829 77171 -44641 -289260 -34528 121638 51564 -124312 -217798 43174 -68051 -45628
10802 -45628 -71805 29366 -88383 48543 -164031 156485 -280263 -20557 -463625 -34867 -127598
10791 -127598 -92332 -79253 -199075 -42000 -229 114854 -146943 -415875 -303106 -39214 29843
10779 -72358 -189658 -148869 115392 157749 -323924 -63257 139637 87325 115615 70615 297038
10768 297038 242014 189958 -101585 66213 118123 -36642 101522 41960 20624 -128910 181450
10756 -54547 -119408 -504 10513 -9464 -64726 -97091 -97411 -445047 78462 -257776 26769 53235
10744 53235 -156299 -154434 -2957 -120628 -259978 -14111 211532 -141162 74810 -323645 -25688
10732 201248 -139177 -67436 38902 38691 -148651 -281881 -35745 -30927 -10049 167556 -412411
$$ packed form
10813C79829G7171d4641k44619c4528A21638E1564a24312r3486D3174f8051K2423
10802d5628k6177B9366h8383D8543a64031A56485b80263b0557m43068c4867r2731
10791a27598L5266J3079j19822d2000b29A14854a46943k68932J12769c9214B9843
10779g2358j17300M0789A15392M2357c23924f3257A39637n2312K8290m5000K26423
10768B97038n5024n2056a01585F6213N1910c6642A01522D1960B0624a28910A81450
10756e4547o4861e04A0513i464n5262l2365l20l47636G8462b57776B6769K6466
10744E3235a56299J865b957j17671j39350a4111B11532a41162G4810c23645b5688
10732B01248a39177f7436C8902k11a48651j33230c5745M818a0049A67556d12411
$$ plain form
10720 87312 72128 179133 -386109 39379 -219631 -117225 -359586 -84363 -26739 -277424
10710 -277424 -229166 120142 139756 169325 352197 92206 -140954 274755 -389674 212213
10699 163597 -77699 -82011 80174 -34787 -5086 4995 -226712 -205775 -100577 -188528 -83215 13224
10686 -5208 -59317 -99354 -14928 93837 -84000 -68308 -121860 94636 69717 70859 -2399 25686
10673 -147074 -214585 -63494 -124605 -121974 48952 -131251 189593 -217908 37557 113449 149642
10662 149642 -260256 202057 -30383 -234999 26220 217299 -167797 -56765 -248447 -442487
10652 -442487 -271969 -82582 47168 290942 -54980 186573 -70445 -96725 -283591 167294
10641 -48182 -224166 -257667 -33063 -343150 -323728 84773 -96359 60169 -277614 -118938 -23627
$$ packed form
10720H7312j5184J07005c86109C9379b19631J02406k42361h4363b6739k50685
10710b77424M8258A20142J9614K9569J82872I2206a40954B74755c89674B12213
10699A63597g7699m312H0174c4787e086D995b26712K0937a00577q7951h3215A3224
10686e208n4109m0037a4928I3837h4000J5692n3552I4636k4919J142b399B5686
10673a47074o7511f3494o1111K631D8952a31251A89593b17908C7557P5892L6193
10662A49642b60256B02057c0383k04616B6220J91079a67797e6765j91682j94040
10652d42487J70518h2582D7168K43774e4980A86573g0445k6280j86866A67294
10641d8182j75984l3501c3063l10087J9422H4773i6359F0169b77614a18938b3627
$$ plain form
10629 174514 -50896 106172 -7202 -82704 -133989 98065 -134509 -414207 -93731 -90580 19647
10617 -292117 -248846 -40809 -64725 -17997 442522 -270819 342546 -69666 -107883 189318 -197842
10605 36015 101185 85845 -282115 182853 -225191 33138 -348969 8499 -278386 -33271 -76666
10594 -76666 -89194 -211363 -214490 56647 -45010 -229617 -162709 132447 191986 -119097 111226
10582 31168 37687 211658 -88308 -382939 -221372 168519 -192244 -177830 38834 84468 439166
10571 439166 388483 28305 -81249 -291804 -106705 -198630 179718 -34549 38897 243456 -181628
10559 -22318 -327903 -111647 370581 -22020 -76009 44789 -20143 -153135 83021 156826 23300
10547 -568177 137557 -168181 -8965 85356 178228 -35809 73226 -233506 114353 -175887 53584
$$ packed form
10629A74514e0896A06172g202p5502n1285I8065a34509k79698i3731L151A9647
10617b92117M3271d0809k3916a7997D42522b70819C42546f9666l8217A89318a97842
10605C6015O5170j5340b82115A82853b25191C3138c48969H499b78386c3271m3395
10594g6666j2528j22169l127E6647d5010j84607O6908A32447N9539a19097A11226
10582C1168O519J73971h8308k94631J61567A68519a92244J4414C8834M5634L54698
10571D39166n0683B8305h1249k10555a06705r1925A79718c4549C8897K04559a81628
10559b2318l05585a11647C70581b2020n3989D4789b0143j32992H3021P3805B3300
10547e68177A37557a68181h965H5356R2872c5809G3226b33506A14353a75887E3584
$$ plain form
10535 164391 -40410 61785 -14014 246625 -184649 142967 107476 -50875 209876 52115 146999
10524 146999 265702 -162790 241858 -384348 -39708 -88307 106436 -84093 206679 -18621
10513 -71780 351550 2206 -231214 -50801 208574 57531 56837 8105 -110273 -88190 -250089
10502 -250089 -2037 33084 34656 165922 -23590 -5405 126150 -309816 -139869 -284806 125461
10490 815 33776 -266681 86240 92893 116258 -98702 -319929 -95547 -29962 -240841 -109736
10478 -332304 -446202 -62145 67742 -183373 -100794 -71414 -16137 174505 -238647 -176643 -148733
10467 -148733 4572 536186 222828 406389 360105 201497 42935 -124321 108853 208487
10457 208487 167609 103294 -310384 140915 161190 -13758 73677 119176 196307 -121213 -31105
$$ packed form
10535A64391d0410F1785a4014B46625a84649A42967l5491e0875B09876E2115R4884
10524A46999J18703a62790B41858c84348c9708m8599A06436h4093B06679a8621
10513g1780C51550B206b31214e0801B08574E7531o94H105a10273K2083j61899
10502b50089b037C3084J572J31266b3590e405A26150c09816a39869j44937A25461
10490H15L2961b66681H6240O653K3365i8702k21227i5547b9962k10879a09736
10478c32304j13898f2145F7742a83373Q2579K9380a6137A74505b38647O2004K7910
10467a48733D572N31614B22828J83561m6284j58608D2935a24321A08853R9634
10457B08487m0878o4315c10384A40915K0275a3758G3677M5499P7131a21213c1105
$$ plain form
10445 53003 43412 -27173 -85870 137607 -113950 9003 202847 -240530 -93541 -189504 -68047
10433 -446565 332405 -270085 31659 -22337 -172582 -227272 -106982 -170410 171520 -7373 -238156
10422 -238156 282315 -116087 90375 -84427 86946 164374 -147276 133736 -5195 -126711 -121496
10411 -121496 63215 60059 310 -59789 -203227 -218816 92811 -164258 -55227 -78 -257330 75537
10398 -17726 -90496 143005 -112803 -108203 342949 125226 -86253 198046 12873 -87508 255924
10386 123666 165665 16308 -145645 -104427 -244463 -47818 21167 -74150 54849 267989 157844
10375 157844 53892 71188 -30271 124220 294349 -39406 131628 143628 364051 76935 175284
10364 175284 398881 52713 464321 39695 122482 170826 499725 441818 207746 28042 468915
$$ packed form
10445E3003r591b7173n8697A37607a13950I003J93844b40530i3541r5963f8047
10433d46565C32405b70085C1659b2337j50245n4690a06982o3428A71520g373k30783
10422b38156B82315a16087I0375h4427H6946P7428a47276A33736e195j21516N215
10411a21496F3215l156C10e9789j43438j5589I2811a64258e5227g8k57252G5537
10398a7726p2770A43005a12803M600C42949A25226h6253A98046A2873h7508B55924
10386A23666M1999A6308a45645M1218j40036d7818B1167g4150E4849K13140j10145
10375A57844E3892J7296c0271A24220J70129c9406A31628J2000K20423G6935R8349
10364A75284K23597E2713M11608C9695Q2787M8344L28899n7907B07746B8042M40873
$$ plain form
10353 468915 428946 403406 -29384 241492 494278 420205 338260 71268 45392 83526 569293
10342 569293 65317 122281 522513 -41553 200281 106083 414686 350497 215389 499252
10332 499252 338110 313119 144760 -25246 271563 741994 270344 158279 -101281 -249215
10322 -249215 223349 117591 82514 -14908 157967 258933 48585 -151865 155082 141047
10312 141047 -103733 -192546 -23435 269710 167670 341712 344500 359019 -125981 154997
10301 216474 252878 81805 -59915 9281 639008 -161314 74760 85539 -88538 58363 113773
10290 113773 101940 9313 85100 356741 132123 356137 151265 -9907 170608 -58264 28484
10278 -56093 -212342 -113909 -185232 177331 51138 62395 -186306 -13249 132102 113676 -11220
$$ packed form
10353D68915l9969k5540b9384B41492K52786p4073q1945G1268k5876L8134M85767
10342E69293F5317N6964M00232d1553B00281r4198L08603o4189j35108K83863
10332D99252j61142k4991A44760b5246B71563M70431B70344j12065a01281j47934
10322b49215B23349j05758l5077a4908A57967J00966D8585a51865A55082j4035
10312A41047a03733q8813b3435B69710j02040J74042K788J4519a25981A54997
10301B16474L6404H1805e9915I281O29727a61314G4760J0779h8538E8363N5410
10290A13773j1833I313P5787K71641A32123K24014A51265i907A70608e8264B8484
10278e6093j56249R8433p1323A77331E1138J1257a86306a3249A32102j8426a1220
$$ plain form
10266 -145773 -151698 -98793 -10612 78167 74902 -8104 -39849 -186255 -195171 160916 179830 86943
10253 -30625 303315 27622 114192 104474 -56640 223705 17866 397097 384100 3821 122749
10242 122749 410826 -152315 103124 185794 296484 259314 -9031 60452 223680 202291 262300
10231 262300 52694 147350 127832 -70355 164746 -3396 -94976 -165387 -47285 -68040 190930
10219 -349116 -8933 -79382 -11882 -28776 130398 -145673 -183966 -143862 -103304 30646 195142
10208 195142 -43642 -97550 144813 56477 -141497 -229588 185119 448166 34842 -270851
10197 -199823 -129349 83784 41669 -146189 308140 -152397 -265281 -143866 183345 -119640
10186 259309 -182210 107562 -126577 -333331 -167537 -169615 81654 122600 -65295 -174083
$$ packed form
10266a45773n925N2905a0612G8167l265h104l1745j46406q916A60916J8914H6943
10253c0625C03315B7622Q6570r718e6640B23705A7866L79231j2997C821J18928
10242A22749K88077a52315A03124Q2670J10690l7170i031F0452J63228k1389O0009
10231B62300E2694R4656j9518g0355A64746c396r1580p0411d7285k0755A90930
10219c49116h933p0449a1882j6894A30398a45673l8293M0104M0558C0646J64496
10208A95142d3642n3908A44813E6477a41497q8091A85119K63047C4842b70851
10197a99823P0474H3784D1669a46189C08140a52397j12884J21415A83345a19640
10186B59309a82210A07562a26577k06754J65794k078H1654M0946f5295j08788
$$ plain form
10176 -174083 310335 -171008 718 -171876 -88673 -232895 -76746 180279 -145769 -15788 -29071
10165 -29071 173145 61239 113350 141042 -37628 -247316 90813 125587 -100552 109506 -70357
10153 -5124 -188642 -270469 -62355 -33262 -113534 194300 -215815 -10796 -47667 -33769 212422
10141 301794 -380699 -151287 -260953 102638 -198409 -37571 109165 -164291 -190501 -47743
10130 -161142 49625 -324053 5564 67634 -104782 -238882 -226474 266051 261876 -64417 30315
10118 -230515 -71240 -38192 -305596 -9103 2211 65880 50040 -3467 3711 202635 207932 -124391
10105 -360527 129085 -44894 -151485 -402147 -167569 -166280 -40830 -100157 165075 119906 10049
10093 5135 -299097 -312594 -126741 -5895 25602 99910 -475720 -213039 104427 41096 -61191
$$ packed form
10176a74083C10335a71008G18a71876Q3203j44222g6746A80279a45769a5788j3283
10165b9071A73145F1239N2111K7692c7628k09688I0813L4774a00552A09506g0357
10153e124j83518q1827f2355K9093q0272A94300b15815a0796l6871J3898B12422
10141C01794c80699a51287j09666A02638a98409c7571A09165a64291k6210d7743
10130a61142D9625c24053E564O2070a04782j34100J2408B66051m175f4417C0315
10118b30515g1240L3048k67404i103B211O3669j5840c467C711J98924N297a24391
10105c60527A29085d4894j06591k50662a67569J289d0830n9327A65075m5169A0049
10093E135b99097j3497a26741e895B5602P4308d75720b13039A04427D1096f1191
$$ plain form
10081 -255598 30563 -257777 42894 -3660 -209603 -76219 -186739 -88309 -222039 -198540 -194691
10070 -194691 -389249 -231588 -36800 116329 -352732 316482 -97186 254743 52574 -167470
10059 152243 -169922 -141882 -103595 -422772 107405 -194457 -54757 -18265 -241985 104300
10048 -50607 -143428 -349916 -99963 -76289 -155474 330617 -391550 -30028 -81024 112678 -60193
10036 11017 -159134 -28508 -131485 -45763 -194998 93602 -96100 -125693 -279013 -15147 -412225
10025 -412225 -332254 -26106 215141 38879 -38043 -93665 -146524 -225926 -288300 -17827 138620
10013 -193721 -420590 -177215 -98547 12830 11461 -7605 -179502 -136077 -117831 167962 -14768
10001 -144619 -53038 170092 1676 -24138 -142330 -185444 167509 27340 -68055 97147 -178215
$$ packed form
10081b55598C0563b57777D2894c660k05943g6219j10520h8309j33730K3499L849
10070a94691j94558J57661c6800A16329c52732C16482i7186B54743E2574a67470
10059A52243a69922K8040L8287l19177A07405a94457e4757a8265k23720A04300
10048e0607r2821k06488i9963K3674p9185C30617c91550c0028n0996A12678f0193
10036A1017a59134b8508j02977d5763j49235I3602i6100k9593j53320a5147l97078
10025d12225P9971b6106B15141C8879c8043n5622n2859p9402o2374a7827A38620
10013a93721k26869a77215P8668A2830j369g605j71897M3425J8246A67962a4768
10001a44619e3038A70092A676b4138j18192m3114A67509B7340f8055I7147a78215
$$ plain form
9989 187382 9712 208760 -47232 -496229 -264817 -200507 -23211 -79428 -201732 342394 -415065
9977 -199678 -314545 -227025 -174465 -169305 -297860 -214691 -208127 -88696 -95298 -199663 181253
9965 351691 -364070 -131956 9210 -87563 -244019 194312 -124017 -173064 47654 -155013 -71621
9953 -38115 -158093 -71119 -122141 -108709 -86911 140670 -263469 118687 -254260 -74941 -59509
9942 -59509 31155 73412 108699 134733 -81415 49799 194278 47835 -60981 -43659 -144473
9931 -144473 1257 -25479 133967 88376 -62107 32813 -62248 -68247 124560 -91239 -59416 89039
9918 -49817 -200183 -196548 -51225 -256234 4909 -23070 97274 -247047 -29570 5682 -273997 -140279
9906 -140279 89439 -5764 -13682 -71034 -127295 128014 2665 -27487 70250 64119 -26132 -124196
$$ packed form
9989A87382I712J99048d7232m48997K31412O4310b3211n6217j22304C42394d15065
9977a99678j14867Q7520N2560N160j28555Q3169O564h8696o602j04365A81253
9965C51691c64070a31956I210h7563j56456A94312a24017m9047D7654a55013g1621
9953c8115j19978g1119n1022J3432K1798A40670b63469A18687b54260g4941J5432
9942e9509C1155M2257L5287K6034h1415D9799J44479D7835f0981J7322j00814
9931a44473A257b5479A33967m5591f2107C2813f2248n999A24560i1239L1823H9039
9918d9817j50366L635e1225k05009D909b3070I7274b47047b9570E682b73997J33718
9906a40279H9439e764p918n7352n6261A28014B665b7487G0250o131b6132r8064
$$ plain form
9894 -124196 -110791 -326822 73926 -16725 46102 -21342 -263026 137636 -268157 -15897 7574
9882 -117841 -95427 331407 -123087 48792 148677 25127 -163474 75125 51983 8019 -179089
9870 -100016 -40474 98287 224313 105571 -70760 -117457 53584 54674 -71539 -121650 -419511
9859 -419511 -103767 -232378 -92109 -123132 -64913 29700 -254754 -130547 -16446 71746 -278875
9847 41287 -349349 39936 79897 -394543 321273 -32864 129676 -224758 -253780 42757 -432096
9835 -32420 280629 282006 20592 -77013 51475 55194 -28150 7504 56252 -107159 -173014 211744
9822 -68318 169582 105537 -172982 -340382 -46771 -72349 203417 -326074 -20965 33893 -49417
9810 -108120 14568 -283176 99947 -511064 -198537 -193476 2782 -141167 115718 75549 -187759
$$ packed form
9894a24196J3405k16031G3926a6725D6102b1342k41684A37636b68157a5897G574
9882a17841K2414C31407a23087D8792R9885B5127a63474G5125k3142H019a79089
9870a00016d0474I8287J26026A05571g0760m6697E3584J090g1539n0111k97861
9859d19511a03767j28611i2109l1023N8219B9700b54754J24207a6446G1746b78875
9847D1287c49349C9936L9961c94543C21273c2864A29676b24758k9022D2757d32096
9835c2420B80629J377B0592g7013E1475L719b8150G504M8748a07159o5855B11744
9822f8318A69582o4045a72982j67400d6771k5578B03417c26074b0965C3893d9417
9810a08120A4568b83176I9947e11064a98537N061B782a41167A15718m0169a87759
$$ plain form
9798 -191122 -74330 50012 -245819 -137885 -260605 73978 174194 -108911 -25705 -273389
9788 -273389 4885 75416 143674 -21338 -46726 -142055 156555 -146595 -134735 -123432 -243710
9777 -243710 -230156 -99802 83168 49166 -40505 -73225 38181 -128032 -34135 110630 172141
9766 172141 120888 15974 52462 15982 90830 -94411 -153204 57293 192192 146126 20138
9754 -9716 -70757 302675 251724 -497657 -148934 -316585 -45750 46418 -55394 -136630 -87589
9743 -87589 -99886 130554 -188277 -357734 66301 -56994 242816 -169800 48588 -171439 -75307
9731 -265135 -124392 -22762 -417109 -42784 -171725 55000 -702 -14356 -146468 61012 149522
9720 149522 422884 11389 -253669 -465935 -28046 -93615 -45966 -122524 180677 83452 -225160
$$ packed form
9798a91122g4330E0012b45819J07934j22720G3978J00216a08911b5705k47684
9788b73389D885P0531O8258b1338k5388r5329A56555a46595J1860J1303j20278
9777b43710J3554i9802H3168l4002d0505l2720C8181a28032c4135A10630O1511
9766A72141n1253A5974L6488A5982P4848i4411n8793E7293J34899m6066B0138
9754i716o1041C02675n0951d97657a48934j67651d5750D6418e5394q1236M9041
9743h7589j2297A30554a88277j69457F6301e6994B42816a69800D8588a71439g5307
9731b65135a24392b2762l94347d2784j28941E5000g02j3654j32112F1012Q8510
9720A49522K73362A1389b53669k12266b8046o5569d5966p6558A80677H3452b25160
$$ plain form
9708 -155874 -494125 -15734 130043 14257 -89220 -273443 201416 77 -102193 -51189 -77268
9697 -77268 -33596 12163 72854 -198286 -23036 -31523 105835 -105181 -249919 27987 29715
9686 29715 220344 -9202 -118382 -197321 -140414 84107 109406 -122965 -5433 36363 -178015
9674 35574 176306 -154412 180526 -70120 -123425 -425042 -314736 40281 51559 -273550 -211297
9663 -211297 -36717 -62178 -82731 -228107 176573 12685 184443 -55559 39332 37341 -215769
9651 -199114 -234117 -27526 -360051 -173508 -335779 178193 434141 -187182 -448278 -257001
9641 -257001 15429 -125256 -14068 5688 -11831 -139720 -201480 -148250 -215877 -71244 -162011
9630 -162011 -125808 45062 237232 53973 -119877 103626 70091 -184672 57411 -194748 163608
$$ packed form
9708a55874l38251a5734A30043A4257h9220j84223B01416G7a02193N1004k6079
9697g7268c3596A2163O0691a98286b3036q487A05835a05181j44738B7987J728
9686B9715J90629i202j09180p8939N6907H4107K5299a22965e433C6363a78015
9674C5574J40732a54412A80526g0120n3305l01617J10306D0281J1278b73550O2253
9663b11297c6717k5461k0553j45376A76573A2685J71758e5559C9332j991b15769
9651a99114l5003b7526l32525a73508j62271A78193K55948a87182k61096J91277
9641b57001A5429a25256a4068E688a1831j27889o1760N3230o7627g1244r0767
9630a62011L6203D5062J92170E3973a19877A03626l3535a84672E7411a94748A63608
$$ plain form
9618 125779 -223376 -30487 -211192 -28000 -79610 -232179 -239971 -11573 -63062 -82827 62599
9606 -316894 -411551 -97595 27740 -203378 -259550 -239617 384878 -51969 40440 -359096 106597
9594 -81466 226792 -113688 -25287 165633 -340167 46819 -182460 50755 148963 -36158 210350
9582 79466 105407 79075 -269569 -250164 -68529 74069 184486 49586 -123161 -165615 189618
9570 175535 219423 50447 -42987 -182170 69191 -201095 -352799 127456 253413 -124655
9559 -161034 41224 124135 -182802 -187867 -178071 -71992 -37680 -43270 -12827 -79282 56968 -9505
9546 125 201615 139356 -139605 -115504 -233916 -96084 139174 -119691 201126 -290084 -45320
9534 79556 -239474 147830 45002 236570 10002 -105629 312389 101800 -15177 -209488
$$ packed form
9618A25779b23376c0487j80705b8000n1610j52569p792a1573n1489j9765F2599
9606c16894r4657i7595B7740b03378n6172J9933C84878e1969D0440c59096A06597
9594h1466B26792a13688b5287A65633c40167D6819a82460E0755R8208c6158B10350
9582G9466K5941k6332b69569J9405f8529G4069J10417D9586a23161m2454A89618
9570A75535M3888E0447d2987j39183F9191b01095j51704A27456J25957a24655
9559a61034D1224Q2911a82802n065R796g1992L4312n590a2827o6455E6968i505
9546A25K01490o2259a39605K4101j18412i6084A39174a19691B01126b90084d5320
9534G9556b39474A47830D5002J91568A0002a05629C12389A01800a5177j94311
$$ plain form
9524 -209488 -152903 130503 -146683 62636 93922 -314955 115295 -53603 -13455 -135903 -40731
9512 -50004 -64460 -30337 -154420 117892 -245498 35069 -44503 71610 320915 -107686 -117991
9501 -117991 -62345 -242601 -64742 -389896 -31157 -107248 -300214 -110790 -132595 -272408 118964
9489 110336 173208 174361 -86758 -105698 -40328 324234 86041 29814 110387 -299317 25171
9477 31480 -44528 -236512 -84695 90679 -327256 -165489 -167078 -82274 -164055 19795 -181425
9465 -421091 -235219 15943 -127903 -136402 -29668 -62483 61569 155708 206987 87004 -206992
9453 -60814 415857 -43996 169969 119586 -99852 121666 -293300 -215979 -242169 11216 80842
9442 80842 149250 -364199 -212349 -120442 68019 -270282 143656 -86592 66064 109831 50086
$$ packed form
9524b09488N6585A30503a46683F2636L1286c14955A15295e3603a3455j22448d0731
9512e0004j4456c0337j24083A17892b45498C5069d4503G1610K49305a07686j0305
9501a17991N5646j80256f4742l25154c1157p6091j92966a10790k1805j39813A18964
9489A10336O2872J153h6758j8940d0328C24234H6041B9814Q0573b99317B5171
9477C1480d4528j91984h4695I0679c27256J61767j589h2274q1781A9795a81425
9465d21091J85872A5943a27903q499b9668l2815F1569R4139N1279H7004b06992
9453f0814D15857d3996A69969n0383i9852A21666b93300P7321k6190A1216O9626
9442H0842O8408c64199J51850R1907F8019b70282A43656h6592F6064M3767E0086
$$ plain form
9430 -188996 81825 -129943 4366 -88530 -138278 -80502 64568 -14110 -143111 -290785 -126759
9418 -66551 -81991 -42526 -174860 -329182 45448 -123796 57241 -145678 87720 26711 120434
9407 120434 -205549 -157945 -45446 -229766 -72250 -254185 -71780 72164 -235951 -77659 112851
9395 -226481 -105260 -230506 -47111 -16833 209916 138160 -113138 301247 -39088 -78238 318053
9383 -171240 168883 -6598 -6582 187108 -84939 61697 295893 -22864 45890 -105277 -217446
9372 -217446 -192257 -197648 -99676 -40183 43538 -258608 -320873 79634 118286 28422 -95572 -298533
9360 -298533 160543 -164120 16296 -152097 -147336 68246 -85510 -242150 -196509 -59789 -220773
9349 -220773 145558 -189461 -288943 -192206 357942 40877 54959 -268239 -348043 69299 -24697
$$ packed form
9430a88996H1825a29943D366h8530m9748N7776F4568a4110j29001j47674a26759
9418f6551j5440L9465j32334j54322D5448a23796E7241a45678H7720B6711R3723
9407A20434b05549M7604d5446j84320g2250j81935g1780G2164b35951g7659A12851
9395b26481a05260j25246d7111a6833B09916p1756a13138C01247c9088l9150C18053
9383a71240A68883f598J6A87108h4939F1697K34196b2864D5890a05277j12169
9372b17446K5189n391R7972d0183D3538b58608o2265G9634L8652B8422i5572k02961
9360b98533A60543a64120A6296a52097M761F8246h5510j56640M5641e9789j60984
9349b20773A45558a89461r9482R6737C57942D0877J4082b68239p9804F9299b4697
$$ plain form
9337 -178060 -193362 -127530 211986 -235407 187166 -220803 -70463 -64267 98127 -323713 -4724
9325 -201185 -63852 -537797 -196561 219970 -156913 -78159 -65128 -30853 162265 86550 -336455
9313 -114375 -354979 -240228 335223 -292446 -287420 -72495 -28511 41336 -40725 -73444 -218105
9302 -218105 -70293 -194045 -341632 -159742 -156735 168742 -175177 -187781 73293 -227861 55159
9290 154112 -136377 32152 -174665 -363969 118796 85667 -12153 117289 -218738 281510
9279 -125556 64819 -52096 -492016 156700 -20257 224505 -119980 129043 -252004 140496
9268 -90014 -36298 47353 -170748 37960 37480 -220242 101869 190312 -46587 -643 -171891 -171976
9256 -171976 63959 -118932 44589 88568 104968 -119490 -574074 1345 -88277 -66909 -279169
$$ packed form
9337a78060j5302O5832B11986b35407A87166b20803g0463O196I8127c23713d724
9325b01185f3852m73945a96561B19970a56913g8159J3031c0853A62265p5715c36455
9313a14375k40604J14751C35223b92446N026g2495b8511D1336d0725l2719j44661
9302b18105g0293j23752j47587a59742L007A68742a75177j2604G3293b27861E5159
9290A54112a36377C2152a74665j89304A18796l3129a2153A17289b18738B81510
9279a25556F4819e2096m39920A56700b0257B24505a19980A29043b52004A40496
9268i0014c6298D7353a70748C7960m80b20242A01869Q8443d6587f43j71248q5
9256a71976F3959a18932D4589M3979J6400a19490m54584A345h8277K1368k12260
$$ plain form
9245 -279169 -54082 140642 -89938 156463 27823 -162407 146560 129659 -408646 313550
9234 44434 -286890 -40177 -46469 187681 -110133 -130059 -37631 51016 128880 -271387 -11442
9222 157719 -18509 -182979 124494 -85259 206367 10370 10171 -84496 54438 -14925 35123
9210 -83215 25447 20288 -155982 -165990 18057 73328 -116127 -148809 -1925 183200 -167202
9198 -34321 -102258 -230602 230667 -151844 -82672 -249443 89966 233057 74522 -78947 -55112
9187 -55112 175853 -70308 -22407 -183020 86376 -72006 -108102 -12960 -28217 -285638 39047
9175 282382 353286 -261418 -13796 15635 226249 -327450 -352220 195491 -28442 -31655 -65027
9164 -65027 -339734 -539821 -339192 -141023 -309522 -24085 30759 -305942 -13192 62748 56722
$$ packed form
9245b79169e4082A40642h9938A56463B7823a62407A46560j6901d08646C13550
9234D4434b86890d0177o292A87681a10133j9926c7631E1016P7864b71387a1442
9222A57719a8509j64470A24494h5259B06367A0370j99h4496E4438a4925C5123
9210h3215B5447n159a55982j0008A8057N5271a16127l2682a925A83200a67202
9198c4321o7937j28344B30667a51844O9172j66771H9966J43091G4522g8947K3835
9187e5112A75853g0308b2407j60613H6376g2006l6096a2960j5257k57421C9047
9175B82382P0904b61418a3796A5635K10614c27450k4770A95491b8442l213l3372
9164f5027k74707k00087K00629a41023j68499b4085C0759c05942a3192F2748o026
$$ plain form
9153 56722 -216828 -113809 -152463 157917 -137195 94831 -122990 -156507 56771 -293215 5319
9141 -412707 -101470 -109938 -319351 -75272 -229578 93568 -10404 -40103 -123947 162706 293093
9130 293093 135500 -4170 -209538 -194636 -131505 27436 306664 -267353 -192870 69783 -225816
9118 -37551 323763 31824 -173196 -211875 -43235 -381339 43691 -278696 99318 34984 -245275
9106 278875 244100 -402806 34558 -114557 -104189 -59144 -17803 -75867 -190997 -127315 -113452
9095 -113452 -139161 -204896 62833 122836 113863 86471 -148769 177427 -159690 70543 110325
9084 110325 -14655 -140928 170582 -110321 -86206 -133591 -232202 -228861 -51238 -183967 -274238
9073 -274238 -443659 -263494 -141620 -72967 -131338 -92369 -24423 50857 -206837 -185883 -454682
$$ packed form
9153E6722b16828J03019l8654A57917a37195I4831a22990l3517E6771b93215E319
9141d12707a01470q468k09413g5272j54306I3568a0404k9699q3844A62706J30387
9130B93093A35500d170k05368J4902O3131B7436K79228b67353P4483F9783b25816
9118c7551C23763C1824a73196l8679d3235l38104D3691b78696I9318C4984b45275
9106B78875l4775d02806C4558a14557J0368M5045a7803n8064j15130O3682J3863
9095a13452k5709o5735F2833O0003q973k7392a48769A77427a59690G0543L9782
9084A10325a4655j26273A70582a10321K4115m7385r8611L341e1238j32729r0271
9073b74238j69421J80165J21874O8653n8371L8969b4423E0857b06837K0954k68799
$$ plain form
9062 -454682 -13312 203203 -159268 -163904 146056 -147451 -163136 -52842 -63157 -248222 1391
9050 191807 7087 96245 327253 255897 90917 -193519 -102380 -167768 -95870 72182 55420
9039 55420 -82817 -105531 -157507 -53797 184331 -244637 -126724 -8255 -198266 -159412 258090
9027 -18215 226721 -212339 -6163 -305135 106355 127669 -5865 61634 -154121 131200 113601
9016 113601 6358 83502 -45594 -225372 -133507 104816 98753 -14831 -48713 -218211 -189313
9005 -189313 26795 112311 -82130 356185 -212308 -56911 21608 -27426 -45626 -225910 -35076
8993 -220871 -230953 -272276 -110310 106816 322538 236544 10132 -72749 -170082 205504 -44151
8981 55669 -76791 239613 -253972 -238611 -160336 13544 -113170 -31980 -53323 -502902 -217045
$$ packed form
9062d54682a3312B03203a59268m636A46056a47451j5685e2842j0315j85065A391
9050A91807G087Q9158K31008p1356I0917a93519R1139o5388P1898G2182j6762
9039E5420h2817k2714n1976e3797A84331b44637J17913h255j90011L8854B58090
9027a8215B26721b12339f163k98972A06355K1314e865F1634a54121A31200j7599
9016A13601F358P7144d5594j79778R1865A04816o063a4831l3882j69498K8898
9005a89313B6795Q5516h2130C56185b12308e6911B1608b7426j8200j80284c5076
8993b20871j0082m1323a10310A06816K15722q5994A0132g2749r7333B05504d4151
8981E5669g6791B39613b53972J5361P8275A3544a13170c1980k1343m49579b17045
$$ plain form
8969 -197584 76857 -268657 -175604 146214 -128938 -14509 -43636 -161863 88567 81837 13537
8957 -65053 -437059 220435 88777 -431667 73081 206028 103115 41876 -94105 27770 170947
8946 170947 -197086 82689 -146999 -223482 -161851 -177114 257712 402114 -288394 100711
8935 -272103 -256331 -359784 12046 8863 -360687 118447 -17235 -156579 -134593 -134995 196490
8923 141427 110996 -22131 102609 88034 215320 213501 202407 14086 468963 47290 84863
8912 84863 101697 399439 527950 1251566 2362096 3506251 7209009 9588066 3656051
8902 1777391 963782 760186 401665 435762 664205 12956 53412 450327 353579 219062
8892 219062 267994 152603 202659 145738 89918 -129725 -264503 152719 -29259 32841 10701
$$ packed form
8969a97584G6857b68657R3053A46214a28938a4509k9127j18227H8567o730A3537
8957f5053l72006B20435H8777d31667G3081J32947j02913D1876i4105B7770J43177
8946A70947a97086H2689a46999p6483O1631j5263B57712J44402b88394A00711
8935b72103J5772j03453A2046l183c60687A18447a7235j39344K1986m02A96490
8923A41427l0431b2131A02609j4575J27286j819j1094A4086M54877D7290L7573
8912H4863J6834K97742J28511P23616J110530J144155L702758K379057C656051
8902A777391q13609k03596l58521L4097K28443A2956M0456L96915r6748j34517
8892B19062M8932j15391N0056n6921n5820a29725j34778A52719b9259C2841A0701
$$ plain form
8880 180803 -248590 33834 -101853 -184803 -76285 -1920 -117462 52504 -127881 -2898 -48919
8869 -48919 -52635 87780 -21857 -15288 -111420 -557627 -10768 -44266 -38243 -233865 30241 230863
8857 230863 10321 -284480 -335279 71492 -189898 -344551 -45204 3537 -354217 -788 -54986
8846 -54986 155498 240551 -43424 57335 -340094 -210274 -96270 -44773 -9969 95093 172160
$$ packed form
8880A80803b48590C3834a01853q2950g6285a920j15542E2504a27881b898m6021
8869d8919l716H7780b1857O569r6132m46207a0768l3498O023j95622C0241K00622
8857B30863A0321b84480n0799G1492a89898j54653d5204C537c54217g88n4198
8846e4986A55498Q5053d3424E7335c40094J29820i6270d4773i969I5093P7067
$$ [...]
##END NTUPLES=NMR SPECTRUM
##END=
