
##TITLE=UV1132_M4-1010-1000_6275099_8tUyFIO9RN
##JCAMPDX= 6.0         $$ Bruker NMR JCAMP-DX V2.0
##DATA TYPE= NMR SPECTRUM
##DATA CLASS= NTUPLES
##ORIGIN= BRUKER
##OWNER= Administrator
$$ 1.72 TOPSPIN		Version 2.1
$$ 2012-06-02 21:17:08.078 -0500  Administrator@TOPSPIN
$$ Compression mode = diff/dup
##.OBSERVE FREQUENCY= 400.13188235
##.OBSERVE NUCLEUS= ^1H
##.ACQUISITION MODE= SIMULTANEOUS (DQD)
##.ACQUISITION SCHEME= undefined
##.AVERAGES= 8
##.DIGITISER RES= 22
##SPECTROMETER/DATA SYSTEM= spect
##.PULSE SEQUENCE= zg30
##.SOLVENT NAME= COFFEE_meoh
##.SHIFT REFERENCE= INTERNAL, COFFEE_meoh, 1, 14.98061
##AUDIT TRAIL= $$ (NUMBER, WHEN, WHO, WHERE, PROCESS, VERSION, WHAT)
$$ ##TITLE= Audit trail, TOPSPIN		Version 2.1
$$ ##JCAMPDX= 5.01
$$ ##ORIGIN= Bruker BioSpin GmbH
$$ ##OWNER= Administrator
$$ $$ C:\Bruker\TOPSPIN/data/COFFEE/nmr/UV1132_M4-1010-1000_6275099_8tUyFIO9RN/10/pdata/1/auditp.txt
$$ ##AUDIT TRAIL=  $$ (NUMBER, WHEN, WHO, WHERE, PROCESS, VERSION, WHAT)
(   1,<2012-06-02 21:16:59.671 -0500>,<Administrator>,<TOPSPIN>,<go>,<TOPSPIN 2.1>,
      <created by zg
	started at 2012-06-02 21:15:52.859 -0500,
	POWCHK enabled, PULCHK disabled,
       configuration hash MD5:
       D5 CA 7A 23 FE 6B EE E2 50 67 74 61 24 F7 5E 3B
       data hash MD5: 64K
       83 E6 A2 01 F1 6E DB 8A 06 05 89 10 2B E4 D6 1A>)
(   2,<2012-06-02 21:17:03.812 -0500>,<Administrator>,<TOPSPIN>,<proc1d>,<TOPSPIN 2.1>,
      <Start of raw data processing
       efp LB = 0 FT_mod = 6 PKNL = 1 PHC0 = 0 PHC1 = 0 SI = 32K 
       data hash MD5: 32K
       BC 81 2F C9 23 1C EA 88 8F C8 9D B5 38 14 DC 5E>)
(   3,<2012-06-02 21:17:04.140 -0500>,<Administrator>,<TOPSPIN>,<proc1d>,<TOPSPIN 2.1>,
      <pk PHC0 = 211.377 PHC1 = 0 
       data hash MD5: 32K
       0F 00 A0 BD E6 84 34 51 84 5F 0F BD 89 D0 74 7D>)
(   4,<2012-06-02 21:17:04.218 -0500>,<Administrator>,<TOPSPIN>,<proc1d>,<TOPSPIN 2.1>,
      <abs ABSG = 1 
       data hash MD5: 32K
       B8 18 CF 37 25 3A 9B 6F CA D6 C6 E5 D2 DA 5A 7C>)
(   5,<2012-06-02 21:17:04.234 -0500>,<Administrator>,<TOPSPIN>,<proc1d>,<TOPSPIN 2.1>,
      <abs ABSG = 2 
       data hash MD5: 32K
       6F CB EA 1E 22 E5 57 74 6A 58 F4 84 DC 0A 50 33>)
(   6,<2012-06-02 21:17:04.265 -0500>,<Administrator>,<TOPSPIN>,<proc1d>,<TOPSPIN 2.1>,
      <abs ABSG = 3 
       data hash MD5: 32K
       F8 A0 FB 47 F8 DD 80 25 E0 58 C0 15 AD 04 DD FF>)
(   7,<2012-06-02 21:17:04.296 -0500>,<Administrator>,<TOPSPIN>,<proc1d>,<TOPSPIN 2.1>,
      <abs ABSG = 4 
       data hash MD5: 32K
       12 96 26 3A 83 A9 E7 52 03 D4 8B CD BD 24 54 2F>)
(   8,<2012-06-02 21:17:04.328 -0500>,<Administrator>,<TOPSPIN>,<proc1d>,<TOPSPIN 2.1>,
      <abs ABSG = 5 
       data hash MD5: 32K
       F5 08 2D 15 49 B1 C2 99 6F E2 14 C3 4C 20 24 6A>)
$$ ##END=
$$ 
$$ $$ hash MD5
$$ $$ 68 57 AF 81 AE C8 B6 10 FD 57 5B E9 33 AE 9C 6C
##$RELAX= 
##$RELAX= 
##$RELAX= 
##$RELAX= 
##$RELAX= 
##$RELAX= 
##$RELAX= 
$$ Bruker specific parameters
$$ --------------------------
$$ [...]
##$TP= (0..7)
150 150 150 150 150 150 150 150
##$TP07= 0
##$TPNAME0= <>
##$TPNAME1= <>
##$TPNAME2= <>
##$TPNAME3= <>
##$TPNAME4= <>
##$TPNAME5= <>
##$TPNAME6= <>
##$TPNAME7= <>
##$TPOAL= (0..7)
0.5 0.5 0.5 0.5 0.5 0.5 0.5 0.5
##$TPOFFS= (0..7)
0 0 0 0 0 0 0 0
##$TUNHIN= 0
##$TUNHOUT= 0
##$TUNXOUT= 0
##$USERA1= <user>
##$USERA2= <user>
##$USERA3= <user>
##$USERA4= <user>
##$USERA5= <user>
##$V9= 5
##$VALIST= <valist>
##$VCLIST= <CCCCCCCCCCCCCCC>
##$VD= 0
##$VDLIST= <DDDDDDDDDDDDDDD>
##$VPLIST= <PPPPPPPPPPPPPPP>
##$VTLIST= <TTTTTTTTTTTTTTT>
##$WBST= 2048
##$WBSW= 25
##$XGAIN= (0..3)
0 0 0 0
##$XL= 0
##$YL= 0
##$YMAX_a= 542872
##$YMIN_a= -652627
##$ZGOPTNS= <>
##$ZL1= 120
##$ZL2= 120
##$ZL3= 120
##$ZL4= 120
##$ABSF1= 14.98061
##$ABSF2= -5.57192
##$ABSG= 5
##$ABSL= 3
##$ALPHA= 0
##$AQORDER= 0
##$ASSFAC= 0
##$ASSFACI= 0
##$ASSFACX= 0
##$ASSWID= 0
##$AUNMP= <proc_prof1d_extract_pilot.lims>
##$AXLEFT= 0
##$AXNAME= <>
##$AXNUC= <1H>
##$AXRIGHT= 0
##$AXTYPE= 0
##$AXUNIT= <>
##$AZFE= 0.1
##$AZFW= 0.1
##$BCFW= 0
##$BC_mod= 0
##$BYTORDP= 0
##$COROFFS= 0
##$CY= 15
##$DATMOD= 1
##$DC= 0
##$DFILT= <>
##$DTYPP= 0
##$F1P= 0
##$F2P= 0
##$FCOR= 0.5
##$FTSIZE= 32768
##$FT_mod= 6
##$GAMMA= 0
##$GB= 0
##$INTBC= 1
##$INTSCL= 1
##$ISEN= 128
##$LB= 0
##$LEV0= 0
##$LPBIN= 0
##$MAXI= 10000
##$MC2= 0
##$MEAN= 0
##$ME_mod= 0
##$MI= 0
##$NCOEF= 0
##$NC_proc= -8
##$NLEV= 6
##$NOISF1= 0
##$NOISF2= 0
##$NSP= 0
##$NTH_PI= 0
##$NZP= 0
##$OFFSET= 14.98061
##$PC= 1
##$PHC0= 211.377
##$PHC1= 0
##$PH_mod= 1
##$PKNL= yes
##$PPARMOD= 0
##$PPDIAG= 0
##$PPIPTYP= 0
##$PPMPNUM= 2147483647
##$PPRESOL= 1
##$PSCAL= 4
##$PSIGN= 0
##$PYNMP= <proc.py>
##$REVERSE= no
##$SF= 400.13
##$SI= 32768
##$SIGF1= 0
##$SIGF2= 0
##$SINO= 400
##$SIOLD= 32768
##$SPECTYP= <>
##$SREGLST= <1H.CDCl3>
##$SSB= 0
##$STSI= 32768
##$STSR= 0
##$SW_p= 8223.68421052632
##$SYMM= 0
##$S_DEV= 0
##$TDeff= 65536
##$TDoff= 0
##$TI= <>
##$TILT= no
##$TM1= 0
##$TM2= 0
##$TOPLEV= 0
##$USERP1= <user>
##$USERP2= <user>
##$USERP3= <user>
##$USERP4= <user>
##$USERP5= <user>
##$WDW= 1
##$XDIM= 32768
##$YMAX_p= 462537851
##$YMIN_p= -670515
##$CURPLOT= <Network HP LaserJet P1505>
##$CURPRIN= <$Network HP LaserJet P1505>
##$DFORMAT= <normdp>
##$LAYOUT= <+/1D_H.xwp>
##$LFORMAT= <normlp>
##$PFORMAT= <normpl>
##$SURQMSG= 1
$$ End of Bruker specific parameters
$$ ---------------------------------
##NTUPLES= NMR SPECTRUM
##VAR_NAME=  FREQUENCY,     SPECTRUM/REAL,   SPECTRUM/IMAG
##SYMBOL=    X,             R,               I
##VAR_TYPE=  INDEPENDENT,   DEPENDENT,       DEPENDENT
##VAR_FORM=  AFFN,          ASDF,            ASDF
##VAR_DIM=   32768,         32768,           32768
##UNITS=     HZ,            ARBITRARY UNITS, ARBITRARY UNITS
##FACTOR=    0.250966925370066, 1,           1
##FIRST=     8223.43324360095, -34147,       44005
##LAST=      0,             78539,           -295972
##MIN=       0,             -670515,         0
##MAX=       8223.43324360095, 462537851,    0
$$ Real data points
##PAGE= N=1
##DATA TABLE= (X++(R..R)), XYDATA
$$ [...]
19549a44383L6211j31298C83828f3853A64233c6441j13505O348j90541B56380
19538a90668G7141a46114G5715O4810a89289m8504R2898j10890a27198F8258K15286
19527B83544a08198B78665a30286A72248c44636A51431c33932A04591H549K78464
19517B87013b35913C09562A18511b61569f8969H2148c18436A03212d01591g3981
19506A39403b95736A17583m7740b28945C1533J76332B7863L7292J82113e5982
19495E6808c1290j05306A52221a09850D4309J19194a68896a0236r9257H8083a37936
19483D9554K427a45992C0687a89858R2380j86027C8073a02318L3434j57947g0978
19471b0102j4897l03308a19671d3112j26646H5987R2912b46703g9475e820j23064
$$ y = [-144383, -108172, -239470, 383828, -63853, 164233, -36441, -149946, -143598, -334139, 256380, -190668, 77141, -146114, 75715, 140525, -189289, -237793, -144895, -255785, -127198, 68258, 283544, -108198, 278665, -130286, 172248, -344636, 151431, -333932, 104591, 8549, 287013, -235913, 309562, 118511, -261569, -68969, 82148, -318436, 103212, -401591, -73981, 139403, -295736, 117583, 69843, -228945, 31533, 207865, 27863, 65155, 247268, -55982, 56808, -31290, -136596, 152221, -109850, 44309, 163503, -168896, -10236, -109493, 88083, -137936, 49554, 51981, -145992, 30687, -189858, -97478, -283505, 38073, -102318, -68884, -226831, -70978, -20102, -34999, -338307, -119671, -43112, -169758, 85987, 178899, -246703, -79475, -5820, -128884]
19460a28884J9653J1378j15484B04914A1161M6199d8930k3628k19029c1677C2435
19448b11709g3635j59063g2080j58372C34902b01124k8864J01689M9489o5433
19438a44243j78249C32110B9909a34085K2755A3491J47269a27775j43038J4256
19428b56557D82919A25169G568K2400j2440b4702B88453c09154j0059A89465b62621
19416b98072c5205l51656f5524j23561h8275k69307d78A75267J17009A17114b79352
19404F4062a12663A69485A3865K27582q2368A794b79479c9601A00220a73864d3400
19392b57804C10613j11464a10346j25453H1774D0666b27418a09342m5874o5819
19382b21035B6608f5222k37856d1753k13502B88682D6451b17238R8138C50749
$$ y = [-128884, -109231, -97853, -213337, 204914, 11161, 57360, -48930, -72558, -291587, -31677, 32435, -211709, -73635, -232698, -72080, -230452, 334902, -201124, -229988, -128299, -78810, -144243, -322492, 332110, 29909, -134085, -111330, 13491, 160760, -127775, -270813, -256557, 482919, 125169, 7568, 29968, 17528, -24702, 288453, -309154, -319213, 189465, -262621, -298072, -35205, -386861, -65524, -189085, -88275, -357582, -478, 175267, 292276, 117114, -279352, 64062, -112663, 169485, 13865, 241447, 159079, 1794, -279479, -39601, 100220, -173864, -43400, -257804, 310613, 199149, -110346, -235799, 81774, 40666, -227418, -109342, -155216, -221035, 26608, -65222, -303078, -41753, -255255, 288682, 46451, -217238, -119100, 350749]
19371a31509D4328J04796a08397j43595n8246P1596A12017i1819B47727b67397
19360B16684a34163L0837j59946J30210O5391A23773b06221k20960H1946g3901
19349F9524C1581a68239N5997c6160j69920n0250a1962A65037a84355A67329a57251
19337C8864a65489M7046B6808L937L7034b42954j89867i4526l94251c6963A6083
19325b17527r658h388p175B24856d9807q8391o228A76214G5181l1317b58968A8195
19312b86508Q4464B42301h0185m62144K5071b26814l0695B8253h1353B67334A28887
19300a68096A35805b73932j1732e3746j22734E3113a81657j61571P8473J32284
19290a32471J9217C80649b29956E8641J71634a2268k00147C7023b655j56650b3824
$$ y = [-131509, 44328, 149124, -108397, -251992, -310238, -238642, 112017, -91819, 247727, -267397, 216684, -134163, -103326, -263272, -133062, -67671, 123773, -206221, -427181, 81946, -73901, 69524, 31581, -168239, -112242, -36160, -206080, -256330, -11962, 165037, -184355, 167329, -157251, 38864, -165489, -118443, 26808, 30745, 67779, -242954, -432821, -94526, -488777, -36963, 16083, -217527, -227185, -8388, -15563, 224856, -49807, -138198, -144426, 176214, 75181, 43864, -258968, 18195, -286508, -202044, 242301, -80185, -542329, -517258, -226814, -257509, 28253, -81353, 267334, 128887, -168096, 135805, -273932, -285664, -53746, -176480, 53113, -181657, -343228, -264755, -132471, -113254, 380649, -229956, 58641, 230275, -12268, -212415, 37023, -2655, -159305, -23824]
19278i1236m967G8346e1878k96967J24577B06838E3593a31486G0501c16645D3399
19266B4858a34699j95398a43646A5269a27895A68507l8394b83700e2825J7733
19256c5092q7488F6211K07755h2635q3054M0746J3012A81884C6432a39946A85906
19244g7989A43309e9793E2266K96591a73863A09685i0451r3622m8434A87546a18010
19232F4473b46362i3626K0882n03539C282J5032K1537a06547K0065q8079l794
19221a78355A331O4730a80905A11994O5886c12750k8069J20529N1472k13524J57341
19210b25001a00875H1247K22086a48975j95656A37133b70099J21674a068j36322
19200a37390f2801A11694b87217R1271A33706j3858a0713r4858a9851n9803J9542
$$ y = [-91236, -96203, 78346, -51878, -348845, -224268, 206838, 53593, -131486, 70501, -316645, 43399, 24858, -134699, -330097, -143646, 15269, -127895, 168507, 130113, -283700, -52825, -35092, -122580, 66211, 273966, -82635, -165689, -124943, -111931, 181884, 36432, -139946, 185906, -77989, 143309, -59793, 52266, 348857, -173863, 109685, -90451, -184073, -232507, 187546, -118010, 64473, -246362, -93626, -72744, -576283, 3282, 18314, 39851, -106547, -86482, -174561, -178355, 1331, 66061, -180905, 111994, 177880, -312750, -340819, -220290, -168818, -382342, -225001, -100875, 81247, 303333, -148975, -344631, 137133, -270099, -148425, -1068, -137390, -62801, 111694, -287217, -195946, 133706, 119848, -10713, -105571, -19851, -79654, -60112]
19189f0112k86168a09594C45429b22512A72687k0682l5859Q2298b14297E7965
19178G1485L4985a5759j56264o805c5054A01098M7793D5571P8270d05924a84206
19166A9378H937J8934J67307H4133R0927n5335b16744P4869j78957N7559O3722
19155a99551A38711a64258j35712E4229a20668K9118L9618r2153L3202m6887A82628
19143A25416d166F8180b65874M8380B43145a24543j38605D9397Q8757a8094H3993
19131B86553g0027J012b3259C2687a76360B5850h1286A74475D1086i6436b9080
19119b7696r5581B14866b0724l4344j46334A10138a09451c6216l34447a71704
19108b58856A07904K4854b70517H6994a65609O3733M8177G3296a7642o6798l3359
$$ y = [-60112, -346280, -109594, 345429, -222512, 172687, 152005, 116146, 198444, -214297, 57965, 71485, 106470, -15759, -172023, -178828, -35054, 101098, 148891, 45571, 123841, -405924, -184206, 19378, 8937, 27871, 195178, 84133, 175060, 119725, -216744, -141875, -320832, -263273, -199551, 138711, -164258, -299970, 54229, -120668, -91550, -51932, -144085, -110883, -157770, 182628, 125416, -4166, 68180, -265874, -217494, 243145, -124543, -263148, 49397, 138154, -18094, 83993, 286553, -70027, -69015, -23259, 32687, -176360, 25850, -81286, 174475, 41086, -96436, -29080, -27696, -123277, 214866, -20724, -55068, -201402, 110138, -109451, -36216, -370663, -171704, -258856, 107904, 132758, -270517, 86994, -165609, -101876, -53699, 73296, -17642, -84440, -117799]
19097a17799r6191B90967a9339D3630a67862A9820b41011j46524J72310Q2382
19087a32843O5674j03049A08370g3748B47846g8567j6908j01373B39648b56986
19076a294A25906d73385I5460f3917j62049A47038o460a79672d114j36537D01847
19064B0427b8301A22767c5165B95307a39018I317b99466A87212a6502m6662k57537
19053c20701g5041j40385d069A32217b33999G3887a86596k6668I3101b05914m6000
19042b51914A22067b79854B5929a8060k35641A49129H429c48234G0478b38354
19031b69564B70808j17005c20639A65163D9263a00646B97867A31304e8585C39427
19020f4590m9891E5520e1560j65649H298d2517C81945H391L40533G9928K33742
$$ y = [-117799, -213990, 290967, -19339, 43630, -167862, 19820, -241011, -387535, -215225, -132843, -67169, -170218, 108370, -73748, 247846, -78567, -95475, -196848, 239648, -256986, -1294, 125906, -473385, 95460, -63917, -225966, 147038, 140578, -179672, -4114, -140651, 401847, 20427, -28301, 122767, -35165, 295307, -139018, 9317, -299466, 187212, -16502, -63164, -320701, -75041, -215426, -4069, 132217, -233999, 73887, -186596, -213264, 93101, -205914, -251914, 122067, -279854, 25929, -18060, -253701, 149129, 8429, -348234, 70478, -238354, -269564, 270808, 153803, -320639, 165163, 49263, -100646, 297867, 131304, -58585, 339427, -64590, -114481, 55520, -51560, -217209, 8298, -42517, 381945, 8391, 348924, 79928, 313670]
19009C13670b89410C7127L83730j14456o5190j18178J71185R536o9913m4559a2683
18997g5288r5657A95793m4739c75750a84828O0053n5875f2471n4224j92309B7378
18985C5265c9059g704D9515a64499a5112p0440n7702j65233i3043k81805b2366
18973a9936j32985e5478j70398A15242g7293j37191d0150k00246R3563f1954A04556
18961d13417J76697c183A92450c6785j99845B00792a8166j97912A39375a38004
18950i7625l04G3664J25280E3471b93466f7615j30903i3567k80083B02663a38386
18938a06923j977m0254q240n2966g8724L3143k7245B0061e6345q992H6306K40604
18926C26910a09990A65106c56802F560K34695d4835r6973j36648A7711J16668
$$ y = [313670, -289410, 37127, 420857, 306401, 241211, 123033, 294218, 303754, 233841, 189282, -12683, -75288, -170945, 195793, 151054, -375750, -184828, -124775, -180650, -62471, -116695, -309004, 27378, 35265, -39059, -7704, 49515, -164499, -15112, -85552, -143254, -308487, -93043, -374848, -22366, -19936, -152921, -55478, -225876, 115242, -77293, -214484, -40150, -240396, -146833, -61954, 104556, -413417, -236720, -3183, 192450, -36785, -236630, 200792, -18166, -216078, 139375, -138004, -97625, -97929, 73664, 198944, 53471, -293466, -67615, -198518, -93567, -373650, 202663, -138386, -106923, -108900, -149154, -157394, -210360, -78724, -45581, -72826, 20061, -56345, -65337, 86306, 326910, -109990, 165106, -356802, 6560, 241255, -44835, -141808, -278456, 17711, 134379]
18916A34379c56785a60507e2365j28717O2975m4804A37191b10502g0425k0363
18906i0788l2251r2009A44462J018a41501A12807j4361K0669J01619i5125A19923
18894A33060N7784e5545j5498I5903K86492G1521b75850A76255M326c0153D0521
18882g8234j68659B1603K4005J50821b9493k33808A73143j3678a42705M7493L7199
18871e8013A34714H957K2108b01874L6472d6094a4926p0664A94963c88618J18980
18860b69638a02134n3992C3903b72477A4992a09520M6842k5343I3158b4690j80793
18849b05483e9036q4770A39605n1309c53250I4209b51713q3589G5252d38043J85900
18838b52143c6544l5909A48791j6836E1599d7872A01734c1280q355j86736M5100
$$ y = [134379, -356785, -160507, -52365, -181082, -118107, -162911, 137191, -210502, -70425, -90788, -123039, -215048, 144462, 145480, -141501, 112807, 98446, 119115, 220734, -95125, 119923, 133060, 190844, -55545, -71043, 95903, 382395, 71521, -275850, 176255, 180581, -30153, 40521, -78234, -246893, 21603, 45608, 196429, -29493, -263301, 173143, 159465, -142705, -95212, -58013, 134714, 8957, 31065, -201874, -165402, -46094, -14926, -85590, 194963, -388618, -269638, -102134, -156126, 33903, -272477, 14992, -109520, -62678, -88021, 93158, -24690, -205483, -59036, -143806, 139605, 88296, -353250, 94209, -251713, -335302, 75252, -438043, -252143, -36544, -72453, 148791, 131955, 51599, -47872, 101734, -31280, -39635, -226371, -181271]
18827a81271p2490a04232j39545A39495a58808q2990B6498a40689A47537c55411
18816a49714A8859b74883G808K5056i7565C9929J0416a3978j28958f7409E4674
18804A40457J71000b82921B08007b39499A88204J39944c7314l539k6958B88893
18793A36809D2928c05273A20057a22812H5647a55692M554j4010a6430B33611a3691
18781a23240k52507P1180A80265o9573L3089c8518m4027m8438B61509c05600A3981
18769b86499i047j42560j05495A23279g4816c1146g880A5869d1391o233A44443
18757e0623j06862A81223h2214D33466b71921P9814a8o2464j04320j739d4107
18745a78705A5575a48009j28667D4271a09040B1457f4321D0974h6452q8919g924
$$ y = [-181271, -253761, -104232, -243777, 139495, -158808, -241798, 26498, -140689, 147537, -355411, -149714, 18859, -274883, 7808, 32864, -97565, 39929, 50345, -13978, -142936, -67409, 54674, 140457, 311457, -282921, 208007, -239499, 188204, 328148, -37314, -40853, -67811, 288893, 136809, 42928, -305273, 120057, -122812, 85647, -155692, -151138, -165148, -16430, 233611, -13691, -123240, -375747, -304567, 180265, 110692, 143781, -38518, -82545, -130983, 261509, -305600, 13981, -286499, -9047, -151607, -257102, 123279, -74816, -31146, -7880, 15869, -41391, -47624, 144443, -50623, -157485, 181223, -82214, 433466, -271921, -192107, -18, -62482, -166802, -168541, -44107, -178705, 15575, -148009, -276676, 44271, -109040, 21457, -64321, 40974, -86452, -175371, -7924]
18733I1971J76786a7214j08777a2109B2029K86749h2543C2755J35724h6544d681
18721D958c5391j51348A95780b73344n6279C22657A04795b1853j31941O5241k23684
18710c12237G9440e2924k93749a8615A67761C6184J49053K06446a76381A38075
18699a17455n0839p5512A5317N6066J41444D352i5705k50677C5235d1762r1488
18688a33250j78635g6645n493E3540J82807a53825n9067r5634d476H7322i2921
18676c3787G7136e01529G6932j7247k0366a57006J3090A34899b40167C481J68756
18665A72237a23390A36088R2726H1337a82763B39149a9433A17368a09517j84277
18655b93794I4657b69820M7570B2713o255i6156C3637K39481g6025G1221a210
$$ y = [91971, 268757, -17214, -125991, -12109, 22029, 308778, -82543, 32755, 168479, -86544, -4681, 4958, -35391, -186739, 195780, -273344, -329623, 322657, 104795, -21853, -153794, -88553, -312237, 79440, -52924, -346673, -18615, 167761, 36184, 185237, 391683, -176381, 138075, -117455, -168294, -243806, 15317, 71383, 212827, 4352, -95705, -346382, 35235, -41762, -133250, -311885, -76645, -82138, 53540, 236347, -153825, -212892, -308526, -4476, 87322, -92921, -33787, 77136, -501529, 76932, 59685, 39319, -157006, -143916, 134899, -240167, 3481, 172237, -123390, 136088, 228814, 81337, -182763, 239149, -19433, 117368, -109517, -293794, 94657, -269820, -222250, 22713, 16458, -96156, 33637, 273118, -76025, 71221, -1210]
18643b2547j10133K8226a4055q8878A02656g7638q0963N0119F1360e0431C5178
18631A3661P5115b4469D0626a62461A0299c62579J57411c7806j99503A44303a67197
18619c0332A35988a92759N7611A2224M3797J45664c02398a7038j13188m4700d9705
18607b07411O8473A90817a53465f4897B9530n710i9207h596A56986a59321I3487
18595g2396A24576f0111A07489b17103B23303c34555L2856G868a10714d4419B199
18583a6702j32135O9279a8776r7243L6748L4481k23366L4387q9400F9355e1873
18571a26780c9792o4326n7763M0458L1213C7880M75892A4246a21205j95758h777
18559A17710d1014I985a68191A82163a4858A16683C7854J02494l3973a17088l4617
$$ y = [-22547, -132680, -104454, -14055, -102933, 102656, -77638, -158601, -108482, 61360, -50431, 35178, 13661, 88776, -24469, 40626, -162461, 10299, -362579, -205168, -37806, -237309, 144303, -167197, -30332, 135988, -192759, -135148, 12224, 56021, 201685, -302398, -17038, -130226, -174926, -49705, -207411, -138938, 190817, -153465, -64897, 29530, 23820, -99207, -8596, 156986, -159321, 93487, -72396, 124576, -60111, 107489, -217103, 223303, -334555, -301699, 7868, -110714, -44419, 2199, -16702, -148837, -79558, -18776, -116019, -79271, -44790, -268156, -233769, -323169, 69355, -51873, -126780, -39792, -104118, -161881, -121423, -90210, 37880, 513772, 14246, -121205, -316963, -8777, 117710, -41014, 9985, -168191, 182163, -14858, 116683, 37854, 140348, 106375, -117088, -151705]
18548a51705E0592i1410k69050J12319A22P7536f7537B5652a39597o6663C5198
18536A13358R834b31867d9239k3767j46577a9845m1878k3010p9133C2231L66836
18525C99067E0870H013b42236P0264J6831F2334a86396i0420B37988G7811d0334
18513D9590a75365b6223j67031d7398q0673H2945c06810i0423A6495O3076d8904
18501A49884a67740d0052o9080o3615B40029a73759q9750A24359b81863J10109
18491a71754f3896j89676J938A9895O051J19654E1231O4734c80322f899C2026
18479A03748a65794j81154C8040a04614k49762A07350J68732b41023A43290b88795
18468A1621a07592A19873h6070p9986h2860M0023F0124R4781B5812i0242L7696
$$ y = [-151705, 50592, -91410, -360460, -248141, 122, 77658, -67537, 25652, -139597, -206260, 35198, 113358, 123192, -231867, -49239, -73006, -219583, -19845, -61723, -84733, -163866, 32231, 399067, 50870, 8013, -242236, -171972, -155141, 62334, -186396, -90420, 237988, 77811, -40334, 49590, -175365, -26223, -193254, -47398, -128071, 82945, -306810, -90423, 16495, 79571, -48904, 149884, -167740, -40052, -109132, -172747, 240029, -173759, -263509, 124359, -281863, -171754, -63896, -253572, -251634, 19895, 25946, 145600, 51231, 115965, -380322, -6899, 32026, 103748, -165794, -346948, 38040, -104614, -354376, 107350, 276082, -241023, 143290, -288795, 11621, -107592, 119873, -86070, -166056, -82860, -42837, 60124, 154905, 25812, -90242, -52546]
18457e2546k73209G5176i0801j06558o62d4915H3712b57669c2932D92b29943i9944
18444C8302j4016L33780b70194A10768P1733a75150p7755A06036a15160j4749
18434a29909E4382N7324e1261A87181k974m6469a99865H7706i2091k3473G5952
18422E4487j4504J6189j2096a99584o9490J17343r6995d4800k9562A7462d5904
18410C5561R6328n5642r236L411J41406H6191f5017j8431l5434q940q7573h9664
18397E7135a11891D56084b06749e7939F7260C702K1807J24455K28429c56384i0404
18385a15733A07578d1323A33328b24638H0102d3472m83413E1321J5566B9973O7117
18374I7090J7818c3600B93771C6197h3320k3006B0915c48064a42836j2000M7852
$$ y = [-52546, -325755, 75176, -90801, -197359, -198021, -44915, 83712, -257669, -32932, 492, -229943, -99944, 38302, 24286, 358066, -270194, 110768, 182501, -175150, -252905, 106036, -115160, -129909, 54382, 111706, -51261, 187181, 184207, 137738, -199865, 87706, -92091, -115564, 75952, 54487, 39983, 56172, 44076, -199584, -269074, -151731, -248726, -44800, -74362, 17462, -45904, 35561, 131889, 76247, 67011, 70422, 211828, 86191, -65017, -83448, -118882, -127822, -215395, -89664, 57135, -111891, 456084, -206749, -57939, 67260, 3702, 25509, 149964, 378393, -356384, -90404, -115733, 107578, -41323, 133328, -224638, 80102, -43472, -526885, 51321, 66887, 29973, 97090, 114908, -33600, 293771, 36197, -83320, -106326, 20915, -348064, -142836, -154836, -106984]
18363a06984m039A3909b46509m5661j32921B54742I402a45190N0956D6734J77803
18352B24537j03460M3125C6704Q1372J9487J45449a3247C52281d7296j21987J9035
18341a50248k20884A74701a33263C5016a12803p575a6485m1032A91824a57426
18330A41806b51331A28364N7784b7695j20668B58000a70074A77168a87426I4720
18319a63751C97493B2828N7884C1982e0622B32402C3925b26810K8956R7099G5199
18307b37642m08c0331m6428k01619A46795o7902L7214J198P9062b01802F3530
18295a17519M4694B35208l5941e81473B09152a28894j17100B20651g1353D9662
18284D0581c04276P5408E3013g8275G9347b65598A50449b07569A49841a48314
$$ y = [-106984, -111023, 13909, -246509, -292170, -425091, 254742, 9402, -145190, -94234, 46734, 224537, 121077, 164202, 36704, 118076, 137563, 283012, -13247, 352281, -47296, -169283, -150248, -371132, 174701, -133263, 35016, -112803, -120378, -16485, -57517, 191824, -157426, 141806, -251331, 128364, 186148, -27695, -148363, 258000, -170074, 177168, -187426, 94720, -163751, 397493, 22828, 80712, 31982, -50622, 232402, 33925, -226810, -197854, -100755, 75199, -237642, -238050, -30331, -76759, -278378, 146795, 78893, 116107, 117305, 196367, -201802, 63530, -117519, -72825, 235208, 199267, -581473, 209152, -128894, -245994, 220651, -71353, 49662, 40581, -304276, -228868, 53013, -78275, 79347, -265598, 150449, -207569, 149841, -148314]
18273G9770J36085a2208G7105i5656A02954a48574M7422A03787c4380n4807C71677
18261i6300B06689a64460J6792O4648c220p4266E2495A1281a7719E3774a52971
18249a20009k27676C03156p5887c6435C0700a88892A62377b7705E4037J3866b46541
18237b7769A8710d03748A11660i304G3294O9524p028J59536D7141a05006n3372
18226a58378f2959A494a37461A57097b55525J07019e4181A32566C0152J14969
18216A45121h9754h295A58304r854a05268j52302e1621a6558A8019b77129c6475
18204b8523C96516a46768E6712K49884H0171J86670A19437K9252b85780A67953
18193a17168b735A13274a89382e9583B33480b55385a4876j34977L4267A06682
$$ y = [79770, 215855, -12208, 77105, -95656, 102954, -148574, -101152, 103787, -34380, -89187, 371677, -96300, 206689, -164460, -147668, -83020, -3220, -77486, 52495, 11281, -17719, 53774, -152971, -120009, -347685, 303156, 227269, -36435, 30700, -188892, 162377, -27705, 54037, 67903, -246541, -27769, 18710, -403748, 111660, -9304, 73294, 142818, 135790, 295326, 47141, -105006, -158378, -62959, 1494, -137461, 157097, -255525, -148506, -54181, 132566, 30152, 145121, -89754, -8295, 158304, 148450, -105268, -257570, -51621, -16558, 18019, -277129, -36475, -28523, 396516, -146768, 56712, 306596, 80171, 266841, 119437, 148689, -285780, 167953, -117168, -2735, 113274, -189382, -59583, 233480, -255385, -14876, -149853, -115586, 106682]
18182a77710A60053a59583N6519c3153l13964A00927K3108a96977D5693J8186
18172F3879L1239C2737K9982c824o111F9377a07624C17399b17209h5466j10615
18161a96081R5939j18311E9379P0713a77345D1474a97189c9670k23377L5660b2122
18149A731J55311b74907I9104a5895A30290a13190N5609l219D1657a17502c5097
18137A69702c24656a51301o1351N7130A38304c0827j61298B5148Q6352d1935j9432
18126f1367j39782B0834K1592b08537C56411a17574D5056h1230B6026K97794F9704
18114c48515a48067A32475k8934K19800a72286l5552B98502l7227E170O4621a62231
18102a028r6181J2637j75109A13324c16644C4320J80506c4134j18385J8961H6909
$$ y = [-177710, 160053, -159583, -103064, -33153, -347117, 100927, 124035, -196977, 45693, 63879, 95118, 32737, 62719, -3824, -9935, 69377, -107624, 317399, -217209, -85466, -196081, -100142, -218453, 59379, 130092, -177345, 41474, -197189, -39670, -263047, -227387, -22122, 1731, 157042, -274907, 99104, -15895, 130290, -113190, -57581, -60800, 41657, -117502, -35097, 169702, -324656, -151301, -212652, -155522, 138304, -30827, -192125, 25148, 111500, -41935, -61367, -201149, 20834, 42426, -208537, 356411, -117574, 45056, -81230, 26026, 323820, 69704, -348515, -148067, 132475, 103541, 323341, -172286, -207838, 298502, 261275, 5170, 69791, -162231, -1028, -97209, -84572, -259681, 113324, -316644, 34320, 214826, -34134, -152519, -133558, 86909]
18090C99478a18621j90470f7871J5585A08638N6821f0415l7099a843B53361b65038
18078C36958f8912K0371j53958j0363a03768n4974m974n6152F8828f464D5772
18066H4595A4249g788I7293a72561k46833b5680E8710a03221K5657n0208F7971
18054I5357J17620n116h6004l20215B86168A1950J54362p1472a92574A11881n3355
18043E8526j1995a2422m10621A83803g4604j35531Q0625c5142F3729M7981e5855
18031c81256B94938A32265R633a18636j19545O5811D4412K60940b6921E1171P2301
18020A23472b72196A23245a75076e7957G0916b09052b4208B50201a06697C8199
18009B90215c1504j00302A61676a73215j37853C8922j3263J48308c13462A25113
$$ y = [399478, -118621, -309091, -67871, -52286, 108638, 165459, -60415, -97514, -1843, 253361, -265038, 336958, -68912, -48541, -202499, -212862, -103768, -158742, -163716, -219868, 68828, -6464, 45772, 84595, 14249, -7788, 97293, -172561, -419394, -25680, 58710, -103221, -77564, -127772, 67971, 95357, 212977, 207861, -86004, -406219, 286168, 11950, 166312, 94840, -192574, 111881, 58526, 46531, -12422, -423043, 183803, -74604, -210135, -129510, -35142, 63729, 111710, -55855, -381256, 294938, 132265, 141898, -118636, -238181, -172370, 44412, 305352, -26921, 51171, 123472, -272196, 123245, -175076, -57957, 70916, -209052, -24208, 250201, -106697, 38199, 290215, -31504, -131806, 161676, -173215, -311068, 38922, 25659, 173967, -313462, 125113]
17998a78n8752o4470Q568a9900m90j55413E8739a41536L1393n9424j34412A6555
17985E4279B4653a23846k39066e6926E0706a00706B03954m9556L691a13995I7828
17973a26060H7626a31904j0099N1542b9271o2755m0011j28808H6343c23422a58659
17961i9811g942q2581G3209a89594l24156a51034f1382E2193J55857b60029g9019
17949D4798A8855a04316D75060A63411a33162B9009a73107B5473f8252C6019i2557
17937D7256M9059c13095J29184B495J47547J51854D8260a80857B18925a67911
17926a83486G5001b44817A14513a1077j7513j02619C475J33340J00555n4364P8400
17915B61406j22599Q352d1068k9776B17734A2645L11501F0590h2694k0954B29772
$$ y = [-178, -58930, -123400, -114832, -19900, -20390, -175803, 58739, -141536, -110143, -169567, -303979, 16555, 54279, 24653, -123846, -362912, -56926, 50706, -100706, 203954, 154398, 158089, -113995, 97828, -126060, 87626, -131904, -142003, -90461, -29271, -92026, -132037, -260845, 86343, -323422, -158659, -99811, -7942, -90523, 73209, -189594, -513750, -151034, -61382, 52193, 208050, -260029, -79019, 44798, 18855, -104316, 475060, 163411, -133162, 29009, -173107, 25473, -68252, 36019, -92557, 47256, 96315, -313095, -183911, 2495, 150042, 301896, 48260, -180857, 218925, -167911, -183486, 75001, -244817, 114513, -11077, -28590, -131209, 3475, 136815, 237370, 183006, 261406, 138807, 147159, -41068, -70844, 217734, 12645, 324146, 60590, -82694, -103648, 229772]
17903E2629M7619K33065A39692D0908a15285A70354a18180B534M8818J67038H3268
17891F9642J10693B3230J5982K11931j02687N9198a44706A96574n4044J8578P7108
17880B38216N5226A5097a6546E97096F8393J01238C9597J51596F9725K1062i6411
17868a34098j67332c2300j30993B33461G4404i6115j14298j07495B10863b85845
17857d5449j5524B6767J69759R2169a42219g0666A16521b06778I5620b50987A49110
17845I0348f5441q1178C148a39909r755j11273a9550l3533k28333a31672l19977
17834d51649A87893h6709k36188J1645i3025k4600G438h2663A32143D9203a74675
17822d2993A82663c13047i4346F0240J6190J14543f7270C869i9834K9256o5777
$$ y = [52629, 100248, 333313, 139692, 40908, -115285, 170354, -118180, 2534, 51352, 218390, 83268, 69642, 180335, 23230, 39212, 251143, 148456, 207654, -144706, 196574, 142530, 161108, 238216, 293442, 15097, -16546, 597096, 68393, 169631, 39597, 191193, 69725, 90787, -96411, -134098, -301430, -32300, -163293, 233461, 74404, -96115, -210413, -317908, 210863, -285845, -45449, -60973, 26767, 196526, 288695, -142219, -70666, 116521, -206778, 95620, -250987, 149110, 90348, -65441, -146619, 3148, -139909, -149664, -260937, -19550, -53083, -281416, -131672, -451649, 187893, -86709, -322897, -311252, -93025, -117625, 7438, -82663, 132143, 49203, -174675, -42993, 182663, -313047, -94346, 60240, 76430, 190973, -67270, 3869, -99834, -70578, -136355]
17811a36355F9761B0119a51773l4578e7918r6758A40565j3424m9601O794j0738
17800G3596M9798a68859M387O3963B08737B8390L5469c18318F7789J40592o9851
17789A38530A0233f8004A26772J68687A34134J35193C2519L23587j22677F8192
17778F9554A8242J38644J00173l6232J32446A19412J53329G8219f859D03202j83360
17767B19842q558b14036L42J0844A14592b89244C6875e5707A50691b10801I3802
17755b22567O3755K1022A57692j1039k7599a65896j53767a11259b9463n6851j89716
17744b76030R2025e7368K2782m2611j94654e4773H9072a54407I4250A2643i4280
17732A48159m7772A3928K82001A34894l331b39788I7442a85840I4920J25161a26816
$$ y = [-136355, 69761, 20119, -151773, -186351, -57918, -154676, 140565, 127141, 77540, 84334, 73596, 123394, -168859, -164472, -100509, 208737, 28390, 63859, -318318, 67789, 208381, 138530, 10233, -68004, 126772, 295459, 134134, 269327, 32519, 356106, 233429, 68192, 69554, 18242, 156886, 257059, 220827, 353273, 119412, 272741, 78219, -6859, 403202, 219842, 211284, -214036, -213694, -202850, 114592, -289244, 36875, -55707, 150691, -210801, 93802, -222567, -158812, -137790, 157692, 146653, 119054, -165896, -319663, -111259, -29463, -86314, -276030, -184005, -57368, -34586, -77197, -271851, -54773, 89072, -154407, 94250, 12643, -94280, 148159, 100387, 13928, 295929, 134894, 131563, -239788, 97442, -185840, 94920, 220081, -126816]
17720C4572K53182A43571B0693c20159i9568d5907J0751j32973P8428C9140a10137
17708B02205L5169c4125C10932j21399a76553c4513H2191a44056l8253E6505a04279
17696a61167K7505M6901c6596B9077O2509a63901B0931J50217K73786a13493j09553
17685b23046C1933i4551A62589a14765C49232b73458E0375R3617c7275G8909J36156
17674B15065J07901h4735A759h3663p2231A3467f4438b5768A04191O2682n3438
17663A13435C3581b1508D9383K85488A22788d0408P529A33064h7355m1651l0243
17652a59249O4612A78281F6930b84263c777m3564A87505G5690a73145E4052a43008
17640d2150C39143B5568K91473l9893a46251f8671B75752K6032c7779j2307A5867
$$ y = [34572, 287754, 143571, 20693, -320159, -99568, -45907, -35156, -168129, -89701, 39140, -110137, 202205, 237374, -34125, 310932, 189533, -176553, -34513, 82191, -144056, -182309, 56505, -104279, -161167, -133662, -86761, -36596, 29077, 91586, -163901, 20931, 171148, 444934, -113493, -223046, 31933, -94551, 162589, -114765, 349232, -273458, 50375, 143992, -37275, 78909, 215065, 322966, -84735, 1759, -83663, -155894, 13467, -64438, -25768, 104191, 166873, 113435, 33581, -21508, 49383, 334871, 122788, -40408, -32879, 133064, -87355, -129006, -159249, -94637, 178281, 66930, -284263, -3777, -47341, 187505, 75690, -173145, 54052, -143008, -42150, 339143, 25568, 317041, 277148, -146251, -68671, 275752, 301784, -37779, -50086, 15867]
17628f7664k58917A18480O6159f5516B05109c6330A89864G6977a55837A00768
17617B40039k1644e6945B8388b53942A49962B9323J38439D8385J29708f6309B07470
17605D7331R809L6743R2093a45084C37468A44716O2476A0513J7046b59B294J88494
17593A90788F120N6189k831a21478j97502A84949k3006h0531J4065B42095e8498
17581E895c2859B56699b17942A02567E1201J34628a36888E4983J32429a33765
17570A15904c6998D01197j84338E4497b86142A7386J01162a27185o8442C46895
17559A8573J5231N3992a55037J1635A44072L2641P1655j07051R1430C8861P8269
17548A17130k2388a8265j29702A87754a04274A51515D9311b0678G3727f8583C1873
$$ y = [-67664, -326581, 118480, 184639, -65516, 205109, -36330, 189864, 76977, -155837, 100768, 240039, 218395, -56945, 28388, -253942, 149962, 29323, 167762, 48385, 178093, -66309, 207470, 47331, 57140, 93883, 185976, -145084, 337468, 144716, 207192, 10513, 27559, -259, 2294, 190788, 6120, 62309, 59478, -121478, -318980, 184949, 161943, -80531, -66466, 242095, -58498, 5895, -32859, 256699, -217942, 102567, 51201, 185829, -136888, 54983, 187412, -133765, 115904, -36998, 401197, 216859, 54497, -286142, 17386, 118548, -127185, -195627, 346895, 18573, 33804, 87796, -155037, -143402, 144072, 176713, 248368, 141317, 232747, 38861, 117130, 94742, -18265, -147967, 187754, -104274, 151515, 49311, -20678, 73727, -68583, 31873]
17536B47434d43256B60087e2293q1578A29571b76811A19670L9247m852J8594a26053
17524A41916O8616J37329A67912a06622B62565K87237A90381e340B73742a9642
17513B25866a23271H0708f1251C7949c6598B38602A18019j5795N9173F2883J75514
17502B38397a59023C75960A68592p7608J64364b45806e4231C6459Q0989j6646
17492A00802D3780c3083I862b2863D34840a15249B00917q4952J73327b7474A39616
17480i6204I4051a63030J6947H7094c9547B60407J96012A89764o6799D3469M6784
17469I0253J6950o651A3777L3197E688J79340R4687k8149j14713d357A23267k7776
17457I5491l2636Q7380a74430F7611j2337K22032J05769a4330E6215N9417N9580
$$ y = [247434, -443256, 260087, -52293, -133871, 129571, -276811, 119670, 158917, 154065, 172659, -126053, 141916, 210532, 347861, 167912, -106622, 262565, 549802, 190381, -5340, 273742, -19642, 225866, -123271, 80708, -61251, 37949, -36598, 238602, 118019, 102224, 161397, 62883, 238397, -159023, 375960, 168592, 90984, 255348, -245806, -54231, 36459, 117448, 100802, 43780, -33083, 9862, -22863, 434840, -115249, 200917, 115965, 289292, -27474, 139616, -96204, 94051, -163030, -146083, 87094, -39547, 260407, 456419, 189764, 122965, 43469, 90253, 107203, 100552, 13777, 46974, 5688, 185028, 279715, 251566, 136853, -4357, 123267, 95491, 62855, 150235, -174430, 67611, 55274, 277306, 383075, -14330, 56215, 115632, 175212]
17446A75212k3838B4313J83906J85329A75426B1508b248l830C12737F5687J16262
17435A81949a18052A40207P460N4057L2223e711B50824j7229L59305k55208D1663
17423I015M4127K25254m0327M4985J33614R1901I6076M3152K0888J786J33563
17412B95465Q0996I6846L58696j19020j09059P2499c7743D02312K8928K7192K98520
17401G56952A61364N6114J45557n8166o2742K81553k36693l8451J06834l7517
17391C17853l5007l685P4795j45673L4229m9581J77203I9041J46854r5088k1925
17380A28882a37157B41666i6961B01702H7727j4971b6491B49756E6952K67629
17370C24581f23B33263J43565L3880b6563j86975A27567m6410L57962j47345J06880
$$ y = [175212, 151374, 24313, 208219, 393548, 175426, 21508, -2248, -6078, 312737, 65687, 181949, -118052, 140207, 147667, 201724, 233947, -5711, 250824, 233595, 592900, 337692, 41663, 9015, 53142, 278396, 238069, 283054, 416668, 508569, 96076, 139228, 160116, 161902, 295465, 376461, 96846, 455542, 336522, 227463, 299962, -37743, 402312, 431240, 458432, 756952, 161364, 217478, 363035, 304869, 242127, 523680, 286987, 248536, 355370, 317853, 282846, 279161, 353956, 208283, 242512, 192931, 370134, 99041, 245895, 150807, 128882, -137157, 241666, -96961, 201702, 87727, 72756, -26491, 249756, 56952, 324581, -623, 233263, 376828, 410708, -26563, -213538, 127567, 81157, 439119, 291774, 398654]
17359C98654A49706J96623B8537J90198a25846D15879A31586b2872A65363J16314
17349B81677i482C47862A69656B0585J50187j8205a6842A6938P5962a09299D7346
17337E5901J06505R4556i4678B01878H0407i9544C34438j00822A4207D205M9469
17326E3674K14842A01212i9047C13329j48218a61297C16347C4002O9675k2146
17316H1531j2702K358K08190a757B11652g7302m1291C8208A996P9345L8143J94171
17304C13655n1872M3010j50815j8952M7691J96757A14842J30889G945K12016J71732
17293C91693A80376l8282o6013L33841J2098D5355K56046j05506r3695L56144
17283D58344k08903o7131m0400F7147a41015b7948C41577j24173B7034Q2839h3952
$$ y = [398654, 149706, 346329, 28537, 218735, -125846, 415879, 131586, -22872, 165363, 281677, -9482, 347862, 169656, 20585, 170772, 152567, -16842, 16938, 92900, -109299, 47346, 55901, 162406, 256962, -94678, 201878, 80407, -99544, 334438, 233616, 14207, 4205, 53674, 268516, 101212, -99047, 313329, 165111, -161297, 316347, 34002, 103677, 81531, 68829, 71187, 279377, -1757, 211652, -77302, -118593, 38208, 1996, 81341, 119484, 313655, 261783, 304793, 153978, 135026, 182717, 379474, 114842, 245731, 7945, 219961, 391693, 180376, 142094, 76081, 409922, 422020, 45355, 301401, 195895, 102200, 458344, 249441, 182310, 141910, 67147, -141015, -27948, 341577, 217404, 27034, 109873, -83952]
17271C09040J16461j42176j1931l1687B6499P7334O5934K45449E5688J91126d5833
17259C77155j88146A0282K81300P5482A78512K0452J5427a8733B06933I8520J82890
17248B81410I8921q49i5485A02745R4270J03123r477G7960L32420K0395K0671
17237D51446n2574b2620D15364A78367K08927e1107A23200l8727O1541c05702
17226A95274L6642J32723J2522A28054k3605K4011f804B7831P033J01662K89276
17215D25802a25096A56935J18739a01717A34602P2882J07114r5529J51179A49321
17204B34861K5738l413J38379J42212k08947H0594L3848J25775Q1794A00231J93216
17193B93447e1200C10925B4079N2762M78257k21777Q5458k2871A4968K17577D5112
$$ y = [309040, 425501, 283325, 271394, 239707, 26499, 103833, 169767, 415216, 55688, 246814, -45833, 377155, 189009, 10282, 291582, 367064, 178512, 198964, 214391, -18733, 206933, 98520, 281410, 98921, 98072, -95485, 102745, 197015, 300138, 290661, 77960, 410380, 430775, 451446, 398872, -22620, 415364, 178367, 387294, -51107, 123200, 84473, 146014, -305702, 195274, 231916, 364639, 377161, 128054, 104449, 128460, -6804, 27831, 34864, 136526, 425802, -125096, 156935, 275674, -101717, 134602, 207484, 314598, 219069, 370248, 149321, 234861, 260599, 257186, 395565, 537777, 328830, 80594, 114442, 240217, 322011, 100231, 293447, -51200, 310925, 24079, 76841, 555098, 333321, 418779, 395908, 14968, 232545, 45112]
17181C03059m5095N017m3034k3115J34824A51234K88232j24335I8043K89818I3258
17169B44316F0236N26486I3014B0426d4623A56977k4246J590L20117r6797I8331
17157A27175N3902K47543M7746B25209n8781M7336D0178N7469K44568J74771A46643
17145B63958p4207J47812J3373j25368j624K58346K88876B54771K13648B08820
17134B75764j29678L8978k682K80858K80404D7555J80948M4950J20601P5130j95839
17123B73345m5614J94436j04281G142J35917R9814L1056J7123r282b9819A14920
17111D05200J73840K02437C35789J32674A12251K1189M22376B21133J11770A38283
17100F90603j77769k48311j201K6306n1848J63297n4859R2995J79846k56498M33783
$$ y = [303059, 257964, 262981, 219947, 196832, 331656, 151234, 439466, 315131, 98043, 387861, 93258, 244316, 60236, 586722, 93014, 20426, -44623, 156977, 132731, 134321, 454438, 357641, 98331, 127175, 181077, 428620, 476366, 225209, 166428, 213764, 40178, 97647, 342215, 516986, 146643, 263958, 189751, 337563, 350936, 225568, 223944, 482290, 771166, 254771, 468419, 208820, 275764, 146086, 185064, 182382, 463240, 743644, 47555, 228503, 273453, 394054, 469184, 273345, 227731, 422167, 317886, 7142, 143059, 242873, 273929, 291052, 281770, -29819, 114920, 405200, 579040, 781477, 335789, 468463, 112251, 133440, 555816, 221133, 332903, 138283, 690603, 512834, 264523, 263322, 289628, 237780, 401077, 346218, 439213, 619059, 362561, 796344]
17089G96344l96772p3029A20802J41743l0930L98088k15991j73615K16511J37528
17079E94136k91046A06805N0673J81121r512J72582J3832l2597J57230j46864
17069D93270l9681J37444k26607r7994J40019m2274j44864L23094r0217J6817
17059D69007K19067l05641J84080k13192k4193K36219K1973p1813P0943j08057
17049D78393j32610L04733j60384J17116o9670k8931j11948L30657J53869j56867
17039G24358m2005J15602n5145r1564l716j2114k33641K88372J22906k59396J6909
17028E70566j32143j06315K86301j68913R8978K1634J07314j39513L6774N8685
17018F33368j52609Q6341K3899K36616j93070J81883l89791L76549C92514J68840
$$ y = [796344, 399572, 326543, 120802, 262545, 231615, 629703, 413712, 240097, 456608, 594136, 303090, 106805, 157478, 338599, 329087, 501669, 515501, 482904, 640134, 493270, 453589, 591033, 364426, 266432, 406451, 364177, 219313, 542407, 452190, 469007, 688074, 382433, 566513, 353321, 329128, 565347, 587320, 515507, 586450, 478393, 345783, 650516, 490132, 607248, 537578, 508647, 396699, 727356, 881225, 724358, 682353, 797955, 742810, 651246, 647530, 635416, 401775, 690147, 813053, 553657, 570566, 438423, 332108, 618409, 449496, 548474, 570108, 677422, 537909, 574683, 633368, 480759, 567100, 590999, 827615, 634545, 816428, 426637, 803186, 392514, 561354]
17008E61354K9487J69361N2575B70928M40496p1719j0782J0935p1908M6052k45701
16997C68301L45863J86042J22751j75040M4052r8108m8424R9236k05744r7212
16987E41717K90052j1785k55228J04329M58679l70129k0822j22274J47205j57507
16977F04237j27054K5556K78932k75368O93313m90798J48562o1945j71640L0037
16967F53832M66606m2356j10676j29657j33550P4707j84737L46283N6126j26368
16957H70210j12477K3788K84894l4683J29215J9052E86998K91535K47511l87505
16947G38539K99140j5470j5806J06533J73587j73493O0141k78185L13670M5749
16937A254405l26584k6766K47485P5636o7094k03312K32239m7094R1645Q6824
$$ y = [561354, 590841, 760202, 812777, 270928, 711424, 639705, 628923, 639858, 567950, 614002, 368301, 714164, 900206, 1022957, 847917, 891969, 793861, 745437, 844673, 638929, 541717, 831769, 819984, 564756, 669085, 1127764, 757635, 736813, 614539, 761744, 604237, 477183, 502739, 781671, 506303, 1199616, 708818, 857380, 795435, 623795, 653832, 1120438, 1078082, 967406, 837749, 704199, 778906, 594169, 940452, 996578, 870210, 757733, 781521, 1066415, 1031732, 1160947, 1179999, 586998, 878533, 1126044, 738539, 1037679, 1022209, 1006403, 1112936, 1286523, 1113030, 1173171, 894986, 1208656, 1254405, 927821, 901055, 1148540, 1224176, 1157082, 953770, 1186009, 1138915, 1230560, 1317384]
16927A317384M976k05712q8190J6343J49738j36195R3963l43890M49870j09438
16917A148849P8421J29887j57562j96809L47250k06229J95780L6482k42369J00554
16907A234254K83056j01464P4054l55595K96271K22114j30947k15111k2982J27647
16897A411297N91964k13129l13947J76541p0229l2670J03409K32280j53396j70591
16887A561529l5974M8841J17356L22574k26416j09840M5393q0462J88442J48712
16877A980155l1995J07708K2843m04612M58009q801P3440L25299j75036j67835
16867B179175k35O1580P2444N5137k743m3585O8319J28052l63139J22552J36813
16856B414370K037K37098j09859K58051k69439K43667J35284j25383R512j6200
$$ y = [1317384, 1322360, 1116648, 1028458, 1044801, 1194539, 1058344, 1152307, 808417, 1258287, 1148849, 1227270, 1357157, 1199595, 1002786, 1350036, 1143807, 1339587, 1376069, 1133700, 1234254, 1517310, 1415846, 1489900, 1134305, 1430576, 1652690, 1521743, 1306632, 1283650, 1411297, 2003261, 1790132, 1476185, 1652726, 1582497, 1549827, 1653236, 1885516, 1732120, 1561529, 1525555, 1574396, 1691752, 2014326, 1787910, 1678070, 1723463, 1643001, 1831443, 1980155, 1948160, 2055868, 2078711, 1674099, 2132108, 2123307, 2196747, 2522046, 2347010, 2179175, 2178940, 2240520, 2312964, 2368101, 2365358, 2321773, 2390092, 2518144, 2155005, 2277557, 2414370, 2416407, 2653505, 2543646, 2801697, 2532258, 2775925, 2911209, 2785826, 2795338, 2779138]
16846B779138K44614j48053J06406p7121N1645R0834M97812k20038l49802k16051
16836B759384N68133j1033L26062j12777j41326k02788L84018J01525l8498m284
16826C628416L54616l98092K13723K94961L4245R3854j16919L34195M8974O5918
16816D553891m2842O8746K66318o0221J58451J73272m48102M92731n0124K76842
16806E388962j06656J34970J75755l430J40619L60372M0975J80935j31608P00589
16796F881483k77255k6271M17962j62725N01619K53419k90511O56530L8412L22346
16786H315009N4548M94152m83075M60522N72383L46225q9421n3865N34409L95988
16776A0546875J48516K39470O38097N02285J23775J81494O36152J74505L69107
$$ y = [2779138, 3023752, 2875699, 2982105, 2904984, 2956629, 3047463, 3545275, 3325237, 2975435, 2759384, 3327517, 3316484, 3642546, 3529769, 3388443, 3185655, 3569673, 3671198, 3632700, 3628416, 3983032, 3584940, 3798663, 4093624, 4127869, 4221723, 4104804, 4438999, 4487973, 4553891, 4511049, 4579795, 4846113, 4785892, 4944343, 5117615, 4669513, 5162244, 5112120, 5388962, 5282306, 5417276, 5593031, 5589601, 5730220, 6090592, 6131567, 6312502, 6180894, 6881483, 6604228, 6577957, 6995919, 6833194, 7334813, 7588232, 7297721, 7954251, 7992663, 8315009, 8369557, 8863709, 8380634, 8841156, 9413539, 9759764, 9670343, 9616478, 10150887, 10546875, 10695391, 10934861, 11572958, 12075243, 12199018, 12380512, 13016664, 13191169, 13560276]
16767A3560276L83651M63867O62530L77893O76114M55401M39813O98391K89712
16758A8007648J045299P96816K99013J123426N33055R97210Q13532J140512O67165
16749B5423676J315350Q45324J267644J410807J224999J433290J618218J466298
16741C6005606J895271K087592J721199K309453K499767K298746K497124K817602
16733E4132360K972378L907995L223022M044215L759824M839908M516529N359077
16725H6755308N297664N826798O607113P122461O684987Q059337P990914Q182957
16717A42527539Q659567Q422540Q742404Q887480Q341494P783857P232627O186468
16709B06783976N201070L904840K123160L54677o31516k702969m360383n793285
$$ y = [13560276, 13943927, 14407794, 15070324, 15448217, 16124331, 16579732, 17019545, 17717936, 18007648, 19052947, 19849763, 20148776, 21272202, 21805257, 22802467, 23615999, 24756511, 25423676, 26739026, 27584350, 28851994, 30262801, 31487800, 32921090, 34539308, 36005606, 37900877, 39988469, 41709668, 44019121, 46518888, 48817634, 51314758, 54132360, 57104738, 61012733, 64235755, 68279970, 72039794, 76879702, 81396231, 86755308, 92052972, 97879770, 104486883, 111609344, 118294331, 126353668, 134344582, 142527539, 151187106, 159609646, 168352050, 177239530, 185581024, 193364881, 200597508, 206783976, 211985046, 215889886, 218013046, 218367723, 217736207, 215033238, 210672855, 204879570]
16701B04879570o796265p842378q261274q794542r436529r215183q641603r179150
16693A36712646q596390q083212p861566p072428p101276o435554n981517n005021
16685H0575682n575661m623958m231760m269625l498002l538398l478579l206190
16677D8153509k314444k516933k490894k115067j902167j740975j995699j533636
16669C1543694j366552j389679j655541j271574j009131j262552p78304j301117
16661B1509244m89842j333370o55613o25952o83249p12453k18658j061484p17451
16652A5011172o9985q27906n56148k99076l23243n48604n38003q00644j6712m31523
16642A0599328l00253n2461k2960p12329m35702j81776n22192J97833l78388k54532
$$ y = [204879570, 198083305, 190240927, 181979653, 173185111, 163748582, 154533399, 145891796, 136712646, 128116256, 120033044, 112171478, 105099050, 97997774, 91562220, 85580703, 80575682, 75000021, 70376063, 66144303, 61874678, 58376676, 54838278, 51359699, 48153509, 45839065, 43322132, 40831238, 38716171, 36814004, 35073029, 33077330, 31543694, 30177142, 28787463, 27131922, 25860348, 24851217, 23588665, 22810361, 21509244, 21019402, 19686032, 19030419, 18404467, 17721218, 17008765, 16790107, 15728623, 15011172, 14941187, 14113281, 13557133, 13258057, 12934814, 12386210, 11848207, 11047563, 11030851, 10599328, 10299075, 10246614, 10223654, 9511325, 9075623, 8893847, 8371655, 8569488, 8191100, 7936568]
16632G936568k40371k46625l2758k10574J64874m22676j99594m18132M824o4765
16622F270771k00070o9235j0499m54311l96182P73988o13390j44734j77449k51726
16612D727163J21204m1126j22302k75048m7115m25144J83322P379j38712k3382
16602C966239j25984p43k82971k28378M11845n35129R0704j18324K20469l55785
16592C041943L46508m34786O4732K0949k09994K46550k30365J57881j43534o9132
16582B790752k27972j52598j44841L37376r5600m53414R4151K9513K71904l48121
16572B101150p0605j0001J56626n1105j56596L27698j93305p1530o8794j01942
16562A861596k85601O01412j15593r8533l51289r1116K99507N1464P0219k01032
$$ y = [7936568, 7696197, 7449572, 7416814, 7206240, 7371114, 6948438, 6748844, 6330712, 6335536, 6270771, 6070701, 6001466, 5990967, 5536656, 5140474, 5914462, 5301072, 5156338, 4978889, 4727163, 4848367, 4807241, 4684939, 4409891, 4362776, 3937632, 4120954, 4128333, 3989621, 3966239, 3840255, 3839512, 3556541, 3328163, 3740008, 3204879, 3295583, 3177259, 3397728, 3041943, 3388451, 2953665, 3018397, 3039346, 2829352, 3075902, 2845537, 3003418, 2859884, 2790752, 2562780, 2410182, 2265341, 2602717, 2507117, 2053703, 2147854, 2177367, 2449271, 2101150, 2030545, 2020544, 2177170, 2126065, 1969469, 2297167, 2103862, 2032332, 1963538, 1861596, 1575995, 2177407, 2061814, 1963281, 1611992, 1520876, 1820383, 1871847, 1942066, 1741034]
16552A741034k21454J11634N3952k65175j78104J28480j92353L30946m4156j47465
16542A317339K61164n99125K89510L26590k45675k0397m07496L40887n861r7958
16532A158978m09256M43625k9531j08575j64102n3572K65994l3178o586m0419
16522A023378k95298L15121K02469m98084L53903O3147R0002n78652M98284m92690
16512F81580J48339m1686J28601j33725j16823K83659K6714K35845l72802j24186
16502G15516K76663J02689j30547k36037J46441O8504o7998Q8339l58175r1908
16492E13487J91917L47818k26376B47807K51329J85881j05805L33539C56257K56322
16482F12579K52761l61762A89648L78150J7191n1625L3813m3624k8982J24167
$$ y = [1741034, 1519580, 1631214, 1685166, 1419991, 1241887, 1370367, 1178014, 1508960, 1464804, 1317339, 1578503, 979378, 1268888, 1595478, 1349803, 1329406, 921910, 1262797, 1256936, 1158978, 749722, 1193347, 1163816, 1055241, 891139, 837567, 1103561, 1070383, 1063797, 1023378, 728080, 1043201, 1245670, 747586, 1101489, 1164636, 1254638, 675986, 1174270, 681580, 829919, 788233, 916834, 783109, 666286, 949945, 976659, 1212504, 839702, 715516, 992179, 1094868, 964321, 728284, 874725, 943229, 875231, 963570, 605395, 513487, 705404, 1053222, 826846, 247807, 499136, 685017, 579212, 912751, 356257, 612579, 865340, 503578, 189648, 567798, 584989, 533364, 567177, 523553, 494571, 618738]
16472F18738j35684J26193r9171r0214J95017k40308M2008J74589R7331j17413
16462E71086k77931j14561L77979n7819J8426j41712p4027P3877J61048k2937
16452E13429j40770K99456l11782j26486M76645k23681k11714K06792m0184r4151
16442C47554L58364k04812k03735K85659B01752J52912R5984p2988J05247J2906
16432D95813A78348K69132j63145L01411B88772j41028J0293L36454q2566B00545
16421F89466C8739K48045N8379p2642J11896l3627q3012L9615M5117Q2728A64740
16409B47665K0476L06097k37916a8649A54573K25636A03645J05936J59378r5434
16399B73525R7036j29546P6255A14403h0931B58759M4774J10a87284B90067n0680
$$ y = [618738, 483054, 609247, 510076, 419862, 614879, 374571, 416579, 591168, 688499, 571086, 293155, 178594, 556573, 498754, 517180, 375468, 301441, 375318, 536366, 513429, 372659, 672115, 360333, 233847, 710492, 486811, 275097, 481889, 441705, 347554, 705918, 501106, 297371, 583030, 201752, 354664, 450648, 377660, 482907, 495813, 178348, 447480, 284335, 585746, 288772, 147744, 158037, 494491, 411925, 200545, 689466, 38739, 286784, 345163, 272521, 384417, 350790, 267778, 307393, 352510, 435238, 164740, 247665, 268141, 574238, 336322, -18649, 154573, 380209, 103645, 209581, 368959, 273525, 370561, 241015, 317270, 114403, -80931, 258759, 303533, 303643, -187284, 290067, 239387]
16388B39387J89861n8060j27421I9861K38639k4280J26019c16511e7634K8735
16378b8899E25627L3164A06334J80681A6392M63377A669J66926D4025J08524K88902
16367D41451j17226I6681K04438A09521Q9807K33443A86846N495c3510A92263
16356D1736N48859G6694J74976J53821j72549Q885G0380a9937C1415K64195a89519
16344E4835J98916J11798p0377A38920J20356A1081K22272c8365A36337J7270
16334A53607M26893A77057a17427C61935o5918I8a55028B13082I0440j3243R5166
16323A72363M2907c3385A90115E5976c9774A78149J46881j26342m6534e0646A24872
16311H5027p62k5607O8510M9538F2995K08735c0173G8797J34238b97994A0833
$$ y = [239387, 429248, 371188, 243767, 99861, 338500, 314220, 440239, -316511, -57634, -28899, 525627, 558791, 106334, 287015, 16392, 479769, 1669, 168595, 44025, 152549, 441451, 324225, 96681, 301119, 109521, 199328, 432771, 186846, 192341, -33510, 192263, 41736, 590595, 76694, 251670, 405491, 232942, 241827, 70380, -19937, 31415, 295610, -189519, 54835, 253751, 365549, 295172, 138920, 259276, 11081, 233353, -38365, 136337, 153607, 580500, 177057, -117427, 361935, 296017, 98, -155028, 213082, 90440, 77197, 172363, 215270, -33385, 190115, 55976, -39774, 178149, 325030, 198688, 152154, -50646, 124872, 85027, 84265, 58658, 127168, 176706, 62995, 271730, -30173, 78797, 213035, -297994, 10833]
16299a04115a5861B88310r8935I1200d5568A26815E3707J19772J27890E4087b93587
16287b7520p9974B02642N54617j84280a16359k6293B79974A24947n6627k3832
16277D4488P1712k7246M3228B7490d08719I0288c3928A8080J28967Q6897n7741
16266A76203J96409A69136a14601A75547b10453C85919E9338M0918h5602D3176
16255G6842l3064b4382n12816B51825A23875J94938D2322c9942j3470C5279a17884
16243A59495J42781G7223M38776j69692j36770j194O3239A09321G790J31114J03888
16232B42792h0768h844B36778M8775n7757h3107B72003B2626K45797h605p5361
16221h3966A47148a67510B99958l2013f7600K6887k4810B12042a82890i0764l6051
$$ y = [-104115, -15861, 288310, 189375, 91200, -45568, 126815, 53707, 173479, 301369, 54087, -293587, -27520, -107494, 202642, 757259, 572979, -116359, -142652, 279974, 124947, 68320, 44488, 116200, 88954, 132182, 27490, -408719, 90288, -33928, 18080, 147047, 233944, 176203, 372612, 169136, -114601, 175547, -210453, 385919, 59338, 100256, -85602, 43176, 76842, 43778, -24382, -537198, 251825, 123875, 318813, 42322, -39942, -53412, 35279, -117884, 159495, 302276, 77223, 515999, 346307, 209537, 208343, 271582, 109321, 7790, 138904, 242792, -80768, -8844, 236778, 285553, 227796, -83107, 272003, 22626, 268423, -8605, -83966, 147148, -167510, 299958, 267945, -67600, -40713, -65523, 212042, -182890, -90764, -126815]
16210a26815E5377K8258b69415a24168o7420L0516M2274N7596D52200A13056K13442
16199C26498J17366j23219p9958A4996c71180D300K23092b03509a9015r6337B36148
16187B13732a37426L4853B51957c3774A1883C350a30731I9217C3389K28587E4821
16175f9800k1905A45640f0153j6401m71m2093k87916c2726C2616e0591D8237Q2399
16163A30636c45525P9016o5211c3277i836m3429f959H7709D1914a60269C1036
16151C6616b4742l64953e6084C7649e3704n7264l9623l0639a2468B93131a00573
16139b79317B8731K47609d2348A87070n5860B1649L718J27938P1787H8722K84586
16128C73308F9873B9722b82096F1111a52158L1925G5200a18232a1613j32898B15541
$$ y = [-126815, 55377, 83635, -269415, -124168, -191588, -161072, -118798, -61202, 452200, 113056, 326498, 443864, 320645, 240687, 14996, -371180, 4300, 227392, -203509, -19015, -115352, 236148, 213732, -137426, -102573, 251957, -33774, 11883, 3350, -130731, 99217, 33389, 261976, 54821, -69800, -91705, 145640, -60153, -76554, -77025, -119118, -407034, -32726, 32616, -50591, 48237, 130636, -345525, -266509, -331720, -33277, -9836, -53265, -6959, 87709, 41914, -160269, 31036, 36616, -24742, -389695, -56084, 37649, -53704, -110968, -150591, -181230, -12468, 293131, -100573, -279317, 28731, 276340, -42348, 187070, 131210, 21649, 25367, 153305, 225092, 88722, 373308, 69873, 29722, -282096, 61111, -152158, -120233, 75200, -118232, -11613, -144511, 215541]
16116B76257q1630b4209j58343A91855o8204K32624A21686M9369e5900j35196
16106a91096l6996i4663E4539b04990F536f2825n3241F1887b9454l75381f4854
16094d39254J58432C4834A6973e3511D6632A1351L27041l8504p9890b26725D24192
16082f9832D0593J13620R3654o2203c31164A87759B048a44084I6147b607E5685
16070a58377m9273A00123e3183b2381n4311A61762D9015a43493j21706a2088r4505
16059a06593l59716a92454Q360F1977J51049b18844h9969k27228A21543E0774
16048a5734k30518B28740E2944a26249b2300E5334b41655C7112c36625o0018I3660
16036a33387D0448c8473j8379j18307Q6772l6162k669N3813l46924C6183e53003
$$ y = [276257, 194627, -24209, -182552, 191855, 123651, 356275, 121686, 171055, -55900, -191096, -228092, -94663, 54539, -204990, 6536, -62825, -116066, 61887, -29454, -404835, -64854, -439254, -280822, 34834, 16973, -53511, 46632, 11351, 338392, 299888, 219998, -226725, 424192, -69832, 40593, 154213, 247867, 185664, -331164, 187759, 2048, -144084, 96147, -2607, 55685, -158377, -207650, 100123, -53183, -22381, -76692, 161762, 49015, -143493, -265199, -12088, -106593, -466309, -192454, -184094, 61977, 213026, -218844, -89969, -317197, 121543, 50774, -15734, -246252, 228740, 52944, -126249, -22300, 55334, -241655, 37112, -336625, -396643, 93660, -133387, 40448, -38473, -56852, -175159, -88387, -124549, -127218, -73405, -420329, 36183, -553003]
16024d67832b29389B13347e926C4878Q3044h633F5874A3964g1971j78582N7916
16013a92637r3447M6126I8244J53241a62888A92604c01328a37808O022j68341
16003c00127B52966i6155j13271h6206n7079A27679c18403h5746j18795R3876
15993a10665E7919f738r4557B72743a62732m7513B087a27660M2999A01985D2114
15981c4382F7762Q0038a00520A22760J48952p8607d04685j45409G2955K2629k1123
15970G4461J35513N652E5276J97417i8578D58650F6671K2109K12295A07232l7970
15959F9262M7000a91105C01238d8235l9169A148J90769K6314B9464M9666L8013
15948A17143B5873i8742l9812C0364b54575f0901E7931f02687a48335A3221J6689
$$ y = [-467832, -229389, 213347, -5926, 34878, 117922, -8633, 65874, 13964, -71971, -250553, -192637, -286084, -239958, 98244, 251485, -162888, 192604, -301328, -137808, -131786, -300127, 252966, -96155, -209426, -86206, -143285, 127679, -318403, -85746, -204541, -110665, 57919, -6738, -101295, 272743, -162732, -210245, 2087, -127660, -84661, 101985, 42114, -34382, 67762, 147800, -100520, 122760, 271712, 193105, -404685, -550094, 72955, 95584, 74461, 209974, 215626, 55276, 252693, -98578, 458650, 66671, 88780, 301075, 107232, 69262, 116262, -191105, 301238, -48235, -87404, 1148, 191917, 218231, 29464, 79130, 117143, 25873, -98742, -138554, 30364, -254575, -60901, 57931, -602687, -148335, 13221, 29910]
15937B9910a5347p1480j83237A44458A859N3770P8187d9100A27960i2662l72320
15926d64982f6441C3528h6464C19527c1846j61568C873P6313f7647A0861d965
15914A30980g9098c0490j67589G5532a15443m0014k4536B1837L4743a24479E2964
15902B22500a47149G1727a80982Q773l8959j32253J00623a8906k14252j40414
15892c73572g3993j61031E7644J00731b88038R7419o858R5541m26171I0674a32810
15880B32214d9767k89345A12873b06605P9596c9383j68492N6421R140B66398I6171
15868A01219a16087q5657k4210d6516k04740c1527o6754j76536B43501b10376
15857A61694M1090I2723J17237b83847f9613G4592N4347a1942j51446k2858A39819
$$ y = [29910, -15347, -86827, -270064, 144458, 1859, 55629, 133816, -49100, 127960, -92662, -464982, -66441, 33528, -86464, 319527, -31846, -193414, 3873, 80186, -67647, 10861, -4965, 130980, -79098, -30490, -198079, 75532, -115443, -155457, -179993, 21837, 56580, -124479, 52964, 222500, -147149, 71727, -180982, -172209, -211168, -343421, -242798, -18906, -233158, -373572, -73993, -235024, 57644, 158375, -288038, -190619, -197477, -101936, -528107, 90674, -132810, 232214, -49767, -339112, 112873, -206605, -127009, -39383, -207875, -151454, -142314, 266398, 96171, 101219, -116087, -201744, -225954, -46516, -251256, -31527, -98281, -274817, 243501, -210376, 161694, 202784, 92723, 209960, -283847, -69613, 74592, 128939, -11942, -163388, -186246, 139819]
15845h6754a1752k89780a10425B9444b8848l28777g491r5721j2633A36774c99612
15833H8748b63597I4510a8647m5892B04281a54527J6398n8409G208a1896A88071
15821b14374O0470d4303k58734i8114Q761n6532n413A02245i5900M2008B76337
15809f5236A6524K5912e5739A80686g3204m48960A61238J69413b76815A36750
15798A66642c7252k18757J03595D0431g142A61855b17857j8709c9492A32015i7024
15786c03601i7656B21216a92904B45361r3936g4975j48411F0005J48159c43459
15775H0224J05700d3241p4117B51071B2675I341J5262L53139A11105h2441Q507
15764g3934k2394B0824J13005L5631h978l50833N2150J14464C111b02739P2119
$$ y = [-86754, -11752, -301532, -110425, 29444, -28848, -357625, -7491, -103212, -115845, 136774, -399612, 88748, -263597, 94510, -18647, -64539, 204281, -154527, -138129, -196538, 7208, -11896, 188071, -214374, -153904, -44303, -303037, -98114, -89353, -145885, -151298, 102245, -95900, -53892, 276337, -65236, 16524, 42436, -55739, 180686, -73204, -522164, 161238, 330651, -276815, 136750, 166642, -37252, -256009, -152414, 40431, -7142, 161855, -217857, -236566, -39492, 132015, -97024, -303601, -97656, 221216, -192904, 245361, 151425, -74975, -223386, 60005, 208164, -343459, 80224, 185924, -43241, -117358, 251071, 22675, 9341, 24603, 377742, 111105, -82441, -73934, -96328, 20824, 133829, 169460, -8978, -359811, -307661, -193197, 3111, -202739, -130620]
15753a30620k29387B69243a0767m3607j24438j9454l4037a10394B30015G3238
15742A1095h3874I5267g7669G1720g2758I8831a74539l2141A95793d06684A22420
15730f1219j37696L6338P2715B00851F3788d6932j49345D3051h1776K7033A33897
15718g4704r6418L7640j97293e8762k05620b0095q7726j09666K3584B32106D8498
15706h104C4916J91492H8290b29626i803B25L2977L0721a33237L783A20477b52813
15693g5766A03207d4147j21761b3506p4394j6412b387C4200a31395J1426j68526
15682b88495J11028A26432l5192J75496h8674A10542d7372A52817a14877C427
15671f158A66019o4881M2296m4080e1031A12234Q7625a07494D97676A66656B4249
$$ y = [-130620, -360007, 269243, -10767, -54374, -178812, -198266, -232303, -110394, 230015, 73238, 11095, -83874, 95267, -77669, 71720, -72758, 98831, -174539, -206680, 195793, -406684, 122420, -61219, -198915, -162577, -89862, 200851, 63788, -46932, -196277, 43051, -81776, -54743, 133897, -74704, -171122, -133482, -330775, -58762, -264382, -20095, -107821, -217487, -193903, 232106, 48498, -8104, 34916, 226408, 88290, -229626, -9803, 225, 33202, 63923, -133237, -129454, 120477, -252813, -75766, 103207, -44147, -165908, -23506, -97900, -114312, -2387, 34200, -131395, -119969, -288495, -177467, 126432, 91240, 266736, -88674, 110542, -47372, 152817, -114877, 3427, -6158, 166019, 101138, 143434, 99354, -51031, 112234, 199859, -107494, 497676, 166656, 24249]
15659a11490D2130d6282A95073a75594P5142E2124M0405J96911a75136B2654a45171
15647a27846J4749F2090e8329b9051a3211p2432o5333B322h9079b0275B36149
15635b27641L8015d5436F4502a59304B23367d3665n1997D6187J14050d16637h8104
15623I9403a14373b9217D4470a69560L7891O5564G0953b80209B29365a14644N86
15612a14058L3022I1278c7302q4683f0791A44710J19958A0342b91887A62219N5217
15601B17436A9459J6227a57911d3362n2671C29292O4920I3127c03242Q2666I9641
15589a02486I7284h8876A44183J25366a23969A32443J54909d27836A02549B6521
15578A69762a19924o1018b5666j57263A19865Q4119a1536r8771B12235a24167
$$ y = [-111490, 42130, -46282, 195073, -175594, -100452, 52124, 92529, 289440, -175136, 22654, -145171, -127846, -113097, 62090, -58329, -29051, -13211, -85643, -150976, 2322, -89079, -20275, 236149, -227641, -189626, -45436, 64502, -159304, 223367, -43665, -95662, 46187, 160237, -416637, -88104, 99403, -114373, -29217, 44470, -169560, -131669, -66105, 70953, -280209, 229365, -114644, -114058, -81036, 91278, -37302, -121985, -60791, 144710, 264668, 10342, -291887, 162219, 217436, 19459, 35686, -157911, -43362, -96033, 329292, 394212, 93127, -303242, -220576, 99641, -102486, 97284, -88876, 144183, 269549, -123969, 132443, 287352, -427836, 102549, 26521, 169762, -119924, -180942, -25666, -182929, 119865, 203984, -11536, -110307, 212235, -124167]
15567a47192H7468D1048J26760a28585A13939f9117d101A14352D5488b80754D53599
15555a47682K4168r2745j31842I3770c08105a15816j15737i5942A90288k2477
15545A67811J7675H5534L1367a4752j2589j68095n9078h167A41273a77512B69097
15533E36849a06804N1704E9789b47065C33965b0294F3825L4996L6711a35878c1978
15521a02947j45141A18243b54506A57207d0551k13091d8779k53438a31676A30510
15510c1608I812b27490k2279f444j8053A81680J12261g5115B25919l4292n9756
15499A31871A1801K04935d2592H910c02j31362o8693j93266J21201b574k64647
15488b67221A43254i6254A60215n6470p958A8219K61764b96857A8698b32767b7575
$$ y = [-147192, 87468, 41048, 167808, -128585, 113939, -69117, -4101, 114352, 45488, -280754, 453599, -147682, -123514, -216259, -348101, 93770, -308105, -115816, -231553, -95942, 190288, 167811, 185486, 85534, 116901, -14752, -27341, -195436, -254514, -8167, 141273, -177512, 269097, 536849, -106804, -55100, 59789, -247065, 333965, -20294, 63825, 98821, 135532, -135878, -31978, -102947, -248088, 118243, -254506, 157207, -40551, -253642, -48779, -302217, -131676, 130510, -31608, 9812, -227490, -249769, -6444, -24497, 181680, 293941, -75115, 225919, 191627, 131871, 11801, 216736, -42592, 8910, -302, -131664, -200357, -393623, -272422, -2574, -267221, 143254, -96254, 160215, 103745, 95787, 18219, 279983, -296857, 18698, -232767, -27575]
15476a52652C2804L3123b30582g2298A24272a37290k17108J40110d107o3797q3349
15465a51253H3401Q1820P095J931B1478K6038a31553F753J00945d234j93346I5628
15452b8006B31403A9277L6159K68754c83328B77268a66031K3823G5997R3685D5985
15440a94834A75975A9571J1898L13991C5777g9440K5694A34718C5781c7872C9511
15428A73131Q4396A26568f0816o6212N1332A62380o3581k7368L2511m4472L18040
15417C77510f2633k7315J1054g134j41223j13080e6560j89034h8930E2538J72593
15406B25131a98028A06311J75292d764m7626B73707G5190a38420A46829J3734
15396A60563a28077B12164l5404o9074b59773i0204l759d3367d488j27288B24115
$$ y = [-152652, 32804, 65927, -230582, -72298, 124272, -137290, -354398, -214288, -4107, -67904, -151253, 83401, 165221, 172316, 174247, 21478, 47516, -131553, 6753, 107698, -4234, -197580, 95628, -28006, 231403, 19277, 55436, 324190, -383328, 277268, -166031, -142208, 75997, 169682, 45985, -194834, 175975, 19571, 31469, 345460, 35777, -79440, -53746, 134718, 35781, -37872, 39511, 173131, 257527, 126568, -60816, -127028, -75696, 162380, 98799, 71431, 103942, 59470, 377510, -62633, -89948, -78894, -7134, -148357, -261437, -56560, -245594, -88930, 52538, 225131, -198028, 106311, 281603, -4764, -52390, 273707, 75190, -138420, 146829, 160563, -128077, 212164, 176760, 107686, -259773, -90204, -93963, -43367, -4488, -131776, 224115]
15384b96427a33949B52137k5372G1814a16806A07494K62315G7138a20554c9239
15373a28566C7534c9708A31700b5082k94898i7584O914A6346i3027k50368g9497
15361A9118J62099k5192F559b14369B61916f2412B179K73580A31137f4465A66288
15349A99480B821e5841a5686D5834M991d6624l1053j30601L1704A44981b184B53954
15336b43745A05328g2824j2390j04061R4129p0180B08192a63503A70024F4991
15325A5724J20459b06403A46514B1849a13351K2189E1847k1415b27243I6176a58941
15313E5150a5966l4016r7862b8495D18682A47278D8341J6630e8370A3893J30987
15302A44880d0362j58868B14986j2721E3028J52943a00157B61000A16719m6438
$$ y = [-296427, -133949, 252137, 226765, 71814, -116806, 107494, 369809, 77138, -120554, -39239, -128566, 37534, -39708, 131700, -25082, -319980, -97584, -90670, 16346, -93027, -343395, -79497, 19118, 181217, 156025, 6559, -214369, 261916, -62412, 2179, 275759, 131137, -64465, 166288, 199480, 2821, -55841, -15686, 45834, 50825, -46624, -77677, -208278, -176574, 144981, -2184, 253954, -243745, 105328, -72824, -85214, -189275, -95146, -165326, 208192, -163503, 170024, 64991, 15724, 136183, -206403, 146514, 21849, -113351, -91162, 51847, 30432, -227243, 96176, -158941, 55150, -15966, -49982, -147844, -28495, 418682, 147278, 48341, 64971, -58370, 13893, 144880, -40362, -199230, 214986, 202265, 53028, 205971, -100157, 261000, 116719, 70281]
15292G0281h9761B92528n7478B8472b42633c3042A81528D9520f7177j13695A62142
15280b04898C87743g8336C43851a65884A25104d8438B9592K65456b05318K6503
15270a78815B34924D9776Q1487c8391A13066J36504k9582d8127A492a69895C57317
15258d35002A69820J2481J61878A30367i4096A6541K13924o7561M8215D0413K10293
15247B50706A9208K23667k4690E6091P7720R5558I4855K56580A07136J75046K2961
15236C05143K46897g8733A98143K34486J032374k27487j60564p9444C30057L3889
15226C63946J56020B07929Q252m8045l7543d1553o0030K8074m0193A27774J0977
15215A38751E4342K87883g9428A04114K33446p7005E5402M529J70028g2360j86784
$$ y = [70281, -89761, 292528, 235050, 28472, -242633, -33042, 181528, 49520, -67177, -180872, 162142, -204898, 387743, -78336, 343851, -165884, 125104, -48438, 29592, 295048, -205318, -178815, 234924, 49776, 131263, -38391, 113066, 249570, 219988, -48127, 1492, -169895, 357317, -435002, 169820, 182301, 344179, 130367, -94096, 16541, 230465, 162904, 211119, 40413, 250706, 19208, 242875, 218185, 56091, 133811, 229369, 94855, 351435, 107136, 282182, 305143, 552040, -78733, 198143, 432629, 1465003, 1237516, 1076952, 997508, 330057, 363946, 519966, 207929, 216181, 168136, 130593, -41553, -101583, -73509, -113702, 127774, 138751, 54342, 342225, -79428, 104114, 337560, 260555, 55402, 59931, 229959, -72360, -259144]
15204b59144k4296A4035J52032d4340A84146b45108A84671f2269D7533L5313i06
15192B31528f8269C5789e0136A49970i6191B63345h9180C19134b10052A39032
15181A5221J43933E9032a34843G9259P4765B2023M4041k1555a12931C84021a28095
15169B8246J83781H1883a41172D749a45110A31632A4653b04530N8812F5329J27393
15158A92722L62593A93475p104a54374D31501H7280K62379d06765a6481k21745
15148b38226a17119C36375L6713n1990c0135o1491M661A18338B612L63190A513
15136B15698C4966a42274C6981R9262J19279a42852B57845b99531B37421k8630
15126B08791l8739K19889j50855k2024r4310h6580G8198a85028D12799H7688a01221
$$ y = [-259144, -283440, 14035, 166067, -44340, 184146, -245108, 184671, -62269, 47533, 82846, -906, 231528, -68269, 35789, -50136, 149970, -96191, 263345, -89180, 319134, -210052, 139032, 15221, 159154, 59032, -134843, 79259, 154024, 22023, 66064, 44509, -112931, 384021, -128095, 28246, 212027, 81883, -141172, 4749, -145110, 131632, 14653, -204530, -145718, 65329, 192722, 555315, 193475, 186371, -154374, 431501, 87280, 349659, -406765, -16481, -238226, -117119, 336375, 373088, 321098, -30135, -91626, -86965, 118338, 2612, 365802, 1513, 215698, 34966, -142274, 36981, 136243, 255522, -142852, 257845, -299531, 237421, 208791, 170052, 389941, 239086, 217062, 122752, -86580, 78198, -185028, 412799, 87688, -101221]
15114B48238q5865B490K8033L78976E9028a10384B90935n2871A2000J54822j2437
15103A54385a31583B47743K3944J45229a73448H971M86878f7122i667j1526j7363
15092c8556C07171N4248A44628K48729K7683E2341k0857J98969p498N0677K20106
15081D93738A81306B228J89342M4559L9811j21687J63652l7105c148D37561j05506
15070C32055g7703j72445e3984A22829K14882n5907K4027E7833J05240k0547F9868
15058C68486H5018M30105e7599C59951A36170b3601C44384j50209H6111J72474
15048B58585E0346K88966H2252J06306R5551p1641o5556M3360r4288A995b0071
15036C53048A15850D0110N72078B67686J95943I2908L07990Q694n0183F2562M9719
$$ y = [248238, 162373, 2490, 30523, 409499, 59028, -110384, 290935, 238064, 12000, 166822, 154385, -131583, 247743, 271687, 416916, -173448, 8971, 495849, -67122, -9667, -21193, -38556, 307171, 361419, 144628, 393357, 421040, 52341, 31484, 230453, 222955, 273632, 493738, 181306, 2228, 191570, 236129, 275940, 154253, 317905, 280800, -3148, 437561, 332055, -77703, -250148, -53984, 122829, 337711, 281804, 305831, 57833, 163073, 142526, 69868, 368486, 85018, 515123, -57599, 359951, 136170, -23601, 344384, 194175, 86111, 258585, 50346, 339312, 82252, 188558, 284109, 212468, 146912, 190272, 95984, 1995, -20071, 353048, 115850, 40110, 612188, 267686, 463629, 92908, 400898, 409592, 359409, 62562, 112281]
15025A12281g1656a8184B20928r7273J20167p943l4890I7506K36424n8624i8425
15013B63160G6464J24678j2231J0133K56523j4869e7403B92070L6131A06293J69606
15002B75899j16176m7867e6920B79793R2715N1125j73783P9223A21423J77933
14992B99356J31497j02822k7294b28602G9417K01188a0339m5502e514A49099L30257
14981D79356A27921K4481p3184N26688B62233K41728A83464J82549A60052G0143
14970A41341J07923l1452J4392l7926m5397R9763J04338j67529J20246F6055J44268
14959B10323I4773D0857L49328j91593k4040K2205J74835j4423l4195J6744R4800
14948D34518B0414J90090O90549B53091J49079A71803k057J27671r6727K35091
$$ y = [112281, -71656, -18184, 220928, 123655, 243822, 235879, 200989, 97506, 333930, 275306, -98425, 263160, 76464, 201142, 188911, 199044, 455567, 440698, -57403, 292070, 328201, 106293, 275899, 159723, 111856, -56920, 279793, 372508, 423633, 249850, 329073, 121423, 299356, 430853, 328031, 300737, -228602, 79417, 280605, -10339, -55841, -5514, 149099, 479356, 127921, 152402, 79218, 605906, 262233, 503961, 183464, 366013, 160052, 70143, 141341, 249264, 217812, 232204, 194278, 148881, 248644, 352982, 185453, 305699, 66055, 210323, 94773, 40857, 390185, 198592, 174552, 196757, 371592, 357169, 322974, 339718, 434518, 20414, 210504, 901053, 253091, 402170, 171803, 169746, 297417, 200690, 435781]
14938D35781A79700L9927N6154l6783J1304L75959B46383J01255j13067k4098
14928B10473b59519H1974K71097A69137P8572K43294j5316K11285a8155I5544
14917c097A17456M27693k10643j54843J53728A59761k5217J41392j37395J19133
14907B57674j05364L9662N6443e2084B10005r6250J51307n3642K18302J7039o9197
14896C77564A58119K43750M765A71077m9528K03288K25266h344A16467J33385
14886B49852K24147B01845C3277L96749j88881K38492A97321M17560B30559E8589
14875B92886O3659Q4901k10440J11494K6178a409H7197J87781K16896O9735B43336
14863C03828N8146R5527q738J8335L08288l11235j22310J54507j38689J31145
$$ y = [435781, 179700, 219627, 275781, 238998, 250302, 626261, 246383, 347638, 234571, 210473, -259519, 81974, 353071, 169137, 247709, 491003, 475687, 686972, -18155, 95544, -3097, 117456, 545149, 334506, 179663, 333391, 159761, 134544, 275936, 138541, 257674, 152310, 191972, 248415, -52084, 210005, 113755, 265062, 211420, 429722, 446761, 377564, 158119, 401869, 406634, 171077, 121549, 324837, 550103, -8344, 116467, 249852, 473999, 201845, 33277, 430026, 241145, 479637, 197321, 614881, 230559, 58589, 292886, 356545, 441446, 231006, 342500, 368678, -1409, 87197, 274978, 491874, 561609, 243336, 303828, 361974, 457501, 448763, 467098, 775386, 464151, 341841, 496348, 357659, 488804]
14853D88804n2098A92575L43410r649M891j49468L12752C06693k758r9569l682
14842B00684M19796k16618R5513k12524N0715Q6234M50512j91492C34912Q4216
14832D19128k03892J17837K76881k61295q6804K07137K80811k66855h580C03183
14821C21887L25848j99183j02788r9451L16950j46728l7588K93227j65395o3224
14811D43555P782O246j1982j81907K92032j27688n3108J04292k22437K96626O479
14800E59890G8715L99233J30028l1124J2797B28030J92305O8633J40226J0120
14790F39314K10041k39628k26155L40368R9069j09473Q9224B42910K67527K02786
14780G13223N2117P1944j26982k08458K81955B21738L34381K27790k48062n5958
$$ y = [488804, 436706, 192575, 535985, 526336, 531227, 381759, 694511, 306693, 303935, 204366, 200684, 620480, 403862, 499375, 286851, 337566, 423800, 874312, 682820, 334912, 419128, 215236, 333073, 609954, 348659, 261855, 468992, 749803, 482948, -8580, 303183, 321887, 647735, 448552, 345764, 246313, 563263, 416535, 378947, 672174, 506779, 443555, 451337, 457583, 445601, 263694, 555726, 428038, 374930, 479222, 256785, 553411, 559890, 78715, 477948, 607976, 576852, 589649, 228030, 420335, 488968, 629194, 639314, 849355, 609727, 383572, 723940, 823009, 713536, 802760, 242910, 510437, 713223, 765340, 837284, 710302, 501844, 783799, 221738, 556119, 783909, 535847, 479889]
14770D79889J49720P754j67088J69705r9284o3838k07145P31553j72583j24567
14760G04116K26315k85601j98797K9049K56682n9003n4922R1530o579j43616p7256
14749D81918K24035j53043r067J17459l4322n8769L61550l16233K37691p9373
14739G71846l0435o840m1257l1036K96605D58998L05462P0299p509m7538N798
14728G85510L7999j17189n9547K48985k05924m3842M5430J13020k11276J01162
14718F94328J25697o0936J46166Q2857k18302l130J52908r1498J84773k26422
14708G86441j9686J03582j62403j53378K33617J5483J27724j87920J86938l68781
14698E61617l678N03966n12730L41702J65435D52800N22512l80026K63120J96396
$$ y = [479889, 629609, 637363, 470275, 639980, 540696, 476858, 269713, 1001266, 828683, 704116, 930431, 644830, 446033, 475082, 731764, 672761, 617839, 709369, 702790, 559174, 481918, 705953, 552910, 543843, 661302, 626980, 568211, 929761, 613528, 851219, 771846, 741411, 734571, 693314, 662278, 958883, 458998, 764460, 834759, 827250, 779712, 785510, 823509, 706320, 646773, 895758, 689834, 645992, 691422, 804442, 593166, 694328, 820025, 759089, 905255, 988112, 769810, 766680, 919588, 828090, 1012863, 786441, 766755, 870337, 707934, 554556, 788173, 803656, 931380, 743460, 930398, 561617, 557939, 1061905, 549175, 890877, 1056312, 452800, 975312, 595286, 858406, 1054802]
14688A054802j60472J89697k6596O3889k61125N7962j18771J98298m18692N70620
14678A149612j83368q2355P1669l2329P402P5950k9268M6921k21433J9411N20994
14667A343206m59693K10788K36622m7605k37456m8578J85326p419Q921j35420
14657A048692k19107M69840k31306J55171p3851N5508j92608P1214l3837K5007
14647A074723L42964j04535l41003J47631k41804M12263j41577L73890n43692
14638I78860L40463j57133R6660j23227K61904m21293L97349j74171J7423K25502
14628A442337j70227K22409j5439k00570m8048R3619L43581m26604L57418k14682
14618A383794Q13O5872l20072P3585K20037M549j50878J94142L3342M5541j58186
$$ y = [1054802, 894330, 1084027, 1057431, 1121320, 860195, 918157, 799386, 997684, 578992, 1149612, 966244, 883889, 955558, 923229, 930631, 1006581, 977313, 1024234, 802801, 822212, 1343206, 883513, 1094301, 1330923, 1283318, 1045862, 997284, 1182610, 1175191, 1184112, 1048692, 829585, 1299425, 1068119, 1223290, 1149439, 1204947, 1012339, 1083553, 1049716, 1074723, 1417687, 1313152, 972149, 1119780, 877976, 1290239, 1148662, 1522552, 978860, 1319323, 1162190, 1258850, 1135623, 1397527, 976234, 1373583, 1199412, 1216835, 1442337, 1272110, 1494519, 1479080, 1278510, 1230462, 1324081, 1667662, 1241058, 1598476, 1383794, 1384607, 1450479, 1130407, 1203992, 1424029, 1428578, 1277700, 1471842, 1505184, 1550725, 1392539]
14607A392539J6350K54374k11329K65015n00871M92243k99021P8772L32358n25386
14597A295044L16702K45736l04212J16711O6731q1073L0530K91058j41138k07977
14587A628112L42986m42992J37042Q1645J75185k83506o2304K91872J5319o7104
14577A816255R4654j05703k56261L24041L2517k9418l3255o0722M62591j23347
14567B121352n5194R6149n0749O7875j39123m525K98330j09055J37375J99479
14557B561914l49947J89562k5158p771r0586L82544k77771N07987j08044O0298
14547B843028j15071Q5660K11539J29520L75375j14231L27754N75398J96705P59637
14537E275314L71586Q87027J756733K484445L893723O591948J0971996n43352
$$ y = [1392539, 1408889, 1663263, 1451934, 1716949, 1216078, 1708321, 1409300, 1488072, 1820430, 1295044, 1611746, 1857482, 1553270, 1669981, 1736712, 1655639, 1686169, 1977227, 1836089, 1628112, 1971098, 1528106, 1665148, 1746793, 1921978, 1638472, 1576168, 1868040, 1883359, 1816255, 1910909, 1805206, 1548945, 1872986, 1905503, 1876085, 1842830, 1782108, 2244699, 2121352, 2066158, 2162307, 2111558, 2179433, 2040310, 2035785, 2334115, 2225060, 2362435, 2561914, 2211967, 2401529, 2376371, 2368600, 2278014, 2660558, 2382787, 2890774, 2782730, 2843028, 2727957, 2813617, 3025156, 3154676, 3530051, 3415820, 3743574, 4318972, 4515677, 5275314, 5646900, 6533927, 8290660, 10775105, 14668828, 21260776, 32232772, 31689420]
14529C1689420j1868675p226957m821577k735534p97561r77196k79984k2575m24140
14520B535221j2045l69219M64961n394l09658M34833j12043l57164J63770M7240
14510B480502p4657K00591J29679l76505K05355L33312l34691N0594P3122L34951
14500C022253l86911M93905k00621J38019q9219l0374R569J29536M57417o03624
14490B939950J71039N1598j85362L20665K11892J0147q5189K93892n80727L97502
14480C545407L31084m59378m8475L27695j35989K50419l746l13699N20554P3175
14470D087047l57188K75912J58897j84005O7743J39893K80479j97818J4849j43180
14460D142629J36148L20813k61162O1787K20324j91641j24215O17369l20917L01595
$$ y = [31689420, 19820745, 12593788, 7772211, 5036677, 4239116, 3261920, 2981936, 2959361, 2535221, 2523176, 2153957, 2618918, 2613524, 2303866, 2738699, 2626656, 2269492, 2433262, 2480502, 2405845, 2606436, 2736115, 2359610, 2564965, 2898277, 2563586, 2614180, 2687302, 3022253, 2635342, 3129247, 2928626, 3066645, 2977426, 2947052, 2956621, 3086157, 3543574, 2939950, 3110989, 3162587, 2977225, 3297890, 3509782, 3519929, 3434740, 3728632, 3147905, 3545407, 3876491, 3417113, 3368638, 3696333, 3560344, 3810763, 3807017, 3493318, 4013872, 4087047, 3729859, 4005771, 4164668, 3980663, 4048406, 4188299, 4468778, 4270960, 4285809, 4142629, 4278777, 4599590, 4338428, 4400215, 4620539, 4428898, 4304683, 4922052, 4601135, 4902730]
14450D902730j43041K35890l3872K63351l30055P4098K77940M9754L20567k94105
14440E323257J15662K85552M548n1232j98011N34051n7538m3072k6822K44011
14430F130406l7812M83328l61138J93540q233p4580N07132j05097J80517M5406
14420F953469R6813O8378J57454J8799p0462K16663J27546J28159L04357n9079
14410G942097k58592M30166J7909K90294j08614L4379N56108j61950N1061m0334
14400H752524L54070K60190J86506k83751K72317L07911p3287M54168r8078J74309
14390A0306879N09268k82012K88014J04637J13440J5222M82895J17951K88395
14381A1944689P4627j3308L47989O07138P4973M8255K89700p7991O59144l9973
$$ y = [4902730, 4759689, 4995579, 4961707, 5225058, 4895003, 4969101, 5247041, 5296795, 5617362, 5323257, 5438919, 5724471, 5729019, 5677787, 5479776, 6013827, 5956289, 5913217, 5886395, 6130406, 6092594, 6575922, 6214784, 6408324, 6400091, 6325511, 6832643, 6727546, 6908063, 6953469, 7050282, 7118660, 7276114, 7294913, 7224451, 7441114, 7568660, 7696819, 8001176, 7942097, 7683505, 8113671, 8131580, 8421874, 8313260, 8347639, 8903747, 8741797, 8792858, 8752524, 9106594, 9366784, 9553290, 9269539, 9541856, 9849767, 9776480, 10230648, 10132570, 10306879, 10816147, 10534135, 10822149, 10926786, 11040226, 11055448, 11538343, 11656294, 11944689, 12019316, 12006008, 12353997, 12961135, 13036108, 13084363, 13374063, 13296072, 13955216, 13915243]
14371A3915243K70003K38970L95750P7773L07858N77872J03752L86483K38305
14362A6512009L12142M03645p02K86372P84708L70894N69801J2279N32366L9327
14352A9822841N13533N76194N44635K98616P16596K91770M22793O45712L27446
14343B4160136K00686J108596O48952M43646N22810N78997J060782L18215Q67093
14334B9909913P12065J064481O04821P21111J228082P65617Q41747J352563M51955
14325C7652355J375617J093728J181507J065443J184709J547982J166262R59292
14317D7226895J804910J500161J419021J945503J554636J904834J784077J889626
14309F1029663K427034K038183K279766K428979K357437K703208K200568L525837
$$ y = [13915243, 14185246, 14424216, 14819966, 14897739, 15205597, 15783469, 15887221, 16273704, 16512009, 16824151, 17227796, 17227094, 17513466, 18298174, 18669068, 19238869, 19251148, 19783514, 19822841, 20336374, 20912568, 21457203, 21755819, 22472415, 22764185, 23186978, 23832690, 24160136, 24360822, 25469418, 26118370, 26562016, 27084826, 27663823, 28724605, 29042820, 29909913, 30621978, 31686459, 32291280, 33012391, 34240473, 35006090, 35847837, 37200400, 37652355, 39027972, 40121700, 41303207, 42368650, 43553359, 45101341, 46267603, 47226895, 49031805, 50531966, 51950987, 53896490, 55451126, 57355960, 59140037, 61029663, 63456697, 65494880, 67774646, 70203625, 72561062, 75264270, 77464838, 80990675]
14301H0990675K892223L460439L245319L913101L557337M077541L931765M758006
14293A10826406M800708M959527N170478N664600N712124O142275O349381P351735
14285A56977234P075270P921200Q240830Q951832R050809R555555J0520025J0500161
14277B28792916J1394683J1942091J2254328J3314713J3091647J4530004J3704029
14270C19024411J3742195J4212924J3661116J3490071J2202786J2262735J2041245
14263D10637483J0553468R471458Q741564Q117001O418377L463935J850624J086698
14255D60340608K197243k132530n561448m708987q488854j0354176j0180687j1480667
14247D09630502j1259161j2793217j4070363j3961071j4570671j3917216j4413888
$$ y = [80990675, 83882898, 87343337, 90588656, 94501757, 98059094, 102136635, 106068400, 110826406, 115627114, 120586641, 125757119, 131421719, 137133843, 143276118, 149625499, 156977234, 164052504, 171973704, 180214534, 189166366, 198217175, 207772730, 218292755, 228792916, 240187599, 252129690, 264384018, 277698731, 290790378, 305320382, 319024411, 332766606, 346979530, 360640646, 374130717, 386333503, 398596238, 410637483, 421190951, 430662409, 439403973, 447520974, 453939351, 457403286, 459253910, 460340608, 462537851, 460405321, 454843873, 450134886, 441646032, 431291856, 421111169, 409630502, 398371341, 385578124, 371507761, 357546690, 342976019, 329058803, 314644915]
14240C14644915j3906825j3132173j2408021j3140537j1958975j2032852j1876316
14233B26189216j1491335j0965965j0548562r602437q940828q258728q238657
14226A58142704o938527p484773o163903o338401n282776n476387n271086n118295
14218A10068556m509569l839069m030191l761424l647906l793041l325552l014235
14210H0147569l055987k665884k591894k700392k666513j773365k328116k179183
14202F0186235j801938j841091j763560j647570j409160j958657j482550j598360
14194D6683349j430720r03301r52243j123395j726263o29838j140675j155860
14186C7621054q95822p92837j041069j134720r81206o26093o78915q38704p89334
$$ y = [314644915, 300738090, 287605917, 275197896, 262057359, 250098384, 238065532, 226189216, 214697881, 203731916, 193183354, 183580917, 174640089, 166381361, 158142704, 151204177, 143719404, 137555501, 131217100, 125934324, 120457937, 115186851, 110068556, 105558987, 101719918, 97689727, 93928303, 90280397, 86487356, 83161804, 80147569, 77091582, 74425698, 71833804, 69133412, 66466899, 64693534, 62365418, 60186235, 58384297, 56543206, 54779646, 53132076, 51722916, 49764259, 48281709, 46683349, 45252629, 44349328, 43397085, 42273690, 40547427, 39917589, 38776914, 37621054, 36725232, 35932395, 34891326, 33756606, 32775400, 32149307, 31470392, 30631688, 29842354]
14177B9842354q81160l30082r23734q33147l70422m11152j038457r9118q15820
14168B4139262m01943m78078l86526o50923k32520p13837m75562n35203k95141
14159A9969529k59551k20846n93607k80279k42969p59996l46898l9771k05132
14150A7020480n03824j91811m02003k86310n66279L49464n70939l11328k72218
14141A4265232J32596k19385o05711l40075j08503R7808m30245q6105l55416j14159
14131A2236037R0310m02256l03785Q8780k93474l17162K1652l88675r2232j77672
14121A0461523l19697J3859l93706M7389K5286m54882J10721k26610j82033K7996
14111I109846m1255k45853m12762K8061l29021J2421J95358l49762J73192l9259
$$ y = [29842354, 28961194, 28631112, 27707378, 26874231, 26503809, 26092657, 25054200, 24955082, 24139262, 23737319, 23259241, 22872715, 22221792, 21989272, 21275435, 20799873, 20264670, 19969529, 19709978, 19489132, 18895525, 18615246, 18372277, 17612281, 17265383, 17225612, 17020480, 16516656, 16324845, 15922842, 15636532, 15070253, 15419717, 14848778, 14537450, 14265232, 14397828, 14178443, 13572732, 13232657, 13124154, 13221962, 12791717, 12705612, 12350196, 12236037, 12326347, 11924091, 11620306, 11709086, 11415612, 11098450, 11120102, 10731427, 10639195, 10461523, 10141826, 10155685, 9761979, 9809368, 9834654, 9379772, 9490493, 9263883, 9081850, 9109846, 9068591, 8822738, 8409976, 8438037, 8109016, 8121437, 8316795, 7967033, 8140225, 8100966]
14101H100966k79568k27842j85981R3339m4157k57887J37977k0587l06315j76135
14091F833810J65679k15891K63424m81155K05599n57170J39530j05317j73878
14082F074631K78720k53427Q8561k85048Q601j54917K16674n1213m60756K86242
14072E748068l90276O0514r5955q2458j69406L55139m75124k1302N9805Q8742
14062E077747j96610L17672p36423L83989k7237k87756K39033q9376k25554O5388
14052D520873N4340j45753K01072m24778O5984k3908J02722M0993j69544k75296
14042C946705M88226j69201k14461j2174K5260k04416j12580K27485k66693j24489
14032C583662K85813m05457L84815l18606n660L69201n07468K3667n9666J00319
$$ y = [8100966, 7821398, 7593556, 7407575, 7500914, 7456757, 7198870, 7336847, 7316260, 7009945, 6833810, 6999489, 6783598, 7047022, 6565867, 6771466, 6214296, 6353826, 6248509, 6074631, 6353351, 6099924, 6188485, 5903437, 5912038, 5757121, 5973795, 5922582, 5461826, 5748068, 5357792, 5418306, 5322351, 5239893, 5070487, 5425626, 4950502, 4929200, 4989005, 5077747, 4881137, 5198809, 4462386, 4846375, 4819138, 4531382, 4770415, 4681039, 4455485, 4520873, 4575213, 4429460, 4630532, 4205754, 4271738, 4247830, 4350552, 4391545, 4222001, 3946705, 4434931, 4265730, 4051269, 4039095, 4064355, 3859939, 3747359, 3974844, 3708151, 3583662, 3869475, 3464018, 3848833, 3530227, 3524567, 3893768, 3386300, 3409967, 3350301, 3450620]
14022C450620j83731j32470P7472J00752j7804Q8255r7280j2266Q0593m33595
14012B920546L59987n17215L52116J03038l4777m88620K02116j80160J18518k81082
14002B554467M52855j96213N1376j36702m95131M27174q7834R8555P8507j60559
13992B586495r2286J03836k45577L44482k16485R643l11612N62863j65545L03629
13982B879443k77495J54443K19391j00549O15804l03488Q84659R68595J756229
13973F797032L372018O060013J1493001N435402j0432946p906732m706857k498844
13965G612087j610878j028286l68858n55587j13323o95646R8826m78220L88546
13956C248661n10432J34879m8589k80225j55183J81218q7403m1576j97316K98117
$$ y = [3450620, 3266889, 3134419, 3211891, 3312643, 3294839, 3383094, 3285814, 3273548, 3354141, 2920546, 3280533, 2763318, 3115434, 3218472, 3183695, 2695075, 2897191, 2717031, 2835549, 2554467, 3007322, 2811109, 2862485, 2725783, 2230652, 2657826, 2569992, 2668547, 2747054, 2586495, 2494209, 2598045, 2352468, 2696950, 2480465, 2490108, 2178496, 2741359, 2575814, 2879443, 2601948, 2756391, 2975782, 2875233, 3491037, 3187549, 4072208, 5040803, 6797032, 10169050, 16229063, 27722064, 33157466, 22724520, 14817788, 10110931, 7612087, 6001209, 4972923, 4604065, 4048478, 3935155, 3239509, 3338335, 2860115, 3248661, 2738229, 2873108, 2824519, 2544294, 2389111, 2570329, 2482926, 2441350, 2244034, 2542151]
13946B542151k58761o8282K45998l75220K32073j06615J14530l36958K00284j03621
13936B085579j47096J25069N4372k23442K17769j285j66390q962p7053L42182
13926B200743k40300L5034k58565k5218J43048n1563k01970K39506k77042J47986
13916A711659J48668M1107p4604k70248L74520j13663l09891n2866J34814J18856
13906A708352K0502R1477m63148J33014K501n5369N13672m11206P1017p1940n1618
13895A487254K85987j72822j26209O8364P8805r1274J1866j2752l59912K88995
13885A458302j37319N8827j54315R2591K32815l68184Q9157J73742k98983K60844
13875A407477k66011L33311J53323j69292J26740j94406M6615j16629n7194k5802
$$ y = [2542151, 2283390, 2215108, 2461106, 2085886, 2317959, 2211344, 2325874, 1988916, 2189200, 2085579, 1938483, 2063552, 2117924, 1894482, 2112251, 2110966, 1944576, 1935614, 1858561, 2200743, 1960443, 1995477, 1736912, 1711694, 1854742, 1803179, 1601209, 1840715, 1563673, 1711659, 1860327, 1901434, 1826830, 1556582, 1931102, 1817439, 1507548, 1454682, 1589496, 1708352, 1728854, 1820331, 1357183, 1490197, 1492698, 1437329, 1951001, 1539795, 1610812, 1538872, 1487254, 1773241, 1600419, 1474210, 1542574, 1621379, 1530105, 1541971, 1529219, 1169307, 1458302, 1320983, 1379810, 1225495, 1318086, 1550901, 1182717, 1271874, 1445616, 1146633, 1407477, 1141466, 1474777, 1628100, 1458808, 1585548, 1391142, 1437757, 1321128, 1263934, 1238132]
13865A238132J61980m52318N82387k41622L9092K10744j84824o6361J30806o2127
13855A355889q3155j40155Q3864J1481j45822n0199K13748l25961M80235j62777
13845A237148k57472J95874p3489L27362k40372k86689M26095R5366j74030r6911
13835A152882m6338K89114l66395J21956J84149l16097k05128K82489J68305l67487
13825H97450J75448r5854o8556K90708k06887N8763l1281L1684j4002n7941k01219
13814G78313J85297j17467k7293O9513k27248L33490J08003k95434J03307K93666
13804A204147l21340J78650n7035J06402q6586J10714k20432K21222k18001j22338
13794G95403L499j09330o9152l6017J86804J54585J20971l43302Q005q2668j00631
$$ y = [1238132, 1400112, 947794, 1530181, 1288559, 1327651, 1538395, 1353571, 1287210, 1418016, 1355889, 1272734, 1132579, 1216443, 1227924, 1082102, 1031903, 1245651, 919690, 1399925, 1237148, 979676, 1175550, 1102061, 1429423, 1189051, 902362, 1328457, 1423823, 1249793, 1152882, 1106544, 1395658, 1029263, 1151219, 1335368, 1019271, 814143, 1096632, 1264937, 897450, 1072898, 977044, 908488, 1199196, 992309, 1051072, 1019791, 1051475, 1037473, 979532, 778313, 963610, 846143, 818850, 888363, 661115, 994605, 1102608, 807174, 910481, 1204147, 882807, 1061457, 1004422, 1110824, 1024238, 1134952, 914520, 1135742, 917741, 795403, 798902, 689572, 620420, 584403, 771207, 925792, 1046763, 703461, 711466, 628798, 528167]
13783E28167K64714j81641n4764M28917k36155O8665M58J46513R2631k95088J79608
13772I42025Q6332m40598K30621L55648n01024K17880j03103p6489J07622M672
13762H23586K43468l26864N9568j85633M59441m43434P1089L21442J19306l57236
13752G84733J74423j12551k1587k98383M39405p6512j53756j53410J2919k1865
13742E73416M9972j79188M05788l63032N5506K49066J5636n3633p9473j91307
13732D82751M51269l44578Q314J45017l25105L83926k88604J27750J73103Q7355
13722I01198l11181J25210J32744l52354K62608k31801k07253L30992q8774J36898
13712F98287k05717M22497q3680l99122L43030l87432K55046j24544q2844M897
$$ y = [528167, 792881, 611240, 556476, 985393, 749238, 817903, 818361, 964874, 1057505, 762417, 942025, 1028357, 587759, 818380, 1174028, 673004, 890884, 787781, 711292, 818914, 823586, 1067054, 740190, 799758, 614125, 1073566, 630132, 701221, 1022663, 1141969, 784733, 959156, 846605, 825018, 526635, 966040, 889528, 735772, 582362, 595281, 573416, 623388, 444200, 849988, 486956, 542462, 791528, 807164, 753531, 674058, 482751, 934020, 589442, 597756, 742773, 417668, 801594, 512990, 640740, 813843, 901198, 590017, 715227, 847971, 495617, 758225, 526424, 319171, 650163, 561389, 698287, 492570, 915067, 831387, 432265, 775295, 387863, 642909, 518365, 435521, 440418]
13702D40418R7762L68301k23073P416L6784B48839O57462r763l55001K4469p1430
13691D94576P8839j42667L78405C36269M16767j52548k68493N52068D06634J86093
13681E92727k10724R2292m2837A81284M71268q9824k80967K21784K6146N8011
13671E87702Q2436j05370k17839K19408k71819N3261N1382J81528n6038J45880
13661F70531j71922A93121K89834Q1434r8538j06592j71191L41799B07836J61135
13651C68971P2738j96947Q2761J43946J47858j71160L06316k53157O3280j79975
13641C84631K01261K3695B39583L47317R2654k09091n3261j18750J60360R2084
13631E50896p030A90405Q8806M97K40890L6170k6284O0498K05886C75566K36552
$$ y = [440418, 538180, 906481, 683408, 690824, 727608, 248839, 906301, 896538, 541537, 566006, 494576, 573415, 430748, 809153, 336269, 753036, 600488, 331995, 884063, 406634, 592727, 382003, 474295, 431458, 181284, 652552, 562728, 281761, 503545, 529691, 587702, 670138, 564768, 346929, 566337, 294518, 347779, 399161, 580689, 524651, 670531, 498609, 193121, 482955, 564389, 465851, 359259, 188068, 529867, 207836, 368971, 441709, 244762, 327523, 471469, 619327, 448167, 754483, 501326, 564606, 384631, 585892, 609587, 239583, 586900, 679554, 470463, 417202, 298452, 458812, 550896, 543866, 190405, 279211, 279708, 520598, 556768, 530484, 590982, 796868, 375566, 612118]
13620F12118J1712k87458J10579F1244K34477K15925L5746k27839M06932C24518
13609F60999B33867K06153R9884K284k19009A47875L57320B15359k5344o1419
13599A28596K65951A83829K03690q7115o7049L41218k48203J77K25366J6012M5545
13588F13470j13907j1345q7688q4714K14063M6019j23254k2870A73955L09646
13578D83601A1281O65880D2364K85692K96041k78168j15751I1437M10011q2811
13568D18637K17084I6189M61933k05433j18444L151K47958A09056J06965M03488
13558F19509n7492A51411K21013r6560K72707j29797N5901k06145j0476n4639
13548B03415J97754J0966l7014A38851J42887L8606J79027j79078J85180q2217
$$ y = [612118, 623830, 336372, 446951, 61244, 295721, 511646, 547392, 319553, 726485, 324518, 660999, 233867, 440020, 539904, 542188, 323179, 147875, 505195, 215359, 190015, 128596, 394547, 183829, 387519, 300404, 233355, 574573, 326370, 326547, 551913, 567925, 613470, 499563, 488218, 400530, 315816, 529879, 575898, 452644, 429774, 173955, 483601, 11281, 677161, 42364, 328056, 624097, 345929, 230178, 91437, 501448, 418637, 635721, 96189, 558122, 352689, 234245, 237396, 485354, 109056, 216021, 619509, 562017, 151411, 372424, 275864, 548571, 418774, 474675, 268530, 258054, 203415, 401169, 412135, 375121, 138851, 281738, 320344, 499371, 320293, 505473, 423256]
13538D23256J06879j66379K36638l3609j24069Q8265m2350K6352A91352M06786
13528E98138k14461m0328E8992K58213j32993J9650L46599B13787Q6855j22850
13518A77792C9750M30501h5359C76834j26993G9700N4270K73109j66805K75514
13508E15788k23438n3574a263E57700F4084J91880J39108j60199k9855o0060K81072
13497D26030K636k5007m6861p0148E0880K1666R9862J15247J00291A26681o916
13486A19765E0354L70886A13109J90549J46034A56059K79384j5189K63636C36489
13475B21825H3823a31310F82706B11806O844n2237N2360F6539N15234b7663D29376
13463c1909A69929D0311M04126p6017P8121q8813J62060j94633a8153C65299o5817
$$ y = [423256, 530135, 363756, 600394, 566785, 442716, 530981, 488631, 514983, 191352, 598138, 383677, 343349, 58992, 317205, 184212, 203862, 550461, 213787, 300642, 177792, 39750, 470251, -85359, 376834, 249841, 79700, 133970, 407079, 240274, 515788, 292350, 238776, -1263, 557700, 64084, 255964, 395072, 234873, 205018, 144958, 426030, 428666, 403659, 356798, 286650, 50880, 72546, 172408, 287655, 387946, 126681, 119765, 50354, 421240, 113109, 303658, 449692, 156059, 435443, 420254, 683890, 336489, 221825, 83823, -131310, 682706, 211806, 218650, 166413, 218773, 66539, 581773, -27663, 429376, -31909, 169929, 40311, 444437, 368420, 446541, 357728, 519788, 325155, -18153, 365299, 299482]
13452B99482j13620K19510p19K42185k85664R4442B24000b10122B24457P2864
13442B97321P9628B7832M26783p4175A42462F4805L80297P4711j23165r0235a0097
13430A84128j8028K44532A45093J94704K38704j41582N0746A1278J50680p3978
13420H7980K58511a74510A97477b0983D219c0634D00135n7332P1075A13493K43772
13409C57265J33314n7225k09186J23102q6529K9118h8848A65075K05554A85207
13398E34914j11982l9302B1851P1796l5370K43525d8356A56588J0376B8505L25209
13387C53714j03608B0946J90009g7363K8431B79766m7697N2041p7031r8601B4682
13375D93696k41552R508J00759a36904B20007b5695A2920M69574j98810J30254
$$ y = [299482, 185862, 405372, 404653, 646838, 361174, 455616, 224000, -210122, 224457, 297321, 376949, 27832, 454615, 380440, 142462, 64805, 445102, 519813, 396648, 306413, -10097, 184128, 166100, 410632, 145093, 339797, 578501, 436919, 487665, 11278, 161958, 87980, 346491, -174510, 197477, -20983, 4219, -30634, 400135, 342803, 413878, 113493, 357265, 490579, 433354, 224168, 347270, 260741, 289859, -88848, 165075, 370629, 185207, 534914, 422932, 383630, 21851, 93647, 58277, 301802, -48356, 156588, 166964, 28505, 353714, 250106, 20946, 210955, -77363, -48932, 279766, 232069, 284110, 207079, 108478, 24682, 493696, 252144, 261652, 362411, -136904, 220007, -25695, 12920, 482494, 283684, 413938]
13365D13938A39620E8487J64127j00432D4810J43269d4745B88359J50923j46352
13355B92930L84618A43116l0504J77217j41468K01639o4865M4262a53046A71116
13344C73846g2794a8769A18795r852h1212G9400J85014O6489A46451P5039J70597
13333C92087f394F58470B58991K92359B21836J37642j31148K05859j41249j10405
13323A82535J42174o8668g8021G0850Q0528A8060M46496B27238K2795j9605o3138
13312A67290K64454b42172C41864J6332k0770M6131N4591D0528J23020J78436
13302C41984A34767a38933F11843k10989l0926r9231K85657k23737F2649J72921
13292B35570J7000C2323Q4719l3358c8165B43809K6363E0139a24474C90823k8820
$$ y = [413938, 139620, 58487, 222614, 122182, 44810, 188079, -44745, 288359, 439282, 292930, 677548, 143116, 112612, 289829, 148361, 350000, 285135, 329397, -153046, 171116, 373846, -72794, -18769, 118795, 108943, -81212, 79400, 264414, 330903, 146451, 221490, 392087, -6394, 658470, 258991, 551350, 221836, 359478, 228330, 434189, 292940, 182535, 324709, 256041, -78021, 70850, 151378, 18060, 464556, 227238, 250033, 230428, 167290, 431744, -242172, 341864, 358196, 337426, 383557, 438148, 40528, 163548, 341984, 134767, -138933, 611843, 400854, 369928, 270697, 556354, 332617, 62649, 235570, 252570, 32323, 117042, 83684, -38165, 243809, 270172, 50139, -124474, 390823, 362003]
13281C62003A67554J82948j12999J62933A00038J47269D9706K4687L98702L0153
13271E03248A35238J95635E1465h3535B83315H1292N4419F3129K24536i823A33839
13259A86353a41024o0839A98884a4212j97937B76673A30126L5188p1216K0505
13249A14603N35403I6760K19561m8772p0655I0992R086L40579a36972D0635e6143
13237B08036A8139J74871J23626l2282J42506j04800b01230i1557M0557G3995
13226B7272M18310I7625J35035p0962J45534g1288F2465B9690f4218j82402A8936
13214f5346A58518J2419E0032i6906C6550d1290F1707J49680e1671A23100b3629
13202A4078f0420B07553B8884Q6550J26417a67904E87929B48043J35140a8111
$$ y = [362003, 167554, 350502, 237503, 400436, 100038, 247307, 49706, 74393, 473095, 503248, 135238, 330873, 51465, -83535, 283315, 81292, 135711, 63129, 287665, -9823, 133839, 186353, -141024, -201863, 198884, -14212, -212149, 276673, 130126, 165314, 94098, 114603, 650006, 96760, 316321, 267549, 196894, 90992, 100078, 440657, -136972, 40635, -56143, 208036, 18139, 193010, 316636, 284354, 426860, 322060, -201230, -91557, -51000, 73995, 27272, 445582, 97625, 232660, 161698, 307232, -71288, 62465, 29690, -64218, -246620, 18936, -65346, 158518, 170937, 50032, -96906, 36550, -41290, 61707, 211387, -51671, 123100, -23629, 14078, -60420, 207553, 28884, 115434, 241851, -167904, 587929, 248043, 383183, -18111]
13191A15647h5897F6567C65h7448a9912A50656J03985q977i383B35711E9274Q1577
13179A40851d4581B48908I1975a95261f8200B80825j6150j02853c9458A10958
13168C57707G0002J64794E0206R4427m7273b23280D53889H9047D406J73554j7838
13157A60122L15974b13824B18399A02498J89861j6712C0007a84346g8158B77935
13146B32913j13625E4490M1931M15926B08146C0342k883a46369d2055p6480A15411
13134A5627g9346B19397E0405K06240k1860J66000j81707j05935e118C41219p2223
13123B68996a46257g2855C29785h4750F5433J83657D4371J35439A5852c16419
13112A24260m8516Q9833A1673b13175g8452F9273b41676E33410B03589p6790a02164
$$ y = [115647, -85897, 66567, 365, -87448, -19912, 150656, 254641, 245664, -9383, 235711, 59274, 140851, -44581, 248908, 91975, -195261, -68200, 280825, 264675, 161822, -39458, 110958, 357707, 70002, 234796, 50206, 144633, 97360, -223280, 453889, 89047, 4406, 177960, 160122, 476096, -213824, 218399, 102498, 292359, 275647, 30007, -184346, -78158, 277935, 232913, 119288, 54490, 96421, 512347, 208146, 30342, 27459, -146369, -42055, -118535, 115411, 15627, -79346, 219397, 50405, 256645, 234785, 400785, 219078, 113143, -5118, 341219, 268996, -146257, -72855, 329785, -84750, 65433, 249090, 44371, 179810, 15852, -316419, 124260, 75744, 165577, 11673, -213175, -78452, 69273, -241676, 533410, 203589, 126799, -102164]
13100a41703e1784C85347H7321L1496b04024B62138r9726K2844J07002j44739
13090A47519F2347J5007a82341A27292L07724J9942H0479C8716R2266a3454B23230
13078A56988m0277K3300N9158a62795H9358J35512p3524h6361j3377e579B00416
13066a69609A76514j7509a59927A5614J14387Q7985b7669C72935O7771A17732
13055c12270J9993B36789a6685B99437b3732B51779A7103L34302b04379B48050
13044b09902C8300O1563D3316O0296c4561j28520E880L6328L18391G2435M7365
13033A19800m5391c165B02422J4890f0036J7490A54236J1740G3696K02158a1380
13021A94234C0777N3435i7825A69032h580l94123A07973d2404D96486B07853D4394
$$ y = [-141703, -51784, 385347, 87321, 118817, -204024, 262138, 162412, 185256, 292258, 147519, 62347, 77354, -182341, 127292, 435016, 454958, 80479, 38716, 130982, -13454, 223230, 156988, 116711, 140011, 199169, -162795, 89358, 224870, 151346, -86361, -99738, -5579, 200416, -169609, 176514, 159005, -159927, 15614, 130001, 217986, -27669, 372935, 440706, 117732, -312270, -292277, 236789, -16685, 299437, -23732, 251779, 17103, 351405, -204379, 248050, -209902, 38300, 99863, 43316, 103612, -34561, -163081, 5880, 42208, 360599, 72435, 119800, 74409, -3165, 202422, 217312, -60036, -42546, 154236, 165976, 73696, 275854, -11380, 194234, 30777, 84212, -97825, 169032, -8580, -402703, 107973, -42404, 496486, 207853, 44394]
13009C10876k5293d1384A18296K31293A61250K0174C0904b49377E2594J95996
12999B48590m1944J47085A39414D0248L8117J63595F6195K90963G8518a15832
12988a48004D07995e3233A59924c4994A41342l0544R7172o0372b0042C6024L02820
12977C38844j55125f1023B70819j11953b22256B33847a06742G5770J43984b64418
12966F7585L73547A72653D2353J6936M679a55860e9638B10673C9014a94046B1364
12954a39114L9594A0865N10387H1090a54516j02132e6995B56749D3717f6753k57980
12943c24733A2666K6440f6206C84829D6304A215K83843E4031B3264K68617e9581
12931e31r3784B33953I9006b66256C7652a28665b5878A4897J32832D6223b70584
$$ y = [310876, 285583, -41384, 118296, 349589, 161250, 181424, 30904, -249377, 52594, 248590, 206646, 353731, 139414, 40248, 78365, 241960, 66195, 357158, 78518, -115832, -148004, 407995, -53233, 159924, -34994, 141342, 110798, 207970, 147598, -20042, 36024, 338844, 183719, -61023, 270819, 158866, -222256, 233847, -106742, 75770, 219754, -264418, 67585, 441132, 172653, 42353, 59289, 63968, -155860, -59638, 210673, 39014, -194046, 21364, -139114, -99520, 10865, 521252, 81090, -154516, -256648, -56995, 256749, 43717, -66753, -324733, 12666, 39106, -66206, 384829, 46304, 1215, 285058, 54031, 23264, 291881, -59581, -531, -94315, 233953, 99006, -266256, 37652, -128665, -25878, 14897, 147729, 46223, -270584]
12919D4470g6919A15544K32448g975j18758D6034G521c32150A12139a05632F8318
12907a0037C18618d5584j27447A41324i1670o3347j00929G1875h2025m3495A47960
12895A38399F4494B1322P1405m4851N5170L130a53734B96171j20831J53281e1751
12883C2969L5253a563A70976G4885K1089a1741H4615a68122A40486J14380a62975
12871D27303A20240L3905M5308J89060A22126K5924N7947r6176G3h3382E1742
12859H6563A1468J37634K5470K70014g7336C0647J83223F7455b3862B5196J0376
12848C5572a51966B98344d3074J0194A3723i529A36580J8616a28227C68846a27472
12836a4118E0140J0886K0416L20824b19662A26773c04545D6405c8411j33412A60480
$$ y = [44470, -76919, 115544, 347992, -7975, -126733, 46034, 7521, -332150, 112139, -105632, 68318, -10037, 318618, -45584, -173031, 141324, -91670, -155017, -255946, 71875, -82025, -125520, 147960, 138399, 64494, 21322, 92727, 47876, 103046, 106176, -153734, 296171, 175340, 328621, -51751, 32969, 68222, -1563, 170976, 74885, 95974, -11741, 84615, -168122, 140486, 254866, -162975, 427303, 120240, 154145, 199453, 388513, 122126, 148050, 205997, 109821, 73, -83382, 51742, 86563, 11468, 149102, 174572, 444586, -77336, 30647, 213870, 67455, -23862, 25196, 35572, -151966, 298344, -43074, -32880, 13723, -9529, 136580, 155196, -128227, 368846, -127472, -14118, 50140, 61026, 81442, 402266, -219662, 126773, -304545, 46405, -38411, -171823, 160480]
12824H7436l2067a8737l74324A23839h8149A66847P6693a49983D25805a0079j22341
12813a32420j46101a15087L4369b3473j09342a8300A21605m4270h9286B3555b2622
12801f4780L0568l96444e1294A16735E3081a38711E0994J56077l1507j3197c16042
12789A55387b52058E5208A0779c52176C7327O482J02377a27823a4858f97p218
12778g915o9698D15988l2744q0328i3881j7765d748p8063l8754r2034A78257P4090
12766B52347A21878f9175A57846J34583d24348a13150m0992A24440J99051e8292
12755c6049r4166A12384c3209B8968a02092L3650b5262j60524d5980C17818A28533
12743A92877c2576a5150A4408a76357I9084K15525c17091B03206b06829d725A82330
$$ y = [87436, 55369, -18737, -393061, 123839, -88149, 166847, 243540, -149983, 425805, -10079, -132420, -278521, -115087, -80718, -23473, -132815, -18300, 121605, 77335, -89286, 23555, -22622, -64780, -34212, -430656, -51294, 116735, 53081, -138711, 50994, 207071, 175564, 162367, -316042, 155387, -252058, 55208, 10779, -352176, 37327, 43809, 146186, -127823, -14858, -697, -7915, -77613, 415988, 383244, 302916, -93881, -111646, -4748, -82811, -121565, -213599, 178257, 252347, 121878, -69175, 157846, 292429, -424348, -113150, -154142, 124440, 323491, -58292, -36049, -130215, 112384, -33209, 28968, -102092, -68442, -25262, -185786, -45980, 317818, 128533, 192877, -32576, -15150, 14408, -176357, 99084, 314609, -317091, 203206, -206829, -4725, 182330]
12731G7220K47982D5512c85736J74800D4221d3922H0083N3852a7956B89844D6164
12719B53895C1296a28481K3932B27240O3333q6632p6053J80653p4597a44728D6884
12707a43144m8457A12924K9420n8161a40969A61864o8517a02159A05434K23428
12697C28862a60377j62101G5796K71085b6192F4671J43686a26654B31231a04933
12686B15023b02969B67675c17224B47090i49j4596A09855K27171r2659A01595
12675A81085m6401l6195a06721B09348B8409J9872a3165B49920o8180b3017j5657
12664c8674j3186r82B9870K93664a8957B76721A38058n251K34476l4103q6434
12653B46746j3592H2369a82908H0377J3614J53830A303J17116C3918g7069B82523
$$ y = [77220, 325202, 45512, -385736, -210936, 44221, -43922, 80083, 133935, -17956, 289844, 46164, 253895, 31296, -128481, -104549, 227240, 290573, 203941, 127888, 308541, 233944, -144728, 46884, -143144, -191601, 112924, 142344, 84183, -140969, 161864, 93347, -102159, 105434, 328862, -160377, -322478, 75796, 346881, -26192, 64671, 208357, -126654, 231231, -104933, 215023, -202969, 267675, -317224, 247090, -949, -15545, 109855, 337026, 244367, 101595, 181085, 134684, 98489, -106721, 209348, 28409, 48281, -13165, 249920, 181740, -23017, -38674, -51860, -52842, 29870, 323534, -18957, 276721, 138058, 132807, 367283, 333180, 246746, 233154, 82369, -182908, 80377, 93991, 247821, 1303, 118419, 33918, -77069, 282523]
12641B99985J91797A59767c14108A63659R4417C3715K7392R7896E6205K27318
12631B83523c0049F3759K05378g501A45712J2992a72863l6165G1434K5979B374
12619B25971J77781e2598r512C57345A18765e7482A38878K08111K3596A18139
12608C21143j22698q3068R5518C4621b0638J245C95101A78939D9718K29393F2109
12596G6013a32938I3714M394N2822o7248c810B00935b08937A59646d24400D2040
12584D8936J85699L7291c09523g375j36630C98633f0981B22493e12617a37462
12573a67211A3812L07509J72032C9667b52429C42634l9522F8216b75375H9813
12562B33577J64387q5948j07455c13907C71668D1072b68436l736E0470a13147
$$ y = [299985, 491782, 159767, -314108, 163659, 258076, 33715, 61107, 159003, 56205, 283523, -30049, 63759, 269137, -7501, 145712, 158704, -172863, -209028, 71434, 97413, 2374, 225971, 403752, -52598, -62110, 357345, 118765, -57482, 138878, 346989, 370585, 118139, 321143, 198445, 115377, 210895, 34621, -20638, -19393, 395101, 178939, 49718, 279111, 62109, 76013, -132938, 93714, 98108, 150930, 83682, -3810, 200935, -208937, 159646, -424400, 42040, 48936, 234635, 271926, -309523, -7375, -144005, 398633, -60981, 222493, -512617, -137462, -167211, 13812, 321321, 493353, 39667, -252429, 342634, 303112, 68216, -275375, 89813, 233577, 397964, 312016, 204561, -313907, 371668, 41072, -268436, -272172, 50470, -113147]
12551A03896O1378J27101i5352d4929A7983M2820f1743H3608C0709K26512d0059
12539b24628I6308D6586c12381J32848A19819m215a51532A14390b46817b1126
12528A14323f8105B46245b34833j25890F3411J10205J39092A19723J3356e634
12517B74122j35323J25214J84449a30339j06555F1973J25472a65673f7702m60280
12507e27982A90358E742J70940n4910d1997j58995C86888q6242G9300J74859B6039
12495i1862k24748A3154a16382B34473L2031A0883J61875a69635E9516d9732A9646
12483b68134c2451l03785e1493A71479a64054e4356A57381f208j77836B86095
12472H7701k7269i2716D84492A57843b92380D9190h357j58857D5202a04012D560
$$ y = [103896, 165274, 292375, -95352, -44929, 17983, 60803, -61743, 83608, 30709, 257221, -40059, -224628, 96308, 46586, -312381, -179533, 119819, 115604, -151532, 114390, -246817, -21126, 114323, -68105, 246245, -234833, -360723, 63411, 173616, 312708, 119723, 133079, -5634, 274122, 138799, 264013, 448462, -130339, -236894, 61973, 187445, -165673, -67702, -527982, 190358, 5742, 176682, 121772, -41997, -200992, 386888, 300646, 79300, 254159, 26039, -91862, -316610, 13154, -116382, 234473, 266504, 10883, 172758, -169635, 59516, -49732, 19646, -268134, -32451, -336236, -51493, 171479, -164054, -54356, 157381, -6208, -184044, 286095, 87701, 60432, -92716, 484492, 157843, -292380, 49190, -8357, -167214, 45202, -104012, 4560]
12460a11169r882F3174K99426I6608j1323K20947e7976k04062a06977J4564q408
12449a00821B98680F710c67600A59925g5496A53007c56758A6628d6750j44117
12439a90867j76124B74810j4773j04297C5954J01480A4199e9562j95733a04158
12428i5775B05933n8111R8757a58076c4331B03868C7712R4727J48114a65159j15591
12417b80750a03655l13344A14457J87096D4476a04114n6929A21762b75294O3589
12407b11705B39041k0933e3150C3786a18312d0151A46343k4986E3540b56580A73219
12395H5261M68560G0031J45010O5528e0207C6252H698b1558q4059a8590j79900
12384a98490D89880a55621A17559J4379b27511A32820M8604a20197F4552c60966
$$ y = [-111169, -121051, 63174, 362600, 96608, 85285, 306232, -57976, -262038, -106977, -92413, -100821, 298680, 6710, -367600, 159925, -75496, 153007, -356758, 16628, -46750, -190867, -366991, 274810, 260037, 155740, 35954, 137434, 14199, -59562, -255295, -104158, -95775, 205933, 147822, 246579, -158076, -34331, 203868, 37712, 132439, 280553, -165159, -280750, -103655, -416999, 114457, 301553, 44476, -104114, -161043, 121762, -275294, -211705, 239041, 218108, -53150, 33786, -118312, -40151, 146343, 121357, 53540, -256580, 173219, 85261, 553821, 70031, 215041, 280569, -50207, 36252, 8698, -21558, -105617, -18590, -198490, 489880, -155621, 117559, 131938, -227511, 132820, 181424, -120197, 64552, -360966]
12373G8392B3048J43692b89467e9257C1974P0213J60302a07649C09585F8555d5323
12361A44748J74840C3486N5830d6416G367h2681F8012L64995A27853J26102h0298
12349b31524N1968e9108f111j00690A37100a56202n3141A69519a57654A58583
12338h216A22787a80655A0705c14066J8225A55687p1265f2554B30561I5932c38353
12326a26653B32288a66809j10011J14390A7213Q6823g3580j3110A08383J29958
12316B38341a10648q9244M8935A56030E1595J14805G826a02660j2011C3473b30624
12304d0537k38725B464f1307p3545d3845o0371N590A42848o461a08850L3695k0101
12292i5256A61377b17194A42557h9098D53077a00937k8435G5872M8513D7642H744
$$ y = [78392, 23048, 166740, -289467, -59257, 31974, 102187, 262489, -107649, 309585, 68555, -45323, 144748, 319588, 33486, 89316, -46416, 7367, -82681, 68012, 433007, 127853, 253955, -80298, -231524, -179556, -59108, -6111, -106801, 137100, -156202, -209343, 169519, -157654, 158583, -8216, 122787, -180655, 10705, -314066, -295841, 155687, 84422, -62554, 230561, 95932, -338353, -126653, 232288, -166809, -276820, -162430, 17213, 104036, -73580, -86690, 108383, 238341, -110648, -199892, -150957, 156030, 51595, 166400, 7826, -102660, -114671, 33473, -230624, -40537, -279262, 2464, -61307, -134852, -43845, -104216, -98626, 142848, 136387, -108850, -75155, -95256, 161377, -217194, 142557, -89098, 453077, -100937, -129372, 75872, 124385, 47642, 8744]
12280a6398B69045B501K2161f7996K7709A22891B8432J4650C787b421G8505O0388
12268A38893a26890m6208A81022j4701J35246a39919f428I9813L28311j65086
12258B63038K90435A89947m2315A8027K75566b02470A56704n9145M2990l8015
12248A02534e1383B04657L8259A00214h1453A09491N8466D0948B0282J91533a62472
12236d75B791L3535a56161I8444n997P1569J61146D6480J0605d6449A93108e6915
12223c750B71293o9906n0174E4536J33990M3314q4306L5109a67971B32677M3642
12212B76319D5923J36990J01673r9388K67691k23424B196J87451k3875l0866H087
12200C89716p1937a18256j50709B04313r0401J88779a03906A07449J72416a9685
$$ y = [-16398, 269045, 2501, 24662, -67996, -40287, 122891, 28432, 43082, 3787, -2421, 78505, 138893, -126890, -173098, 181022, 166321, 301567, -139919, -6428, 99813, 428124, 263038, 553473, 189947, 147632, 18027, 293593, -202470, 156704, 97559, 140549, 102534, -51383, 204657, 242916, 100214, -81453, 109491, 167957, 40948, 20282, 211815, -162472, -475, 2791, 36326, -156161, 98444, 92447, 164016, 325162, 46480, 57085, -46449, 193108, -56915, -3750, 271293, 201387, 151213, 54536, 188526, 231840, 147534, 182643, -167971, 232677, 276319, 45923, 182913, 284586, 185198, 452889, 229465, 2196, 189647, 165772, 134906, 8087, 389716, 317779, -118256, -268965, 204313, 113912, 302691, -103906, 107449, 279865, -19685]
12189c777C02733G3539k489L35715j61037r4030J28012J1795A28249K78506b18228
12177a26208A96383a9604A65393J24049R0472j14014B5447D534L6147K7127K5599
12166I3407K61103b7272G4637L46693p7401j55694B7915P5638L14893q0896I7829
12154G0513J6994K3307R339a888B73445a6492j392B04702a77623E71678B31007
12142C00115J9315i1029c8628D4306K4160b53124I1586a42260e0295B6040d76811
12130B82228I272K20412A9510a34381G763J56490a51922A24281l7087g3028I0521
12118F7915J25682E9820c683C0490O0051J21666a73510A81217J63457a71750C630
12106a74322F9639r743L4109a0901D7878a59425m0339j9481B46483C6576d61982
$$ y = [-3777, 302733, 73539, 71050, 406765, 245728, 151698, 279710, 291505, 128249, 406755, -218228, -126208, 196383, -19604, 165393, 289442, 379914, 265900, 25447, 4534, 40681, 67808, 93407, 354510, -27272, 74637, 421330, 343929, 188235, 27915, 103553, 418446, 337550, 97829, 70513, 87507, 110814, 120153, -1888, 273445, -16492, -17884, 204702, -177623, 571678, 231007, 300115, 319430, -91029, -38628, 44306, 68466, -253124, 91586, -142260, -50295, 26040, -476811, 282228, 9272, 229684, 19510, -134381, 7763, 164253, -151922, 124281, 87194, -73028, 90521, 67915, 193597, 59820, -3683, 30490, 90541, 212207, -173510, 181217, 344674, -171750, 3630, -174322, 69639, 59896, 94005, -10901, 47878, -159425, -199764, -219245, 246483, 36576, -461982]
12094A46938i7476n6068I8896B1709c6031j33577c8495k3958j26905p0437h180
12082d2997B03898B4395N0260K99782A29948a63293J918G1487K25443a84174C61089
12070A5965N6663K31260I3562a38844c3442C7271M50893A17736K24570M91956
12060H34262L67858C48810e4550C25871A00112m214A5990J38943c20969A59612
12049A94966b20030B6144f7859J062K9135G832a46760k87687A19428g7818K7020
12038e0798B15291J5786b99716a6600k15309A84240a55009C1463J89262a16727
12027A61428a00457b8597j03678M0389p4524A83966f6258B59287D2025h8284A0402
12015h8027A01513d27234e9552l4351C4427M9107a72016g8790b9090B99151A15210
$$ y = [146938, -97476, -153544, 98896, 21709, -36031, -169608, -38495, -62453, -189358, -259795, -8180, -42997, 203898, 24395, 74655, 374437, 129948, -163293, -161375, 71487, 296930, -184174, 361089, 15965, 72628, 303888, 93562, -138844, -33442, 37271, 488164, 117736, 342306, 834262, 1202120, 348810, -54550, 325871, 100112, 95898, 15990, 154933, -320969, 159612, 194966, -220030, 26144, -67859, -66797, -37662, 7832, -146760, -434447, 119428, -77818, -50798, 215291, 231077, -299716, -16600, -231909, 184240, -155009, 31463, 220725, -116727, 161428, -100457, -28597, -132275, -91886, -166410, 183966, -66258, 259287, 42025, -88284, 10402, -88027, 101513, -427234, -59552, -93903, 34427, 83534, -172016, -78790, -29090, 299151, 115210]
12003A69521F4472a01185b3459C27525i2958E0959b32836A8518g399j24270M2036
11992h9633H183h9472I9739K50642B1500d1462A8383J94776d27426G5394c9662
11980c4652A5876M59280e69189a54008I005K11744a38871k7026A59256n8330b27102
11968b64022J15878L8553A80522o4146M598c11315H9815f3805j27398B55320b78628
11956H3278a41970j19663a18005H5149h0182B5522O8078C137c0749j859j26877
11945a59485c1150C0291O8902P7746a3047j47463K0997b8091j97137A10360a16964
11933a17153A29485R0536e4303j9930A0577L0758b07383B03769q5719D8575b71620
11921I2474P4685J6615H1605h5224m7240e4383A24437K0613n3200h2473a1720
$$ y = [169521, 64472, -101185, -23459, 327525, -92958, 50959, -232836, 18518, -7399, -131669, -89633, 8183, -89472, 99739, 350381, 21500, -41462, 18383, 213159, -427426, 75394, -39662, -34652, 15876, 475156, -569189, -154008, 9005, 220749, -138871, -165897, 159256, 100926, -227102, -264022, -148144, -109591, 180522, 116376, 120974, -311315, 89815, -63805, -191203, 255320, -278628, 83278, -141970, -261633, -118005, 85149, -80182, 25522, 93600, 3137, -30749, -32608, -159485, -31150, 30291, 99193, 176939, -13047, -160510, -139513, -28091, -225228, 110360, -116964, -117153, 129485, 220021, -54303, -74233, 10577, 41335, -207383, 203769, 118050, 48575, -271620, 92474, 167159, 183774, 81605, -85224, -132464, -54383, 124437, 145050, 91850, -82473, -11720]
11909e8921j16823B83154A8449J69586L0005b13053E4389P4324J24915j26227
11899A27401K7200a04731E3988P2170n6497a91342j7999P2024f6704M637B25351
11887B34526i1591j4095D457a75105F6093C2040i1598m2002H876K27302C766K36523
11875B40289b02176B18009F4164a44124o1967C61065g6792p0230m6012A94925
11864A01632c5697n8487A28348n0754a66155e8111o8792f3153k0787A6416P6585
11853I3001c68658J74453R1508k08737P1707e1020B47504a31496A01949C8035
11842A64448b6686F862d7539j78039i3462A84962C8690R4765c6759j00176K3023
11831a13912a9380j99162H9971g1927A08831P8296b9392j59975N2486c639A79300
$$ y = [-58921, -175744, 283154, 18449, 188035, 218040, -213053, 54389, 128713, 253628, 127401, 154601, -104731, 53988, 126158, 69661, -191342, -209341, -137317, -66704, -62067, 225351, 234526, -91591, -105686, 4457, -175105, 66093, 32040, -91598, -133600, 8876, 236178, 3766, 240289, -202176, 218009, 64164, -144124, -206091, 361065, -76792, -147022, -193034, 194925, 101632, -35697, -94184, 128348, 77594, -166155, -58111, -126903, -63153, -83940, 16416, 93001, -368658, -194205, -102697, -311434, -239727, -51020, 247504, -131496, 101949, 38035, 164448, -26686, 6862, -47539, -225578, -93462, 184962, 38690, 133455, -36759, -136935, -113912, -19380, -218542, 89971, -71927, 108831, 187127, -29392, -189367, -136881, -3639, 179300]
11819a48029j37904o8654j61957g8597l0683K380B59029A17547k4705J87351h7543
11807c5001n3399j23210k31103c1811j28683N7417b1640H8791a65777E9838c10785
11795i8499j3372n8312H3646b31938b6227r0966G8698a8929o3163K9934l67080
11784d19238J65500j12745J41953B78865a59951F9453r15c06714J45276A50449
11773a33627A31560b8590j85064b990l17499G1092L0076b81536D42027b29545
11762B62643m4553J53226a42571N5526d0511A73108d7665i570n2424B47565r6189
11751A51376c4086A61676g008l137j46064p4521J01598j72579C27e0689k14994
11740b65683b0536A43714m4049L8047a29538d4530p8949k16689B2707P2539M3561
$$ y = [-148029, -285933, -354587, -516544, -78597, -109280, -106900, 259029, 117547, 92842, 280193, -87543, -35001, -88400, -211610, -442713, -31811, -160494, -103077, -21640, 88791, -165777, 59838, -310785, -98499, -111871, -170183, 83646, -231938, -26227, -117193, 78698, -18929, -82092, -52158, -419238, -253738, -366483, -224530, 278865, -159951, 69453, 68538, -306714, -161438, 150449, -133627, 131560, -28590, -213654, -2990, -320489, 71092, 101168, -281536, 442027, -229545, 262643, 218090, 371316, -142571, -87045, -40511, 173108, -47665, -9570, -61994, 247565, 151376, -34086, 161676, -7008, -10145, -156209, -230730, -129132, -301711, 327, -50689, -265683, -20536, 143714, 99665, 137712, -129538, -44530, -123479, -340168, 22707, 95246, 138807]
11729A38807c54715a20839k3168d9869A78400g5292L1711C43439j16894J6071
11719B42616j18571g7388B82079b25689I1182q468I607J31064a51319B10204N5078
11708B65282a66341B8191a86591A2155J81215H5749Q1769b5344c278p032D01167
11696E53412q3640b76158C86880A1030b42376f7516l37468A48480C5156a21848
11685B6459a04707m7212M9371A5954R3303i477F9117L9308a25120B5035j625c9710
11672b79902B39424b32766D986J56300o6240d4274H9803J7236Q0270p9927f770
11660c69825A65948m6332P0365d0608E390P6818a892C05326h0173k85604A91722
11648I5453L4609E4379h700o08015E4598a73519f2531B50178q8874a34425k990
$$ y = [138807, -354715, -120839, -144007, -49869, 178400, -75292, -43581, 343439, 226545, 242616, 124045, -77388, 282079, -225689, 91182, 82714, 9607, 140671, -151319, 210204, 265282, -166341, 28191, -186591, 12155, 193370, 85749, 167518, -25344, -3278, -10310, 401167, 553412, 469772, -276158, 386880, 11030, -242376, -67516, -404984, 148480, 35156, -121848, 26459, -104707, -151919, -102548, 15954, 109257, -9477, 69117, 108425, -125120, 25035, 23410, -39710, -279902, 239424, -232766, 4986, 161286, 95046, -44274, 89803, 107039, 187309, 107382, -6770, -369825, 165948, 119616, 189981, -40608, 5390, 82208, -1892, 305326, -80173, -365777, 191722, 95453, 130062, 54379, -8700, -616715, 54598, -173519, -62531, 250178, 161304, -134425, -137415]
11637a37415h913B74463G2080R3992n3851b45370F6357j2613B264Q3160L2829
11626A18253J5040a40023B67128r3499f0903B15927k7957q0313g6626B02352A3335
11614B7818a0088l7222k12375C15611I0446a27419M9184C422P6690J75365j9346
11603B36131r7491J41321j28251d6009j60414m1486P7973f8414q3388j5466N8707
11592a08561A25152E8448k0013i6419o2713i992E2049J55494a68855H1726g2452
11580a06162A0341b23576A19587L9449J81973a40950A30387L7124c2164J4493
11570a7671o7307C8733J08805J19399p3062b11788F1338R4601e2622K0501j90695
11559b22816E2380K07130A6787h505A1023O6761B0174b29510A03243K43655A48868
$$ y = [-137415, -8913, 274463, 72080, 166072, 112221, -245370, 66357, 53744, 2264, 85424, 118253, 133293, -140023, 267128, 173629, -60903, 215927, 187970, 107657, -76626, 202352, 13335, 27818, -10088, -47310, -259685, 315611, 90446, -127419, -78235, 3422, 80112, 255477, 236131, 138640, 279961, 151710, -46009, -206423, -247909, -169936, -68414, -151802, -167268, -108561, 125152, 58448, 38435, -96419, -159132, -9992, 52049, 207543, -168855, 81726, -72452, -106162, 10341, -223576, 119587, 159036, 341009, -140950, 130387, 167511, -32164, -17671, -84978, 38733, 147538, 266937, 193875, -211788, 61338, 155939, -52622, -32121, -222816, 52380, 259510, 16787, -8505, 11023, 77784, 20174, -229510, 103243, 346898, 148868]
11547A90767p1317J66368H8651a20963l5925B5164c846j54107A31402J47589j01884
11536A77107i0564C0788e9069j0646m8601F514O8087O0560N975B8938a0778I3360
11523A5096b5369o4525A26903a62337D34270A95687G480Q3576b3686I5878J11563
11512B07441a7345j98939A41932Q401a28579A21054J51071o63j22020a42531B33585
11500B7674M15509A81024J9562K455K20a95404j67627A131b73381D72405G814
11488C0517J72388K1593a18113F32872E1150o347J22408F238J34559a13665m8599
11477a62264A68557q3656N6392J26867D0993b61281A98104E6976L5738K93705
11467C86419A71545K27530j19596E6806M591d3950I5372j1062L52877A42810a7613
$$ y = [190767, 119450, 285818, 88651, -120963, -156888, 25164, -3846, -157953, 131402, 278991, 177107, -90564, 30788, -59069, -69715, -118316, 6514, 74601, 135161, 141136, 28938, -10778, 93360, 15096, -25369, -89894, 126903, -162337, 434270, 195687, 7480, 91056, -23686, 95878, 207441, -17345, -216284, 141932, 150333, -128579, 121054, 272125, 271462, 149442, -142531, 233585, 27674, 443183, 181024, 200586, 203041, 203261, -195404, -363031, 1131, -273381, 472405, 7814, 30517, 202905, 224498, -118113, 632872, 51150, 44803, 167211, 6238, 140797, -113665, -162264, 168557, 84901, 141293, 268160, 40993, -261281, 198104, 56976, 92714, 386419, 171545, 399075, 279479, 56806, 61397, -43950, 95372, 84310, 437187, 142810, -17613]
11455A21620h9098E63904B20248a23251j18768D09429c463p1826A50619f1000
11444A45147J62550j05370a03168C70987A16351d921k9172A76296B5132J03235
11434A28367a29176A58834D2340L89349j55710d788j89549G0936K42026E5907
11423D1166P775R243L50734b10283C20013a40775p4883C4287j5600g0749B30976
11411E40099j88161b2639l6735j75022m0208P8647j27K7397E0655b17054C8318
11399B5020f1480b6774C8571i1007B15129h4393j69091K9662D9130J773O759L6839
11387I4501f2486K4070B56575r7409f7404E061O2369J32547a90114A40487q023
11376A32464d78886i5161C42963a74253Q918I0152C1633N02976a28336q434B8994
$$ y = [121620, -89098, 563904, 220248, -123251, -242019, 409429, -3463, -75289, 150619, -61000, 145147, 307697, 202327, -103168, 370987, 116351, -4921, -34093, 176296, 25132, 128367, -129176, 158834, 42340, 431689, 275979, -4788, -194337, 70936, 312962, 55907, 41166, 48941, 58184, 408918, -210283, 320013, -140775, -215658, 34287, 18687, -70749, 230976, 540099, 351938, -22639, -59374, -234396, -274604, -195957, -196084, -168687, 50655, -217054, 38318, 25020, -61480, -26774, 38571, -91007, 215129, -84393, -253484, -223822, 49130, 50903, 57662, 94501, -62486, -38416, 256575, 159166, -67404, 5061, 67430, 199977, -190114, 140487, 132464, -478886, -95161, 342963, -174253, -165335, 90152, 31633, 534609, -128336, -136770, 28994]
11364a31229H4078f7630j10041P1129j95949h3826A04071M8550J76607b891A76824
11352D8480a40025A39146b29000A18087b6701C23201i1079m9257A90974n3958
11342A37016j0788c3004j25962b8779A84561q4605m4996b32565j70835a7971k01609
11331b19580A86308d1771B54150g2389A71756f3404r5824j31611B60720a60256
11320b921A10935g3471l7012K9352E7662J5169b46109D7650r112A4499a203A57581
11307b88524K3210J04662k60038B1711e875B29076c3107k43173d8471B32782n6527
11296A76255B5739b41784B6492J44501k906A0452h8151B04074I8341h1920k02662
11285b84582l8189O1394h3474l7127C4655j0749a05122j72810i8251k41483a62610
$$ y = [-131229, 84078, -67630, -177671, -106542, -302491, -83826, 104071, 152621, 329228, -2891, 176824, 48480, -140025, 139146, -229000, 118087, -26701, 323201, -91079, -140336, 190974, 137016, 126228, -33004, -158966, -28779, 184561, 99956, 54960, -232565, -403400, -17971, -219580, 186308, -41771, 254150, -72389, 171756, -63404, -159228, -290839, 260720, -160256, -2921, 110935, -73471, -110483, -81131, 57662, 72831, -246109, 47650, 38538, 14499, -1203, 157581, -288524, -265314, -160652, -420690, 21711, -5875, 229076, -33107, -276280, -48471, 232782, 176255, 25739, -241784, 26492, 170993, 168087, 10452, -88151, 204074, 98341, -81920, -284582, -322771, -261377, -83474, -120601, 34655, 23906, -105122, -277932, -98251, -339734, -162610]
11273a28160A08996b75220A20220m5544a77689E0166J80329F0703a25151H6295
11262a16486A15288c8790p4003A05516j5349a96402f2105a6564A09073L18471
11252D27544g2391j59570d0180j90638C7546L35420j40634a52662j06847E7840
11241a87358E38876a56800k3203A67542p7245a63784c9669j40749j10366F3617
11230A80858C0040c70555A09787a49080d7867j02540j39772G6283A1677a39648
11219b18093J103c542D7779d01484a69973a9303E4535b45401D1604J66521d17327
11207b4379k18791j32085h7687J0095j19587B71286a85445a2958k35639k3308
11197b71905a01263A27069b05100A46291g7066B43900b04019H6352J16450C4231
$$ y = [-128160, 108996, -275220, 120220, 74676, -177689, 50166, 230495, 60703, -125151, 86295, -116486, 115288, -38790, -112793, 105516, 90167, -196402, -62105, -16564, 109073, 427544, -72391, -231961, -40180, -230818, 37546, 372966, 232332, -152662, -259509, 57840, -187358, 538876, -156800, -180003, 167542, 90297, -163784, -39669, -180418, -290784, 63617, 180858, 30040, -370555, 109787, -149080, -47867, -150407, -290179, 76283, 11677, -139648, -218093, -216990, -3542, 47779, -401484, -169973, -19303, 54535, -245401, 41604, 208125, -417327, -24379, -243170, -375255, -87687, -77592, -197179, 271286, -185445, -12958, -248597, -271905, -101263, 127069, -205100, 146291, -77066, 243900, -204019, 86352, 202802, 34231]
11186c8881m442j09687m9724a3211l49916A51119b80358P9508A6931e1341B12946
11174A17379b73514e5994e987C9564a01812B3339O8776a82851N3487A41429e2341
11162b4089l09192d0671A09663l2454P1969Q6454d56930p6865A20792J36528f7904
11150c31385B80228C5107J81786G0783j2201M1279a22280E3943J15239b86170
11139h1275A9267J4018O2672N6857J08509d49381J31741a6001j1155L55j88188
11128b14989B2556N9107B1845e4381B28959c8498C27728E1670a87111D0808a56249
11116b28805M4344e817A70181p5975N9283i6720K4190B33023k9457a6049B35252
11104C69329a3135I5966J92981j28645G082J90348a38805q0558B83225j19646
$$ y = [-38881, -43323, -153010, -202734, -13211, -363127, 151119, -280358, -200850, 16931, -51341, 212946, 117379, -273514, -55994, -5987, 39564, -101812, 23339, 92115, -182851, -129364, 141429, -52341, -24089, -333281, -40671, 109663, 77209, 149178, 235632, -456930, -533795, 120792, 257320, -67904, -331385, 280228, 35107, 216893, 70783, 58582, 99861, -122280, 53943, 169182, -286170, -81275, 19267, 33285, 95957, 152814, 261323, -449381, -317640, -16001, -27156, -26801, -214989, 22556, 81663, 21845, -54381, 228959, -38498, 327728, 51670, -187111, 40808, -156249, -228805, -184461, -5817, 170181, 94206, 153489, -96720, -72530, 233023, 203566, -16049, 235252, 369329, -13135, 95966, 288947, 160302, 7082, 197430, -138805, -219363, 283225, 163579]
11094A63579b08779p514B65824J44084j96434J75291B6184K65460o311Q1853p0219
11083B96967f1200C0150J79139E0518K32199b93316A25079C6087J83801A5635
11072A65679J68259r7643j10264J16102J71074c1175C5397K72330L5077j64805
11062A77999m2140j980J68908m795J67510A78534c086G6737L02792A0889O1835
11051G2724N7844K09136J8082M62640l22568J89891j24956j12979J10312k13668
11041C46458K03226B04727M14473k32569K5022J58679L11980k49121j28867J83356
11031F87680K93601D42273l1601L09465J96677B88106M09581j22755L748K80992
11021H59672l25224M18499l10392j06270j73963K30406P9755J86483D20175L89663
$$ y = [163579, -208779, -216293, 265824, 409908, 213474, 388765, 26184, 291644, 285333, 367186, 296967, -61200, 30150, 209289, 50518, 282717, -293316, 125079, 36087, 219888, 15635, 165679, 333938, 236295, 126031, 242133, 413207, -31175, 35397, 307727, 342804, 177999, 135859, 133879, 302787, 297992, 465502, 178534, -3086, 76737, 379529, 10889, 72724, 130568, 339704, 357786, 820426, 497858, 687749, 562793, 449814, 560126, 346458, 549684, 204727, 619200, 386631, 411653, 570332, 882312, 633191, 504324, 687680, 981281, 442273, 410672, 720137, 916814, 288106, 697687, 574932, 578680, 859672, 534448, 952947, 642555, 536285, 362322, 592728, 672483, 858966, 420175, 809838]
11011H09838m1065O5147o3423J86602n6234j29362n6229P5345l69991q6449L70541
11000G04720B37845k7960P39925j12609m05549M62684O1496j27813k15155J06314
10990G19178l27453M87859l98714O13627p1735l93058J80968j58125j89033K43644
10980G07158q1535O2618R1676L05405j92448k4193j8317P6016l52119J31635K91182
10969I97078j10827L1636L02096q9750O1790K54647j49240L74446N3006K93667
10959B018549K64912J09062J73175K98136j40117N793j21847l30773K247k24468
10949B054669L8824m54723k0968R8822j04844m27676L69029L6619o8720p9162
10939A441870m7865j96153M07148o65720K1465k24522k86813r0102q7141J90276
$$ y = [809838, 768773, 833920, 770497, 957099, 900865, 771503, 715274, 790619, 420628, 334179, 704720, 237845, 209885, 949810, 837201, 431652, 894336, 955832, 828019, 612864, 719178, 391725, 879584, 480870, 1094497, 1022762, 629704, 810672, 652547, 463514, 707158, 625623, 688241, 779917, 1085322, 892874, 868681, 850364, 926380, 574261, 705896, 997078, 886251, 917887, 1219983, 1130233, 1192023, 1446670, 1297430, 1671876, 1724882, 2018549, 2283461, 2392523, 2565698, 2863834, 2723717, 2729510, 2607663, 2276890, 2279137, 2054669, 2093493, 1638770, 1617802, 1716624, 1611780, 1184104, 1553133, 1589752, 1521032, 1441870, 1394005, 1197852, 1605000, 939280, 960745, 736223, 449410, 359308, 272167, 462443]
10929D62443B10855m8906J87376k945c0303k1582B02976q0219d5389D67578f3261
10917a03208C88936j18258o9774J9833K070f0784p6114B99419J06078a0518A0899
10905g4996A40239J28251b00863i7540F5453L33875A08477N5164a77016F6311
10894B10002l1006m5332b45404I5899k1788i6336H8379b36839B9470J17243o8255
10883G8458C802b29709B70950C5041b15734B71933b1092j67078C41252b5858l8846
10872f4704B03456K4449A1398J78909D7838a96537m0505A5572E861b15905k0178
10861b36083L8003b2340l2840A8612b95090F1288A9356M2787c9835l02755C4814
10849A70124b32218f7576j0488j20626k20460D2649a39163G7696M6957b23968
$$ y = [462443, 210855, 161949, 349325, 346380, -30303, -51885, 202976, 122757, -45389, 467578, -63261, -103208, 388936, 270678, 200904, 220737, 222807, -60784, -136898, 299419, 405497, -10518, 10899, -74996, 140239, 268490, -200863, -97540, 65453, 399328, 108477, 163641, -177016, 66311, 210002, 178996, 133664, -245404, 95899, 74111, -96336, 88379, -236839, 29470, 146713, 78458, 3802, -229709, 270950, 35041, -215734, 271933, -21092, -188170, 341252, -25858, -64704, 203456, 227905, 11398, 190307, 47838, -196537, -237042, 15572, 5861, -215905, -236083, -198080, -22340, -55180, 18612, -295090, 61288, 19356, 62143, -39835, -342590, 34814, 170124, -232218, -67576, -78064, -198690, -419150, 42649, -139163, 77696, 124653, -223968]
10838A13346a26959a4059q2971M8056B61232e2316j40257Q9203A95438k286H3966
10826b35687B11040b22523e3332D27809l6072c3911e175o5952j8798k21250A48833
10814E3018f0974A19917c14724I6798a28616e1360j66664B60113c4661j34168
10804a68829l5680B83396a11792l00615A03926a43357h467j22903p8253l2279
10794b41902E794J01355C8289c67941m1309B73365A28599d1063E6959a95708D4043
10782d652C0036a65506d9813B36266a72092D07219H5789b11076P6635M3330r6474
10771a87585I8623i5761H0568a97499A9435n457J7516f9044A6021e6379r9251
10760a55630B9926a24643A66977d08217c6040b114C48543g6092k05350A7741J35277
$$ y = [113346, -126959, -14059, -97030, -48974, 261232, -52316, -192573, -103370, 195438, 193152, 83966, -235687, 211040, -222523, -53332, 427809, 391737, -33911, -5175, -71127, -89925, -311175, 148833, 53018, -60974, 119917, -314724, 96798, -128616, -51360, -218024, 260113, -34661, -168829, -204509, 283396, -111792, -412407, 103926, -143357, -8467, -131370, -209623, -241902, 5794, 107149, 38289, -367941, -409250, 273365, 128599, -41063, 56959, -195708, 44043, -4652, 30036, -165506, -49813, 236266, -172092, 407219, 85789, -211076, -134441, -91111, -187585, 98623, -95761, 80568, -197499, 19435, 13978, 31494, -69044, 16021, -56379, -155630, 29926, -124643, 166977, -408217, -36040, -2114, 348543, -76092, -281442, 17741, 153018]
10749A53018A4517b63285C98a90331N7550K9442m92497E1862b693E3037c43448
10737g6175A20486a33567K9891A95J87889c52525I796a5351B5414c6371c537r0625
10725i4162G3415b23481e359k22806o6601e6201j34237B02893D2604a91443L1111
10714a60332b8861j86206i0025M0718p3007a5752M838l89618J72980f9566J7159
10703e2407B9537b08688L5049Q5794L0811C95422a86668e1369l26286J52819n8518
10692b83354A04647e32175G7802r817M9584B0765J62260b85501A86905a10782
10681i2499g858l55966e1820k7312H8213g9839j56592n4949M0234B87742d1535
10669B10370e9360k51521a30900N0386A93683a86344O7897N5894m8761A84153
$$ y = [153018, 14517, -263285, 398, -190331, -132781, -103339, -595836, 51862, -2693, 53037, -343448, -76175, 120486, -133567, -103676, 195, 188084, -352525, 9796, -15351, 25414, -36371, -3537, -94162, 73415, -223481, -5359, -228165, -294766, -56201, -190438, 202893, 42604, -191443, -160332, -28861, -215067, -90025, -49307, -122314, -15752, -10914, -400532, -227552, -69566, -52407, 29537, -208688, -173639, -87845, -57034, 395422, -186668, -51369, -377655, -224836, -283354, 104647, -532175, 77802, 67985, 117569, 20765, 183025, -285501, 186905, -110782, -92499, -7858, -363824, -51820, -79132, 88213, -79839, -236431, -291380, -251146, 287742, -41535, 210370, -59360, -310881, -130900, -80514, 193683, -186344, -118447, -62553, -111314, 184153]
10658A82138j8533a17393j67536A18099a67366P1723B29093a62225B1012a66685
10647c2267B42448j02096e9793I7818b3898j5183j84910C1915J99853a36935N0844
10636h6091B56526H2821d7384q0755G372b07440A62830b00817j89063M6203g9012
10624c04596A60866c14597E3091a94942D6594P3510J48105a53151e7634K7242
10614c0392k7168m63723a39595A73353b03922h1121a1622B20935b02324A55051
10603B04201a51442j28508j46359a65648A79716k4072A7296b40427B63219k6488
10593B36731M2634a75581B9167d02507F0735P332a61288e2241B27057b3730j35907
10582a59637M3652k6523B4210g7451A26231k3484a8958j04837N9288D4645R932
$$ y = [182138, 163605, -117393, -284929, 118099, -167366, -95643, 229093, -162225, 21012, -166685, -32267, 242448, 140352, -59793, 97818, -23898, -39081, -223991, 31915, 231768, -136935, -86091, 256526, 82821, -47384, -128139, 7372, -207440, 162830, -200817, -389880, -343677, -79012, -304596, 160866, -314597, 53091, -194942, 46594, 120104, 268209, -153151, -57634, -30392, -57560, -521283, -139595, 173353, -203922, -81121, -11622, 220935, -202324, 155051, 204201, -151442, -279950, -426309, -165648, 179716, 155644, 17296, -240427, 263219, 236731, 279365, -175581, 29167, -402507, 60735, 68067, -161288, -52241, 227057, -23730, -159637, -115985, -142508, 24210, -77451, 126231, 102747, -18958, -123795, -64507, 44645, 54577]
10571E4577e3894j4169B18802A8840N62604a83111N1255j25600p7167L5909a12958
10559d5257b0018C22491f7044m7647F6260F157b6137A69558o0599b53853d8169
10547b3316k31362M8218e4245j81708D2528c01559I2015e7393B47774a3973k2730
10536c6703l30973a26747A20206K3530a50707j48970e9933A55785g4835A04765
10525c4453O28P40D9341a9031j71685D54a6928C03605b92985A15183r675a09071
10512a39368j01246h8859A52673b48670C7956a28482F6405a65637c9403A341L8371
10501C9712N2161M5579J6377K32142a30636c6442E1297k692N9258b27892Q4704
10490a43188F6104l579b32789o0758Q2041R0299m2125o2825B35686c75311Q2915
$$ y = [54577, -53894, -68063, 218802, 18840, 581444, -183111, -131856, -257456, -334623, -298714, -112958, -45257, -20018, 322491, -67044, -114691, 66260, 6157, -26137, 169558, 108959, -253853, -48169, -23316, -254678, -206460, -54245, -235953, 42528, -301559, 92015, -57393, 247774, -13973, -36703, -367676, -126747, 120206, 143736, -150707, -299677, -59933, 155785, -74835, 104765, -34453, -33825, -33085, 49341, -19031, -190716, 454, -16928, 303605, -292985, 115183, 105508, -109071, -139368, -240614, -88859, 152673, -248670, 37956, -128482, 66405, -165637, -39403, 1341, 39712, 91873, 137452, 153829, 385971, -130636, -36442, 51297, 48605, 107863, -227892, -143188, 66104, 62525, -232789, -293547, -211506, -121207, -163332, -226157, 235686, -375311, -292396]
10479b92396A6939J21119f1886A24506J44607e4319N208A53732c7411A90760a08963
10467B14989K202e2339r394B08617a2331A78738E5447a23159c1111C017a53651
10455f2649B61694d7502D4824K04852j20331b41870I8168a65934e3032B5873A0912
10443b89539f3715F1359O1790a06528l3020O3966K2976B35356b24817O4189P5865
10432h4763F1283J99661e3558a3814k94354J46884G7798b01069c116k78581c581
10420h2418C21147C9799K16706b5197A09726e3208p5246k40520B90000c9001B82466
10408a41982A35412e1631j01330A29517g8533I0273J20595K5465i8084C00565
10397b53040R4917d4401r50k65030a49396d3728l28867F0731J84749F3829b08472
$$ y = [-292396, 16939, 138058, -61886, 124506, 269113, -54319, -49111, 153732, -37411, 190760, -108963, 214989, 217191, -52339, -61733, 208617, -12331, 178738, 55447, -123159, -31111, 3017, -153651, -62649, 261694, -47502, 44824, 249676, 129345, -241870, 98168, -165934, -53032, 25873, 10912, -289539, -63715, 61359, 123149, -106528, -139548, -75582, -52606, 235356, -224817, -160628, -84763, 61283, 260944, -53558, -13814, -308168, -161284, 77798, -201069, -3116, -281697, -3581, -82418, 321147, 39799, 256505, -25197, 109726, -53208, -128454, -368974, 290000, -39001, 282466, -141982, 135412, -51631, -152961, 129517, -78533, 90273, 210868, 236333, -98084, 300565, -253040, -158123, -44401, -45351, -310381, -149396, -43728, -372595, 60731, 245480, 63829, -208472]
10385a95644A15448a00152a878j32797B68495o6795a6903G7643K3965a09722m5020
10374a54742B40094e7633A71753N544a31335A27600D4604R4160k7549J47083L3326
10363B91624J29293G2366J01170M7131j1208a64913G7991L64319p4365K4363N7625
10352D49933A73448J13253K83448j43811o809j66143F3138L55131a47716A02023
10341C29824R7917j90218q1239m0658J07015o6487K74143M90316D311N12072k11272
10330C05111J21629P0505k28736L8609r1577K10307r017j85698K27033A30330
10319B12396n4309C2421L3740P5926a35550C6698L50780l5108a03763A56357m1569
10308A14788j702L9381a90688E16050A45565C9015M7128d7807E09502k52486H5365
$$ y = [-195644, 115448, -100152, -1878, -134675, 268495, 201700, -16903, 77643, 101608, -109722, -154742, 240094, -57633, 171753, 177297, -131335, 127600, 44604, 138764, 111215, 258298, 291624, 420917, 72366, 173536, 220667, 209459, -164913, 77991, 442310, 367945, 392308, 449933, 173448, 286701, 570149, 426338, 419529, 253386, 63138, 418269, -147716, 102023, 329824, 427741, 237523, 156284, 115626, 222641, 156154, 430297, 920613, 4311, 516383, 305111, 426740, 497245, 268509, 307118, 215541, 425848, 416831, 231133, 458166, 130330, 212396, 158087, 32421, 66161, 142087, -135550, 36698, 387478, 352370, -103763, 156357, 114788, 113086, 152467, -190688, 516050, 145565, 39015, 86143, -47807, 509502, 257016, 85365]
10296G6728d0864B26809a79027P3516d2419r6267c7116j11534j9366A19806d10079
10284B23228A04493M3999O0749A5236N0635M1305Q8396D7136J0011b2613k998
10273b5611E1910L4355N6253D0568b0318j67613O3144n4706A9432a25987A06304
10261E4565a94853j50001f0652A54433a31544O1850A97642L01836A17647G184
10250C1350b05151q9463B95357L5988L938B9183J64250O5051I7353Q0965o5965
10239A12353n1851a31756f2600B79911P4467A64343b97174F2950J28094h3431
10228A04220K00112L1983c28593H537J92674d4156j27714d4714n4284G3718r72
10217G2746j2549A407d6104l093A6261K51370a07946A63055b11719C97135a40798
$$ y = [76728, -40864, 226809, -179027, -105511, -42419, -138686, -37116, -148650, -168016, 119806, -410079, 223228, 104493, 148492, 209241, 15236, 65871, 107176, 195572, 47136, 57147, -22613, -25611, 51910, 86265, 142518, 40568, -20318, -187931, -124787, -179493, 19432, -125987, 106304, 54565, -194853, -344854, -60652, 154433, -131544, -69694, 197642, 499478, 117647, 7184, 31350, -205151, -294614, 295357, 331345, 335283, 29183, 193433, 258484, 97353, 178318, 112353, 60502, -131756, -62600, 279911, 354378, 164343, -297174, 62950, 191044, -83431, 104220, 304332, 336315, -328593, 8537, 201211, -44156, -171870, -44714, -98998, 73718, 72746, 60197, 1407, -46104, -49197, 16261, 267631, -107946, 163055, -211719, 397135, -140798]
10205C1960j1228a10725M4775k07589F0197a81492r8205J05503j23616A8094g2978
10193a12540N5424b7322j32059d1883o7426j1957a0257q9032j07255f4245l10051
10182c74296A85520l1362h2047L3854j18224g1493C9875J5114g4294D3209e781
10170c7324a3914k09116a367A08873K3200b04194j6983i6570r0190G2781g9757
10158A41058k676J042b54426d9814j34629A78552R681q9885J53832a073j64752
10147a65825b0864B4780L47900f8077j69545C2087J0403g4168k93892j2357c3461
10135E8181O68b18339O1008N3377k19924g6422m9800D0103K20138d28309a51452
10123H5485C1859o525g4808j74865k05318B13160D2527Q7603g3586L0910j83845
$$ y = [31960, 20732, -110725, -65950, -273539, 60197, -181492, -279697, -174194, -297810, 18094, -72978, -112540, -57116, -27322, -159381, -41883, -109309, -121266, -10257, -99289, -206544, -64245, -374296, 185520, 154158, -82047, -48193, -166417, -71493, 39875, 54989, -74294, 43209, -5781, -37324, -13914, -223030, -1367, 108873, 132073, -204194, -221177, -96570, -186760, 72781, -79757, 141058, 138382, 139424, -254426, -49814, -184443, 178552, 188233, 98348, 252180, -1073, -165825, -20864, 24780, 372680, -68077, -237622, 32087, 42490, -74168, -368060, -380417, -33461, 58181, 58849, -218339, -157331, -103954, -323878, -76422, -126222, 40103, 260241, -428309, -151452, 85485, 31859, 25334, -74808, -249673, -454991, 213160, 42527, 130130, -73586, -42676, -226521]
10112b26521a5563n1400l4280A2779g6446E2269b73344J22623P5065j67724A69291
10100A58214M6672a48587A56860b53265J14190k2325j73361A69854f7965j22264
10090a90229m1489o9206P9332b3587A13636h5405M2663l46781A03159a37904k80633
10079d18537d1128J1132n3782C6440A4164M1674a05208F3838d8327n9214j56769
10068b64310J1380A16651b22966L0605I3208J79120A15596J01930b72603I516
10057a05801G0484h208C83837A87871d75870e3714a810B58704E571L0058J49236
10046A84865b08627A02060b27667E502L7187R1434c08547A280b06709L6076g7609
10034A17157a2052j39976A6271a437j33751h666G9051b71642H1310P3017O0718
$$ y = [-226521, -15563, -66963, -101243, 12779, -76446, 52269, -273344, -150721, -75656, -243380, 169291, 158214, 204886, -148587, 156860, -253265, -139075, -161400, -334761, 169854, -67965, -190229, -231718, -300924, -221592, -23587, 113636, -85405, -42742, -389523, 103159, -137904, -418537, -41128, -29996, -83778, 36440, 14164, 55838, -105208, 63838, -48327, -107541, -264310, -252930, 116651, -222966, -192361, 93208, 272328, 115596, 217526, -272603, 9516, -105801, 70484, -8208, 383837, 187871, -475870, -53714, -1810, 258704, 5571, 35629, 184865, -208627, 102060, -227667, 5502, 42689, 134123, -308547, 1280, -206709, -170633, -77609, 117157, -12052, -152028, 16271, -1437, -135188, -8666, 79051, -271642, 81310, 154327, 215045]
10023B15045a44317A86552D924c16291A3357J12107l5051b86475I7490J74833
10013B72323b1683k96904B02897G4051b24603M0830j33646B7536Q3728E0550a53803
10001C56206A60152a4855d681j30993l0748C3075N6491b1630o6596k25751F6744
9989A60907A1033i4582q1799Q2329l4522M6997C28901F1209c04358h611F718d0256
9976A2770b33090J00973j8581C2260L0477d4387I9792a07094A21147a40379M8854
9965i1525j09777M2368g8282A72052a62182A01672b39177i1463q8522q5300A68860
9953a15706b3436I5636i2580L4149n5575j27000b7039n9972j2510k36617a6598
9941C4514a18848K8282K5394G1235c69260A9188l522C93Q6959P0222G3278a79063
$$ y = [215045, -144317, 186552, 4924, -316291, 13357, 125464, 90413, -286475, 97490, 272323, -21683, -318587, 202897, 74051, -224603, -183773, -317419, 27536, 111264, 50550, -153803, 356206, 160152, -14855, -4681, -135674, -166422, 33075, 89566, -21630, -88226, -313977, 66744, 160907, 11033, -94582, -176381, -94052, -128574, -81577, 328901, 61209, -304358, -8611, 6718, -40256, 12770, -233090, -132117, -150698, 32260, 62737, -44387, 99792, -107094, 121147, -140379, -91525, -201302, -158934, -78282, 172052, -162182, 101672, -239177, -91463, -179985, -265285, 168860, -115706, -23436, 95636, -92580, -58431, -114006, -241006, -27039, -87011, -99521, -336138, -16598, 34514, -118848, -90566, -65172, 71235, -369260, 19188, 15666, 393, 87352, 157574, 73278, -179063]
9928a61598D2239a63995A95396d7449B17545a98156D8518a17403k06676J40586
9918a83493A34137b36767f8129k18657a37786c7197j06313B34442G4988K998d1609
9906c165A04342f6006b3054j8977j929j67239C8426J172b77179n4832M9935A28936
9893b43480C3954b70363j8917j5013f4398m7925j07897B37697B8754c1601k2105
9882e3706F7468b00362a2546k45048h8783k14612D7708J40733f4686L1842a6046
9870D1672f0085a2147q9629F8802d8525k8222r2888c8649C6596c61722J72198
9859a89524o0425g0120A81758a23843B27549b07247a6282M190I0340a48758b1279
9847D1829b27581b4746k48169a02622L1444j86914A7710a58612A63109b29984
$$ y = [-161598, 42239, -163995, 195396, -47449, 217545, -198156, 48518, -117403, -324079, -183493, 134137, -236767, -68129, -286786, -137786, -37197, -143510, 234442, 74988, 77986, -41609, -3165, 104342, -66006, -23054, -42031, -43960, -211199, 38426, 39598, -277179, -332011, -282076, 128936, -243480, 33954, -270363, -289280, -304293, -64398, -112323, -220220, 237697, 28754, -31601, -53706, 67468, -200362, -12546, -257594, -88783, -303395, 47708, 188441, -64686, -32844, -16046, 41672, -60085, -12147, -101776, 68802, -48525, -76747, -169635, -38649, 36596, -361722, -189524, -249949, -70120, 181758, -123843, 227549, -207247, -16282, -12092, 90340, -148758, -21279, 41829, -227581, -24746, -272915, -102622, -71178, -258092, 17710, -158612, 163109, -229984]
9836A27924F1322b00646l5643B2636K687a59709B62966j9098m6301b75513G1467
9824a65418d3083B8880d1065k14067e1874B1074d4607k17562A59270a59559F2345
9812a35321K0908A04500a02407k41237m6670H3527J5424a40679l5910C02643A37563
9800e37061a068n629C08998a2755I5403L4326D8091c2165B47439B8526b05868
9788a94234j6151L4433e3832j73450B5534a37739j81907f7357B59935P2478C6450
9776B47390q3896i8363j6608j40309g4949p395L7927k05558A70779c33314D6030
9764A17886d6091q9581o31F2467a78049A74050F9740a9795k29894c7305k9793
9753f7098E2616a95163e7268k1809B27137f6257b5851j65667L3519A3633a66765
$$ y = [127924, 61322, -200646, -236289, 22636, 25323, -159709, 262966, 243868, 197567, -275513, 71467, -165418, -43083, 28880, -41065, -255132, -51874, 21074, -44607, -262169, 159270, -159559, 62345, -135321, -114413, 104500, -102407, -343644, -390314, 83527, 98951, -140679, -176589, 302643, 137563, -537061, -1068, -6697, 308998, -12755, 95403, 129729, 48091, -32165, 247439, 28526, -205868, -194234, -210385, -175952, -53832, -227282, 25534, -137739, -319646, -67357, 259935, 332413, 36450, 247390, 163494, -98363, -114971, -255280, -74949, -82344, -44417, -249975, 170779, -333314, 46030, 117886, -46091, -135672, -136303, 62467, -178049, 174050, 69740, -19795, -249689, -37305, -67098, 52616, -195163, -57268, -79077, 227137, -66257, -25851, -191518, -157999, 13633, -166765]
9741c60911a23710j65844f0894P611A49346C875b79502j0092j83306E0080g366
9729H6944a01168A05660b50477E7111a8489B75550c91117a17439B36133c26896
9718A23037A8494a95510B14420a01512K4535F2218f6467k9884n4231P794A40915
9706I1485G857Q8346K8954O4814i1996B7807e7650H6544a55784I5415O6321b73469
9693D47745b70218B65872c14585a07693d4734B08428a61907o0294C5497b22778
9682B17176c27608O0076B8283a17562A39324c2606k948k25462b2741l63591B14294
9670a23988j49060G2035C3434b63526J22504f9203k6236j61820B3726q720c0061
9658a87887g658j86952E1794a12201A60434D7225i853l6658A91503E7555j0842
$$ y = [-360911, -123710, -289554, -60894, -53283, 149346, 3875, -279502, -289594, -472900, 50080, -7366, 86944, -101168, 105660, -250477, 57111, -18489, 275550, -391117, -117439, 236133, -326896, 123037, 18494, -195510, 214420, -101512, -76977, 62218, -66467, -96351, -150582, -142788, 140915, 91485, 7857, 96203, 125157, 189971, -91996, 27807, -57650, 86544, -155784, 95415, 161736, -273469, 447745, -270218, 265872, -314585, -107693, -44734, 208428, -161907, -222201, 35497, -222778, 217176, -327608, -267532, 28283, -117562, 139324, -32606, -35554, -261016, -22741, -386332, 214294, -123988, -273048, 72035, 33434, -263526, -141022, -69203, -95439, -257259, 23726, 15006, -30061, -187887, -7658, -194610, 51794, -112201, 160434, 47225, -9853, -46511, 191503, 57555, 46713]
9647D6713d26035a6930B11548g9500F2188b95298a8201l40866a30643A2253Q7911
9636A00164m5772F968a11123N4758b2353A02287h3383l9525N0892o0024l5028
9625a67068k6486B90022a04618A12703K7021h628H929b05390j85063J10093l4118
9614c14478R878E43b88135A8308a75200B07947e8757n7124J4969C11588F5099
9602b67450b7981F9374c54070h1162J1606j82979C3449a72522C04569b72123b8753
9590B42790A1326J77268a72656A1160K07687d22472B72221f6059B2677c91994
9579e3922n0999c288k88951J04267C2536a44572J7213j11248a02507A51049b58715
9567H7532j8038K9049B0394K90941a90687k76596I7099O5338b81900J09274F4863
$$ y = [46713, -426035, -16930, 211548, -79500, 62188, -295298, -18201, -359067, -130643, 12253, 100164, 54392, 6968, -111123, -56365, -22353, 102287, -83383, -122908, -72016, -132040, -167068, -193554, 290022, -104618, 112703, 139724, -8628, 8929, -205390, -390453, -280360, -314478, -304600, 543, -288135, 18308, -175200, 207947, -58757, -115881, -100912, 311588, 65099, -267450, -27981, 69374, -354070, -81162, -69556, -252535, 33449, -172522, 304569, -272123, -28753, 242790, 11326, 188594, -172656, 11160, 218847, -422472, 272221, -66059, 22677, -391994, -53922, -104921, -3288, -292239, -187972, 32536, -144572, -127359, -238607, -102507, 151049, -258715, 87532, 69494, 98543, 20394, 311335, -190687, -467283, 97099, 162437, -281900, -172626, 64863]
9555B65634q7289a26484j47362F2346b57887A18140a65111g0040n1986p138C3237
9543c6977p8996o3983k58981D6295J78692r1370a23376J5191B3179g616k50561
9532b58177h516j4797m8718i540E6696c05822A14907A9655J72165b24486M037
9521b20449B48323A15863b71612a2862r3375B9721a50602D7981a34708d5775k6412
9510g2187j85828J1766i1136c3104j9790r064j49168b9820k85447l1801a19810
9498a84594G0195p730R3110e01484Q6017a61800j20557C4969b50180g8470r9610
9487a78080H480J18753a08667J3152j50611j7350B5848c06728F2269f2361A08891
9475h4126H3964K41838H7843D09h4509H3289J52903K3313j20362D0581K36047
$$ y = [265634, 178345, -126484, -273846, 62346, -257887, 118140, -165111, -70040, -122026, -129164, 33237, -36977, -115973, -179956, -438937, 46295, 224987, 133617, -123376, -108185, 23179, -7616, -258177, -8516, -23313, -72031, -9540, 56696, -305822, 114907, 19655, 191820, -224486, -220449, 248323, 115863, -271612, -12862, -106237, 29721, -150602, 47981, -134708, -45775, -72187, -258015, -246249, -91136, -33104, -52894, -61958, -211126, -29820, -315267, -347068, -119810, -184594, 70195, 62465, 155575, -501484, -415467, -161800, -282357, 34969, -250180, -78470, -178080, 8480, 127233, -108667, -95515, -246126, -263476, 25848, -306728, 62269, -62361, 108891, -84126, 83964, 325802, 87843, 409, -84509, 83289, 236192, 259505, 139143, 40581, 276628]
9464B76628C3478K1613i4601c7452k9292a4305B5925c6235j06258L3745k5080
9453a33828c574k7881k55620A10730A7841h6663C471a9258H8417a46069P0316
9442g5753n5452k99910g5857b800p3096B65816a70340j79768J40539D7855R339
9431E7194b46465d3496A31244b1281K364q1671h123A33369i4769b9770k78086
9420c07856A25095F905L8968a7243k43483a03578k16418P6299j29609C2596J39776
9409A72372b78678B104d5852C4126R3547b1556C03675A30767A5293c29287B50303
9397E4889a74802A07939N9319b04552B39140g6388m20875F7767a59234j28021
9387b87255C6370b52096O9164O7294j41713F5305k608a73533O591F8586J69487
$$ y = [276628, 33478, 55091, -94601, -37452, -66744, -14305, 25925, -36235, -142493, -108748, -133828, -3574, -31455, -287075, 110730, 17841, -86663, 3471, -19258, 88417, -146069, -75753, -131205, -431115, -75857, -2800, -75896, 265816, -170340, -350108, -209569, 47855, 57194, -246465, -43496, 131244, -21281, -18917, -100588, -8123, 133369, -94769, -29770, -307856, 125095, 6905, 45873, -17243, -260726, -103578, -319996, -243697, -373306, 32596, 172372, -278678, 2104, -45852, 34126, 127673, -21556, 303675, 130767, 15293, -329287, 250303, 54889, -174802, 107939, 167258, -204552, 239140, -76388, -497263, 67767, -159234, -287255, 36370, -252096, -182932, -115638, -257351, 65305, 62697, -173533, -166942, 68586, 238073]
9376B38073e4371l80394I2747J5336c6519A69385N5915A7330K0965a56516m8359
9365b04875m9513a19976j59396j36635b00856I8869a40227k4676l5511K6166I6050
9353E3627i7593A35421J7193J97175a89691M0856P0739l60773a23033C3512a11348
9341a57626c2273l52868A49523d62237i9985j19264H6999k2077c958A5371R7919
9330A13290D4394b27025Q9584H0964a54818k0630Q188B24678a23550E1870A3306
9318B36911a22590I8792a25872o1154f4055q2098j5423k8834O7386D5690i9556
9306E4250f5044m163A13005b94885I9492c24155c4105l3873B14940F7759f2552
9294G6603j1120a41537j73377a12083j67554A8422P0786b53294a02191l9500j22773
$$ y = [238073, -54371, -434765, 92747, 108083, -36519, 169385, 225300, 17330, 38295, -156516, -204875, -254388, -119976, -279372, -416007, -200856, 98869, -140227, -164903, -200414, -174248, 96050, 53627, -97593, 135421, 152614, 349789, -189691, -148835, -78096, -438869, -123033, 33512, -111348, -157626, -32273, -385141, 149523, -462237, -99985, -219249, 86999, 64922, -3958, 15371, 113290, 44394, -227025, -137441, 80964, -154818, -175448, -167260, 224678, -123550, 51870, 13306, 236911, -122590, 98792, -125872, -187026, -64055, -146153, -161576, -190410, -123024, 45690, -99556, 54250, -65044, -69207, 113005, -294885, 99492, -324155, -34105, -67978, 214940, 67759, -62552, 76603, 65483, -141537, -314914, -112083, -279637, 18422, 89208, -253294, -102191, -141691, -264464]
9283b64464c0345E1363b8460l65748a93035A8779M10427i151A33378a72296F56188
9271D04178A64399b22582B48244E0084d0450E3404e1697n9864A3671b06579f6812
9259g928A232K04243c0084k93875J48051A94701a0156p5318l8572L7481k1040
9248a07605J2843A037h2654L9754A15362k6998l114a84509g0272L754n177j98142
9236b69837J17001l9077A18617b62112B00192d31928f8428k56642a51951M3828
9226a08123K9113K6476A66579D9190M4305a25830L0417j77170H443a09866A30063
9214f2652j16150N1418j6688C736N7971N060J4211b43583I556J14613d38325D08699
9201a66706g2752k89107C17132c50035c7141A20138A4365h8199L8924A23784J45810
$$ y = [-264464, -30345, 51363, -28460, -394208, -193035, 18779, 429206, -9151, 133378, -172296, 656188, 404178, 164399, -222582, 248244, 50084, -40450, 53404, -51697, -111561, 13671, -206579, -66812, -7928, 1232, 205475, -30084, -323959, -175908, 194701, -10156, -85474, -124046, -86565, -107605, -94762, 1037, -82654, -42900, 115362, 88364, 85250, -184509, -70272, -66518, -71695, -269837, -152836, -191913, 118617, -262112, 200192, -431928, -68428, -325070, -151951, -108123, -79010, -52534, 166579, 49190, 93495, -125830, -95413, -272583, 8443, -109866, 130063, -62652, -178802, -127384, -144072, 3736, 61707, 66767, 80978, -243583, 9556, 124169, -438325, 408699, -166706, -72752, -361859, 317132, -350035, -37141, 120138, 14365, -88199, -49275, 123784, 269594]
9190B69594c30706c7306C33275g2071l354A99797b18758h0552C81d8296l10748
9179c59044J63326k24329J43375f5068q1640P1420A94461a12000d5739j36804
9169a82543n889F8625b41264H0648a65861B50032q6721O881c22509b9027I0133
9157e9535A29147a06095a8781o8520H9473g0061j70130d3933l87785e495A05448
9145b57526k05937a55646D41872a15339o7857A7463a2481A47287k9300a00554
9134G2035L1022b79245f2833A37478k9773J6970A0093J12762k687N6603b4767
9122a04457A67643c65891H1392j9344J70577b68702A02523d05370I4626c16483
9111a32766G2038h8401F1576d32381a78484F004c23207B57678d57565F8955a3652
$$ y = [269594, -330706, -37306, 333275, -72071, -75425, 199797, -218758, -80552, 381, -48296, -359044, -195718, -420047, -276672, -65068, -146708, -75288, 194461, -112000, -45739, -182543, -188432, 68625, -241264, 80648, -165861, 250032, 163311, 170192, -322509, -29027, 90133, -59535, 129147, -106095, -18781, -87301, 89473, -70061, -240191, -43933, -431718, -5495, 105448, -257526, -463463, -155646, 441872, -115339, -183196, 17463, -12481, 147287, 117987, -100554, 72035, 103057, -279245, -62833, 137478, 107705, 124675, 10093, 122855, 120168, 176771, -24767, -104457, 167643, -365891, 81392, 62048, 232625, -268702, 102523, -405370, 94626, -316483, -132766, 72038, -88401, 61576, -432381, -178484, 6004, -323207, 257678, -457565, 68955, -13652]
9099B16279c90147c3923A25032f0364j90222B08777a60654A73383A099c7827I694
9087C84744b10664M3786L047D4808J37023L8262c44191d9568A4622a91903B77464
9075b7266B05738D49b31841A22417d7437B3905a22314A60991a67577L3690O3517
9064g0370j24385P6792j4684C80187n9629b78692B78954a56777r8090O5053r3055
9053b82869B1296h5793A12703a38920j824m4113Q1662j33403B2576b5235q7114
9042a12349E5484f70515b43078P3761j00402p8748J04781J10374A47433b77372
9031a41214J9187l7293A0910a94407j38490A34442a47380N9142A13429a42075
9020h8110l2574C23430D1685i034k22998H0060J2202C793K37599b7717j81316
$$ y = [216279, -390147, -33923, 125032, -60364, -250586, 208777, -160654, 173383, 1099, -37827, 9694, 384744, -210664, -166878, -163831, 44808, 181831, 220093, -344191, -49568, 14622, -191903, 277464, -27266, 205738, 449, -231841, 122417, -47437, 23905, -122314, 160991, -167577, -133887, -70370, -194755, -117963, -132647, 380187, 320558, -278692, 278954, -156777, -254867, -189814, -282869, 21296, -85793, 112703, -138920, -140744, -184857, -103195, -236598, 22576, -25235, -112349, 55484, -670515, -243078, -169317, -269719, -348467, -243686, -133312, 147433, -277372, -141214, -122027, -159320, 10910, -194407, -332897, 134442, -147380, -88238, 113429, -142075, -88110, -120684, 323430, 41685, -9034, -232032, 80060, 92262, 3793, 241392, -27717, -209033]
9009b09033O9578m8122Q8851d8962a4812o3178m4480B45422A18708Q9089b35570
8997B0110c8297A75957e050j51205q7204A35828c9884A62400B0932b27288g7646
8985G4089d2927j5413m735l91091J55260A38743g0773o225p2958b6084J1637D6681
8972B14109c77526f4781c1401C3706c88790C9352g5350a166o8271A51633f4717
8960a47465C765J30652B4847M911b84957A92121b36500j24592d0341n6296A65658
8948a39529C2880K4715B1135b84834a01447B63690g1391j15708m3986g5050l01590
8937c76640M6113I9835a21628k53844a69869r3606F094c13009f1183a5665j42489
8926a58154e1432H8513g2943r4987A20856J13769a09510C09086d664A43168N2854
$$ y = [-209033, -139455, -187577, -98726, -48962, -14812, -77990, -122470, 245422, 118708, 207797, -235570, 20110, -38297, 175957, -5050, -156255, -243459, 135828, -39884, 162400, 20932, -227288, -77646, 74089, -42927, -58340, -63075, -454166, -298906, 138743, -70773, -76998, -149956, -26084, -14447, 46681, 214109, -377526, -64781, -31401, 33706, -388790, 39352, -75350, -1166, -69437, 151633, -64717, -147465, 3765, 134417, 24847, 29758, -284957, 192121, -236500, -361092, -40341, -96637, 165658, -139529, 32880, 57595, 21135, -284834, -101447, 263690, -71391, -187099, -231085, -75050, -376640, -330527, 99835, -121628, -375472, -169869, -263475, 6094, -313009, -61183, -15665, -158154, -51432, 88513, -72943, -167930, 120856, 234625, -109510, 309086, -4664, 143168, 196022]
8915A96022G7721Q299K26274J09957N3472L03914L15485P78079J366131L177984
8905F417316K440472D351732B121310A028251k48452k11298j21107j13745E0727
8895C52347j62081P379n2554F7351m302K43209i2202A09398a59769b1031A18849
8883A19557e7980Q184C2391a8745l79977f547A57234R6814a73517j28738r2221
8872c94476J65358H3452c51911o468J48324j00240A98213C8922M3634A8887a61013
$$ y = [196022, 77721, 86020, 312294, 422251, 475723, 779637, 1095122, 1873201, 3239332, 6417316, 8857788, 4351732, 2121310, 1028251, 779799, 568501, 447394, 333649, 50727, 352347, 190266, 197645, 145091, 67351, 63049, 306258, -92202, 109398, -159769, -21031, 118849, 119557, -57980, -49796, 32391, -18745, -398722, -6547, 157234, 254048, -173517, -302255, -394476, -229118, 83452, -351911, -358379, -210055, -310295, 198213, 38922, 82556, 18887, -161013]
$$ [...]
##END NTUPLES=NMR SPECTRUM
##END=
