
##TITLE=UV1132_M4-1010-1000_6275099_8tUyFIO9RN
##JCAMPDX= 6.0         $$ Bruker NMR JCAMP-DX V2.0
##DATA TYPE= NMR SPECTRUM
##DATA CLASS= NTUPLES
##ORIGIN= BRUKER
##OWNER= Administrator
$$ 1.72 TOPSPIN		Version 2.1
$$ 2012-06-02 21:30:12.218 -0500  Administrator@TOPSPIN
$$ Compression mode = diff/dup
##.OBSERVE FREQUENCY= 400.13188235
##.OBSERVE NUCLEUS= ^1H
##.ACQUISITION MODE= SIMULTANEOUS (DQD)
##.ACQUISITION SCHEME= undefined
##.AVERAGES= 64
##.DIGITISER RES= 22
##SPECTROMETER/DATA SYSTEM= spect
##.PULSE SEQUENCE= noesygpps1d.comp
##.SOLVENT NAME= COFFEE_meoh
##.SHIFT REFERENCE= INTERNAL, COFFEE_meoh, 1, 14.96694
##AUDIT TRAIL= $$ (NUMBER, WHEN, WHO, WHERE, PROCESS, VERSION, WHAT)
$$ ##TITLE= Audit trail, TOPSPIN		Version 2.1
$$ ##JCAMPDX= 5.01
$$ ##ORIGIN= Bruker BioSpin GmbH
$$ ##OWNER= Administrator
$$ $$ C:\Bruker\TOPSPIN/data/COFFEE/nmr/UV1132_M4-1010-1000_6275099_8tUyFIO9RN/12/pdata/1/auditp.txt
$$ ##AUDIT TRAIL=  $$ (NUMBER, WHEN, WHO, WHERE, PROCESS, VERSION, WHAT)
(   1,<2012-06-02 21:30:06.937 -0500>,<Administrator>,<TOPSPIN>,<go>,<TOPSPIN 2.1>,
      <created by zg
	started at 2012-06-02 21:18:36.546 -0500,
	POWCHK enabled, PULCHK disabled,
       configuration hash MD5:
       D5 CA 7A 23 FE 6B EE E2 50 67 74 61 24 F7 5E 3B
       data hash MD5: 64K
       05 DA 8E 2E DC E2 55 B9 F9 4D B2 7A D0 B4 7B 6C>)
(   2,<2012-06-02 21:30:09.765 -0500>,<Administrator>,<TOPSPIN>,<proc1d>,<TOPSPIN 2.1>,
      <Start of raw data processing
       efp LB = 0.3 FT_mod = 6 PKNL = 1 PHC0 = 0 PHC1 = 0 SI = 128K 
       data hash MD5: 128K
       2D 45 00 77 14 B0 49 DB A9 5E 71 58 D1 BE 3E 7C>)
(   3,<2012-06-02 21:30:11.093 -0500>,<Administrator>,<TOPSPIN>,<proc1d>,<TOPSPIN 2.1>,
      <pk PHC0 = 34.18396 PHC1 = 0 
       data hash MD5: 128K
       D3 84 38 CE AE 38 1A 4C CA C4 93 10 AC 40 4C 2E>)
(   4,<2012-06-02 21:30:11.875 -0500>,<Administrator>,<TOPSPIN>,<proc1d>,<TOPSPIN 2.1>,
      <abs ABSG = 1 
       data hash MD5: 128K
       48 DF 70 EE 08 C5 28 F6 2E 5A E8 7C 9D 15 08 45>)
(   5,<2012-06-02 21:30:11.968 -0500>,<Administrator>,<TOPSPIN>,<proc1d>,<TOPSPIN 2.1>,
      <abs ABSG = 2 
       data hash MD5: 128K
       AE 31 EA 29 24 1C 0F 74 0F 0A 7D 18 34 D2 2D 5C>)
(   6,<2012-06-02 21:30:12.031 -0500>,<Administrator>,<TOPSPIN>,<proc1d>,<TOPSPIN 2.1>,
      <abs ABSG = 3 
       data hash MD5: 128K
       9B 12 4A 08 79 2C 14 4E AB DD 94 49 E9 9F B1 6B>)
(   7,<2012-06-02 21:30:12.093 -0500>,<Administrator>,<TOPSPIN>,<proc1d>,<TOPSPIN 2.1>,
      <abs ABSG = 4 
       data hash MD5: 128K
       05 8E C0 1E 2E 78 53 81 F8 F8 DD F1 19 70 EA 3A>)
(   8,<2012-06-02 21:30:12.140 -0500>,<Administrator>,<TOPSPIN>,<proc1d>,<TOPSPIN 2.1>,
      <abs ABSG = 5 
       data hash MD5: 128K
       9C 84 9E 30 D8 32 37 85 EE 34 FD 69 5F 38 4F E3>)
$$ ##END=
$$ 
$$ $$ hash MD5
$$ $$ 79 50 48 25 21 07 8E F5 34 C2 C2 1D 90 DF CC 66
##$RELAX= 
##$RELAX= 
##$RELAX= 
##$RELAX= 
##$RELAX= 
##$RELAX= 
##$RELAX= 
##$RELAX= 
$$ Bruker specific parameters
$$ [...]
##$TP07= 0
##$TPNAME0= <>
##$TPNAME1= <>
##$TPNAME2= <>
##$TPNAME3= <>
##$TPNAME4= <>
##$TPNAME5= <>
##$TPNAME6= <>
##$TPNAME7= <>
##$TPOAL= (0..7)
0.5 0.5 0.5 0.5 0.5 0.5 0.5 0.5
##$TPOFFS= (0..7)
0 0 0 0 0 0 0 0
##$TUNHIN= 0
##$TUNHOUT= 0
##$TUNXOUT= 0
##$USERA1= <user>
##$USERA2= <user>
##$USERA3= <user>
##$USERA4= <user>
##$USERA5= <user>
##$V9= 5
##$VALIST= <valist>
##$VCLIST= <CCCCCCCCCCCCCCC>
##$VD= 0
##$VDLIST= <DDDDDDDDDDDDDDD>
##$VPLIST= <PPPPPPPPPPPPPPP>
##$VTLIST= <TTTTTTTTTTTTTTT>
##$WBST= 2048
##$WBSW= 25
##$XGAIN= (0..3)
0 0 0 0
##$XL= 0
##$YL= 0
##$YMAX_a= 11242771
##$YMIN_a= -6352544
##$ZGOPTNS= <>
##$ZL1= 120
##$ZL2= 120
##$ZL3= 120
##$ZL4= 120
##$ABSF1= 14.96694
##$ABSF2= -5.58559
##$ABSG= 5
##$ABSL= 3
##$ALPHA= 0
##$AQORDER= 0
##$ASSFAC= 0
##$ASSFACI= 0
##$ASSFACX= 0
##$ASSWID= 0
##$AUNMP= <proc_prof1d_extract.lims>
##$AXLEFT= 0
##$AXNAME= <>
##$AXNUC= <1H>
##$AXRIGHT= 0
##$AXTYPE= 0
##$AXUNIT= <>
##$AZFE= 0.1
##$AZFW= 0.1
##$BCFW= 0
##$BC_mod= 0
##$BYTORDP= 0
##$COROFFS= 0
##$CY= 15
##$DATMOD= 1
##$DC= 0
##$DFILT= <>
##$DTYPP= 0
##$F1P= 0
##$F2P= 0
##$FCOR= 0.5
##$FTSIZE= 131072
##$FT_mod= 6
##$GAMMA= 0
##$GB= 0
##$INTBC= 1
##$INTSCL= 1
##$ISEN= 128
##$LB= 0.3
##$LEV0= 0
##$LPBIN= 0
##$MAXI= 10000
##$MC2= 0
##$MEAN= 0
##$ME_mod= 0
##$MI= 0
##$NCOEF= 0
##$NC_proc= -3
##$NLEV= 6
##$NOISF1= 0
##$NOISF2= 0
##$NSP= 0
##$NTH_PI= 0
##$NZP= 0
##$OFFSET= 14.96694
##$PC= 1
##$PHC0= 34.18396
##$PHC1= 0
##$PH_mod= 1
##$PKNL= yes
##$PPARMOD= 0
##$PPDIAG= 0
##$PPIPTYP= 0
##$PPMPNUM= 2147483647
##$PPRESOL= 1
##$PSCAL= 4
##$PSIGN= 0
##$PYNMP= <proc.py>
##$REVERSE= no
##$SF= 400.130005470905
##$SI= 131072
##$SIGF1= 0
##$SIGF2= 0
##$SINO= 400
##$SIOLD= 131072
##$SPECTYP= <>
##$SREGLST= <1H.CDCl3>
##$SSB= 0
##$STSI= 131072
##$STSR= 0
##$SW_p= 8223.68421052632
##$SYMM= 0
##$S_DEV= 0
##$TDeff= 65536
##$TDoff= 0
##$TI= <>
##$TILT= no
##$TM1= 0
##$TM2= 0
##$TOPLEV= 0
##$USERP1= <user>
##$USERP2= <user>
##$USERP3= <user>
##$USERP4= <user>
##$USERP5= <user>
##$WDW= 1
##$XDIM= 131072
##$YMAX_p= 513890544
##$YMIN_p= -319802289
##$CURPLOT= <Network HP LaserJet P1505>
##$CURPRIN= <$Network HP LaserJet P1505>
##$DFORMAT= <normdp>
##$LAYOUT= <+/1D_H.xwp>
##$LFORMAT= <normlp>
##$PFORMAT= <normpl>
##$SURQMSG= 1
$$ End of Bruker specific parameters
$$ ---------------------------------
##NTUPLES= NMR SPECTRUM
##VAR_NAME=  FREQUENCY,     SPECTRUM/REAL,   SPECTRUM/IMAG
##SYMBOL=    X,             R,               I
##VAR_TYPE=  INDEPENDENT,   DEPENDENT,       DEPENDENT
##VAR_FORM=  AFFN,          ASDF,            ASDF
##VAR_DIM=   131072,        131072,          131072
##UNITS=     HZ,            ARBITRARY UNITS, ARBITRARY UNITS
##FACTOR=    0.0627417313425165, 1,          1
##FIRST=     8223.62146879498, 2148,         -107355
##LAST=      0,             2987,            -108490
##MIN=       0,             -319802289,      0
##MAX=       8223.62146879498, 513890544,    0
$$ Real data points
##PAGE= N=1
##DATA TABLE= (X++(R..R)), XYDATA
$$ [...]
$$ plain form
63520 1317184 1283735 1251493 1221971 1195731 1171714 1148400 1125713 1105462 1089704 1078904 1072038
63509 1072038 1068127 1066965 1068460 1072101 1077414 1084394 1093246 1104219 1117861 1134717 1154241 1174502 1193637
63496 1193637 1211515 1229716 1250150 1273921 1301001 1330534 1361780 1395296 1432892 1475867 1523539
63485 1523539 1574141 1626920 1682356 1739879 1795971 1845212 1883181 1908206 1920794 1922294 1914626 1900638
63473 1900638 1883507 1865100 1845264 1823189 1799140 1774293 1749037 1722223 1692242 1658211 1619868
63462 1619868 1576989 1529581 1478534 1425675 1373075 1322213 1273624 1227284 1183440 1142901 1106261
63451 1106261 1073027 1041973 1012278 983909 957165 932553 910922 892821 877613 864028 851673
63440 851673 841166 832719 825691 819758 815247 811772 807885 802925 798050 794435 791597 788819 787095 787845
$$ packed form
63520A317184l3449l2242k9522k6240k4017k3314k2687k0251j5758j0800o866
63509A072038l911j162J495L641N313O980Q852J0973J3642J6856J9524K0261J9135
63496A193637J7878J8201K0434K3771K7080K9533L1246L3516L7596M2975M7672
63485A523539N0602N2779N5436N7523N6092M9241L7969K5025J2588J500p668j3988
63473A900638j7131j8407j9836k2075k4049k4847k5256k6814k9981l4031l8343
63462A619868m2879m7408n1047n2859n2600n0862m8589m6340m3844m0539l6640
63451A106261l3234l1054k9695k8369k6744k4612k1631j8101j5208j3585j2355
63440H51673j0507q447p028n933m511l475l887m960m875l615k838k778j724P50
$$ plain form
63426 787845 790269 791833 791366 790070 789383 789452 790069 791541 793821 795912 797052 797816 799310 801765 804511 806846
63410 806846 808380 808760 807501 804109 798425 791208 784263 779386 776956 775991 775470 775001 774375 773464 772908 773915
63394 773915 776801 780378 783434 786384 790954 798551 809367 822696 837618 853657 871113 890507 911527
63381 911527 933013 954328 976216 999740 1024814 1050441 1076249 1103243 1133086 1167080 1205680
63370 1205680 1248364 1293582 1338955 1381845 1420319 1454181 1485124 1515283 1545388 1574746 1603194
63359 1603194 1632344 1664443 1700665 1741139 1785994 1835255 1887744 1940907 1991812 2037813 2076424
63348 2076424 2105608 2124586 2133897 2134509 2127349 2113760 2095612 2074534 2051428 2026868 2001153 1973503
63336 1973503 1941988 1905229 1863859 1819536 1772833 1723161 1670700 1617315 1565197 1515510 1468797
$$ packed form
63426G87845K424J564m67j296o87O9O17J472K280K091J140P64J494K455K746K335
63410H06846J534L80j259l392n684p217o945m877k430r65n21m69o26r11n56J007
63394G73915K886L577L056K950M570P597J0816J3329J4922J6039J7456J9394K1020
63381I11527K1486K1315K1888K3524K5074K5627K5808K6994K9843L3994L8600
63370A205680M2684M5218M5373M2890L8474L3862L0943L0159L0105K9358K8448
63359A603194K9150L2099L6222M0474M4855M9261N2489N3163N0905M6001L8611
63348B076424K9184J8978R311O12p160j3589j8148k1078k3106k4560k5715k7650
63336A973503l1515l6759m1370m4323m6703m9672n2461n3385n2118m9687m6713
$$ plain form
63325 1468797 1425763 1386805 1351371 1318786 1289451 1264425 1244022 1227727 1215398 1207519 1204122 1204447
63313 1204447 1208109 1215719 1227691 1243012 1259938 1277590 1296357 1317011 1339982 1365351 1393081 1423309
63301 1423309 1456512 1493002 1532176 1572971 1615492 1661341 1711410 1763952 1815952 1866082 1914937
63290 1914937 1962202 2004905 2039149 2062931 2076755 2082163 2080377 2072101 2057981 2038990 2016401 1991301
63278 1991301 1964217 1935319 1904738 1872381 1837653 1799892 1758880 1714557 1666671 1615628 1563532
63267 1563532 1513343 1466727 1423506 1383311 1346755 1314534 1286424 1261990 1241616 1225851 1213891
63256 1213891 1203287 1191105 1175298 1155551 1133308 1110570 1088215 1065694 1042528 1019351 997041
63245 997041 975729 955493 937289 922003 908925 896380 883822 872227 862345 853748 845893 838932
$$ packed form
63325A468797m3034l8958l5434l2585k9335k5026k0403j6295j2329p879l397L25
63313A204447L662P610J1972J5321J6926J7652J8767K0654K2971K5369K7730L0228
63301A423309L3203L6490L9174M0795M2521M5849N0069N2542N2000N0130M8855
63290A914937M7265M2703L4244K3782J3824N408j786q276j4120j8991k2589k5100
63278A991301k7084k8898l0581l2357l4728l7761m1012m4323m7886n1043n2096
63267A563532n0189m6616m3221m0195l6556l2221k8110k4434k0374j5765j1960
63256A213891j0604j2182j5807j9747k2243k2738k2355k2521k3166k3177k2310
63245I97041k1312k0236j8204j5286j3078j2545j2558j1595r882q597p855o961
$$ plain form
63233 838932 832778 826274 818287 809164 800189 791865 783593 774997 766634 759082 752080 745195 738886 734110
63219 734110 730866 727794 723579 718394 713590 710181 708061 706603 705458 704610 704051 703778 703908 704524 705507 706835
63203 706835 708960 712505 717394 722558 726774 729788 732435 735704 739989 745253 751518 758805 766850 775342
63189 775342 784359 794099 804232 814195 824235 835506 848759 863577 879378 896526 915786 937215
63177 937215 960402 985402 1012489 1041250 1070898 1101376 1133106 1165610 1197452 1227764 1256872
63166 1256872 1285223 1312863 1340372 1369087 1399469 1430155 1459645 1488397 1518277 1550255 1583412
63155 1583412 1615797 1645415 1670657 1690793 1706251 1717894 1726027 1730464 1731148 1727905 1719719 1705277
63143 1705277 1684670 1660046 1634214 1608801 1583892 1559152 1535017 1512832 1493912 1478549 1466124
$$ packed form
63233H38932o154o504p987r123q975q324q272q596q363p552p002o885o309m776
63219G34110l244l072m215n185m804l409k120j458j145q48n59k73J30O16R83J328
63203G06835K125L545M889N164M216L014K647L269M285N264O265P287Q045Q492
63189G75342R017R740J0133R963J0040J1271J3253J4818J5801J7148J9260K1429
63177I37215K3187K5000K7087K8761K9648L0478L1730L2504L1842L0312K9108
63166A256872K8351K7640K7509K8715L0382L0686K9490K8752K9880L1978L3157
63155A583412L2385K9618K5242K0136J5458J1643Q133M437O84l243q186j4442
63143A705277k0607k4624k5832k5413k4909k4740k4135k2185j8920j5363j2425
$$ plain form
63132 1466124 1456214 1449219 1445653 1445137 1446594 1449370 1453865 1461110 1472003 1486727 1504481 1523787 1543436
63119 1543436 1563286 1584100 1606622 1630753 1655341 1678796 1700423 1721353 1743475 1766934 1789210
63108 1789210 1807335 1820525 1829880 1835967 1837847 1834355 1825083 1809880 1788640 1762266 1732786 1701470
63096 1701470 1667402 1629054 1587005 1544054 1502538 1462572 1423300 1385010 1349301 1317637 1290374
63085 1290374 1266936 1246204 1226835 1207971 1189891 1173558 1159487 1147482 1137381 1129250 1122628 1116549
63073 1116549 1110917 1107102 1106309 1107951 1110541 1113787 1118650 1125477 1133301 1141190 1149363 1158553 1168947 1179974
63059 1179974 1190608 1199807 1207336 1214167 1221386 1228752 1235181 1240463 1245346 1249889 1253200 1255152 1256874 1258854
63045 1258854 1260037 1259841 1259692 1261172 1263608 1264951 1264461 1263232 1262519 1262864 1264482 1267229 1270267 1272727 1274529
$$ packed form
63132A466124r910o995l566n16J457K776M495P245J0893J4724J7754J9306J9649
63119A543436J9850K0814K2522K4131K4588K3455K1627K0930K2122K3459K2276
63108A789210J8125J3190R355O087J880l492r272j5203k1240k6374k9480l1316
63096A701470l4068l8348m2049m2951m1516l9966l9272l8290l5709l1664k7263
63085A290374k3438k0732j9369j8864j8080j6333j4071j2005j0101q131o622o079
63073A116549n632l815p93J642K590L246M863O827P824P889Q173R190J0394J1027
63059A179974J0634R199P529O831P219P366O429N282M883M543L311J952J722J980
63045A258854J183j96j49J480K436J343m90j229p13L45J618K747L038K460J802
$$ plain form
63030 1274529 1275788 1275960 1274753 1273445 1274000 1276959 1281269 1285924 1290653 1295180 1299225 1303301 1308407 1314829
63016 1314829 1322307 1331257 1342505 1355694 1369327 1382760 1396901 1412533 1429289 1446980 1466781 1490039
63004 1490039 1516519 1544727 1573669 1603707 1635946 1671241 1709699 1750982 1795185 1843232 1896037
62993 1896037 1953504 2014892 2079821 2148041 2218512 2289872 2361852 2435192 2510058 2585627 2661422
62982 2661422 2737789 2814503 2889940 2962316 3031207 3097508 3162603 3227630 3292511 3355257 3413060
62971 3413060 3464395 3509218 3547071 3576341 3595766 3605203 3604204 3591233 3565320 3527400 3479096 3421345
62959 3421345 3355389 3283968 3210103 3135403 3060846 2988436 2920618 2858510 2802073 2751706 2708438
62948 2708438 2672884 2645220 2625787 2614459 2609853 2610646 2617530 2632279 2654779 2682472 2713056 2746429
$$ packed form
63030A274529J259J72j207j308N55K959M310M655M729M527M045M076N106O422
63016A314829P478Q950J1248J3189J3633J3433J4141J5632J6756J7691J9801K3258
63004A490039K6480K8208K8942L0038L2239L5295L8458M1283M4203M8047N2805
62993A896037N7467O1388O4929O8220P0471P1360P1980P3340P4866P5569P5795
62982B661422P6367P6714P5437P2376O8891O6301O5095O5027O4881O2746N7803
62971C413060N1335M4823L7853K9270J9425R437r99j2971k5913l7920m8304n7751
62959C421345o5956p1421p3865p4700p4557p2410o7818o2108n6437n0367m3268
62948B708438l5554k7664j9433j1328m606P93O884J4749K2500K7693L0584L3373
$$ plain form
62936 2746429 2783460 2823997 2866681 2909826 2951858 2991567 3028502 3062852 3094908 3125085 3154066
62925 3154066 3181699 3205568 3221791 3227856 3223961 3211376 3190423 3160527 3121211 3072372 3014371 2948587
62913 2948587 2877261 2802147 2723906 2643315 2562241 2482551 2404732 2328557 2254756 2185029 2120637
62902 2120637 2061777 2008061 1958627 1911858 1865995 1820349 1775419 1731941 1690462 1651599 1615651
62891 1615651 1581832 1548842 1516500 1485838 1457131 1428812 1399137 1368238 1337819 1309471 1284143
62880 1284143 1262561 1244767 1229262 1213791 1197389 1181075 1166481 1154439 1144805 1136664 1128542 1119442
62868 1119442 1110060 1102104 1096024 1090428 1084274 1078433 1074115 1070768 1066969 1062692 1059062 1056068 1052212 1046789
62854 1046789 1041098 1036693 1033401 1029804 1024991 1019166 1012935 1006596 999954 992600 984622 977066 971208 967317
$$ packed form
62936B746429L7031M0537M2684M3145M2032L9709L6935L4350L2056L0177K8981
62925C154066K7633K3869J6223O065l895j2585k0953k9896l9316m8839n8001o5784
62913B948587p1326p5114p8241q0591q1074p9690p7819p6175p3801o9727o4392
62902B120637n8860n3716m9434m6769m5863m5646m4930m3478m1479l8863l5948
62891A615651l3819l2990l2342l0662k8707k8319k9675l0899l0419k8348k5328
62880A284143k1582j7794j5505j5471j6402j6314j4594j2042r634q141q122r100
62868A119442r382p956o080n596o154n841m318l347l799m277l630k994l856n423
62854A046789n691m405l292l597m813n825o231o339o642p354p978p556n858l891
$$ plain form
62840 967317 964660 962721 961671 961476 961480 961304 961470 962625 964684 967143 969646 971773 972947 973132 973131 973567 973956
62823 973956 973352 971617 969614 968415 968512 969264 968896 965863 960842 956658 955504 956649 957493 956276 953160 949388
62807 949388 946344 944910 944730 944383 943060 941554 940797 940133 938271 935382 932766 930806 928905 927422 927788
62792 927788 930164 932694 934020 935227 938143 942666 946937 949523 950279 949478 947324 944330 941280 938600 936361
62777 936361 934926 934959 936535 938762 940632 942010 943374 944752 945483 945311 945265 946698 949477 951985 953282 954478
62761 954478 957244 961682 966747 972259 978987 986701 993731 999155 1004292 1011131 1020108 1030387 1041504 1053473
62747 1053473 1065523 1076147 1084856 1093156 1103235 1115885 1130025 1144152 1158062 1173046 1190480 1210544
62735 1210544 1232656 1256824 1283758 1313557 1345245 1378153 1412958 1450587 1490877 1533485 1579733
$$ packed form
62840I67317k657j939j050j95Mj76J66J155K059K459K503K127J174J85jM36L89
62823I73956o04j735k003j199R7P52l68l033n021m184j154J145Q44j217l116l772
62807I49388l044j434j80l47j323j506p57o64j862k889k616j960j901j483L66
62792I27788K376K530J326J207K916M523M271K586P56q01k154k994l050k680k239
62777I36361j435L3J576K227J870J378J364J378P31j72m6J433K779K508J297J196
62761I54478K766M438N065N512O728P714P030N424N137O839Q977J0279J1117J1969
62747A053473J2050J0624Q709Q300J0079J2650J4140J4127J3910J4984J7434K0064
62735A210544K2112K4168K6934K9799L1688L2908L4805L7629M0290M2608M6248
$$ plain form
62724 1579733 1632064 1691428 1756431 1825595 1899338 1978850 2063936 2153270 2246381 2343995 2446061
62713 2446061 2550453 2654124 2754722 2850349 2938384 3015620 3079630 3129279 3163883 3182626 3185166
62702 3185166 3172178 3144802 3103866 3050072 2984629 2909278 2825901 2736420 2642730 2546202 2447528
62691 2447528 2347712 2248912 2153453 2062034 1973890 1889026 1809215 1736131 1669362 1607402 1550122
62680 1550122 1498959 1454490 1415004 1378172 1343392 1311721 1283849 1259096 1236452 1215872 1198177
62669 1198177 1184081 1173648 1166340 1161157 1157020 1153592 1151724 1152594 1156311 1161836 1168337 1176073 1185699 1197356
62655 1197356 1211061 1227417 1246986 1269003 1291687 1314308 1338435 1366702 1400571 1439627 1482708
62644 1482708 1529154 1579022 1632675 1690640 1753668 1822356 1896354 1974149 2054099 2135804 2220057
$$ packed form
62724A579733N2331N9364O5003O9164P3743P9512Q5086Q9334R3111R7614J02066
62713B446061J04392J03671J00598R5627Q8035P7236O4010M9649L4604J8743K540
62702C185166j2988k7376m0936n3794o5443p5351q3377q9481r3690r6528r8674
62691B447528r9816r8800r5459r1419q8144q4864p9811p3084o6769o1960n7280
62680A550122n1163m4469l9486l6832l4780l1671k7872k4753k2644k0580j7695
62669A198177j4096j0433p308n183m137l428j868Q70L717N525O501P736R626J1657
62655A197356J3705J6356J9569K2017K2684K2621K4127K8267L3869L9056M3081
62644A482708M6446M9868N3653N7965O3028O8688P3998P7795P9950Q1705Q4253
$$ plain form
62633 2220057 2307255 2396254 2485074 2572212 2656547 2736200 2808437 2870865 2921965 2960096 2982820
62622 2982820 2988107 2975920 2947926 2905857 2850888 2784522 2708958 2626119 2537072 2443183 2347319
62611 2347319 2252790 2160987 2070953 1981667 1894177 1810991 1733849 1662687 1596463 1534393 1476503
62600 1476503 1423529 1376201 1334129 1295568 1258880 1224095 1192344 1163992 1138287 1114810 1093945
62589 1093945 1075450 1057877 1040342 1023839 1009603 996913 983964 970553 958401 948716 940816 933615
62577 933615 927374 923261 921860 922684 924604 926209 926206 924249 921433 919512 919408 920395 920648 918713 914797 910704
62561 910704 908315 908158 909590 912031 915432 919587 923733 927299 930846 935983 944256 955924 969590 983236
62547 983236 995962 1008655 1022702 1038451 1055401 1073485 1093296 1115123 1138677 1163953 1191610
$$ packed form
62633B220057Q7198Q8999Q8820Q7138Q4335P9653P2237O2428N1100L8131K2724
62622B982820N287j2187k7994m2069n4969o6366p5564q2839q9047r3889r5864
62611B347319r4529r1803r0034q9286q7490q3186p7142p1162o6224o2070n7890
62600A476503n2974m7328m2072l8561l6688l4785l1751k8352k5705k3477k0865
62589A093945j8495j7573j7535j6503j4236j2690j2949j3411j2152r685p900p201
62577I33615o241m113j401Q24J920J605lj957k816j921j04R87K53j935l916m093
62561I10704k389j57J432K441L401M155M146L566L547N137Q273J1668J3666J3646
62547I83236J2726J2693J4047J5749J6950J8084J9811K1827K3554K5276K7657
$$ plain form
62536 1191610 1222290 1256178 1293431 1334343 1378717 1425537 1473496 1521388 1567980 1612225 1653840
62525 1653840 1692939 1728714 1759120 1782222 1797215 1803840 1801676 1790769 1772358 1748120 1718934 1684917
62513 1684917 1646469 1604682 1560930 1516410 1471879 1427513 1383344 1340138 1299431 1262307 1228584
62502 1228584 1197564 1169092 1143425 1120623 1100682 1083710 1069214 1055708 1042143 1029589 1020453
62491 1020453 1015641 1013166 1009964 1004752 998899 994707 993117 993129 993348 993734 995258 997906 1000001 1000072 998748
62476 998748 998067 999371 1002680 1007720 1014495 1022846 1032388 1043043 1054949 1067752 1080788 1094191 1109147
62463 1109147 1126653 1146616 1168643 1193320 1222145 1256230 1295375 1338501 1384827 1434428 1487511
62452 1487511 1543312 1600296 1657726 1716468 1777646 1840790 1903956 1965427 2024462 2080472 2132421
$$ packed form
62536A191610L0680L3888L7253M0912M4374M6820M7959M7892M6592M4245M1615
62525A653840L9099L5775L0406K3102J4993O625k164j0907j8411k4238k9186l4017
62513A684917l8448m1787m3752m4520m4531m4366m4169m3206m0707l7124l3723
62502A228584l1020k8472k5667k2802j9941j6972j4496j3506j3565j2554r136
62491A020453m812k475l202n212n853m192j590J2K19L86J524K648K095P1j324
62476I98748o81J304L309N040O775Q351R542J0655J1906J2803J3036J3403J4956
62463A109147J7506J9963K2027K4677K8825L4085L9145M3126M6326M9601N3083
62452A487511N5801N6984N7430N8742O1178O3144O3166O1471N9035N6010N1949
$$ plain form
62441 2132421 2179491 2221661 2259068 2291121 2316771 2335727 2349247 2359730 2369432 2379484 2390334
62430 2390334 2403265 2421013 2446370 2480402 2522551 2572149 2628946 2692299 2760916 2833798 2910669
62419 2910669 2991040 3073403 3155469 3234281 3305658 3364613 3407648 3434457 3446685 3445102 3428498
62408 3428498 3394820 3342460 3270727 3180498 3075094 2959739 2839219 2716014 2591009 2465707
62398 2465707 2343098 2226309 2116897 2014903 1920262 1833494 1754839 1683464 1618389 1560126
62388 1560126 1510496 1470413 1438427 1411973 1389539 1370911 1355730 1342945 1331907 1323084 1317129 1313756
62376 1313756 1312086 1311697 1312657 1314737 1317205 1319360 1320644 1320126 1316537 1309262 1298969 1286913 1273877 1260084
62362 1260084 1245835 1231657 1217810 1203941 1189335 1173411 1156206 1138658 1122240 1107840 1095013
$$ packed form
62441B132421M7070M2170L7407L2053K5650J8956J3520J0483R702J0052J0850
62430B390334J2931J7748K5357L4032M2149M9598N6797O3353O8617P2882P6871
62419B910669Q0371Q2363Q2066P8812P1377N8955M3035K6809J2228j583j6604
62408C428498l3678n2360p1733r0229j05404j15355j20520j23205j25005j25302
62398B465707j22609j16789j09412j01994r4641q6768p8655p1375o5075n8263
62388A560126m9630m0083l1986k6454k2434j8628j5181j2785j1038q823n955l373
62376A313756j670l89R60K080K468K155J284n18l589p275j0293j2056j3036j3793
62362A260084j4249j4178j3847j3869j4606j5924j7205j7548j6418j4400j2827
$$ plain form
62351 1095013 1082693 1070585 1059333 1049290 1039728 1029683 1019239 1009649 1002315 997771 995437 994106
62339 994106 992910 992004 992226 994148 997664 1002397 1007915 1013556 1018799 1024126 1030732 1038770 1046569 1052415 1056722
62324 1056722 1061639 1068844 1078577 1090538 1104510 1119850 1135401 1150477 1165513 1181506 1199244 1219183
62312 1219183 1241314 1264796 1288374 1311657 1335663 1361817 1390918 1423417 1459957 1500914 1545725
62301 1545725 1593444 1643895 1697816 1756103 1819483 1888706 1964197 2045249 2130103 2217014 2304738
62290 2304738 2391688 2475176 2552087 2620132 2677969 2724266 2757337 2776057 2780870 2773543 2756028 2729667
62278 2729667 2695159 2652816 2602911 2546275 2484758 2420692 2355652 2290156 2224883 2161707 2102762
62267 2102762 2048611 1998087 1950039 1904552 1862194 1822874 1786044 1751491 1719091 1687956 1656736
$$ packed form
62351A095013j2320j2108j1252j0043r562j0045j0444r590p334m544k334j331
62339I94106j196r06K22J922L516M733N518N641N243N327O606Q038P799N846M307
62324A056722M917P205R733J1961J3972J5340J5551J5076J5036J5993J7738J9939
62312A219183K2131K3482K3578K3283K4006K6154K9101L2499L6540M0957M4811
62301A545725M7719N0451N3921N8287O3380O9223P5491Q1052Q4854Q6911Q7724
62290B304738Q6950Q3488P6911O8045N7837M6297L3071J8720M813p327j7515k6361
62278B729667l4508m2343m9905n6636o1517o4066o5040o5496o5273o3176n8945
62267B102762n4151n0524m8048m5487m2358l9320l6830l4553l2400l1135l1220
$$ plain form
62256 1656736 1625047 1593905 1564265 1535581 1506412 1476372 1446897 1419925 1396329 1375983 1358960
62245 1358960 1345876 1336787 1330354 1324732 1319267 1314869 1312594 1312271 1312776 1313363 1314259 1315891 1317897 1319248 1319291
62230 1319291 1318511 1318127 1318995 1320994 1323486 1326198 1329319 1332741 1335614 1337215 1338284 1340996 1347145 1356477 1367161
62215 1367161 1377812 1388628 1400581 1414131 1429103 1445391 1463115 1482254 1502671 1524609 1548791
62204 1548791 1576006 1606886 1642005 1681736 1725914 1774133 1826603 1884405 1948697 2019866 2097396
62193 2097396 2180062 2266021 2353226 2440171 2525954 2609279 2687572 2757420 2815833 2861072 2892624
62182 2892624 2910720 2915804 2908278 2888706 2857966 2816728 2764999 2702997 2632593 2556998 2478537 2397533
62170 2397533 2314008 2229777 2148005 2071077 1999671 1933575 1872591 1816780 1766426 1721616 1681475
$$ packed form
62256A656736l1689l1142k9640k8684k9169l0040k9475k6972k3596k0346j7023
62245A358960j3084r089o433n622n465m398k275l23N05N87Q96J632K006J351M3
62230A319291p80l84Q68J999K492K712L121L422K873J601J069K712O149R332J0684
62215A367161J0651J0816J1953J3550J4972J6288J7724J9139K0417K1938K4182
62204A548791K7215L0880L5119L9731M4178M8219N2470N7802O4292P1169P7530
62193B097396Q2666Q5959Q7205Q6945Q5783Q3325P8293O9848N8413M5239L1552
62182B892624J8096N084p526j9572l0740m1238n1729o2002p0404p5595p8461q1004
62170B397533q3525q4231q1772p6928p1406o6096o0984n5811n0354m4810m0141
$$ plain form
62159 1681475 1644368 1609555 1578111 1551279 1528403 1507475 1487326 1468127 1450156 1433579 1419361
62148 1419361 1408751 1401426 1395553 1390224 1386536 1385577 1386642 1388377 1390667 1394291 1399485 1405886 1413332 1421693
62134 1421693 1430458 1439518 1450014 1463268 1479033 1495743 1512404 1529323 1547015 1565390 1584322 1604136
62122 1604136 1625120 1647038 1669460 1692148 1714830 1736977 1758169 1778567 1798740 1819224 1840462
62111 1840462 1863016 1887498 1914234 1943247 1974703 2009191 2047349 2089395 2135410 2185927 2241413
62100 2241413 2300748 2360841 2418441 2471872 2520294 2561904 2594275 2616392 2628960 2632440 2626321 2611010
62088 2611010 2588927 2562263 2530400 2491057 2443740 2390887 2335742 2280352 2225824 2173292 2123713
62077 2123713 2077021 2032244 1988852 1948062 1912464 1883740 1860706 1840283 1820614 1802344 1786432
$$ packed form
62159A681475l7107l4813l1444k6832k2876k0928k0149j9199j7971j6577j4218
62148A419361j0610p325n873n329l688r59J065J735K290L624N194O401P446Q361
62134A421693Q765R060J0496J3254J5765J6710J6661J6919J7692J8375J8932J9814
62122A604136K0984K1918K2422K2688K2682K2147K1192K0398K0173K0484K1238
62111A840462K2554K4482K6736K9013L1456L4488L8158M2046M6015N0517N5486
62100B241413N9335O0093N7600N3431M8422M1610L2371K2117J2568L480o119j5311
62088B611010k2083k6664l1863l9343m7317n2853n5145n5390n4528n2532m9579
62077B123713m6692m4777m3392m0790l5598k8724k3034k0423j9669j8270j5912
$$ plain form
62066 1786432 1771884 1756799 1740872 1725342 1710817 1696713 1682932 1670672 1661088 1654246 1649845 1647916
62054 1647916 1648232 1649921 1652332 1655491 1658977 1661106 1660206 1656282 1650530 1643530 1634903 1624767 1614479 1605458
62040 1605458 1597739 1590169 1581707 1572085 1561435 1549979 1538481 1528571 1521820 1518249 1516325 1514848 1514485
62027 1514485 1516794 1522040 1528788 1535777 1543313 1552379 1563088 1574795 1587471 1602130 1619752 1640346
62015 1640346 1663342 1688392 1715343 1743634 1772423 1801525 1831830 1864433 1899529 1936511 1974951
62004 1974951 2015006 2056864 2100221 2144342 2188253 2230846 2271287 2309299 2344455 2375183 2399306
61993 2399306 2415798 2425113 2427428 2421642 2406894 2384049 2354565 2318592 2275463 2225512 2170117 2110312
61981 2110312 2046791 1981025 1914945 1849522 1785076 1722859 1664627 1610457 1558874 1509738 1465141
$$ packed form
62066A786432j4548j5085j5927j5530j4525j4104j3781j2260r584o842m401j929
62054A647916L16J689K411L159L486K129r00l924n752p000q627j0136j0288r021
62040A605458p719p570q462r622j0650j1456j1498r910o751l571j924j477l63
62027A514485K309N246O748O989P536R066J0709J1707J2676J4659J7622K0594
62015A640346K2996K5050K6951K8291K8789K9102L0305L2603L5096L6982L8440
62004A974951M0055M1858M3357M4121M3911M2593M0441L8012L5156L0728K4123
61993B399306J6492R315K315n786j4748k2845k9484l5973m3129m9951n5395n9805
61981B110312o3521o5766o6080o5423o4446o2217n8232n4170n1583m9136m4597
$$ plain form
61970 1465141 1426467 1392206 1360018 1329554 1301715 1276230 1251767 1227860 1205147 1184076 1164765
61959 1164765 1147820 1133829 1122061 1110856 1099266 1087359 1075228 1062984 1051586 1042305 1035138 1028809
61947 1028809 1022387 1015969 1009946 1004886 1001980 1001938 1003256 1003403 1002364 1003251 1008218 1015261 1020540 1022797 1023777
61932 1023777 1024959 1025761 1025028 1022707 1019469 1015594 1010829 1004866 997638 989388 980570 971427 961718 951059
61918 951059 939335 926651 913374 900693 890434 883402 878211 872805 867022 862592 860619 860300 860442
61905 860442 860833 861349 861013 859417 858342 860268 865192 870481 874346 878199 884563 893528 902541 909484 914783
61890 914783 920363 927610 936926 948513 962525 978527 995544 1012949 1031077 1050787 1072620 1096491
61878 1096491 1121972 1148686 1176359 1204567 1232573 1259649 1285593 1310743 1335425 1359674 1383570
$$ packed form
61970A465141l8674l4261l2188l0464k7839k5485k4463k3907k2713k1071j9311
61959A164765j6945j3991j1768j1205j1590j1907j2131j2244j1398r281p167o329
61947A028809o422o418o023n060k906m2J318J47j039Q87M967P043N279K257R80
61932A023777J182Q02p33k321l238l875m765n963p228q250q818r143r709j0659
61918I51059j1724j2684j3277j2681j0259p032n191n406n783m430j973l19J42
61905H60442L91N16l36j596j075J926M924N289L865L853O364Q965R013O943N299
61890I14783N580P247R316J1587J4012J6002J7017J7405J8128J9710K1833K3871
61878A096491K5481K6714K7673K8208K8006K7076K5944K5150K4682K4249K3896
$$ plain form
61867 1383570 1407312 1430490 1451741 1469793 1484656 1497064 1506816 1512535 1513253 1509516 1502784 1494616 1486794
61854 1486794 1481253 1478912 1479009 1480337 1482811 1487190 1493749 1502152 1512452 1525230 1540572 1557633 1575309
61841 1575309 1592621 1608214 1620174 1626918 1628129 1624686 1617878 1608664 1597320 1583693 1567996 1551197
61829 1551197 1534247 1517060 1498891 1479698 1460437 1441795 1423284 1404093 1384400 1365348 1347808
61818 1347808 1331449 1315031 1297529 1279074 1260833 1243933 1228710 1215147 1203616 1194656 1188340 1184546
61806 1184546 1183591 1185812 1190660 1197213 1205620 1216923 1231205 1247020 1263167 1280062 1298852 1320265
61794 1320265 1345000 1374113 1407934 1445396 1485504 1528690 1575522 1624781 1674184 1722567 1769868
61783 1769868 1815262 1856961 1893974 1926668 1955313 1979356 1998432 2012689 2021619 2023938 2019569 2010799
$$ packed form
61867A383570K3742K3178K1251J8052J4863J2408R752N719P18l737o732q168p822
61854A486794n541k341R7J328K474M379O559Q403J0300J2778J5342J7061J7676
61841A575309J7312J5593J1960O744J211l443o808r214j1344j3627j5697j6799
61829A551197j6950j7187j8169j9193j9261j8642j8511j9191j9693j9052j7540
61818A347808j6359j6418j7502j8455j8241j6900j5223j3563j1531q960o316l794
61806A184546r55K221M848O553Q407J1303J4282J5815J6147J6895J8790K1413
61794A320265K4735K9113L3821L7462M0108M3186M6832M9259M9403M8383M7301
61783A769868M5394M1699L7013L2694K8645K4043J9076J4257Q930K319m369q770
$$ plain form
61771 2010799 2000623 1990662 1981374 1973342 1967250 1963192 1961166 1962007 1966838 1975626 1986980 1999199 2010768
61758 2010768 2019997 2025129 2025126 2019800 2009062 1992611 1970581 1943925 1913666 1880048 1842887 1802744 1761465
61745 1761465 1721344 1683717 1648370 1614272 1580813 1548297 1517438 1488673 1461930 1436631 1411778
61734 1411778 1386478 1360858 1336283 1314233 1294975 1277554 1261012 1245163 1230158 1215803 1201702
61723 1201702 1187851 1174684 1162519 1151373 1141370 1132863 1125772 1119108 1111857 1104450 1098758 1096203 1096214
61710 1096214 1096953 1097295 1097522 1098259 1099446 1100632 1101765 1103246 1105343 1107865 1110450 1112997 1115716 1118840 1122506
61695 1122506 1127029 1132950 1140305 1147879 1153804 1157133 1158345 1158040 1155945 1151802 1146522 1141405 1136457 1130459
61681 1130459 1122662 1113612 1104346 1095620 1087941 1081443 1075548 1069518 1063536 1058523 1054825 1052002 1050074 1049881
$$ packed form
61771B010799j0176r961r288q032o092m058k026Q41M831Q788J1354J2219J1569
61758B010768R229N132ln326j0738j6451k2030k6656l0259l3618l7161m0143m1279
61745A761465m0121l7627l5347l4098l3459l2516l0859k8765k6743k5299k4853
61734A411778k5300k5620k4575k2050j9258j7421j6542j5849j5005j4355j4101
61723A201702j3851j3167j2165j1146j0003q507p091o664p251p407n692k555J1
61710A096214P39L42K27P37J187J186J133J481K097K522K585K547K719L124L666
61695A122506M523N921P355P574N925L329J212l05k095m143n280n117m948n998
61681A130459p797r050r266q726p679o498n895o030n982n013l698k823j928j93
$$ plain form
61667 1049881 1051741 1054644 1057340 1059474 1061180 1062484 1063714 1065644 1068389 1070952 1072720 1074604 1077558 1080572
61653 1080572 1081489 1079642 1076459 1073463 1070837 1068150 1065231 1061725 1056633 1049251 1040286 1031359 1023344 1015658
61639 1015658 1007313 998326 989735 982273 975499 968461 960787 952579 943623 933605 923243 914228 907642
61626 907642 903044 899440 896380 893613 890523 886660 882388 878338 874712 871646 869551 868313 866802 864235
61612 864235 861581 860555 861416 862684 862886 861692 859607 857583 856881 858259 861147 864326 867295 870146 872460
61597 872460 873669 874487 876581 880394 884646 888548 893241 900044 908319 916273 923242 929897 936374 941490
61583 941490 944225 945250 946444 949055 952653 955841 957769 958800 959667 960389 960314 959111 957212 955307 953813
61568 953813 952892 952440 951832 950098 946642 941576 935277 928029 920247 912603 905567 899084 892975 887419 882695
$$ packed form
61667A049881J860K903K696K134J706J304J230J930K745K563J768J884K954L014
61653A080572R17j847l183k996k626k687k919l506n092p382q965q927q015p686
61639A015658q345q987q591p462o774p038p674q208q956j0018j0362r015o586
61626I07642m598l604l060k767l090l863m272m050l626l066k095j238j511k567
61612H64235k654j026Q61J268K02j194k085k024p02J378K888L179K969K851K314
61597H72460J209Q18K094L813M252L902M693O803Q275P954O969O655O477N116
61583I41490K735J025J194K611L598L188J928J031Q67P22p5j203j899j905j494
61568I53813r21m52o08j734l456n066o299p248p782p644p036o483o109n556m724
$$ plain form
61553 882695 878549 874094 868351 860911 852247 843486 835640 828858 822437 815528 807724 799042 789774 780593
61539 780593 772546 766506 762404 759066 755002 749536 743151 736689 730424 724220 718394 713777 710778 708924
61525 708924 707522 706211 704630 702281 699255 696434 694299 692129 689062 685412 682055 679085 676168 673782
61511 673782 672773 672826 672673 671945 671526 671786 671802 671010 670551 672056 675690 680142 684106 687210 689865 692822 696618
61494 696618 701006 705085 708298 711085 714277 718058 721772 724584 726151 726693 726491 725419 723272 720616 718748
61479 718748 718377 718929 719718 721092 723495 726143 728066 730007 733601 738596 742677 744476 745102 745931 746551 746022
61463 746022 744825 744075 743643 742501 740518 738596 737127 735319 732167 727659 723145 720761 721932 725898 730147
61448 730147 732738 733710 733994 733923 733519 733244 733355 733205 732400 732156 734195 738301 742182 743950 743987 744239 746344
$$ packed form
61553H82695m146m455n743p440q664q761p846o782o421o909p804q682r268r181
61539G80593q047o040m102l338m064n466o385o462o265o204n826m617k999j854
61525G08924j402j311j581k349l026k821k135k170l067l650l357k970k917k386
61511F73782j009N3j53p28m19K60J6p92m59J505L634M452L964L104K655K957L796
61494F96618M388M079L213K787L192L781L714K812J567N42k02j072k147k656j868
61479G18748l71N52P89J374K403K648J923J941L594M995M081J799O26Q29O20n29
61463G46022j197p50m32j142j983j922j469j808l152m508m514k384J171L966M249
61448G30147K591R72K84p1m04k75J11j50q05k44K039M106L881J768L7K52K105
$$ plain form
61431 746344 750570 755909 760937 764869 767934 770664 773137 775204 777102 779403 782574 786873 792307 798381
61417 798381 804274 809655 814857 819966 824416 828033 831689 836026 839978 841501 839681 835546 831079 827870
61403 827870 826271 825224 823296 820302 817335 814691 810866 804676 797506 792023 789126 787556 786195 785194
61389 785194 784930 785447 787183 790859 796111 801380 805669 809461 813423 817145 819771 821206 822139 823391 825540
61374 825540 828657 832070 834829 836609 837769 838598 839149 839801 841138 843167 845495 848412 852854 858955 865550
61359 865550 871582 877179 882771 887994 892208 895499 898323 900611 901955 902409 902390 901965 900862 899127 897226
61344 897226 895521 894094 893139 892983 893457 893486 891799 888296 884548 882502 882535 883218 883220 882931 883541 885087 886544
61327 886544 887763 890036 894141 898865 902454 904998 908418 914122 921456 928643 934713 940180 946088 952722
$$ packed form
61431G46344M226N339N028L932L065K730K473K067J898K301L171M299N434O074
61417G98381N893N381N202N109M450L617L656M337L952J523j820m135m467l209
61403H27870j599j047j928k994k967k644l825o190p170n483k897j570j361j001
61389G85194k64N17J736L676N252N269M289L792L962L722K626J435R33J252K149
61374H25540L117L413K759J780J160Q29N51O52J337K029K328K917M442O101O595
61359H65550O032N597N592N223M214L291K824K288J344M54j9m25j103j735j901
61344H97226j705j427r55j56M74K9j687l503l748k046L3O83Kk89O10J546J457
61327H86544J219K273M105M724L589K544L420N704P334P187O070N467N908O634
$$ plain form
61313 952722 959223 964327 967409 969014 970484 972903 976132 978952 980512 981533 983514 986697 989600 990916
61299 990916 991034 991013 990932 990343 989837 990788 993607 997445 1001706 1006674 1012398 1018219 1024029 1031042 1040470 1051916
61283 1051916 1063626 1073932 1082104 1088406 1093890 1099745 1106311 1112854 1118474 1122982 1126911 1131150 1136553
61270 1136553 1143128 1149402 1153391 1154448 1153464 1151188 1147563 1143204 1140066 1139502 1140648 1142013 1143854 1147450
61256 1147450 1152560 1157491 1161835 1167490 1176394 1188499 1202604 1217985 1234271 1250637 1266408 1282175
61244 1282175 1299261 1318051 1337576 1356760 1375296 1393012 1409006 1421917 1430883 1435812 1436769 1433484
61232 1433484 1425757 1414287 1400774 1386850 1372903 1358226 1342451 1326472 1311604 1298139 1285251
61221 1285251 1272244 1259273 1246856 1235442 1225727 1218621 1214247 1211575 1209763 1209454 1211853 1216886 1223200
$$ packed form
61313I52722O501N104L082J605J470K419L229K820J560J021J981L183K903J316
61299I90916J18k1q1n89n06R51K819L838M261M968N724N821N810P013R428J1446
61283A051916J1710J0306Q172O302N484N855O566O543N620M508L929M239N403
61270A136553O575O274L989J057r84k276l625m359l138n64J146J365J841L596
61256A147450N110M931M344N655Q904J2105J4105J5381J6286J6366J5771J5767
61244A282175J7086J8790J9525J9184J8536J7716J5994J2911Q966M929R57l285
61232A433484p727j1470j3513j3924j3947j4677j5775j5979j4868j3465j2888
61221A285251j3007j2971j2417j1414r715p106m374k672j812l09K399N033O314
$$ plain form
61208 1223200 1229781 1236486 1243042 1248850 1254153 1260232 1267793 1276107 1284410 1293192 1303241 1314218 1325178
61195 1325178 1336041 1347461 1359497 1371267 1381841 1390840 1398339 1404724 1410447 1415420 1418821 1419867 1418444
61182 1418444 1414825 1409456 1403306 1397499 1392038 1385834 1378740 1372357 1367864 1364260 1360162 1356237 1354182 1354189 1355368
61167 1355368 1358055 1363556 1371820 1381423 1391804 1403454 1415881 1427589 1438381 1449473 1460782 1470379
61155 1470379 1477561 1484419 1493126 1503443 1514131 1525062 1536474 1547519 1557184 1565618 1573207 1579402 1583890
61142 1583890 1587988 1593504 1600913 1609856 1620494 1632938 1646115 1658780 1671292 1685118 1700898 1718001
61130 1718001 1735507 1752530 1768056 1781546 1793343 1803570 1811210 1815199 1815778 1813788 1809464 1803090 1795988
61117 1795988 1789359 1782734 1775074 1766756 1758733 1750175 1739107 1725563 1712205 1701205 1691906 1682188 1670883
$$ packed form
61208A223200O581O705O556N808N303O079P561Q314Q303Q782J0049J0977J0960
61195A325178J0863J1420J2036J1770J0574Q999P499O385N723M973L401J046j423
61182A418444l619n369o150n807n461o204p094o383m493l604m098l925k055PJ179
61167A355368K687N501Q264R603J0381J1650J2427J1708J0792J1092J1309R597
61155A470379P182O858Q707J0317J0688J0931J1412J1045R665Q434P589O195M488
61142A583890M098N516P409Q943J0638J2444J3177J2665J2512J3826J5780J7103
61130A718001J7506J7023J5526J3490J1797J0227P640L989N79j990m324o374p102
61117A795988o629o625p660q318q023q558j1068j3544j3358j1000r299r718j1305
$$ plain form
61104 1670883 1658116 1644251 1629375 1613372 1596050 1577472 1558261 1539143 1520240 1501368 1482950
61093 1482950 1465978 1451112 1438389 1427694 1418934 1412065 1407603 1406695 1409711 1414939 1419582 1421875 1421444
61080 1421444 1418245 1412575 1405990 1400642 1397414 1395810 1395681 1397644 1401485 1405626 1408976 1412359 1417573 1425930
61066 1425930 1438129 1454498 1474613 1497396 1522105 1548650 1576885 1606693 1639120 1675995 1717516
61055 1717516 1761273 1804668 1847458 1890941 1935589 1980797 2026305 2072267 2118070 2162534 2205504
61044 2205504 2248038 2290577 2331871 2370312 2405592 2438298 2468278 2494173 2514527 2528903 2537947
61033 2537947 2542871 2545019 2545383 2544021 2540138 2533245 2524334 2515509 2508404 2503297 2499803 2497781 2497211 2497746 2499097
61018 2499097 2501736 2506703 2514755 2525920 2539565 2554639 2570289 2586770 2605317 2626352 2648114 2667960
$$ packed form
61104A670883j2767j3865j4876j6003j7322j8578j9211j9118j8903j8872j8418
61093A482950j6972j4866j2723j0695q760o869m462r08L016N228M643K293m31
61080A421444l199n670o585n348l228j604j29J963L841M141L350L383N214Q357
61066A425930J2199J6369K0115K2783K4709K6545K8235K9808L2427L6875M1521
61055A717516M3757M3395M2790M3483M4648M5208M5508M5962M5803M4464M2970
61044B205504M2534M2539M1294L8441L5280L2706K9980K5895K0354J4376R044
61033B537947M924K148L64j362l883o893q911q825p105n107l494k022n70N35J351
61018B499097K639M967Q052J1165J3645J5074J5650J6481J8547K1035K1762J9846
$$ plain form
61006 2667960 2684931 2700147 2714687 2728161 2739849 2750302 2760940 2772325 2783564 2793444 2801716 2809098
60994 2809098 2816242 2823012 2828840 2833582 2837740 2842060 2847414 2855015 2866031 2880684 2898366 2918923 2943100
60981 2943100 2971230 3002341 3035527 3071655 3112684 3159441 3210965 3266068 3324851 3388693 3459136
60970 3459136 3536711 3620619 3709985 3805546 3909322 4022262 4143360 4271727 4408156 4553419
60960 4553419 4706581 4867059 5037552 5222790 5425783 5647483 5889852 6156919 6452530
60951 6452530 6779243 7140158 7540404 7986803 8487959 9054701 9698334 10428320 11253817
60942 11253817 12187205 13243058 14433910 15771411 17272514 18959875 20855713 22982717
60934 22982717 25369854 28031004 30899674 33770035 36327888 38285755 39525185 40130632
$$ packed form
61006B667960J6971J5216J4540J3474J1688J0453J0638J1385J1239R880Q272P382
60994B809098P144O770N828M742M158M320N354P601J1016J4653J7682K0557K4177
60981B943100K8130L1111L3186L6128M1029M6757N1524N5103N8783O3842P0443
60970C459136P7575Q3908Q9366R5561J03776J12940J21098J28367J36429J45263
60960D553419J53162J60478J70493J85238K02993K21700K42369K67067K95611
60951F452530L26713L60915M00246M46399N01156N66742O43633P29986Q25497
60942A1253817R33388J055853J190852J337501J501103J687361J895838K127004
60934B2982717K387137K661150K868670K870361K557853J957867J239430O05447
$$ plain form
60926 40130632 40304799 40262311 40182748 40201196 40369439 40591682 40619683 40159921 39029069 37236773
60916 37236773 34945344 32365957 29679954 27016290 24459953 22063730 19857693 17857469
60908 17857469 16068215 14484611 13092742 11875172 10813866 9889301 9080759 8369966
60900 8369966 7743468 7190731 6701512 6266046 5876293 5525533 5207566 4917374 4652088
60891 4652088 4410484 4191768 3995001 3818783 3660732 3517552 3386029 3263685 3148579
60882 3148579 3039164 2934561 2834417 2738434 2646678 2560145 2479936 2405554 2334996 2266855 2201410
60871 2201410 2139265 2080069 2023372 1969784 1920180 1874213 1830656 1788991 1749816 1713667 1680242
60860 1680242 1648932 1619529 1592113 1566587 1542667 1520188 1499075 1478984 1459300 1439778 1421093
$$ packed form
60926D0130632J74167m2488p9563J8448J68243K22243K8001m59762j130852j792296
60916C7236773k291429k579387k686003k663664k556337k396223k206037k000224
60908A7857469j789254j583604j391869j217570j061306r24565q08542p10793
60900H369966o26498n52737m89219m35466l89753l50760l17967k90192k65286
60891D652088k41604k18716j96767j76218j58051j43180j31523j22344j15106
60882C148579j09415j04603j00144r5983r1756q6533q0209p4382p0558o8141o5445
60871B201410o2145n9196n6697n3588m9604m5967m3557m1665l9175l6149l3425
60860A680242l1310k9403k7416k5526k3920k2479k1113k0091j9684j9522j8685
$$ plain form
60849 1421093 1404381 1390138 1377878 1366846 1356618 1346870 1337317 1328352 1321033 1315619 1310491 1303454 1294030
60836 1294030 1283701 1273959 1264934 1255934 1246485 1236423 1225605 1213941 1201483 1188387 1175012 1161961
60824 1161961 1149544 1137292 1124476 1111130 1098081 1086057 1075224 1065490 1056568 1047802 1038670 1029650
60812 1029650 1021996 1016449 1012573 1009372 1006115 1002662 999619 998163 999056 1001779 1005228 1009168 1014237 1020516
60798 1020516 1026985 1032589 1037122 1041006 1044888 1049418 1054422 1058269 1059265 1057996 1057132 1058477 1061288 1063909
60784 1063909 1065670 1066395 1065489 1062839 1059576 1056477 1052287 1045097 1034945 1023632 1012280 1000577 988470
60771 988470 977143 967754 960156 953289 946220 938588 930649 923079 916218 909526 902328 894975 888554 883492
60757 883492 879237 875230 871255 866854 861504 855640 850347 845558 839688 831811 823260 816123 810824 806241
$$ packed form
60849A421093j6712j4243j2260j1032j0228r748r553q965p319n414n128p037r424
60836A294030j0329r742r025r000r449j0062j0818j1664j2458j3096j3375j3051
60824A161961j2417j2252j2816j3346j3049j2024j0833r734q922q766r132r020
60812A029650p654n547l876l201l257l453l043j456Q93K723L449L940N069O279
60798A020516O469N604M533L884L882M530N004L847R96j269q64J345K811K621
60784A063909J761P25r06k650l263l099m190p190j0152j1313j1352j1703j2107
60771I88470j1327r389p598o867p069p632p939p570o861o692p198p353o421n062
60757H83492m255m007l975m401n350n864n293m789n870p877q551p137n299m583
$$ plain form
60743 806241 801661 797447 793987 791215 789343 788989 790147 791761 792812 793438 794570 796769 799791 803156 806779
60728 806779 810998 815971 821091 825279 828147 830612 833800 837372 839641 839599 838258 837563 838406 840096 841388
60713 841388 841416 839874 837003 833531 830255 827551 825424 823902 823030 822650 822527 822606 822741 822317 820709 818099
60697 818099 815370 813130 811323 809742 808306 806800 805055 803575 803130 803377 802795 800733 798776 799134 802067
60682 802067 805820 808743 810271 809861 806431 799804 791993 785969 782983 781557 779242 775109 770398 766937
60668 766937 765349 764946 765003 765478 766473 767639 768581 769435 770634 772368 774609 777268 779904 781671 782119 781724
60652 781724 781169 780569 780112 780878 783906 788672 793598 797998 802297 806230 808274 807543 805192 803165 802218 801861
60636 801861 801563 801201 800722 800010 798902 797087 794394 791391 788960 786964 784216 780320 776526 773907 771708
$$ packed form
60743H06241m580m214l460k772j872l54J158J614J051O26J132K199L022L365L623
60728H06779M219M973N120M188K868K465L188L572K269m2j341o95Q43J690J292
60713H41388K8j542k871l472l276k704k127j522q72l80j23P9J35m24j608k610
60697H18099k729k240j807j581j436j506j745j480m45K47n82k062j957L58K933
60682H02067L753K923J528m10l430o627p811o024k986j426k315m133m711l461
60668G66937j588m03N7M75R95J166R42Q54J199J734K241K659K636J767M48l95
60652G81724n55o00m57P66L028M766M926M400M299L933K044p31k351k027r47l57
60636H01861k98l62m79p12j108j815k693l003k431j996k748l896l794k619k199
$$ plain form
60621 771708 768824 766234 766281 769610 774273 778105 780788 783134 785422 787250 788445 789483 791068 793461 795959
60606 795959 797167 796232 793740 790915 788128 785010 781898 780010 779813 780162 779702 778461 777497 777641 779204 782376
60590 782376 786958 791878 795771 798176 799799 801486 803185 803965 803008 800613 798102 796412 794912 792155 787758
60575 787758 782829 778452 774706 771531 769538 769134 769656 770311 771361 773301 775446 776604 776888 777524 778878
60560 778878 779946 780053 779785 779861 780172 780422 780648 780546 779294 776880 774715 774025 774390 774835 775774 778716 784300
60543 784300 791543 798809 804688 808300 809823 810693 812245 814059 814569 813384 812074 812511 815415 820737 828190
60528 828190 836606 843746 847978 849871 851331 853330 855225 856253 856912 858550 861899 866321 870510 874098
60514 874098 878493 885737 896314 908604 920958 933857 949196 967602 987434 1006744 1025452 1044874
$$ packed form
60621G71708k884k590M7L329M663L832K683K346K288J828J195J038J585K393K498
60606G95959J208r35k492k825k787l118l112j888j97L49m60j241r64J44J563L172
60590G82376M582M920L893K405J623J687J699P80r57k395k511j690j500k757m397
60575G87758m929m377l746l175j993m04N22O55J050J940K145J158K84O36J354
60560G78878J068J07k68P6L11K50K26j02j252k414k165o90L65M45R39K942N584
60543G84300P243P266N879L612J523Q70J552J814N10j185j310M37K904N322P453
60528H28190Q416P140M232J893J460J999J895J028O59J638L349M422M189L588
60514H74098M395P244J0577J2290J2354J2899J5339J8406J9832J9310J8708J9422
$$ plain form
60502 1044874 1065470 1085726 1103281 1116612 1125542 1130734 1133188 1134033 1134224 1134188 1133820 1132809 1130914 1128251
60488 1128251 1125768 1125277 1128267 1134469 1142254 1150856 1161457 1175467 1192552 1211510 1232590 1257390 1286304
60475 1286304 1317611 1349811 1383599 1420400 1459597 1498292 1533381 1562951 1586044 1602362 1612400
60464 1612400 1616984 1616338 1610197 1599092 1584908 1569755 1554591 1539178 1523088 1506474 1490266 1476044
60452 1476044 1465482 1459257 1456293 1454587 1453331 1454193 1459977 1471905 1488706 1508646 1531894 1560276 1595195
60439 1595195 1636701 1684334 1737770 1796463 1859731 1927510 1999924 2075606 2151459 2224745 2294381
60428 2294381 2359379 2417332 2465918 2505153 2536481 2559941 2573757 2576467 2567760 2547021 2512808 2464528
60416 2464528 2403531 2332000 2251821 2165104 2074703 1983409 1893357 1806739 1725981 1652346 1585200
$$ packed form
60502A044874K0596K0256J7555J3331Q930N192K454Q45J91l6l68j011j895k663
60488A128251k483m91K990O202P785Q602J0601J4010J7085J8958K1080K4800K8914
60475A286304L1307L2200L3788L6801L9197L8695L5089K9570K3093J6318J0038
60464A612400M584o46o141j1105j4184j5153j5164j5413j6090j6614j6208j4222
60452A476044j0562o225k964j706j256Q62N784J1928J6801J9940K3248K8382L4919
60439A595195M1506M7633N3436N8693O3268O7779P2414P5682P5853P3286O9636
60428B294381O4998N7953M8586L9235L1328K3460J3816K710q707k0739l4213m8280
60416B464528o0997p1531q0179q6717r0401r1294r0052q6618q0758p3635o7146
$$ plain form
60405 1585200 1523586 1467697 1417798 1372604 1330231 1290435 1254452 1222619 1193497 1165681 1139359
60394 1139359 1115571 1094734 1076402 1059838 1044342 1029552 1015875 1004145 994454 985851 977660 970481
60382 970481 965106 960894 956258 950680 945193 940600 936284 931436 926618 923006 920376 916976 911641 905271
60368 905271 899878 896705 895477 894896 893504 890678 887297 885049 884570 884623 883619 881555 879810 879381 880165 881800
60352 881800 884281 887482 890822 893808 896543 899389 902458 905643 908898 912295 915883 919440 922284 923671
60338 923671 923891 924736 928135 934216 941264 947532 952432 955933 957871 958502 959021 960646 963405 966405 969145
60323 969145 972037 975610 979672 983394 986063 987741 989298 991713 995281 999504 1003714 1007605 1011220 1014686
60309 1014686 1018043 1021187 1024001 1026686 1029760 1033411 1037108 1040370 1043687 1047902 1052790 1057166 1060662 1064467
$$ packed form
60405A585200o1614n5889m9899m5194m2373l9796l5983l1833k9122k7816k6322
60394A139359k3788k0837j8332j6564j5496j4790j3677j1730r691q603q191p179
60382I70481n375m212m636n578n487m593m316m848m818l612k630l400n335o370
60368I05271n393l173j228n81j392k826l381k248m79N3j004k064j745m29P84J635
60352H81800K481L201L340K986K735K846L069L185L255L397L588L557K844J387
60338I23671K20Q45L399O081P048O268M900L501J938O31N19J625K759L000K740
60323I69145K892L573M062L722K669J678J557K415L568M223M210L891L615L466
60309A014686L357L144K814K685L074L651L697L262L317M215M888M376L496L805
$$ plain form
60295 1064467 1069945 1077359 1086403 1097037 1108923 1120816 1131682 1142074 1153193 1164635 1174115 1179692
60283 1179692 1181509 1181145 1180003 1178695 1177187 1174838 1170622 1164088 1156160 1148534 1142149 1136549 1130835 1124853
60269 1124853 1119090 1113700 1108244 1102581 1097426 1093486 1090370 1087050 1083471 1081028 1081082 1083427 1086688 1090000
60255 1090000 1093775 1098821 1105262 1112713 1121351 1132240 1146320 1163310 1182024 1201619 1221977 1242902
60243 1242902 1263721 1283997 1303828 1322739 1338919 1350460 1357001 1359284 1357398 1350503 1338155 1320920
60231 1320920 1299808 1276235 1252533 1231148 1212875 1196852 1182543 1170548 1161060 1152885 1144886 1137392
60219 1137392 1131217 1126130 1121336 1116816 1113094 1109967 1106319 1100997 1093455 1084102 1074546 1066816 1061509 1057154
60205 1057154 1052001 1045846 1039520 1033506 1028018 1023601 1020361 1017221 1013288 1009576 1007900 1008189 1008323 1006834
$$ packed form
60295A064467N478P414R044J0634J1886J1893J0866J0392J1119J1442R480N577
60283A179692J817l64j142j308j508k349m216o534p928p626o385n600n714n982
60269A124853n763n390n456n663n155l940l116l320l579k443N4K345L261L312
60255A090000L775N046O441P451Q638J0889J4080J6990J8714J9595K0358K0925
60243A242902K0819K0276J9831J8911J6180J1541O541K283j886o895j2348j7235
60231A320920k1112k3573k3702k1385j8273j6023j4309j1995r488q175p999p494
60219A137392o175n087m794m520l722l127l648n322p542r353r556p730n307m355
60205A057154n153o155o326o014n488m417l240l140l933l712j676K89J34j489
$$ plain form
60191 1006834 1004574 1003458 1004529 1007497 1011245 1014471 1016622 1018454 1021122 1024702 1028287 1031359 1034112 1036441
60177 1036441 1037731 1038001 1038308 1039603 1041831 1044467 1047234 1049985 1052607 1055393 1058871 1062932 1066697 1069620
60163 1069620 1072220 1075379 1079431 1084213 1089614 1095694 1102548 1110251 1118767 1127989 1138094 1149580 1162450
60150 1162450 1175759 1188750 1202140 1217158 1233420 1248978 1262795 1276072 1290626 1306786 1323317
60139 1323317 1338586 1351414 1361653 1370408 1378875 1386631 1392018 1394656 1396289 1398377 1400067 1399705 1397274
60126 1397274 1393877 1389604 1383656 1376331 1369033 1362070 1353961 1343627 1332027 1320845 1310459 1300180 1289868
60113 1289868 1280193 1271476 1263280 1255381 1248302 1242431 1237185 1231782 1226555 1222676 1220440 1218646 1216125 1213203
60099 1213203 1210902 1209213 1207216 1204826 1203309 1203713 1205608 1207864 1210061 1212540 1215527 1218872 1222517 1226689
$$ packed form
60191A006834k260j116J071K968L748L226K151J832K668L580L585L072K753K329
60177A036441J290K70L07J295K228K636K767K751K622K786L478M061L765K923
60163A069620K600L159M052M782N401O080O854P703Q516R222J0105J1486J2870
60150A162450J3309J2991J3390J5018J6262J5558J3817J3277J4554J6160J6531
60139A323317J5269J2828J0239Q755Q467P756N387K638J633K088J690l62k431
60126A397274l397m273n948p325p298o963q109j0334j1600j1182j0386j0279j0312
60113A289868r675q717q196p899p079n871n246n403n227l879k236j794k521k922
60099A213203k301j689j997k390j517M04J895K256K197K479K987L345L645M172
$$ plain form
60085 1226689 1231609 1237166 1242891 1248255 1253221 1258404 1264361 1270837 1277284 1284089 1292462 1302850 1314258
60072 1314258 1325630 1337121 1349316 1361702 1372840 1381865 1389207 1395923 1402853 1410323 1418186 1426165 1434394
60059 1434394 1443402 1453360 1463696 1473838 1483950 1494405 1504960 1515147 1525261 1536128 1547831 1559312
60047 1559312 1569358 1577405 1583226 1586398 1586481 1583569 1578398 1571979 1565146 1558283 1551327 1543968 1535856 1526752
60033 1526752 1516847 1506996 1498240 1490902 1484453 1478412 1472893 1467900 1462641 1456235 1448886 1441706 1435391 1429565
60019 1429565 1423368 1416195 1407906 1398838 1389721 1381160 1373030 1364614 1355264 1344704 1332853 1319861 1306198
60006 1306198 1292201 1277498 1261475 1244480 1228074 1213876 1202537 1193901 1187518 1182561 1177750 1172067
59994 1172067 1165614 1159442 1154573 1151409 1149826 1149383 1149406 1149377 1149470 1150476 1153013 1157007 1162069 1168016 1174751 1182043
$$ packed form
60085A226689M920N557N725N364M966N183N957O476O447O805Q373J0388J1408
60072A314258J1372J1491J2195J2386J1138R025P342O716O930P470P863P979Q229
60059A434394R008R958J0336J0142J0112J0455J0555J0187J0114J0867J1703J1481
60047A559312J0046Q047N821L172Q3k912n171o419o833o863o956p359q112r104
60033A526752r905r851q756p338o449o041n519m993n259o406p349p180o315n826
60019A429565o197p173q289r068r117q561q130q416r350j0560j1851j2992j3663
60006A306198j3997j4703j6023j6995j6406j4198j1339q636o383m957m811n683
59994A172067o453o172m869l164j583m43K3k9R3J006K537L994N062N947O735P292
$$ plain form
59978 1182043 1190036 1199726 1211965 1225675 1237906 1246309 1251100 1254027 1256037 1256825 1256216 1254678 1252361 1248660
59964 1248660 1243096 1235787 1226737 1215551 1202365 1188304 1174428 1160731 1146691 1132211 1117555 1102962
59952 1102962 1088942 1076390 1065819 1056889 1049170 1042825 1038007 1034264 1031225 1029103 1027700 1025686 1022057
59939 1022057 1017784 1014745 1013369 1012617 1012053 1012336 1013484 1014116 1013093 1011010 1009582 1010225 1013462 1018785 1024761
59924 1024761 1030075 1034861 1040384 1047231 1054630 1061678 1068093 1073300 1075973 1075378 1072483 1068963 1065672 1062685
59910 1062685 1060040 1057619 1054797 1051130 1047115 1043539 1040461 1037543 1035175 1034602 1036945 1042318 1049515 1056274
59896 1056274 1060559 1062225 1062979 1064137 1065046 1064348 1062129 1059835 1058547 1058310 1058796 1059533 1059728 1059007 1058271 1058871
59880 1058871 1060936 1063412 1065670 1068059 1070880 1073846 1076645 1079091 1080717 1081378 1082396 1085858 1092359 1100474
$$ packed form
59978A182043P993R690J2239J3710J2231Q403M791K927K010P88o09j538k317l701
59964A248660n564p309r050j1186j3186j4061j3876j3697j4040j4480j4656j4593
59952A102962j4020j2552j0571q930p719o345m818l743l039k122j403k014l629
59939A022057m273l039j376p52n64K83J148O32j023k083j428O43L237N323N976
59924A024761N314M786N523O847P399P048O415N207K673n95k895l520l291k987
59910A062685k645k421k822l667m015l576l078k918k368n73K343N373P197O759
59896A056274M285J666P54J158R09o98k219k294j288k37M86P37J95p21p36O00
59880A058871K065K476K258K389K821K966K799K446J626O61J018L462O501Q115
$$ plain form
59866 1100474 1108679 1116482 1123289 1127829 1129856 1131166 1133503 1136211 1137290 1136235 1134515 1133563 1133514 1133850 1134276
59851 1134276 1134935 1136550 1140118 1145674 1151630 1156283 1159788 1163552 1167916 1171689 1174144 1176186 1179022 1182615
59837 1182615 1186003 1188449 1189830 1190566 1191646 1194205 1198574 1204110 1210213 1217053 1225082 1234423 1245066 1257056
59823 1257056 1270032 1282994 1295040 1306109 1316780 1327600 1338725 1349842 1360320 1369818 1378696 1387362
59811 1387362 1395340 1401736 1406520 1410329 1412962 1413329 1411327 1408481 1406028 1403550 1400362 1397017 1394232 1391402
59797 1391402 1387677 1383757 1381034 1379488 1378043 1376740 1376820 1378657 1381222 1383934 1387504 1392503 1398420 1404799
59783 1404799 1412120 1420740 1429721 1437345 1442272 1443896 1442447 1439227 1436010 1433727 1432275 1431723 1432614 1434640
59769 1434640 1436147 1435783 1433752 1430673 1426130 1419468 1411264 1402768 1394245 1385089 1375401 1366219 1358074 1350362
$$ packed form
59866A100474Q205P803O807M540K027J310K337K708J079j055j720r52m9L36M26
59851A134276O59J615L568N556N956M653L505L764M364L773K455K042K836L593
59837A182615L388K446J381P36J080K559M369N536O103O840Q029R341J0643J1990
59823A257056J2976J2962J2046J1069J0671J0820J1125J1117J0478R498Q878Q666
59811A387362P978O396M784L809K633L67k002k846k453k478l188l345k785k830
59797A391402l725l920k723j546j445j303Q0J837K565K712L570M999N917O379
59783A404799P321Q620Q981P624M927J624j449l220l217k283j452n52Q91K026
59769A434640J507l64k031l079m543o662q204q496q523r156r688r182q145p712
$$ plain form
59755 1350362 1342474 1334802 1328222 1323194 1319758 1317851 1317018 1316020 1313399 1308821 1303711 1300054 1298256 1296523
59741 1296523 1292872 1287570 1282728 1279345 1275695 1269267 1259556 1248186 1236947 1226806 1218475 1212520 1208375
59728 1208375 1204192 1198443 1191485 1185114 1180749 1178277 1176483 1174217 1171169 1167798 1164770 1162525 1161208 1160803
59714 1160803 1161278 1162722 1165277 1168711 1172149 1174693 1176527 1179025 1183507 1190050 1197750 1205705 1213403 1220558
59700 1220558 1227254 1234266 1242749 1253350 1265788 1279284 1293119 1306743 1319681 1331656 1342856 1353927
59688 1353927 1365466 1377470 1389411 1400898 1411944 1422361 1431361 1438346 1443853 1448959 1453756 1457179
59676 1457179 1458503 1458263 1457466 1456607 1455720 1454583 1452422 1448337 1442792 1438001 1435970 1436488 1437721 1438262 1437829 1436456
59660 1436456 1434156 1431299 1428394 1425471 1422440 1420015 1419284 1420150 1421058 1420774 1419863 1419891 1421482 1423766 1425759 1427808
$$ packed form
59755A350362p888p672o580n028l436j907q33r98k621m578n110l657j798j733
59741A296523l651n302m842l383l650o428r711j1370j1239j0141q331n955m145
59728A208375m183n749o958o371m365k472j794k266l048l371l028k245j317m05
59714A160803M75J444K555L434L438K544J834K498M482O543P700P955P698P155
59700A220558O696P012Q483J0601J2438J3496J3835J3624J2938J1975J1200J1071
59688A353927J1539J2004J1941J1487J1046J0417R000O985N507N106M797L423
59676A457179J324k40p97q59q87j137k161m085n545m791k031N18J233N41m33j373
59660A436456k300k857k905k923l031k425p31Q66R08k84r11K8J591K284J993K049
$$ plain form
59644 1427808 1431150 1435958 1440438 1442673 1443228 1444878 1449273 1454922 1459281 1461966 1464668 1468466 1472680 1476430
59630 1476430 1479876 1483474 1486994 1489797 1491416 1491514 1489984 1487399 1484698 1482043 1478630 1473947 1468438 1462497
59616 1462497 1455721 1447927 1440133 1433350 1426740 1418186 1406838 1394104 1381916 1371006 1361390 1353519 1347851
59603 1347851 1343792 1340326 1337725 1337414 1339721 1342820 1344738 1345592 1346931 1349548 1353098 1357343 1362278 1367091
59589 1367091 1370587 1372898 1375271 1377679 1378234 1375883 1372189 1369144 1366344 1361885 1355176 1347235 1338696 1329293
59575 1329293 1319226 1309493 1300642 1292386 1284687 1278149 1273056 1268876 1264851 1260398 1255064 1248941 1242962 1237769
59561 1237769 1232458 1225564 1217166 1208682 1200660 1192361 1183789 1176410 1171059 1166474 1161007 1154827 1149458 1145874
59547 1145874 1143926 1143085 1142850 1142821 1143015 1143823 1145218 1146493 1147169 1147616 1148366 1149443 1150785 1152601 1154776 1156575
$$ packed form
59644A427808L342M808M480K235N55J650M395N649M359K685K702L798M214L750
59630A476430L446L598L520K803J619R8j530k585k701k655l413m683n509n941
59616A462497o776p794p794o783o610q554j1348j2734j2188j0910r616p871n668
59603A347851m059l466k601l11K307L099J918Q54J339K617L550M245M935M813
59589A367091L496K311K373K408N55k351l694l045k800m459o709p941q539r403
59575A329293j0067r733q851q256p699o538n093m180m025m453n334o123n979n193
59561A237769n311o894q398q484q022q299q572p379n351m585n467o180n369l584
59547A145874j948q41k35k9J94Q08J395J275O76M47P50J077J342J816K175J799
$$ plain form
59531 1156575 1157488 1157783 1157669 1156685 1154586 1152130 1150155 1148452 1146455 1144522 1143476 1143164 1142462 1140662 1138064
59516 1138064 1135240 1132544 1130383 1129207 1128869 1128395 1126624 1123032 1118132 1113352 1110305 1109657 1110639 1111858 1112478
59501 1112478 1112468 1112114 1111729 1111677 1112205 1113235 1114610 1116470 1119070 1122227 1125176 1127136 1128134 1129334 1132270 1137395
59485 1137395 1143597 1149644 1155839 1163431 1172546 1181943 1191149 1201626 1215027 1231250 1249178 1268420 1288890
59472 1288890 1308892 1325109 1335039 1338862 1338658 1336273 1332158 1325978 1318139 1310585 1305787 1304779 1306572 1309670
59458 1309670 1313545 1318174 1322771 1325909 1326689 1325143 1321560 1316115 1309124 1301076 1292342 1283164 1273793 1264215
59444 1264215 1253993 1242926 1231798 1221887 1213672 1206485 1199541 1192896 1187187 1182559 1178181 1173111 1167801
59431 1167801 1164205 1163638 1164788 1165036 1164026 1164517 1168895 1175999 1182759 1188056 1193341 1199805 1206747 1213021 1218662
$$ packed form
59531A156575R13K95j14r84k099k456j975j703j997j933j046l12p02j800k598
59516A138064k824k696k161j176l38m74j771l592m900m780l047o48R82J219O20
59501A112478j0l54l85n2N28J030J375J860K600L157K949J960R98J200K936N125
59485A137395O202O047O195P592R115R397R206J0477J3401J6223J7928J9242K0470
59472A288890K0002J6217R930L823k04k385m115o180p839p554m798j008J793L098
59458A309670L875M629M597L138P80j546l583n445o991q048q734r178r371r578
59444A264215j0222j1067j1128r911q215p187o944o645n709m628m378n070n310
59431A167801l596n67J150K48j010M91M378P104O760N297N285O464O942O274N641
$$ plain form
59416 1218662 1224430 1230716 1237483 1244574 1251598 1257979 1263464 1268177 1272084 1274976 1277180 1279633 1282895 1286505
59402 1286505 1289447 1290904 1290639 1289289 1288381 1289330 1292192 1295988 1300275 1305573 1312071 1319013 1326018 1334127 1344602
59387 1344602 1357138 1370060 1381918 1392043 1399756 1404062 1404500 1401845 1397704 1393498 1389711 1385756 1380609
59374 1380609 1373891 1366372 1359261 1353177 1348186 1344651 1343431 1345089 1349390 1355835 1364262 1374567 1386183
59361 1386183 1398477 1411780 1427488 1446863 1469967 1495995 1524234 1554267 1585476 1617204 1649781
59350 1649781 1684874 1724034 1766473 1808200 1843310 1866583 1875921 1873394 1864110 1853360 1844090 1836756
59338 1836756 1831455 1829790 1834120 1844696 1857715 1866712 1866339 1855038 1834569 1807936 1778267 1748783
59326 1748783 1722119 1699040 1678546 1659664 1642534 1627339 1613184 1599078 1585675 1574946 1568051
$$ packed form
59416A218662N768O286O767P091P024O381N485M713L907K892K204K453L262L610
59402A286505K942J457k65j350r08R49K862L796M287N298O498O942P005Q109J0475
59387A344602J2536J2922J1858J0125P713M306M38k655m141m206l787l955n147
59374A380609o718p519p111o084m991l535j220J658M301O445Q427J0305J1616
59361A386183J2294J3303J5708J9375K3104K6028K8239L0033L1209L1728L2577
59350A649781L5093L9160M2439M1727L5110K3273R338k527r284j0750r270p334
59338A836756n301j665M330J0576J3019Q997l73j1301k0469k6633k9669k9484
59326A748783k6664k3079k0494j8882j7130j5195j4155j4106j3403j0729o895
$$ plain form
59315 1568051 1564184 1561563 1558871 1555673 1552190 1549062 1546877 1545497 1544086 1542093 1540009 1538931 1539524 1541625
59301 1541625 1544748 1548662 1553468 1559271 1566053 1573938 1583427 1595024 1608486 1622748 1636906 1651229 1666937
59288 1666937 1684960 1705018 1725827 1746059 1765182 1783613 1802137 1821082 1839973 1857943 1874359
59277 1874359 1889036 1901932 1912707 1920540 1924366 1923472 1917890 1908201 1895056 1878993 1860495 1839860
59265 1839860 1817081 1792291 1766341 1740604 1716072 1692803 1670196 1647599 1624933 1603113 1583588
59254 1583588 1566830 1551515 1535940 1520098 1505408 1492473 1480291 1467923 1455800 1444861 1435444
59243 1435444 1427655 1421902 1418299 1416334 1415800 1417372 1421701 1428808 1438920 1452604 1468935 1484486 1495454
59230 1495454 1500182 1498650 1490728 1476805 1459439 1442218 1426787 1412578 1399409 1388541 1380811 1375518
$$ packed form
59315A568051l867k621k692l198l483l128k185j380j411j993k084j078N93K101
59301A541625L123L914M806N803O782P885R489J1597J3462J4262J4158J4323J5708
59288A666937J8023K0058K0809K0232J9123J8431J8524J8945J8891J7970J6416
59277A874359J4677J2896J0775P833L826q94n582r689j3145j6063j8498k0635
59265A839860k2779k4790k5950k5737k4532k3269k2607k2597k2666k1820j9525
59254A583588j6758j5315j5575j5842j4690j2935j2182j2368j2123j0939r417
59243A435444p789n753l603j965n34J572M329P107J0112J3684J6331J5551J0968
59230A495454M728j532p922j3923j7366j7221j5431j4209j3169j0868p730n293
$$ plain form
59218 1375518 1372008 1370952 1373012 1377257 1382109 1387445 1394841 1405826 1420447 1437506 1455873 1475294 1495780
59205 1495780 1516390 1535419 1552178 1567737 1582970 1596639 1606627 1612542 1615529 1615929 1613036 1607460 1601731
59192 1601731 1597638 1594423 1590665 1586663 1583774 1582362 1581731 1581502 1581805 1582347 1582476 1582283 1582897 1585369 1589416 1593291
59176 1593291 1594928 1593683 1591064 1589242 1588675 1587789 1585180 1581224 1576963 1572164 1565376 1555663 1543623 1530809
59162 1530809 1518512 1506846 1494728 1481003 1465852 1450741 1436848 1424068 1411813 1400149 1389673
59151 1389673 1380760 1373263 1366521 1359454 1351455 1343703 1338689 1337612 1338806 1339578 1339121 1338814 1340128 1343273 1347612
59136 1347612 1352215 1356019 1358491 1360467 1363559 1368360 1373749 1378173 1381189 1383536 1386177 1389508 1393209 1396664
59122 1396664 1399783 1403318 1407989 1413210 1417165 1418399 1417024 1414243 1411111 1407975 1404740 1401209 1397299 1393271
$$ packed form
59218A375518l510j056K060M245M852N336P396J0985J4621J7059J8367J9421K0486
59205A495780K0610J9029J6759J5559J5233J3669R988N915K987M00k893n576n729
59192A601731m093l215l758m002k889j412o31k29L03N42J29j93O14K472M047L875
59176A593291J637j245k619j822n67q86k609l956m261m799o788r713j2040j2814
59162A530809j2297j1666j2118j3725j5151j5111j3893j2780j2255j1664j0476
59151A389673q913p497o742p067p999p752n014j077J194P72m57l07J314L145M339
59136A347612M603L804K472J976L092M801N389M424L016K347K641L331L701L455
59122A396664L119L535M671N221L955J234j375k781l132l136l235l531l910m028
$$ plain form
59108 1393271 1389656 1386710 1384094 1381407 1378856 1376872 1375123 1372589 1368922 1365119 1362256 1359983 1357038 1353048
59094 1353048 1348845 1344832 1339971 1332946 1323724 1313319 1302380 1290659 1277768 1263908 1249860 1236526
59082 1236526 1224423 1213403 1202905 1192489 1181946 1171204 1160905 1152915 1149024 1148533 1148235 1145625 1141294
59069 1141294 1137359 1134708 1133207 1133653 1137497 1144677 1153352 1161977 1170340 1178588 1186728 1195477 1206245 1219734
59055 1219734 1235386 1252291 1269577 1286017 1300798 1314881 1329990 1345833 1360013 1371310 1381206
59044 1381206 1391110 1399946 1406138 1410557 1415432 1421022 1425334 1426958 1426580 1425567 1424347 1422398 1418941 1413622
59030 1413622 1407275 1401899 1398935 1397611 1395798 1392512 1388748 1385727 1383214 1379755 1373938 1365167 1353846 1341270
59016 1341270 1329002 1317908 1307760 1297878 1288050 1278712 1270200 1262033 1253289 1243961 1235548 1229700 1226352
$$ packed form
59108A393271l615k946k616k687k551j984j749k534l667l803k863k273k945l990
59094A353048m203m013m861p025r222j0405j0939j1721j2891j3860j4048j3334
59082A236526j2103j1020j0498j0416j0543j0742j0299p990l891m91k98k610m331
59069A141294l935k651j501M46L844P180Q675Q625Q363Q248Q140Q749J0768J3489
59055A219734J5652J6905J7286J6440J4781J4083J5109J5843J4180J1297R896
59044A381206R904Q836O192M419M875N590M312J624l78j013j220j949l457n319
59030A413622o347n376k964j324j813l286l764l021k513l459n817q771j1321j2576
59016A341270j2268j1094j0148r882r828r338q512q167q744r328q413n848l348
$$ plain form
59003 1226352 1223841 1220815 1217329 1214067 1211361 1209255 1207642 1205834 1202806 1198453 1194007 1190626 1188141 1185692
58989 1185692 1183031 1180618 1178944 1178282 1178639 1179522 1180276 1180978 1182236 1183653 1183608 1181447 1179057 1179137 1182412 1187523
58973 1187523 1193052 1198445 1203406 1207798 1212259 1217909 1225298 1234378 1245331 1258464 1273329 1288980 1305302
58960 1305302 1323246 1343387 1364877 1385997 1405214 1421637 1435186 1446661 1457052 1466328 1473211 1476448
58948 1476448 1476085 1473224 1468818 1463161 1456615 1450439 1446359 1445171 1446120 1448023 1450698 1454746 1460217 1466316
58934 1466316 1472394 1478319 1483653 1487441 1489299 1489940 1490140 1489986 1489617 1489756 1490632 1491101 1489941 1487701 1486386 1487455
58918 1487455 1490709 1494946 1499124 1503214 1508472 1516705 1528781 1544019 1561107 1579048 1596984 1614017
58906 1614017 1629916 1645447 1661358 1677465 1693102 1707719 1720568 1730777 1738476 1744958 1750778 1754544
$$ packed form
59003A226352k511l026l486l262k706k106j613j808l028m353m446l381k485k449
58989A185692k661k413j674o62L57Q83P54P02J258J417m5k161k390Q0L275N111
58973A187523N529N393M961M392M461N650P389R080J0953J3133J4865J5651J6322
58960A305302J7944K0141K1490K1120J9217J6423J3549J1475J0391R276O883L237
58948A476448l63k861m406n657o546o176m080j188R49J903K675M048N471O099
58934A466316O078N925N334L788J858O41K00j54l69J39Q76M69j160k240j315J069
58918A487455L254M237M178M090N258Q233J2076J5238J7088J7941J7936J7033
58906A614017J5899J5531J5911J6107J5637J4617J2849J0209P699O482N820L766
$$ plain form
58894 1754544 1754471 1750300 1742644 1731403 1716275 1698174 1678743 1658767 1638365 1618213 1599138 1580728
58882 1580728 1561778 1542127 1522936 1505281 1489553 1476004 1464646 1454712 1445433 1437295 1431449 1428054
58870 1428054 1426324 1425930 1427077 1429323 1431714 1434064 1436847 1439828 1442113 1443528 1444583 1445063 1444144 1441960 1439559
58855 1439559 1437168 1434209 1431344 1430630 1432920 1436678 1440255 1443810 1448079 1452867 1458160 1465417 1476007 1489173
58841 1489173 1503230 1518440 1536893 1559278 1583163 1605260 1624790 1643976 1665421 1689533 1714647
58830 1714647 1739241 1763368 1787705 1812046 1835652 1858825 1883032 1909134 1936157 1962032 1984998
58819 1984998 2004167 2019486 2031536 2040879 2047299 2050113 2049294 2045692 2039914 2031628 2020413 2006894 1992610
58806 1992610 1978843 1965708 1952245 1937444 1921439 1905548 1890818 1876733 1861737 1844807 1826053
$$ packed form
58894A754544p3m171p656j1241j5128j8101j9431j9976k0402k0152j9075j8410
58882A580728j8950j9651j9191j7655j5728j3549j1358r934r279q138n846l395
58870A428054j730l94J147K246K391K350K783K981K285J415J055M80r19k184k401
58855A439559k391k959k865p14K290L758L577L555M269M788N293P257J0590J3166
58841A489173J4057J5210J8453K2385K3885K2097J9530J9186K1445K4112K5114
58830A714647K4594K4127K4337K4341K3606K3173K4207K6102K7023K5875K2966
58819A984998J9169J5319J2050R343O420K814q19l602n778q286j1215j3519j4284
58806A992610j3767j3135j3463j4801j6005j5891j4730j4085j4996j6930j8754
$$ plain form
58795 1826053 1806123 1785641 1764990 1743991 1722027 1699190 1677041 1657364 1640287 1624382 1608415
58784 1608415 1592217 1576143 1560708 1546590 1533901 1521497 1508017 1493613 1479552 1466128 1452129
58773 1452129 1436517 1419510 1401921 1384751 1369734 1358824 1352309 1348311 1344827 1341536 1339152 1337943
58761 1337943 1337601 1337946 1338995 1340637 1342707 1345182 1348216 1352204 1357635 1364265 1370658 1375311 1378136 1380012
58747 1380012 1381156 1381072 1380022 1379132 1378704 1377477 1373922 1367435 1358272 1347468 1336911 1328169 1320874 1313412
58733 1313412 1305392 1298008 1291722 1285349 1278194 1271479 1266555 1262935 1259283 1255306 1251597 1248592 1246806 1247222
58719 1247222 1250137 1254152 1257413 1259508 1261379 1263955 1267671 1272507 1277316 1279567 1277012 1269739 1259961 1249995
58705 1249995 1240974 1232976 1225355 1217024 1207248 1196502 1186265 1177915 1171923 1167960 1165564 1164713 1165584 1167570
$$ packed form
58795A826053j9930k0482k0651k0999k1964k2837k2149j9677j7077j5905j5967
58784A608415j6198j6074j5435j4118j2689j2404j3480j4404j4061j3424j3999
58773A452129j5612j7007j7589j7170j5017j0910o515l998l484l291k384j209
58761A337943l42L45J049J642K070K475L034L988N431O630O393M653K825J876
58747A380012J144q4j050q90m28j227l555o487r163j0804j0557q742p295p462
58733A313412q020p384o286o373p155o715m924l620l652l977l709l005j786M16
58719A247222K915M015L261K095J871K576L716M836M809K251k555p273r778r966
58705A249995r021p998p621q331r776j0746j0237q350n992l963k396q51Q71J986
$$ plain form
58691 1167570 1169062 1169005 1168457 1169627 1173345 1178398 1183323 1187678 1191486 1194847 1198570 1203834 1210554 1217298 1223588
58676 1223588 1230968 1240694 1251488 1260988 1268821 1276970 1287363 1300017 1313293 1325169 1334586 1342329 1350464
58663 1350464 1360360 1371454 1382280 1392234 1401785 1411411 1421026 1430320 1439304 1448628 1459346 1471911 1485365
58650 1485365 1498083 1509264 1518895 1526309 1529946 1528929 1523904 1515929 1505492 1492941 1478599 1461754
58638 1461754 1440652 1414517 1384946 1354611 1325242 1297361 1271048 1246145 1222378 1199962 1179450
58627 1179450 1160554 1142072 1123706 1107065 1093955 1084275 1076376 1068878 1061442 1054368 1048232 1043501 1039958
58614 1039958 1036899 1034111 1031976 1030324 1028184 1025305 1023121 1023518 1027163 1033389 1041028 1049054 1057161 1065959
58600 1065959 1075780 1085261 1092232 1096113 1098063 1098628 1096987 1093087 1088662 1085073 1081623 1077092 1071602 1065932
$$ packed form
58691A167570J492n7n48J170L718N053M925M355L808L361L723N264O720O744O290
58676A223588P380R726J0794R500P833Q149J0393J2654J3276J1876R417P743Q135
58663A350464R896J1094J0826R954R551R626R615R294Q984R324J0718J2565J3454
58650A485365J2718J1181R631P414L637j017n025p975j0437j2551j4342j6845
58638A461754k1102k6135k9571l0335k9369k7881k6313k4903k3767k2416k0512
58627A179450j8896j8482j8366j6641j3110r680p899p498p436p074o136m731l543
58614A039958l059k788k135j652k140k879k184L97L645O226P639Q026Q107Q798
58600A065959R821R481O971L881J950N65j641l900m425l589l450m531n490n670
$$ plain form
58586 1065932 1060228 1054502 1049134 1043865 1037521 1029881 1022594 1017103 1012862 1008786 1005202 1003119 1002585 1003026
58572 1003026 1004208 1005795 1006949 1007387 1007792 1008364 1008345 1007789 1008045 1009375 1009976 1008836 1007606 1007919 1008802 1008888 1009406
58555 1009406 1012467 1017832 1023965 1031031 1040097 1050220 1059205 1066736 1074114 1081290 1086789 1090412 1093440 1096153
58541 1096153 1097640 1098282 1100043 1103761 1108101 1111641 1114244 1116029 1116797 1117089 1118319 1121256 1125396 1130039 1135051
58526 1135051 1140658 1147559 1156903 1168955 1182154 1194850 1207539 1221879 1238005 1254647 1271595 1290061
58514 1290061 1310463 1331599 1352291 1372443 1392344 1412326 1433271 1456162 1481043 1507521 1536143
58503 1536143 1568099 1603805 1642905 1685115 1729616 1774155 1816531 1856645 1895391 1931747 1962877
58492 1962877 1986980 2004202 2014759 2018230 2015171 2007675 1997558 1985157 1970321 1953594 1936110 1919032
$$ packed form
58586A065932n704n726n368n269o344p640p287n491m241m076l584k083n34M41
58572A003026J182J587J154M38M05N72j9n56K56J330O01j140j230L13Q83Q6N18
58555A009406L061N365O133P066R066J0123Q985P531P378P176N499L623L028K713
58541A096153J487O42J761L718M340L540K603J785P68K92J230K937M140M643N012
58526A135051N607O901R344J2052J3199J2696J2689J4340J6126J6642J6948J8466
58514A290061K0402K1136K0692K0152J9901J9982K0945K2891K4881K6478K8622
58503A536143L1956L5706L9100M2210M4501M4539M2376M0114L8746L6356L1130
58492A962877K4103J7222J0557L471l059p496j0117j2401j4836j6727j7484j7078
$$ plain form
58480 1919032 1902961 1887092 1869305 1847980 1823180 1795254 1763554 1728055 1691077 1655292 1620784
58469 1620784 1586233 1552324 1521538 1494833 1470993 1449228 1430053 1413335 1397777 1382828 1369238
58458 1369238 1357349 1346657 1337337 1330310 1325441 1321466 1318033 1315890 1314590 1311913 1306445 1299326 1292756
58445 1292756 1287889 1284553 1281943 1279184 1276130 1273685 1272600 1272282 1271714 1270887 1270215 1269497 1268815 1269404 1271868 1274752
58429 1274752 1276986 1280393 1287110 1295676 1302992 1309533 1319098 1333383 1350280 1367989 1387283 1408773 1431162
58416 1431162 1453730 1477896 1504674 1532539 1559078 1582978 1603374 1619018 1629158 1633937 1633450 1627965
58404 1627965 1619290 1609993 1600877 1591022 1580544 1571312 1564731 1560944 1560409 1563993 1571136 1580163 1590747 1603782
58390 1603782 1618627 1633029 1646054 1658377 1669109 1675140 1674568 1668322 1657700 1642938 1625028 1606244
$$ packed form
58480A919032j6071j5869j7787k1325k4800k7926l1700l5499l6978l5785l4508
58469A620784l4551l3909l0786k6705k3840k1765j9175j6718j5558j4949j3590
58458A369238j1889j0692r320p027m869l975l433k143j300k677n468p119o570
58445A292756m867l336k610k759l054k445j085l18n68q27o72p18o82N89K464K884
58429A274752K234L407O717Q566P316O541R565J4285J6897J7709J9294K1490K2389
58416A431162K2568K4166K6778K7865K6539K3900K0396J5644J0140M779m87n485
58404A627965q675r297r116r855j0478r232o581l787n35L584P143R027J0584J3035
58390A603782J4845J4402J3025J2323J0732O031n72o246j0622j4762j7910j8784
$$ plain form
58378 1606244 1587704 1568740 1549582 1532258 1517928 1505772 1495385 1487732 1482854 1479289 1476820 1477186
58366 1477186 1480952 1486277 1491911 1498821 1507670 1517437 1527746 1539782 1553416 1565960 1575236 1581268 1583657
58353 1583657 1580309 1570740 1557962 1544979 1531681 1517142 1502618 1490059 1479463 1469651 1460015 1449995
58341 1449995 1438775 1427110 1417604 1411688 1408081 1405396 1404046 1404333 1405164 1406358 1409842 1416697 1425030 1432446
58327 1432446 1438695 1444344 1448964 1452322 1455468 1459148 1463033 1467691 1474973 1485028 1495264 1503809 1511838
58314 1511838 1521137 1531740 1543352 1556579 1571129 1585269 1598628 1613131 1629682 1646527 1662367
58303 1662367 1678419 1695832 1713857 1732154 1752008 1773622 1795212 1816482 1839690 1865293 1889828
58292 1889828 1910345 1927602 1942489 1952935 1957585 1959648 1963692 1970624 1978528 1986320 1994198 2002673 2013381
$$ packed form
58378A606244j8540j8964j9158j7324j4330j2156j0387p653m878l565k469L66
58366A477186L766N325N634O910Q849R767J0309J2036J3634J2544R276O032K389
58353A583657l348r569j2778j2983j3298j4539j4524j2559j0596r812r636j0020
58341A449995j1220j1665r506n916l607k685j350K87Q31J194L484O855Q333P416
58327A432446O249N649M620L358L146L680L885M658P282J0055J0236Q545Q029
58314A511838R299J0603J1612J3227J4550J4140J3359J4503J6551J6845J5840
58303A662367J6052J7413J8025J8297J9854K1614K1590K1270K3208K5603K4535
58292A889828K0517J7257J4887J0446M650K063M044O932P904P792P878Q475J0708
$$ plain form
58279 2013381 2028548 2047762 2067793 2087228 2108128 2131451 2154752 2176814 2200535 2228137 2257282
58268 2257282 2285283 2313430 2343419 2372894 2398618 2421182 2442575 2461807 2477037 2489803 2503201
58257 2503201 2517715 2532135 2546445 2560707 2573501 2584769 2597821 2615318 2635701 2656656 2679412
58246 2679412 2706283 2736612 2768576 2802467 2838962 2876697 2914650 2954175 2995647 3036217 3074175
58235 3074175 3112433 3154298 3198935 3244315 3291294 3341222 3392833 3445007 3499304 3556461 3614133
58224 3614133 3671589 3732636 3800128 3871713 3944756 4020859 4101338 4182957 4262995 4344133 4429464
58213 4429464 4517226 4605434 4697102 4795505 4898892 5005382 5118548 5242389 5375126 5513629
58203 5513629 5659466 5814930 5977800 6145853 6321719 6507581 6700549 6899379 7109811
$$ packed form
58279B013381J5167J9214K0031J9435K0900K3323K3301K2062K3721K7602K9145
58268B257282K8001K8147K9989K9475K5724K2564K1393J9232J5230J2766J3398
58257B503201J4514J4420J4310J4262J2794J1268J3052J7497K0383K0955K2756
58246B679412K6871L0329L1964L3891L6495L7735L7953L9525M1472M0570L7958
58235C074175L8258M1865M4637M5380M6979M9928N1611N2174N4297N7157N7672
58224C614133N7456O1047O7492P1585P3043P6103Q0479Q1619Q0038Q1138Q5331
58213D429464Q7762Q8208R1668R8403J03387J06490J13166J23841J32737J38503
58203E513629J45837J55464J62870J68053J75866J85862J92968J98830K10432
$$ plain form
58194 7109811 7336377 7574812 7819874 8074647 8344327 8626885 8918353 9221674 9541818
58185 9541818 9877863 10228611 10600011 10997790 11418547 11857448 12318616 12808312 13324635
58176 13324635 13864638 14435151 15045163 15693377 16374336 17090596 17847808 18645184 19483219
58167 19483219 20373766 21329622 22351372 23437321 24597841 25845484 27179963 28599160
58159 28599160 30116694 31751801 33510471 35394269 37418683 39603527 41954105 44472160
58151 44472160 47176878 50095440 53244947 56647982 60355973 64433588 68933883 73917953
58143 73917953 79487283 85766916 92869736 100907653 110019711 120354134 132047726 145268440
58135 145268440 160247392 177200044 196224869 217335754 240584172 266142516 294409466
$$ packed form
58194G109811K26566K38435K45062K54773K69680K82558K91468L03321L20144
58185I541818L36045L50748L71400L97779M20757M38901M61168M89696N16323
58176A3324635N40003N70513O10012O48214O80959P16260P57212P97376Q38035
58167A9483219Q90547R55856J021750J085949J160520J247643J334479J419197
58159B8599160J517534J635107J758670J883798K024414K184844K350578K518055
58151D4472160K704718K918562L149507L403035L707991M077615M500295M984070
58143G3917953N569330O279633P102820Q037917R112058J0334423J1693592J3220714
58135A45268440J4978952J6952652J9024825K1110885K3248418K5558344K8266950
$$ plain form
58128 294409466 326145776 362171511 402152686 443107952 479284321 504249529 513890544
58121 513890544 508006251 489574443 462822843 431678895 399103736 366957667 336122597
58114 336122597 306856450 279221309 253310848 229236119 207061888 186802997 168429866
58107 168429866 151859455 136977882 123682305 111877727 101440507 92218810 84068885
58100 84068885 76864925 70479282 64784603 59678753 55086702 50940608 47179867 43767284
58092 43767284 40681521 37891806 35356422 33042364 30927654 28986728 27192301 25530852
58084 25530852 23999773 22590229 21287444 20084789 18981111 17965371 17019095 16133243
58076 16133243 15308811 14542253 13824023 13150116 12521386 11932311 11373517 10844616 10351976
$$ packed form
58128B94409466L1736310L6025735L9981175M0955266L6176369K4965208R641015
58121E13890544n884293j8431808k6751600l1143948l2575159l2146069l0835070
58114C36122597k9266147k7635141k5910461k4074729k2174231k0258891j8373131
58107A68429866j6570411j4881573j3295577j1804578j0437220r221697q149925
58100H4068885p203960o385643n694679n105850m592051m146094l760741l412583
58092D3767284l085763k789715k535384k314058k114710j940926j794427j661449
58084B5530852j531079j409544j302785j202655j103678j015740r46276q85852
58076A6133243q24432p66558p18230o73907o28730n89075n58794n28901m92640
$$ plain form
58067 10351976 9894363 9462753 9053287 8668243 8304870 7955636 7619718 7302761 7004806
58058 7004806 6719393 6444909 6186068 5943474 5711986 5490187 5281539 5085100 4894520
58049 4894520 4707447 4527428 4355809 4190155 4031034 3881791 3740999 3603449 3469117
58040 3469117 3342786 3224360 3108225 2993404 2885989 2789711 2701632 2618905 2542668 2473342
58030 2473342 2408488 2347176 2290975 2239663 2191283 2146664 2108081 2073407 2037538 1999687 1963282
58019 1963282 1928879 1893490 1856940 1822370 1790067 1757081 1723249 1691413 1661500 1630747 1600036
58008 1600036 1573458 1551100 1528834 1505912 1486115 1470410 1455106 1438609 1423506 1410284 1395238
57997 1395238 1376659 1357422 1339361 1320344 1298915 1276896 1255594 1234080 1212783 1194168 1178376
$$ packed form
58067A0351976m57613m31610m09466l85044l63373l49234l35918l16957k97955
58058G004806k85413k74484k58841k42594k31488k21799k08648j96439j90580
58049D894520j87073j80019j71619j65654j59121j49243j40792j37550j34332
58040C469117j26331j18426j16135j14821j07415r6278q8079q2727p6237o9326
58030B473342o4854o1312n6201n1312m8380m4619l8583l4674l5869l7851l6405
58019A963282l4403l5389l6550l4570l2303l2986l3832l1836k9913l0753l0711
58008A600036k6578k2358k2266k2922j9797j5705j5304j6497j5103j3222j5046
57997A395238j8579j9237j8061j9017k1429k2019k1302k1514k1297j8615j5792
$$ plain form
57986 1178376 1162572 1145799 1130064 1115814 1101124 1086288 1074319 1065735 1057662 1049086 1041990 1036153
57974 1036153 1028069 1016678 1005171 995352 985076 973202 962360 954533 947846 939689 929351 916245
57962 916245 899690 881963 867527 857640 849505 841724 836152 833182 829919 824907 820151 816580 811900
57949 811900 805034 798487 794061 790287 786221 783692 783365 782507 779308 775891 774502 774080 773054 772317 772920
57934 772920 773729 773710 773816 774571 774584 773375 772847 774115 775719 776641 777950 779814 780251 778898 778614 780979 783270
57917 783270 782438 779250 776098 773454 771076 770124 771285 772715 772218 769813 766523 762712 759248 757904 758736
57902 758736 759227 757719 755402 753467 750972 747358 744265 742696 740900 737296 733100 729754 726156 720927
57888 720927 715375 711644 709633 708044 706874 706663 706780 706543 706659 707776 709073 709965 711614 715089 719592
$$ packed form
57986A178376j5804j6773j5735j4250j4690j4836j1969q584q073q576p096n837
57974A036153q084j1391j1507r819j0276j1874j0842p827o687q157j0338j3106
57962I16245j6555j7727j4436r887q135p781n572k970l263n012m756l571m680
57949H11900o866o547m426l774m066k529l27q58l199l417j389m22j026p37O03
57934G72920Q09j9J06P55J3j209n28J268J604R22J309J864M37j353k84K365K291
57917G83270q32l188l152k644k378r52J161J430m97k405l290l811l464j344Q32
57902G58736M91j508k317j935k495l614l093j569j796l604m196l346l598n229
57888G20927n552l731k011j589j170k11J17k37J16J117J297Q92J649L475M503
$$ plain form
57873 719592 724076 728948 734627 740201 745056 749977 755007 758159 758085 756107 753753 750199 744210 736797 729642
57858 729642 722347 713552 703547 693681 684269 675062 666783 660226 654711 649136 643759 639335 635466 631468
57844 631468 628063 626585 627030 628189 629145 629552 629100 627846 626480 625508 624736 624073 623992 624782 626345 628988 633123
57827 633123 637928 641845 644807 648293 652740 656764 659541 662080 665319 668801 672117 675832 680027 683644
57813 683644 686178 688438 690993 693589 696699 701504 707538 712460 715057 716456 717536 717486 715970 714362 713569
57798 713569 712845 711998 712330 713943 714583 712988 711234 711813 714250 716485 717780 718375 717922 716318 714820 714559
57782 714559 714939 714712 713392 710601 705750 699608 694457 691448 689410 687399 686382 687147 688723 690487 693703
57767 693703 699046 704501 707791 709414 711341 714053 716621 718529 719807 720453 720911 721914 722856 721901 718639
$$ packed form
57873G19592M484M872N679N574M855M921N030L152p4j978k354l554n989p413p155
57858G29642p295q795j0005r866r412r207q279o557n515n575n377m424l869l998
57844F31468l405j478M45J159R56M07m52j254j366r72p72o63q1P90J563K643M135
57827F33123M805L917K962L486M447M024K777K539L239L482L316L715M195L617
57813F83644K534K260K555K596L110M805O034M922K597J399J080n0j516j608p93
57798G13569p24q47L32J613O40j595j754N79K437K235J295N95m53j604j498k61
57782G14559L80k27j320k791m851o142n151l009k038k011j017P65J576J764L216
57767F93703N343N455L290J623J927K712K568J908J278O46M58J003R42r55l262
$$ plain form
57752 718639 714847 711683 708181 703576 698683 693619 686653 677046 666727 657286 647576 636303 624805
57739 624805 615119 607238 600351 594886 591190 587950 583958 579794 576116 572292 568396 566245 566486 566977 566123
57724 566123 565312 565867 566302 565231 564303 565313 567088 568478 571753 579057 587698 593321 596319 600767 607971
57709 607971 615247 620581 624499 627492 629321 630982 633963 637213 637853 635318 632142 630387 629754 629475 629693
57694 629693 630582 632009 634284 637781 642005 646436 651602 657790 663696 668190 672373 677960 684778 691761
57680 691761 698978 706314 711741 713700 713941 715009 716094 714532 710420 706431 703723 701403 699488 698939 698948
57665 698948 697546 694957 693232 692511 690802 687499 683946 680290 675128 668839 664069 661936 660445 657564
57651 657564 653426 648741 643630 638999 636767 637454 639193 639884 638860 636214 632419 629043 628007 629586 632529
$$ packed form
57752G18639l792l164l502m605m893n064o966r607j0319r441r710j1273j1498
57739F24805r686p881o887n465l696l240l992m164l678l824l896k151K41M91q54
57724E66123q11N55M35j071r28J010J775J390L275P304Q641N623K998M448P204
57709F07971P276N334L918K993J829J661K981L250O40k535l176j755o33k79K18
57694F29693Q89J427K275L497M224M431N166O188N906M494M183N587O818O983
57680F91761P217P336N427J959K41J068J085j562m112l989k708k320j915n49R
57665F98948j402k589j725p21j709l303l553l656n162o289m770k133j491k881
57651F57564m138m685n111m631k232O87J739O91j024k646l795l376j036J579K943
$$ plain form
57636 632529 636113 640367 644510 647303 648977 650768 652515 652807 651557 650272 649696 649344 649431 650874 653147
57621 653147 654484 654627 655269 657464 660784 665417 672807 683560 696697 711549 728591 748064 769726
57608 769726 794368 823632 857733 894833 932596 968458 998380 1017756 1024250 1018241 1000618 972284
57596 972284 935849 895360 853768 812470 773352 738905 709952 685406 664626 647826 634020
57585 634020 621115 608750 598797 592466 588851 586658 585130 583035 579269 574981 572589 572149 571282 569275
57571 569275 568304 569587 571161 570917 569304 567468 565130 562014 559318 557924 556843 555041 553182 552105 551087
57556 551087 549136 546621 544274 541927 539463 537692 536942 536017 533762 530605 527510 524554 521477 518574 516104
57541 516104 513877 512022 510984 510166 507992 504063 499918 496899 494548 491750 488154 483920 479436 475791
$$ packed form
57636F32529L584M254M143K793J674J791J747K92j250j285n76l52Q7J443K273
57621F53147J337J43O42K195L320M633P390J0753J3137J4852J7042J9473K1662
57608G69726K4642K9264L4101L7100L7763L5862K9922J9376O494o009j7623k8334
57596I72284l6435m0489m1592m1298l9118l4447k8953k4546k0780j6800j3806
57585F34020j2905j2365r953o331l615k193j528k095l766m288k392m40q67k007
57571E69275r71J283J574k44j613j836k338l116k696j394j081j802j859j077j018
57556E51087j951k515k347k347k464j771p50r25k255l157l095k956l077k903k470
57541E16104k227j855j038q18k174l929m145l019k351k798l596m234m484l645
$$ plain form
57527 475791 474011 473246 471280 467355 462796 458463 453606 448041 443339 440731 439556 438879 438890 439517 439403 437584
57511 437584 434705 431391 426995 421354 416332 414012 414291 415405 415876 415040 412846 410307 409203 410316 412689
57496 412689 415218 417910 421105 424741 429021 434459 440642 446239 450783 454944 458613 460589 460926 461611 463800
57481 463800 466232 467681 469173 472187 476142 479278 480851 481020 479774 477507 475726 475603 476537 477387 478433
57466 478433 480858 484841 489195 492507 494019 493904 493276 493306 494122 495294 497318 501207 506583 511892 516941
57451 516941 523288 531239 538438 542806 545410 548893 554018 559089 562108 562480 561170 559907 559758 560173 560017
57436 560017 559374 559192 559363 558752 557178 555571 553985 551345 547537 543820 540841 538327 537092 538863 543258
57421 543258 547376 549556 551211 553704 555863 556384 556472 557931 560126 560854 559159 555669 551171 546298 541737
$$ packed form
57527D75791j780p65j966l925m559m333m857n565m702k608j175o77J1O27j14j819
57511D37584k879l314m396n641n022k320K79J114M71q36k194k539j104J113K373
57496D12689K529K692L195L636M280N438O183N597M544M161L669J976L37O85K189
57481D63800K432J449J492L014L955L136J573J69j246k267j781j23R34Q50J046
57466D78433K425L983M354L312J512j15o28L0Q16J172K024L889N376N309N049
57451E16941O347P951P199M368K604L483N125N071L019L72j310j263j49M15j56
57436E60017o43j82J71o11j574j607j586k640l808l717k979k514j235J771M395
57421E43258M118K180J655K493K159N21Q8J459K195P28j695l490m498m873m561
$$ plain form
57406 541737 537568 533267 529057 525966 523862 521109 517111 513523 511893 511810 512523 514526 518127 522038 524910
57391 524910 527034 529335 532021 535271 539740 545320 550921 556439 563200 571457 579271 585002 589131 592616
57377 592616 595538 598494 603020 609054 614158 616923 619136 622942 627930 632745 637466 642469 646924 650431
57363 650431 654338 659610 665254 670516 676380 682938 687787 689581 690970 695285 702290 709923 718170 727971
57349 727971 737973 745946 752518 760314 770036 780179 789856 799054 806778 811886 815622 820816 828617 837930
57335 837930 847535 856792 864995 872353 881008 892758 906146 917963 927333 936341 946964 959249 972218
57322 972218 984845 996402 1007231 1018734 1031587 1044961 1058536 1073642 1090864 1108291 1124130
57311 1124130 1139309 1155278 1170995 1184807 1197790 1212287 1228267 1244028 1259554 1276133 1293345
$$ packed form
57406E41737m169m301m210l091k104k753l998l588j630q3P13K003L601L911K872
57391E24910K124K301K686L250M469N580N601N518O761Q257P814N731M129L485
57377E92616K922K956M526O034N104K765K213L806M988M815M721N003M455L507
57363F50431L907N272N644N262N864O558M849J794J389M315P005P633Q247R801
57349G27971J0002P973O572P796R722J0143R677R198P724N108L736N194P801R313
57335H37930R605R257Q203P358Q655J1750J3388J1817R370R008J0623J2285J2969
57322I72218J2627J1557J0829J1503J2853J3374J3575J5106J7222J7427J5839
57311A124130J5179J5969J5717J3812J2983J4497J5980J5761J5526J6579J7212
$$ plain form
57300 1293345 1309396 1324124 1339067 1355123 1372577 1392600 1415722 1439347 1459998 1477975 1496952
57289 1496952 1519011 1542977 1567708 1593844 1621516 1649003 1674805 1699214 1723067 1746583 1769980
57278 1769980 1793747 1817806 1841546 1864797 1887608 1909257 1928843 1946775 1964531 1983184 2003038
57267 2003038 2023968 2044935 2064076 2080704 2096461 2113276 2131171 2149400 2168314 2188406 2208795
57256 2208795 2228514 2248134 2268449 2289021 2309907 2333011 2359339 2386573 2412120 2437222 2465223
57245 2465223 2497044 2531152 2566640 2603130 2638858 2672423 2705710 2741495 2778705 2813668 2845832
57234 2845832 2878481 2913404 2948428 2981059 3011581 3041510 3071490 3101790 3132915 3164853 3197026
57223 3197026 3229163 3260926 3291151 3319249 3346821 3375951 3406436 3436732 3467009 3499023 3533525
$$ packed form
57300A293345J6051J4728J4943J6056J7454K0023K3122K3625K0651J7977J8977
57289A496952K2059K3966K4731K6136K7672K7487K5802K4409K3853K3516K3397
57278A769980K3767K4059K3740K3251K2811K1649J9586J7932J7756J8653J9854
57267B003038K0930K0967J9141J6628J5757J6815J7895J8229J8914K0092K0389
57256B208795J9719J9620K0315K0572K0886K3104K6328K7234K5547K5102K8001
57245B465223L1821L4108L5488L6490L5728L3565L3287L5785L7210L4963L2164
57234B845832L2649L4923L5024L2631L0522K9929K9980L0300L1125L1938L2173
57223C197026L2137L1763L0225K8098K7572K9130L0485L0296L0277L2014L4502
$$ plain form
57212 3533525 3570165 3609545 3653071 3700895 3751915 3805348 3860532 3915981 3970645 4025227 4080413
57201 4080413 4135051 4188148 4240919 4294227 4345633 4392137 4434496 4475668 4516148 4554203 4589638
57190 4589638 4623912 4657482 4690351 4724157 4760236 4796715 4831302 4865956 4904869 4948762 4995386
57179 4995386 5044907 5100256 5162359 5229288 5300037 5374809 5451576 5526718 5599572 5672421 5745783
57168 5745783 5817625 5887304 5956031 6023196 6086518 6146439 6206168 6266662 6325557 6381785 6437278
57157 6437278 6493360 6549398 6605919 6665218 6727812 6791760 6856192 6922125 6989359 7056129 7122238
57146 7122238 7188863 7255074 7318588 7380247 7443536 7509126 7574204 7637841 7702682 7770503 7840351
57135 7840351 7911934 7986444 8062938 8138187 8211243 8284007 8356222 8424113 8485178 8540244 8589766
$$ packed form
57212C533525L6640L9380M3526M7824N1020N3433N5184N5449N4664N4582N5186
57201D080413N4638N3097N2771N3308N1406M6504M2359M1172M0480L8055L5435
57190D589638L4274L3570L2869L3806L6079L6479L4587L4654L8913M3893M6624
57179D995386M9521N5349O2103O6929P0749P4772P6767P5142P2854P2849P3362
57168E745783P1842O9679O8727O7165O3322N9921N9729O0494N8895N6228N5493
57157F437278N6082N6038N6521N9299O2594O3948O4432O5933O7234O6770O6109
57146G122238O6625O6211O3514O1659O3289O5590O5078O3637O4841O7821O9848
57135G840351P1583P4510P6494P5249P3056P2764P2215O7891O1065N5066M9522
$$ plain form
57124 8589766 8632394 8668348 8699862 8726958 8746962 8759510 8767898 8774165 8776956 8775517 8771580 8765733
57112 8765733 8755767 8739845 8717675 8687854 8648139 8599149 8543744 8482354 8413564 8339818 8267537
57101 8267537 8200707 8139142 8083541 8036572 7997529 7961325 7924645 7888714 7855025 7823309 7794748
57090 7794748 7771991 7754626 7739159 7723949 7709222 7692235 7668209 7636241 7598330 7552817 7495523
57079 7495523 7427253 7352556 7270473 7174261 7061117 6934331 6795103 6640741 6472136 6293927
57069 6293927 6105219 5898580 5669925 5420470 5147433 4842533 4501976 4128160 3719237
57060 3719237 3266833 2766076 2216957 1612909 938990 183968 -657186 -1595217 -2648149
57051 -2648149 -3828132 -5140401 -6599529 -8233457 -10068180 -12123751 -14429924 -17029853
$$ packed form
57124H589766M2628L5954L1514K7096K0004J2548Q388O267K791j439l937n847
57112H765733r966j5922k2170k9821l9715m8990n5405o1390o8790p3746p2281
57101H267537o6830o1565n5601m6969l9043l6204l6680l5931l3689l1716k8561
57090G794748k2757j7365j5467j5210j4727j6987k4026l1968l7911m5513n7294
57079G495523o8270p4697q2083r6212j13144j26786j39228j54362j68605j78209
57069F293927j88708k06639k28655k49455k73037l04900l40557l73816m08923
57060C719237m52404n00757n49119o04048o73919A83968f57186r38031j052932
57051b648149j179983j312269j459128j633928j834723k055571k306173k599929
$$ plain form
57043 -17029853 -19963099 -23261425 -26966755 -31136757 -35830070 -41109465 -47069164 -53839958
57035 -53839958 -61559837 -70355800 -80347116 -91625626 -104218808 -118096386 -133198303
57028 -133198303 -149391517 -166407954 -183958327 -202000614 -220790798 -240468051 -260507981
57021 -260507981 -279624448 -296219369 -308927109 -316885511 -319802289 -317965959 -312111329
57014 -312111329 -303073354 -291480111 -277772537 -262446776 -246157825 -229559541 -213101270
57007 -213101270 -196990427 -181288287 -166010864 -151190229 -136903524 -123261332 -110367977
57000 -110367977 -98301581 -87126180 -76895333 -67631738 -59318345 -51916429 -45378604
56993 -45378604 -39641329 -34624455 -30249970 -26452205 -23166376 -20321343 -17851025 -15702825
$$ packed form
57043a7029853k933246l298326l705330m170002m693313n279395n959699o770794
57035e3839958p719879q795963r991316j1278510j2593182j3877578j5101917
57028a33198303j6193214j7016437j7550373j8042287j8790184j9677253k0039930
57021b60507981j9116467j6594921j2707740p958402k916778J836330N854630
57014c12111329R037975J1593243J3707574J5325761J6288951J6598284J6458271
57007b13101270J6110843J5702140J5277423J4820635J4286705J3642192J2893355
57000a10367977J2066396J1175401J0230847R263595Q313393P401916O537825
56993d5378604N737275N016874M374485L797765L285829K845033K470318K148200
$$ plain form
56985 -15702825 -13830351 -12189064 -10744598 -9475295 -8360860 -7376492 -6501356 -5723184
56977 -5723184 -5030005 -4405864 -3838912 -3325657 -2863079 -2443623 -2061042 -1713420 -1396693
56968 -1396693 -1101859 -821547 -552733 -290926 -29189 234401 495668 752756 1007021 1251450
56958 1251450 1466288 1632011 1741867 1798970 1808506 1777973 1718884 1641691 1551443 1451319 1345892
56947 1345892 1237509 1124032 1004132 881085 758042 633428 504371 370960 233923
56938 233923 91951 -54908 -202338 -345532 -483226 -615001 -737542 -846860 -941930 -1023297
56928 -1023297 -1090286 -1142235 -1180442 -1206445 -1220204 -1222099 -1214983 -1202375 -1186328 -1168564 -1151585 -1136906
56916 -1136906 -1123916 -1111785 -1100681 -1090114 -1078411 -1065171 -1051996 -1039406 -1025122 -1006897 -985078
$$ packed form
56985a5702825J872474J641287J444466J269303J114435R84368Q75136P78172
56977e723184O93179O24141N66952N13255M62578M19456L82581L47622L16727
56968a396693K94834K80312K68814K61807b9189B34401K61267K57088K54265K44429
56958A251450K14838J65723J09856N7103R536l0533n9089p7193r0248j00124j05427
56947A345892j08383j13477j19900j23047j23043j24614j29057j33411j37037
56938B33923I1951e4908j47430j43194j37694j31775j22541j09318r5070q1367
56928a023297o6989n1949l8207k6003j3759j895P116J2608J6047J7764J6979J4679
56916a136906J2990J2131J1104J0567J1703J3240J3175J2590J4284J8225K1819
$$ plain form
56905 -985078 -961018 -934944 -906735 -877030 -846145 -813397 -778541 -742347 -705023 -665870 -625585
56894 -625585 -587362 -554771 -529641 -512220 -501754 -496562 -495094 -497066 -502107 -507830 -511457 -513032 -514447
56881 -514447 -515436 -513451 -507613 -499680 -490447 -478143 -461360 -440939 -417946 -392145 -363388 -332544 -300634
56868 -300634 -269449 -243313 -227276 -222614 -226471 -236287 -251465 -270027 -287380 -300439 -310373 -319488
56856 -319488 -327785 -334318 -339567 -344334 -348052 -350012 -350795 -351005 -349953 -346884 -342112 -335953 -328152 -319422 -311801
56841 -311801 -306267 -301437 -295702 -289129 -282315 -274998 -266983 -259004 -251597 -244383 -237280 -231008 -225472 -218915
56827 -218915 -209484 -196668 -181067 -164372 -149822 -140685 -137475 -138131 -141136 -146581 -153798 -160378 -164436
56814 -164436 -165886 -164637 -159626 -150728 -139706 -128120 -115784 -102036 -86710 -69072 -47661 -22030
$$ packed form
56905i85078K4060K6074K8209K9705L0885L2748L4856L6194L7324L9153M0285
56894f25585L8223L2591K5130J7421J0466N192J468j972n041n723l627j575j415
56881e14447r89J985N838P933R233J2304J6783K0421K2993K5801K8757L0844L1910
56868c00634L1185K6136J6037M662l857r816j5178j8562j7353j3059r934r115
56856c19488q297o533n249m767l718j960p83k10J052L069M772O159P801Q730P621
56841c11801N534M830N735O573O814P317Q015P979P407P214P103O272N536O557
56827b18915R431J2816J5601J6695J4550R137L210o56l005n445p217o580m058
56814a64436j450J249N011Q898J1022J1586J2336J3748J5326J7638K1411b2030
$$ plain form
56801 7145 40324 79111 122934 167545 207819 240232 262189 271819 270159 261351 248936 233668
56789 233668 216156 199247 185860 176385 170097 167453 169174 174877 184660 200471 223801 253401 287229
56776 287229 325347 368870 417361 469301 523533 577370 624114 655568 667660 662157 643319 614839
56764 614839 579829 541367 502022 463790 428723 398719 374618 356414 344169 337859 336615 339461
56752 339461 346801 359924 378666 400748 424241 449927 479817 512843 542701 561036 563116 550149
56740 550149 526490 496015 461586 425952 391000 356768 323183 292433 267729 249831 236735
56729 236735 226745 219805 215747 213686 213931 218365 227873 241130 256766 274808 294793 314091 329407
56716 329407 338685 340643 334182 319749 300087 278306 256081 234462 214837 197647 181385 164437
$$ packed form
56801G145L3179L8787M3823M4611M0274L2413K1957R630j660q808j2415j5268
56789B33668j7512j6909j3387r475o288k644J721N703R783J5811K3330K9600L3828
56776B87229L8118M3523M8491N1940N4232N3837M6744L1454J2092n503j8838k8480
56764F14839l5010l8462l9345l8232l5067l0004k4101j8204j2245o310j244K846
56752C39461P340J3123J8742K2082K3493K5686K9890L3026K9858J8335K080j2967
56740E50149k3659l0475l4429l5634l4952l4232l3585l0750k4704j7898j3096
56729B36735r990o940m058k061K45M434R508J3257J5636J8042J9985J9298J5316
56716C29407R278J958o461j4433j9662k1781k2225k1619j9625j7190j6262j6948
$$ plain form
56704 164437 147242 131609 118797 109141 102281 96515 89099 78778 67344 57525 50021 43721 37878
56691 37878 32629 27969 23620 19762 16785 14423 11853 8447 4077 -773 -4905 -7274 -8424 -10143 -13106
56676 -13106 -15874 -16942 -16695 -16474 -16651 -16633 -16023 -14798 -12892 -10385 -7680 -4968 -2011 1354 5208 9964
56660 9964 15666 20791 23413 23943 24992 27842 30869 32400 33130 34219 34754 32986 29008 24432 20331
56645 20331 17137 15764 17043 20454 24725 29261 33869 37856 40778 43470 46944 50708 53433 54811
56631 54811 55636 56594 58173 61186 65951 71321 75852 79705 84145 89316 93727 96031 96399 96115 96413 97606
56615 97606 98810 98836 97717 96861 97374 99108 101762 105585 110017 113073 113643 113479 115114 118453 121213 122344
56599 122344 123083 124547 126195 127203 127901 129078 130946 133392 136406 139490 141288 140534 137199 132384 127314
$$ packed form
56704A64437j7195j5633j2812r656o860n766p416j0321j1434r819p504o300n843
56691C7878n249m660m349l858k977k362k570l406D077g73m132k369j150j719k963
56676a3106k768j068K47K21j77J8O10J225J906K507K705K712b011A354L854M756
56660I964N702N125K622N30J049K850L027J531P30J089N35j768l978m576m101
56645B0331l194j373J279L411M271M536M608L987K922K692L474L764K725J378
56631E4811Q25R58J579L013M765N370M531L853M440N171M411K304L68k84K98J193
56615I7606J204K6j119q56N13J734K654L823M432L056N70j64J635L339K760J131
56599A22344P39J464J648J008O98J177J868K446L014L084J798p54l335m815n070
$$ plain form
56584 127314 122687 118679 115188 112024 109004 105958 102746 99335 95881 92821 90940 91048 93273 96812
56570 96812 100743 104811 109055 113037 116153 118466 120481 122346 124066 126147 128825 130855 130455 127611 124162
56555 124162 121398 118961 116456 114593 113907 113623 112660 110858 108483 105468 101940 98614 95917 93473 91060
56540 91060 89259 88564 88712 89531 91551 95028 99121 102721 105478 107569 109155 110520 111945 113127 113571
56525 113571 113800 115065 117624 120655 124150 129244 135858 141775 145337 147680 150874 154930 158281 160496
56511 160496 162949 166994 172645 178965 184931 190036 194667 199799 206089 213587 222281 232268 243379 255473
56497 255473 268959 283908 298769 311391 321341 329588 335950 339039 339245 339394 341305 343719 344894 345194
56483 345194 345499 345012 342716 339554 337015 334564 330620 325407 320838 317747 314825 310327 303906 296987 291921
$$ packed form
56584A27314m627m008l491l164l020l046l212l411l454l060j881J08K225L539
56570I6812L931M068M244L982L116K313K015J865J720K081K678K030m00k844l449
56555A24162k764k437k505j863o86k84r63j802k375l015l528l326k697k444k413
56540I1060j801o95J48Q19K020L477M093L600K757K091J586J365J425J182M44
56525A13571K29J265K559L031L495N094O614N917L562K343L194M056L351K215
56511A60496K453M045N651O320N966N105M631N132O290P498Q694R987J1111J2094
56497B55473J3486J4949J4861J2622R950Q247O362L089K06J49J911K414J175L00
56483C45194L05m87k296l162k539k451l944n213m569l091k922m498o421o919n066
$$ plain form
56468 291921 290060 289962 288399 283862 278011 272978 268644 263656 257688 251311 244802 238559 233631 230350 227311
56453 227311 223106 218260 214201 211263 209057 207712 207169 205995 202550 196996 191150 186785 184745 184752 185288
56438 185288 184872 184268 185982 190639 195608 198557 200459 203328 206727 208680 208743 207939 206857 205883 206253 208634
56422 208634 211505 213084 213980 215804 218084 218963 218405 218289 219587 221498 223160 224270 224349 223329 222629 223884
56406 223884 226796 229737 231986 233757 234739 234458 233534 232810 231834 229990 228319 228236 229223 229927 230848 233531 237670
56389 237670 241494 244699 248442 252536 255202 255789 255517 255324 255143 255385 256893 259011 259783 258501 256365 254411
56373 254411 252690 251707 252677 255769 259597 262697 264218 263400 260248 256708 255250 256054 257246 257857 258677 260201
56357 260201 261753 262888 263819 264300 263981 263981 266085 270173 274405 278176 282668 288105 292736 295337 296680 297644
$$ packed form
56468B91921j861r8j563m537n851n033m334m988n968o377o509o243m928l281l039
56453B27311m205m846m059k938k206j345n43j174l445n554n846m365k040PN36
56438A85288m16o04J714M657M969K949J902K869L399J953O3q04j082r74L70K381
56422B08634K871J579Q96J824K280Q79n58j16J298J911J662J110P9j020p00J255
56406B23884K912K941K249J771R82k81r24p24r76j844j671q3R87P04R21K683M139
56389B37670L824L205L743M094K666N87k72j93j81K42J508K118P72j282k136j954
56373B54411j721r83R70L092L828L100J521q18l152l540j458Q04J192O11Q20J524
56357B60201J552J135R31M81l19%K104M088M232L771M492N437M631K601J343R64
$$ plain form
56341 297644 297766 296693 295409 294936 295105 295523 296584 298739 301852 305843 310950 316844 322492 327244 331127
56326 331127 333953 335333 335656 335842 336107 336281 337194 340005 343890 346161 345287 342480 339819 338065 336804 335541
56310 335541 334173 333237 333820 336328 339531 341970 344033 347266 351917 356661 360617 364058 367347 370703 374644
56295 374644 378850 381043 379292 375439 373825 376217 380166 382864 384377 386301 389307 393075 397020 400139
56281 400139 401531 401827 402833 405282 408328 411531 415659 421028 426732 432210 438035 444500 450943 457122
56267 457122 463826 471452 479311 486856 494228 501151 506833 511559 516850 523293 529450 533563 535257 535261 534859
56252 534859 535917 539732 545132 549169 550512 550914 552715 556209 560294 564493 569347 575494 583103 591785
56238 591785 600855 610107 620184 631496 643222 654360 665327 677359 690713 704730 719139 733898
$$ packed form
56341B97644J22j073j284m73J69M18J061K155L113L991N107N894N648M752L883
56326C31127K826J380L23J86K65J74R13K811L885K271q74k807k661j754j261j263
56310C35541j368r36N83K508L203K439K063L233M651M744L956L441L289L356L941
56295C74644M206K193j751l853j614K392L949K698J513J924L006L768L945L119
56281D00139J392K96J006K449L046L203M128N369N704N478N825O465O443O179
56267D57122O704P626P859P545P372O923N682M726N291O443O157M113J694Mm02
56252E34859J058L815N400M037J343M02J801L494M085M199M854O147P609Q682
56238E91785R070R252J0077J1312J1726J1138J0967J2032J3354J4017J4409J4759
$$ plain form
56226 733898 748331 762018 776042 791813 809284 827898 848208 870360 892081 911048 928718
56215 928718 948870 972615 997888 1023826 1052163 1083683 1116589 1149600 1183928 1220987 1260542
56204 1260542 1302311 1347171 1395687 1447524 1503323 1565050 1633393 1706772 1784038 1866476 1956261
56193 1956261 2054564 2161877 2278622 2404960 2541538 2690362 2852912 3027461 3210681 3401764
56183 3401764 3602103 3810721 4023362 4236712 4449985 4660961 4863702 5052123 5223227
56174 5223227 5375146 5504434 5607090 5680043 5720104 5723853 5690618 5623991 5529049 5409776 5269944
56163 5269944 5113813 4944310 4762660 4571417 4375698 4179938 3985615 3793781 3607460
56154 3607460 3429500 3259876 3097217 2941589 2794259 2656146 2527798 2409261 2298815
$$ packed form
56226G33898J4433J3687J4024J5771J7471J8614K0310K2152K1721J8967J7670
56215I28718K0152K3745K5273K5938K8337L1520L2906L3011L4328L7059L9555
56204A260542M1769M4860M8516N1837N5799O1727O8343P3379P7266Q2438Q9785
56193A956261R8303J07313J16745J26338J36578J48824J62550J74549J83220J91083
56183C401764K00339K08618K12641K13350K13273K10976K02741J88421J71104
56174E223227J51919J29288J02656P2953M0061L749l3235o6627r4942j19273j39832
56163E269944j56131j69503j81650j91243j95719j95760j94323j91834j86321
56154C607460j77960j69624j62659j55628j47330j38113j28348j18537j10446
$$ plain form
56145 2298815 2193710 2093390 2000066 1914958 1836221 1762036 1693473 1632297 1577794 1527637 1480439
56134 1480439 1435843 1393565 1353851 1317565 1284687 1254149 1225948 1201559 1181356 1163677 1147488
56123 1147488 1133754 1122951 1113455 1103899 1095158 1088638 1084341 1081652 1080021 1078020 1074146 1069507 1067246
56110 1067246 1068277 1070267 1071842 1074618 1079533 1084438 1087509 1090252 1094952 1101687 1109951 1120632 1134156
56097 1134156 1149036 1164433 1181793 1201906 1222911 1243511 1265695 1291852 1321369 1352559 1385870
56086 1385870 1422820 1463661 1508386 1558154 1613584 1673441 1736929 1805406 1880173 1960810 2047402
56075 2047402 2141763 2244112 2350656 2456539 2559193 2657110 2747933 2830036 2904050 2971072
56065 2971072 3031430 3086249 3137105 3182443 3217509 3239709 3250940 3253040 3244843 3226162 3200573 3170934
$$ packed form
56145B298815j05105j00320r3324q5108p8737p4185o8563o1176n4503n0157m7198
56134A480439m4596m2278l9714l6286l2878l0538k8201k4389k0203j7679j6189
56123A147488j3734j0803r496r556q741o520m297k689j631k001l874m639k261
56110A067246J031J990J575K776M915M905L071K743M700O735Q264J0681J3524
56097A134156J4880J5397J7360K0113K1005K0600K2184K6157K9517L1190L3311
56086A385870L6950M0841M4725M9768N5430N9857O3488O8477P4767Q0637Q6592
56075B047402R4361J02349J06544J05883J02654R7917R0823Q2103P4014O7022
56065B971072O0358N4819N0856M5338L5066K2200J1231K100q197j8681k5589k9639
$$ plain form
56053 3170934 3135275 3089998 3033925 2966603 2886614 2795303 2698974 2603723 2510873 2420377 2334957
56042 2334957 2257041 2185091 2117246 2055751 2003767 1960630 1924217 1895049 1873854 1857903 1844149
56031 1844149 1833509 1827806 1825185 1823031 1822812 1827268 1834939 1842215 1848966 1857618 1868362 1879600 1891516
56018 1891516 1905009 1918659 1930717 1942616 1956935 1973668 1991847 2012457 2036105 2060388 2083545
56007 2083545 2108178 2137303 2169337 2201134 2233274 2267903 2304070 2339922 2377022 2417715 2460574
55996 2460574 2503029 2546039 2591350 2636633 2678454 2717996 2759029 2802288 2846430 2892163 2940767
55985 2940767 2990876 3041415 3095166 3154772 3217879 3280971 3345160 3413353 3484744 3557034 3630925
55974 3630925 3707467 3784469 3860829 3940662 4027626 4119077 4211605 4308093 4412888 4524304 4638874
$$ packed form
56053C170934l5659m5277n6073o7322p9989r1311r6329r5251r2850r0496q5420
56042B334957p7916p1950o7845o1495n1984m3137l6413k9168k1195j5951j3754
56031A844149j0640n703k621k154k19M456P671P276O751Q652J0744J1238J1916
56018A891516J3493J3650J2058J1899J4319J6733J8179K0610K3648K4283K3157
56007B083545K4633K9125L2034L1797L2140L4629L6167L5852L7100M0693M2859
55996B460574M2455M3010M5311M5283M1821L9542M1033M3259M4142M5733M8604
55985B940767N0109N0539N3751N9606O3107O3092O4189O8193P1391P2290P3891
55974C630925P6542P7002P6360P9833Q6964R1451R2528R6488J04795J11416J14570
$$ plain form
55963 4638874 4758911 4888392 5025163 5164896 5309341 5463103 5625756 5794863 5973302
55954 5973302 6165737 6371252 6587190 6816463 7062870 7323146 7592136 7871968 8167643
55945 8167643 8477947 8799897 9137589 9496864 9875484 10268645 10679806 11115822 11576062
55936 11576062 12057296 12564488 13105021 13676818 14274167 14900567 15563505 16261910 16992421
55927 16992421 17763064 18586519 19464773 20395275 21387036 22454554 23600621 24822046 26127965
55918 26127965 27535143 29049887 30672865 32417194 34302535 36335996 38518985 40868278
55910 40868278 43410292 46162213 49143706 52402394 56003603 60002817 64457350 69459412
55902 69459412 75127580 81571699 88896409 97227379 106695861 117411389 129499591 143160226
$$ packed form
55963D638874J20037J29481J36771J39733J44445J53762J62653J69107J78439
55954E973302J92435K05515K15938K29273K46407K60276K68990K79832K95675
55945H167643L10304L21950L37692L59275L78620L93161M11161M36016M60240
55936A1576062M81234N07192N40533N71797N97349O26400O62938O98405P30511
55927A6992421P70643Q23455Q78254R30502R91761J067518J146067J221425J305919
55918B6127965J407178J514744J622978J744329J885341K033461K182989K349293
55910D0868278K542014K751921K981493L258688L601209L999214M454533N002062
55902F9459412N668168O444119P324710Q330970R468482J0715528J2088202J3660635
$$ plain form
55894 143160226 158638811 176155537 195922337 218205012 243279212 271339452 302522422
55887 302522422 336829193 373488115 409956548 441685647 463488189 471795386 466075068
55880 466075068 448485463 422436050 391296731 357801480 323942782 291067790 260063078
55873 260063078 231522510 205797236 182981440 162960002 145511720 130369220 117230103
55866 117230103 105790638 95796909 87048141 79361985 72569748 66540902 61179168 56391424
55858 56391424 52082955 48180017 44632251 41393644 38422911 35700628 33222695 30974180
55850 30974180 28926085 27055558 25350260 23793103 22361032 21040205 19826589 18710734
55842 18710734 17676444 16714571 15823703 14996695 14220059 13487238 12799687 12154359 11542600
$$ packed form
55894A43160226J5478585J7516726J9766800K2282675K5074200K8060240L1182970
55887C02522422L4306771L6658922L6468433L1729099K1802542Q307197n720318
55880D66075068j7589605k6049413l1139319l3495251l3858698l2874992l1004712
55873B60063078k8540568k5725274k2815796k0021438j7448282j5142500j3139117
55866A17230103j1439465r993729q748768p686156o792237o028846n361734m787744
55858E6391424m308469l902938l547766l238607k970733k722283k477933k248515
55850C0974180k048095j870527j705298j557157j432071j320827j213616j115855
55842A8710734j034290r61873q90868q27008p76636p32821o87551o45328o11759
$$ plain form
55833 11542600 10962195 10418733 9913936 9443145 9004579 8600365 8227678 7878773 7550370
55824 7550370 7243856 6956475 6681992 6420194 6176347 5950799 5737846 5534825 5343433
55815 5343433 5161806 4983931 4807363 4633660 4461350 4286625 4110867 3939473 3773308
55806 3773308 3609298 3449025 3298140 3156940 3019919 2885350 2757392 2638027 2524791
55797 2524791 2417375 2318656 2227921 2140441 2055263 1976529 1905800 1839843 1777279 1720644 1670294
55786 1670294 1622682 1576281 1533207 1493560 1454203 1414639 1378204 1345851 1314350 1282185 1251784
55775 1251784 1224360 1197885 1171761 1148324 1128096 1108421 1088287 1069773 1053379 1036602 1018503
55764 1018503 1001114 985112 968554 950940 933951 917261 898420 877993 859895 845308 831039
$$ packed form
55833A1542600n80405n43462n04797m70791m38566m04214l72687l48905l28403
55824G550370l06514k87381k74483k61798k43847k25548k12953k03021j91392
55815E343433j81627j77875j76568j73703j72310j74725j75758j71394j66165
55806C773308j64010j60273j50885j41200j37021j34569j27958j19365j13236
55797B524791j07416r8719r0735q7480q5178p8734p0729o5957o2564n6635n0350
55786A670294m7612m6401m3074l9647l9357l9564l6435l2353l1501l2165l0401
55775A251784k7424k6475k6124k3437k0228j9675k0134j8514j6394j6777j8099
55764A018503j7389j6002j6558j7614j6989j6690j8841k0427j8098j4587j4269
$$ plain form
55753 831039 815390 800801 789039 778476 768089 759633 753673 747668 740314 734031 730953 729957 729696
55740 729696 731176 735179 740299 745566 752215 760983 770231 778278 785089 790385 792737 791815 789072 785153
55726 785153 779061 770668 761492 752321 742756 733442 725691 718278 707825 693246 676929 660996 645595
55713 645595 631422 620266 611908 603923 595899 590621 589698 591090 592371 593380 594026 592410 587075 578941
55699 578941 569554 559474 549419 540573 532606 523639 513178 502893 493785 485024 476364 468958 462792
55686 462792 455895 447293 438388 430440 423065 416060 410217 405334 399986 394312 390536 389601 389641 388830 387317
55671 387317 385395 382295 378021 373927 370136 364615 356116 346102 336690 328622 322094 317424 313955 310355
55657 310355 306814 304849 304303 302973 300034 297550 297671 300572 305759 312931 320727 327153 332125 337223 342356
$$ packed form
55753H31039j5649j4589j1762j0563j0387q456n960o005p354o283l078r96k61
55740G29696J480M003N120N267O649Q768R248Q047O811N296K352r22k743l919
55726G85153o092q393r176r171r565r314p751p413j0453j4579j6317j5933j5401
55713F45595j4173j1156q358p985q024n278r23J392J281J009O46j616n335q134
55699E78941r387j0080j0055q846p967q967j0461j0285r108q761q660p406o166
55686D62792o897q602q905p948p375p005n843m883n348n674l776r35M0q11j513
55671C87317j922l100m274m094l791n521q499j0014r412q068o528m670l469l600
55657C10355l541j965n46j330k939k484J21K901N187P172P796O426M972N098N133
$$ plain form
55642 342356 345412 345786 345110 343560 338813 330138 320272 311490 302930 293715 285571 280010 275765 271604 269134
55627 269134 269966 272262 273067 272413 272303 272978 273035 272364 272374 273661 275484 277235 278802 279856 280077 279694 278850
55610 278850 277074 274117 270541 266904 263356 260406 258778 258017 256930 255912 257042 261028 265915 269759
55596 269759 272774 275827 278719 281131 283522 285847 287125 287461 288707 291778 294957 296256 295907 295269 294846
55581 294846 294671 295084 295741 295252 292949 289636 285717 280352 273455 266590 260631 254480 247390 240543 234851
55566 234851 229253 222867 216929 212794 209861 207298 205911 206284 206759 205503 203047 200742 198222 194692 191320
55551 191320 189775 189314 187743 184672 181709 179954 179191 178996 178843 177610 174676 171167 168792 168022 168556 170540
55535 170540 173780 176661 177470 176146 173415 169144 163140 156759 152053 149727 149081 149285 149692 149861 150318 152138
$$ packed form
55642C42356L056L74o76j550m747q675r866q782q560r215q144n561m245m161k470
55627B69134Q32K296Q05o54j10O75N7o71J0J287J823J751J567J054K21l83q44
55610B78850j776k957l576l637l548k950j628p61j087j018J130L986M887L844
55596B69759L015L053K892K412K391K325J278L36J246L071L179J299l49o38m23
55581B94846j75M13O57m89k303l313l919n365o897o865n959o151p090o847n692
55566B34851n598o386n938m135k933k563j387L73M75j256k456k305k520l530l372
55551A91320j545m61j571l071k963j755p63j95j53j233k934l509k375p70N34J984
55535A70540L240K881Q09j324k731m271o004o381m706k326o46K04M07J69M57J820
$$ plain form
55519 152138 154846 156306 155964 156253 158970 162196 163229 162995 164817 169809 176267 182805 189203 194542 197431
55504 197431 198380 199585 201978 204473 206189 207406 208063 207377 205461 203637 202600 201662 200109 197941 194995
55489 194995 190718 185239 179589 174575 170357 167132 165134 163936 162785 161678 161205 161480 162254 163818 166575
55474 166575 169790 172010 172720 172507 171695 170002 167636 165585 164571 164497 164885 165020 163836 160739 156638 153271
55458 153271 151424 150493 149632 148535 147201 145811 144799 144299 143627 141981 139515 137096 135257 134048 133531
55443 133531 133617 133681 133163 132347 131810 131362 130288 128503 126790 126039 126694 128626 131007 132693 133177 132804 131836
55426 131836 130050 127630 125515 124265 123509 123089 123698 125618 128000 130201 132591 135034 136085 135171 134206
55411 134206 135189 137186 137599 135699 132918 130237 127419 124682 123093 123007 123607 124134 124312 123680 121952 120076
$$ packed form
55519A52138K708J460l42K89K717L226J033k34J822M992O458O538O398N339K889
55504A97431R49J205K393K495J716J217O57o86j916j824j037r38j553k168k946
55489A94995m277n479n650n014m218l225j998j198j151j107m73K75P74J564K757
55474A66575L215K220P10k13q12j693k366k051j014p4L88J35j184l097m101l367
55458A53271j847r31q61j097j334j390j012n00o72j646k466k419j839j209n17
55443A33531Q6O4n18q16n37m48j074j785j713p51O55J932K381J686M84l73r68
55426A31836j786k420k115j250p56m20O09J920K382K201K390K443J051r14r65
55411A34206R83J997M13j900k781k681k818k737j589q6O00N27J78o32j728j876
$$ plain form
55395 120076 119624 120997 123300 125726 127825 128679 127414 124637 122013 120268 118808 117308 116378 116475 117406 119084
55379 119084 121595 124196 125369 124360 122064 120210 120042 121510 123182 123484 122768 123364 126436 129659 129770
55364 129770 126974 124856 125863 128639 130239 129310 126496 123157 120685 120182 121813 124591 127063 128198 127990
55349 127990 127732 129150 132507 135989 137690 137522 136238 133749 130107 127286 127559 130088 131367 129604 126728
55334 126728 125351 125494 125415 124267 122675 121482 121022 121194 121514 121386 120730 120088 119974 120523 121692 123234 124504
55317 124504 125016 125136 125568 126348 127051 127753 128845 130081 130796 130864 130427 128993 126060 122519 120063 119042 118186
55300 118186 116591 114684 113060 111694 110721 110711 111586 112348 112427 112438 113113 114294 115434 116372 117261 118345 119987
55283 119987 122230 124318 125374 125534 125570 125603 125234 124834 125382 126823 127802 127386 126056 124754 123964 123842 124258
$$ packed form
55395A20076m52J373K303K426K099Q54j265k777k624j745j460j500r30R7R31J678
55379A19084K511K601J173j009k296j854j68J468J672L02p16N96L072L223J11
55364A29770k796k118J007K776J600r29k814l339k472n03J631K778K472J135k08
55349A27990k58J418L357L482J701j68j284k489l642k821K73K529J279j763k876
55334A26728j377J43p9j148j592j193m60J72L20j28o56o42j14N49J169J542J270
55317A24504N12J20M32P80P03P02J092J236P15O8m37j434k933l541k456j021q56
55300A18186j595j907j624j366r73j0Q75P62P9J1O75J181J140R38Q89J084J642
55283A19987K243K088J056J60L6L3l69m00N48J441R79m16j330j302p90j22M16
$$ plain form
55266 124258 124549 124323 124480 126146 128554 129525 128435 127132 127292 128273 128397 127133 125187 123521 123163 125025
55250 125025 128886 133100 135992 137119 136960 136167 135436 135194 134961 133810 131715 129526 127510 125186 122844
55235 122844 121758 122217 122716 121978 120708 120483 121869 124386 127289 129601 130416 130102 130312 131952 133985 134954
55219 134954 134708 133791 132342 130755 130421 132300 135294 137285 137442 136523 135373 134148 132759 131136 129240
55204 129240 127474 126708 127275 128385 129112 129451 129828 130252 130581 130878 130854 129839 128225 127957 130310 133810 135609
55187 135609 134488 131394 127716 124388 122218 121434 120964 119615 117965 117616 118485 118514 116637 114524 114393 116111
55171 116111 117702 118109 118325 119868 123075 127049 130582 132791 133258 132176 130494 129506 129855 130894 131361 130805
55155 130805 130165 130773 132959 135622 136990 135916 132922 130016 128969 129543 129935 129105 128024 128132 129322 130245
$$ packed form
55266A24258K91k26J57J666K408R71j090j303J60R81J24j264j946j666l58J862
55250A25025L861M214K892J127j59p93p31k42k33j151k095k189k016k324k342
55235A22844j086M59M99p38j270k25J386K517K903K312Q15l14K10J640K033R69
55219A34954k46r17j449j587l34J879K994J991J57r19j150j225j389j623j896
55204A29240j766p66N67J110P27L39L77M24L29K97k4j015j614k68K353L500J799
55187A35609j121l094l678l328k170p84m70j349j650l49Q69K9j877k113j31J718
55171A16111J591M07K16J543L207L974L533K209M67j082j682r88L49J039M67n56
55155A30805o40O08K186K663J368j074k994k906j047N74L92q30j081J08J190R23
$$ plain form
55139 130245 130235 129961 130120 130323 129723 128319 127227 127604 129464 131664 132984 133144 132664 132046 131475 131129 131215 131600
55121 131600 131838 131723 131418 131079 130794 130884 131652 132730 133411 133864 135288 138322 141931 144452 145383 145650 146421
55104 146421 148082 150066 151350 151446 151206 152114 154328 156012 155323 152666 150175 149195 149159 148991 148633 148699 149292
55087 149292 149886 150193 150459 150762 150588 149548 148177 147377 147147 146628 145574 144989 145720 147097 147650 146678 144394
55070 144394 141151 137658 135594 136634 140512 144971 147870 148728 148382 148096 148951 150948 152470 151721 149038
55055 149038 146782 146716 148521 151087 153837 156183 157090 156260 154800 153819 153216 152777 153416 155915 158965 159890
55039 159890 157514 153499 150810 151246 154210 157380 158798 158667 158891 160724 163512 165973 167786 169319 170562
55024 170562 171146 170911 169897 168289 166808 166319 166538 166111 164749 164134 165520 167479 167573 165674 163967 164010 165451
$$ packed form
55139A30245j0k74J59K03o00j404j092L77J860K200J320J60m80o18n71l46Q6L85
55121A31600K38j15l05l39k85R0P68J078O81M53J424L034L609K521R31K67P71
55104A46421J661J984J284R6k40R08K214J684o89k657k491r80l6j68l58O6N93
55087A49292N94L07K66L03j74j040j371q00k30n19j054n85P31J377N53r72k284
55070A44394l243l493k064J040L878M459K899Q58l46k86Q55J997J522p49k683
55055A49038k256o6J805K566K750K346R07q30j460r81o03m39O39K499L050R25
55039A59890k376m015k689M36K964L170J418j31K24J833K788K461J813J533J243
55024A70562N84k35j014j608j481m89K19m27j362o15J386J959R4j899j707M3J441
$$ plain form
55007 165451 167656 170828 174887 178565 180452 180320 178771 176137 172270 167184 161597 156818 153873 152447
54993 152447 151001 148523 146007 145556 148019 152066 155561 157323 157605 157496 158011 159329 160738 161490 161657 161915
54977 161915 162697 163855 164931 165461 165335 165269 166441 169068 171632 172201 170441 167683 165204 163152 161194 159440
54961 159440 158391 158341 159048 159893 160338 160412 160665 161503 162780 164178 165682 167407 169201 170637 171133 170037 167193
54944 167193 163723 161549 161654 163302 165306 167337 169428 171060 171780 172172 173235 175076 177112 179191 181492
54929 181492 183653 185105 186176 187717 189495 190005 188260 185075 182281 181195 181974 183766 185232 185489 184913
54914 184913 184674 185362 186396 186902 186811 186904 187930 189765 191443 192107 191947 191872 192259 192584 192464 192298 192464 192639
54896 192639 192549 192762 193891 195539 196815 197440 197599 197258 196543 196196 196591 196706 195284 192663 190260 188571 187049
$$ packed form
55007A65451K205L172M059L678J887j32j549k634l867n086n587m779k945j426
54993A52447j446k478k516m51K463M047L495J762K82j09N15J318J409P52J67K58
54977A61915P82J158J076N30j26o6J172K627K564N69j760k758k479k052j958j754
54961A59440j049n0P07Q45M45P4K53Q38J277J398J504J725J794J436M96j096k844
54944A67193l470k174J05J648K004K031K091J632P20L92J063J841K036K079K301
54929A81492K161J452J071J541J778N10j745l185k794j086P79J792J466K57n76
54914A84913k39O88J034N06r1R3J026J835J678O64j60p5L87L25j20j66J66J75
54896A92639r0K13J129J648J276O25J59l41p15l47L95J15j422k621k403j689j522
$$ plain form
54879 187049 185806 185830 187261 188874 189782 190427 191375 192269 192652 192869 193474 194501 195929 198113 201030 203730
54863 203730 205324 206149 207308 209348 211962 214849 218317 222978 229024 235879 242644 248971 255307 261910
54849 261910 267940 272074 273907 274104 273198 270940 267002 261744 256052 250763 246249 242227 238059 233596 229470
54834 229470 226063 222686 218696 215014 213338 213872 215099 215928 216781 218163 219555 220493 221607 223554 225674
54819 225674 226833 227166 227994 230183 233381 236919 240807 245695 252077 259534 266719 272355 276397 279901 283610
54804 283610 287066 289238 289483 287570 283370 277125 269815 262725 256576 251279 246396 241683 237263 233355
54790 233355 229817 226070 221655 216695 211551 206389 201567 198050 196533 196189 195261 193100 190783 189451 188943
54775 188943 188550 188258 188450 188853 188549 186879 184019 180982 179326 180310 183669 187441 189545 189536 188627 188287 189123
$$ packed form
54879A87049j243K4J431J613R08O45R48Q94L83K17O05J027J428K184K917K700
54863B03730J594Q25J159K040K614K887L468M661O046O855O765O327O336O603
54849B61910O030M134J833J97r06k258l938n258n692n289m514m022m168m463m126
54834B29470l407l377l990l682j676N34J227Q29Q53J382J392R38J114J947K120
54819B25674J159L33Q28K189L198L538L888M888O382P457P185N636M042L504L709
54804B83610L456K172K45j913m200o245p310p090o149n297m883m713m420l908
54790B33355l538l747m415m960n144n162m822l517j517l44r28k161k317j332n08
54775A88943l93k92J92M03l04j670k860l037j656R84L359L772K104rr09l40Q36
$$ plain form
54758 189123 190771 192341 193042 192854 192685 193654 195992 198612 199783 198517 195523 192700 191441 191548 191968 192228
54742 192228 192670 193542 194484 194824 193937 191626 188800 187395 188712 191874 194731 196093 196242 195641 194577 193976
54726 193976 194943 197053 198509 198578 198431 199001 199647 199976 201284 204537 208133 209675 209410 209997 213115 218010
54710 218010 223405 228994 234535 239056 241976 244210 247214 251345 255762 259662 263176 267176 272598 279885
54696 279885 288762 298301 307061 313411 316249 315723 312977 309003 304057 298244 292001 285563 278623 271171
54682 271171 264179 258705 254706 251447 248666 246482 244564 242517 240930 240784 241666 241805 240405 238959 239483
54667 239483 241995 244442 244875 243244 241286 241143 243975 249502 256670 264497 272127 278380 282153 283667 284804
54652 284804 287658 292677 298259 301895 301703 297485 290832 284034 278316 273039 266821 259424 252256 246907
$$ packed form
54758A89123J648J570P01j88j69R69K338K620J171j266k994k823j259J07M20K60
54742A92228M42Q72R42L40q87k311k826j405J317L162K857J362J49o01j064o01
54726A93976R67K110J456O9j47N70O46L29J308L253L596J542k65N87L118M895
54710B18010N395N589N541M521K920K234L004M131M417L900L514M000N422P287
54696B79885Q877R539Q760O350K838n26k746l974m946n813o243o438o940p452
54682B71171o992n474l999l259k781k184j918k047j587j46Q82J39j400j446N24
54667B39483K512K447M33j631j958j43K832N527P168P827P630O253L773J514J137
54652B84804K854N019N582L636j92m218o653o798n718n277o218p397p168n349
$$ plain form
54638 246907 243439 240429 236782 233159 231193 231339 232109 231830 230591 229676 229277 227863 224233 219374 215571
54623 215571 214034 214088 214372 214043 212906 211296 210183 210608 212406 213923 213656 211989 210625 210401 210390 209271
54607 209271 206863 203965 201347 199467 198690 199020 199846 200674 202009 204677 208198 210694 210943 209875 209424 210227
54591 210227 211221 211335 210871 210908 211881 213119 213670 213244 212397 212032 212791 214643 216833 218294 218437 217557 216331
54574 216331 214985 213391 211929 211557 212578 213944 214585 215077 216995 220589 224048 225412 224352 221670 217902
54559 217902 213384 209155 206689 206492 207616 208736 209200 208892 207720 205841 204098 203563 204449 205857 206856 207520
54543 207520 208582 210335 212381 214424 216696 219309 221676 222933 222673 220979 218168 214854 211933 209986
54529 209986 208946 208637 209085 209763 209186 206448 202937 201347 202764 205651 207955 209317 210773 213067 215895
$$ packed form
54638B46907l468l010l647l623j966J46P70k79j239r15l99j414l630m859l803
54623B15571j537N4K84l29j137j610j113M25J798J517k67j667j364k24j1j119
54607B09271k408k898k618j880p77L30Q26Q28J335K668L521K496K49j068m51Q03
54591B10227R94J14m64L7R73J238N51m26q47l65P59J852K190J461J43q80j226
54574B16331j346j594j462l72J021J366O41M92J918L594L459J364j060k682l768
54559B17902m518m229k466j97J124J120M64l08j172j879j743n35Q86J408R99O64
54543B07520J062J753K046K043K272K613K367J257k60j694k811l314k921j947
54529B09986j040l09M48O78n77k738l511j590J417K887K304J362J456K294K828
$$ plain form
54514 215895 218380 219897 220688 221764 223755 225885 226689 225796 224283 223176 222517 222059 221822 221503 220408 218636
54498 218636 217435 217686 218881 220326 222372 225425 228603 230605 231451 232202 233411 235027 237294 240271 242720
54483 242720 243186 242403 243011 246198 249899 251231 249698 247049 244843 243420 242904 243796 246198 249333 252321
54468 252321 254939 257110 258110 257119 254657 252703 252783 254225 254879 253442 250454 247133 244164 241858 240577
54453 240577 240283 240247 239944 239774 240234 240856 240874 240597 241058 242394 243578 243844 243331 242099 239703 236355 233534
54436 233534 232453 232505 232162 231112 230504 231205 232789 234422 235864 237233 238519 239943 242239 245805 249747
54421 249747 252522 253569 253680 253663 253387 252471 251247 250448 250377 250959 252259 254164 255833 256424 256539 258052 262049
54404 262049 267440 272110 275138 277487 280725 285412 290583 294518 296050 295332 293441 291364 289393 287273
$$ packed form
54514B15895K485J517P91J076J991K130Q04q93j513j107o59m58k37l19j095j772
54498B18636j201K51J195J445K046L053L178K002Q46P51J209J616K267K977K449
54483B42720M66p83O08L187L701J332j533k649k206j423n16Q92K402L135K988
54468B52321K618K171J000r91k462j954Q0J442O54j437k988l321k969k306j281
54453B40577k94l6l03j70M60O22J8k77M61J336J184K66n13j232k396l348k821
54436B33534j081N2l43j050o08P01J584J633J442J369J286J424K296L566L942
54421B49747K775J047J11j7k76r16j224p99p1N82J300J905J669N91J15J513L997
54404B62049N391M670L028K349L238M687N171L935J532p18j891k077j971k120
$$ plain form
54390 287273 284591 281191 277562 274683 273154 272730 273068 274378 276516 277916 276745 273242 269661 267491 265834
54375 265834 263037 258850 254357 250762 249083 250064 253214 256496 258056 258073 258184 259486 261829 264578 267052
54360 267052 268479 268476 267609 266796 266261 265627 264814 264148 263769 263537 263470 263836 265011 267558 271814 276784 280095 280148
54342 280148 278058 276617 277492 280197 283365 285981 287605 288565 289978 292658 295887 298131 298873 298811 298414 297494
54326 297494 296418 296386 297868 299714 300508 300157 299584 299469 299889 300778 302153 304053 306531 309464 312338 314627
54310 314627 316475 318530 320988 323411 325713 328595 332562 336912 340156 341270 340306 338162 336026 334784
54296 334784 334656 335375 336516 337371 336825 334093 329675 324944 320603 316148 311110 306137 302371 300069 298296
54281 298296 295790 291930 287134 282542 279071 276581 274131 271121 268001 265807 265274 266272 267726 268173 266938
$$ packed form
54390B87273k682l400l629k879j529m24L38J310K138J400j171l503l581k170j657
54375B65834k797m187m493l595j679R81L150L282J560J7J11J302K343K749K474
54360B67052J427lq67q13n35o34q13o66l79k32o7L66J175K547M256M970L311N3
54342B80148k090j441Q75K705L168K616J624R60J413K680L229K244P42o2l97r20
54326B97494j076l2J482J846P94l51n73j15M20Q89J375J900K478K933K874K289
54310C14627J848K055K458K423K302K882L967M350L244J114r64k144k136j242
54296C34784j28P19J141Q55n46k732m418m731m341m455n038m973l766k302j773
54281B98296k506l860m796m592l471k490k450l010l120k194n33R98J454M47j235
$$ plain form
54266 266938 264939 263939 264894 267327 270146 272482 273754 273696 272734 271837 271657 272123 273086 274727 276898 278505
54250 278505 278226 275899 272850 270748 270215 270587 270910 270990 271255 271739 271769 270911 269636 268553 267458 265888 264246
54233 264246 263530 264004 264976 265814 266410 266652 266363 265857 265758 266097 266457 267158 269291 273141 277435 280714 282729
54216 282729 283933 284329 283599 281950 280149 278897 278520 278887 279253 278690 277234 276226 276859 278588 279517 278402
54200 278402 275942 274218 275036 278640 283675 288417 292129 295227 298265 301140 303301 304413 304812 305560 307780
54185 307780 311267 313871 313138 308823 303131 298320 294825 291920 289202 286783 284818 283592 283579 284686 285909
54170 285909 286437 286745 287899 290042 292208 293405 293198 291447 288337 284822 282353 281763 282644 284050 285657
54155 285657 287970 291358 295035 297333 297187 295151 292649 290427 288185 285598 283030 281068 279885 279216 278593
$$ packed form
54266B66938j999j000R55K433K819K336J272n8r62q97j80M66R63J641K171J607
54250B78505k79k327l049k102n33L72L23Q0K65M84L0q58j275j083j095j570j642
54233B64246p16M74R72Q38N96K42k89n06r9L39L60P01K133L850M294L279K015
54216B82729J204L96p30j649j801j252l77L67L66n63j456j008O33J729R29j115
54200B78402k460j724Q18L604N035M742L712L098L038K875K161J112L99P48K220
54185C07780L487K604p33m315n692m811l495k905k718k419j965j226j3J107J223
54170B85909N28L08J154K143K166J197k07j751l110l515k469n90Q81J406J607
54155B85657K313L388L677K298j46k036k502k222k242k587k568j962j183o69o23
$$ plain form
54140 278593 277586 276305 275701 276776 279456 282796 286203 289611 292450 293541 292487 290320 288316 286992
54126 286992 286559 287214 288327 288486 287428 286960 288684 291477 292685 291558 290110 290485 292706 295263 296912
54111 296912 297460 297553 298127 299586 301226 301899 301411 300694 300376 299743 297634 294051 290288 287550 286002 285325 285565
54094 285565 286768 288110 288420 287858 288058 289805 291363 290353 286867 283385 281759 281787 282829 285002 287959
54079 287959 290046 290011 288617 287456 286957 286575 286105 285618 284795 283564 282878 283648 285319 286685 287616 288738 289989
54062 289989 291033 292717 296268 300957 304362 305463 305910 307575 310200 312371 313676 314868 316693 319489
54048 319489 323351 327812 331822 334906 337937 342070 347275 352707 358099 363722 369069 372726 373985 373829
54034 373829 373735 374056 374130 373479 372098 369838 366567 363110 360884 359989 358546 354935 350062 346212 344033 342139
$$ packed form
54140B78593j007j281o04J075K680L340L407L408K839J091j054k167k004j324
54126B86992m33O55J113J59j058m68J724K793J208j127j448L75K221K557J649
54111B96912N48R3N74J459J640O73m88p17l18o33k109l583l763k738j548o77K40
54094B85565J203J342L10n62K00J747J558j010l486l482j626K8J042K173K957
54079B87959K087l5j394j161m99l82m70m87q23j231o86P70J671J366R31J122J251
54062B89989J044J684L551M689L405J101M47J665K625K171J305J192J825K796
54048C19489L862M461M010L084L031M133N205N432N392N623N347L657J259j56
54034C73829r4L21P4o51j381k260l271l457k226q95j443l611m873l850k179j894
$$ plain form
54018 342139 339691 337809 337842 339526 341654 343472 344618 344697 343872 343118 343069 343424 344268 346722 351019 355108 356956
54001 356956 357511 359362 362852 365682 366501 366689 367779 368944 368344 365899 363576 363392 365832 369751 373419
53986 373419 376125 378905 383073 388029 391685 393438 395457 400193 407602 415807 423766 432038 441241 450973
53972 450973 460587 470307 481073 493318 506007 517041 524822 529437 532241 534611 537502 541693 547404
53959 547404 553533 558252 560784 562053 563293 564665 565387 564547 561495 556189 549527 542648 535631 527639 518712
53944 518712 510418 504068 499023 493525 486644 478807 471005 464161 458762 454424 450245 446117 443067 441672
53930 441672 440839 439006 435965 432610 429477 426604 424422 423437 423093 422013 419620 416762 414734 414318 415649
53915 415649 418167 420710 422474 423893 425905 428591 431473 434917 439985 446779 454302 462293 471848 483533
$$ packed form
54018C42139k448j882L3J684K128J818J146P9q25p54m9L55Q44K454M297M089J848
54001C56956N55J851L490K830Q19J88J090J165o00k445k323j84K440L919L668
53986C73419K706K780M168M956L656J753K019M736P409Q205P959Q272R203R732
53972D50973R614R720J0766J2245J2689J1034P781M615K804K370K891M191N711
53959E47404O129M719K532J269J240J372P22q40l052n306o662o879p017p992q927
53944E18712q294o350n045n498o881p837p802o844n399m338m179m128l050j395
53930D41672q33j833l041l355l133k873k182r85l44j080k393k858k028m16J331
53915D15649K518K543J764J419K012K686K882L444N068O794P523P991R555J1685
$$ plain form
53901 483533 496001 507331 516681 523701 527420 527184 524187 520562 516999 512449 506199 499101 492547 487296
53887 487296 483633 481785 481651 482765 484882 487987 491420 493837 494658 495060 496904 501086 507269 514603 522049
53872 522049 528620 534142 539483 545296 551022 555940 560604 566022 571835 576933 581915 589014 598889 609191
53858 609191 617631 625240 634935 647552 660991 673058 683587 693547 703479 713351 722959 731858 739532
53845 739532 746054 751997 757405 761493 763801 764965 765788 765985 764520 760921 755749 749888 743819 737516 730689
53830 730689 723064 714539 705049 694353 682411 670079 658859 649439 640789 631306 620722 610321 601313
53817 601313 593554 585977 577662 568272 558029 547772 538617 530912 523684 515837 507860 501509 497443 493983
53803 493983 488961 482305 475896 471064 467310 463657 460214 457697 456039 454241 451389 447230 441924 435825
$$ packed form
53901D83533J2468J1330R350P020L719k36k997l625l563m550o250p098o554n251
53887D87296l663j848j34J114K117L105L433K417Q21M02J844M182O183P334P446
53872E22049O571N522N341N813N726M918M664N418N813N098M982P099R875J0302
53858F09191Q440P609R695J2617J3439J2067J0529R960R932R872R608Q899P674
53845G39532O522N943N408M088K308J164Q23J97j465l599n172n861o069o303o827
53830G30689p625q525r490j0696j1942j2332j1220r420q650r483j0584j0401r008
53817F01313p759p577q315r390j0243j0257r155p705p228p847p977o351m066l460
53803D93983n022o656o409m832l754l653l443k517j658j798k852m159n306o099
$$ plain form
53789 435825 429633 424409 421234 420657 422171 424222 425191 424584 422929 420547 417192 413206 410134 409344 410550
53774 410550 412447 414318 416087 417198 416725 414755 412671 411657 411525 411260 410234 408585 406807 405217 403773
53759 403773 402460 401921 403271 406820 411375 415409 418578 421508 424615 428037 432332 438010 444418 450220
53745 450220 455103 460015 465667 471982 479211 488212 498958 509891 519501 527748 535269 542133 548181 553846
53731 553846 559620 565188 569995 574344 579060 584200 588760 591707 592993 593727 595456 598747 602184 603327
53717 603327 601109 596751 591941 586905 580892 573727 565866 557433 548375 539340 531320 524391 517688 510732
53703 510732 504033 498246 493435 489318 485551 481523 476540 470696 465193 461372 459441 458344 456767 454186
53689 454186 451040 448018 445306 442689 440224 438337 437069 435785 434048 432373 431493 431182 430584 429630 429234
$$ packed form
53789D35825o192n224l175n77J514K051R69o07j655k382l355l986l072p90J206
53774D10550J897J871J769J111m73j970k084j014j32k65j026j649j778j590j444
53759D03773j313n39J350L549M555M034L169K930L107L422M295N678O408N802
53745D50220M883M912N652O315P229R001J0746J0933R610Q247P521O864O048N665
53731E53846N774N568M807M349M716N140M560K947J286P34J729L291L437J143
53717F03327k218m358m810n036o013p165p861q433r058r035q020o929o703o956
53703E10732o699n787m811m117l767m028m983n844n503l821j931j097j577k581
53689D54186l146l022k712k617k465j887j268j284j737j675q80l11n98r54l96
$$ plain form
53674 429234 429775 430176 429230 427477 426897 428569 431250 432805 432753 432783 434690 438424 442523 445947 448840 451727
53658 451727 454690 457452 459814 461858 464075 467198 471481 476174 480219 483347 485978 488240 490087 492341
53644 492341 496422 502535 509049 514290 518184 521572 524841 528160 532250 537730 544020 549878 554885 559580
53630 559580 564335 568960 573282 577234 580434 582544 584090 586057 588482 590215 590305 588966 586881 584256 581030
53615 581030 577468 573930 570241 565957 561380 557831 556460 556900 557546 557379 557040 557581 558557 558342 556487 554733
53599 554733 555058 557350 559702 560511 559643 557984 556647 556418 557256 558298 558814 559025 559641 561012 563178 566203
53583 566203 569740 572845 575211 578145 583136 589630 595515 599816 603505 607334 610484 612342 614293 618239
53569 618239 623855 628891 632281 635648 641185 648869 656596 662552 666697 670066 673565 677715 682778 688483
$$ packed form
53674D29234N41M01r46j753n80J672K681J555n2L0J907L734M099L424K893K887
53658D51727K963K762K362K044K217L123M283M693M045L128K631K262J847K254
53644D92341M081O113O514N241L894L388L269L319M090N480O290N858N007M695
53630E59580M755M625M322L952L200K110J546J967K425J733R0j339k085k625l226
53615E81030l562l538l689m284m577l549j371M40O46j67l39N41R76k15j855j754
53599E54733L25K292K352Q09q68j659j337k29Q38J042N16K11O16J371K166L025
53583E66203L537L105K366K934M991O494N885M301L689L829L150J858J951L946
53569F18239N616N036L390L367N537P684P727N956M145L369L499M150N063N705
$$ plain form
53555 688483 694037 699041 704033 709386 714133 717085 719028 722291 727684 733279 737201 740335 744856 750926
53541 750926 756453 759811 761264 761898 762686 764641 768275 772391 774752 774600 773384 772399 770975 768063 764583
53526 764583 762728 763253 764693 765225 764295 762288 759584 756402 752981 749313 744977 739762 734377 730048 727220
53511 727220 724948 721935 718056 714395 711743 709593 707053 704367 702890 703512 705605 707725 709068 709976 711157
53496 711157 712687 714039 715136 716996 720799 726269 731622 735462 738268 741672 746718 753235 760440 767568
53482 767568 774280 781101 789216 799240 810470 821832 833135 844725 856525 868498 881686 897431
53470 897431 915481 934098 952234 970474 989470 1008718 1027742 1047534 1069780 1095027 1122356
53459 1122356 1150542 1178929 1207499 1236766 1267559 1300344 1334726 1369924 1405700 1442629 1481537
$$ packed form
53555F88483N554N004M992N353M747K952J943L263N393N595L922L134M521O070
53541G50926N527L358J453O34P88J955L634M116K361j52j216r85j424k912l480
53526G64583j855N25J440N32r30k007k704l182l421l668m336n215n385m329k828
53511G27220k272l013l879l661k652k150k540k686j477O22K093K120J343R08J181
53496G11157J530J352J097J860L803N470N353L840K806L404N046O517P205P128
53482G67568O712O821Q115J0024J1230J1362J1303J1590J1800J1973J3188J5745
53470H97431J8050J8617J8136J8240J8996J9248J9024J9792K2246K5247K7329
53459A122356K8186K8387K8570K9267L0793L2785L4382L5198L5776L6929L8908
$$ plain form
53448 1481537 1522806 1566125 1610659 1655469 1699835 1743256 1785397 1826290 1866445 1906424 1946426
53437 1946426 1986467 2026615 2066496 2104889 2140659 2174160 2207029 2240402 2273844 2306045 2335917
53426 2335917 2362985 2387609 2411112 2435029 2459774 2484582 2508914 2533157 2557422 2580434 2600389
53415 2600389 2616594 2629691 2640531 2649402 2656083 2660086 2660796 2657784 2651065 2640815 2626897 2608904 2586896
53402 2586896 2562096 2536624 2512018 2487868 2462316 2434252 2404444 2374056 2342886 2310140 2276358
53391 2276358 2243104 2210851 2178680 2146274 2114656 2084453 2055004 2026076 1999103 1975558 1955136
53380 1955136 1936826 1920895 1908367 1899015 1891348 1884479 1878865 1875221 1873693 1874220 1876896 1881949 1889879
53367 1889879 1901439 1916727 1934613 1953935 1975054 1999129 2025986 2053928 2082102 2111931 2145520
$$ packed form
53448A481537M1269M3319M4534M4810M4366M3421M2141M0893M0155L9979M0002
53437A946426M0041M0148L9881L8393L5770L3501L2869L3373L3442L2201K9872
53426B335917K7068K4624K3503K3917K4745K4808K4332K4243K4265K3012J9955
53415B600389J6205J3097J0840Q871O681M003P10l012o719j0250j3918j7993k2008
53402B586896k4800k5472k4606k4150k5552k8064k9808l0388l1170l2746l3782
53391B276358l3254l2253l2171l2406l1618l0203k9449k8928k6973k3545k0422
53380A955136j8310j5931j2528r352p667o869n614l644j528N27K676N053P930
53367A889879J1560J5288J7886J9322K1119K4075K6857K7942K8174K9829L3589
$$ plain form
53356 2145520 2183439 2224858 2269220 2316653 2366829 2418637 2471578 2526820 2585935 2648784 2713592
53345 2713592 2779351 2847185 2918622 2993393 3070083 3148477 3229713 3314034 3399902 3485934 3572397
53334 3572397 3659951 3748041 3835720 3923252 4011569 4100427 4188193 4273444 4356046 4436691 4515933
53323 4515933 4593548 4668362 4738896 4804287 4864071 4917029 4961485 4997387 5026845 5051469 5070203
53312 5070203 5081088 5084061 5080182 5068911 5048341 5017985 4979225 4932811 4877931 4814344 4743607 4667407
53300 4667407 4586258 4500750 4412649 4323639 4234076 4143942 4054031 3965173 3877334 3790478 3705468
53289 3705468 3622984 3542422 3462950 3384842 3308492 3232932 3156966 3081422 3008708 2940212 2875583
53278 2875583 2814626 2758139 2706264 2657372 2609726 2563534 2520365 2481008 2444873 2411397 2380948
$$ packed form
53356B145520L7919M1419M4362M7433N0176N1808N2941N5242N9115O2849O4808
53345B713592O5759O7834P1437P4771P6690P8394Q1236Q4321Q5868Q6032Q6463
53334C572397Q7554Q8090Q7679Q7532Q8317Q8858Q7766Q5251Q2602Q0645P9242
53323D515933P7615P4814P0534O5391N9784N2958M4456L5902K9458K4624J8734
53312E070203J0885K973l879j1271k0570l0356l8760m6414n4880o3587p0737p6200
53300D667407q1149q5508q8101q9010q9563r0134q9911q8858q7839q6856q5010
53289C705468q2484q0562p9472p8108p6350p5560p5966p5544p2714o8496o4629
53278B875583o0957n6487n1875m8892m7646m6192m3169l9357l6135l3476l0449
$$ plain form
53267 2380948 2353758 2328496 2302872 2276015 2249760 2226838 2207842 2190713 2173440 2156427 2141589
53256 2141589 2129814 2120371 2112485 2106349 2102395 2100547 2100739 2103529 2109615 2118944 2130645 2143635 2157199
53243 2157199 2171370 2187047 2205420 2226970 2251221 2277653 2306445 2337958 2371861 2407398 2444350
53232 2444350 2483098 2523586 2564777 2605400 2644884 2683172 2719933 2754455 2786299 2815593 2842464
53221 2842464 2866543 2887293 2904534 2918251 2928002 2933020 2932980 2928261 2919291 2906072 2888661 2867767 2844302
53208 2844302 2818455 2789671 2757510 2722094 2683682 2642366 2598348 2552098 2503988 2454093 2402703
53197 2402703 2350678 2298879 2247370 2195537 2143012 2090265 2038414 1988626 1941373 1895752 1849758
53186 1849758 1801969 1753138 1705610 1660849 1617990 1575197 1531972 1489578 1449434 1411949 1377044
$$ packed form
53267B380948k7190k5262k5624k6857k6255k2922j8996j7129j7273j7013j4838
53256B141589j1775r443p886o136l954j848J92K790O086R329J1701J2990J3564
53243B157199J4171J5677J8373K1550K4251K6432K8792L1513L3903L5537L6952
53232B444350L8748M0488M1191M0623L9484L8288L6761L4522L1844K9294K6871
53221B842464K4079K0750J7241J3717R751N018m0m719q970j3219j7411k0894k3465
53208B844302k5847k8784l2161l5416l8412m1316m4018m6250m8110m9895n1390
53197B402703n2025n1799n1509n1833n2525n2747n1851m9788m7253m5621m5994
53186A849758m7789m8831m7528m4761m2859m2793m3225m2394m0144l7485l4905
$$ plain form
53175 1377044 1344964 1315793 1288467 1261181 1233238 1206037 1181707 1160839 1142015 1123474 1104622
53164 1104622 1085763 1067083 1048460 1029833 1011017 991341 970262 948376 927189 907716 889777
53153 889777 872681 855955 839305 822646 806506 791725 778328 765287 751864 738549 726167
53142 726167 714675 703504 692517 681855 671343 660903 651165 642706 634875 626343 616678 606602
53130 606602 596902 588106 580937 575827 571817 567172 561455 555964 551715 548128 544245 540186 536533 533115
53116 533115 529290 524889 520054 514618 508478 502248 496800 492383 488808 486135 484403 482974 481091 479147
53102 479147 478641 480500 483848 486695 487620 486652 484659 482222 479392 476539 474801 474927 475883 475605 473433 470994
53086 470994 470290 471641 473992 476321 477902 477873 475801 472676 470443 470290 471711 473174 473361 471983 469889
$$ packed form
53175A377044l2080k9171k7326k7286k7943k7201k4330k0868j8824j8541j8852
53164A104622j8859j8680j8623j8627j8816j9676k1079k1886k1187j9473j7939
53153H89777j7096j6726j6650j6659j6140j4781j3397j3041j3423j3315j2382
53142G26167j1492j1171j0987j0662j0512j0440r738q459p831q532r665j0076
53130F06602r700q796p169n110m010m645n717n491m249l587l883m059l653l418
53116E33115l825m401m835n436o140o230n448m417l575k673j732j429j883j944
53102D79147n06J859L348K847R25r68j993k437k830k853j738J26R56k78k172k439
53086D70994p04J351K351K329J581k9k072l125k233j53J421J463J87j378k094
$$ plain form
53071 469889 468354 467995 468476 469247 470048 470592 470582 470555 471863 474999 478630 481194 482898 485121 488264 491447
53055 491447 494074 496427 498630 500323 501722 503962 507704 512013 515197 516469 516487 516505 517166 517943 517709 515989
53039 515989 513540 511598 510895 511540 513173 514738 514768 512719 509540 506167 502066 496261 489244 482590 477103
53024 477103 472710 469905 469537 470981 472129 471758 470617 469692 468741 467182 465092 462515 458970 454675 451321
53009 451321 450469 451709 453240 453763 453097 451585 449829 448595 448199 448242 448379 448819 449570 449846 448967 447314 445681
52992 445681 444220 442849 442206 443229 445958 449406 452405 454047 453791 451926 449723 448387 447913 447511 446850
52977 446850 446400 446812 448506 451474 454925 457424 457971 456662 453986 450161 445798 442319 440648 440037 439234
52962 439234 438256 437857 437784 437172 436462 437213 439725 442338 443602 443827 443878 443691 442945 442240 442557 443975 445798 447578
$$ packed form
53071D69889j535l59M81P71Q01N44j0k7J308L136L631K564J704K223L143L183
53055D91447K627K353K203J693J399K240L742M309L184J272J8J8O61P77k34j720
53039E15989k449j942p03O45J633J565L0k049l179l373m101n805p017o654n487
53024D77103m393k805l68J444J148l71j141r25r51j559k090k577l545m295l354
53009D51321q52J240J531N23o66j512j756j234l96M3J37M40P51K76q79j653j633
52992D45681j461j371o43J023K729L448K999J642k56j865k203j336m74m02o61
52977D46850m50M12J694K968L451K499N47j309k676l825m363l479j671o11q03
52962D39234r78l99p3o12p10P51K512K613J264K25N1j87p46p05L17J418J823J780
$$ plain form
52944 447578 449262 450520 450681 449511 447713 446530 446732 447864 448675 448627 448716 450217 452878 455230 456542 457385
52928 457385 458179 458532 458537 459400 461835 464828 467053 468708 470845 473548 476048 478202 480512 482854 484477 485215
52912 485215 485552 485492 484692 483866 484591 487100 489488 490062 489545 490019 492332 495572 498640 501204 503269 504861
52896 504861 506315 508070 509822 510367 508723 505220 501319 498403 496656 494959 492001 487710 483528 481045
52882 481045 480517 480933 481221 480975 480222 479086 477764 476402 474894 473127 471327 469779 468285 466429 464399
52867 464399 462940 462398 462365 462477 462910 463797 464691 465033 464727 463883 462513 460969 460166 460731 462195 463601 464653
52850 464653 465624 466423 466547 466051 465815 466523 467721 468180 467102 464984 463346 463386 464655 465348 464223 461876 459680
52833 459680 457993 456234 454471 453808 455015 457628 460719 463804 466615 468804 470472 472402 475072 477727
$$ packed form
52944D47578J684J258J61j170j798j183K02J132Q11m8Q9J501K661K352J312Q43
52928D57385P94L53NQ63K435K993K225J655K137K703K500K154K310K342J623P38
52912D85215L37o0q00q26P25K509K388N74n17M74K313L240L068K564K065J592
52896E04861J454J755J752N45j644l503l901k916j747j697k958m291m182k483
52882D81045n28M16K88k46p53j136j322j362j508j767j800j548j494j856k030
52867D64399j459n42l3J12M33Q87Q94L42l06q44j370j544q03N65J464J406J052
52850D64653R71P99J24m96k36P08J198M59j078k118j638M0J269O93j125k347k196
52833D59680j687j759j763o63J207K613L091L085K811K189J668J930K670K655
$$ plain form
52819 477727 479050 478594 477140 475861 475596 476626 478522 480250 481044 481391 482801 486326 491419 496358 499774
52804 499774 501678 503082 504703 506205 506704 505817 504041 502294 501359 501500 502059 501491 498477 493308 487693 483019
52788 483019 479283 475895 472740 469813 466459 461981 456803 452119 448303 444526 440254 436386 434273 434020
52774 434020 434331 433912 432545 430925 430011 430701 433448 437580 441179 442283 440519 437313 434415 432487 431207
52759 431207 430248 429682 429616 429926 430378 430735 430781 430516 430265 430358 430771 431336 432127 433262 434493 435435 436103 436823 437746
52740 437746 438937 440727 443235 445522 446061 444357 441505 438820 436516 434017 430939 427238 422883 418051
52726 418051 413466 410155 408864 409751 412133 414326 414479 412270 409500 408349 409223 410874 412373 414106 416664
52711 416664 419585 421859 423374 425137 427883 430987 433130 433702 432937 431016 428014 424929 423489 424152 425250
$$ packed form
52819D77727J323m56j454j279k65J030J896J728P94L47J410L525N093M939L416
52804D99774J904J404J621J502M99q87j776j747r35J41N59n68l014n169n615m674
52788D83019l736l388l155k927l354m478n178m684l816l777m272l868k113k53
52774D34020L11m19j367j620r14O90K747M132L599J104j764l206k898j928j280
52759D31207r59n66o6L10M52L57M6k65k51R3M13N65P91J135J231R42O68P20R23
52740D37746J191J790K508K287N39j704k852k685k304k499l078l701m355m832
52726D18051m585l311j291Q87K382K193J53k209k770j151Q74J651J499J733K558
52711D16664K921K274J515J763K746L104K143N72p65j921l002l085j440O63J098
$$ plain form
52696 425250 425200 424722 425492 427319 428501 428682 429244 430685 431792 432147 433325 436338 439750 441859 443252 445436
52680 445436 448254 450596 452704 455603 458848 461003 462159 463867 466517 468724 469649 470168 471161 472128 472218 471463
52664 471463 470406 469426 468761 468250 466935 464018 460374 457832 456750 455687 453786 451908 450782 449691 447999
52649 447999 446607 446573 447321 447524 447029 446696 446852 446984 446640 445787 444724 444245 445325 447906 450647 452482 453596
52632 453596 454232 453851 452664 452598 454880 457586 457866 456206 455977 458503 461065 460894 459040 458664 460856 463922
52616 463922 466073 467057 467310 467045 466558 466466 467092 467989 468312 467514 465768 464001 463334 464119 465647 467068 468333
52599 468333 469827 471399 472455 472911 473410 474539 476494 479548 484056 489595 494816 498676 501317 503200 504022
52584 504022 503479 502713 503671 506664 509513 509701 506729 501805 496057 490122 485155 482845 483897 487212 491072
$$ packed form
52696D25250n0m78P70J827J182J81N62J441J107L55J178L013L412K109J393K184
52680D45436K818K342K108K899L245K155J156J708K650K207R25N19R93R67R0p55
52664D71463j057r80o65n11j315k917l644k542j082j063j901j878j126j091j692
52649D47999j392l4P48K03m95l33J56J32l44q53j063m79J080K581K741J835J114
52632D53596O36l81j187o6K282K706K80j660k29K526K562j71j854l76K192L066
52616D63922K151R84K53k65m87r2O26Q97L23p98j746j767o67P85J528J421J265
52599D68333J494J572J056M56M99J129J955L054M508N539N221L860K641J883Q22
52584E04022n43p66R58K993K849J88k972m924n748n935m967k310J052L315L860
$$ plain form
52569 491072 494614 497643 499625 499922 499167 499361 501897 505796 508604 508974 507730 506300 505030 503570 502150
52554 502150 501349 500895 499915 498640 498658 500812 503707 505222 504965 504293 504299 504758 504946 504550 503618 502413 501500 501343
52536 501343 501706 501989 502171 502684 503327 503255 502440 502308 504176 507615 510996 513299 514668 515506 515844 515758 515732 516183
52518 516183 516789 516638 515230 513279 512289 513080 514835 515992 516124 516582 519023 523474 528056 530552 530241 528388
52502 528388 526988 527028 527944 528624 528457 527275 524959 521839 519106 517968 518465 519767 521282 522509 522125 518801
52486 518801 513371 508865 507529 508677 510184 511062 511567 511691 510934 509426 508122 507834 508661 510247 511987 513201
52470 513201 513722 514149 515069 516368 517853 520003 523242 526798 529197 529767 529011 527897 527544 529063 532505 536196
52454 536196 538360 539285 540611 542589 543717 543470 543591 545696 549026 551952 554709 558981 565107 571106 574658
$$ packed form
52569D91072L542L029J982K97p55J94K536L899K808L70j244j430j270j460j420
52554E02150q01m54r80j275J8K154K895J515k57o72OM59J88l96r32j205r13j57
52536E01343L63K83J82N13O43p2q15j32J868L439L381K303J369Q38L38q6k6M51
52518E16183O06j51j408j951r90P91J755J157J32M58K441M451M582K496l11j853
52502E28388j400M0R16O80j67j182k316l120k733j138M97J302J515J227l84l324
52486E18801n430m506j336J148J507Q78N05J24p57j508j304k88Q27J586J740J214
52470E13201N21M27R20J299J485K150L239L556K399N70p56j114l53J519L442L691
52454E36196K164R25J326J978J128k47J21K105L330K926K757M272O126N999L552
$$ plain form
52439 574658 575134 573527 571121 568464 565196 560716 555289 550340 547240 545893 544952 543325 541018 538590 536389
52424 536389 534490 532885 531421 529781 527744 525424 523224 521681 521269 522130 523961 526327 529105 532433 536241
52409 536241 540066 543428 546326 549230 552569 556253 559813 563008 566032 568868 570799 571282 571209 572341 574994
$$ packed form
52439E74658M76j607k406k657l268m480n427m949l100j347r41j627k307k428k201
52424E36389j899j605j464j640k037k320k200j543m12Q61J831K366K778L328L808
52409E36241L825L362K898K904L339L684L560L195L024K836J931M83p3J132K653
$$ [...]
##END NTUPLES=NMR SPECTRUM
##END=
