
##TITLE=UV1133_M4-1010-1000_6275400_qGbNvg8Q4H
##JCAMPDX= 6.0         $$ Bruker NMR JCAMP-DX V2.0
##DATA TYPE= NMR SPECTRUM
##DATA CLASS= NTUPLES
##ORIGIN= BRUKER
##OWNER= Administrator
$$ 1.72 TOPSPIN		Version 2.1
$$ 2012-06-03 00:17:57.656 -0500  Administrator@TOPSPIN
$$ Compression mode = diff/dup
##.OBSERVE FREQUENCY= 400.13188235
##.OBSERVE NUCLEUS= ^1H
##.ACQUISITION MODE= SIMULTANEOUS (DQD)
##.ACQUISITION SCHEME= undefined
##.AVERAGES= 8
##.DIGITISER RES= 22
##SPECTROMETER/DATA SYSTEM= spect
##.PULSE SEQUENCE= zg30
##.SOLVENT NAME= COFFEE_meoh
##.SHIFT REFERENCE= INTERNAL, COFFEE_meoh, 1, 14.98061
##AUDIT TRAIL= $$ (NUMBER, WHEN, WHO, WHERE, PROCESS, VERSION, WHAT)
$$ ##TITLE= Audit trail, TOPSPIN		Version 2.1
$$ ##JCAMPDX= 5.01
$$ ##ORIGIN= Bruker BioSpin GmbH
$$ ##OWNER= Administrator
$$ $$ C:\Bruker\TOPSPIN/data/COFFEE/nmr/UV1133_M4-1010-1000_6275400_qGbNvg8Q4H/10/pdata/1/auditp.txt
$$ ##AUDIT TRAIL=  $$ (NUMBER, WHEN, WHO, WHERE, PROCESS, VERSION, WHAT)
(   1,<2012-06-03 00:17:49.671 -0500>,<Administrator>,<TOPSPIN>,<go>,<TOPSPIN 2.1>,
      <created by zg
	started at 2012-06-03 00:16:43.046 -0500,
	POWCHK enabled, PULCHK disabled,
       configuration hash MD5:
       D5 CA 7A 23 FE 6B EE E2 50 67 74 61 24 F7 5E 3B
       data hash MD5: 64K
       E3 A1 B4 F5 7F 11 99 F0 B0 A5 78 14 0B A2 1F 9D>)
(   2,<2012-06-03 00:17:53.640 -0500>,<Administrator>,<TOPSPIN>,<proc1d>,<TOPSPIN 2.1>,
      <Start of raw data processing
       efp LB = 0 FT_mod = 6 PKNL = 1 PHC0 = 0 PHC1 = 0 SI = 32K 
       data hash MD5: 32K
       2D 63 39 17 CC E4 4B 31 9C 56 A7 67 F9 0F CB 25>)
(   3,<2012-06-03 00:17:53.953 -0500>,<Administrator>,<TOPSPIN>,<proc1d>,<TOPSPIN 2.1>,
      <pk PHC0 = 211.5967 PHC1 = 0 
       data hash MD5: 32K
       30 A4 EC A5 05 3D 36 B2 29 24 F3 3A 3B 7B 67 DD>)
(   4,<2012-06-03 00:17:54.015 -0500>,<Administrator>,<TOPSPIN>,<proc1d>,<TOPSPIN 2.1>,
      <abs ABSG = 1 
       data hash MD5: 32K
       F2 B6 F6 35 A4 F5 7D D2 86 33 75 DD 7B 25 19 E5>)
(   5,<2012-06-03 00:17:54.046 -0500>,<Administrator>,<TOPSPIN>,<proc1d>,<TOPSPIN 2.1>,
      <abs ABSG = 2 
       data hash MD5: 32K
       9E 01 8E 29 89 F4 7B 74 F9 83 EE 74 F6 BE 6B E7>)
(   6,<2012-06-03 00:17:54.078 -0500>,<Administrator>,<TOPSPIN>,<proc1d>,<TOPSPIN 2.1>,
      <abs ABSG = 3 
       data hash MD5: 32K
       30 7D 5F 3B 27 A0 EB B0 AB 47 72 6F 10 E7 E9 1C>)
(   7,<2012-06-03 00:17:54.109 -0500>,<Administrator>,<TOPSPIN>,<proc1d>,<TOPSPIN 2.1>,
      <abs ABSG = 4 
       data hash MD5: 32K
       31 A0 CE 7C 55 3D E1 E0 FA 1F F6 4E 2D B4 82 5D>)
(   8,<2012-06-03 00:17:54.140 -0500>,<Administrator>,<TOPSPIN>,<proc1d>,<TOPSPIN 2.1>,
      <abs ABSG = 5 
       data hash MD5: 32K
       2A A5 E5 42 C8 90 71 DC A5 85 DD 0F 15 07 E9 40>)
$$ ##END=
$$ 
$$ $$ hash MD5
$$ $$ 11 C3 D7 7A DE E0 1C A7 DD E8 AB 4A 4C 79 50 BF
##$RELAX= 
##$RELAX= 
##$RELAX= 
##$RELAX= 
##$RELAX= 
##$RELAX= 
##$RELAX= 
$$ Bruker specific parameters
$$ --------------------------
$$ [...]
150 150 150 150 150 150 150 150
##$TP07= 0
##$TPNAME0= <>
##$TPNAME1= <>
##$TPNAME2= <>
##$TPNAME3= <>
##$TPNAME4= <>
##$TPNAME5= <>
##$TPNAME6= <>
##$TPNAME7= <>
##$TPOAL= (0..7)
0.5 0.5 0.5 0.5 0.5 0.5 0.5 0.5
##$TPOFFS= (0..7)
0 0 0 0 0 0 0 0
##$TUNHIN= 0
##$TUNHOUT= 0
##$TUNXOUT= 0
##$USERA1= <user>
##$USERA2= <user>
##$USERA3= <user>
##$USERA4= <user>
##$USERA5= <user>
##$V9= 5
##$VALIST= <valist>
##$VCLIST= <CCCCCCCCCCCCCCC>
##$VD= 0
##$VDLIST= <DDDDDDDDDDDDDDD>
##$VPLIST= <PPPPPPPPPPPPPPP>
##$VTLIST= <TTTTTTTTTTTTTTT>
##$WBST= 2048
##$WBSW= 25
##$XGAIN= (0..3)
0 0 0 0
##$XL= 0
##$YL= 0
##$YMAX_a= 543352
##$YMIN_a= -653502
##$ZGOPTNS= <>
##$ZL1= 120
##$ZL2= 120
##$ZL3= 120
##$ZL4= 120
##$ABSF1= 14.98061
##$ABSF2= -5.57192
##$ABSG= 5
##$ABSL= 3
##$ALPHA= 0
##$AQORDER= 0
##$ASSFAC= 0
##$ASSFACI= 0
##$ASSFACX= 0
##$ASSWID= 0
##$AUNMP= <proc_prof1d_extract_pilot.lims>
##$AXLEFT= 0
##$AXNAME= <>
##$AXNUC= <1H>
##$AXRIGHT= 0
##$AXTYPE= 0
##$AXUNIT= <>
##$AZFE= 0.1
##$AZFW= 0.1
##$BCFW= 0
##$BC_mod= 0
##$BYTORDP= 0
##$COROFFS= 0
##$CY= 15
##$DATMOD= 1
##$DC= 0
##$DFILT= <>
##$DTYPP= 0
##$F1P= 0
##$F2P= 0
##$FCOR= 0.5
##$FTSIZE= 32768
##$FT_mod= 6
##$GAMMA= 0
##$GB= 0
##$INTBC= 1
##$INTSCL= 1
##$ISEN= 128
##$LB= 0
##$LEV0= 0
##$LPBIN= 0
##$MAXI= 10000
##$MC2= 0
##$MEAN= 0
##$ME_mod= 0
##$MI= 0
##$NCOEF= 0
##$NC_proc= -8
##$NLEV= 6
##$NOISF1= 0
##$NOISF2= 0
##$NSP= 0
##$NTH_PI= 0
##$NZP= 0
##$OFFSET= 14.98061
##$PC= 1
##$PHC0= 211.5967
##$PHC1= 0
##$PH_mod= 1
##$PKNL= yes
##$PPARMOD= 0
##$PPDIAG= 0
##$PPIPTYP= 0
##$PPMPNUM= 2147483647
##$PPRESOL= 1
##$PSCAL= 4
##$PSIGN= 0
##$PYNMP= <proc.py>
##$REVERSE= no
##$SF= 400.13
##$SI= 32768
##$SIGF1= 0
##$SIGF2= 0
##$SINO= 400
##$SIOLD= 32768
##$SPECTYP= <>
##$SREGLST= <1H.CDCl3>
##$SSB= 0
##$STSI= 32768
##$STSR= 0
##$SW_p= 8223.68421052632
##$SYMM= 0
##$S_DEV= 0
##$TDeff= 65536
##$TDoff= 0
##$TI= <>
##$TILT= no
##$TM1= 0
##$TM2= 0
##$TOPLEV= 0
##$USERP1= <user>
##$USERP2= <user>
##$USERP3= <user>
##$USERP4= <user>
##$USERP5= <user>
##$WDW= 1
##$XDIM= 32768
##$YMAX_p= 458205390
##$YMIN_p= -771218
##$CURPLOT= <Network HP LaserJet P1505>
##$CURPRIN= <$Network HP LaserJet P1505>
##$DFORMAT= <normdp>
##$LAYOUT= <+/1D_H.xwp>
##$LFORMAT= <normlp>
##$PFORMAT= <normpl>
##$SURQMSG= 1
$$ End of Bruker specific parameters
$$ ---------------------------------
##NTUPLES= NMR SPECTRUM
##VAR_NAME=  FREQUENCY,     SPECTRUM/REAL,   SPECTRUM/IMAG
##SYMBOL=    X,             R,               I
##VAR_TYPE=  INDEPENDENT,   DEPENDENT,       DEPENDENT
##VAR_FORM=  AFFN,          ASDF,            ASDF
##VAR_DIM=   32768,         32768,           32768
##UNITS=     HZ,            ARBITRARY UNITS, ARBITRARY UNITS
##FACTOR=    0.250966925370066, 1,           1
##FIRST=     8223.43324360095, -98860,       -14300
##LAST=      0,             -27064,          -119279
##MIN=       0,             -771218,         0
##MAX=       8223.43324360095, 458205390,    0
$$ Real data points
##PAGE= N=1
##DATA TABLE= (X++(R..R)), XYDATA
$$ [...]
19540e5104m8176a6155B37510f8470k31628g2318B75380H4516f2458k3373l13564
$$ -55104 -103280 -16155 237510 -68470 -300098 -72318 275380 84516 -62458 -85831 -399395
19529c99395a29406f2275A64018a9636p5087c826j4809r8513K7144F6351d46203
$$ -399395 -129406 -62275 164018 -19636 -94723 -3826 -18635 -117148 -90004 66351 -446203
19517a02908j24144E40628c00822i2212I2473k1822a20939N2287E1612Q2590M5965
$$ -102908 -227052 540628 -300822 -92212 92473 70651 -120939 -68652 51612 134202 180167
19506A80167d3752m3264A94186P7503E8584k7150L66480g2511J7498j54443R0622
$$ 180167 -43752 -87016 194186 271689 58584 31434 397914 -72511 -55013 -209456 -118834
19495a18834J9537j96410J19598A5909e9420b4029c601A54989a41254L9375q2047
$$ -118834 -99297 -295707 -176109 15909 -59420 -24029 -3601 154989 -141254 -101879 -183926
19484a83926H2097i7952k20985A5551a37839B529K19771c72535J24499c151H4755
$$ -183926 82097 -97952 -318937 15551 -137839 2529 222300 -372535 -248036 -3151 84755
19472b30920J07438M1620A12973J58327E2587d50157J35991d2067l09668n8137
$$ -230920 -123482 -81862 112973 271300 52587 -450157 -314166 -42067 -351735 -409872
19462d09872J78607a13708j32118A96873A2363J63370J3541C6539b26538R1221
$$ -409872 -231265 -113708 -245826 196873 12363 175733 189274 36539 -226538 -135317
19452a35317F8596e5278A23300b50460B2996K34132b31547c2226C10071k7222
$$ -135317 68596 -55278 123300 -250460 22996 257128 -231547 -32226 310071 282849
19442B82849A10740l8714k486b52449h0821O264q9660j34462p1517i6522A96045
$$ 282849 110740 72026 69540 -252449 -80821 -74557 -164217 -298679 -370196 -96522 196045
19430b58061G2144R6207m8624J0833i5709c6249l95813J25969P2284A49371b03405
$$ -258061 72144 168351 119727 130560 -95709 -36249 -432062 -306093 -233809 149371 -203405
19418b41771e7003p7789A79718d1616J7212n7517q8148c9960C5049e8632C1077
$$ -241771 -57003 -134792 179718 -41616 -24404 -81921 -170069 -39960 35049 -58632 31077
19406H2189c41542G4026g2387B7537K40026c20353a57060A05457a47580P2764
$$ 82189 -341542 74026 -72387 27537 267563 -320353 -157060 105457 -147580 -74816
19396g4816q1059A2704a79374F321a96407A04640b7291p5387A74977D4942b7660
$$ -74816 -155875 12704 -179374 6321 -196407 104640 -27291 -102678 174977 44942 -27660
19384g0544D0413P169B3320n833a44980f8939H2254Q3793J18909A8632b46667
$$ -70544 40413 47582 23320 17487 -144980 -68939 82254 166047 284956 18632 -246667
19372c65333R9210a09677D5234a74112A18183c13581H0193c02282G9502a16585
$$ -365333 -266123 -109677 45234 -174112 118183 -313581 80193 -302282 79502 -116585
19361c18227A51221f5968j94579B15680B3934g7279o1074K1402A4517M64986c84692
$$ -318227 151221 -65968 -260547 215680 23934 -77279 -138353 -116951 14517 479503 -384692
19349a99693f4598j22374e0146G6815Q1452b11448I0945c0178l649O572A47662
$$ -199693 -64598 -186972 -50146 76815 158267 -211448 90945 -30178 -33827 -27255 147662
19337a66423j16407j3825A38050a54608N6190E8998M7046J8704h6746j0672j64156
$$ -166423 -282830 -296655 138050 -154608 -98418 58998 106044 124748 -86746 -97418 -261574
19326b61574m3897C1828c5468C07485j23930a47481j20125d3386l25219A84463
$$ -261574 -305471 31828 -35468 307485 183555 -147481 -267606 -43386 -368605 184463
19315a1474A8692c2562B05485h3163l4530d4975P954k63929j6230P9086J11285
$$ -11474 18692 -32562 205485 -83163 -117693 -44975 -37021 -300950 -317180 -238094 -126809
19304a26809q990n0599B9465J06528N8922f9412o7080a1607A72523C2968a56098
$$ -126809 -135799 -186398 29465 135993 194915 -69412 -136492 -11607 172523 32968 -156098
19292c0491p6024D33795a13340b7773r7840A63018b82802P9954B95794l262e6014
$$ -30491 -106515 433795 -113340 -27773 -125613 163018 -282802 -202848 295794 292532 -56014
19280A69N382a7909j82495g5720j3359H1910b05674j32463A35265K2856h3966
$$ 169 5551 -17909 -200404 -75720 -89079 81910 -205674 -338137 135265 158121 -83966
19268A32550P7097A4377a18422e1621j7471j07544N0814E2817a08490M5908j22558
$$ 132550 209647 14377 -118422 -51621 -69092 -176636 -125822 52817 -108490 -62582 -185140
19257a85140C4593a01727j29159A26495N8807f1925p3909m3076k62945a55531
$$ -185140 34593 -101727 -230886 126495 185302 -61925 -135834 -178910 -441855 -155531
19246A96034i2431q227M8750p5314j39255A19904c37868C83156g5307j88668J04271
$$ 196034 -92431 -100658 -51908 -127222 -266477 119904 -337868 383156 -75307 -263975 -159704
19235a59704I1674k3334h2300d0736J7692l68883K3974I961N3611i212q7114A41083
$$ -159704 91674 68340 -82300 -40736 -23044 -391927 -367953 9961 63572 -9212 -96326 141083
19222g9592L4857I7613a2392l87266i2969l61266C34684b92519G2968a86656b3151
$$ -79592 -44735 97613 -12392 -399658 -92969 -454235 334684 -292519 72968 -186656 -23151
19210D2796c61005A44786e5454e565A01295c2251n44966A25036a82598E29546
$$ 42796 -361005 144786 -55454 -5565 101295 -32251 -577217 125036 -182598 529546
19199c4123D423b71548J31540A11737c77692j3766a95608i2511D1446a24006j66683
$$ -34123 4423 -271548 -140008 111737 -377692 -391458 -195608 -92511 41446 -124006 -290689
19188b90689B054a77265F0757e0882j43617I7135B085P7319q217L965h418j03888
$$ -290689 2054 -177265 60757 -50882 -194499 97135 2085 79404 71187 75152 -8418 -112306
19176a12306j8589E4808K5939l3300b17357K2110O6384H8662d3411a6492k5030
$$ -112306 -130895 54808 80747 47447 -217357 -195247 -128863 88662 -43411 -16492 -41522
19165d1522C0305b09336I1121R7741A5503g095j74565m0371j4547k42493B41165
$$ -41522 30305 -209336 91121 188862 15503 -7095 -181660 -222031 -236578 -479071 241165
19153a06769C16842j43073a16262D21438B5876P9669C8484b05772j63032h4821
$$ -106769 316842 173769 -116262 421438 25876 105545 38484 -205772 -368804 -84821
19142h2282r9070j57766e7741A32371a3368A15412a54632l77553a23226M5392
$$ -82282 -181352 -339118 -57741 132371 -13368 115412 -154632 -532185 -123226 -77834
19132g7834j3524d3865F1010a53059j7319J1466L4473A60306b28001R7449D36745
$$ -77834 -91358 -43865 61010 -153059 -170378 -158912 -124439 160306 -228001 -130552 436745
19120f839j34572O7617a0245B9241N3615k3328K65401A02014C6081q556K86640
$$ -6839 -141411 -73794 -10245 29241 82856 59528 324929 102014 36081 27525 314165
19109C14165b85344g0468j71635C0375M1197J67544b58186b3093j03384N649p2010
$$ 314165 -285344 -70468 -242103 30375 71572 239116 -258186 -23093 -126477 -120828 -192838
19098a92838I0761J07849a84188j01659h9932m2303I6634d3187k27528R9289A14870
$$ -192838 90761 198610 -184188 -285847 -89932 -132235 96634 -43187 -270715 -171426 114870
19086b23614a0694B48801G2435a42238c8070k2874j58345b1216N552q8275l3171
$$ -223614 -10694 248801 72435 -142238 -38070 -60944 -219289 -21216 -15664 -103939 -137110
19075a37110l1428k76873a15181G3641b18123B2517J83525K0304r6088b49749
$$ -137110 -168538 -445411 -115181 73641 -218123 22517 206042 226346 130258 -249749
19064g2764B26924a09473j15166P6984A6240M1553c7417B0429K7871d4108p0651
$$ -72764 226924 -109473 -224639 -147655 16240 57793 -37417 20429 48300 -44108 -114759
19053a14759F8772c2548l14339E0169a79220c269A17986A3719J06495i1488A47321
$$ -114759 68772 -32548 -346887 50169 -179220 -3269 117986 13719 120214 -91488 147321
19041a06616B1672c2554k35708Q2957j11501J36622P2803E457a85406D6073M4178
$$ -106616 21672 -32554 -268262 -185305 -296806 -160184 -87381 5457 -185406 46073 90251
19030I0251a29726n2342B17605a74011P9900A1131i6808g518A67060n1305a34503
$$ 90251 -129726 -182068 217605 -174011 -94111 11131 -96808 -7518 167060 115755 -134503
19018g8077j55028p578J20118k1358m6205f8012j86960A85869H7099D2653f6250
$$ -78077 -233105 -240683 -120565 -141923 -188128 -68012 -254972 185869 87099 42653 -66250
19006A24681E5747N2400N7938A1445b8790r8578B83776i4596b7430k66406R0981
$$ 124681 55747 108147 166085 11445 -28790 -127368 283776 -94596 -27430 -293836 -202855
18995b02855B1935J36155h4347j05754A60598J3997j9224J7378a78324k36743
$$ -202855 21935 158090 -84347 -190101 160598 174595 155371 172749 -178324 -415067
18985d15067E7957h8835E9078B6369b79089I3767B7264a01150D32720A33804d4489
$$ -415067 57957 -88835 59078 26369 -279089 93767 27264 -101150 432720 133804 -44489
18973f0402D5641J10348a98986G1817i9270m3393k26478A39487a82948d8663J1971
$$ -60402 45641 155989 -198986 71817 -99270 -142663 -369141 139487 -182948 -48663 -36692
18962c6692I9463D4201a54353d499j16281j8303j75619A77472q3376b0540k42148
$$ -36692 99463 44201 -154353 -4499 -120780 -139083 -314702 177472 94096 -20540 -262688
18951b62688N6061h2472G8913c0041A51918d01180A49851d82833A6677R9596A9232
$$ -262688 -206627 -82472 78913 -30041 151918 -401180 149851 -482833 16677 116273 19232
18939c92553c9945a2341j84396O2154j0580I3129i3306j18199a4048o1827j83532
$$ -392553 -39945 -12341 -196737 -134583 -145163 93129 -93306 -211505 -14048 -75875 -259407
18928b59407a23100J2250p435n7330j9552R3545R423L8642A15450a42999M3503
$$ -259407 -123100 -110850 -118285 -175615 -195167 -101622 -92199 -53557 115450 -142999 -99496
18917i9496C6075K6651c05837n2168I258M7308P4392D6390R2035g6902q6986f7284
$$ -99496 36075 62726 -305837 -358005 9258 56566 130958 46390 138425 -76902 -163888 -67284
18904a05217J9359k39286a17463C3043g1686j65826B0447M2097B0603Q839a24216
$$ -105217 -85858 -325144 -117463 33043 -71686 -237512 20447 62544 20603 29442 -124216
18892G1508d88715a72119G8594h5303A4791N7146K37267O391i4732A29035a87280
$$ 71508 -488715 -172119 78594 -85303 14791 71937 309204 315595 -94732 129035 -187280
18880B38765a76223e7638a585k9623j00580j793B635b39868J04488A27459d0985
$$ 238765 -176223 -57638 -1585 -31208 -131788 -133581 2635 -239868 -135380 127459 -40985
18868A50415a09558A34185J1198b29444o0622e0021o0143B72453F1967k7157i1788
$$ 150415 -109558 134185 145383 -229444 -290066 -50021 -110164 272453 61967 34810 -91788
18856b31942Q7404j41511J37237E30185A87359b1074R786q631l24049a27757A09135
$$ -231942 -144538 -286049 -148812 530185 187359 -21074 -11288 -19919 -343968 -127757 109135
18844a47242j13898B54950k6586m9015a16367F5808p805N1464E0849b91938B03376
$$ -147242 -261140 254950 228364 179349 -116367 65808 58003 109467 50849 -291938 203376
18832B45768a14307K0287B282R6508a63508g9202l12984A54381b19276g0686M875
$$ 245768 -114307 -94020 2282 98790 -163508 -79202 -392186 154381 -219276 -70686 -65811
18821f5811A4178K84815F4787g5852d586k37953b243B39191a6971E4401P6436
$$ -65811 14178 298993 64787 -75852 -4586 -242539 -2243 239191 -16971 54401 130837
18810A30837b89018h2766e032A34852n6810R8089l0858o0346K8110C1929M5902
$$ 130837 -289018 -82766 -5032 134852 78042 176131 145273 84927 113037 31929 77831
18799G7831L3710N964K5449J20800I4726j3859a39823E2616K22978a09290B82528
$$ 77831 111541 117505 142954 263754 94726 80867 -139823 52616 275594 -109290 282528
18787A79242O3817d66682A7941b43807J05974L169I3669b20116B34992q4565e2696
$$ 179242 243059 -466682 17941 -243807 -137833 -134664 93669 -220116 234992 150427 -52696
18775G330g0665A59605b61676C8783a18850B29191b33592j53506F4748d8684b1950
$$ 7330 -70665 159605 -261676 38783 -118850 229191 -233592 -387098 64748 -48684 -21950
18763A66120G637O5880F850c8456k18099j57133e5161p3498A42353J5808g0259
$$ 166120 7637 73517 6850 -38456 -256555 -413688 -55161 -128659 142353 158161 -70259
18751b36820b6975l8365j62255a1555p1381n8320k01382H2044A3292d01301J74654
$$ -236820 -26975 -65340 -227595 -11555 -82936 -141256 -342638 82044 13292 -401301 -226647
18740b26647Q5515q4518I4574b70519j05243R0045B1264a67394q6201D3494G673
$$ -226647 -141132 -225650 94574 -270519 -375762 -285717 21264 -167394 -253595 43494 7673
18728A98116a92617m6790c0128D02207b14200F3741b12125G1570b48548L0319
$$ 198116 -192617 -239407 -30128 402207 -214200 63741 -212125 71570 -248548 -218229
18718b18229B7710J5934L55662b32827g3529j13377J6508N2191c4172k97658g6899
$$ -218229 27710 43644 399306 -232827 -73529 -186906 -170398 -118207 -34172 -331830 -76899
18706b85182o7688d9731j82328N6751f7983C02340a61967A33694K3241a72072
$$ -285182 -352870 -49731 -232059 -175308 -67983 302340 -161967 133694 156935 -172072
18695c1093F4333j7685P9202a17560A33877h3239A24854a88897C4559g728C6785
$$ -31093 64333 46648 125850 -117560 133877 -83239 124854 -188897 34559 -7728 36785
18683C3175K0863c1893j47791c123B976i8339B07585l2145J77715A2223K8946
$$ 33175 54038 -31893 -179684 -3123 2976 -98339 207585 175440 353155 12223 41169
18672D1169K1685c03619j94608I6433L4698C7014i5666A03773l3190J90152h951
$$ 41169 62854 -303619 -498227 96433 131131 37014 -95666 103773 70583 260735 -8951
18660I2858J9006K0125c78745J64666A29627e4437l15635H9706A8524c09909k6659
$$ 92858 111864 131989 -378745 -214079 129627 -54437 -370072 89706 18524 -309909 -336568
18649c36568a39061D38084f407m85191b00580K2092E1061e8322B0959M8532K3083
$$ -336568 -139061 438084 -6407 -491598 -200580 -178488 51061 -58322 20959 69491 92574
18638I2574a16649A08510b3250B6888L6500b48427k46927O0805J21039E5528c9450
$$ 92574 -116649 108510 -23250 26888 63388 -248427 -495354 -434549 -313510 55528 -39450
18626a04943k37538a08210J2743l3603F1552A7022K51477h7132A5502f5922B6653
$$ -104943 -342481 -108210 -95467 -129070 61552 17022 268499 -87132 15502 -65922 26653
18614i6959H0360d8499D1361J06336j6344a54964B6111a62664A38010F3352J63119
$$ -96959 80360 -48499 41361 147697 131353 -154964 26111 -162664 138010 63352 226471
18603B26471b09569B05953P8352c9172I124g7257A96806c7569J5763B46865a1613
$$ 226471 -209569 205953 284305 -39172 9124 -77257 196806 -37569 -21806 246865 -11613
18591c39490A01259D6618b48798g5806A21272g4505j40448i9295j03543b1666
$$ -339490 101259 46618 -248798 -75806 121272 -74505 -214953 -99295 -202838 -21666
18580e4539q9423G1784b23937B57621c4300D8065c7671J2031C4375c50624D8363
$$ -54539 -143962 71784 -223937 257621 -34300 48065 -37671 -25640 34375 -350624 48363
18568b97188J17772a2654n03642E15630b0108E1351h2556F4303b23600E6875j2815
$$ -297188 -179416 -12654 -516296 515630 -20108 51351 -82556 64303 -223600 56875 44060
18557D4060a41720j17929J24474F0944a8500B51312b50827A88860c0247k01317
$$ 44060 -141720 -259649 -135175 60944 -18500 251312 -250827 188860 -30247 -231564
18547b31564g5610F8722k6510a8337A07103c8797B0801g754k78883D9534J84521
$$ -231564 -75610 68722 42212 -18337 107103 -38797 20801 -7754 -286637 49534 234055
18536B34055G6491K0627a75130o0991c3972c490A67643b89504J39179j29985A60286
$$ 234055 76491 97118 -175130 -236121 -33972 -3490 167643 -289504 -150325 -280310 160286
18524b16824E3071b25464j04444J27572D2943O1521b22457K1770R018A46334d725
$$ -216824 53071 -225464 -329908 -202336 42943 104464 -222457 -200687 -191669 146334 -4725
18512a21479H3791b22568F8234a02882j3335k4828F1846L00697a46835L9749r8260
$$ -121479 83791 -222568 68234 -102882 -116217 -141045 61846 362543 -146835 -107086 -205346
18501b05346h7470j14144f1242l04364B59062b64934A73576b53630R5425j30602
$$ -205346 -87470 -201614 -61242 -365606 259062 -264934 173576 -253630 -158205 -288807
18491b88807B52765i2255j23161A10461l4586e5249j363B75511F5408J15613a31750
$$ -288807 252765 -92255 -215416 110461 75875 -55249 -56612 275511 65408 181021 -131750
18479b1006j80891M7018L6482A78963b1666j86781O0692e3768a3572j41678O1551
$$ -21006 -201897 -154879 -118397 178963 -21666 -208447 -147755 -53768 -13572 -155250 -93699
18468i3699A6629b44528g695r112j40426B5217N0375a45016M8098I095c61802
$$ -93699 16629 -244528 -7695 -16807 -157233 25217 75592 -145016 -96918 9095 -361802
18456c65120D4164a94936b3514I921O3629e8453a4638H8722c09654I3321C395
$$ -365120 44164 -194936 -23514 9921 73550 -58453 -14638 88722 -309654 93321 3395
18444a65692O6215b7598B10654c7807j2056j92529a09191j1642A60969f7695b6374
$$ -165692 -99477 -27598 210654 -37807 -49863 -242392 -109191 -120833 160969 -67695 -26374
18432A55558b31384C63656C0406J01715R5276G6834g732C36784b11922e6645l7252
$$ 155558 -231384 363656 30406 132121 227397 76834 -7732 336784 -211922 -56645 -93897
18421i3897o3776a5148k20642F0037a64923G2271b68714g4171G4718a82423B14883
$$ -93897 -157673 -15148 -235790 60037 -164923 72271 -268714 -74171 74718 -182423 214883
18409G9121P3242a37839l3069E5479b4793B5488e996F8712N3280i1231j4967g132
$$ 79121 152363 -137839 -170908 55479 -24793 25488 -5996 68712 121992 -91231 -106198 -7132
18396b02548o2739e7698A87303b02529C13448H0969J93883b09936H7643b39122
$$ -202548 -265287 -57698 187303 -202529 313448 80969 274852 -209936 87643 -239122
18385d6384C1833c20309a6788o9809j0982C00769a60305D8034k2282E469a97871
$$ -46384 31833 -320309 -16788 -86597 -97579 300769 -160305 48034 25752 5469 -197871
18373E7865b99547g5348p3693J3331f6041j31089j14693b8418k79847A06273a22198
$$ 57865 -299547 -75348 -149041 -135710 -66041 -197130 -311823 -28418 -308265 106273 -122198
18361a00469D8967K66046h7278H5380o516B4516e53781B20100f708A63778f1745
$$ -100469 48967 315013 -87278 85380 78864 24516 -553781 220100 -6708 163778 -61745
18349g83k37058a4727E5706F042R4714b5402j52636P7311p8592B9168d49968g6194
$$ -783 -237841 -14727 55706 6042 100756 -25402 -178038 -100727 -179319 29168 -449968 -76194
18336i4260G8688a30826B9302M0898J03900B7988Q5563i8365B56956b5015E9744
$$ -94260 78688 -130826 29302 70200 174100 27988 113551 -98365 256956 -25015 59744
18324B21637b1966A68286A2438f9096G7999c23870P1909B25709a45743A38441
$$ 221637 -21966 168286 12438 -69096 77999 -323870 -251961 225709 -145743 138441
18313f6300p7400k47318C07679a21059j50735j7522a10784k20006a49855A2107
$$ -66300 -143700 -391018 307679 -121059 -271794 -289316 -110784 -330790 -149855 12107
18302A86992J62043A31977c6182G3219K12181A9476a99190N8299j61489H8745
$$ 186992 349035 131977 -36182 73219 285400 19476 -199190 -140891 -302380 88745
18291e5769A704R1463e16984g7700L7857j16215j81004C86995e5500j05352c8359
$$ -55769 1704 93167 -516984 -77700 -39843 -156058 -337062 386995 -55500 -160852 -38359
18279D40912a65938N6353K7760a2511k13668A63680a03881A98796G3023a76343
$$ 440912 -165938 -109585 -81825 -12511 -226179 163680 -103881 198796 73023 -176343
18268A77406b757j82261h1974j04056q7976F8448h581p5974j89890A57650c11378
$$ 177406 -2757 -185018 -81974 -186030 -274006 68448 -8581 -84555 -274445 157650 -311378
18256I5092b40122C8290a73349F2331J04346b5887n4773o0121I2222M66415B9692
$$ 95092 -240122 38290 -173349 62331 166677 -25887 -80660 -140781 92222 558637 29692
18244I742J4654a75499c3153j67674A51595o9035i6938j55192H6300b49970h2617
$$ 9742 24396 -175499 -33153 -200827 151595 82560 -96938 -252130 86300 -249970 -82617
18232A12407R704l815l3819a34350l6674A21093j7711e6050C9242N9171c82537
$$ 112407 122111 118296 84477 -134350 -171024 121093 103382 -56050 39242 98413 -382537
18220D4871h9340I8850K97963a56301E1384c86607E2181O3943a75261Q3935B1497
$$ 44871 -89340 98850 396813 -156301 51384 -386607 52181 116124 -175261 -91326 21497
18208a07521I8628b82884l1997B60270D6632P459g1819A60564c52941R2416I388
$$ -107521 98628 -282884 -314881 260270 46632 54091 -71819 160564 -352941 -260525 9388
18196A65548m0719N8143b59075D8380a37996O5681k41273i9040k758C155P8126
$$ 165548 124829 182972 -259075 48380 -137996 -72315 -313588 -99040 -101798 3155 81281
18185H1281I796K85388c18841F854a22282b5479D3448L0697e5611A0590a49774
$$ 81281 9796 295184 -318841 6854 -122282 -25479 43448 74145 -55611 10590 -149774
18173a94759j3731A8247f8307K2389A1598a5924m85542B09608b63312N4382F4615
$$ -194759 -208490 18247 -68307 -45918 11598 -15924 -501466 209608 -263312 -208930 64615
18161a3599n4512B99837r528d083A03153a36694G7214K90960a66026B3073a61673
$$ -13599 -68111 299837 290309 -4083 103153 -136694 77214 368174 -166026 23073 -161673
18149E9176e4637k16816Q9302A15514J15081a95791d0113D1551K4412e0321A60297
$$ 59176 -54637 -271453 -182151 115514 230595 -195791 -40113 41551 65963 -50321 160297
18137c83165J64841g8607A416b41053A92100c2927j11997A07785a81196A69830
$$ -383165 -218324 -78607 1416 -241053 192100 -32927 -144924 107785 -181196 169830
18126g502A6508d41609r189D3782b6652j70035B277K13811C17c60446a19013A25734
$$ -7502 16508 -441609 -450798 43782 -26652 -196687 2277 216088 317 -360446 -119013 125734
18113b3164l10699b2845k24056A08993J14847k9245a83658G7559J5022A4229d34954
$$ -23164 -333863 -22845 -246901 108993 223840 194595 -183658 77559 92581 14229 -434954
18101f8767l6585m0711B14189D5865b98354i8399d0431j68812i2170B03815j5311
$$ -68767 -105352 -146063 214189 45865 -298354 -98399 -40431 -209243 -92170 203815 188504
18090A88504b85655a19591j10502Q7431e7711B70906D3431j8757i8941n9194C12170
$$ 188504 -285655 -119591 -230093 -142662 -57711 270906 43431 24674 -98941 -158135 312170
18078B01K09127A7476L01733A37a30034A24141h6087r6209m9458B9772a34464
$$ 201 209328 17476 319209 137 -130034 124141 -86087 -182296 -231754 29772 -134464
18066c49862f1935a5439C07357I2857L65361k24621K53360I1652f1352B05896
$$ -349862 -61935 -15439 307357 92857 458218 233597 486957 91652 -61352 205896
18055F7677g230j04215D4431K70027a88855p4445E4870k27a31174c0288j7003
$$ 67677 -7230 -111445 44431 314458 -188855 -263300 54870 54643 -131174 -30288 -47291
18044d7291A84048d281D370a80377N8307D0263J51872P5667e7072K2680j16093
$$ -47291 184048 -4281 4370 -180377 -122070 40263 192135 267802 -57072 -34392 -150485
18033a50485m3G0516K54149B7712g2908b3535B1834b21596A20726b21374o8497
$$ -150485 -150528 70516 324665 27712 -72908 -23535 21834 -221596 120726 -221374 -289871
18022b89871n4159B78368A4663a01634l29701C1239a21076k86826J05423d0117
$$ -289871 -344030 278368 14663 -101634 -431335 31239 -121076 -407902 -302479 -40117
18011a7237H4182J20438a02704q4903D5823d8162B78377a318E3459P4519c5700
$$ -17237 84182 204620 -102704 -187607 45823 -48162 278377 -1318 53459 127978 -35700
17999a57269M1466B8675g3578C6527a83578j17259a47607j16179B31957j02906
$$ -157269 -115803 28675 -73578 36527 -183578 -300837 -147607 -263786 231957 129051
17989A29051d0642n6420c6422j0456A79565C4728K47442a03392Q247C3579O6650
$$ 129051 -40642 -97062 -36422 -46878 179565 34728 282170 -103392 -95145 33579 100229
17978A00229Q3121b20409b3103F8330b7353m85344A26650i9406B2133M3244E996
$$ 100229 183350 -220409 -23103 68330 -27353 -512697 126650 -99406 22133 65377 5996
17966a46453b7703B39377a89051D15271r2464B4510d0390m6647o5032A07756a975
$$ -146453 -27703 239377 -189051 415271 322807 24510 -40390 -87037 -152069 107756 -1975
17954D1803J86440g5572A99802P7428a28477f2719c0383k4882k49930a50203m344
$$ 41803 228243 -75572 199802 277230 -128477 -62719 -30383 -55265 -305195 -150203 -154547
17943a54547A82339a2001r3260d3779D755a94023H8213e3415n0844c7731j19781
$$ -154547 182339 -12001 -105261 -43779 4755 -194023 88213 -53415 -104259 -37731 -157512
17932a57512E2348L3687a04267d4658n4827B29945a45885m0867b6838n0918B6043
$$ -157512 52348 86035 -104267 -44658 -99485 229945 -145885 -186752 -26838 -77756 26043
17920A60993e9989D948K20489b04657d8861B12051m8725b33119L5415A96208M4923
$$ 160993 -59989 4948 225437 -204657 -48861 212051 163326 -233119 -197704 196208 241131
17909B41131L1894c81935E0488a2264B8189M1231d34897d9189k10267L4748j35784
$$ 241131 273025 -381935 50488 -12264 28189 69420 -434897 -49189 -259456 -224708 -360492
17898c60492J63709q9564b3045E8863J44577D9770J15708i9192B29047p0135l3620
$$ -360492 -196783 -286347 -23045 58863 203440 49770 165478 -99192 229047 158912 125292
17887A25292J35310E3452J16730d0208o7642A48229c1129B31697J50946D3977
$$ 125292 260602 53452 170182 -40208 -107850 148229 -31129 231697 382643 43977
17876A88804c4474k4286F2132B6173a71889A19468a06775d4610M471j67443H7292
$$ 188804 -34474 -58760 62132 26173 -171889 119468 -106775 -44610 -40139 -207582 87292
17864C4534a76137A04434Q3391a78781c6086j1728A64219F3140J78558E2012b16694
$$ 34534 -176137 104434 187825 -178781 -36086 -47814 164219 63140 241698 52012 -216694
17852i0285q0353A74407A456J93318h4060B60978f7041E9434d7036B4319O6189
$$ -90285 -170638 174407 1456 194774 -84060 260978 -67041 59434 -47036 24319 90508
17841I0508K573a42835D6540n315K3844M0544d2429F4402K22935L095h4707k02675
$$ 90508 93081 -142835 46540 41225 65069 105613 -42429 64402 287337 290432 -84707 -287382
17829b87382C75705c7241A12865J79071d51762a42341p0055a0737G0902A0550
$$ -287382 375705 -37241 112865 291936 -451762 -142341 -212396 -10737 70902 10550
17818F2326K64648A13381A7106a91209m7178F7009a71568E1317J33867e1959k00879
$$ 62326 326974 113381 17106 -191209 -238387 67009 -171568 51317 185184 -51959 -252838
17807b52838F0417A636N25095A11110J0133g8527j06134j38309A320c81646D32706
$$ -252838 60417 1636 526731 111110 121243 -78527 -184661 -322970 1320 -381646 432706
17795a68694E1218J92523d9523A28589k0857i9770k09682A98854I3635g7103q0490
$$ -168694 51218 243741 -49523 128589 107732 -99770 -309452 198854 93635 -77103 -157593
17784a57593A62080R3840F7969M3009K78315a45877I2116d7537k92314g4815I9418
$$ -157593 162080 255920 67969 110978 389293 -145877 92116 -47537 -339851 -74815 99418
17772A41156K83965a9682D8879J33205b63574B06961b35768i3832H5661f1153
$$ 141156 425121 -19682 48879 182084 -263574 206961 -235768 -93832 85661 -61153
17761f6891A34989c15077A15697g1576r5911e7938H1049J73374d8219F685c8691
$$ -66891 134989 -315077 115697 -71576 -167487 -57938 81049 254423 -48219 6685 -38691
17749e9846C0272f0496K5234D9393i1832j9333I4166h1419j40696D43564A01157
$$ -59846 30272 -60496 -35262 49393 -91832 -111165 94166 -81419 -222115 443564 101157
17737E1318a347E9507Q1121K19898h4380j59679B04805H9731J34211a41724m4053
$$ 51318 -1347 59507 140628 360526 -84380 -244059 204805 89731 223942 -141724 -185777
17726a85777A65231f8740A1665M1858a33275r6640C9006b70037A76427E999b2696
$$ -185777 165231 -68740 11665 53523 -133275 -229915 39006 -270037 176427 5999 -22696
17714A74460c5723A02433e1122k13842A04067J58896c9856k30018A8013J09705
$$ 174460 -35723 102433 -51122 -264964 104067 262963 -39856 -269874 18013 127718
17704A27718h4877H4484a3945A27999L6384a4192j28817c5736B90676C120K65183
$$ 127718 -84877 84484 -13945 127999 164383 -14192 -143009 -35736 290676 3120 268303
17693B68303c22709f470B13616j6010o2732J80605a47698d5087A8470M1713c84171
$$ 268303 -322709 -6470 213616 197606 134874 315479 -147698 -45087 18470 60183 -384171
17681D45039B5204K61831d321E3668f9652A5828Q7373R6641f0684B69929a3522
$$ 445039 25204 287035 -4321 53668 -69652 15828 103201 199842 -60684 269929 -13522
17669a07677I4790J22722a05879b0138B65071a53253E1899N347b53294J12844
$$ -107677 94790 217512 -105879 -20138 265071 -153253 51899 57246 -253294 -140450
17659a40450M5202L1716A72606L445e0161j23603A86159a44225f7290r5505L4311
$$ -140450 -95248 -63532 172606 176051 -50161 -173764 186159 -144225 -67290 -162795 -128484
17648a28484A41820N9596a96039A09162J501L4341h1086A64083L9953a33723C32911
$$ -128484 141820 201416 -196039 109162 110663 145004 -81086 164083 204036 -133723 332911
17636A13439b87663a03811A97620m0661h4688H7082b44774g8908k64443c1440
$$ 113439 -287663 -103811 197620 156959 -84688 87082 -244774 -78908 -343351 -31440
17625a38742E8522b104B3977a69172A02241D5386h066k78131d5557D53994a46553
$$ -138742 58522 -2104 23977 -169172 102241 45386 -8066 -286197 -45557 453994 -146553
17613G5393K1814O5223J28930b68299e4407j35221A94421b47073N0857F36003
$$ 75393 97207 162430 291360 -268299 -54407 -189628 194421 -247073 -196216 636003
17602A7708J55488d9796j66184A596K83509e3566A43147b03863E9562J3751J39602
$$ 17708 173196 -49796 -215980 1596 285105 -53566 143147 -203863 59562 73313 212915
17591B12915d8795B09569E5789K56486C3419L84675a11410C00849h4808o1593
$$ 212915 -48795 209569 55789 312275 33419 418094 -111410 300849 -84808 -146401
17581a46401g0617F5537b87728A12093e6626A25303J79645C3801J04323B8011
$$ -146401 -70617 65537 -287728 112093 -56626 125303 304948 33801 138124 28011
17570D7536a18379B92082a15707j48510G2438N1883A7405a72968C74636j50634
$$ 47536 -118379 292082 -115707 -264217 72438 124321 17405 -172968 374636 224002
17560B24002c302C45506o3923m8312k4021A00359a0158D1209j5177a8999k15479
$$ 224002 -3302 345506 281583 233271 209250 100359 -10158 41209 26032 -18999 -234478
17549b34478B10150j3465d764m6268D48249A47871c3539A45090J26151B7613a51747
$$ -234478 210150 196685 -4764 -51032 448249 147871 -33539 145090 271241 27613 -151747
17537D9483J09061K65488A36616f4253A90190L7019n3647l1698p0781J26570H4647
$$ 49483 158544 424032 136616 -64253 190190 227209 173562 141864 71083 197653 84647
17525c4461a1099A06460M81220a14892K2419A64811A0135d4936A40851L2414i8348
$$ -34461 -11099 106460 587680 -114892 -92473 164811 10135 -44936 140851 173265 -98348
17513B75495D0533p242g6619k700B67492J55185A11746Q8325h068o7204A91692
$$ 275495 40533 33291 -76619 -79319 267492 422677 111746 200071 -8068 -75272 191692
17501h8652k22712J50983c3331G1807k5317K50184r0716e6393N405j20768K4778
$$ -88652 -311364 -160381 -33331 71807 46490 296674 205958 -56393 -50988 -171756 -146978
17490a46978C53263A22773q210K35587r5229L6389l4103a790B74659G1783L4245
$$ -146978 353263 122773 114563 350150 254921 291310 257207 -1790 274659 71783 106028
17479A06028d534A66496J78525A08174b80320B96304a81060E55386A88190K0395
$$ 106028 -4534 166496 345021 108174 -280320 296304 -181060 555386 188190 208585
17469B08585E1933P117B0072J91707q270B6298h3920B16427h5340C85955A39919
$$ 208585 51933 59050 20072 211779 203509 26298 -83920 216427 -85340 385955 139919
17457f2481A92870e9472j06056e2845B23063o9649a27865f061H2306J40372a23918
$$ -62481 192870 -59472 -165528 -52845 223063 153414 -127865 -6061 82306 222678 -123918
17445E1674a49854O5494B07791K11926A05331O236J10314M2674J63273j42893
$$ 51674 -149854 -84360 207791 419717 105331 111567 221881 264555 427828 284935
17435B84935k6715H3468M73787A15667J08402F1797M47313k50247O173J80132
$$ 284935 258220 83468 557255 115667 224069 61797 509110 258863 265036 445168
17425D45168A56163L24291A4887N32225m9842k07939J3516L50606I8041L46401
$$ 445168 156163 480454 14887 547112 497270 289331 302847 653453 98041 444442
17415D44442B18049B7511L36134k421j60551J12701K61456A98251J9421b2337
$$ 444442 218049 27511 363645 361224 200673 313374 574830 198251 217672 -22337
17404B77777R865n9684K5300C8221K47292N3953h3120B91656J65894C5210L56176
$$ 277777 287642 227958 253258 38221 285513 339466 -83120 291656 457550 35210 391386
17393C91386j70934l6385r663Q3626b8011B37506g5811G5967C7516K016a6959
$$ 391386 220452 184067 174404 258030 -28011 237506 -75811 75967 37516 39532 -16959
17381a44508C95263F5121J59254I7028J19277M1369m5853L06393L3584g454C80411
$$ -144508 395263 65121 224375 97028 216305 257674 211821 518214 551798 -7454 380411
17369C71248A9975L39584J82657a28934A57380B8649e3070B17936p8081a30875
$$ 371248 19975 359559 542216 -128934 157380 28649 -53070 217936 139855 -130875
17358B881P0303K847e1459p512H162J98173A02852a92093A45032M43925A71652
$$ 2881 73184 76031 -51459 -58971 8162 206335 102852 -192093 145032 588957 171652
17346A84517b4041B54360J18835b1006C53072A32706J49004J39961H9377M72804
$$ 184517 -24041 254360 373195 -21006 353072 132706 281710 421671 89377 562181
17336E62181A59891Q1702C1811M2713r77M0857k0696P9376K49709j72427J22284
$$ 562181 159891 241593 31811 74524 73547 114404 93708 173084 422793 250366 372650
17325C72650j53187K0336H3338a59321C49533j29143K67782j06111A50411a57414
$$ 372650 219463 239799 83338 -159321 349533 220390 488172 382061 150411 -157414
17314C21285O0953J74980k40215i8954D01021a6032j66579A93197b6059J2172
$$ 321285 382238 557218 317003 -98954 401021 -16032 -182611 193197 -26059 -13887
17304a3887C70207a36189C5837J17610H151L01598l0339o2068q8754A0854M4701
$$ -13887 370207 -136189 35837 153447 8151 309749 279410 217342 128588 10854 55555
17293E5555a04103A96702C6303M5772L408l9375N4177M15902A20515K53945A65881
$$ 55555 -104103 196702 36303 82075 85483 46108 100285 516187 120515 374460 165881
17281D394J77474L82850h0793A02615O1066E3520O584J81224b3138j1295j7070
$$ 4394 181868 564718 -80793 102615 163681 53520 60104 241328 -23138 -34433 -51503
17270e1503K0310H7728b6214j68254C99190r6228Q2119Q1767B28789P7609A34416
$$ -51503 -31193 87728 -26214 -194468 399190 302962 385081 466848 228789 306398 134416
17258G7784a89556A02958L0657L78951h8502e154B48095q929n6169O6177H7305
$$ 77784 -189556 102958 133615 512566 -88502 -5154 248095 239166 182997 249174 87305
17246a89513B51406n807m0710e9491D08347p427E4641L07075a00647d9909C76041
$$ -189513 251406 245599 204889 -59491 408347 400920 54641 361716 -100647 -49909 376041
17234B64827F7977K46468e771A08276a45212I3877L07596j71377L08042r1905
$$ 264827 67977 314445 -5771 108276 -145212 93877 401473 230096 538138 446233
17224D46233j63940H2335K68441A55186J826Q5605N839k3212l0126l4161P9624
$$ 446233 282293 82335 350776 155186 157012 242617 248456 225244 195118 160957 240581
17213B40581O5561L2389E0774Q8548K53097l7406O0762j85317M48341C5644b7619
$$ 240581 306142 338531 50774 139322 392419 355013 415775 230458 678799 35644 -27619
17201E15396C4680J21555J89890A54881R9762K11896A33724K40107m0891d3793
$$ 515396 34680 156235 346125 154881 254643 466539 133724 373831 332940 -43793
17190I3981L8621l1359r958l0082P3418L31965A51732h7325D62918F9098K77804
$$ 93981 132602 101243 91285 61203 134621 466586 151732 -87325 462918 69098 346902
17179C46902o1061N5731J52930A5256K60243E0713M9386K40366P6194L2720j80733
$$ 346902 285841 341572 494502 15256 275499 50713 100099 340465 416659 449379 268646
17168B68646p0908q5914K67099j6320d936E97715k07118l0925j41896P4245A16325
$$ 268646 197738 111824 378923 362603 -4936 597715 390597 359672 217776 292021 116325
17156B97785A07870l4223R8349K06695a40898a8034D56826j37463I9987J17077
$$ 297785 107870 73647 171996 378691 -140898 -18034 456826 319363 99987 217064
17146B17064b6347H4052M31227A70721k9107L01236j27661G0358N20675B09859
$$ 217064 -26347 84052 515279 170721 141614 442850 315189 70358 591033 209859
17135B02663M69176k38176B359M46953j47661j09595K65164j98128P6187J6052
$$ 202663 671839 433663 2359 449312 301651 192056 457220 259092 335279 351331
17125C51331j60320J08089Q1744M00161l80680I7878N04749l1171B68187J4190
$$ 351331 191011 299100 380844 781005 400325 97878 602627 571456 268187 282377
17115B82377o8663P6197l675A35402J69766j08831L23868j52730j48532J14444
$$ 282377 213714 289911 286236 135402 305168 196337 520205 367475 218943 333387
17105C33387J42470k37502Q5519J30518L7703A49965Q4755K49393j02569j86748
$$ 333387 475857 238355 323874 454392 492095 149965 234720 484113 381544 194796
17095A94796M76891k94536J04695j43475l4468K34507L36928k84552k38187J2427
$$ 194796 671687 377151 481846 338371 303903 538410 875338 590786 352599 365026
17085C65026J90291j67588J54471j06289P6635j82503h918E03466B49475K51960
$$ 365026 555317 387729 542200 435911 512546 330043 -8918 503466 249475 501435
17075E01435j40267N3512m0993L7453k5133M0759Q767N629J87940r3112k09649
$$ 501435 361168 414680 373687 411140 386007 426766 435533 441162 629102 535990 326341
17064C26341K36331k34325m5074J99490B34980K66762M2633j74491L51076k78577
$$ 326341 562672 328347 283273 482763 234980 501742 544375 369884 720960 442383
17054D42383k15747K79650l7678k30557N09186j37563j20814J75980j21572j66132
$$ 442383 226636 506286 468608 238051 747237 609674 488860 664840 543268 377136
17044C77136J8977j39680N71377D05888J23193L01792l12675r164r2493j95492
$$ 377136 396113 256433 827810 405888 529081 830873 518198 509034 416541 221049
17034B21049M04294j59327K03281q7749l180Q9835k70021R2667J09451j81447
$$ 221049 625343 466016 669297 581548 578368 668203 398182 490849 600300 418853
17024D18853K78074J15879l81614N8365l2979K48421r2001J22870R9910r6459
$$ 418853 696927 812806 431192 489557 456578 704999 612998 735868 835778 739319
17014G39319M12991D95959J74590B14029L19983Q4637K55471k54750J22568M9081
$$ 739319 1152310 495959 670549 214029 534012 618649 874120 619370 741938 791019
17004G91019M9034j82965o3451L62549O3231k13246l32681M65276k33039L8305
$$ 791019 840053 657088 593637 956186 1019417 806171 473490 938766 705727 744032
16994G44032Q7703k55043K62155o1674k99359L49153k02077O9315M06922l62495
$$ 744032 831735 576692 838847 777173 477814 826967 624890 694205 1101127 738632
16984G38632N2007k32307J78588J80519M6360l02669J13766p8785l0242j7885
$$ 738632 790639 558332 736920 917439 963799 661130 774896 696111 665869 647984
16974F47984K80275m2256k87388m3093L92576L8802K984j46343J3767p4549j80801
$$ 647984 928259 886003 598615 555522 948098 986900 989884 843541 857308 782759 601958
16963F01958J34686K31601J35125k47102j76457L51026m01209J28198J63541m3942
$$ 601958 736644 968245 1103370 856268 679811 1030837 629628 757826 921367 877425
16953H77425m8196K76712k30515r7318K19497J39722j3591j07659K50063k21516
$$ 877425 829229 1105941 875426 778108 997605 1137327 1123736 1016077 1266140 1044624
16943A044624o1959r5220J93563k45388L60265j15663j20499k56209N67900J23190
$$ 1044624 982665 887445 1081008 835620 1195885 1080222 959723 703514 1271414 1394604
16933A394604m68712N35247j19897j17412J01995j35508J60707m14030J73391
$$ 1394604 925892 1461139 1341242 1223830 1325825 1190317 1351024 936994 1110385
16924A110385K97188j10539k59368K00845k33495L40231j29951K61320m5459j7944
$$ 1110385 1407573 1297034 1037666 1238511 1005016 1345247 1215296 1476616 1431157 1413213
16914A413213k94652J27451q0489L71912K761k58444J73442J42248l10292K39069
$$ 1413213 1118561 1246012 1165523 1537435 1540196 1281752 1455194 1597442 1287150 1526219
16904A526219k40067J1195Q0470J0401J95335J34695k41788K63682p6288r8183
$$ 1526219 1286152 1297347 1377817 1388218 1583553 1718248 1476460 1740142 1663854 1565671
16894A565671O36539m38812n671j25518M2078k59232K67121k64454K13312J86017
$$ 1565671 2202210 1763398 1757727 1632209 1674287 1415055 1682176 1417722 1631034 1817051
16884A817051M6903j98274k28422N36053O0829k28756N83942k58348j56502L28000
$$ 1817051 1863954 1665680 1437258 1973311 2034140 1805384 2389326 2130978 1974476 2302476
16874B302476m67075Q0471M5259m25551O81299j94651Q1131j51429K61174l49970
$$ 2302476 1835401 1915872 1961131 1535580 2216879 2022228 2103359 1951930 2213104 1863134
16864A863134K70446M00742j14836o7776K76086l72031k08662P60694m88183K81148
$$ 1863134 2133580 2534322 2419486 2351710 2627796 2255765 2047103 2807797 2319614 2600762
16854B600762k28549K75892J51586p8219O5791m5384j14501L3289L84697j81849
$$ 2600762 2372213 2648105 2799691 2721472 2787263 2741879 2627378 2660667 3045364 2863515
16844B863515J13739M0399J43793K1937k43854K39269O2242j82536K65039P6369
$$ 2863515 2977254 3017653 3161446 3183383 2939529 3178798 3241040 3058504 3323543 3399912
16834C399912J65105K5246L79736n26029K44420m00541N07144J00161J89025k82504
$$ 3399912 3565017 3590263 3969999 3443970 3688390 3287849 3794993 3895154 4084179 3801675
16824C801675K77518J47944r2083j72416J29392K85384J92161k79478M15594k59183
$$ 3801675 4079193 4227137 4135054 3962638 4092030 4377414 4569575 4290097 4705691 4446508
16814D446508M83643j69336n217P16718n71329O43531j37195k70706M76677o5737
$$ 4446508 4930151 4760815 4755598 5472316 4900987 5544518 5407323 5136617 5613294 5547557
16804E547557L74215M2695J06793J71788j35363K24754J83173K12576k09173K43533
$$ 5547557 5921772 5964467 6071260 6243048 6107685 6332439 6515612 6728188 6519015 6762548
16794F762548L45491j73771N34626K82063K61807k90524N60183P3889K67945K23278
$$ 6762548 7108039 6934268 7468894 7750957 8012764 7722240 8282423 8356312 8624257 8847535
16784H847535J580P8291L79669L46300p9670K63112N30470Q9444N03729K48262
$$ 8847535 8849115 8927406 9307075 9653375 9573705 9836817 10367287 10456731 10960460 11208722
16774A1208722L81119N64873M61212L84418J82572K67825N80786O55R67331M20382
$$ 11208722 11589841 12154714 12615926 13000344 13182916 13450741 14031527 14032182 14999513 15419895
16764A5419895M36501M24792L73094Q82139K56222J011790L38359R39073O06110
$$ 15419895 15856396 16281188 16654282 17536421 17792643 18804433 19142792 20081865 20687975
16755B0687975M89189Q83111J050725O73092J390472O85218J141065J110326J254712
$$ 20687975 21177164 22060275 23111000 23784092 25174564 25859782 27000847 28111173 29365885
16746B9365885J109255J605572J231294J544605J757789J766683J863276J998707
$$ 29365885 30475140 32080712 33312006 34856611 36614400 38381083 40244359 42243066
16738D2243066K022332K455413K567291K508049K926698K865930L282886L441412
$$ 42243066 44265398 46720811 49288102 51796151 54722849 57588779 60871665 64313077
16730F4313077L724820M122515M351800M545436N239071N420637N818021N977629
$$ 64313077 68037897 72160412 76512212 81057648 86296719 91717356 97535377 103513006
16722A03513006O703096O838890P409537P281628Q438462P855882Q750684Q435184
$$ 103513006 110216102 117054992 124464529 131746157 140184619 148040501 156791185 165226369
16714A65226369Q244893Q135693P680278O706547O289928M890722L503971K436260
$$ 165226369 173471262 181606955 189287233 195993780 202283708 207174430 210678401 213114661
16706B13114661O68739j152630k226215l239743m998866n784951p259118p829907
$$ 213114661 213783400 212630770 210404555 207164812 202165946 196380995 189121877 181291970
16698A81291970q013265q596773q504034q552258q703048q291158q181145p090386
$$ 181291970 173278705 164681932 156177898 147625640 138922592 130631434 122450289 115359903
16690A15359903p742069o575323o439467n810539o077715n072535m695534m578814
$$ 115359903 107617834 101042511 94603044 88792505 82714790 77642255 72946721 68367907
16682F8367907m249568l827131l417889l520904l173914k870138k427463k713382
$$ 68367907 64118339 60291208 56873319 53352415 50178501 47308363 44880900 42167518
16674D2167518k183675k045192j936099k130600j441132j718980j554827j066328
$$ 42167518 39983843 37938651 36002552 33871952 32430820 30711840 29157013 28090685
16666B8090685j435266j072157j463980n40819j261327p46573r24718p27653q99237
$$ 28090685 26655419 25583262 24119282 23578463 22317136 21570563 20645845 19918192 19018955
16657A9018955j127514l24843o75404o03273o05153q01758o25934k95699p06420
$$ 19018955 17891441 17566598 16891194 16287921 15682768 14881010 14255076 13959377 13252957
16648A3252957k02850k18332l34842p35084m12896l19336o32635k23989j230l61144
$$ 13252957 13050107 12831775 12496933 11761849 11348953 11029617 10396982 10172993 10171763 9810619
16638I810619l57620m24403r7358n85764K65958l57230o3847l79157q4493k04363
$$ 9810619 9452999 9028596 8931238 8345474 8611432 8254202 8190355 7811198 7726705 7522342
16628G522342l99396k02606k39573O5605j89009m40191n1244l28457r9996k7537
$$ 7522342 7122946 6920340 6680767 6746372 6557363 6117172 6065928 5737471 5637475 5609938
16618E609938Q3259j61544j88203m44216Q1941J50228j03922j13752j44815k78156
$$ 5609938 5693197 5531653 5343450 4899234 4981175 5131403 5027481 4913729 4768914 4490758
16608D490758k89744Q2356K20793r0239k97866O2256q4968j88118k71843k80621
$$ 4490758 4201014 4283370 4504163 4413924 4116058 4178314 4093346 3905228 3633385 3352764
16598C352764j2166O04223k76016j15013l63025M10656l22140l52642J361p4883
$$ 3352764 3340598 3944821 3668805 3553792 3190767 3601423 3279283 2926641 2928002 2853119
16588B853119q8229M60119k90404M5702l39131N1591n6428K70061k92150J92898
$$ 2853119 2764890 3225009 2934605 2980307 2641176 2692767 2636339 2906400 2614250 2807148
16578B807148l37998J8763j05862o5935j17941p368J50252k12416j00301K61466
$$ 2807148 2469150 2487913 2382051 2316116 2198175 2190807 2341059 2128643 2028342 2289808
16568B289808k18040k46565M27805n65501L72785o0398l2296k51368M70972m01808
$$ 2289808 2071768 1825203 2253008 1687507 2060292 1999894 1967598 1716230 2187202 1785394
16558A785394k14781j09753M12879j7349J79593k44204J73976k31748k21400p718
$$ 1785394 1570613 1460860 1873739 1856390 2035983 1791779 1965755 1734007 1512607 1504889
16548A504889J51492p8764q63r877k55833J51422l19016L19608q9693j37874K46239
$$ 1504889 1656381 1577617 1576754 1566877 1311044 1462466 1143450 1463058 1373365 1235491 1481730
16537A481730m57498L06587j04576J5659L7391n6055p8131J95679o7488p7809
$$ 1481730 1024232 1330819 1226243 1241902 1279293 1223238 1145107 1340786 1273298 1195489
16527A195489k92269k2341K66902N3423k43875J36826q9992l5895K41871j48597
$$ 1195489 903220 880879 1147781 1201204 957329 1094155 1004163 968268 1210139 1061542
16517A061542J14895q6154o3526o3304k05416L53268N8996k8871l11313L9064
$$ 1061542 1176437 1090283 1026757 963453 758037 1111305 1170301 1141430 830117 869181
16507H69181l79609M48750q4985j48840n8287K37171j7074K1158k07856J74704
$$ 869181 489572 938322 853337 704497 646210 883381 866307 887465 679609 854313
16497H54313R9566l24542J43109r6649K9614P6640J24190j46922j29238j40517
$$ 854313 953879 629337 772446 675797 705411 782051 906241 759319 630081 489564
16487D89564O2923J83469j34643L29042k23837q3464j23140J52471P3473n3643
$$ 489564 552487 735956 601313 930355 706518 623054 499914 652385 725858 672215
16477F72215C25951M42753j74611j56194J9363L4667j25158R5150j66285M69185
$$ 672215 325951 768704 594093 437899 457262 491929 366771 461921 295636 764821
16467G64821k81289M8578P878B24389N17154j93669k08354P1872J48573K8269
$$ 764821 483532 532110 539988 224389 741543 547874 339520 411392 559965 588234
16457E88234q6951M50357D65093q5076j40913J20059J38404R071O2983B67168
$$ 588234 501283 951640 465093 380017 239104 359163 497567 506638 569621 267168
16446E74571p6651m8728N3440r59j09276r6353L50884O291j35630B42965L03246
$$ 574571 497920 449192 502632 501673 392397 296044 646928 653219 517589 242965 546211
16435E46211o4281j20198j30679L27911Q1196j26274A51317O8246K41986m0746
$$ 546211 481930 361732 231053 558964 640160 513886 151317 219563 461549 420803
16425D20803K04370j53226R980E2626M14024J5265J52731B08604J90259J86647
$$ 420803 625173 471947 481927 52626 466650 481915 634646 208604 398863 585510
16415E85510B42956K26160j27767k9509A16895L28391j62243M0623F5354K04955
$$ 585510 242956 469116 341349 311840 116895 445286 283043 323666 65354 270309
16405B70309r3407J2770n5470Q8919J91200n2509R8256A58326K38563j56659l0904
$$ 270309 176902 189672 134202 223121 414321 361812 460068 158326 396889 240230 209326
16394B09326l825K29936j20197O6557h1558D58038r5223i068A57333J16554R3356
$$ 209326 205501 435437 315240 381797 -81558 458038 362815 -9068 157333 273887 367243
16383C67243J14816j53727N0534D3486K7344K9433J48361l8913a8818Q04B68970
$$ 367243 482059 328332 378866 43486 70830 100263 248624 209711 -18818 -18014 268970
16371b9065A17286K01609J37139H0591J57504I0815a06908A86005b32477G4786
$$ -29065 117286 318895 456034 80591 238095 90815 -106908 186005 -232477 74786
16360B22699m4750n070F0008K00643H9998b9957E21357i670A34564J19447h2157
$$ 222699 177949 172879 60008 260651 89998 -29957 521357 -9670 134564 254011 -82157
16348C06640B7274m510d166I3449a12309D09014j7932R484A54250J21969a3447
$$ 306640 27274 22764 -4166 93449 -112309 409014 391082 400566 154250 276219 -13447
16336B66937B7941L46205h2793D8313J67374f537B38778R2630a4259j03621B11604
$$ 266937 27941 374146 -82793 48313 215687 -6537 238778 331408 -14259 -117880 211604
16324B20920J05072o1894A04809K58416E3180M3027L6765m0624k9582O927Q4414
$$ 220920 325992 264098 104809 363225 53180 96207 132972 92348 62766 69693 154107
16313A54107G6751K31705J2562A30283a08603D27849A32181c1610A4926J43221
$$ 154107 76751 308456 321018 130283 -108603 427849 132181 -31610 14926 158147
16303A58147e7192B06389a25350C29826b84651C16357f9084B5579b87599B61828
$$ 158147 -57192 206389 -125350 329826 -284651 316357 -69084 25579 -287599 261828
16292D23493j57761J02081a2411m9198a6817A64597M0413C1949C749e4655p6262
$$ 423493 265732 367813 -12411 -61609 -16817 164597 205010 31949 3749 -54655 -130917
16281a30917B10254n4325C894R6286l1686e1845A95412J17442i9338D06923A22463
$$ -130917 210254 155929 3894 100180 68494 -51845 195412 312854 -99338 406923 122463
16269A11576a87467A29126R6405l6775L6080C8519b7759a3183B37162H0656a32861
$$ 111576 -187467 129126 225531 188756 224836 38519 -27759 -13183 237162 80656 -132861
16257F3317a92643A83973E4613f2282B5082O5594C9668J0286J06761n5093m2219
$$ 63317 -192643 183973 54613 -62282 25082 90676 39668 49954 156715 101622 59403
16246E9403a02496k44162f983B71069b3396A81794p2538P01180a39664A56308
$$ 59403 -102496 -346658 -6983 271069 -23396 181794 109256 810436 -139664 156308
16235d1016D80812h80D6002e1802A22205j2112a37170H0923a5647r7537p6809
$$ -41016 480812 -880 46002 -51802 122205 110093 -137170 80923 -15647 -113184 -189993
16224a89993b3529H0266K20078b52786J18076A37658d38979A0622b4139B17155
$$ -189993 -23529 80266 300344 -252786 -134710 137658 -438979 10622 -24139 217155
16213a05298J4019C4587L6216e2485q605a3353A23448k8577M808e7562F7944b26598
$$ -105298 -91279 34587 70803 -52485 -61090 -13353 123448 94871 99679 -57562 67944 -226598
16200D0255P8377k6613K26800c255B28764h8601A78484f8117D11712A30630M0565
$$ 40255 118632 92019 318819 -3255 228764 -88601 178484 -68117 411712 130630 171195
16189A71195J02748A36771E5867K86401a30424Q019a6179A09711g859l6408p6189
$$ 171195 273943 136771 55867 342268 -130424 -122405 -16179 109711 -7859 -44267 -120456
16178a20456j17494Q7595A84150n1978A2707K17587A08234g0052k03751b1917
$$ -120456 -237950 -150355 184150 132172 12707 230294 108234 -70052 -273803 -21917
16167A50847f462C68569b94022E0597N2219L58347b17558a5684B9158M7748Q3526
$$ 150847 -6462 368569 -294022 50597 102816 461163 -217558 -15684 29158 76906 160432
16156A60432f2951A17580f5234K0279B17183E4355i9496B31840p0612e5249F768
$$ 160432 -62951 117580 -65234 -44955 217183 54355 -99496 231840 161228 -55249 6768
16144a47654A65970f965q0369j22069A72637b78946R7937Q4161A27390b19487
$$ -147654 165970 -6965 -87334 -209403 172637 -278946 -181009 -96848 127390 -219487
16133c6770D06121b57575H592K10000c1021A2779b41355M2527h9568D47250H0130
$$ -36770 406121 -257575 8592 218592 -31021 12779 -241355 -198828 -89568 447250 80130
16121a73116A1736K56067C9134K11618g8930l0343d7326B10456N8372a64029f0282
$$ -173116 11736 267803 39134 250752 -78930 -109273 -47326 210456 268828 -164029 -60282
16109b90308A30302n7300P227b88552g7291A61102c9463a3196B44142i5548A01380
$$ -290308 130302 73002 80229 -288552 -77291 161102 -39463 -13196 244142 -95548 101380
16097a99519a4208K898k36314B20611i0581a518k18351M0686E5930b55936E1128
$$ -199519 -14208 -11310 -247624 220611 -90581 -1518 -219869 -179183 55930 -255936 51128
16085B94724A4442L56791b35710e096k7713A49875m6355c1461B38967L5059a63816
$$ 294724 14442 371233 -235710 -5096 -32809 149875 103520 -31461 238967 274026 -163816
16073a12561M2744A73222m1602l9677k1187a20610D5978a36007N5537A880R5869
$$ -112561 -69817 173222 131620 91943 70756 -120610 45978 -136007 -80470 1880 97749
16062I7749g71218F737a19701J4881B13502d8014k39943e3430C1934P0865C2132
$$ 97749 -771218 6737 -119701 -104820 213502 -48014 -287957 -53430 31934 102799 32132
16050a19689b2263l0628m6275d945m221B364a0330L078A54393E7183B1544o255
$$ -119689 -22263 -52891 -99166 -4945 -9166 2364 -10330 -7252 154393 57183 21544 15289
16038A5289b01629A42640i2783j6453A76430d47861J26907K8047g9687L5192r3674
$$ 15289 -201629 142640 -92783 -109236 176430 -447861 -320954 -292907 -79687 -44495 -138169
16027a38169d521l47158J32522R4475C0382M442J54356c9787o5536A61059a27571
$$ -138169 -4521 -351679 -219157 -124682 30382 34824 189180 -39787 -105323 161059 -127571
16015a52902e0503k84093H0307a2479B55838b40102C1997K93382H2964b73199
$$ -152902 -50503 -334596 80307 -12479 255838 -240102 31997 325379 82964 -273199
16004B5692J02137a41262m6748A786a26705N4885L4204A32092c68346L1201B357
$$ 25692 127829 -141262 -188010 1786 -126705 -71820 -37616 132092 -368346 -337145 2357
15992b58175f619B25632b25614J11914j39272b4432j56379C2858a98731A07667
$$ -258175 -6619 225632 -225614 -113700 -252972 -24432 -180811 32858 -198731 107667
15981A60657i5869p3480C03987l2278G9130c02537A89745c02622E0256Q2105a45289
$$ 160657 -95869 -169349 303987 271709 79130 -302537 189745 -302622 50256 132361 -145289
15969D40145B2206K16906J27415j69243Q6373p7173H7240a82721B97O1443d18996
$$ 440145 22206 239112 366527 197284 283657 206484 87240 -182721 297 61740 -418996
15957a68516A87991c25867h2195l08571B3094J95818a73733c0914A34358e1513
$$ -168516 187991 -325867 -82195 -390766 23094 218912 -173733 -30914 134358 -51513
15946B81925A8198J39620a86281F5113J41008c5282A39722b49371j70284J70409
$$ 281925 18198 157818 -186281 65113 206121 -35282 139722 -249371 -419655 -249246
15936b49246f8596D8853b28013b7087E6929a3528j56456G2937b3064A04224b28054
$$ -249246 -68596 48853 -228013 -27087 56929 -13528 -169984 72937 -23064 104224 -228054
15924a77862E9487b24842B7323K65088a6319A8821O3593F989c20569i262k55520
$$ -177862 59487 -224842 27323 292411 -16319 18821 82414 6989 -320569 -9262 -264782
15913b64782a13040G9287K93578b51387C53012A55044G179c93306k8209a3408
$$ -264782 -113040 79287 372865 -251387 353012 155044 7179 -393306 -421515 -13408
15902A0644b38132a9157C1241b54861K9775L1824A01361a00421k2853H8272g3397
$$ 10644 -238132 -19157 31241 -254861 -225086 -193262 101361 -100421 -123274 88272 -73397
15890B6355a14820j26004j97259a45539A40725b55568b6877o9110j82024J34706
$$ 26355 -114820 -240824 -438083 -145539 140725 -255568 -26877 -95987 -278011 -143305
15880a43305N8057B11090a05212D2952b46492I2523a30885J053N3664D15157H9482
$$ -143305 -85248 211090 -105212 42952 -246492 92523 -130885 -129832 -76168 415157 89482
15868c7552A10835P0384o4051a62356l0723A41685a45872M2512M6183K4430F0066
$$ -37552 110835 181219 117168 -162356 -193079 141685 -145872 -103360 -57177 -32747 60066
15856f8586g081A45454j5713a69788j48717i1074I0751a19067n2591j07951B7777
$$ -68586 -7081 145454 129741 -169788 -318505 -91074 90751 -119067 -171658 -279609 27777
15844A06736C4048c1697H6171b27912A79299F7117J50650F1875a85713A21873
$$ 106736 34048 -31697 86171 -227912 179299 67117 217767 61875 -185713 121873
15833d19670i3632r6055d2603A88008q5751j5209g8547b0235A29225B0763g8177
$$ -419670 -93632 -189687 -42603 188008 102257 87048 -78547 -20235 129225 20763 -78177
15821f8122q760j82926A22800a28875D7904a16861A8436M9048b21965a8606l6813
$$ -68122 -76882 -259808 122800 -128875 47904 -116861 18436 67484 -221965 -18606 -55419
15810e5419B68902c33425M6755A51230R9646M9333H145a1487q5528A47191J6008
$$ -55419 268902 -333425 -286670 151230 250876 300209 8145 -11487 -97015 147191 163199
15799A63199B8949O3199D2835a46481I4126J54999c3241G754a29330A47603c23224
$$ 163199 28949 92148 42835 -146481 94126 249125 -33241 7754 -129330 147603 -323224
15787a3534A62993a27433M8961k7157j95754A04726B9010f7031j63448a8401r4177
$$ -13534 162993 -127433 -78472 -105629 -301383 104726 29010 -67031 -230479 -18401 -112578
15776a12578e6234I3368R6164K09922a48312M6949A39890i2464J4535B4025h0944
$$ -112578 -56234 93368 189532 399454 -148312 -101363 139890 -92464 -77929 24025 -80944
15764a10499e2579j44117o37L390k6460J4962h6203K4722D0927b21925H0571a07317
$$ -110499 -52579 -196696 -197333 -193943 -220403 -205441 -86203 -61481 40927 -221925 80571 -107317
15751e6108m3952B37640f6952A68614h2699L7519j55141K1581d339m4188j85237
$$ -56108 -100060 237640 -66952 168614 -82699 -45180 -200321 -178740 -4339 -48527 -233764
15740b33764n8101A25571J96964B5363J57578G1365h1676D4141a30578H7548g4878
$$ -233764 -291865 125571 322535 25363 182941 71365 -81676 44141 -130578 87548 -74878
15728d7420b1903l813l6904E9302E757R9539d3615j77650j21730A18626B6737
$$ -47420 -21903 -25716 -62620 59302 5757 105296 -43615 -221265 -342995 118626 26737
15716B07457h8420A45848b2235B32108a17964L3644A85093a31643J0569K517k15978
$$ 207457 -88420 145848 -22235 232108 -117964 -84320 185093 -131643 -121074 -118557 -334535
15705c34535p3782A63364d00953A96498H0037i48A9465K92619j45549c73561a43886
$$ -334535 -408317 163364 -400953 196498 80037 -948 19465 312084 166535 -373561 -143886
15693h1566B14683d2460j13479A09881G788J75305g2174r1551k1851I9443b19342
$$ -81566 214683 -42460 -155939 109881 7788 183093 -72174 -163725 -185576 99443 -219342
15681a9158D1633e409m8834k6778p0010A57248A0831K99497b14796j22037K9589
$$ -19158 41633 -5409 -54243 -81021 -151031 157248 10831 310328 -214796 -336833 -307244
15670c07244K1486D13384b09211M3032I6018O2984b0223A03162a45720b1825k17207
$$ -307244 -285758 413384 -209211 -166179 96018 159002 -20223 103162 -145720 -21825 -239032
15659b39032a1021E8029G71a23159C32870H7147a78884m2586c2805A09734a12363
$$ -239032 -11021 58029 771 -123159 332870 87147 -178884 -221470 -32805 109734 -112363
15647a26978e5387j90151c0263j79294n4343A9260R1190c6222j7247B35687b82814
$$ -126978 -55387 -245538 -30263 -209557 -263900 19260 110450 -36222 -53469 235687 -282814
15635b0065I684b4064k25384I064L7959a04554d0738k7363C34827A30091B8925
$$ -20065 9684 -24064 -249448 9064 47023 -104554 -40738 -68101 334827 130091 28925
15623E8082J4400a97192E7571Q9753n6387l7070a39159A1276c07006A82422g1345
$$ 58082 72482 -197192 57571 147324 90937 53867 -139159 11276 -307006 182422 -71345
15611a56209b6099f903j68548A6497a46336J9862B98242G0844g2925H5598J04148
$$ -156209 -26099 -6903 -175451 16497 -146336 -126474 298242 70844 -72925 85598 189746
15600A89746o3083P6813r8155L26319C6196P8173a11292D3971F661b760B07436
$$ 189746 126663 203476 105321 431640 36196 114369 -111292 43971 6661 -2760 207436
15588b08487h8613j33781b1853C8001b53657a22358B15882A00959e6296j1478
$$ -208487 -88613 -222394 -21853 38001 -253657 -122358 215882 100959 -56296 -67774
15578f7774C1705a98815D2158J56456e6949j42736L7876R069A68845a94430A22470
$$ -67774 31705 -198815 42158 198614 -56949 -199685 -161809 -152740 168845 -194430 122470
15566F8138f0700j20923l356A86129i9072G6019R1209i3291p6560C44187a4407
$$ 68138 -60700 -181623 -184979 186129 -99072 76019 167228 -93291 -169851 344187 -14407
15554a33409k96256J52368a12607A17372h6936C71157q5618a974j95594n8840
$$ -133409 -429665 -277297 -112607 117372 -86936 371157 285539 -1974 -197568 -256408
15544b56408A5811J28637d98392C3514K55817N0442e6253k80949H0608O125b78648
$$ -256408 15811 144448 -498392 33514 289331 339773 -56253 -337202 80608 86733 -278648
15532a42575B61622A14013O4536g9102B32981a23938a7828I2302e8177d5j2666
$$ -142575 261622 114013 178549 -79102 232981 -123938 -17828 92302 -58177 -45 -12711
15521a2711n0778C49987E9649J32594e2602n0421M9761b6434D19191b6704p0523
$$ -12711 -63489 349987 59649 192243 -52602 -103023 -53262 -26434 419191 -26704 -97227
15510i7227D9360R038A9822a0987B03508a7436A55583a62885M156j12677A46631
$$ -97227 49360 58398 19822 -10987 203508 -17436 155583 -162885 -158729 -271406 146631
15498H7952L7452A4780a11519K6683B30648f6028n7494j59150E5987a82461j10032
$$ 87952 125404 14780 -111519 -84836 230648 -66028 -123522 -282672 55987 -182461 -292493
15487b92493c5299n1316n2454F0240J8667J20555a14786n4155j66859H7860L6236
$$ -292493 -35299 -86615 -139069 60240 78907 199462 -114786 -168941 -335800 87860 124096
15476A24096M1334a757j41178C33472d5788M022p4635j4415B09688M415H6419
$$ 124096 165430 -1757 -142935 333472 -45788 -41766 -116401 -130816 209688 214103 86419
15464D2329g5511B1862a73125B85978a21924j23929a4662A59638C5595g1025A03561
$$ 42329 -75511 21862 -173125 285978 -121924 -245853 -14662 159638 35595 -71025 103561
15452b69258A17010R4719b6948C08476D7948L83900g6125A5534J85646i6152B27539
$$ -269258 117010 211729 -26948 308476 47948 431848 -76125 15534 201180 -96152 227539
15440A32332k1792K5912J11029P9019H4768J42243D2494K8062j4879M11089C0534
$$ 132332 110540 136452 247481 326500 84768 227011 42494 70556 55677 466766 30534
15428a37772a2741A98562J43660F6233g7071A12124b96718A60247e3781E1074
$$ -137772 -12741 198562 342222 66233 -77071 112124 -296718 160247 -53781 51074
15417B0383d3161G7988d27248J62534M0310H8040l9761b06482A33900a28696C11535
$$ 20383 -43161 77988 -427248 -264714 -224404 88040 48279 -206482 133900 -128696 311535
15405F704a08873A56075a24358j11551l07477A68408a39079e2041j65346B14996
$$ 6704 -108873 156075 -124358 -235909 -543386 168408 -139079 -52041 -217387 214996
15394E0994K3637a03964n0106B03460a41120d8391K2360j49098Q820B6932e2642
$$ 50994 74631 -103964 -154070 203460 -141120 -48391 -26031 -175129 -166309 26932 -52642
15382A72174a0495D3228J99433a08316A88249E1180r726N2136a27698A29557g3669
$$ 172174 -10495 43228 242661 -108316 188249 51180 41454 93590 -127698 129557 -73669
15370a19322G4026i1124A42823a15529k1234A24950L4622b13076B06420a16412
$$ -119322 74026 -91124 142823 -115529 -136763 124950 159572 -213076 206420 -116412
15359b47790J05739A79145b64222k01002J66252A18396n1175k5302a29966a4490
$$ -247790 -142051 179145 -264222 -465224 -298972 118396 67221 41919 -129966 -14490
15348A5850J44047b31955i387B6003d9714m2368B81009N4218D7071b16608F4777
$$ 15850 159897 -231955 -9387 26003 -49714 -92082 281009 335227 47071 -216608 64777
15336C29032a02892F447O7471c8464C0392K26297J01382B0012c4468P98A74704
$$ 329032 -102892 6447 73918 -38464 30392 256689 358071 20012 -34468 -33670 174704
15324B8021d8052F6834f5234B56269h5696E5747L00951B5228b25118O4274b953
$$ 28021 -48052 66834 -65234 256269 -85696 55747 356698 25228 -225118 -160844 -2953
15312I0933N505l5762J43346Q0641b03130A7646J7360N599j2367J26317C3064
$$ 90933 96438 60676 204022 284663 -203130 17646 35006 40605 28238 154555 33064
15300A48479J35245I0833O2242i919C84539A75481q651e161F3557K37208A31093
$$ 148479 283724 90833 153075 -9919 384539 175481 166830 -5161 63557 300765 131093
15288c6553E9657R5533J18134o0867a63515E1154m906K64811j16117J60525j44858
$$ -36553 59657 155190 273324 212457 -163515 51154 46248 311059 194942 355467 210609
15277B10609b17489A94588h1058j21701A10211g4178A62212E0966a2024j49676
$$ 210609 -217489 194588 -81058 -202759 110211 -74178 162212 50966 -12024 -161700
15267a61700J083C03378l1258q0432b7065k58113A13473M65979A42268J6838K33348
$$ -161700 -160617 303378 272120 191688 -27065 -285178 113473 579452 142268 159106 392454
15256C92454I6965L8911K45470E904a15792B96326m0827E7646b9029A89082P7674
$$ 392454 96965 135876 381346 5904 -115792 296326 255499 57646 -29029 189082 266756
15245B66756F8118L29004j06004n0461k4996C8227K63846K63872k43555L04628
$$ 266756 68118 397122 291118 240657 215661 38227 302073 565945 322390 627018
15235F27018j98600j07903O44714N39750l91606J23229m61839N4848B68267J55861
$$ 627018 428418 320515 965229 1504979 1113373 1236602 774763 829611 268267 424128
15225D24128j64003j26946b98874A62893a17750B72852b6506H6099M7649a12759
$$ 424128 260125 133179 -298874 162893 -117750 272852 -26506 86099 133748 -112759
15214D90234H6982N0966R5301m1722K2069b2120k12806A25007g5411B17743g7128
$$ 490234 86982 137948 233249 191527 213596 -22120 -234926 125007 -75411 217743 -77128
15202a7959j02053L3246n7058A04860N4361D5243g6867B6248K14073b4831n9281
$$ -17959 -120012 -86766 -143824 104860 159221 45243 -76867 26248 240321 -24831 -84112
15191h4112c5604k0651j33168P7188A5906N8922c7622A07998O031a52478d0483
$$ -84112 -35604 -56255 -189423 -112235 15906 74828 -37622 107998 114029 -152478 -40483
15179f4997I4867b9892C33252q5076E2285c05934D2253A9775J8367K95397H6145
$$ -64997 94867 -29892 333252 248176 52285 -305934 42253 19775 38142 333539 86145
15167A24370c818l62151B27147K7913o1520J63604B8933Q0759a23742I896J32091
$$ 124370 -3818 -365969 227147 255060 193540 357144 28933 109692 -123742 9896 141987
15156A41987J69202H2137J70520a50690D9269c2445D43668j89359J63283H6100
$$ 141987 311189 82137 252657 -150690 49269 -32445 443668 254309 417592 86100
15145i5523D9833A7543a78626d784A09311L33296g3506A47173N7085M1426L92
$$ -95523 49833 17543 -178626 -4784 109311 442607 -73506 147173 204258 245684 246076
15134B46076P99f5840D02429H5316R6948E1454J36251p2683C6084L21177D2918
$$ 246076 246875 -65840 402429 85316 182264 51454 187705 115022 36084 357261 42918
15122D8441M412J6150r761J28721K08003a08366C1032l791h134o4540A58543j5569
$$ 48441 52853 69003 59242 187963 395966 -108366 31032 27241 -8134 -72674 158543 142974
15110A42974a06022B50890H2228L05504A16177d0254D94604E4291k4918b60162
$$ 142974 -106022 250890 82228 387732 116177 -40254 494604 54291 29373 -260162
15099D20201e738A21919K31459J83051I4763l9487J36542G0247K49974a03726
$$ 420201 -5738 121919 353378 536429 94763 55276 191818 70247 320221 -103726
15088I3363K67623A08513J01923C7013K12148C6948N7041J40401a32747B3421
$$ 93363 360986 108513 210436 37013 249161 36948 93989 234390 -132747 23421
15077a6796j06902A85041o4359L2897J34321o7557J20518J55885I3051L40444
$$ -16796 -123698 185041 120682 153579 287900 220343 340861 496746 93051 433495
15067D33495j74690J7511A27425B8766K03102J56967F6039B4366J4625a7334B11373
$$ 433495 258805 276316 127425 28766 231868 388835 66039 24366 38991 -17334 211373
15055A89650e9837H1599j2643O2661L2926c25816C36654j32390r4687K8846m621
$$ 189650 -59837 81599 68956 131617 164543 -325816 336654 204264 109577 138423 133802
15044A33802J24415r1996k8205E2986J34509P0440J96965A95924J22502J06468
$$ 133802 258217 166221 138016 52986 187495 257935 454900 195924 318426 424894
15034D24894a8632A64364O8870K66866A95868a9180A57836L25706A13686M08009
$$ 424894 -18632 164364 233234 500100 195868 -19180 157836 483542 113686 521695
15024E21695k23059J4759J98575j84004A5172P8877J21198R684H9807b1856o7298
$$ 521695 298636 313395 511970 327966 15172 94049 215247 224931 89807 -21856 -89154
15013h9154A5789L50293m9987D4250J06876e1893A39246P2184M7177N9828j41811
$$ -89154 15789 366082 316095 44250 151126 -51893 139246 211430 258607 318435 176624
15002A76624O6554r2416M94395B63961o5886M988J05c5393B79590j22232M7706
$$ 176624 243178 150762 645157 263961 198075 203063 203168 -35393 279590 157358 205064
14991B05064l310A6819M4203d1785B26248m9594R6487A31691b27759B17551J20978
$$ 205064 201754 16819 61022 -41785 226248 176654 273141 131691 -227759 217551 338529
14980C38529D1738K70084l3489P6700J8381j22372C4467Q9256R4749L61963A39574
$$ 338529 41738 311822 278333 355033 373414 251042 34467 123723 218472 580435 139574
14968F9975L70196B1985L68803A12672L49127j40745B3073K9352M03061I5530
$$ 69975 440171 21985 390788 112672 461799 321054 23073 52425 455486 95530
14957B22140K9868n6535R8016j34892L75575j40196J93588B78369o8768o9903
$$ 222140 252008 195473 293489 158597 534172 393976 587564 278369 209601 139698
14947A39698n6414M03499A57477M39492A16959m1583K46451A49726M6505J52664
$$ 139698 83284 486783 157477 596969 116959 75376 321827 149726 196231 348895
14937C48895p3132Q3318j27195q5244n6220B274J45005K35846B228L52957A55608
$$ 348895 275763 359081 231886 146642 90422 2274 147279 383125 2228 355185 155608
14925C41846N3482p1637l5507K6326C0532f4436E78797b2717B23675R4252K00816
$$ 341846 395328 323691 288184 314510 30532 -64436 578797 -22717 223675 317927 518743
14914E18743I1297J99954j5017M96613A69026m9303K7364N2104K62465A57952
$$ 518743 91297 291251 276234 772847 169026 119723 147087 199191 461656 157952
14903C33501m1998O0856E7403O12128B61009A13522J99822J46247G3293M63297
$$ 333501 291503 352359 57403 669531 261009 113522 313344 459591 73293 536590
14893E36590M8021B05161M9087o5729l4578K08869j4675N65849I7275L0770L14963
$$ 536590 584611 205161 254248 188519 153941 362810 348135 913984 97275 128045 443008
14882D43008k342n0359p5971J22699A91325M60607k67314n4460K33708k23074
$$ 443008 440666 390307 314336 437035 191325 651932 384618 330158 563866 340792
14872C40792A34247L5740K04812j85763J49877l3356D8324O01898j68066R4926
$$ 340792 134247 169987 374799 189036 338913 305557 48324 650222 482156 577082
14862E77082j23201J15944A19276K69911J32235A62870C9834N24141A02712J46631
$$ 577082 453881 569825 119276 389187 521422 162870 39834 563975 102712 249343
14852B49343I7822P7192J74424j06834J64583B03471J25876K47875A43787J18135
$$ 249343 97822 175014 349438 242604 407187 203471 329347 577222 143787 261922
14842B61922R8348p3891J97258K7950B29021J97106K13183j85600K2599A98263
$$ 261922 360270 286379 483637 511587 229021 426127 639310 453710 476309 198263
14831B11475L64118n7353k23537H6505K96579J78962B64601M50230l49793K3990
$$ 211475 575593 518240 294703 86505 383084 562046 264601 714831 365038 389028
14821C89028J65832j7519N1763O4943k8264p894j9285r0206J12728K10962J9949
$$ 389028 554860 537341 589104 654047 625783 617889 598604 508398 621126 832088 852037
14810H52037C73167K06419q4336n0481J30750q5760K12288k01822O7138k28806
$$ 852037 373167 579586 495250 444769 575519 489759 702047 500225 567363 338557
14800C38557J58227n1603J72923K10673j62904k1058B94181J13119K4113J61664
$$ 338557 496784 445181 618104 828777 665873 644815 294181 407300 431413 593077
14790E93077K03778k45644L01260j07870j01735k29269J64991N7575n4528j34983
$$ 593077 796855 551211 852471 744601 642866 413597 578588 636163 581635 446652
14780D46652R2730j74787Q0531J50657K1652M5188K60885p0461l75639K08310
$$ 446652 539382 364595 445126 595783 617435 662623 923508 853047 477408 685718
14770F85718C04265K81505l4025J97013k19564r6418p8178M04612l4353J01295
$$ 685718 304265 585770 551745 748758 529194 432776 354598 759210 724857 826152
14760H26152L8112l6479l21286M84609k59594j19694P3077R8731l26170J97478
$$ 826152 864264 827785 506499 991108 731514 611820 684897 783628 457458 654936
14750F54936m2089k7805L65198l68054M38196k23711j63505J15129n9693l08751
$$ 654936 612847 585042 950240 582186 1020382 796671 633166 748295 688602 379851
14740C79851q0785K59566J17801m3523k09467L03913j14760K97777q9996j37027
$$ 379851 299066 558632 676433 632910 423443 727356 612596 910373 820377 683350
14730F83350J54416K2097k97953L33275J32210R0058m19141J80705m9003r4011
$$ 683350 837766 859863 561910 895185 1027395 1117453 698312 879017 830014 736003
14720G36003j61845J86784j12988j53244M17940k67612K76439J5199j43766k1677
$$ 736003 574158 760942 647954 494710 912650 645038 921477 936676 792910 771233
14710G71233M23693k66515p1458k18211o0142M94423j1595k43248J47294n6898
$$ 771233 1194926 928411 856953 638742 578600 1073023 1061428 818180 965474 908576
14700I08576j7969K88341j06064R8483j15725j55292l9163l02143M35029K92280
$$ 908576 890607 1178948 1072884 1171367 1055642 900350 861187 559044 994073 1286353
14690A286353k48617Q7240l85370L29864k42323j18765K50320j1038j21450l8031
$$ 1286353 1037736 1124976 739606 1069470 827147 708382 958702 947664 826214 788183
14680G88183L6129J9519p1363K21221O255J1274o9026K53237m65953J01467O16536
$$ 788183 824312 843831 772468 993689 999944 1011218 942192 1195429 729476 830943 1447479
14669A447479m44633O487K97534m26231K77284J59650j34058L7150l10588j87102
$$ 1447479 1002846 1009333 1306867 880636 1157920 1317570 1183512 1220662 910074 722972
14659G22972J04791M14970l72008L12377k7306j28839j00749L39877k55530K24364
$$ 722972 827763 1242733 870725 1183102 1155796 1026957 926208 1266085 1010555 1234919
14649A234919J18976k65304j98877L86906l32790M89493n05772N08161k33486
$$ 1234919 1353895 1088591 889714 1276620 943830 1433323 927551 1435712 1202226
14640A202226J78730l87051K34322R0165J27668k30800J20446l63173L27391o1664
$$ 1202226 1380956 993905 1228227 1318392 1446060 1215260 1335706 972533 1299924 1238260
14630A238260q3709o730L02377J23809m55406M01959m46724L75324o2945L49032
$$ 1238260 1154551 1147821 1450198 1574007 1118601 1520560 1073836 1449160 1386215 1735247
14620A735247m85787k36050O23018j94162l29401J28989L20407j46048K27596
$$ 1735247 1249460 1013410 1636428 1442266 1112865 1241854 1562261 1416213 1643809
14611A643809o5035l36347K21139k91192K25486R3870N54691k01438j34731l67963
$$ 1643809 1578774 1242427 1463566 1172374 1397860 1491730 2046421 1844983 1710252 1342289
14601A342289K77343k44382K22406J00872j53309l2930K27967K76071l41576K87883
$$ 1342289 1619632 1375250 1597656 1698528 1545219 1512289 1740256 2016327 1674751 1962634
14591A962634l11309j88527M52460k67873l44055O54385l46063J78022M17243
$$ 1962634 1651325 1462798 1915258 1647385 1303330 1957715 1611652 1789674 2206917
14582B206917n72517K87879r7946l78914N62270k57030K79646N6582q657k03476
$$ 2206917 1634400 1922279 1824333 1445419 2007689 1750659 2030305 2086887 2078230 1874754
14572A874754o0397K00426k4325p9147L9725K96566k80149O92456m60879k47553
$$ 1874754 1814357 2014783 1990458 1911311 1951036 2247602 1967453 2659909 2199030 1951477
14562A951477K26969K53468M7959K18311l36884N3885J66417Q6579k45235j62449
$$ 1951477 2178446 2431914 2479873 2698184 2361300 2415185 2581602 2668181 2422946 2260497
14552B260497L41645J86002J82771k74918J97549L40980m21728L95509m9787L35653
$$ 2260497 2602142 2788144 2970915 2695997 2893546 3234526 2812798 3208307 3158520 3494173
14542C494173o9631N00348R9955O24243K47854J010897O66818J350128L057696
$$ 3494173 3424542 3924890 4024845 4649088 4896942 5907839 6574657 7924785 10982481
14533A0982481M200639O805315Q030176k588105r060967m683257m178877l190544
$$ 10982481 15183120 21988435 30018611 27430506 18369539 13686282 9507405 6316861
14525F316861j552535j098700l59720l19462n31030O8765k84757j22253N58792
$$ 6316861 4764326 3665626 3305906 2986444 2455414 2524179 2239422 2117169 2675961
14516B675961m72895J28338L81138q0118n88044L48560k28377O20636l46875K70412
$$ 2675961 2203066 2331404 2712542 2632424 2044380 2392940 2164563 2785199 2438324 2708736
14506B708736l3609l59687N00152k09766L62438j40433J55529j35836r9013J35553
$$ 2708736 2675127 2315440 2815592 2605826 2968264 2827831 2983360 2847524 2748511 2884064
14496B884064k38961N24480j32714m9913J57976j6742L33837k28834O6123k28710
$$ 2884064 2645103 3169583 3036869 2986956 3144932 3128190 3462027 3233193 3299316 3070606
14486C070606J89378L23685l01124j2405J6148L77130m67388L44358P2193m2466
$$ 3070606 3259984 3583669 3282545 3270140 3286288 3663418 3196030 3540388 3612581 3570115
14476C570115K29271M13894k58384k10607L20373k5377k51753K70258J37856j99732
$$ 3570115 3799386 4213280 3954896 3744289 4064662 4039285 3787532 4057790 4195646 3995914
14466C995914J9074J73043N3152J44921N726K80150n46669L15758J18256J49358
$$ 3995914 4014988 4188031 4241183 4386104 4391830 4671980 4125311 4441069 4559325 4708683
14456D708683n0300o8473l695L84507j04175m5065K79217j34914k82790M94511
$$ 4708683 4658383 4589910 4586215 4970722 4866547 4821482 5100699 4965785 4682995 5177506
14446E177506P0995q8897p8133M23775k24143L88957j95245m7477L46093J44031
$$ 5177506 5248501 5159604 5081471 5505246 5281103 5670060 5474815 5427338 5773431 5917462
14436E917462j50254N7855K38616l8324K34934j26382j04179K86764m5631J91635
$$ 5917462 5767208 5825063 6063679 6025355 6260289 6133907 6029728 6316492 6270861 6462496
14426F462496K97908k13356K7670J55414J58807k16810J63585J92000N4256m6910
$$ 6462496 6760404 6547048 6574718 6730132 6888939 6672129 6835714 7027714 7081970 7035060
14416G035060L03804J30663J90531J24007l88914O58929k48088P3377L32157J93197
$$ 7035060 7338864 7469527 7660058 7784065 7395151 8054080 7805992 7879369 8211526 8404723
14406H404723k3180K26175K46206l55875P73104R2283j79532L93454J60564k54568
$$ 8404723 8381543 8607718 8853924 8498049 9271153 9363436 9183904 9577358 9737922 9483354
14396I483354L84744k65933M36186J81734O6486L18209R4583J01880J06499O2164
$$ 9483354 9868098 9602165 10038351 10220085 10286571 10604780 10699363 10801243 10907742 10969906
14386A0969906J07643J03299M87780J48523j73586O04624O46874k78851R5414
$$ 10969906 11077549 11180848 11668628 11817151 11643565 12248189 12895063 12616212 12711626
14377A2711626O47246J02009j22062O9249N38532M79322n7417L43169L11300L73973
$$ 12711626 13358872 13460881 13338819 13408068 13946600 14425922 14368505 14711674 15022974 15396947
14367A5396947K47687R7577Q1671P26691j17579P24659K19093L42469l3197P19346
$$ 15396947 15644634 15742211 15823882 16550573 16432994 17157653 17376746 17719215 17686018 18405364
14357A8405364K28392M16299K66777L18609O57974L42599L79458R26726L32994
$$ 18405364 18633756 19050055 19316832 19635441 20293415 20636014 21015472 21942198 22275192
14348B2275192L89012M60236L45104L45929Q37537M53611N13446O40478P22438
$$ 22275192 22664204 23124440 23469544 23815473 24653010 25106621 25620067 26260545 26982983
14339B6982983N16969Q14886N07610O39373Q85378P25671R01075O33109J191267
$$ 26982983 27499952 28314838 28822448 29461821 30347199 31072870 31973945 32607054 33798321
14330C3798321K58266J176937P56169J366921R06354J359006J157306J073602
$$ 33798321 34056587 35233524 35989693 37356614 38262968 39621974 40779280 41852882
14322D1852882J022471J328043J096616J281891J328088J729710J386007J627274
$$ 41852882 42875353 44203396 45300012 46581903 47909991 49639701 51025708 52652982
14314E2652982J860434J736530K228224J147006K738394J784371K153777K582089
$$ 52652982 54513416 56249946 58478170 59625176 62363570 64147941 66301718 68883807
14306F8883807K450570K406743K758708K829560L095015K965895L580078L329156
$$ 68883807 71334377 73741120 76499828 79329388 82424403 85390298 88970376 92299532
14298I2299532L685233L630713L821088M477330M244333M818749M656195N385192
$$ 92299532 95984765 99615478 103436566 107913896 112158229 116976978 121633173 127018365
14290A27018365N817834N722970O254701P043094O621430P461373P696638P958393
$$ 127018365 132836199 138559169 144813870 151856964 158478394 165939767 173636405 181594798
14282A81594798R087305Q732703J0101484J0003791J0794916J1308429J1546005
$$ 181594798 190682103 199414806 209516290 219520081 230314997 241623426 253169431
14275B53169431J2061790J2780793J3399440J3317297J4020058J3659179J3645651
$$ 253169431 265231221 278012014 291411454 304728751 318748809 332407988 346053639
14268C46053639J3937457J3013497J2878656J1806836J1715014J1154784J0483158
$$ 346053639 359991096 373004593 385883249 397690085 409405099 420559883 431043041
14261D31043041R011009P473889N524731L720146P70756O61818m4101m751988
$$ 431043041 440054050 447527939 453052670 456772816 457543572 458205390 458161289 453409301
14253D53409301p276281o029652n202995n600266r467407q903338j1769540j3279794
$$ 453409301 446133020 440103368 434900373 429300107 419832700 410929362 399159822 385880028
14245C85880028j3758414j4468677j3443043j3515175j3322899j3978598j3831340
$$ 385880028 372121614 357652937 344209894 330694719 317371820 303393222 289561882
14238B89561882j3507410j2959596j2628183j1781542j1885585j1791561j0732039
$$ 289561882 276054472 263094876 250466693 238685151 226799566 215008005 204275966
14231B04275966j0490939r551221r147994q154497q269300p237984p237837o383436
$$ 204275966 193785027 184233806 175085812 166931315 158662015 151424031 144186194 137802758
14223A37802758o017829o006694n450526m887413n065889m636533l935329m298822
$$ 137802758 131784929 125778235 120327709 115440296 110374407 105737874 101802545 97503723
14215I7503723l695548l554438m034153k646175l482699k843594k863564k641887
$$ 97503723 93808175 90253737 86219584 83573409 80090710 77247116 74383552 71741665
14207G1741665k314461k439478k362539k267131j820292k225789j761689j754471
$$ 71741665 69427204 66987726 64625187 62358056 60537764 58311975 56550286 54795815
14199E4795815j546787j433945k069470j176894j575088j122920j118707j224436
$$ 54795815 53249028 51815083 49745613 48568719 46993631 45870711 44752004 43527568
14191D3527568j314106j123925j352038j074589r30838p80263p16175j486411
$$ 43527568 42213462 41089537 39737499 38662910 37732072 36951809 36235634 34749223
14183C4749223r30398r98474n20566j062436k04577j026500q22505l74218j080382
$$ 34749223 33818825 32820351 32299785 31237349 31032772 30006272 29183767 28809549 27729167
14174B7729167o41111o14457o41835l80798o76182j53276j001906q9047p67883
$$ 27729167 27088056 26473599 25831764 25450966 24774784 24621508 23619602 23530555 22762672
14165B2762672p35600k82117n40469k18094k84307p26659l29052o77481j48818
$$ 22762672 22027072 21744955 21204486 20986392 20702085 19975426 19646374 18968893 18820075
14156A8820075p16745J83850o43539k95314l64077K4033m86028k35765m99170
$$ 18820075 18103330 18287180 17643641 17348327 16984250 17008283 16522255 16286490 15787320
14147A5787320j51895j09983n68856q7719j99706l93324k53825p6324m82784m9583
$$ 15787320 15635425 15525442 14956586 14868867 14669161 14275837 14022012 13945688 13462904 13413321
14137A3413321J22314n91337O4058m74187k12017l02123l34177j40837j47611
$$ 13413321 13535635 12944298 13008356 12534169 12322152 12020029 11685852 11545015 11397404
14128A1397404K27608j81205k47391m17692k04142j28002p1107K6240j02532m01176
$$ 11397404 11625012 11443807 11196416 10778724 10574582 10446580 10375473 10401713 10299181 9898005
14118I898005M27861n78514l55569o3594j1534l5473l72616l7918o5374j52909
$$ 9898005 10325866 9747352 9391783 9328189 9316655 9281182 8908566 8870648 8805274 8652365
14108H652365j37638r1477J34171l61179j09277J03575l99599R488j88690K4807
$$ 8652365 8514727 8423250 8557421 8196242 8086965 8190540 7790941 7800429 7611739 7636546
14098G636546k17819K31731J0412k95883k42361N193P0103Q3924l59243r7023
$$ 7636546 7418727 7650458 7660870 7364987 7122626 7127819 7197922 7281846 6922603 6825580
14088F825580k2717m30293K90933l77984J52048j08213k14841Q8982l17754P4478
$$ 6825580 6802863 6372570 6663503 6285519 6437567 6329354 6114513 6203495 5885741 5960219
14078E960219j66310J31801m28985M22111k24163m5591j91517K42697j74975p3086
$$ 5960219 5793909 5925710 5496725 5918836 5694673 5649082 5457565 5700262 5525287 5452201
14068E452201k64829J34819K95859o57697L26517k46768j40954j09742J52362
$$ 5452201 5187372 5322191 5618050 4960353 5286870 5040102 4899148 4789406 4941768
14059D941768k50548M23225k82618m07284M19053j68293m17416N573j10516J05082
$$ 4941768 4691220 5114445 4831827 4424543 4843596 4675303 4257887 4263460 4152944 4258026
14049D258026n6183L05682k58576Q2832P6632k2475j74058j13748K05824j38754
$$ 4258026 4201843 4507525 4248949 4331781 4408413 4385938 4211880 4098132 4303956 4165202
14039D165202M3666l41972J61981l98792J75045K15135r9101n26841M40330l01538
$$ 4165202 4208868 3866896 4028877 3630085 3805130 4020265 3921164 3394323 3834653 3533115
14029C533115j06127K04557m8385l72198L24357J45778j54911j29548L3523j8020
$$ 3533115 3426988 3631545 3583160 3210962 3535319 3681097 3526186 3396638 3430161 3412141
14019C412141j53182P1151J19355r2780o7657j30455n0396q6554J78279m60048
$$ 3412141 3258959 3330110 3449465 3356685 3289028 3158573 3108177 3021623 3199902 2739854
14009B739854N71406l43126n49L7283R974o8830L3916k31017k35881O9922J05591
$$ 2739854 3311260 2968134 2967585 3004868 3014842 2946012 2979928 2748911 2513030 2582952 2688543
13998B688543K1853k24143M11493o84283L42073q2496M7419N0655J02409k35801
$$ 2688543 2710396 2486253 2897746 2213463 2555536 2473040 2520459 2571114 2673523 2437722
13988B437722n2133K37470l56091M39642M3612m34967M82945P1270k52549J50004
$$ 2437722 2385589 2623059 2266968 2706610 2750222 2315255 2798200 2869470 2616921 2766925
13978B766925J65129N62487N08738Q93299K440736L770987O216131R677976J206895
$$ 2766925 2932054 3494541 4003279 4896578 7337314 11108301 17324432 27002408 28209303
13969B8209303p999624n430502l189710k945535j852181j176045p98624m02567
$$ 28209303 20209679 14779177 11589467 8643932 6791751 5615706 4817082 4414515
13961D414515o04120l08334L8638k06606l261k08338m50747l35839J78812K80401
$$ 4414515 3810395 3502061 3540699 3334093 3330832 3122494 2671747 2335908 2514720 2795121
13951B795121l97915p7402J81960J12847j16426l04070J26699m9383j90546j22518
$$ 2795121 2397206 2319804 2501764 2614611 2498185 2194115 2320814 2271431 2080885 1958367
13941A958367M8591Q6694j01137L60834k91628j4825r1959J15412K61014n1013
$$ 1958367 2006958 2093652 1992515 2353349 2061721 2046896 1954937 2070349 2331363 2280350
13931B280350l27904q6749j6544K5560J73648k13874j14518K79657j70579l1650
$$ 2280350 1952446 1865697 1849153 1874713 2048361 1834487 1719969 1999626 1829047 1797397
13921A797397o677k42896L13140L9632r7813M957q9714O2166k68760J35800j78832
$$ 1797397 1790720 1547824 1860964 1900596 1802783 1807740 1718026 1780192 1511432 1647232 1468400
13910A468400K36310j66148n0489J62042p9150j03536N5682J8184j38211M38554
$$ 1468400 1704710 1538562 1488073 1650115 1570965 1467429 1523111 1541295 1403084 1841638
13900A841638k94030L06718l62898k11769K90570l2884o7304P8352k60227o4325
$$ 1841638 1547608 1854326 1491428 1279659 1570229 1537345 1470041 1548393 1288166 1223841
13890A223841K79338O5578j90399j21289M20641q4001j57869J13102k50554r7917
$$ 1223841 1503179 1568757 1378358 1257069 1677710 1593709 1435840 1548942 1298388 1200471
13880A200471k0652L38760j58156k21441l2123N89152k26265l10046K65375O6549
$$ 1200471 1179819 1518579 1360423 1138982 1106859 1696011 1469746 1159700 1425075 1491624
13870A491624k89389r0280J65391j41531n3683J42772K63054m33355K33232L9505
$$ 1491624 1202235 1111955 1277346 1135815 1082132 1224904 1487958 1054603 1287835 1327340
13860A327340l89512M95052J12084n55100J578K35969j59884J81154J82807j41924
$$ 1327340 937828 1432880 1544964 989864 991442 1227411 1067527 1248681 1431488 1289564
13850A289564L4423q0255J09046K5089m14864M29184F90029L18569J85669j42728
$$ 1289564 1323987 1243732 1352778 1377867 963003 1392187 690029 1008598 1194267 1051539
13840A051539K56319k92526J48271j57203r7660r2663L60389r60m20114M80981
$$ 1051539 1307858 1015332 1163603 1006400 908740 816077 1176466 1175506 755392 1236373
13830A236373l05599p3756r8333M25218j78621J11305L4093k62137K14826K84964
$$ 1236373 930774 857018 758685 1183903 1005282 1116587 1150680 888543 1103369 1388333
13820A388333p7232F45652M99972r905k05171r9480L9069J69694k16395K02212
$$ 1388333 1311101 645652 1145624 1135719 930548 831068 870137 1039831 823436 1025648
13810A025648j80697J99364J28875l24417o4338j61367M29004j64839N123o1669
$$ 1025648 844951 1044315 1173190 848773 784435 623068 1052072 887233 892356 830687
13800H30687K07517J2581N9009j61957k24529L42844n7467N0393k15511r9864
$$ 830687 1038204 1050785 1109794 947837 723308 1066152 1008685 1059078 843567 743703
13790G43703J90672o140j74647L25340j65896k80279P4093K40134C49034N14453
$$ 743703 934375 928235 753588 1078928 913032 632753 706846 946980 349034 863487
13780H63487K38403j75726J44649J47275n50929N8664L19930n06431N01136l88800
$$ 863487 1101890 926164 1070813 1218088 667159 725823 1045753 539322 1040458 651658
13770F51658L97003m94347J62582K47313k20489j05710N2508K72640k29857j0922
$$ 651658 1048661 554314 716896 964209 743720 638010 690518 963158 733301 722379
13760G22379j51942K41232l32351J70674Q2318m2323Q817J04460m4728k19549
$$ 722379 570437 811669 479318 649992 732310 689987 698804 803264 758536 538987
13750E38987j34735N08807K05678l91036J9590Q392J2271K92782j92947q5856
$$ 538987 404252 913059 1118737 727701 747291 755683 767954 1060736 867789 781933
13740G81933j38188Q0275k47406L1889K42346k95945j72997N47896l68587J99420
$$ 781933 643745 724020 476614 508503 750849 454904 281907 829803 461216 660636
13730F60636J07037J05033K42616n35576K96446j85557j14589M5946k65522K74582
$$ 660636 767673 872706 1115322 579746 876192 690635 576046 621992 356470 631052
13720F31052k11544R0556M8546K02770o7347j93913M00816k99858k71712K9583
$$ 631052 419508 510064 558610 761380 694033 500120 900936 601078 329366 358949
13710C58949K6429K10184J45866K327k49805j73591K74343R3180n7319j82557
$$ 358949 385378 595562 741428 743755 493950 320359 594702 687882 630563 448006
13700D48006L87924j23171K4846j88414J18984k502k15340J96915k9993L8071
$$ 448006 835930 712759 737605 549191 668175 665673 450333 647248 617255 655326
13690F55326n680J65932l35370P5382o3709j70481J40391J62793j54909J27138
$$ 655326 649646 815578 480208 555590 491881 321400 461791 624584 469675 596813
13680E96813A90205K65452J7385J63658l14645M00183C13976K55429N8711m6816
$$ 596813 190205 455657 473042 636700 322055 722238 313976 569405 628116 581300
13670E81300j18417J82217r1217K16639k36352q965J94905j61906o4579J66036
$$ 581300 462883 645100 553883 770522 534170 525205 720110 558204 493625 659661
13660F59661k40548l6348j2948n7988L14905m4872B48075O2447A01744P82333
$$ 659661 419113 382765 369817 311829 626734 581862 248075 310522 101744 884077
13650H84077q9955B84589J25648J86431K4921o7185N4769q4192q2438K19075C18692
$$ 884077 794122 284589 410237 596668 621589 554404 609173 524981 442543 661618 318692
13638E76501j00670B00432p528M03773J03406j29916B84664K59492j892A18274
$$ 576501 475831 200432 192904 596677 700083 570167 284664 544156 542264 118274
13627B66307Q3489J52170K1758j78650J41949m4545J27160q4253j71833L01168
$$ 266307 349796 501966 523724 345074 487023 442478 569638 485385 313552 614720
13617F14720j20817j48357P4243J1754j76428J54914M9362L7361J18603B78309
$$ 614720 493903 345546 419789 431543 255115 410029 459391 496752 615355 278309
13606B92859O0788m1042M29703C12252K84624J48211A98151M98880k45338L36325
$$ 292859 353647 312605 742308 312252 596876 745087 198151 697031 451693 788018
13596G88018C42507o4871J00314j3672L04201l20984J23159n7424A63540J81175
$$ 788018 342507 277636 377950 364278 668479 347495 470654 413230 163540 344715
13586C44715K0330J32013j31140J5940J9685j22158P9987j2989l8121Q6917r3737
$$ 344715 365045 497058 365918 381858 401543 279385 359372 346383 308262 395179 301442
13575C01442Q0621j58732J92070j70364J87697B07237J25685P2008M41958B41019
$$ 301442 382063 223331 415401 245037 432734 207237 332922 404930 846888 241019
13564C37299K6847A72905K9176K08806A52888J06370J84557Q788A87180L97167
$$ 337299 364146 172905 202081 410887 152888 259258 443815 452603 187180 584347
13554E84347j03704r461K84915r9032j44771A51454J17367A15009L61666j80960
$$ 584347 480643 471182 756097 657065 512294 151454 268821 115009 476675 295715
13544B95715I4549J48724L06097k49785K92052k22312J2618J55810j12476j60327
$$ 295715 94549 243273 549370 299585 591637 369325 381943 537753 425277 264950
13534B64950k5308J40822j00749K9621C1873K15710J51197A57239M20891C6636
$$ 264950 239642 380464 279715 309336 31873 247583 398780 157239 578130 36636
13523B76274J75610A94156J42596q6541a18796A04529N17918A85764J60470j32212
$$ 276274 451884 194156 336752 250211 -118796 104529 622447 185764 346234 214022
13513B14022J14410j00900O8924Q0509p2269n8168m9221L43512j19029N8696R4786
$$ 214022 328432 227532 296456 376965 304696 246528 197307 540819 421790 480486 575272
13502E75272F6982B9100J23820O17983A79677H3698N25901A00758J78322i372
$$ 575272 66982 29100 152920 770903 179677 83698 609599 100758 279080 -9372
13491D18535A63054E1634J26331c3056C45323j40659F4439M43272c0759D72742
$$ 418535 163054 51634 177965 -33056 345323 204664 64439 507711 -30759 472742
13480D4813K07103j3718j396L2659Q1436A47154k8468g5304A90315H9331K26614
$$ 44813 251916 238198 236802 269461 350897 147154 118686 -75304 190315 89331 315945
13469C15945N3811m6353J70825k07629F379K25471k3890H589L01743J77273B03805
$$ 315945 369756 323403 494228 286599 6379 231850 207960 8589 310332 487605 203805
13457B26918J39822O5296A95337K81104j38999A2693K33885r1018J73429A07133
$$ 226918 366740 432036 195337 476441 337442 12693 246578 155560 328989 107133
13446C13872K59050B55043Q5461A45110M8810q1302J5542J77945l0637j13469
$$ 313872 572922 255043 340504 145110 193920 112618 128160 306105 275468 161999
13436A61999C3194L23911k3415n935J41033j92139l9551I9940N8056G932a33436
$$ 161999 33194 357105 333690 327755 468788 276649 237098 99940 157996 7932 -133436
13424g3788A72711L4036M11697A22109J10244H9702J11388L7472M6862G2287J31703
$$ -73788 172711 206747 618444 122109 232353 89702 201090 238562 285424 72287 203990
13413B03990d3135j7058C49129n7850l3241c9695D45651j88768J68101j7648J5701
$$ 203990 -43135 -60193 349129 291279 258038 -39695 445651 256883 424984 407336 423037
13402D23037a20690B31852K18280a562E690a83607C92403c31638D18941j20827
$$ 423037 -120690 231852 450132 -1562 5690 -183607 392403 -331638 418941 298114
13392B98114j03285J97937Q328m6379A13674B3858K06456B1697M6735J33363J58688
$$ 298114 194829 392766 401094 354715 113674 23858 230314 21697 68432 201795 360483
13381C60483A54359M22818G9993k97j6592K49034A29744J90359L27667B97470
$$ 360483 154359 577177 79993 79696 63104 312138 129744 320103 647770 297470
13370h7144F9248M3218J5844j9907Q7015Q2206E1838L45885g0604A57487B901
$$ -87144 69248 112466 128310 108403 195418 277624 51838 397723 -70604 157487 2901
13358B28995R6075J20778k08052G7314h6227B03693m3544i779E14069P9969B70315
$$ 228995 325070 445848 237796 77314 -86227 203693 160149 -9779 514069 594038 270315
13346A46233K26991G9808K20576b12833A4626Q7625a22391F8810M56734a9265
$$ 146233 373224 79808 300384 -212833 14626 102251 -122391 68810 525544 -19265
13335A45720F2749K31328l7530J9013I4326J20920e460C78828A42645J20178j8679
$$ 145720 62749 294077 256547 275560 94326 215246 -5460 378828 142645 262823 244144
13324B44144K02760j54521A21618J72916A35491K98087j68431J69640G7825J11858
$$ 244144 446904 292383 121618 294534 135491 433578 265147 434787 77825 189683
13314A89683J19422a63587B72329a1688I7426J41623K14104A27194E6968J80438
$$ 189683 309105 -163587 272329 -11688 97426 239049 453153 127194 56968 237406
13304B37406d238A01200L89455B13812a6107D08574j32470A32816J35657k9823
$$ 237406 -4238 101200 490655 213812 -16107 408574 276104 132816 268473 238650
13294B38650R2401j61841K47855j55328J40213j18620j16267m7626L8300J0995
$$ 238650 331051 169210 417065 261737 401950 283330 167063 119437 157737 168732
13284A68732E9953A4992L12677r5234j7528H337L31990H7125a2484B09585g8223
$$ 168732 59953 14992 327669 232435 214907 8337 340327 87125 -12484 209585 -78223
13272I2757K82325A17855L42077F1835M4114J03101j193a62773A3951P6689f7662
$$ 92757 375082 117855 459932 61835 105949 209050 207857 -162773 13951 90640 -67662
13260c7666E5457B4831J7215J22054M8713l7005a18616C5172J18761p2383a4825
$$ -37666 55457 24831 42046 164100 212813 175808 -118616 35172 153933 81550 -14825
13248F42974B49700J5107b66835A39879H574K39818B0722K76630j33102a6562
$$ 642974 249700 264807 -266835 139879 8574 248392 20722 297352 164250 -16562
13237a91794C0975K49337b32830A87623R1124F6937J94308A25994J7618m5717
$$ -191794 30975 280312 -232830 187623 278747 66937 261245 125994 143612 97895
13227I7895K9778C2193J16697K12471I9280d8383D45471D5416K29483a26551B70200
$$ 97895 127673 32193 148890 361361 99280 -48383 445471 45416 274899 -126551 270200
13215a47747B39288b15857b8768j48600i958F8785J39267J13896a614C06718j24767
$$ -147747 239288 -215857 -28768 -177368 -9958 68785 208052 321948 -1614 306718 181951
13204A81951J07938n5284G0555M7091C328M79418B4766J69622g372E3423O5824
$$ 181951 289889 234605 70555 117646 3328 482746 24766 194388 -7372 53423 119247
13193A19247J63936A22588J03248B5286K39536a43300d4687A0868c28960A36407
$$ 119247 283183 122588 225836 25286 264822 -143300 -44687 10868 -328960 136407
13182B42083n6153b5068B97971m2102p6481E3331a65495A84946C2902b34526a06067
$$ 242083 185930 -25068 297971 255869 179388 53331 -165495 184946 32902 -234526 -106067
13170A17866a77152L7462f3893A14452m6912e6934A76633K32367j07516f6773
$$ 117866 -177152 -139690 -63893 114452 67540 -56934 176633 409000 301484 -66773
13159b03677A53698J2630q2368J66999r0821L5156E1882D105J05804h1828A18949
$$ -203677 153698 166328 83960 250959 160138 195294 51882 4105 109909 -81828 118949
13147B46562B9514K18400j03138d0909B99663a07696A51406J89449o3201E5647
$$ 246562 29514 247914 144776 -40909 299663 -107696 151406 340855 277654 55647
13136C76348A59327n6174J66100b9637A77959n009E5262P2478n9836b22178Q2016
$$ 376348 159327 103153 269253 -29637 177959 172950 55262 127740 67904 -222178 -140162
13125a40162I6600K22103B6356M40199b58730C5763R2571b06117O1601H1452f65
$$ -140162 96600 318703 26356 466555 -258730 35763 128334 -206117 -144516 81452 -665
13113B99733H4337J93277q4876J07302G9219b10080g4204H0020a52173C16889
$$ 299733 84337 277614 192738 300040 79219 -210080 -74204 80020 -152173 316889
13102B40532a20685B00176a42864D0630J21532C9186Q8747P8509E054J52823D1907
$$ 240532 -120685 200176 -142864 40630 162162 39186 127933 206442 5054 157877 41907
13090i847C56248H9825K5378C1066K3704b32003B16947J31583k1121A59782J7619
$$ -9847 356248 89825 115203 31066 54770 -232003 216947 348530 327409 159782 177401
13079A77401Q297n1604J78152d064j51921A76223g3330A24048a51520B59971i369
$$ 177401 185698 134094 312246 -4064 -155985 176223 -73330 124048 -151520 259971 -9369
13067A32803d9254G3979J36245M964n2525h2554H3658C4694N2601C0120J79437
$$ 132803 -49254 73979 210224 215188 162663 -82554 83658 34694 87295 30120 209557
13056B09557J0426j0643M4517j08389j8571n9847O4431J1946m704f86B15446R8337
$$ 209557 219983 209340 253857 145468 126897 67050 131481 143427 138723 -686 215446 313783
13044C13783a14317l7858N9483B70460a70992G6401J65098R1108G3849J69220
$$ 313783 -114317 -152175 -92692 270460 -170992 76401 241499 332607 73849 243069
13034B43069f8730G491a51738A36154r726o1183M46145B4742J0127M8938K0967
$$ 243069 -68730 7491 -151738 136154 126428 65245 511390 24742 34869 83807 104774
13023A04774j0566M4238J60027L7504h4398A60897a28710d2034E44233c4180d305
$$ 104774 94208 138446 298473 335977 -84398 160897 -128710 -42034 544233 -34180 -4305
13011E1422J4936K33085D4119K13414H8572a3213A76554o3600Q8034p8350a54312
$$ 51422 66358 299443 44119 257533 88572 -13213 176554 112954 200988 122638 -154312
12999b41297A15820E2099J99414f0791A62092c3058B09272i4722B60739K6650
$$ -241297 115820 52099 251513 -60791 162092 -33058 209272 -94722 260739 287389
12989B87389A42674e9559A93567m4880h474j70899B25451j00742R8502E8926a042
$$ 287389 142674 -59559 193567 148687 -8474 -179373 225451 124709 223211 58926 -1042
12977B1249e3538K4633r8280c9802j21733B94870g4271G129M5925a48901I1001
$$ 21249 -53538 -28905 -127185 -39802 -161535 294870 -74271 7129 53054 -148901 91001
12965a58169B05702b3239A27997b08944A31039P7717g4810c4607m7315D5617Q8568
$$ -158169 205702 -23239 127997 -208944 131039 208756 -74810 -34607 -81922 45617 134185
12954A34185L8163a09169b0812k9572B63609j05008f2071G864J70611l899n3567
$$ 134185 172348 -109169 -20812 -50384 263609 158601 -62071 7864 178475 174576 121009
12943A21009a16984j70057i1004A06539A4740a8578C17865j40897e3220A94735
$$ 121009 -116984 -287041 -91004 106539 14740 -18578 317865 176968 -53220 194735
12932B06974R019k6753L07032B41875l7953G3045j3419e6738A19583D0999i1565
$$ 206974 215993 189240 496272 241875 203922 73045 59626 -56738 119583 40999 -91565
12920A45056g5047m944j57945r7516C214J52137R277e4377j40231B1331i7566
$$ 145056 -75047 -79991 -237936 -335452 3214 155351 164628 -54377 -194608 21331 -97566
12908e0083q8953B13332C8176L831L43844a54854A95038H4324A5241K98873b6440
$$ -50083 -139036 213332 38176 42007 385851 -154854 195038 84324 15241 314114 -26440
12896B37743d3709B89889A07007I298L76574A57269J33598b45965A60376p2J85537
$$ 237743 -43709 289889 107007 9298 385872 157269 290867 -245965 160376 160304 345841
12885C45841b0558A31845C47J88417k3405f6594j49195Q1092j70450A49227O0142
$$ 345841 -20558 131845 347 188764 165359 -66594 -215789 -134697 -305147 149227 209369
12874B09369h5553i803F4493e748A24948i1746F9428O5322Q3197I5498J2385P7410
$$ 209369 -85553 -9803 64493 -5748 124948 -91746 69428 134750 217947 95498 107883 185293
12862A85293N2019c96039h3245j06830A1937a5137B3493K53605h2239C78595H3637
$$ 185293 237312 -396039 -83245 -190075 11937 -15137 23493 277098 -82239 378595 83637
12850A92112b16348K1509E5719J01212B4959a08318A9954a88069A41594a98787
$$ 192112 -216348 -194839 55719 156931 24959 -108318 19954 -188069 141594 -198787
12839b03022K0642b5900B53273a20913A42646J32772a58199f6580p804A66467
$$ -203022 -182380 -25900 253273 -120913 142646 275418 -158199 -66580 -74384 166467
12828a08026n1208D58785A65817J00852r3658M0085a2765q8407g675B58697J09444
$$ -108026 -159234 458785 165817 266669 173011 213096 -12765 -101172 -7675 258697 368141
12817C68141j03371h8608F68477b53883f7502G2417K3875f4768A97050J81356
$$ 368141 264770 -88608 668477 -253883 -67502 72417 96292 -64768 197050 378406
12807C78406A04184f2384E698K30156k8442H4210C1299P4441l7109D487K9882
$$ 378406 104184 -62384 5698 235854 207412 84210 31299 105740 68631 4487 34369
12796C4369f9989A74742H2136e6268j31952C33785c14124A43782K09845a19246
$$ 34369 -69989 174742 82136 -56268 -188220 333785 -314124 143782 353627 -119246
12785a4071k45334c4926j90457i9240A52182d3567A72504L5263R7767j26220b1384
$$ -14071 -259405 -34926 -225383 -99240 152182 -43567 172504 207767 305534 179314 -21384
12773c8247A17439n1566K685l0118h3291G5346i565n1661a0321m1369E075K70194
$$ -38247 117439 65873 68558 38440 -83291 75346 -9565 -61226 -10321 -51690 5075 275269
12761B75269a57212A29573m6450A3021k613a1738B09243G1458J05223a58290d4043
$$ 275269 -157212 129573 83123 13021 10408 -11738 209243 71458 176681 -158290 -44043
12749a65069B76629j02249F141b209D0122J91656J2406a66848a543B4572a01167
$$ -165069 276629 174380 6141 -2209 40122 231778 244184 -166848 -1543 24572 -101167
12737B77032G718L2822L571b859q6926J4004A16026i0341C06100a71664C2974
$$ 277032 7718 40540 44111 -2859 -89785 -75781 116026 -90341 306100 -171664 32974
12725a75709e1584B24195G4265a8312k60571a32169F4566c8329A77378D8233O0683
$$ -175709 -51584 224195 74265 -18312 -278883 -132169 64566 -38329 177378 48233 108916
12714A08916K31881g7527A19288g6286B0684a3483k0369A2720K53501F4566J48711
$$ 108916 340797 -77527 119288 -76286 20684 -13483 -33852 12720 266221 64566 213277
12703B13277a79995q5359h933A57007g1463F9078c2065B78109D2605a18763C9055
$$ 213277 -179995 -265354 -8933 157007 -71463 69078 -32065 278109 42605 -118763 39055
12691B47674A07219L3973n6790J22783J61404A17212n5596h0623G2557J30575
$$ 247674 107219 141192 84402 207185 368589 117212 61616 -80623 72557 203132
12681B03132j5205b6036C87792b7409j01296G7463h5516k20373e8400A1112R7184
$$ 203132 187927 -26036 387792 -27409 -128705 77463 -85516 -305889 -58400 11112 108296
12670A08296A3878L5625c93246A08636b12031D075R6114b41167A55134D1793h6583
$$ 108296 13878 49503 -393246 108636 -212031 4075 100189 -241167 155134 41793 -86583
12658C4650J28394a5694B50114h2234A8328J85689B1116K36393M9190a04294J4602
$$ 34650 163044 -15694 250114 -82234 18328 204017 21116 257509 306699 -104294 -89692
12647h9692A9070L82127H6934D2953J16765C7665J26283C9788K76798a46238C1016
$$ -89692 19070 401197 86934 42953 159718 37665 163948 39788 316586 -146238 31016
12635C32925j4771A40523a80575A30535L30641B28854i0779B81016n2061I7834
$$ 332925 318154 140523 -180575 130535 461176 228854 -90779 281016 228955 97834
12624H5474a14021A43246A5889a23719q0259D4009K39183D3481J85951c1228D92443
$$ 85474 -114021 143246 15889 -123719 -203978 44009 283192 43481 229432 -31228 492443
12612A18064K32750l8510J72899J986f3035B93947J33936Q6858A23455J90010
$$ 118064 350814 312304 485203 487189 -63035 293947 427883 514741 123455 313465
12602C13465c05672A730J67944j7905D4301J4964f7784A9800R2418d5080A6328
$$ 313465 -305672 1730 169674 151769 44301 59265 -67784 19800 112218 -45080 16328
12590A96993p1060a6044q3446I7279a17903D0533K35422A11010J07669R6563o1864
$$ 196993 125933 -16044 -99490 97279 -117903 40533 275955 111010 218679 315242 253378
12579B53378a91746I8038a33151A22300K27990I7825c2021A68001K78903g4587
$$ 253378 -191746 98038 -133151 122300 350290 97825 -32021 168001 446904 -74587
12568e5142C8742a5483D4757O8041f7609A14718b74189a06492j39717a257C4553
$$ -55142 38742 -15483 44757 112798 -67609 114718 -274189 -106492 -246209 -1257 34553
12556b68328i8953A11945a462A67800a34187G540e911A55980b7432B67392A05298
$$ -268328 -98953 111945 -1462 167800 -134187 7540 -5911 155980 -27432 267392 105298
12544H0839J21108a09239B03441b5368m0468F8028J73152d1930n7442i915n5936
$$ 80839 201947 -109239 203441 -25368 -65836 68028 241180 -41930 -99372 -9915 -65851
12533f5851B45597G1271d3944A17590b101q5099p6074a0966A6361a2100A29221
$$ -65851 245597 71271 -43944 117590 -2101 -87200 -163274 -10966 16361 -12100 129221
12521D34651a03381b907m2405A45612j8260B1866K50889i0160A68603A5041M502
$$ 434651 -103381 -2907 -45312 145612 127352 21866 272755 -90160 168603 15041 19543
12510A9543Q371b49640J14028A15708J66296b4479A18429J39760f7528B58080
$$ 19543 27914 -249640 -135612 115708 282004 -24479 118429 258189 -67528 258080
12499c25508i7039H3693A6996M46286A2314P2227b5917B03080R8381H4566b25892
$$ -325508 -97039 83693 16996 463282 12314 84541 -25917 203080 301461 84566 -225892
12487A80650b5905m762B87571j21442a8879i38E3027O155a07069K4983j2607A04386
$$ 180650 -25905 -30667 287571 166129 -18879 -938 53027 59182 -107069 -82086 -94693 104386
12474F7094L41965H169K3408P1128a09320j6481A71060i0927C3948e59217b60079
$$ 67094 409059 8169 31577 102705 -109320 -125801 171060 -90927 33948 -559217 -260079
12462B74261h3661B02066D9842J1025a06812n102n4164c4793r29k32212A2551
$$ 274261 -83661 202066 49842 60867 -106812 -111914 -166078 -34793 -35722 -267934 12551
12450A27782L1669a68940M6386M91j58726E2535a42752F7590M7790o895A1281
$$ 127782 159451 -168940 -122554 -122063 -280789 52535 -142752 67590 115380 108485 11281
12438E9404e2222n8458K4711G9598M0982J70813A4513f4748l06381J75686C88173
$$ 59404 -52222 -110680 -85969 79598 120580 291393 14513 -64748 -371129 -195443 388173
12426D0705J01394a1515F9467e0130j1160A65454J11225c637A21933K4256J5570
$$ 40705 142099 -11515 69467 -50130 -61290 165454 276679 -3637 121933 146189 161759
12415A61759b0585A69767H0044i0181A76355F9752e5283k46835B4647a02603A94117
$$ 161759 -20585 169767 80044 -90181 176355 69752 -55283 -302118 24647 -102603 194117
12403A39199m7986a51278C37312b43837A81283e8764E7284i8508G3260J8210q770
$$ 139199 91213 -151278 337312 -243837 181283 -58764 57284 -98508 73260 91470 82700
12392H2700J24652H4226R6395b70111a29840k27995B77828A01562a4701j88147
$$ 82700 207352 84226 180621 -270111 -129840 -357835 277828 101562 -14701 -202848
12382b02848A71550O131b26954j06624A59470N6174f0669e080j68874A17204C3455
$$ -202848 171550 177681 -226954 -333578 159470 215644 -60669 -5080 -173954 117204 33455
12370a19644A5841b23031B29996a13625P344E3398a48119A94696O8669i3134c5659
$$ -119644 15841 -223031 229996 -113625 -106281 53398 -148119 194696 263365 -93134 -35659
12358a87528B89773j42145L2518d2144o1266j67242A89520n7334n2599Q1232c03529
$$ -187528 289773 147628 180146 -42144 -103410 -270652 189520 132186 79587 160819 -303529
12346a69938b8925A32953P0893e0539k52987a44397L4015A02405b26467c9097
$$ -169938 -28925 132953 203846 -50539 -303526 -144397 -110382 102405 -226467 -39097
12335C14283d41860A08198P4233I317O3674B8043R2094a69672c1645B18297B7135
$$ 314283 -441860 108198 182431 9317 72991 28043 120137 -169672 -31645 218297 27135
12323i711A87812F1592b5041g791k37893c8156k7232A25848n5462A5695J03926
$$ -9711 187812 61592 -25041 -7791 -245684 -38156 -65388 125848 70386 15695 119621
12312A19621f5235B31698g0263A32122K09980a3180k13923E7052J32512h7077
$$ 119621 -65235 231698 -70263 132122 342102 -13180 -227103 57052 189564 -87077
12301a10955q6645M5105D02985E1182R3670a07970L7350E0035K49545a01128A32629
$$ -110955 -197600 -152495 402985 51182 144852 -107970 -70620 50035 299580 -101128 132629
12289D0182J28372G7758d8623j39547B5857l458L01670Q4001j98649o4857a98839
$$ 40182 168554 77758 -48623 -188170 25857 22399 324069 408070 209421 144564 -198839
12277A05174a79605A23842a86635A02631J14738a0727B47282h2270D2788a26261
$$ 105174 -179605 123842 -186635 102631 217369 -10727 247282 -82270 42788 -126261
12266H1260h8432l6107D6563i7121P818A85636f7856B38613e8077C79455E305
$$ 81260 -88432 -124539 46563 -97121 -89303 185636 -67856 238613 -58077 379455 5305
12254b7615B90499J25279b5977l1867E5413m666P2666n4821A6061O4955a10882
$$ -27615 290499 415778 -25977 -57844 55413 50747 123413 68592 16061 81016 -110882
12242I3318P6902J19196j09961q4296b2027p1760d0101n3133D5980i5311A3719
$$ 93318 170220 289416 179455 95159 -22027 -93787 -40101 -93234 45980 -95311 13719
12230a73957f1358A40351N948l9360a57594A48388b06248B23203A590K43299A09408
$$ -173957 -61358 140351 146299 106939 -157594 148388 -206248 223203 1590 244889 109408
12218A09523e6421B60551l0582M3417G77a7684j4241j17699B53392A00534J03109
$$ 109523 -56421 260551 229969 273386 777 -17684 -31925 -149624 253392 100534 203643
12207B03643L934A060K85442D6177L32784j52129L17401j12214n4970O2340c6187
$$ 203643 207577 1060 286502 46177 378961 226832 544233 432019 377049 439389 -36187
12195A71897F9288K93250j03959Q7633j53461O8722P2576j56421K50305A59495
$$ 171897 69288 362538 258579 346212 192751 261473 334049 177628 427933 159495
12184B70460j5111G5401J59008j10550N297N6328M1467C5664L27239j67030M8559
$$ 270460 255349 75401 234409 123859 129156 185484 226951 35664 362903 195873 244432
12173B44432K8906n4856P4270Q1882n7336j13392D0591J59905a4176B22066B011
$$ 244432 273338 218482 292752 374634 317298 203906 40591 200496 -14176 222066 2011
12161a03663K186A83546p4515J10404L2340a28663c0949F5212K69962j37273L5085
$$ -103663 -101477 183546 109031 219435 251775 -128663 -30949 65212 335174 197901 232986
12150B32986h0264l8846I3725K60663j25698a05092o1347A8130K4206R7732J36740
$$ 232986 -80264 -119110 93725 354388 228690 -105092 -166439 18130 42336 140068 276808
12139B76808k5432a18628F8027a98419a8275A26460N9182e3321k3737a0751E2895
$$ 276808 251376 -118628 68027 -198419 -18275 126460 185642 -53321 -77058 -10751 52895
12127D73074A1919N3366b008B36604H6215a82058D6697b1970g069G3021l1441
$$ 473074 11919 65285 -2008 236604 86215 -182058 46697 -21970 -7069 73021 41580
12116D1580J75487a27723N1656R789j25989A30669J23866D7918f5021C122a82392
$$ 41580 217067 -127723 -76067 -66278 -192267 130669 254535 47918 -65021 3122 -182392
12104g2237B07570P9615a13736B82060a44789o1437c6998j17077B50612A14860
$$ -72237 207570 287185 -113736 282060 -144789 -206226 -36998 -154075 250612 114860
12093e8611j07269k93520b1290B8804b35215J10559j76909i0365p743d8566G7382
$$ -58611 -165880 -459400 -21290 28804 -235215 -124656 -301565 -90365 -98108 -48566 77382
12081G1359l3486a0418I9699b00044f5460B51578A21229P7737a37936A63318J20228
$$ 71359 37873 -10418 99699 -200044 -65460 251578 121229 198966 -137936 163318 283546
12070B83546I9359h1378B66476n6511a67357a3096C0134K40805K44557L33745
$$ 283546 99359 -81378 266476 209965 -167357 -13096 30134 270939 515496 849241
12060H49241K27167l49671B26477q9627J4387K40658r4620G0321b17165H6846
$$ 849241 1076408 726737 226477 136850 151237 391895 297275 70321 -217165 86846
12049f2860b763j27041o2281A67309e1178b3653l8272a2887A05588E0921J3305
$$ -62860 -2763 -129804 -192085 167309 -51178 -23653 -61925 -12887 105588 50921 64226
12038F4226J48406e1237I1095O5996f3904l2552D703b99142B6463b1485k41704
$$ 64226 212632 -51237 91095 157091 -63904 -96456 4703 -299142 26463 -21485 -263189
12027b63189A99703a43100H1175d09840A58884M8970b9542L824C1764b96327f4271
$$ -263189 199703 -143100 81175 -409840 158884 207854 -29542 -25718 31764 -296327 -64271
12015A51208b70539B33171j4803e40137A57967E477K6951b32986A84785b22209
$$ 151208 -270539 233171 218368 -540137 157967 5477 32428 -232986 184785 -222209
12004A26196f3756A36839b71908A28172f9795b9093B317a17761B49871G0416K19002
$$ 126196 -63756 136839 -271908 128172 -69795 -29093 2317 -117761 249871 70416 289418
11993B89418d0006o1432j03943n45O423G417R8922K86917a23479C27078I2804
$$ 289418 -40006 -101438 -205381 -205926 -199503 7417 106339 393256 -123479 327078 92804
11981A92337b14820h4200m4425k8130l3962A91731f5622H9474K13897G3390K2076
$$ 192337 -214820 -84200 -128625 -156755 -190717 191731 -65622 89474 303371 73390 95466
11970I5466a4432k14687g7597K220j15215d779E7249a03507B9638J06545a74715
$$ 95466 -14432 -229119 -77597 -75377 -190592 -4779 57249 -103507 29638 136183 -174715
11958a8346l42996a313n6843B33819B9626L37796j76617c9115G4567a06253l19338
$$ -18346 -361342 -1313 -58156 233819 29626 367422 190805 -39115 74567 -106253 -425591
11947d25591b9430j20361A74655F9279a9291g680B7059g3123E90h1786A0069b15760
$$ -425591 -29430 -149791 174655 69279 -19291 -7680 27059 -73123 590 -81786 10069 -215760
11934A3896K76426d58490B11331b15278G8436b41266C1569r387b37812e1293H3592
$$ 13896 290322 -458490 211331 -215278 78436 -241266 31569 22182 -237812 -51293 83592
11922A96870a6866o6643A35175b14166h595A25082E7371L06202a17281J5616d2093
$$ 196870 -16866 -83509 135175 -214166 -8595 125082 57371 363573 -117281 -101665 -42093
11910A9753c6656J0007A21220a28730L6815A09992n072A5490b2808j87091B19622
$$ 19753 -36656 -26649 121220 -128730 -91915 109992 104920 15490 -22808 -209899 219622
11898B85398a64918o0114A87385a42599D1886P6092c34763a16282D8323c4783
$$ 285398 -164918 -225032 187385 -142599 41886 117978 -334763 -116282 48323 -34783
11887b47599A68622i5596a3055j65211P0175A10717C4676a35230L0167B80709
$$ -247599 168622 -95596 -13055 -178266 -108091 110717 34676 -135230 -105063 280709
11876A14682b65559Q4804o0537O0981B4156b61010F1944K18685e1756j98258a05965
$$ 114682 -265559 -180755 -241292 -180311 24156 -261010 61944 280629 -51756 -250014 -105965
11864A33106g8595j54195M9019b9462e784k30533A8708D898L6888C35a33474a9076
$$ 133106 -78595 -232790 -183771 -29462 -5784 -236317 18708 4898 41786 335 -133474 -19076
11851a87590j05333a31010K3832D8217k542a10697k8802N9861a5525A22982m2967
$$ -187590 -292923 -131010 -107178 48217 45675 -110697 -139499 -79638 -15525 122982 80015
11840H0015C3203K2587J69019b01341A06652e4630j5145C2608i4771F6196a4549
$$ 80015 33203 55790 224809 -201341 106652 -54630 -69775 32608 -94771 66196 -14549
11828c17794H8973a26458b8818J1469k39432c9014F8977a12962l8550m3589F4040
$$ -317794 88973 -126458 -28818 -17349 -256781 -39014 68977 -112962 -151512 -195101 64040
11816a24333H5734j7375e4141A28508c19702b7524k36593A06919b71519A02366
$$ -124333 85734 68359 -54141 128508 -319702 -27524 -264117 106919 -271519 102366
11805a09465j2632L3251E5340a8151L756j7886D8658f072A85873B569a21163D00793
$$ -109465 -122097 -88846 55340 -18151 -14395 -32281 48658 -6072 185873 2569 -121163 400793
11792a79633e2654C9741a43471l20131g8694k67258C6867Q0539j8517i2451L9770
$$ -179633 -52654 39741 -143471 -463602 -78694 -345952 36867 117406 98889 -92451 -52681
11781e2681i865o0231C51045a22134H9782a78007A54021i5135j7920k05980f7605
$$ -52681 -9865 -70096 351045 -122134 89782 -178007 154021 -95135 -113055 -319035 -67605
11769c4577r7042N0236b7376L349k5706D0194c66749a60489A15625a98k85339
$$ -34577 -131619 -81383 -27376 -24027 -49733 40194 -366749 -160489 115625 -198 -285537
11758b85537a007A92940d1849r7159o8460L8822Q0937j26216c2441A52162D5181
$$ -285537 -1007 192940 -41849 -139008 -207468 -168646 -87709 -213925 -32441 152162 45181
11746b30792B61844c06973A24394d1214n6236B20686b6257A70761M5806e2261
$$ -230792 261844 -306973 124394 -41214 -97450 220686 -26257 170761 216567 -52261
11735A13654e3576a5050j82918H4758j8660C479a69309J3374D177c67082C67469
$$ 113654 -53576 -15050 -197968 84758 66098 3479 -169309 -155935 4177 -367082 367469
11723i4327j47918j68449D3436b25657F3488a38576e2705k33660E4256b89056
$$ -94327 -242245 -410694 43436 -225657 63488 -138576 -52705 -286365 54256 -289056
11712a24110H4673K79513G5885b33997A73614E7286j4542K35833l2191A20626
$$ -124110 84673 364186 75885 -233997 173614 57286 42744 278577 246386 120626
11701b89769C8895c334r6972M7004B68590a19528B41658a46471A26607a7095C3371
$$ -289769 38895 -3334 -100306 -53302 268590 -119528 241658 -146471 126607 -17095 33371
11689B61015a12835p2014B68160a76189J0262G0925a75120b7093j32359g577D4287
$$ 261015 -112835 -184849 268160 -176189 -165927 70925 -175120 -27093 -159452 -7577 44287
11677B33545k2130J05081A8516b33749b5899m1058N799k9400J5371B22782Q4747
$$ 233545 211415 316496 18516 -233749 -25899 -66957 -61158 -90558 -75187 222782 307529
11666C07529A03156f6342D0479J40269r0059a87527B4086a38672c8207i791A34921
$$ 307529 103156 -66342 40479 180748 90689 -187527 24086 -138672 -38207 -9791 134921
11654G3230b03279k0234A0130Q4435J17510a6200A17568K66641I4502e8309A04264
$$ 73230 -203279 -223513 10130 94565 212075 -16200 117568 384209 94502 -58309 104264
11642F936J37376M2931F7889J26420i3423B44916j20475K5455O6008e0647n6311
$$ 6936 144312 187243 67889 194309 -93423 244916 124441 149896 215904 -50647 -106958
11631a06958J5730A27914R0428a24370L6083k3374p8419B01570C4741O3503a40155
$$ -106958 -91228 127914 218342 -124370 -88287 -111661 -190080 201570 34741 98244 -140155
11619A3362J3712a78988B32231g8287B13408g112A88434a29116A21101k3209J08862
$$ 13362 27074 -178988 232231 -78287 213408 -7112 188434 -129116 121101 97892 206754
11608B06754c2675k54675B6365K01252q281H012K1498j1775a68670b9413A07522
$$ 206754 -32675 -287350 26365 227617 219336 8012 29510 17735 -168670 -29413 107522
11596A60823m561l2037a59828e112C78790B419C05Q6870B1622J28960a38513n2961
$$ 160823 156262 124225 -159828 -5112 378790 2419 305 87175 21622 150582 -138513 -191474
11584a91474d7787A67223b2484C0334K33756q9297K18662A51556i3766A86956
$$ -191474 -47787 167223 -22484 30334 264090 174793 393455 151556 -93766 186956
11573b4436B14047N364c56649H1294a82564D36213G8436J27397D0743c95290i951
$$ -24436 214047 219411 -356649 81294 -182564 436213 78436 205833 40743 -395290 -9951
11561b05992d4390A29155b8617q6277A33403I077f167A55141R6437H0170C4183
$$ -205992 -44390 129155 -28617 -114894 133403 9077 -6167 155141 251578 80170 34183
11549A13659R7446a89190a1374F5548g6145A3208K1101a23872A7978R3762j0021
$$ 113659 211105 -189190 -11374 65548 -76145 13208 34309 -123872 17978 111740 101719
11538A01719c1813A72359f3857m4389o0021P8197B7731L90437a31356I2565b4438
$$ 101719 -31813 172359 -63857 -108246 -168267 -90070 27731 418168 -131356 92565 -24438
11526h0938A53611l0131L03642a2468B60181a55063A62512J63320f0871E4625
$$ -80938 153611 123480 427122 -12468 260181 -155063 162512 325832 -60871 54625
11515C40518b14578A27444C8866a51247N6395A70254j3906d6024A70711J1717
$$ 340518 -214578 127444 38866 -151247 -94852 170254 156348 -46024 170711 182428
11505A82428e9854m3723A58284b19961B6743J75871j2127o7619D2618f0134A11111
$$ 182428 -59854 -103577 158284 -219961 26743 202614 190487 122868 42618 -60134 111111
11493a54466b0119F9123E734J50097o7738N9680m0842h5059B42214F0951d17105
$$ -154466 -20119 69123 5734 155831 88093 147773 106931 -85059 242214 60951 -417105
11481d271E0559a04104A94304J38203j57310O787J16883j19467a6396B17807E7619
$$ -4271 50559 -104104 194304 332507 175197 181984 298867 179400 -16396 217807 57619
11469B16931k8889J28499j17236O717A411N2947J1927L11312j79360J42089g0093
$$ 216931 188042 316541 199305 206022 1411 54358 66285 377597 198237 340326 -70093
11457I3598c4748A30732N3081A3682J20972J17805I0860B9614a10260A03506j9059
$$ 93598 -34748 130732 183813 13682 134654 252459 90860 29614 -110260 103506 84447
11446H4447g3719B13430E275J09915B1399J52876n2780m0107M74158a95935G2205
$$ 84447 -73719 213430 5275 115190 21399 174275 121495 81388 555546 -195935 72205
11434a8290A21283n6011B6759K70597r6440b24530A88489J30610C1766J31572
$$ -18290 121283 65272 26759 297356 200916 -224530 188489 319099 31766 163338
11424A63338b3280B31276c30109A3600K4156a16930H837K7603f5438p983f163
$$ 163338 -23280 231276 -330109 13600 37756 -116930 8837 36440 -65438 -73421 -6163
11412g5033a2495A04731g0585j54722A1487b50113r1345A27248e10533a43548
$$ -75033 -12495 104731 -70585 -225307 11487 -250113 -341458 127248 -510533 -143548
11401B1796J88086a01696j63343f7358l2548B93178b93544C58547a8451A87620
$$ 21796 209882 -101696 -265039 -67358 -99906 293178 -293544 358547 -18451 187620
11390E1532N0513B3914a43383D44380e3936m3296G7553K3084h1608A30762m0768
$$ 51532 102045 23914 -143383 444380 -53936 -97232 77553 100637 -81608 130762 89994
11379H9994D162J64537l5780J8945j6204a18666j69507e9569l5418a9076B18523
$$ 89994 4162 168699 132919 151864 135660 -118666 -288173 -59569 -94987 -19076 218523
11367F7174M5580a56450G4869K54176A23317C1888h3774C84621A30000M8453g2172
$$ 67174 112754 -156450 74869 329045 123317 31888 -83774 384621 130000 178453 -72172
11355A85183j9802J7683d6528b0765A80211b56115F7414h1914A19447i676G422
$$ 185183 165381 183064 -46528 -20765 180211 -256115 67414 -81914 119447 -9676 7422
11343a97295G7558l6994a9927j25778k89109C9034j2274b10947J246d9640A22185
$$ -197295 77558 40564 -19927 -145705 -434814 39034 26760 -210947 -209701 -49640 122185
11331c19912d7394E22416e5235A83963J49725A0960a03349A17345n8602J12401
$$ -319912 -47394 522416 -55235 183963 333688 10960 -103349 117345 58743 171144
11321A71144q777G5367d79722g2465p5768j8716A18840D3348a24042A04444B7384
$$ 171144 162367 75367 -479722 -72465 -148233 -166949 118840 43348 -124042 104444 27384
11309a19194H8950K1473f8657j49810N4620m7750A78450c18172e0782I7611a7073
$$ -119194 88950 110423 -68657 -218467 -163847 -211597 178450 -318172 -50782 97611 -17073
11297a13171E3735J00790E9706L2771J2177E2182a53654l1931E3783b15831p896
$$ -113171 53735 154525 59706 92477 104654 52182 -153654 -185585 53783 -215831 -223727
11286b23727e9886B43902b43422f9756k16238A26930a51849b3965k3091o6612
$$ -223727 -59886 243902 -243422 -69756 -285994 126930 -151849 -23965 -47056 -113668
11276a13668j38223j69689i1013o0048j08806A271a58000n3357D9294b285F814
$$ -113668 -251891 -421580 -91013 -151061 -259867 1271 -158000 -211357 49294 -2285 6814
11264A05609a05295F1037a43112B5986M2991a39761c1241j37291M0871f2654k02595
$$ 105609 -105295 61037 -143112 25986 68977 -139761 -31241 -168532 -127661 -62654 -265249
11253b65249J05336A13876i1333k19562G0720f331k74920c5102n6147c0393m89946
$$ -265249 -159913 113876 -91333 -310895 70720 -6331 -281251 -35102 -91249 -30393 -520339
11242e20339E4313i727n2261A65685b00927E8713g9630j42422B64987b20714n3648
$$ -520339 54313 -9727 -61988 165685 -200927 58713 -79630 -222052 264987 -220714 -274362
11231b74362j7952A38616M5241l1168b07119o9001C55372a69960D75164A06158
$$ -274362 -292314 138616 183857 152689 -207119 -276120 355372 -169960 475164 106158
11220h1908j10060A00367a39026c1508r014q5323A7192Q022e1508C447b51296
$$ -81908 -191968 100367 -139026 -31508 -40522 -125845 17192 25214 -51508 3447 -251296
11208c10657H311a09023G1728a32472A39424a35142M0562n032G4708c2918A92126
$$ -310657 8311 -109023 71728 -132472 139424 -135142 -94580 -99612 74708 -32918 192126
11196f6719D9656C952J3117g870P63B5399b20274i0901G1976K1631a50719b5603
$$ -66719 49656 3952 17069 -7870 -7107 25399 -220274 -90901 71976 93607 -150719 -25603
11183b21963d8719G8888f3222B41153a20272j04330K3720E8942J43304D722g9941
$$ -221963 -48719 78888 -63222 241153 -120272 -224602 -200882 58942 202246 4722 -79941
11171a9094A46972b79194k02538b25491m502J13046G1455Q4375b8032j93440J09846
$$ -19094 146972 -279194 -481732 -225491 -229993 -116947 71455 155830 -28032 -221472 -111626
11160a11626I6684j9668a41961o330j12659f6956l35264i4761L8893k898j41446
$$ -111626 96684 77016 -141961 -148291 -260950 -66956 -402220 -94761 -55868 -58766 -200212
11149b00212E622a854n3582A34910B11J13171M8365b10838A76713K6670b22455
$$ -200212 5622 -1854 -55436 134910 211 113382 161747 -210838 176713 203383 -222455
11137A5455g1746n5730N7006n4979a6602m6618K6443A18167j5564D1562b73287
$$ 15455 -71746 -127476 -70470 -125449 -16602 -63220 -36777 118167 102603 41562 -273287
11125d3280G5453M8790h9838A8083c52760I1501Q79a00972d5141A58916c8392
$$ -43280 75453 124243 -89838 18083 -352760 91501 92380 -100972 -45141 158916 -38392
11113e5906A11971J07407b00239H5365C567Q3704d066I8742L8167F0026a76108
$$ -55906 111971 219378 -200239 85365 3567 87271 -4066 98742 136909 60026 -176108
11101B04344b32317B37524F4655a10921I2685J94003A10822e4208F9053c02138
$$ 204344 -232317 237524 64655 -110921 92685 286688 110822 -54208 69053 -302138
11090B57113a8777A98556H1831J43152O7230J30517A49314K60626n1830g3211
$$ 257113 -18777 198556 81831 224983 292213 422730 149314 409940 358110 -73211
11079g9727A80450L42032r2898G5578L576J82325J44889H0172M64695A53542d7073
$$ -79727 180450 522482 429584 75578 79154 261479 406368 80172 544867 153542 -47073
11067D46258j34335r4975J8893O311n0833l1346K6140M1935M40810A24188K68184
$$ 446258 311923 216948 235841 242152 191319 159973 186113 228048 668858 124188 392372
11056C92372j12450r6311J51653L46074B92186J29566o0868J62554J38962j8099
$$ 392372 279922 183611 335264 681338 292186 421752 360884 523438 662400 644301
11046F44301A45178L68583L20818k98442Q4950n2855k903K95653C19803K86108
$$ 644301 145178 513761 834579 536137 621087 568232 565329 860982 319803 605911
11036F05911r1547L41771R7829Q115l25110J13368J87113k00113j21951J956J33356
$$ 605911 514364 856135 953964 962079 636969 750337 937450 737337 615386 617342 750698
11025G50698O0328K42330r4732k65629o6178K27467J34187k21661P374J7512J2006
$$ 750698 811026 1053356 958624 692995 626817 854284 988471 766810 774184 791696 803702
11014H03702R2617j327J45077k89825k78479L43842k96054R5251J01552l0012
$$ 803702 896319 894992 1040069 750244 471765 815607 519553 614804 716356 686344
11004F86344q932n7811J37289k91826O1280O6705O8959o2053j65314m0178L34428
$$ 686344 677412 619601 756890 465064 526344 593049 662008 599955 434641 394463 728891
10993G28891k15164J56148r7601L6757J20353J76258j98835o1110Q5662k46238
$$ 728891 513727 669875 572274 609031 729384 905642 706807 645697 731359 485121
10983D85121K77301j13957n7935P870L21991k93588j2863K02934j17841o2481
$$ 485121 762422 648465 590530 598400 920391 626803 613940 816874 699033 636552
10973F36552o0895L89565l13571L30300N145Q0706p5510J72788K62431n5191J3597
$$ 636552 575657 965222 651651 981951 987096 1067802 992292 1165080 1427511 1372320 1385917
10962A385917K24934N50761O4786K58485n9629P4545M0038K94048J15597m10647
$$ 1385917 1610851 2161612 2226398 2484883 2425254 2499799 2539837 2833885 2949482 2538835
10952B538835j01821m3384l37574m25762k281J55314l30986K72897l95802Q5330
$$ 2538835 2437014 2393630 2056056 1630294 1628013 1783327 1452341 1725238 1329436 1414766
10942A414766n668L35323k97133k87667q6944j14505k0300j71749j93511j17355
$$ 1414766 1409098 1744421 1447288 1159621 1072677 958172 937872 766123 572612 455257
10932D55257J74474j53385o1919j42757J0344j37512N0000p2061a23850M5494
$$ 455257 629731 476346 414427 271670 282014 144502 194502 122441 -123850 -78356
10922g8356K9940k9617A4644f9899B1050a2469A48948N2765H0701e5018B5892
$$ -78356 -48416 -78033 14644 -69899 21050 -12469 148948 201713 80701 -55018 25892
10910E6907M0573N9750B4070a6577b730D1500d17339a42762j83493A03412n1663
$$ 56907 97480 157230 24070 -16577 -2730 41500 -417339 -142762 -326255 103412 51749
10899E1749E447a10937d7708j48678D5634a4475j61162A37481a09197C9793K55537
$$ 51749 5447 -110937 -47708 -196386 45634 -14475 -175637 137481 -109197 39793 295330
10888B95330a07381q2490j56157A1014M6518J56787j06217k8664i8832A69837
$$ 295330 -107381 -189871 -346028 11014 57532 214319 108102 79438 -98832 169837
10877H1698d0938A30204a31587G9293a64968B47652k7329C0699L02310j22982
$$ 81698 -40938 130204 -131587 79293 -164968 247652 220323 30699 333009 210027
10867B10027a12868A17185b43890J9801B44002B4539a69170E0067a13857j50055
$$ 210027 -112868 117185 -243890 -224089 244002 24539 -169170 50067 -113857 -263912
10857b63912P2348F62J3772P791a44186I0209a42684l7104N6406k20312m2319
$$ -263912 -191564 662 14434 22225 -144186 90209 -142684 -179788 -123382 -343694 -386013
10846c86013B46181F2632J27804a82464K4264l5694A46849b05236I5511Q9153
$$ -386013 246181 62632 190436 -182464 -158200 -193894 146849 -205236 95511 184664
10836A84664H1129a08504G9525l3081h07j84866I4992m4418K1446B8197D920c16702
$$ 184664 81129 -108504 79525 46444 -807 -185673 94992 50574 72020 28197 4920 -316702
10823b9869B56155a45530e7418A96774a52842A66454a48736j69323P4104m1427
$$ -29869 256155 -145530 -57418 196774 -152842 166454 -148736 -318059 -243955 -285382
10813b85382j6609A08714k8108J48027r3397J5130j1799E3651J51288H6201b22069
$$ -285382 -301991 108714 80606 228633 135236 150366 138567 53651 204939 86201 -222069
10801b46293B03246a69441j0171B0194L10O406b06945A6997g1408B2399A15K98593
$$ -246293 203246 -169441 -179612 20194 20504 26910 -206945 16997 -71408 22399 115 298708
10789B98708j15252J09631C9031a44856a7357I2464k1658b12769B32928a96568
$$ 298708 183456 293087 39031 -144856 -17357 92464 70806 -212769 232928 -196568
10778c14810A58719m7098B0436K7531g8408L7755o8990C56384D7898M4176J11985
$$ -314810 158719 111621 20436 47967 -78408 -40653 -109643 356384 47898 92074 204059
10767B04059n7092h8619k1117l2813a1778A77318e23234a14693m6626D5541J3188
$$ 204059 146967 -88619 -109736 -142549 -11778 177318 -523234 -114693 -161319 45541 58729
10756E8729b3628A31424R4707c74017a4362l64492A01977d01681a50327j30914
$$ 58729 -23628 131424 226131 -374017 -14362 -378854 101977 -401681 -150327 -281241
10746b81241B2686J0454J50249E1345a14436p5460o1124A4093c0225F0113O0382
$$ -281241 22686 33140 183389 51345 -114436 -189896 -251020 14093 -30225 60113 120495
10735A20495b77648h8373B36169j14325Q3505a2388A25014g3212H6819b25465
$$ 120495 -277648 -88373 236169 121844 205349 -12388 125014 -73212 86819 -225465
10724a70293A19679c26495r9789b00090H6956b36230R3311N9408A46208c1265
$$ -170293 119679 -326495 -426284 -200090 86956 -236230 -142919 -83511 146208 -31265
10713a77496N124A44282L28484G4825f4803b1304q0075G9553b66330B0586a1470
$$ -177496 -172372 144282 472766 74825 -64803 -21304 -101379 79553 -266330 20586 -11470
10701H9632C9858J03988C9168b7360A35123b9484p4587A16595a8110j8553J2612
$$ 89632 39858 143846 39168 -27360 135123 -29484 -104071 116595 -18110 -36663 -24051
10690b4051k09333j84871A68560a60720b1745j0420n8204A95990P9125n8891b35914
$$ -24051 -233384 -418255 168560 -160720 -21745 -32165 -90369 195990 275115 216224 -235914
10678F756g0929Q411l0046q8979K0482O9254I8080b91355H440a17477A21356b51898
$$ 6756 -70929 -62518 -92564 -181543 -161061 -91807 98080 -291355 8440 -117477 121356 -251898
10665a36772n322a3753j60655A35304a53611m829j12695D99514b85373c8101j6295
$$ -136772 -142094 -13753 -174408 135304 -153611 -158440 -271135 499514 -285373 -38101 -54396
10654e4396l94944C57321c2267A74187A7981c16524a0054F3021a71226K8076j83302
$$ -54396 -449340 357321 -32267 174187 17981 -316524 -10054 63021 -171226 -143150 -326452
10643c26452L7707P6628Q0798p5676A636a7773l4023k30642Q6060M3305A77875
$$ -326452 -288745 -212117 -131319 -206995 1636 -17773 -51796 -282438 -196378 -153073 177875
10631a53113e4018A79043A3854g0048a7009A0464a97429P4263a4978B13199H3410
$$ -153113 -54018 179043 13854 -70048 -17009 10464 -197429 -123166 -14978 213199 83410
10619i9686j33623b9337j03155j4422a7230A6699c2253j6821G6067e09595J59865
$$ -99686 -233309 -29337 -132492 -146914 -17230 16699 -32253 -49074 76067 -509595 -349730
10608c49730J63224B15419H78a14174a1166A04916c2289B6769e4107F2746a78847
$$ -349730 -186506 215419 878 -114174 -11166 104916 -32289 26769 -54107 62746 -178847
10596b17767c476l52426e4256m0198c8144I1682a33098K2845B20704a67309r1512
$$ -217767 -3476 -355902 -54256 -94454 -38144 91682 -133098 -110253 220704 -167309 -258821
10585b58821i1915L111p5354M5460e3301A55638i9224A00303C4950n743c56988
$$ -258821 -91915 -88804 -164158 -118698 -53301 155638 -99224 100303 34950 29207 -356988
10573a28208M3282B52924f6546C02791H5645c57781d8842j34999j47100B8619
$$ -128208 -84926 252924 -66546 302791 85645 -357781 -48842 -183841 -330941 28619
10562b65618Q3510n2239J11442r9996O90D0520e3414C14660e0985j6211j93401
$$ -265618 -182108 -234347 -122905 -222901 -222211 40520 -53414 314660 -50985 -67196 -260597
10551b60597a16551j9582h365D9966B921d52150A42711m6163K6007J44435j07304
$$ -260597 -116551 -136133 -8365 49966 2921 -452150 142711 96548 122555 266990 159686
10540A59686o7694c03200D3259f4164K1801C1746Q5690I556d6281m692l67746
$$ 159686 91992 -303200 43259 -64164 -42363 31746 117436 9556 -46281 -50973 -418719
10529d18719i9327n7725L6640A95334e4033k04326f6799B38389a81071D49680
$$ -418719 -99327 -157052 -120412 195334 -54033 -258359 -66799 238389 -181071 449680
10518a99273P2828A48793g0306j42632J566M2766K3838j41529B40972j14634a07017
$$ -199273 -126445 148793 -70306 -212938 -211372 -168606 -144768 -286297 240972 126338 -107017
10506a7422B64544h819C054d2107B1279d9654H3939c59229a19162c1975l7913
$$ -17422 264544 -8819 3054 -42107 21279 -49654 83939 -359229 -119162 -31975 -69888
10495f9888J6535k88000J44640B64596p6766R4048a59064n5337c2492n9409k6624
$$ -69888 -53353 -341353 -196713 264596 187830 281878 -159064 -214401 -32492 -91901 -118525
10484a18525J9195H7534a34007f0922G7618M00092G0304J55065B8217a20786H3726
$$ -118525 -99330 87534 -134007 -60922 77618 477710 70304 225369 28217 -120786 83726
10472h3343l27707A08614l8939a57672L4357B19574K62238j41855J23037A21589
$$ -83343 -411050 108614 69675 -157672 -123315 219574 481812 339957 462994 121589
10461A22272L85562B28963A280J93456p6353K40214a22020a0727A35290B391J48857
$$ 122272 507834 228963 1280 194736 118383 358597 -122020 -10727 135290 2391 151248
10450A51248a55820A51141J7632c4722k72905B7746b62769A6458K67522h9194
$$ 151248 -155820 151141 168773 -34722 -307627 27746 -262769 16458 283980 -89194
10439a43603d5584n9930H7667b82392A18447d3711A22923k1680e08301b37801
$$ -143603 -45584 -105514 87667 -282392 118447 -43711 122923 101243 -508301 -237801
10428a79350C59144a04011F2215A4305L50877A3833a92477n5340Q4267I5141N9310
$$ -179350 359144 -104011 62215 14305 365182 13833 -192477 -247817 -163550 95141 154451
10417A54451m5504N2499m8996K1590a26176A59673G4317b92651I8369l8541k0700
$$ 154451 108947 161446 112450 134040 -126176 159673 74317 -292651 98369 59828 39128
10406C9128J49996b9283J4443H7111a79335m244d1845k18527B937i8942A26212
$$ 39128 189124 -29283 -14840 87111 -179335 -183579 -41845 -260372 2937 -98942 126212
10394b22621F3720P1900K8903h2443A37604D2864b2461A24704F1372J64344F2282
$$ -222621 63720 135620 164523 -82443 137604 42864 -22461 124704 61372 225716 62282
10382A09675Q8456j0062K1346C8508b32947B3625d3598k63931A23607a16520q2538
$$ 109675 198131 188069 209415 38508 -232947 23625 -43598 -307529 123607 -116520 -199058
10371a99058A01510a0251B33946k5869c5956j16239G061K87853L7192o7256j31701
$$ -199058 101510 -10251 233946 208077 -35956 -152195 7061 294914 332106 264850 133149
10360A33149L33538k01833n7765p3538J18333m9730n4424K24525J88348k24803
$$ 133149 466687 264854 207089 133551 251884 202154 147730 372255 560603 335800
10350C35800k7646P8024A23029J43179J51304d870B80576b5715E49890r1088F0606
$$ 335800 308154 386178 123029 266208 417512 -4870 280576 -25715 549890 458802 60606
10338F52204E1780M40317B40810N8336j06008K03827k5103o7594P0357E0132L09208
$$ 652204 51780 492097 240810 299146 193138 396965 371862 304268 374625 50132 359340
10327C59340H5692J9173h8059C31520A6615L16901j13371J95210j9660j7380o6539
$$ 359340 85692 104865 -88059 331520 16615 333516 220145 415355 395695 378315 311776
10316C11776c81446a3973j60538B64099P5738g6162A38737k1080J39030A4050
$$ 311776 -381446 -13973 -174511 264099 339837 -76162 138737 117657 256687 14050
10305B51741a7161A50775J54856k9449D5715B0955K65856A23325l6433J52198
$$ 251741 -17161 150775 305631 276182 45715 20955 286811 123325 86892 239090
10295B39090f2856A55490d00273G0663A067d8562k37090q4925c7869A11819d0171
$$ 239090 -62856 155490 -400273 70663 1067 -48562 -285652 -370577 -37869 111819 -40171
10283A68623f697m03691B12452J71478a58826K524b8670j07002B7753m991d3674
$$ 168623 -6697 -410388 212452 383930 -158826 -156302 -28670 -135672 27753 22762 -43674
10271G6385e5642j76743a03823b9291k50032c8961B0030b57499i5585B35647D1390
$$ 76385 -55642 -232385 -103823 -29291 -279323 -38961 20030 -257499 -95585 235647 41390
10259c0749B7715K41705g9558n4688M9889n4257K6929H534e9183j49094b6707
$$ -30749 27715 269420 -79558 -134246 -84357 -138614 -111685 8534 -59183 -208277 -26707
10247A42926b6758B58395j22603J06687J63896A33746a91815A53457a1836B17284
$$ 142926 -26758 258395 135792 242479 406375 133746 -191815 153457 -11836 217284
10236a5477E3671J00973a59889O5703j05590A8252P0189a40125b2270A24721a59840
$$ -15477 53671 154644 -159889 -94186 -199776 18252 88441 -140125 -22270 124721 -159840
10224f7294E3452N2348K31411a23982b2681k34302A00860b37685D9968b95161
$$ -67294 53452 105800 337211 -123982 -22681 -256983 100860 -237685 49968 -295161
10213C27946q3555C3219j2015a59696g6036F8055c61520D353a3776B2015g7591
$$ 327946 244391 33219 21204 -159696 -76036 68055 -361520 4353 -13776 22015 -77591
10201F2983B2894d8152n1100J1047j74320A64142G3794e7448j21930k03176H6649
$$ 62983 22894 -48152 -99252 -88205 -262525 164142 73794 -57448 -179378 -382554 86649
10189c0848B964a3955k89228B7852J98165p6294a45376A3196a21425e2280B8555
$$ -30848 2964 -13955 -303183 27852 226017 149723 -145376 13196 -121425 -52280 28555
10177e55789A66850g7885A5867a56920c4488I9612A6955i1538j32524r827O0550
$$ -555789 166850 -77885 15867 -156920 -34488 99612 16955 -91538 -224062 -233889 -173339
10166a73339l8346B64319A2237c21263R096P1505J10440I0524c21860b0013a374
$$ -173339 -211685 264319 12237 -321263 -312167 -240662 -130222 90524 -321860 -20013 -1374
10154c8511H4786J1043a40339C11089a04144K8112b0183k36665B64904f7400K8599
$$ -38511 84786 95829 -140339 311089 -104144 -76032 -20183 -256848 264904 -67400 -38801
10143c8801G1905A1026K83862g1864F2453c1406j88528g0256j47451N2810c3466
$$ -38801 71905 11026 294888 -71864 62453 -31406 -219934 -70256 -217707 -164897 -33466
10131b2628k0450g365j88448E7125Q9052b86971J30024k3710K9492j07102P0117
$$ -22628 -43078 -7365 -195813 57125 146177 -286971 -156947 -180657 -151165 -258267 -188150
10120a88150K3147o4358C62654a01035A86985e9124p2030j38335A2302g683n0315
$$ -188150 -165003 -229361 362654 -101035 186985 -59124 -131154 -269489 12302 -7683 -57998
10109e7998Q768p3438p2648e9069A45232c43796N9646a4901j49732j22868b1849
$$ -57998 -49230 -122668 -195316 -59069 145232 -343796 -284150 -14901 -164633 -287501 -21849
10097d1167J5894j23243m676j7355a0069m22387A69072p8781h7222j8013b4296
$$ -41167 -25273 -148516 -153192 -170547 -10069 -432456 169072 90291 -87222 -105235 -24296
10085C18229a38452c6158j12002N0189D5151J13323d8853o7902B38558f1876A22402
$$ 318229 -138452 -36158 -148160 -97971 45151 158474 -48853 -116755 238558 -61876 122402
10073H4807b00476P8943A97821o4613c71124J62871O9935A61143a27349A10295
$$ 84807 -200476 -121533 197821 133208 -371124 -208253 -138318 161143 -127349 110295
10062F545a43045c7748j20173o287j76451A5763a82023B2493d22426a25493j5397
$$ 6545 -143045 -37748 -157921 -164208 -340659 15763 -182023 22493 -422426 -125493 -140890
10051a40890A10829i5065l9820H8132e881k92767A40681a74762f4194C2770a7199
$$ -140890 110829 -95065 -134885 88132 -5881 -298648 140681 -174762 -64194 32770 -17199
10039g7280A4778Q864e2191l2790A8912b59128b4872C2604i9305k75052B1643
$$ -77280 14778 23642 -52191 -84981 18912 -259128 -24872 32604 -99305 -374357 21643
10027B47264b7505k67872R2835A740d11517g7489r3793e8685m1647q9204B7005
$$ 247264 -27505 -295377 -202542 1740 -411517 -77489 -171282 -58685 -100332 -189536 27005
10015g6869k54769a6367l08621F1980b91955A31134a31068l6715B9785a05273
$$ -76869 -331638 -16367 -324988 61980 -291955 131134 -131068 -167783 29785 -105273
10004A16962J0347b64124H799J04385c9109B8381L4455N0604C6747E275a54180
$$ 116962 127309 -264124 8799 113184 -39109 28381 62836 113440 36747 5275 -154180
9992b33762Q3754H4738m0462j9702P9699j0963l7085A8837b73082R4122A62647
$$ -233762 -150008 84738 44276 24574 104273 93310 56225 18837 -273082 -178960 162647
9980A01250d0615A54556l3573B9098b46738J10759j13029J15003O2009K8349p9872
$$ 101250 -40615 154556 120983 29098 -246738 -135979 -249008 -134005 -71996 -43647 -123519
9969a23519k8931C2285l614J8860A0460a67777N7161j3644I188c6634k02501O1947
$$ -123519 -152450 32285 28671 47531 10460 -167777 -110616 -124260 9188 -36634 -239135 -177188
9957a77188O2068A85477b00800A4793a1495j14300l7435D32070b39227A03232
$$ -177188 -115120 185477 -200800 14793 -11495 -125795 -163230 432070 -239227 103232
9946b15735c6993G8242a29788e875B8688a05834l08073f8664i455r0365A43372
$$ -215735 -36993 78242 -129788 -5875 28688 -105834 -413907 -68664 -9455 -99820 143372
9934B89770d06380C18756a50761m9122A28662b07637G1626J7907b11519A19472
$$ 289770 -406380 318756 -150761 -199883 128662 -207637 71626 89533 -211519 119472
9923b27186B66191b43601k2053O8174g1822j07821e1396j72629a01953p2494B5441
$$ -227186 266191 -243601 -265654 -197480 -71822 -179643 -51396 -224025 -101953 -174447 25441
9911d4965b452A73972c8618j54372R3132c6j23589j5838e7332A92190l0090A4905
$$ -44965 -2452 173972 -38618 -192990 -99858 -36 -123625 -139463 -57332 192190 162100 14905
9898c42053a25493C02392b43939i9623A13790a42014j4291o0990g0541H9009a83107
$$ -342053 -125493 302392 -243939 -99623 113790 -142014 -156305 -217295 -70541 89009 -183107
9886a91939j09370A28643b16624Q710c2486A01957m4035b3506p610A36048F1751
$$ -191939 -301309 128643 -216624 -207914 -32486 101957 57922 -23506 -31116 136048 61751
9874B90760e981j54021B09701j9923a59540j50061B77360a30402L3445n2864C7864
$$ 290760 -5981 -160002 209701 189778 -159540 -309601 277360 -130402 -96957 -149821 37864
9862a9722A31690a07468k15852H3825c77376g0755B12056F572a59905A33274a34624
$$ -19722 131690 -107468 -323320 83825 -377376 -70755 212056 6572 -159905 133274 -134624
9850a70192B70707e40830J96724R1583A39846B021c2824h782n594j40025D14216
$$ -170192 270707 -540830 -344106 -252523 139846 2021 -32824 -8782 -14376 -154401 414216
9838B8523b85139K5954I8412a85722r5738A03556B2104P5068a92061C253a38617
$$ 28523 -285139 -259185 98412 -185722 -281460 103556 22104 97172 -192061 3253 -138617
9826a18481D4729c32475D1238O3352L9253A6178c44944D5048a48931r661e1538
$$ -118481 44729 -332475 41238 104590 143843 16178 -344944 45048 -148931 -158592 -51538
9814I1095L1075b92096B57429b65642P7614M7187A69990A5982R4785h1054j82155
$$ 91095 122170 -292096 257429 -265642 -188028 -140841 169990 15982 110767 -81054 -263209
9803b63209a18102m2477N3601l879I3085b45437i9902j71987f4160k4318j02106
$$ -263209 -118102 -160579 -106978 -110857 93085 -245437 -99902 -271889 -64160 -88478 -190584
9792a90584r2585D7815a98003A81982i4117j05411b583k49347d4017q2390o4602
$$ -190584 -283169 47815 -198003 181982 -94117 -199528 -2583 -251930 -44017 -126407 -191009
9781a91009A73865p7948d73746a13979L6503l26907A19916J4400f4013r8893A73847
$$ -191009 173865 95917 -473746 -113979 -77476 -404383 119916 134316 -64013 -162906 173847
9769b5418j28574m7169K2333Q7768A02277d831l46312A94003C40N3097j6630J35
$$ -25418 -153992 -201161 -178828 -91060 102277 -4831 -351143 194003 340 53437 36807 36942
9757C6942b7815E0749a78894k98964e1680m0536h66q1990c770j69668A76402A6184
$$ 36942 -27815 50749 -178894 -477858 -51680 -92216 -866 -82856 -3770 -173438 176402 16184
9744a33229k54383C2727a79499A75755a90804q6036h6184j53033n153h5067k92172
$$ -133229 -387612 32727 -179499 175755 -190804 -276840 -86184 -239217 -244370 -85067 -377239
9733c77239a58059b1210B69962a94185B9307f8263r8219j4057E8439a43746K4223
$$ -377239 -158059 -21210 269962 -194185 29307 -68263 -166482 -180539 58439 -143746 -119523
9722a19523j10388h0884I518J53203Q8759a22996A18769K36844a35506j3275N0446
$$ -119523 -229911 -80884 9518 162721 251480 -122996 118769 355613 -135506 -148781 -98335
9711i8335a4842H5649P6763f3820o0676M2899A78875J6645r2030N190P323a59013
$$ -98335 -14842 85649 162412 -63820 -124496 -81597 178875 195520 103490 108680 116003 -159013
9698B71069f2766J1853A02677a03532l35756C0996b4837E1133a11608C8537J0040
$$ 271069 -62766 -50913 102677 -103532 -439288 30996 -24837 51133 -111608 38537 48577
9687D8577e9123j01126c0200k96387A85099f0481k1235G2172b09508j64997h8597
$$ 48577 -59123 -160249 -30200 -326587 185099 -60481 -81716 72172 -209508 -374505 -88597
9675A43473b20304A98386h2000C1496J95520H2159e6895l36264J25543i7560k02077
$$ 143473 -220304 198386 -82000 31496 227016 82159 -56895 -393159 -267616 -97560 -299637
9664b99637R8745Q8730A50124a95455H7389H251K08604d8188B77354d2656j3495
$$ -299637 -200892 -112162 150124 -195455 87389 8251 216855 -48188 277354 -42656 -56151
9653e6151c016k28612O1231A10776c39120g3129a9604A00281a61843J6786j3438
$$ -56151 -3016 -231628 -170397 110776 -339120 -73129 -19604 100281 -161843 -145057 -158495
9642a58495G2200a93471l4498P8872J0815I8105g9537G0345R0267e40878J64956
$$ -158495 72200 -193471 -227969 -149097 -138282 98105 -79537 70345 160612 -540878 -375922
9631c75922C48737a29505J9355B40116d5437A61652D5485b37148k79926a13972
$$ -375922 348737 -129505 -110150 240116 -45437 161652 45485 -237148 -517074 -113972
9620b31751d2546k81971e0664I7869h3587n6325n1038M9723m8730g6669D8894
$$ -231751 -42546 -324517 -50664 97869 -83587 -139912 -190950 -141227 -189957 -76669 48894
9608c9084H8513b62267L5304c1708B21114a49836d0699C12903j41415a12746k77695
$$ -39084 88513 -262267 -226963 -31708 221114 -149836 -40699 312903 171488 -112746 -390441
9597c90441A63370m3413a49407F1773K12388h6425k28281d7982m3087A40601M0214
$$ -390441 163370 119957 -149407 61773 274161 -86425 -314706 -47982 -91069 140601 180815
9586A80815c76485J68865f2063k06852A41025D7824K28787a98528m0683G5197
$$ 180815 -376485 -207620 -62063 -268915 141025 47824 276611 -198528 -239211 75197
9575b03847C6833b13805k4719B1782b51216C9538a44460k0084H0760M504a22604
$$ -203847 36833 -213805 -238524 21782 -251216 39538 -144460 -164544 80760 85264 -122604
9563a5955B0205h7441F4058A3532e7125o9551A76957G1883a31198B78115D0309
$$ -15955 20205 -87441 64058 13532 -57125 -126676 176957 71883 -131198 278115 40309
9551a09255n4210P9229o421C16036b61885c5240j41444c6161k03003A04128a77062
$$ -109255 -163465 -84236 -90657 316036 -261885 -35240 -176684 -36161 -239164 104128 -177062
9539b01148k06354a90229j3161A2525K20848b07338k7297g8392F2166P6856D0745
$$ -201148 -407502 -190229 -203390 12525 233373 -207338 -234635 -78392 62166 139022 40745
9527A51931j2592a58811C5846g9234A9737a15735n1424J4250A04315a00917M7613
$$ 151931 139339 -158811 35846 -79234 19737 -115735 -167159 -152909 104315 -100917 -53304
9516e3304r0545M8802B7128n902b18574L7811M2619j00643B837a27712d5922C495
$$ -53304 -143849 -95047 27128 21226 -218574 -180763 -138144 -238787 2837 -127712 -45922 3495
9503d1146B66292b32428a14993k8093d3792j96602O518Q6197B69523b75576c6784
$$ -41146 266292 -232428 -114993 -143086 -43792 -240394 -233876 -147679 269523 -275576 -36784
9491d38315f2865j58066N9725C48791a79676C7444a84609J5769M5413F0988c3835
$$ -438315 -62865 -220931 -161206 348791 -179676 37444 -184609 -168840 -123427 60988 -33835
9479a79473B4470c15040k6864J45103C4427i6831n4164n3622c1936r7434j60840
$$ -179473 24470 -315040 -341904 -196801 34427 -96831 -150995 -204617 -31936 -129370 -290210
9468b90210J22694n0328L5710g4191j93787f6703n8028A47569c13188J04173a02917
$$ -290210 -167516 -217844 -182134 -74191 -267978 -66703 -124731 147569 -313188 -209015 -102917
9456b8699r3925J9273B33463b16348j29670I732L02729b23072L4440A18860c2448
$$ -28699 -122624 -103351 233463 -216348 -346018 9732 312461 -223072 -188632 118860 -32448
9444b31884D631K9308b15556E4563d7308B4794e0742C259M4648A1889Q6684P8183
$$ -231884 4631 33939 -215556 54563 -47308 24794 -50742 3259 47907 11889 98573 176756
9432A76756a4217j01370E3945b81915h9021A0805a78838j5824P0217N4312j32904
$$ 176756 -14217 -115587 53945 -281915 -89021 10805 -178838 -194662 -124445 -70133 -203037
9421b03037H789J1815d26734D392f3125C02183c4217j46354b3974D4599M1623
$$ -203037 8789 20604 -426734 4392 -63125 302183 -34217 -180571 -23974 44599 86222
9410H6222e9413q5597C47937c05585B79100i685F4900b6351n1400q5172N106j97774
$$ 86222 -59413 -145010 347937 -305585 279100 -9685 64900 -26351 -77751 -162923 -157817 -355591
9398c55591a27903J3746H462M0850b45827C7214h9802d0024n397a4027j59974
$$ -355591 -127903 -114157 8462 49312 -245827 37214 -89802 -40024 -45421 -14027 -174001
9387a74001k72421e2968j46669c7615E0536c13506E5665a02019A8112a60352d7183
$$ -174001 -446422 -52968 -199637 -37615 50536 -313506 55665 -102019 18112 -160352 -47183
9375A20583a97401A31009g7718A84020j8775d2180q6974B45565j04318b39475
$$ 120583 -197401 131009 -77718 184020 165245 -42180 -129154 245565 141247 -239475
9364e5420k54102B0010a77066m06013b13423o0917B32797F5208i4871p3153G8239
$$ -55420 -309522 20010 -177066 -583079 -213423 -274340 232797 65208 -94871 -168024 78239
9352h7568A7493J95960D7187a01053H5041P3173i5810c39k1803A70595c26586
$$ -87568 17493 213453 47187 -101053 85041 158214 -95810 -339 -22142 170595 -326586
9340a16428e7118B14790E2412a50033k47447C17129a16017o6887D509c5597j27934
$$ -116428 -57118 214790 52412 -150033 -397480 317129 -116017 -182904 4509 -35597 -163531
9329a63531e5670C91065a81880a978A06908d08452N7032R0067C08982e3169l5378
$$ -163531 -55670 391065 -181880 -1978 106908 -408452 -351420 -261353 308982 -53169 -88547
9318h8547B93078b19258f0630D685i522k59615a04369j29095h6295A55525j1171
$$ -88547 293078 -219258 -60630 4685 -9522 -269137 -104369 -233464 -86295 155525 144354
9307A44354a15553r6189a00323B59043b3232j60316E9093J9436b05914g0823n7901
$$ 144354 -115553 -211742 -100323 259043 -23232 -183548 59093 78529 -205914 -70823 -128724
9296a28724A38325b93991R7566h4351k57775R1485P2767g5465A67345f9111B44296
$$ -128724 138325 -293991 -196425 -84351 -342126 -250641 -177874 -75465 167345 -69111 244296
9284G4795b22330a10413M4738K6704H9208K39758b1071m62844e7934j01772o0398
$$ 74795 -222330 -110413 -65675 -38971 89208 328966 -21071 -483915 -57934 -159706 -220104
9273b20104A79219H1489b13207A25767a22310j25464p9857d6488k96257J68391
$$ -220104 179219 81489 -213207 125767 -122310 -247774 -327631 -46488 -342745 -174354
9263a74354N9720k02738J50021k53750a2595B08330n6131o5846c69548A21175
$$ -174354 -114634 -317372 -167351 -421101 -12595 208330 152199 86353 -369548 121175
9252a66978C2908b72318Q8101o9894a13853N0272j34793d5502l169l060A38513
$$ -166978 32908 -272318 -184217 -254111 -113853 -63581 -198374 -45502 -48671 -51731 138513
9240F9955c20888a17445j33454A35593a04377c4298k612n2250j80420A66723K5669
$$ 69955 -320888 -117445 -250899 135593 -104377 -34298 -36910 -89160 -269580 166723 192392
9229A92392F9165h0666b7348A07415c53219a24027N4198r914q79k3945L2020A6506
$$ 192392 69165 -80666 -27348 107415 -353219 -124027 -69829 -79743 -80622 -104567 -72547 16506
9216E5921B1273b57557L5218C5092M3025J49992F7480e2785q3829L3339o1338
$$ 55921 21273 -257557 -222339 35092 78117 228109 67480 -52785 -136614 -103275 -164613
9205a64613j8017B2697f367B37251G6339d5996p9690A85107J6930a02958j34576
$$ -164613 -182630 22697 -6367 237251 76339 -45996 -125686 185107 202037 -102958 -237534
9194b37534O6701m4396j33004l2493L3552A07075e3147b0648p3434B24150A2537
$$ -237534 -170833 -215229 -348233 -380726 -347174 107075 -53147 -20648 -94082 224150 12537
9182e1286A25529B8516a06784A48416a06806a6825k186A43724a4228A28612Q3228
$$ -51286 125529 28516 -106784 148416 -106806 -16825 -19011 143724 -14228 128612 211840
9171B11840K1878h1197A5018a35200k42533e5607E33870b92754e5067A8776Q0455
$$ 211840 233718 -81197 15018 -135200 -377733 -55607 533870 -292754 -55067 18776 99231
9160I9231g6514k8916A79694a64877B50486h8780A10085J003b33322a13934k75258
$$ 99231 -76514 -105430 179694 -164877 250486 -88780 110085 111088 -233322 -113934 -389192
9149c89192H730L22190j42585d33522G2872J02922E6558c2815J4426j12946b0749
$$ -389192 8730 330920 188335 -433522 72872 175794 56558 -32815 -18389 -131335 -20749
9137b35546F087a68298j717B21193e4027A81979d1430j88778K5144h9493A51609
$$ -235546 6087 -168298 -170015 221193 -54027 181979 -41430 -230208 -205064 -89493 151609
9125b39779C25973b40861A79118b01267i0773C9400a58593C6515M7830R9096a45089
$$ -239779 325973 -240861 179118 -201267 -90773 39400 -158593 36515 84345 183441 -145089
9113I5888a55714M9991A22215D0968a68742A18156a25963A14330k8988D5b04332
$$ 95888 -155714 -105723 122215 40968 -168742 118156 -125963 114330 85342 45 -204332
9101E2979b72945h1978d0857j93098A17822g9181l88965B8050f1635a5484l70415
$$ 52979 -272945 -81978 -40857 -233955 117822 -79181 -468146 28050 -61635 -15484 -385899
9090c85899a04352n7315D5278J18669C3998J23666a26681K5177C92315i1881n7143
$$ -385899 -104352 -161667 45278 163947 33998 157664 -126681 -101504 392315 -91881 -149024
9079a49024k34784a44093B67119Q3939f0572p5365A94916a93960r4288J27037
$$ -149024 -383808 -144093 267119 351058 -60572 -135937 194916 -193960 -288248 -161211
9069a61211o5959F8280i6628A79066l1886E9102O0549E3194b74584M8148A58325
$$ -161211 -227170 68280 -96628 179066 147180 59102 119651 53194 -274584 -226436 158325
9057a29180M5296B5573K04518E5120a23319B6398e7444A20192d23658a8566j04267
$$ -129180 -83884 25573 230091 55120 -123319 26398 -57444 120192 -423658 -18566 -122833
9046a22833A34736F599a48300A6928K39238a07002L8922b9484k7545k38049I8195
$$ -122833 134736 6599 -148300 16928 256166 -107002 -68080 -29484 -57029 -295078 98195
9034a84164Q3166B0401a06838B2033c71067B34982c11667a102B8993a70137k291
$$ -184164 -100998 20401 -106838 22033 -371067 234982 -311667 -1102 28993 -170137 -172428
9023a72428e3113p8575e0236j73745M0430A14736a63619b9267l63702a36214A15731
$$ -172428 -53113 -131688 -50236 -223981 -183551 114736 -163619 -29267 -392969 -136214 115731
9011a98122j96887a09956L6128o3857L5314j62426G7687J5342b24827E3370f0744
$$ -198122 -395009 -109956 -73828 -137685 -102371 -264797 77687 93029 -224827 53370 -60744
8999b50780P2671L0875n2463A55735c49597g8324L5845A000J02801B5521a43229
$$ -250780 -178109 -147234 -199697 155735 -349597 -78324 -42479 1000 103801 25521 -143229
8987c29621b6388j07500m4750e2414l15465c0420j90054a06427l11921f4901A89420
$$ -329621 -26388 -133888 -178638 -52414 -367879 -30420 -220474 -106427 -418348 -64901 189420
8975B3271d1482o302C03364D8823A2922R0102a66863G9039c92243c1469l4879
$$ 23271 -41482 -47784 303364 48823 12922 103024 -166863 79039 -392243 -31469 -66348
8964f6348C5306M827a47695J4265e6697j76983A47869J50274h7532j25671I927
$$ -66348 35306 40133 -147695 -133430 -56697 -233680 147869 298143 -87532 -213203 9927
8952d7443l45833J79366C1582J64463c41642C560N2249D691b87887a27715M724
$$ -47443 -393276 -213910 31582 196045 -341642 3560 55809 4691 -287887 -127715 -122991
8941a22991F7023b3498h75F5341d5135m0829B9500a55252j31175I0980C5101L7077
$$ -122991 67023 -23498 -875 65341 -45135 -85964 29500 -155252 -286427 90980 35101 72178
8929G2178c78573A80073k3612a40448l8415A35153N2403F6222d5526D37110K354
$$ 72178 -378573 180073 156461 -140448 -178863 135153 187556 66222 -45526 437110 439464
8918D39464B07682l7027K5077H4614P528J37733E9867O66932j7906J81125J267580
$$ 439464 207682 170655 195732 84614 92142 229875 59867 726799 708893 890018 2157598
8907B157598J361839L254867O81032l501699j341359j073526o70120q5243j58151
$$ 2157598 3519437 6774304 7455336 3953637 2612278 1538752 868632 783389 625238
8898F25238j99418a29148j7304A72208J84426j68893K24983a31595A85301D4206
$$ 625238 425820 -129148 -146452 172208 356634 187741 412724 -131595 185301 44206
8887B55458l0930I4573B3563q286K11123g157j97699R9884B59788A02752b21140
$$ 255458 224528 94573 23563 15277 226400 -7157 -204856 -104972 259788 102752 -221140
8875e8031l13253G3457a29823B30748E1162o165c04985f0231m3783I3231g4388
$$ -58031 -371284 73457 -129823 230748 51162 44997 -304985 -60231 -104014 93231 -74388
8863H7104K570A7025J22401C4025L4088a12177G7882b78483f7779j18380a3134
$$ 87104 89674 17025 139426 34025 68113 -112177 77882 -278483 -67779 -186159 -13134
8851A7941N9698J02320F5434J34515d2023I7012j7724C3430a8625k5115C69241
$$ 17941 77639 179959 65434 199949 -42023 97012 79288 33430 -18625 -43740 369241
8839C6866a36933k41586H141K36948d7705B38919b4893l5860J0425p018A67987
$$ 36866 -136933 -378519 8141 245089 -47705 238919 -24893 -60753 -50328 -57346 167987
$$ [...]
##END NTUPLES=NMR SPECTRUM
##END=
