
##TITLE=UV1133_M4-1010-1000_6275400_qGbNvg8Q4H
##JCAMPDX= 6.0         $$ Bruker NMR JCAMP-DX V2.0
##DATA TYPE= NMR SPECTRUM
##DATA CLASS= NTUPLES
##ORIGIN= BRUKER
##OWNER= Administrator
$$ 1.72 TOPSPIN		Version 2.1
$$ 2012-06-03 00:31:01.750 -0500  Administrator@TOPSPIN
$$ Compression mode = diff/dup
##.OBSERVE FREQUENCY= 400.13188235
##.OBSERVE NUCLEUS= ^1H
##.ACQUISITION MODE= SIMULTANEOUS (DQD)
##.ACQUISITION SCHEME= undefined
##.AVERAGES= 64
##.DIGITISER RES= 22
##SPECTROMETER/DATA SYSTEM= spect
##.PULSE SEQUENCE= noesygpps1d.comp
##.SOLVENT NAME= COFFEE_meoh
##.SHIFT REFERENCE= INTERNAL, COFFEE_meoh, 1, 14.96681
##AUDIT TRAIL= $$ (NUMBER, WHEN, WHO, WHERE, PROCESS, VERSION, WHAT)
$$ ##TITLE= Audit trail, TOPSPIN		Version 2.1
$$ ##JCAMPDX= 5.01
$$ ##ORIGIN= Bruker BioSpin GmbH
$$ ##OWNER= Administrator
$$ $$ C:\Bruker\TOPSPIN/data/COFFEE/nmr/UV1133_M4-1010-1000_6275400_qGbNvg8Q4H/12/pdata/1/auditp.txt
$$ ##AUDIT TRAIL=  $$ (NUMBER, WHEN, WHO, WHERE, PROCESS, VERSION, WHAT)
(   1,<2012-06-03 00:30:56.187 -0500>,<Administrator>,<TOPSPIN>,<go>,<TOPSPIN 2.1>,
      <created by zg
	started at 2012-06-03 00:19:25.875 -0500,
	POWCHK enabled, PULCHK disabled,
       configuration hash MD5:
       D5 CA 7A 23 FE 6B EE E2 50 67 74 61 24 F7 5E 3B
       data hash MD5: 64K
       B9 41 3E 2D F8 4C 1A 76 10 48 A6 58 34 80 77 9B>)
(   2,<2012-06-03 00:30:59.328 -0500>,<Administrator>,<TOPSPIN>,<proc1d>,<TOPSPIN 2.1>,
      <Start of raw data processing
       efp LB = 0.3 FT_mod = 6 PKNL = 1 PHC0 = 0 PHC1 = 0 SI = 128K 
       data hash MD5: 128K
       5E FA E6 A2 79 2A AA D3 5D 33 BB 29 92 94 3E FA>)
(   3,<2012-06-03 00:31:00.562 -0500>,<Administrator>,<TOPSPIN>,<proc1d>,<TOPSPIN 2.1>,
      <pk PHC0 = 33.72803 PHC1 = 0 
       data hash MD5: 128K
       6D 7B 0C FE 23 38 7A 20 99 54 E5 28 45 7D 39 71>)
(   4,<2012-06-03 00:31:01.375 -0500>,<Administrator>,<TOPSPIN>,<proc1d>,<TOPSPIN 2.1>,
      <abs ABSG = 1 
       data hash MD5: 128K
       F1 20 96 B6 77 28 41 8B A4 6B 40 67 92 0D B4 7B>)
(   5,<2012-06-03 00:31:01.468 -0500>,<Administrator>,<TOPSPIN>,<proc1d>,<TOPSPIN 2.1>,
      <abs ABSG = 2 
       data hash MD5: 128K
       78 26 9E 7A D6 84 09 87 F2 65 69 5F CA 4C 85 3A>)
(   6,<2012-06-03 00:31:01.531 -0500>,<Administrator>,<TOPSPIN>,<proc1d>,<TOPSPIN 2.1>,
      <abs ABSG = 3 
       data hash MD5: 128K
       7A 26 88 9B 74 A0 D2 10 5B 43 11 14 7C 0F 36 37>)
(   7,<2012-06-03 00:31:01.593 -0500>,<Administrator>,<TOPSPIN>,<proc1d>,<TOPSPIN 2.1>,
      <abs ABSG = 4 
       data hash MD5: 128K
       2B 44 5B CD F0 A8 45 46 BB 9A 5B 75 A7 C2 DD 4B>)
(   8,<2012-06-03 00:31:01.656 -0500>,<Administrator>,<TOPSPIN>,<proc1d>,<TOPSPIN 2.1>,
      <abs ABSG = 5 
       data hash MD5: 128K
       43 D4 88 52 97 04 B1 8E DF 93 54 96 7B 0E 27 54>)
$$ ##END=
$$ 
$$ $$ hash MD5
$$ $$ 44 82 BA 41 0A 00 26 52 0B 31 76 CB A0 CC 33 FC
##$RELAX= 
##$RELAX= 
##$RELAX= 
##$RELAX= 
##$RELAX= 
##$RELAX= 
##$RELAX= 
##$RELAX= 
$$ Bruker specific parameters
$$ [...]
##$TP07= 0
##$TPNAME0= <>
##$TPNAME1= <>
##$TPNAME2= <>
##$TPNAME3= <>
##$TPNAME4= <>
##$TPNAME5= <>
##$TPNAME6= <>
##$TPNAME7= <>
##$TPOAL= (0..7)
0.5 0.5 0.5 0.5 0.5 0.5 0.5 0.5
##$TPOFFS= (0..7)
0 0 0 0 0 0 0 0
##$TUNHIN= 0
##$TUNHOUT= 0
##$TUNXOUT= 0
##$USERA1= <user>
##$USERA2= <user>
##$USERA3= <user>
##$USERA4= <user>
##$USERA5= <user>
##$V9= 5
##$VALIST= <valist>
##$VCLIST= <CCCCCCCCCCCCCCC>
##$VD= 0
##$VDLIST= <DDDDDDDDDDDDDDD>
##$VPLIST= <PPPPPPPPPPPPPPP>
##$VTLIST= <TTTTTTTTTTTTTTT>
##$WBST= 2048
##$WBSW= 25
##$XGAIN= (0..3)
0 0 0 0
##$XL= 0
##$YL= 0
##$YMAX_a= 10939667
##$YMIN_a= -6490963
##$ZGOPTNS= <>
##$ZL1= 120
##$ZL2= 120
##$ZL3= 120
##$ZL4= 120
##$ABSF1= 14.96681
##$ABSF2= -5.58572
##$ABSG= 5
##$ABSL= 3
##$ALPHA= 0
##$AQORDER= 0
##$ASSFAC= 0
##$ASSFACI= 0
##$ASSFACX= 0
##$ASSWID= 0
##$AUNMP= <proc_prof1d_extract.lims>
##$AXLEFT= 0
##$AXNAME= <>
##$AXNUC= <1H>
##$AXRIGHT= 0
##$AXTYPE= 0
##$AXUNIT= <>
##$AZFE= 0.1
##$AZFW= 0.1
##$BCFW= 0
##$BC_mod= 0
##$BYTORDP= 0
##$COROFFS= 0
##$CY= 15
##$DATMOD= 1
##$DC= 0
##$DFILT= <>
##$DTYPP= 0
##$F1P= 0
##$F2P= 0
##$FCOR= 0.5
##$FTSIZE= 131072
##$FT_mod= 6
##$GAMMA= 0
##$GB= 0
##$INTBC= 1
##$INTSCL= 1
##$ISEN= 128
##$LB= 0.3
##$LEV0= 0
##$LPBIN= 0
##$MAXI= 10000
##$MC2= 0
##$MEAN= 0
##$ME_mod= 0
##$MI= 0
##$NCOEF= 0
##$NC_proc= -3
##$NLEV= 6
##$NOISF1= 0
##$NOISF2= 0
##$NSP= 0
##$NTH_PI= 0
##$NZP= 0
##$OFFSET= 14.96681
##$PC= 1
##$PHC0= 33.72803
##$PHC1= 0
##$PH_mod= 1
##$PKNL= yes
##$PPARMOD= 0
##$PPDIAG= 0
##$PPIPTYP= 0
##$PPMPNUM= 2147483647
##$PPRESOL= 1
##$PSCAL= 4
##$PSIGN= 0
##$PYNMP= <proc.py>
##$REVERSE= no
##$SF= 400.130005523844
##$SI= 131072
##$SIGF1= 0
##$SIGF2= 0
##$SINO= 400
##$SIOLD= 131072
##$SPECTYP= <>
##$SREGLST= <1H.CDCl3>
##$SSB= 0
##$STSI= 131072
##$STSR= 0
##$SW_p= 8223.68421052632
##$SYMM= 0
##$S_DEV= 0
##$TDeff= 65536
##$TDoff= 0
##$TI= <>
##$TILT= no
##$TM1= 0
##$TM2= 0
##$TOPLEV= 0
##$USERP1= <user>
##$USERP2= <user>
##$USERP3= <user>
##$USERP4= <user>
##$USERP5= <user>
##$WDW= 1
##$XDIM= 131072
##$YMAX_p= 436664498
##$YMIN_p= -377016414
##$CURPLOT= <Network HP LaserJet P1505>
##$CURPRIN= <$Network HP LaserJet P1505>
##$DFORMAT= <normdp>
##$LAYOUT= <+/1D_H.xwp>
##$LFORMAT= <normlp>
##$PFORMAT= <normpl>
##$SURQMSG= 1
$$ End of Bruker specific parameters
$$ ---------------------------------
##NTUPLES= NMR SPECTRUM
##VAR_NAME=  FREQUENCY,     SPECTRUM/REAL,   SPECTRUM/IMAG
##SYMBOL=    X,             R,               I
##VAR_TYPE=  INDEPENDENT,   DEPENDENT,       DEPENDENT
##VAR_FORM=  AFFN,          ASDF,            ASDF
##VAR_DIM=   131072,        131072,          131072
##UNITS=     HZ,            ARBITRARY UNITS, ARBITRARY UNITS
##FACTOR=    0.0627417313425165, 1,          1
##FIRST=     8223.62146879498, 2630,         -112931
##LAST=      0,             6479,            -112160
##MIN=       0,             -377016414,      0
##MAX=       8223.62146879498, 436664498,    0
$$ Real data points
##PAGE= N=1
##DATA TABLE= (X++(R..R)), XYDATA
$$ [...]
63524A450108k7215k9986l1043l0461k8939k6906k4469k1899j9515j7278j5076
$$ 1450108 1422893 1392907 1361864 1331403 1302464 1275558 1251089 1229190 1209675 1192397 1177321
63513A177321j3417j2885j2735j1000o782j688J740K716K663L348N271P715R646
$$ 1177321 1163904 1151019 1138284 1127284 1120502 1118814 1120554 1123270 1125933 1129281 1134552 1142267 1151913
63500A151913J0676J1468J2999J5145J6699J7385J9007K3373K9533L4462L6482
$$ 1151913 1162589 1174057 1187056 1202201 1218900 1236285 1255292 1278665 1308198 1342660 1379142
63489A379142L6771L7434L9410M2552M6300M9403M9941M6701M0208L1940K3094
$$ 1379142 1415913 1453347 1492757 1535309 1581609 1631012 1680953 1727654 1767862 1799802 1822896
63478A822896J4564P303J942j630l898n415p144j0134j4172j7548j9181k0428
$$ 1822896 1837460 1844763 1846705 1845075 1841177 1835762 1828618 1818484 1804312 1786764 1767583 1747155
63466A747155k3646k9263l5380m0047m2841m4132m4098m3000m1654m0807m0379
$$ 1747155 1723509 1694246 1658866 1618819 1575978 1531846 1487748 1444748 1403094 1362287 1321908
63455A321908l9775l8735l7515l6348l5043l3182l0593k7523k4374k1403j8883
$$ 1321908 1282133 1243398 1205883 1169535 1134492 1101310 1070717 1043194 1018820 997417 978534
63444I78534j7365j7179j7564j6915j4425j1137q895q445q966r174q365o670m812
$$ 978534 961169 943990 926426 909511 895086 883949 875054 866609 857643 848469 840104 833434 828622
63431H28622l550l013k732k530k808l549l754k717j166j53O44K204M120M842L982
$$ 828622 825072 822059 819327 816797 813989 810440 806686 803969 802803 802650 803294 805498 809618 814460 818442
63416H18442K820K208J612P23L57P69N44j376l733m494l643k902l132l585l577
$$ 818442 821262 823470 825082 825805 826162 826931 827475 826099 822366 817872 814229 811327 808195 804610 801033
63401H01033l360l166k600j359K98J987L454M363M650M916N686O499O725P055
$$ 801033 797673 794507 791907 790548 790846 792833 796287 800650 805300 810216 815902 822401 829126 836181
63387H36181Q761J1563J3779J4878J6118J8134J9740K0191K0894K3229K6080K7524
$$ 836181 844942 856505 870284 885162 901280 919414 939154 959345 980239 1003468 1029548 1057072
63375A057072K8062K9961L3761L7507L9580M0257M0117L8749L5950L2764L0353
$$ 1057072 1085134 1115095 1148856 1186363 1225943 1266200 1306317 1345066 1381016 1413780 1444133
63364A444133K8824K8002K8326L0040L2411L4723L7347M0816M4385M6591M6889
$$ 1444133 1472957 1500959 1529285 1559325 1591736 1626459 1663806 1704622 1749007 1795598 1842487
63353A842487M5779M3578L9953L4657K7964K0445J2812N815j85n219r001j0886
$$ 1842487 1888266 1931844 1971797 2006454 2034418 2054863 2067675 2073490 2073305 2068086 2059085 2048199
63341B048199j1353j2586j6294k1338k5062k6911k9180l3777l9749m4639m7038
$$ 2048199 2036846 2024260 2007966 1986628 1961566 1934655 1905475 1871698 1831949 1787310 1740272
63330A740272m6988m4947m1709l8705l7070l6421l5277l2740k9159k5373k1871
$$ 1740272 1693284 1648337 1606628 1567923 1530853 1494432 1459155 1426415 1397256 1371883 1350012
63319A350012j8721j5813j3024j0320p689m927j791J575M781P872J1307J4993
$$ 1350012 1331291 1315478 1302454 1292134 1284445 1279518 1277727 1279302 1284083 1291955 1303262 1318255
63307A318255J8051K0069K1906K4425K7087K8861L0174L2578L6375L9830M1389
$$ 1318255 1336306 1356375 1378281 1402706 1429793 1458654 1488828 1521406 1557781 1597611 1639000
63296A639000M1754M2832M5104M6916M6394M3266L8583L3160K6925J9721J2180
$$ 1639000 1680754 1723586 1768690 1815606 1862000 1905266 1943849 1977009 2003934 2023655 2035835
63285B035835N370j95m745q539j1521j3829j6055j8637k1448k4415k8050l2767
$$ 2035835 2041205 2041010 2036265 2027726 2016205 2002376 1986321 1967684 1946236 1921821 1893771 1861004
63273A861004l7866m1873m3870m4096m3327m2177m0972l9704l8052l5779l3159
$$ 1861004 1823138 1781265 1737395 1693299 1649972 1607795 1566823 1527119 1489067 1453288 1420129
63262A420129l0590k7818k4171j9823j6375j5650j7931k1661k4852k6701k7608
$$ 1420129 1389539 1361721 1337550 1317727 1301352 1285702 1267771 1246110 1221258 1194557 1166949
63251A166949k7859k6878k4358k1543k0249k0447k0092j7960j5467j4538j4652
$$ 1166949 1139090 1112212 1087854 1066311 1046062 1025615 1005523 987563 972096 957558 942906
63240I42906j3689j1249r236r020r724r946r695r699r953j0102j0432j1287j1968
$$ 942906 929217 917968 908732 899712 889988 880042 870347 860648 850695 840593 830161 818874 806906
63227H06906j1288r188p020o150o780q011q710q347p307o316n454m158k363r86
$$ 806906 795618 786430 779410 773260 766480 758469 749759 741412 734105 727789 722335 718177 715814 714828
63213G14828p96j268j297o65p3J76P45K277M303N471M794K718Q61M99J336K164
$$ 714828 714032 712764 711467 710802 710729 710905 711650 713927 718230 723701 728495 731213 732074 732573 733909 736073
63197G36073K563L215M330M933M450M170N783Q863J1081J1026R747R167R954J1530
$$ 736073 738636 741851 746181 751114 755564 759734 765517 774380 785461 796487 806234 815401 825355 836885
63183H36885J3343J5233J6841J7604J7609J7936J9579K2110K3845K3759K2878
$$ 836885 850228 865461 882302 899906 917515 935451 955030 977140 1000985 1024744 1047622
63172A047622K3202K5323K7782K9021K9156K9297K9849L0257L0178K9875K9534
$$ 1047622 1070824 1096147 1123929 1152950 1182106 1211403 1241252 1271509 1301687 1331562 1361096
63161A361096K8960K8091K7172K6252K5020K3281K1207J9030J6831J4636J2316
$$ 1361096 1390056 1418147 1445319 1471571 1496591 1519872 1541079 1560109 1576940 1591576 1603892
63150A603892R526O128K626l60k969n874r146j2038j4016j5365j6569j7620j8212
$$ 1603892 1613418 1619546 1622172 1621812 1618843 1612969 1603823 1591785 1577769 1562404 1545835 1528215 1510003
63137A510003j8062j6799j4099j0375o920m911m335m089k881l4M101Q219J0952
$$ 1510003 1491941 1475142 1461043 1450668 1443748 1438837 1434502 1430413 1427532 1427498 1431599 1439818 1450770
63124A450770J2084J2696J3936J5914J7901J9209J9618J9395J9146J9393J9951
$$ 1450770 1462854 1475550 1489486 1505400 1523301 1542510 1562128 1581523 1600669 1620062 1640013
63113A640013K0077J9444J8528J7693J6434J3999J0500O811L556N76k697o659
$$ 1640013 1660090 1679534 1698062 1715755 1732189 1746188 1756688 1763499 1767055 1767631 1764934 1758275
63101A758275j1184j5556j8978k1451k3846k6769k9701l1689l2593l3045l3362
$$ 1758275 1747091 1731535 1712557 1691106 1667260 1640491 1610790 1579101 1546508 1513463 1480101
63090A480101l3197l2243l0726k9046k7391k5730k3937k1897j9789j8078j6824
$$ 1480101 1446904 1414661 1383935 1354889 1327498 1301768 1277831 1255934 1236145 1218067 1201243
63079A201243j5301j2911j0362r100r372r740q795o738m743l305j950k09J776
$$ 1201243 1185942 1173031 1162669 1153569 1144197 1134457 1125662 1118924 1114181 1110876 1108926 1108717 1110493
63066A110493L620N174O513P720Q753R442R669R550R258Q655P421N734M383L906
$$ 1110493 1114113 1119287 1125800 1133520 1142273 1151715 1161384 1170934 1180192 1188847 1196268 1202002 1206385 1210291
63052A210291L913L609K852K303K653L936N442O149N530M206L388L337K922J342
$$ 1210291 1214204 1217813 1220665 1222968 1225621 1229557 1234999 1241148 1246678 1250884 1254272 1257609 1260531 1261873
63038A261873l88o80K95Q34K92j31L70O93l08j593j079J438M020N157N254N326
$$ 1261873 1261485 1260805 1261100 1261934 1262226 1262095 1262465 1263158 1262850 1261257 1260178 1261616 1265636 1270793 1276047 1281373
63022A281373N423N046M323M053M783O293P830Q756R195R997J1722J3723J4811
$$ 1281373 1286796 1291842 1296165 1300218 1305001 1311294 1319124 1327880 1337075 1347072 1358794 1372517 1387328
63009A387328J4865J5050J6240J8029J9617K1020K2803K5179K7997L1162L4482
$$ 1387328 1402193 1417243 1433483 1451512 1471129 1492149 1514952 1540131 1568128 1599290 1633772
62998A633772L7409L9675M1897M4881M8464N1646N3921N5810N8028O0565O2832
$$ 1633772 1671181 1710856 1752753 1797634 1846098 1897744 1951665 2007475 2065503 2126068 2188900
62987B188900O4321O5003O5242O5390O5452O5264O4918O4704O4516O3901O2995
$$ 2188900 2253221 2318224 2383466 2448856 2514308 2579572 2644490 2709194 2773710 2837611 2900606
62976B900606O2630O2842O2007N8468N2665M6512M0809L4523K6667J7589Q026
$$ 2900606 2963236 3026078 3088085 3146553 3199218 3245730 3286539 3321062 3347729 3365318 3373344
62965C373344j848j1814k1212k9937l8710m7291n3384n4897n2889n0753n0444
$$ 3373344 3371496 3359682 3338470 3308533 3269823 3222532 3169148 3114251 3061362 3010609 2960165
62954B960165n0823m9890m7185m3373l8812l3648k8594k4302k0236j5144q729
$$ 2960165 2909342 2859452 2812267 2768894 2730082 2696434 2667840 2643538 2623302 2608158 2599429
62943B599429j991M068R344J4081J8327K2195K5907K9036L0523L0155K9436K9957
$$ 2599429 2597438 2601506 2610850 2624931 2643258 2665453 2691360 2720396 2750919 2781074 2810510 2840467
62931B840467L1320L1846L1116L0383L0146K8780K4515J7822J0710M211k304r702
$$ 2840467 2871787 2903633 2934749 2965132 2995278 3024058 3048573 3066395 3077105 3081316 3079012 3069310
62919C069310j8054k6888l5468m2808m8356n2790n7260o1767o5133o6745o7263
$$ 3069310 3051256 3024368 2988900 2946092 2897736 2844946 2787686 2725919 2660786 2594041 2526778
62908B526778o7251o6191o3670o0682n8693n7769n6616n4416n1750m9614m8180
$$ 2526778 2459527 2393336 2329666 2268984 2210291 2152522 2095906 2041490 1989740 1940126 1891946
62897A891946m6876m5239m3255m1148l9172l7623l6688l6138l5303l3726l1653
$$ 1891946 1845070 1799831 1756576 1715428 1676256 1638633 1601945 1565807 1530504 1496778 1465125
62886A465125k9669k7846k5864k4045k3439k4262k4994k3940k1342j8807j6929
$$ 1465125 1435456 1407610 1381746 1357701 1334262 1310000 1285006 1261066 1239724 1220917 1203988
62875A203988j4802j2096j0152j0230j1624j2496j1978j0635r299q286p480o495
$$ 1203988 1189186 1177090 1166938 1156708 1145084 1132588 1120610 1109975 1100676 1092390 1084910 1078415
62863A078415m836k564p54p30k716n466p324p584o921o539o817p017o641o438
$$ 1078415 1073579 1071015 1070261 1069531 1066815 1061349 1054025 1046441 1039520 1032981 1026164 1019147 1012506 1006068
62849A006068p179p858o559l351p88q32k583l902m018l406k294p86L00L19l9J94
$$ 1006068 998889 991031 984472 981121 980333 979501 976918 973016 968998 965592 963298 962512 962812 963131 963092 963286
62833I63286N74J94k88N46K250K738J399J54O57K040K418J414J39m95m78j70J51
$$ 963286 963860 964054 963766 964312 966562 969300 970699 970853 971510 973550 975968 977382 977521 977026 976548 976378 976529
62816I76529K84L3r29k823n013n999n119l795l840m831m815l473k615l118l555
$$ 976529 976813 976846 975917 973094 968081 962082 956963 953168 949328 944497 939682 936209 933594 930476 926921
62801I26921k758j766j778j979j036N99J740K594L840M483K963Q3j481p72L03
$$ 926921 924163 922397 920619 918640 917604 918203 919943 922537 926377 930860 933823 933906 932425 931653 931956
62786I31956j78j810l022l180k695k074j624j452j282p28J8L42J70O1K95O25R94
$$ 931956 931778 929968 926946 923766 921071 918997 917373 915921 914639 913911 913929 914271 914441 914502 914797 915422 916416
62769I16416J597K133J891Q53r8l23R4J134L011N215O516O551O413O919P307O657
$$ 916416 918013 920146 922037 922890 922792 922469 922563 923697 926708 931923 938439 944990 951403 958322 965629 972286
62753I72286N736O143P989R669R924R171Q631Q967J0028J1359J2546J3350J3816
$$ 972286 978022 984165 992154 1001823 1011747 1020918 1029549 1038516 1048544 1059903 1072449 1085799 1099615
62740A099615J4200J4753J5545J6487J7483J8671K0397K2712K5099K7119K9119
$$ 1099615 1113815 1128568 1144113 1160600 1178083 1196754 1217151 1239863 1264962 1292081 1321200
62729A321200L1680L4488L6799L9115M3099M9143N5260N9552O2829O7282P3087
$$ 1321200 1352880 1387368 1424167 1463282 1506381 1555524 1610784 1670336 1733165 1800447 1873534
62718A873534P8120Q1122Q3333Q6244Q9072Q9608Q6917Q2119P6770P1277O4824
$$ 1873534 1951654 2032776 2116109 2202353 2291425 2381033 2467950 2550069 2626839 2698116 2762940
62707B762940N6218M4784L1016J6573L210q514j9351l0070m0368m9229n6167o1575
$$ 2762940 2819158 2863942 2894958 2911531 2914741 2906227 2886876 2856806 2816438 2767209 2711042 2649467
62695B649467o5899o9158p1596p4089p6983p8915p8171p5271p2786p1888p0582
$$ 2649467 2583568 2514410 2442814 2368725 2291742 2212827 2134656 2059385 1986599 1914711 1844129
62684A844129o6639o1068n6854n4849n3021m9685m5416m1231l6888l2105k7884
$$ 1844129 1777490 1716422 1659568 1604719 1551698 1502013 1456597 1415366 1378478 1346373 1318489
62673A318489k5249k3691k2119k0414j8826j6714j3430r782p065n122k878m73
$$ 1318489 1293240 1269549 1247430 1227016 1208190 1191476 1178046 1168264 1161199 1156077 1153199 1152726
62661A152726J043J948L787O685Q732Q862Q603R894J2666J5849J9412K3696K7760
$$ 1152726 1153769 1155717 1159504 1166189 1174921 1183783 1192386 1202280 1214946 1230795 1250207 1273903 1301663
62648A301663L0371L2183L5098L9539M4015M7564N0989N5264O0126O4841O9074
$$ 1301663 1332034 1364217 1399315 1438854 1482869 1530433 1581422 1636686 1696812 1761653 1830727
62637A830727P2395P4150P4770P6048P8930Q1854Q2353P9763P5084O8828O0539
$$ 1830727 1903122 1977272 2052042 2128090 2207020 2288874 2371227 2450990 2526074 2594902 2655441
62626B655441N0405L9713K9209J8187N800p485k0358l1950m2053n0567n7425o2794
$$ 2655441 2705846 2745559 2774768 2792955 2798755 2791270 2770912 2738962 2696909 2646342 2588917 2526123
62614B526123o6967p0251p3042p5534p7147p6890p4711p1879o9533o7484o5112
$$ 2526123 2459156 2388905 2315863 2240329 2163182 2086292 2011581 1939702 1870169 1802685 1737573
62603A737573o2568o0174n7319n3352m9187m6376m4596m1731l7019l2455l0087
$$ 1737573 1675005 1614831 1557512 1504160 1454973 1408597 1364001 1322270 1285251 1252796 1222709
62592A222709k9197k7609k4852k2411k1214k0559j9588j8417j7281j5773j3561
$$ 1222709 1193512 1165903 1141051 1118640 1097426 1076867 1057279 1038862 1021581 1005808 992247
62581I92247j1189r487q596p963o981n425l630k360k021j988j468j021k123m729
$$ 992247 981058 971571 962975 955012 948031 942606 938976 936616 934595 932607 931139 930118 927995 923266
62567I23266o470n383k615j011j419j966j158l4l46j612j382J666N910Q495Q344
$$ 923266 916796 911413 908798 907787 906368 904402 903244 903210 902864 901252 899870 901536 907446 915941 924285
62552I24285O949O359P057Q194R341J0997J3264J5064J5438J4985J5156J6530
$$ 924285 931234 937593 944650 952844 962185 973182 986446 1001510 1016948 1031933 1047089 1063619
62540A063619J8724K1597K5261K8884L0994L1570L2609L5674L9714M2286M2387
$$ 1063619 1082343 1103940 1129201 1158085 1189079 1220649 1253258 1288932 1328646 1370932 1413319
62529A413319M0994L9222L7127L4313L0691K6294K0946J4535P400L44n553r492
$$ 1413319 1454313 1493535 1530662 1564975 1595666 1621960 1642906 1657441 1664841 1665185 1659632 1650140
62517A650140j1810j4080j7685k2391k6821l0221l2914l5057l5973l5185l3384
$$ 1650140 1638330 1624250 1606565 1584174 1557353 1527132 1494218 1459161 1423188 1388003 1354619
62506A354619l1730l0602k9581k8321k6960k5831k5089k4487k3355k1092j7988
$$ 1354619 1322889 1292287 1262706 1234385 1207425 1181594 1156505 1132018 1108663 1087571 1069583
62495A069583j5156j3363j2230j0930r292p662o101m346k543j335j078j405j661
$$ 1069583 1054427 1041064 1028834 1017904 1008612 1000950 994849 990503 987960 986625 985547 984142 982481
62482I82481j525j054l66N48J782L264M543N059M819M568N025O101P192Q067R091
$$ 982481 980956 979902 979536 980084 981866 985130 989673 994732 999551 1004119 1009144 1015245 1022437 1030504 1039595
62467A039595J0636J2710J5058J7259J8843J9769K0830K3051K6490L0047L2730
$$ 1039595 1050231 1062941 1077999 1095258 1114101 1133870 1154700 1177751 1204241 1234288 1267018
62456A267018L4876L7787M2272M7650N2258N4940N6010N6707N7713N8547N8399
$$ 1267018 1301894 1339681 1381953 1429603 1481861 1536801 1592811 1649518 1707231 1765778 1824177
62445A824177N6959N4135M9635M3794L8310L4891L3027L0327K5591K0496J7498
$$ 1824177 1881136 1935271 1984906 2028700 2067010 2101901 2134928 2165255 2190846 2211342 2228840
62434B228840J6913J7205J7643J9262K2950K7726L1772L4768L8406M4339N2044
$$ 2228840 2245753 2262958 2280601 2299863 2322813 2350539 2382311 2417079 2455485 2499824 2551868
62423B551868N9150O3896O6721O9153P1451P2042O9170O2442N2635M0866K8336
$$ 2551868 2611018 2674914 2741635 2810788 2882239 2954281 3023451 3085893 3138528 3179394 3207730
62412C207730J6242N022o156j8621l2842m7963o2400p4640q3876r0324r4775r7559
$$ 3207730 3223972 3228994 3222838 3204217 3171375 3123412 3061012 2986372 2902496 2812172 2717397 2619838
62400B619838r8309r7031r4790r2634r0217q6353q0753p4413o8386o2976n8274
$$ 2619838 2521529 2424498 2329708 2237074 2146857 2060504 1979751 1905338 1836952 1773976 1715702
62389A715702n4456n1203m7564m2939l7737l2720k8109k3821j9993j6695j3469
$$ 1715702 1661246 1610043 1562479 1519540 1481803 1449083 1420974 1397153 1377160 1360465 1346996
62378A346996r908o589m631m209m208l791l727n362q385j0572j0163p935o294
$$ 1346996 1337088 1330499 1325868 1321659 1317451 1313660 1309933 1304571 1296186 1285614 1275451 1267516 1261222
62365A261222o682q595j0887j3011j4748j5715j5802j5484j5075j4210j2687j1236
$$ 1261222 1254540 1245945 1235058 1222047 1207299 1191584 1175782 1160298 1145223 1131013 1118326 1107090
62353A107090j0628j0472r827q788q322q572q443p216n636m927n357o250o797
$$ 1107090 1096462 1085990 1076163 1067375 1059053 1050481 1042038 1034822 1029186 1024259 1018902 1012652 1005855
62340A005855o408m789k235M11K404L554L953L791L584L996N012N713N436M736
$$ 1005855 999447 994658 992423 992834 995238 998792 1002745 1006536 1010120 1014116 1019128 1024841 1030277 1035013
62326A035013M775N959P707R279J0403J1172J1900J3083J5045J7394J9076J9302
$$ 1035013 1039788 1045747 1053454 1062733 1073136 1084308 1096208 1109291 1124336 1141730 1160806 1180108
62314A180108J8403J7709J8384K0383K2717K4714K6637K8881L1135L3022L5198
$$ 1180108 1198511 1216220 1234604 1254987 1277704 1302418 1329055 1357936 1389071 1422093 1457291
62303A457291L8813M3849M8828N2572N5491N8760O2834O7319P1713P5633P8551
$$ 1457291 1496104 1539953 1588781 1641353 1696844 1755604 1818438 1885757 1957470 2033103 2111654
62292B111654P9891P9402P7171P3341O7947O0808N1646M0728K9299J8713Q972
$$ 2111654 2191545 2270947 2348118 2421459 2489406 2550214 2601860 2642588 2671887 2690600 2699572
62281B699572j038j1537k1013k8071l3357l8650m4449m9436n2237n2897n2570
$$ 2699572 2698534 2686997 2665984 2637913 2604556 2565906 2521457 2472021 2419784 2366887 2314317
62270B314317n2343n2507n2492n1400m8879m5493m2251l9966l9107l9643m0675
$$ 2314317 2261974 2209467 2156975 2105575 2056696 2011203 1968952 1928986 1889879 1850236 1809561
62259A809561m0820l9634l8151l7480l7292l6465l4799l3096l1698k9964k7346
$$ 1809561 1768741 1729107 1690956 1653476 1616184 1579719 1544920 1511824 1480126 1450162 1422816
62248A422816k4210k1244j8713j6520j4554j2745j1026r426q024o807n651m311
$$ 1422816 1398606 1377362 1358649 1342129 1327575 1314830 1303804 1294378 1286354 1279547 1273896 1269585
62236A269585k258Q66M274O074N248L304K996N258Q388J0310J0717J0492R954
$$ 1269585 1267327 1268193 1272467 1278541 1283789 1287093 1290089 1295347 1303735 1314045 1324762 1335254 1345208
62223A345208Q653O650N059M953O196P682Q684R585J1123J3257J5225J6504J7147
$$ 1345208 1353861 1360511 1365570 1370523 1376719 1384401 1393085 1402670 1413793 1427050 1442275 1458779 1475926
62210A475926J7192J6608J6099J7061K0115K4283K8224L1687L5050L8225M1105
$$ 1475926 1493118 1509726 1525825 1542886 1563001 1587284 1615508 1647195 1682245 1720470 1761575
62199A761575M4521M9464N5420O0742O4789O8552P2892P7148P9890Q0194P7767
$$ 1761575 1806096 1855560 1910980 1971722 2036511 2105063 2177955 2255103 2334993 2415187 2492954
62188B492954P2503O4688N5322M5718L6636K7799J8227P251m559j5765k5559l4417
$$ 2492954 2565457 2630145 2685467 2731185 2767821 2795620 2813847 2821098 2816539 2800774 2775215 2740798
62176B740798m2964n0901n7682o3408o8053p0573p0159o7959o6084o5055o3608
$$ 2740798 2697834 2646933 2589251 2525843 2457790 2387217 2317058 2249099 2183015 2117960 2054352
62165B054352o0878n7293n3372m9270m5660m3297m1386l8151l3613k9931k8206
$$ 2054352 1993474 1936181 1882809 1833539 1787879 1744582 1703196 1665045 1631432 1601501 1573295
62154A573295k6716k3620j9724j6981j5583j4314j2813j1599j0382q238n415l360
$$ 1573295 1546579 1522959 1503235 1486254 1470671 1456357 1443544 1431945 1421563 1413325 1407910 1404550
62142A404550k631k065l83K195M386N402N756O695Q801J1242J2668J2875J2906
$$ 1404550 1401919 1399854 1399471 1401666 1406052 1411454 1417210 1423905 1432706 1443948 1456616 1469491 1482397
62129A482397J3420J3917J3936J3954J4506J5382J6491J8397K1027K2858K2667
$$ 1482397 1495817 1509734 1523670 1537624 1552130 1567512 1584003 1602400 1623427 1646285 1668952
62118A668952K1300K0398K0094J9479J8704J8941K0448K2322K4205K6795L0483
$$ 1668952 1690252 1710650 1730744 1750223 1768927 1787868 1808316 1830638 1854843 1881638 1912121
62107A912121L4788L9242M3609M7105M8909M9683N1309N4357N6844N6137N1366
$$ 1912121 1946909 1986151 2029760 2076865 2125774 2175457 2226766 2281123 2337967 2394104 2445470
62096B445470M3569L4430K5415J7344J0056K757m930j2564j9534k5456k9946l2869
$$ 2445470 2489039 2523469 2548884 2566228 2576284 2579041 2574111 2561547 2542013 2516557 2486611 2453742
62084B453742l4985l7485m0496m2936m4188m4924m5612m5195m2377l7788l3743
$$ 2453742 2418757 2381272 2340776 2297840 2253652 2208728 2163116 2117921 2075544 2037756 2004013
62073B004013l1796l1213l0075k7375k3825k0842j9109j8255j7722j7450j7505
$$ 2004013 1972217 1941004 1910929 1883554 1859729 1838887 1819778 1801523 1783801 1766351 1748846
62062A748846j7560j7168j6156j4216j0729n951j839l48r07j048J68Q77o85l450
$$ 1748846 1731286 1714118 1697962 1683746 1673017 1667066 1665227 1664879 1663972 1662924 1663092 1663969 1663284 1659834
62048A659834n001m787m332m605m858m284l552l991n881q215r928j0886j1610
$$ 1659834 1654833 1650046 1645714 1641109 1636251 1631967 1628415 1624424 1618543 1610328 1600400 1589514 1577904
62035A577904j2248j2154j0595p794m799k299j0K494M847O333O967P524Q547R887
$$ 1577904 1565656 1553502 1542907 1535113 1530314 1528015 1528005 1530499 1535346 1541679 1548646 1556170 1564717 1574604
62021A574604J1345J3235J5902J9014K1773K3832K5604K7437K8976K9724L0018
$$ 1574604 1585949 1599184 1615086 1634100 1655873 1679705 1705309 1732746 1761722 1791446 1821464
62010A821464L0679L1660L1950L1278L1024L2522L5086L6984L8018L9558M1797
$$ 1821464 1852143 1883803 1915753 1947031 1978055 2010577 2045663 2082647 2120665 2160223 2202020
61999B202020M2666M0287L5235K9250K2816J5491P842J231m312j0243j7172k3870
$$ 2202020 2244686 2284973 2320208 2349458 2372274 2387765 2395607 2396838 2392526 2382283 2365111 2341241
61987B341241k9242l3950l9007m3908m7591n0445n3649n6701n7453n5248n2349
$$ 2341241 2311999 2278049 2239042 2195134 2147543 2097098 2043449 1986748 1929295 1874047 1821698
61976A821698n1173n1181m9920m6583m2933m0718l9601l8145l5692l2557k9101
$$ 1821698 1770525 1719344 1669424 1622841 1579908 1539190 1499589 1461444 1425752 1393195 1364094
61965A364094k5490k2117j9622j8443j8467j9031j9238j8671j7763j7003j6037
$$ 1364094 1338604 1316487 1296865 1278422 1259955 1240924 1221686 1203015 1185252 1168249 1152212
61954A152212j4365j2761j2637j3713j3741j1467q513p073o865o001m033k224
$$ 1152212 1137847 1125086 1112449 1098736 1084995 1073528 1065015 1057942 1051077 1045076 1041043 1038819
61942A038819j077M05K661M514M780L652J886j63j983k493j296K46J39k189n455
$$ 1038819 1037742 1038147 1040808 1045322 1050102 1053754 1055640 1055477 1053494 1051001 1049705 1049951 1050090 1047901 1042446
61927A042446p843q435p671o835o882p666q456q996r533r958r730q815p890p462
$$ 1042446 1034603 1026168 1018497 1011662 1004780 997114 988658 979662 970129 960171 950441 941626 933736 926274
61913I26274p449p733q285q605p924o301m724l762k955j816n50N80J669K507K529
$$ 926274 918825 911092 902807 894202 886278 879977 875253 871491 868536 866720 866170 866750 868419 870926 873455
61898H73455J963K054L470N362O756P831Q955R471Q700P548P808J0123J3556J6874
$$ 873455 875418 877472 880942 886304 893060 900891 909846 919317 928017 935565 943373 953496 967052 983926
61884I83926J9432K1156K2491K4071K5793K6733K6640K6711K7918K9356K9595
$$ 983926 1003358 1024514 1047005 1071076 1096869 1123602 1150242 1176953 1204871 1234227 1263822
61873A263822K9020K9269L0659L1734L1313K9494K6521K2294J7418J3328J0641
$$ 1263822 1292842 1322111 1352770 1384504 1415817 1445311 1471832 1494126 1511544 1524872 1535513
61862A535513Q480O032L793K501J777O49j026k415k675j621K85K252L894N732
$$ 1535513 1543993 1550025 1553818 1556319 1558096 1558745 1557719 1555304 1552629 1551008 1551293 1553545 1557439 1563171
61848A563171Q553J2084J5002J6472J6932J6941J6032J3366R073M284J05k961
$$ 1563171 1571724 1583808 1598810 1615282 1632214 1649155 1665187 1678553 1687626 1691910 1692015 1689054
61836A689054m915o140p231q653j0609j3234j6353j9007j9974j9275j8504j8954
$$ 1689054 1684139 1677999 1670768 1662115 1651506 1638272 1621919 1602912 1582938 1563663 1545159 1526205
61824A526205j9951j9914j8687j7810j8422j9763k0137j8925j7147j6217j6367
$$ 1526205 1506254 1486340 1467653 1449843 1431421 1411658 1391521 1372596 1355449 1339232 1322865
61813A322865j6430j5205j2854j0591q989p271m566j234J687L860N726P498R051
$$ 1322865 1306435 1291230 1278376 1267785 1258796 1251525 1246959 1245725 1247412 1251272 1256998 1264496 1273547
61800A273547J0674J2947J5717J8235K0581K3950K8786L3545L6320L7195L7960
$$ 1273547 1284221 1297168 1312885 1331120 1351701 1375651 1404437 1437982 1474302 1511497 1549457
61789A549457L9795M2372M5061M7546M8912M7599M3438L8766L5977L4218L0114
$$ 1549457 1589252 1631624 1676685 1724231 1773143 1820742 1864180 1902946 1938923 1973141 2003255
61778B003255K2115J2806O061K950J546J19j059j124l42L70P98J297J828K124
$$ 2003255 2025370 2038176 2044237 2047187 2048733 2048852 2047793 2046669 2046327 2046697 2047495 2048792 2050620 2052744
61764B052744K631M306P109R486R803P935M975J727k033o912j2924j9170k4374
$$ 2052744 2055375 2059681 2066790 2076276 2086079 2094014 2098989 2100716 2098683 2091771 2078847 2059677 2035303
61751B035303k7932l0511l3304l6431l8575l8660l7366l6227l5557l4370l2283
$$ 2035303 2007371 1976860 1943556 1907125 1868550 1829890 1792524 1756297 1720740 1686370 1654087
61740A654087l0339k9562k9718l0018l0111k9723k8323k6101k4465k4285k4256
$$ 1654087 1623748 1594186 1564468 1534450 1504339 1474616 1446293 1420192 1395727 1371442 1347186
61729A347186k2438j9206j7001j6896j7062j5352j2211r824r236r548r598r266
$$ 1347186 1324748 1305542 1288541 1271645 1254583 1239231 1227020 1217196 1207960 1198412 1188814 1179548
61717A179548q974q798q502q018p523p191p020o754n945m259j914J65R00P3j132
$$ 1179548 1170574 1161776 1153274 1145256 1137733 1130542 1123522 1116768 1110823 1106564 1104650 1104815 1105715 1105788 1104656
61702A104656j011Q92L127L907L183K521L028M133M700M531M176L726K649P58
$$ 1104656 1103645 1104537 1107664 1111571 1114754 1117275 1120303 1124436 1129136 1133667 1137843 1141569 1144218 1144976
61688A144976j318k810l610m107m432m313l715l311l854n122o007n857n267n174
$$ 1144976 1143658 1140848 1137238 1133131 1128699 1124386 1120671 1117360 1113506 1108384 1102377 1096520 1091253 1086079
61674A086079n609n789n196l942k287m56J197K321K805K467R29j469l110k545
$$ 1086079 1080470 1074681 1069485 1065543 1063256 1062800 1063997 1066318 1069123 1071590 1072519 1071050 1067940 1065395
61660A065395l32J635K546L045L253K088o83l237l777k809k189k587l171l351
$$ 1065395 1065063 1066698 1069244 1072289 1075542 1077630 1076947 1073710 1069933 1067124 1064935 1062348 1059177 1055826
61646A055826l500l951m382m524m820n972q004r846r969p851m920l478m332n981
$$ 1055826 1052326 1048375 1043993 1039469 1034649 1028677 1020673 1010827 1000858 993007 988087 984609 980277 974296
61632I74296o558n990n681o551q086r130r056q233p633p808q114p372n447l534
$$ 974296 967738 961748 956067 949516 941430 932300 923244 915011 907378 899570 891456 884084 878637 875103
61618H75103k676k628k667k658k752k658j975q98K7N03M61J1k75L63J805K922
$$ 875103 872427 869799 867132 864474 861722 859064 857089 856191 856218 856721 857182 857193 856918 857281 859086 862008
61602H62008K965K316J527N73k77n6J508L185L917M376N702P494Q401Q059P085
$$ 862008 864973 867289 868816 869389 869112 869056 870564 873749 877666 882042 887744 895238 903639 911698 918783
61587I18783N795M237L054K858L121K969K624K748K913K212J059O98J063Q01n88
$$ 918783 924578 928815 931869 934727 937848 940817 943441 946189 949102 951314 952373 953071 954134 954935 954347
61572I54347k090k775k671k044j089m24o28j238j475j710k827m329m805m204l876
$$ 954347 952257 949482 946811 944767 943678 943254 942626 941388 939913 938203 935376 931047 926242 922038 918162
61557I18162m285m616m870o203q510r713q539o437n664o676q292r260q926p532
$$ 918162 913877 909261 904391 898188 889678 879965 871426 864989 859325 852649 844357 835097 826171 818639
61543H18639o530p380r391j0158q692o661n811n898o088o608p584p873o629m781
$$ 818639 812109 804729 795338 785180 776488 769827 764016 758118 752030 745422 737838 729965 723336 718555
61529G18555l436k123k98O59r09l986n693m774k637j081o92j415l082m887n575
$$ 718555 715119 712996 712698 713357 712448 708462 702769 697995 695358 694277 693585 692170 689088 684201 678626
61514F78626m601k527k61J464K115J706J067R61J134Q46J40k52j3N10J083J888
$$ 678626 674025 671498 671237 672701 674816 676522 677589 678550 679684 680530 680670 680418 680405 680915 681998 683886
61498F83886L024M184M889M814M078L315K982K572J261n45j417r36k61p9M83J981
$$ 683886 686910 691094 695983 700797 704875 708190 711172 713744 715005 714460 713043 712107 711846 711767 712250 714231
61482G14231L188L041K661L646N306N599M249K912K570K609K459K202J574J06
$$ 714231 717419 720460 723121 726767 732073 737672 741921 744833 747403 750012 752471 754673 756247 756353
61468G56353j427j498j73O10l34j960k743k555k071j498p73k20j59m20p24j057
$$ 756353 754926 753428 753255 753865 753531 751571 748828 746273 744202 742704 741931 741711 741552 741132 740408 739351
61452G39351j346j404j419j729j938j143O26K025J896M47j366k774l195k240l69
$$ 739351 738005 736601 735182 733453 731515 730372 730998 733023 734919 735366 734000 731226 728031 725791 725422
61437G25422J189J761J920K429L169L681L994M257M037K898J379O92J354K575
$$ 725422 726611 728372 730292 732721 735890 739571 743565 747822 751859 754757 756136 756828 758182 760757
61423G60757L110K561J884K447M437O330O515N227M176M245M529L878K544J602
$$ 760757 763867 766428 768312 770759 775196 781526 788041 793268 797444 801689 806218 810096 812640 814242
61409H14242J431J527J420J059N07j70o92p42l82p7k82j059j948k260j732r12
$$ 814242 815673 817200 818620 819679 820186 820016 819324 818582 818200 818123 817841 816782 814834 812574 810842 809930
61393H09930n84p81q37l96K0k41j126j937j903o32J558L540M144L363K397K272
$$ 809930 809346 808565 807728 807332 807352 807111 805985 804048 802145 801513 803071 806611 810755 814118 816515 818787
61377H18787K785L160L190L222L329L079K187J021L52O74J703K573K731K603L011
$$ 818787 821572 824732 827922 831144 834473 837552 839739 840760 841112 841786 843489 846062 848793 851396 854407
61362H54407L914M278L515K589L072N175P209P193M868J960N37J128K570L386
$$ 854407 858321 862599 866114 868703 871775 876950 884159 891352 896220 898180 898717 899845 902415 905801
61348I05801K937J201j665m800o294m597n87K774L318J648j72j108j646k298k659
$$ 905801 908738 909939 908274 903474 897180 892583 891996 894770 898088 899736 899564 898456 896810 894512 891853
61333H91853k111q55J46P8r90k162k437j491J25J421J657Q25k48l89R99L406N665
$$ 891853 889742 888887 889033 889111 888121 885959 883522 882031 882156 883577 885234 886059 885811 885422 886421 889827 895492
61316H95492O945P169O773O356O400O862P074O457N288M384M120M239M428M463
$$ 895492 902437 909606 916379 922735 929135 935997 943071 949528 954816 959200 963320 967559 971987 976450
61302I76450L886K425Q65O38K108M011N033N259N528O074O569O920P172P059O550
$$ 976450 980336 982761 983626 984264 986372 990383 995416 1000675 1006203 1012277 1018846 1025766 1032938 1039997 1046547
61287A046547O518P828R817J0740R927Q493P595O946N713M094L132L341M347N583
$$ 1046547 1053065 1060893 1070710 1081450 1091377 1099870 1107465 1114411 1120124 1124218 1127350 1130691 1135038 1140621
61273A140621O546O519N027K722R69K56k60j276k163j989j053n59r98j700j803
$$ 1140621 1147167 1153686 1158713 1161435 1162404 1162660 1162400 1161124 1158961 1156972 1155919 1155360 1154362 1152662 1150859
61258A150859r18J064L908O707Q419Q972R121R162Q726Q159Q894J1748J5546J8323
$$ 1150859 1149941 1151005 1154913 1161620 1170039 1179011 1188132 1197294 1206020 1214179 1223073 1234821 1250367 1268690
61244A268690J9273J8882J7793J6422J5121J3717J1289P430L409R05k48j811m573
$$ 1268690 1287963 1306845 1324638 1341060 1356181 1369898 1381187 1388617 1392026 1392931 1392683 1390872 1386299
61231A386299p280q501q434q261q583r198r886j0623j1261j1560j1423j0808r699
$$ 1386299 1379019 1370518 1362084 1353823 1345240 1336042 1326156 1315533 1304272 1292712 1281289 1270481 1260782
61218A260782q311p064o023m696k737n28J244K371L120L642L876L936M190M805
$$ 1260782 1252471 1245407 1239384 1234688 1231951 1231423 1232667 1235038 1238158 1241800 1245676 1249612 1253802 1258607
61204A258607N552O267P187Q501R742J0179R848R738J0555J1772J2343J1968J1043
$$ 1258607 1264159 1270426 1277613 1286114 1295856 1306035 1315883 1325621 1336176 1347948 1360291 1372259 1383302
61191A383302R683P761N748M496L965L136J596J41o39j414l021n044o316o242
$$ 1383302 1392985 1400746 1406494 1410990 1414955 1418091 1419687 1419828 1419189 1417775 1414754 1409710 1403394 1397152
61177A397152n114l689k986l582m508l918j590L60L07n42LK019L923N128O220
$$ 1397152 1392038 1388349 1385363 1381781 1377273 1373355 1371765 1372125 1372432 1371890 1371893 1373912 1377835 1382963 1389183
61162A389183P168P395P415Q252R341R139P898P579Q519Q651O945N450O383Q898
$$ 1389183 1396351 1403746 1411161 1419413 1428754 1437893 1445791 1453370 1461889 1470540 1477485 1482935 1489318 1498216
61148A498216J0341R619P844O410N834O031O566O963P362Q496J0444J2100J2480
$$ 1498216 1508557 1518176 1526020 1532430 1538264 1544295 1550861 1557824 1565186 1573682 1584126 1596226 1608706
61135A608706J1977J1769J2614J4556J7005J8631J8075J5459J2492J0522R158
$$ 1608706 1620683 1632452 1645066 1659622 1676627 1695258 1713333 1728792 1741284 1751806 1760964
61124A760964P288M615J651r64k660l249l440m154n071n046m200m057n043n703
$$ 1760964 1768252 1772867 1774518 1773554 1770894 1767645 1764205 1760051 1754980 1749934 1745734 1741677 1736634 1730931
61110A730931n440o032q818j2055j3247j2910j3598j5897j7833j8169j7907j8054
$$ 1730931 1725491 1719459 1710641 1698586 1685339 1672429 1658831 1642934 1625101 1606932 1589025 1570971
61098A570971j7998j6976j5572j4715j4202j3222j1699j0202q872p283n352l838
$$ 1570971 1552973 1535997 1520425 1505710 1491508 1478286 1466587 1456385 1447513 1440230 1434878 1431040
61086A431040l482l887l812k935k597l965n987o566n666n352o237n915k437K305
$$ 1431040 1427558 1423671 1419859 1416924 1414327 1410362 1404375 1397809 1392143 1386791 1380554 1374639 1372202 1374507
61072A374507M607L599J892K062M248P219J0081J2622J5042J7681K0424K2592
$$ 1374507 1379114 1382713 1384605 1386667 1390915 1398134 1408215 1420837 1435879 1453560 1473984 1496576
61060A496576K4031K5702K8225L0686L2083L3096L4802L6397L6297L5121L5218
$$ 1496576 1520607 1546309 1574534 1605220 1637303 1670399 1705201 1741598 1777895 1813016 1848234
61049A848234L7014L8184L7130L5153L4114L3773L2914L1579L0425K8824K5331
$$ 1848234 1885248 1923432 1960562 1995715 2029829 2063602 2096516 2128095 2158520 2187344 2212675
61038B212675J9905J4309J0224P756N820L333M2l318n647o555o795p420q627r635
$$ 2212675 2232580 2246889 2257113 2264869 2270689 2274022 2274064 2270746 2265099 2258544 2251749 2244329 2235702 2226067
61024B226067r638q748p912p771p572n805k156J787M452O270Q734J1959J4526
$$ 2226067 2216429 2207681 2199769 2191998 2184426 2178621 2176465 2178252 2182704 2188974 2197708 2209667 2224193
61011B224193J5753J6709J8578K1228K3944K6562K9099L1159L2518L3652L4982
$$ 2224193 2239946 2256655 2275233 2296461 2320405 2346967 2376066 2407225 2439743 2473395 2508377
61000B508377L6140L6781L7512L9111M1173M2520M2894M3287M4338M5279M4937
$$ 2508377 2544517 2581298 2618810 2657921 2699094 2741614 2784508 2827795 2872133 2917412 2962349
60989B962349M3317M1529M0482M0305M1008M2774M5206M7065M7570M7479M7943
$$ 2962349 3005666 3047195 3087677 3127982 3168990 3211764 3256970 3304035 3351605 3399084 3447027
60978C447027M8760M9093M9611N2156N6824O1234O3723O5621O9041P3913P9091
$$ 3447027 3495787 3544880 3594491 3646647 3703471 3764705 3828428 3894049 3963090 4037003 4116094
60967D116094Q5075R3250J02964J11822J18931J25815J33889J43052J53276J65573
$$ 4116094 4201169 4294419 4397383 4509205 4628136 4753951 4887840 5030892 5184168 5349741
60957E349741J80683J98386K18699K42037K67497K92841L17437L43926L75946
$$ 5349741 5530424 5728810 5947509 6189546 6457043 6749884 7067321 7411247 7787193
60948G787193M15543M63814N22779N95223O83355P88094R08174J039673J179279
$$ 7787193 8202736 8666550 9189329 9784552 10467907 11256001 12164175 13203848 14383127
60939A4383127J329580J498139J688289J892882K098645K288613K428496K453328
$$ 14383127 15712707 17210846 18899135 20792017 22890662 25179275 27607771 30061099
60931C0061099K290596J920927J420300R29128N67750L77244L30970L78392M58848
$$ 30061099 32351695 34272622 35692922 36622050 37189800 37567044 37898014 38276406 38735254
60922C8735254M85655L56162J0229n15274j098824j606676j959059k143449k187976
$$ 38735254 39220909 39577071 39587300 39072026 37973202 36366526 34407467 32264018 30076042
60913C0076042k133309k019286j879613j738336j609285j498105j403828j320537
$$ 30076042 27942733 25923447 24043834 22305498 20696213 19198108 17794280 16473743
60905A6473743j241125j161126j079249r95961r13297q34827p63228o97778o35755
$$ 16473743 15232618 14071492 12992243 11996282 11082985 10248158 9484930 8787152 8151397
60896H151397n76105n20219m69452m23729l82556l45636l12113k80837k51947
$$ 8151397 7575292 7055073 6585621 6161892 5779336 5433700 5121587 4840750 4588803
60887D588803k26859k06033j88138j72055j58422j48025j39715j31363j22500
$$ 4588803 4361944 4155911 3967773 3795718 3637296 3489271 3349556 3218193 3095693
60878C095693j14630j08764j03884r8300r1706q5205p9791p5569p2190o9117o5439
$$ 3095693 2981063 2872299 2768415 2670115 2578409 2493204 2413413 2337844 2265654 2196537 2131098
60867B131098o0490n5182n1680n0743n0069m6672m0630l5023l2104l1066l0019
$$ 2131098 2070608 2015426 1963746 1913003 1862934 1816262 1775632 1740609 1708505 1677439 1647420
60856A647420k8537k7155k5696k3568k1125j9312j8267j7337j6274j5382j4676
$$ 1647420 1618883 1591728 1566032 1542464 1521339 1502027 1483760 1466423 1450149 1434767 1420091
60845A420091j3802j2723j1672j0561r376q855r741j1295j1781j0656r339r349
$$ 1420091 1406289 1393566 1381894 1371333 1361957 1353102 1343361 1332066 1320285 1309629 1300290 1290941
60833A290941j0534j1726j2397j2835j3172j3066j2362j1542j1287j1807j2649
$$ 1290941 1280407 1268681 1256284 1243449 1230277 1217211 1204849 1193307 1182020 1170213 1157564
60822A157564j3119j2950j2586j2685j3275j3480j2358r995p671o756p385q314
$$ 1157564 1144445 1131495 1118909 1106224 1092949 1079469 1067111 1057116 1049445 1042689 1035304 1026990
60810A026990q138o667m943m029l967l848k722m38K118L702L813L176K946L542
$$ 1026990 1018852 1012185 1007242 1003213 999246 995398 992676 992238 994356 998058 1001871 1005047 1007993 1011535
60796A011535M564N512O112O127N520M750M308L975L217K231J775J862J649Q48
$$ 1011535 1016099 1021611 1027723 1033850 1039370 1044120 1048428 1052403 1055620 1057851 1059626 1061488 1063137 1063985
60782A063985J25k82j201l033m740n389n822p503j0206j2133j2193j0992r524
$$ 1063985 1064110 1063828 1062627 1059594 1054854 1049465 1043643 1036140 1025934 1013801 1001608 990616 981092
60769I81092q003o306m810m203m744n924o885p312p899r427j1231j1400r073n875
$$ 981092 973089 966783 961973 957770 953026 947102 940217 932905 925006 915579 904348 892948 883875 878000
60755H78000m220m688n917o622o676o420o004n593n309m916m210l637l800m483
$$ 878000 873780 869092 863175 856553 849877 843457 837453 831860 826551 821635 817425 813788 809988 805505
60741H05505m882m689m059k805p30J228J575L99k66J054L398M720M367L287K319
$$ 805505 800623 795934 791875 789070 788340 789568 791143 791542 791276 792330 795728 800448 804815 808102 810421
60726H10421J395K89o70r59m43N84J677K469K738K384J455L54k17J60J051J508
$$ 810421 811816 812105 811435 810476 810033 810617 812294 814763 817501 819885 821340 821694 821477 821637 822688 824196
60710H24196J037j4j013j559j520r71l40j27l74q12j489k583l499l091j345M9
$$ 824196 825233 825219 824206 822647 821127 820156 819816 819689 819315 818503 817014 814431 810932 807841 806496 806545
60694H06545k77j452j625p55n92j786k712j934m38m4o37p47m44j495m332o691
$$ 806545 806268 804816 803191 802436 801844 800058 797346 795412 794974 794930 794293 793546 793102 791607 787275 780584
60678G80584o392m031j750m83O7k82j983m123m946m184l275k944k295q81O5m19
$$ 780584 774192 770161 768411 767928 767995 767713 765730 761607 756661 752477 749202 746258 743963 743082 743147 742728
60662G42728j197o21R74J780J063p3l25M63J563K191K140J998K553L532L599K166
$$ 742728 741531 740910 741884 743664 744727 744654 744329 744792 746355 748546 750686 752684 755237 758769 762368 764534
60646G64534N91O04K135L683M307M138L324J923P87J145K893M329M029K220Mj986
$$ 764534 765125 765729 767864 771547 775854 779992 783316 785239 786026 787171 790064 794393 798422 800642 800646 798660
60630G98660l636m753m923l882j911N6R38M99m05r40j264j731j784o36J260K593
$$ 798660 795024 790271 785348 781466 779555 779611 780549 781048 780643 779703 778439 776708 774924 774288 775548 778141
60614G78141L037L515M492N114M375K285l47k505l312k784k276l060m391m335
$$ 778141 781178 784693 789185 794299 798674 800959 800612 798107 794795 792011 789735 786675 782284 777949
60600G77949k720j500j603j333P99L348L917K685J813J926J551O9j011m98N87
$$ 777949 775229 773729 772126 770793 771592 774940 778857 781542 783355 785281 786832 786901 785890 785392 785979
60585G85979P31J71J43P74J074N26m89j651k893l722l509k642k345k948l266k281
$$ 785979 786710 786881 787024 787798 788872 789398 788909 787258 784365 780643 777134 774492 772147 769199 765933 763652
60569G63652o13M57O76O43N55L04M63J694L159L007J022n86N2J929K566J231m64
$$ 763652 763039 763496 764172 764815 765370 765674 766137 767831 770990 773997 775019 774433 774485 776414 778980 780211 779747
60552G79747q18K73J792K718K541J576Q73J212K078K259J451O75R99K444M193
$$ 779747 778929 779202 780994 783712 786253 787829 788702 789914 791992 794251 795702 796377 797376 799820 804013
60537H04013N360N506M912M309L912L066J419R0N20K319L515L208K656L103L836
$$ 804013 809373 814879 819791 824100 828012 831078 832497 832587 833107 835426 838941 842149 844805 847908 851744
60522H51744L479K344K097L377N051O027O646P748R083R604R129Q872R953J2021
$$ 851744 855223 857567 859664 863041 868092 874119 880765 888513 897596 907200 916329 925201 935154 947175
60508I47175J3843J4995J6114J7471J8233J7587J5904J4080J2265J0050P588N581
$$ 947175 961018 976013 992127 1009598 1027831 1045418 1061322 1075402 1087667 1097717 1105305 1110886
60496A110886M176K744R40o54j265p90L17J629L001M484O132P894R671J1497J3366
$$ 1110886 1115062 1117806 1118746 1118092 1116827 1116037 1116354 1117983 1120984 1125468 1131600 1139494 1149165 1160662 1174028
60481A174028J4957J5990J7051J9263K2783K6403K9199L1716L4539L6682L6640
$$ 1174028 1188985 1204975 1222026 1241289 1264072 1290475 1319674 1351390 1385929 1422611 1459251
60470A459251L4440L1143K6905K1173J4599Q889M482J50m721q973j1436j2352
$$ 1459251 1493691 1524834 1551739 1572912 1587511 1596400 1600882 1601032 1596311 1587338 1575902 1563550
60458A563550j2426j1779j0719j0136j0104r209o393k563O37K882M889O889Q709
$$ 1563550 1551124 1539345 1528626 1518490 1508386 1499177 1492784 1490221 1490858 1493740 1498629 1505518 1514227
60445A514227J0840J4198J8831K3816K8452L2944L7931M3827N0488N7082O2456
$$ 1514227 1525067 1539265 1558096 1581912 1610364 1643308 1681239 1725066 1775554 1832636 1895092
60434A895092O5968O7731O7956O6554O3588N9533N4717M9047M2579L5792K8958
$$ 1895092 1961060 2028791 2096747 2163301 2226889 2286422 2341139 2390186 2432765 2468557 2497515
60423B497515K1851J4282O246k640j2905k4185l5352m5938n6144o5116p0887p2990
$$ 2497515 2519366 2533648 2539894 2537254 2524349 2500164 2464812 2418874 2362730 2297614 2226727 2153737
60411B153737p3584p4599p5175p3462o9786o5992o2491n8159n2995m8681m6210
$$ 2153737 2080153 2005554 1930379 1856917 1787131 1721139 1658648 1600489 1547494 1498813 1452603
60400A452603m4595m2484l9678l6637l3657l1089k9294k7926k6039k3311k0425
$$ 1452603 1408008 1365524 1325846 1289209 1255552 1224463 1195169 1167243 1141204 1117893 1097468
60389A097468j7971j5784j3652j1930j1047j0890j0985j0786r827q105o369n384
$$ 1097468 1079497 1063713 1050061 1038131 1027084 1016194 1005209 994423 984596 976491 970122 964738
60377I64738m995m519m028m318n542o782p160o642n538m055k663k070k402k892
$$ 964738 959743 955224 951196 946878 941336 934554 927394 920752 915214 911159 908496 906426 904024 901132
60363I01132k837k338j837j475j228j179j340j525j654j828j982j859j287j52
$$ 901132 898295 895957 894120 892645 891417 890238 888898 887373 885719 883891 881909 880050 878763 878611
60349H78611J756M117N541M694K214M26O98J951K344J542N79L09R21K389M306
$$ 878611 880367 884484 890025 894719 896933 897359 898057 900008 902352 903894 904473 904782 905703 908092 912398
60334I12398N565N293M163L779M567N157M227K378J515K713N191P284P854O700
$$ 912398 917963 923256 927419 931198 935765 940922 945149 947527 949042 951755 956946 964230 972084 978784
60320I78784M258J492k44l8J584K986L058K220J500J246J282J790L077M569N067
$$ 978784 983042 984534 984290 984252 985836 988822 991880 994100 995600 996846 998128 999918 1002995 1007564 1012631
60305A012631M176K711J607J184J615L089N072O309O346O248P106Q441R011Q655
$$ 1012631 1016807 1019518 1021125 1022309 1023924 1027013 1032085 1038394 1044740 1050988 1058094 1066535 1075546 1084201
60291A084201Q302Q400Q444Q049P481O917O090M983M090L638L111J946J73j871
$$ 1084201 1092503 1100903 1109347 1117396 1124877 1131794 1137884 1142867 1146957 1150595 1153706 1155652 1155825 1153954
60277A153954l884n272n188l530j484m50p04j621k786m146n353n814n402m590
$$ 1153954 1150070 1144798 1139610 1136080 1134596 1134146 1133442 1131821 1129035 1124889 1119536 1113722 1108320 1103730
60263A103730l807l159k659k158j227K81J663K141K195L149N271P348Q498R484
$$ 1103730 1099923 1096764 1094105 1091947 1090720 1091001 1092664 1094805 1097000 1100149 1105420 1112768 1121266 1130750
60249A130750J1546J4658J7583J9161J9063J7960J7322J8203J9540J8594J4000
$$ 1130750 1142296 1156954 1174537 1193698 1212761 1230721 1248043 1266246 1285786 1304380 1318380
60238A318380P639K480o98l323o456r726j2442j4358j5304j5304j4996j4851j4233
$$ 1318380 1326019 1328499 1327801 1324478 1318022 1308296 1295854 1281496 1266192 1250888 1235892 1221041 1206808
60225A206808j2469j0573j0295j1429j1804j0294q212p122o775o120n116m565
$$ 1206808 1194339 1183766 1173471 1162042 1150238 1139944 1131732 1124610 1117835 1111715 1106599 1102034
60213A102034n009o498q661j0413j0446q643o188m016k193j133j945m615p086
$$ 1102034 1097025 1090527 1081866 1071453 1061007 1052364 1046176 1042160 1039967 1038834 1036889 1032274 1025188
60200A025188p333n587l576k380j873j533r40RP53N78k52p52p98j068j210P3K405
$$ 1025188 1017855 1012268 1008692 1006312 1004439 1002906 1001966 1001975 1002728 1003306 1003054 1002302 1001504 1000436 999226 999299 1001704
60183A001704L350J928M64J185K923L431L157L882M852L603L18j733o22J879L042
$$ 1001704 1005054 1006982 1007446 1008631 1011554 1014985 1018142 1022024 1026876 1030479 1030797 1029064 1028442 1030321 1033363
60168A033363K239O31m05K45K976O579Q845Q680O899M889L492L247M500O891R518
$$ 1033363 1035602 1036233 1035828 1036073 1039049 1045628 1054473 1063153 1070052 1074941 1078433 1081680 1086180 1093071 1102589
60153A102589J1711J3079J3276J2616J2374J3283J4377J4521J4231J4388J4175
$$ 1102589 1114300 1127379 1140655 1153271 1165645 1178928 1193305 1207826 1222057 1236445 1250620
60142A250620J2450J0352R945J0723J0269Q294O980O980O316M194K787L622M890
$$ 1250620 1263070 1273422 1283367 1294090 1304359 1312653 1319633 1326613 1332929 1337123 1339910 1343532 1348422
60129A348422M280K255N17q64k750m859o428p607q502q048n790l625l842o227
$$ 1348422 1352702 1354957 1355474 1354610 1351860 1347001 1340573 1332966 1324464 1316416 1310626 1307001 1303159 1296932
60115A296932q713j0039j0138q889o352l725k331k034j895j747j877j998k036
$$ 1296932 1288219 1278180 1268042 1259153 1252801 1249076 1246745 1244711 1242816 1241069 1239192 1237194 1235158
60102A235158k958n134o764n892l484k305l029l567k368l93P61J076J681L199
$$ 1235158 1232200 1227066 1220302 1214410 1210926 1208621 1205592 1202025 1199657 1199264 1200025 1201101 1202782 1205981
60088A205981N117O195N518L628K330K587L246K951K555L937O900R172R678R788
$$ 1205981 1211098 1217293 1222811 1226439 1228769 1231356 1234602 1237553 1240108 1244045 1250945 1260117 1269795 1279583
60074A279583J0812J1964J1846J0630R645R514R664R304Q165O614N463N501O821
$$ 1279583 1290395 1302359 1314205 1324835 1334480 1343994 1353658 1362962 1371127 1377741 1383204 1388705 1395526
60061A395526Q720J0174J0407R344P947P671Q972J0735J1748J2170J2661J2731
$$ 1395526 1404246 1414420 1424827 1434171 1442118 1449789 1458761 1469496 1481244 1493414 1506075 1518806
60049A518806J1333Q856P001O491O275N262L524J391j380m638p157p875p313o924
$$ 1518806 1530139 1538995 1545996 1552487 1558762 1564024 1567548 1568939 1567559 1562921 1555764 1547889 1540576 1533652
60035A533652p324p820p518o526n961o863q957j0724j0927r807q368p056n919
$$ 1533652 1526328 1518508 1510990 1504464 1498503 1491640 1482683 1471959 1461032 1451225 1442857 1435801 1429882
60022A429882n562o561q080q411p239o149o379p266p652p803q840j0818j2500
$$ 1429882 1424320 1417759 1409679 1401268 1394029 1387880 1381501 1374235 1366583 1358780 1349940 1339122 1326622
60009A326622j2946j2544j2321j2660j2953j2441j1187j0011r373q826p910p051
$$ 1326622 1313676 1301132 1288811 1276151 1263198 1250757 1239570 1229559 1220186 1211360 1203450 1196399
59997A196399o949p427p697p438o779n618l945k548k145k020q89R69K046K151
$$ 1196399 1189450 1182023 1174326 1166888 1160109 1154491 1150546 1147998 1145853 1143833 1142944 1143913 1145959 1148110
59983A148110K794M601O172O388O136O513O908O299N188M629M378L681L011L233
$$ 1148110 1150904 1155505 1161677 1168065 1174201 1180714 1187622 1193921 1199109 1203738 1208116 1211797 1214808 1218041
59969A218041L678K889R49p70j987l779o434q871j0462j1724j2769j2809j1904
$$ 1218041 1221719 1224608 1225557 1224787 1222800 1219021 1212587 1203716 1193254 1181530 1168761 1155952 1144048
59956A144048j1648j2904j4170j3366j0575p790o546o714p292p431o829n813m923
$$ 1144048 1132400 1119496 1105326 1091960 1081385 1073595 1067049 1060335 1053043 1045612 1038783 1032970 1028047
59943A028047m172l086j814j361k162l093k807j467k51L85Q46J195J026N02L74
$$ 1028047 1023875 1020789 1018975 1017614 1015452 1012359 1009552 1008085 1007834 1008219 1009065 1010260 1011286 1011788 1012162
59928A012162P70J076J226J948L411M740N410N968O561N936L166l85k285j926
$$ 1012162 1012932 1014008 1015234 1017182 1020593 1025333 1030743 1036711 1043272 1049208 1052374 1051989 1049704 1047778
59914A047778r26p64j419k320l253l776l073j186N17J010R60J529K565K994K561
$$ 1047778 1046852 1046088 1044669 1042349 1039096 1035320 1032247 1031061 1031578 1032588 1033548 1035077 1037642 1040636 1043197
59899A043197J941J381N06m73o23K61J152J291J170J277Q62r13l067l440j281
$$ 1043197 1045138 1046519 1047025 1046552 1045929 1046190 1047342 1048633 1049803 1051080 1051942 1051029 1047962 1044522 1043241
59884A043241J797L701L836K879J538K23o69r96j175j574j693o07J728M269O034
$$ 1043241 1045038 1048739 1052575 1055454 1056992 1057215 1056546 1055550 1054375 1052801 1051108 1050501 1052229 1056498 1062532
59869A062532O891P117O806O076N256M473L580K929L464N254O486N209J994m04
$$ 1062532 1069423 1076540 1083346 1089422 1094678 1099151 1102731 1105660 1109124 1114378 1120864 1126073 1128067 1127663
59855A127663l22J014J559J228J564L264N289O351O206N334M164L057K402K231
$$ 1127663 1127341 1128355 1129914 1131142 1132706 1135970 1141259 1147610 1153816 1159150 1163314 1166371 1168773 1171004
59841A171004K062J473O06j61o78q76l96J078L228N207O457P150P767Q541R441
$$ 1171004 1173066 1174539 1175145 1174984 1174306 1173430 1173034 1174112 1177340 1182547 1189004 1196154 1203921 1212462 1221903
59826A221903J0385J1133J1187J0256Q923Q452R546J1449J2575J2064J0552R367
$$ 1221903 1232288 1243421 1254608 1264864 1273787 1282239 1291785 1303234 1315809 1327873 1338425 1347792
59814A347792R152R359Q965P582N857M776M586M530L691J936j84k250m312o351
$$ 1347792 1356944 1366303 1375268 1382850 1388707 1393483 1398069 1402599 1406290 1408226 1408042 1405792 1401480 1395129
59800A395129p796p907o605m726l308k652k166j233j00M27J58j05M39J706L225
$$ 1395129 1387333 1379426 1372821 1368095 1364787 1362135 1359969 1358736 1358636 1359063 1359221 1359116 1359555 1361261 1364486
59785A364486M977O978Q394Q001N708K929J175Q33J390K245L033L721M619N839
$$ 1364486 1369463 1376441 1384835 1392836 1398544 1401473 1402648 1403481 1404871 1407116 1410149 1413870 1418489 1424328
59771A424328O633N863L427N11j825l676n419o714p058o828o838p109o990o393
$$ 1424328 1430961 1436824 1440251 1440762 1438937 1435261 1429842 1423128 1416070 1409242 1402404 1395295 1388305 1381912
59757A381912o182p107q797j0008r809q462p209o929p072o356m619l250l469m882
$$ 1381912 1375730 1368623 1359826 1349818 1340009 1331547 1324338 1317409 1310337 1303981 1299362 1296112 1292643 1287761
59743A287761o328p338p946p754o448m932m697n945p387q040q184q227p696o050
$$ 1287761 1281433 1274095 1266149 1258395 1251947 1247015 1242318 1236373 1228986 1220946 1212762 1204535 1196839 1190789
59729A190789l878k482k504l362l940l618k877k904m206n536m860j770J686L180
$$ 1190789 1186911 1184429 1181925 1178563 1174623 1171005 1168128 1165224 1161018 1155482 1150622 1148852 1150538 1153718
59715A153718K669K025K440L219L295K935L204M324N483O120O476O665O207N037
$$ 1153718 1156387 1158412 1160852 1164071 1167366 1170301 1173505 1177829 1183312 1189432 1195908 1202573 1208780 1213817
59701A213817M250M823O020O214N218M632N579P189Q025Q071Q417R526J0792J1595
$$ 1213817 1218067 1222890 1228910 1235124 1240342 1244974 1250553 1257742 1265767 1273838 1282255 1291781 1302573 1314168
59687A314168J1851J1584J0672R246P785O750O263O148O022N578M956M537M142
$$ 1314168 1326019 1337603 1348275 1357521 1365306 1372056 1378319 1384467 1390489 1396067 1401023 1405560 1409702
59674A409702K991Q67j267k448k924l409l647k807j053N49J628K786M012M060
$$ 1409702 1412693 1413560 1412293 1409845 1406921 1403512 1399865 1397058 1396005 1396554 1398182 1400968 1404980 1409040
59660A409040K136p11k653k971k190r50M05J471J922J955J881J363r6j774j931
$$ 1409040 1411176 1410465 1407812 1404841 1402651 1401701 1402106 1403577 1405499 1407454 1409335 1410698 1410602 1408828 1406897
59645A406897p5J794J374p81j716J01K780L716L025K827L803M424L584K220J652
$$ 1406897 1406822 1408616 1409990 1409209 1407493 1407594 1410374 1414090 1417115 1419942 1423745 1428169 1431753 1433973 1435625
59630A435625J796J862J654J220K49j167k081k016j970k993m491n197n137n357
$$ 1435625 1437421 1439283 1440937 1442157 1442406 1441239 1439158 1437142 1435172 1432179 1427688 1422491 1417354 1411997
59616A411997o083o491o093n180m160l476l857n379o634o211m735m034m383m221
$$ 1411997 1405914 1399423 1393330 1388150 1383990 1380514 1376657 1371278 1364644 1358433 1353698 1349664 1345281 1341060
59602A341060k753j198r14j593j962j312J69J659K006P37q95r06J076L349M270
$$ 1341060 1338307 1337109 1336195 1334602 1332640 1331328 1331497 1333156 1335162 1335899 1335004 1334098 1335174 1338523 1342793
59587A342793L776K522P83j185k764l716m536n562o428o750o598o071n315n060
$$ 1342793 1346569 1349091 1349874 1348689 1345925 1342209 1337673 1332111 1325683 1318933 1312335 1306264 1300949 1295889
59573A295889o010p473p954p416p466q704r550q645o916o047o185o467o692o994
$$ 1295889 1289879 1282406 1274452 1267036 1259570 1250866 1241316 1232671 1225755 1219708 1213523 1207056 1200364 1193370
59559A193370o871o021n423o087p315p597o697n441m022k112l26J31o82j406j326
$$ 1193370 1186499 1180478 1175055 1168968 1161653 1154056 1147359 1141918 1137896 1135784 1135458 1135589 1134907 1133501 1132175
59544A132175j012r25p07k50j86p24r07J85J974K784J604p54k286j709J65J267
$$ 1132175 1131163 1130238 1129531 1129281 1129095 1128371 1127464 1127649 1129623 1132407 1134011 1133257 1130971 1129262 1129427 1130694
59528A130694O25p00j347j340j265p41P69K227J748p25l041l545k940k815l440
$$ 1130694 1131319 1130619 1129272 1127932 1126667 1125926 1126695 1128922 1130670 1129945 1126904 1123359 1120419 1117604 1114164
59513A114164l842l412k530j957k154l015l845l808k744j381n22k10J01P64J556
$$ 1114164 1110322 1106910 1104380 1102423 1100269 1097254 1093409 1089601 1086857 1085476 1084954 1084744 1084845 1085609 1087165
59498A087165J985J876J628J880K746L495L156J514m89j350j97K249M073M097
$$ 1087165 1089150 1091026 1092654 1094534 1097280 1100775 1103931 1105445 1104956 1103606 1103409 1105658 1109731 1113828
59484A113828L438M262O907R397J0363J1073J3371J6742J9078J9678J9483J8523
$$ 1113828 1117266 1121528 1128435 1137832 1148195 1159268 1172639 1189381 1208459 1228137 1247620 1266143
59472A266143J5353R672L669k17j642j545m19J376K674K505J612J626K864M056
$$ 1266143 1281496 1291168 1294837 1294620 1292978 1291433 1291014 1292390 1295064 1297569 1299181 1300807 1303671 1307727
59458A307727M156L210J506r16l517n140n312m999n427o673p969q906r570r836
$$ 1307727 1311883 1315093 1316599 1315683 1312166 1307026 1301714 1296715 1291288 1284615 1276646 1267740 1258170 1248334
59444A248334r428q694q517r161r793r517q409p138n924m493k814j367o55p30
$$ 1248334 1238906 1230212 1221695 1212534 1202741 1193224 1184815 1177677 1171753 1167260 1164446 1163079 1162424 1161694
59430A161694j195j362o43P85J914J935J212P52R47J588K849N154P882R321Q663
$$ 1161694 1160499 1159137 1158494 1159279 1161193 1163128 1164340 1165092 1166039 1167627 1170476 1175630 1183512 1192833 1201496
59415A201496P191O694P313P797P438O726O223N719M691L092J381P7o14q25o07
$$ 1201496 1208687 1215381 1222694 1230491 1237929 1244655 1250878 1256597 1261288 1264380 1265761 1265838 1265224 1264399 1263792
59400A263792L97K435M704N638M687L258L215M779O600P657Q209Q926R827J0332
$$ 1263792 1264189 1266624 1271328 1276966 1281653 1284911 1288126 1292905 1299505 1307162 1315371 1324297 1334124 1344456
59386A344456R973Q865P684P042O606N161J988k053n225o551o262n064l652k763
$$ 1344456 1354429 1363294 1370978 1378020 1384626 1389787 1391775 1389722 1384497 1377946 1371684 1366620 1362968 1360205
59372A360205k779l156k876j609OJ316K360L610N377P549R622J1085J2108J3561
$$ 1360205 1357426 1354270 1351394 1349785 1349791 1351107 1353467 1357077 1362454 1370003 1379625 1390710 1402818 1416379
59358A416379J5819J8070J9508K0823K3446K7408L1196L3860L5885L7385L6644
$$ 1416379 1432198 1450268 1469776 1490599 1514045 1541453 1572649 1606509 1642394 1679779 1716423
59347A716423L1584K2281J1308J821m128o065m794j758J908N782R551J2283J2631
$$ 1716423 1748007 1770288 1781596 1783417 1779289 1773224 1768430 1766672 1768580 1774362 1783913 1796196 1808827
59334A808827R640L274n418j4303k0897k3877k3905k2603k0853j8488j5374j2130
$$ 1808827 1818467 1821741 1816323 1802020 1781123 1757246 1733341 1710738 1689885 1671397 1656023 1643893
59322A643893r630q307q067q566r389j0198j0835j1127j0649r035o563m169k583
$$ 1643893 1634263 1625956 1617889 1609323 1599934 1589736 1578901 1567774 1557125 1548090 1541527 1537358 1534775
59309A534775j775j355j168j056m42J198L306M351L500J870J561L448O303Q228
$$ 1534775 1533000 1531645 1530477 1529421 1528979 1530177 1533483 1537834 1541334 1543204 1544765 1548213 1554516 1562744
59295A562744Q617Q527R279J1016J2648J3129J2598J2274J3181J5236J7511J9152
$$ 1562744 1571361 1579888 1589167 1600183 1612831 1625960 1638558 1650832 1664013 1679249 1696760 1715912
59283A715912J9864J9734J9029J8082J7080J5839J3960J1223P774M087Q32j498
$$ 1715912 1735776 1755510 1774539 1792621 1809701 1825540 1839500 1850723 1858497 1862584 1863416 1861918
59271A861918l124m878p172r390j0817j1860j3680j6577j9496k1272k1792k1760
$$ 1861918 1858794 1853916 1846744 1837354 1826537 1814677 1800997 1784420 1764924 1743652 1721860 1700100
59259A700100k1777k1885k1726k1096k0409k0317k0544j9789j7523j5171j4364
$$ 1700100 1678323 1656438 1634712 1613616 1593207 1572890 1552346 1532557 1515034 1499863 1485499
59248A485499j4492j3579j1340r462q660p570n421l690l634l750j668K488O509
$$ 1485499 1471007 1457428 1446088 1436626 1427966 1420396 1414975 1411285 1407651 1403901 1402233 1404721 1411230
59235A411230R188J1063J2335J1976R270M847k43n463j0357j3984j5347j4224
$$ 1411230 1420418 1431481 1443816 1455792 1465062 1469909 1469666 1464203 1453846 1439862 1424515 1410291
59223A410291j1605r354q781r120q145m981j424N78J777M383Q568J2099J3490
$$ 1410291 1398686 1389332 1380551 1371431 1363286 1358305 1356881 1357459 1359236 1363619 1372187 1384286 1397776
59210A397776J3795J4716J6341J7502J7395J6112J4183J2136J0184Q195O294N183
$$ 1397776 1411571 1426287 1442628 1460130 1477525 1493637 1507820 1519956 1530140 1538335 1544629 1549812
59198A549812N171N175L645M73k906n120n664m485k192n26j023k808l344j780
$$ 1549812 1554983 1560158 1563803 1564276 1561370 1556250 1550586 1546101 1543909 1543383 1542360 1539552 1536208 1534428
59184A534428l3K35J9J187L567N366N662M943L714K096O43L8j22j126l323n448
$$ 1534428 1534395 1534630 1534649 1535836 1539403 1544769 1550431 1555374 1559088 1561184 1561827 1561865 1561743 1560617 1557294 1551846
59168A551846o175n613m815m507m891o237q748j1879j4389j5349j4825j3417j1627
$$ 1551846 1545671 1540058 1535243 1530736 1525845 1519608 1510860 1498981 1484592 1469243 1454418 1441001 1429374
59155A429374r945r069r383j0346j1015j1125j1043j0705r540p588n746m400k730
$$ 1429374 1419429 1410360 1400977 1390631 1379616 1368491 1357448 1346743 1337203 1329615 1323869 1319469 1316739
59142A316739j80K209K929J991Q60O50J296K253L135L740M098M470M823M661L910
$$ 1316739 1316559 1318768 1321697 1323688 1324548 1325198 1326494 1328747 1331882 1335622 1339720 1344190 1349013 1353674 1357584
59127A357584L436L909M703M800M283L826L284K026N02L4J025K453L255L108J942
$$ 1357584 1361020 1364929 1369632 1374432 1378715 1382541 1385825 1387851 1388353 1388387 1389412 1391865 1395120 1398228 1400170
59112A400170n3j906k600k525l001m205m884m405l685l559l534k890k000j657
$$ 1400170 1400117 1398211 1395611 1393086 1390085 1385880 1380996 1376591 1372906 1369347 1365813 1362923 1360923 1359266
59098A359266j958k511l129l792m490n530p263r170j0117r951r941j0972j2134
$$ 1359266 1357308 1354797 1351668 1347876 1343386 1337856 1330593 1321423 1311306 1301355 1291414 1280442 1268308
59085A268308j1979j0574r426r585j0589j1191j0761r785r059q541p413n477l824
$$ 1268308 1256329 1245755 1236329 1226744 1216155 1204964 1194203 1184418 1175359 1166818 1159405 1153928 1150104
59072A150104l362l357k510j058m03p30n24J311M122O685Q415R155R025Q939J0018
$$ 1150104 1146742 1143385 1140875 1139817 1139414 1138684 1138160 1139471 1143593 1150278 1158693 1167848 1176873 1185812 1195830
59057A195830J1966J3199J3096J2775J3052J3118J2191J1132J1132J1849J2166
$$ 1195830 1207796 1220995 1234091 1246866 1259918 1273036 1285227 1296359 1307491 1319340 1331506
59046A331506J1938J1690J1203R908Q305P522P469O712M491J903M48J30k68j248
$$ 1331506 1343444 1355134 1366337 1376245 1384550 1392072 1399541 1406253 1410744 1412647 1413095 1413225 1412957 1411709
59032A411709j750p21J099J880J075j15r18k253m817p247p752o760o195o749p668
$$ 1411709 1409959 1409238 1410337 1412217 1413292 1413177 1412259 1410006 1405189 1397942 1390190 1383430 1377235 1370486 1362818
59017A362818q771j0515j2179j2260j0891r836r725r336q169p460p862q152p262
$$ 1362818 1354047 1343532 1331353 1319093 1308202 1298366 1288641 1279305 1271136 1263676 1255814 1247662 1240400
59004A240400n742m331k893j832k497m921o907o845n851n733o340o346n331l702
$$ 1240400 1234658 1230327 1227434 1225602 1223105 1218184 1211277 1204432 1198581 1192848 1186508 1180162 1174831 1171129
58990A171129j796k17K24p5M02J890K790K457K367L205L196J198q79q92L43J037
$$ 1171129 1169333 1169116 1169340 1169265 1169667 1171557 1174347 1176804 1179171 1182376 1185572 1186770 1185891 1184999 1185342 1186379
58974A186379J585L080M651N101N565P356Q874Q098O843Q560J2632J4958J4159
$$ 1186379 1187964 1191044 1195695 1200796 1206361 1213717 1222591 1230689 1237532 1246092 1258724 1273682 1287841
58961A287841J3253J4585J6820J7938J7997J7536J6100J3663J1353R523P132L939
$$ 1287841 1301094 1315679 1332499 1350437 1368434 1385970 1402070 1415733 1427086 1436609 1443741 1447680
58949A447680J243l28j617k702k211Q8K220K853L048L872M375L640K854L350M094
$$ 1447680 1448923 1448595 1446978 1444276 1442065 1442153 1444373 1447226 1450274 1454146 1458521 1462161 1465015 1468365 1472459
58934A472459L298J465P31J709K762K242R1k555m257l969j861O18K048K224J676
$$ 1472459 1475757 1477222 1477953 1479662 1482424 1484666 1484757 1482202 1477945 1473976 1472115 1472733 1474781 1477005 1478681
58919A478681Q25K00Q03L208O533R141J0301J0755J1693J3394J4869J4909J3665
$$ 1478681 1479506 1479706 1480509 1483717 1490250 1499391 1509692 1520447 1532140 1545534 1560403 1575312 1588977
58906A588977J2789J3424J4579J4516J3229J2129J1508J0081P399M700K663M3
$$ 1588977 1601766 1615190 1629769 1644285 1657514 1669643 1681151 1691232 1698631 1703331 1705994 1706037
58894A706037m048q054r894j0059j1014j3764j6685j7890j7358j6302j5445j4756
$$ 1706037 1701989 1693935 1684041 1673982 1662968 1649204 1632519 1614629 1597271 1580969 1565524 1550768
58882A550768j4234j4067j3956j3016j0897q662p757q144q223o957n171m187m073
$$ 1550768 1536534 1522467 1508511 1495495 1484598 1475936 1468179 1460035 1451812 1444855 1439684 1435497 1431424
58869A431424m171m377m638l943j605Q82J156q29k732l214l351l988l797j439
$$ 1431424 1427253 1422876 1418238 1414295 1412690 1413572 1414728 1413899 1411167 1407953 1404602 1400614 1396817 1395378
58855A395378J747L039J695l92j083J70K637N283P228Q096Q324Q770R839J1124
$$ 1395378 1397125 1400164 1401859 1401467 1400384 1400554 1403191 1408474 1415702 1423798 1432122 1440892 1450731 1461855
58841A461855J1985J2455J3459J5801J8895K0971K0999J9869J9086J8876J8589
$$ 1461855 1473840 1486295 1499754 1515555 1534450 1555421 1576420 1596289 1615375 1634251 1652840
58830A652840J8455J9565K2037K4493K5685K5574K4565K2772K0573J8857J8080
$$ 1652840 1671295 1690860 1712897 1737390 1763075 1788649 1813214 1835986 1856559 1875416 1893496
58819A893496J7592J6413J4042J0488O244K525N21l6q21k985n937q326r525r751
$$ 1893496 1911088 1927501 1941543 1952031 1958275 1960800 1961321 1961285 1960464 1957479 1951542 1943216 1933691 1923940
58805A923940r538r587j0498j2194j3914j5002j5294j4856j4166j4422j6515j9396
$$ 1923940 1914402 1904815 1894317 1882123 1868209 1853207 1837913 1823057 1808891 1794469 1777954 1758558
58793A758558k0641j9184j6632j5370j6182j8101j9670j9792j8270j6283j5575
$$ 1758558 1737917 1718733 1702101 1686731 1670549 1652448 1632778 1612986 1594716 1578433 1562858
58782A562858j6537j7760j7939j7316j6685j5917j4565j3101j2476j2765j3187
$$ 1562858 1546321 1528561 1510622 1493306 1476621 1460704 1446139 1433038 1420562 1407797 1394610
58771A394610j3206j2787j1786r984p759n975n129m961m918m542l513j826p5Q99
$$ 1394610 1381404 1368617 1356831 1346847 1339088 1333113 1327984 1323023 1318105 1313563 1310050 1308224 1308149 1309048
58757A309048Q90O77J250K670L980M278L685K957K433J870J167M91l19j625l084
$$ 1309048 1309938 1310615 1311865 1314535 1318515 1322793 1326478 1329435 1331868 1333738 1334905 1335396 1335077 1333452 1330368
58742A330368l784l704m000n219o331o349n863n954o660p596q963j0422j0209
$$ 1330368 1326584 1322880 1318880 1313661 1307330 1300981 1295118 1289164 1282504 1274908 1265945 1255523 1245314
58729A245314p280l578j933k305k287j047j87n18n66Q55K690L382K958K362J999
$$ 1245314 1238034 1234456 1232523 1230218 1227931 1226884 1226697 1226179 1225613 1226468 1229158 1232540 1235498 1237860 1239859
58714A239859J870J959J830Q57p33k111l326n080o875p230o286o261q272j0445
$$ 1239859 1241729 1243688 1245518 1246375 1245642 1243531 1240205 1235125 1228250 1221020 1214734 1208473 1200201 1189756
58700A189756j0372q095n368l233j752j044j102j197o82O7M16O59J490K742L416
$$ 1189756 1179384 1171289 1165921 1162688 1160936 1159892 1158790 1157593 1156911 1156978 1157394 1158053 1159543 1162285 1165701
58685A165701K836J330R4M72K841O054Q539R805J0158R464P562N698N790P973
$$ 1165701 1168537 1169867 1169961 1170433 1173274 1179328 1187867 1197672 1207830 1217294 1224856 1230554 1236344 1244317
58671A244317J0415J1825J2515J2684J1579R192P035O177O004N860O369Q040R855
$$ 1244317 1254732 1266557 1279072 1291756 1303335 1312527 1319562 1325739 1331743 1337603 1343972 1352012 1361867
58658A361867J0569J0448J0592J1355J2225J2581J1989J0544R163Q545P767N326
$$ 1361867 1372436 1382884 1393476 1404831 1417056 1429637 1441626 1452170 1461333 1469878 1477645 1482971
58646A482971J572j618l782o343r798j2833j4973j7612k1137k3671k4243k4713
$$ 1482971 1484543 1482925 1479143 1472800 1463002 1450169 1435196 1417584 1396447 1372776 1348533 1323820
58634A323820k6515k7763k6075k2431j9559j7954j6278j4670j4594j5757j5883
$$ 1323820 1297305 1269542 1243467 1221036 1201477 1183523 1167245 1152575 1137981 1122224 1106341
58623A106341j3921j1352r964r801r738q869p147n264m019l416k900k569l121
$$ 1106341 1092420 1081068 1071104 1061303 1051565 1042696 1035549 1030285 1026266 1022850 1019950 1017381 1014260
58610A014260m092l685j232J519K715K810L374M762O204P146P251O133M279L081
$$ 1014260 1010168 1006483 1005251 1006770 1009485 1012295 1015669 1020431 1026635 1033781 1041032 1047165 1051444 1054525
58596A054525K911K452R46m98j061j778l378m488m030l553m809o577o467m708
$$ 1054525 1057436 1059888 1060834 1060336 1059275 1057497 1054119 1049631 1045601 1042048 1037239 1030662 1024195 1019487
58582A019487l463l271k960k420k745l740l870k812j901j849j904j508j119j127
$$ 1019487 1016024 1012753 1009793 1007373 1004628 1000888 997018 994206 992305 990456 988552 987044 985925 984798
58568I84798j181p11O21K582L898L202J244O88K363L669K504Q30J784M838O864
$$ 984798 983617 982906 983527 986109 990007 993209 994453 995141 997504 1001173 1003677 1004507 1006291 1011129 1017993
58553A017993O907O697O991O652N355M400M523N166N959O735O473M561K779L401
$$ 1017993 1024900 1031597 1038588 1045240 1050595 1054995 1059518 1064684 1070643 1077378 1083851 1088412 1091191 1094592
58539A094592N555O217M676L105K650K082R25P08K054L288L264L273M757P181
$$ 1094592 1100147 1106364 1111040 1114145 1116795 1118877 1119802 1120510 1122564 1125852 1129116 1132389 1137146 1144327
58525A144327R352J1035J2171J2351J2195J3349J5896J7489J6511J4475J3790
$$ 1144327 1153679 1164714 1176885 1189236 1201431 1214780 1230676 1248165 1264676 1279151 1292941
58514A292941J4510J4991J4792J5096J6590J8426J9503J9937K0939K3509K7303
$$ 1292941 1307451 1322442 1337234 1352330 1368920 1387346 1406849 1426786 1447725 1471234 1498537
58503A498537L0877L3208L4690L6249L7939L9032L9024L7725L4765K9948K3921
$$ 1498537 1529414 1562622 1597312 1633561 1671500 1710532 1749556 1787281 1822046 1851994 1875915
58492A875915J7677J1705O262J937r64l075n165p137q620r727j0561j0964j1630
$$ 1875915 1893592 1905297 1911559 1913496 1912532 1909457 1904292 1897155 1888535 1878808 1868247 1857283 1845653
58479A845653j4073j8354k2297k4399k5843k8022k9796k9597k8458k8201k7920
$$ 1845653 1831580 1813226 1790929 1766530 1740687 1712665 1682869 1653272 1624814 1596613 1568693
58468A568693k5525k1862j9912k0259k0632j9835j8898j8159j6504j4057j2616
$$ 1568693 1543168 1521306 1501394 1481135 1460503 1440668 1421770 1403611 1387107 1373050 1360434
58457A360434j2570j2155j0558r164q835q512p556o999p306p155n736m273l927
$$ 1360434 1347864 1335709 1325151 1315987 1307152 1298640 1291084 1284085 1276779 1269624 1263888 1259615 1255688
58444A255688l987l388k395j638q75O9M72j23r39r69j52J001K029K548K602L083
$$ 1255688 1251701 1248313 1245918 1244280 1243405 1243474 1243946 1243823 1242884 1241915 1241763 1242764 1244793 1247341 1249943 1253026
58428A253026M762P037Q812J0189J1800J3055J2988J2489J3451J5781J7557J8215
$$ 1253026 1257788 1264825 1273637 1283826 1295626 1308681 1321669 1334158 1347609 1363390 1380947 1399162
58416A399162J9129K0664K1220J9864J7664J5500J2655Q683M820K355R71l33j830
$$ 1399162 1418291 1438955 1460175 1480039 1497703 1513203 1525858 1534541 1539361 1541716 1542687 1542354 1540524
58403A540524l190m009l819k601j331q86n12J237M259P086Q983J0324J1139J1099
$$ 1540524 1537334 1533325 1529506 1526905 1525574 1524688 1524176 1525413 1529672 1536758 1545741 1556065 1567204 1578303
58389A578303J0593J0073Q759N770J997j122l974p632j1130j2525j2139j1947
$$ 1578303 1588896 1598969 1607728 1613498 1615495 1614373 1610399 1602767 1591637 1579112 1566973 1555026
58377A555026j2159j1276r335q019p637o961o022o006o318m921j843P98K438M514
$$ 1555026 1542867 1531591 1522256 1514237 1506600 1499639 1493617 1487611 1481293 1476372 1474529 1475327 1477765 1482279
58363A482279P114Q586Q844R465R985P834K925j313k686k761l446m374n012o193
$$ 1482279 1489393 1497979 1506823 1516288 1526273 1534107 1537032 1535719 1533033 1530272 1526826 1522452 1517440 1511247
58349A511247q006q987q785q921r787r620p651n466m214l190k086j776j989j181
$$ 1511247 1503241 1494254 1485469 1476548 1466761 1457141 1449490 1444024 1439810 1436620 1434534 1432758 1430769 1429588
58335A429588M39R06K76R77L326M387K729Q21J070K644L946N081O203O326N422
$$ 1429588 1430027 1430933 1431209 1432186 1435512 1439899 1442628 1443449 1444519 1447163 1451109 1456190 1462393 1468719 1474141
58320A474141N097N950O840P533R042J0770J0763R422R347J0799J1381J0913J2037
$$ 1474141 1479238 1485188 1492028 1499561 1508603 1519373 1530136 1539558 1548905 1559704 1571085 1581998 1594035
58307A594035J4955J6478J5822J6223J8876K0464J9259J8569K0921K3553K3196
$$ 1594035 1608990 1625468 1641290 1657513 1676389 1696853 1716112 1734681 1755602 1779155 1802351
58296A802351K1099J9773J8665J6629J5132J5359J5356J3364J1030J0351J0481
$$ 1802351 1823450 1843223 1861888 1878517 1893649 1909008 1924364 1937728 1948758 1959109 1969590
58285A969590J0255J0775J2753J4567J5370J6690J8725J8965J6902J5947J7982
$$ 1969590 1979845 1990620 2003373 2017940 2033310 2050000 2068725 2087690 2104592 2120539 2138521
58274B138521K0384K1139K2256K4844K5874K3659K1877K3793K6679K6493K4213
$$ 2138521 2158905 2180044 2202300 2227144 2253018 2276677 2298554 2322347 2349026 2375519 2399732
58263B399732K3048K2860K1804K0356J9713J9120J8263J8934K1188K1788J9780
$$ 2399732 2422780 2445640 2467444 2487800 2507513 2526633 2544896 2563830 2585018 2606806 2626586
58252B626586J9157K2374K5920K6414K6133K7953K9675K8613K7278K9113L2618
$$ 2626586 2645743 2668117 2694037 2720451 2746584 2774537 2804212 2832825 2860103 2889216 2921834
58241B921834L4917L7134M0832M3171M1378L8536L9348M3208M6468M8341M9902
$$ 2921834 2956751 2993885 3034717 3077888 3119266 3157802 3197150 3240358 3286826 3335167 3385069
58230C385069N0728N1028N3335N7903O0703O0132O0660O5328P0447P2721P5385
$$ 3385069 3435797 3486825 3540160 3598063 3658766 3718898 3779558 3844886 3915333 3988054 4063439
58219D063439Q1360Q6817Q8331R0011R6064J02314J03237J01821J04062J08958
$$ 4063439 4144799 4231616 4319947 4409958 4506022 4608336 4711573 4813394 4917456 5026414
58209E026414J12633J17114J25826J35073J39472J41695J47612J55836J61582
$$ 5026414 5139047 5256161 5381987 5517060 5656532 5798227 5945839 6101675 6263257
58200F263257J66823J76804J89826K00133K07894K17143K27201K35259K44041
$$ 6263257 6430080 6606884 6796710 6996843 7204737 7421880 7649081 7884340 8128381
58191H128381K57524K72506K83658K93231L06568L22089L35390L48925L67654
$$ 8128381 8385905 8658411 8942069 9235300 9541868 9863957 10199347 10548272 10915926
58182A0915926L89370M09427M30425M56797M84871N09216N33746N65158O00766
$$ 10915926 11305296 11714723 12145148 12601945 13086816 13596032 14129778 14694936 15295702
58173A5295702O34591O69712P12083P58093Q01379Q45806Q97892R52834J002887
$$ 15295702 15930293 16600005 17312088 18070181 18871560 19717366 20615258 21568092 22570979
58164B2570979J053256J114324J184766J258247J339655J437187J545407J654508
$$ 22570979 23624235 24738559 25923325 27181572 28521227 29958414 31503821 33158329
58156C3158329J769680J903047K054537K220453K411580K640343K898679L171682
$$ 33158329 34928009 36831056 38885593 41106046 43517626 46157969 49056648 52228330
58148E2228330L463426L785024M129812M490181M888211N358610N913114O555191
$$ 52228330 55691756 59476780 63606592 68096773 72984984 78343594 84256708 90811899
58140I0811899P316774Q243852R360175J0681158J2236258J4028352J6005439
$$ 90811899 98128673 106372525 115732700 126413858 138650116 152678468 168683907
58133A68683907J8137005K0468731K2996924K5530581K7815106K9723877L1030881
$$ 168683907 186820912 207289643 230286567 255817148 283632254 313356131 344387012
58126C44387012L0893222K7917470K1208049J1456354Q02391q482885j5179863
$$ 344387012 375280234 403197704 424405753 435862107 436664498 428181613 413001750
58119D13001750j9230330k1140194k1513683k0944938j9971456j8960934j8074432
$$ 413001750 393771420 372631226 351117543 330172605 310201149 291240215 273165783
58112B73165783j7345923j6751992j6228543j5703127j5140320j4532890j3861581
$$ 273165783 255819860 239067868 222839325 207136198 191995878 177462988 163601407
58105A63601407j3104283j2277955j1431094j0594547r770086q962307q188744
$$ 163601407 150497124 138219169 126788075 116193528 106423442 97461135 89272391
58098H9272391p458544o769312o125877n538990n006607m517955m073780l682246
$$ 89272391 81813847 75044535 68918658 63379668 58373061 53855106 49781326 46099080
58090D6099080l338210l027059k745871k500584k285292k084900j896831j730551
$$ 46099080 42760870 39733811 36987940 34487356 32202064 30117164 28220333 26489782
58082B6489782j586477j454150j331154j225546j138325j060237r87644r26108
$$ 26489782 24903305 23449155 22118001 20892455 19754130 18693893 17706249 16780141
58074A6780141q76375q31054p87046p47949p12400o72826o27889n84604n46217
$$ 16780141 15903766 15072712 14285666 13537717 12825317 12152491 11524602 10939998 10393781
58065A0393781n08872m71647m39193m12359l86204l59177l35398l16338k98711
$$ 10393781 9884909 9413262 8974069 8561710 8175506 7816329 7480931 7164593 6865882
58056F865882k81534k67270k55301k42191k28692k18848k12209k04542j95846
$$ 6865882 6584348 6317078 6061777 5819586 5590894 5372046 5159837 4955295 4759449
58047D759449j89659j84967j77080j66358j57814j51908j44073j33600j24970
$$ 4759449 4569790 4384823 4207743 4041385 3883571 3731663 3587590 3453990 3329020
58038C329020j19502j13490j05490r8151r2022q4623p6519p1289o8631o4158n6985
$$ 3329020 3209518 3096028 2990538 2892387 2800365 2715742 2639223 2567934 2499303 2435145 2378160
58027B378160n0960m7648m4556m1075l9705m0346l9662l7177l6041l6737l6045
$$ 2378160 2327200 2279552 2234996 2193921 2154216 2113870 2074208 2037031 2000990 1964253 1928208
58016A928208l3236l1555l2249l2710l1731l1328l2181l2418l1791l2109l2703
$$ 1928208 1894972 1863417 1831168 1798458 1766727 1735399 1703218 1670800 1639009 1606900 1574197
58005A574197l0659k6436k3934k4010k3074j9584j6856j7655k0314k2026k2259
$$ 1574197 1543538 1517102 1493168 1469158 1446084 1426500 1409644 1391989 1371675 1349649 1327390
57994A327390k1567k0296j9375j9426j8933j6441j3941j4309j6162j5689j2947
$$ 1327390 1305823 1285527 1266152 1246726 1227793 1211352 1197411 1183102 1166940 1151251 1138304
57983A138304j1477j1978j1607r676q781r601r757q734r106j1591j3392j2750
$$ 1138304 1126827 1114849 1103242 1093566 1084785 1075184 1065427 1056693 1047587 1035996 1022604 1009854
57971A009854j1164j0074r226r076j0799j3172j3417j1877j1764j3718j4763j3463
$$ 1009854 998690 988616 979390 970314 959515 946343 932926 921049 909285 895567 880804 867341
57959H67341j1838j1163j0038p886o456o517o556n803n208m754l279j577j891
$$ 867341 855503 844340 834302 826416 819960 813443 806887 801084 795876 791122 787843 786266 784375
57946G84375l742m011j906m3J30M0L80j55j533j634r3Q12K26N0J160J844J156
$$ 784375 780633 776622 774716 774673 774803 774843 775223 775068 773535 771901 771808 772620 772846 772896 774056 775900 777056
57929G77056L49j04j445l608m615m031l628l848l116j477j252l044m637m874n060
$$ 777056 777405 777301 775856 772248 767633 763602 759974 756126 753010 751533 750281 747237 742600 737726 732666
57914G32666n701n557m805n298o624n877k525M13J197J412J897R07j891l716k985
$$ 732666 726965 721408 716603 711305 704681 698804 696279 696692 697889 699301 701198 702105 700214 696498 693513
57899F93513j778k083l071l752m730n648m640k136j348l131m285k949j611k340
$$ 693513 691735 689652 686581 682829 678099 672451 667811 665675 664327 661196 656911 653962 652351 650011
57885F50011l172k040m25q5K23J660K417J233M72K171M134L685K530L878O858
$$ 650011 646839 644799 644374 644289 644512 646172 648589 649822 650294 652465 656599 660284 662814 666692 673550
57870F73550P887O037L371J185p38k080k287k171k716l141k369j351j741l301
$$ 673550 681437 687474 690845 692030 691292 689212 686925 684754 682038 678897 676528 675177 673436 670135
57856F70135m678n621o525o886o168n170m897n089n177n297n140l636j072L66
$$ 670135 665457 659836 653311 646425 640257 635087 630190 625101 619924 614627 609487 605851 604779 605145
57842F05145k57j111p45l51j006j180M55J947P32k283m011l374j688m1J303J939
$$ 605145 604888 603777 603032 602681 601675 600495 600950 602897 603629 601346 597335 593961 592273 592232 593535 595474
57826E95474J926K473M201N807O140O091O687O902N503L467K427K079J415J034
$$ 595474 597400 599873 604074 609881 616021 622112 628799 635701 641204 644671 647098 649177 650592 651626
57812F51626J792K511J643J72J95J430J649J25j733k863l548m063m152l770l055
$$ 651626 653418 655929 657572 657744 657939 659369 661018 661143 659410 656547 652999 648936 644784 641014 637959
57797F37959j786L0J729K955M083M871M159K049O25J085J887J389M71N97J072
$$ 637959 636173 636203 637932 640887 644970 649841 654000 656049 656674 657759 659646 661035 661506 662103 663175
57782F63175N46k60O4Q42M34q09j220o83m40o44l47N55J333J872K326K106R68
$$ 663175 663721 663461 663525 664367 664801 663992 662772 662089 661649 661005 660658 661213 662546 664418 666744 668850 669818
57765F69818K15Q59J577N41j631k950l138l335l570l047k430l242n213o431o181
$$ 669818 670033 670892 672469 673010 671379 668429 665291 661956 658386 655339 652909 649667 644454 638023 631842
57750F31842n536n323n442o048p440q824q901p725o527o098o623q373j0796j1826
$$ 631842 626306 620983 615541 609493 602053 593229 584328 576603 570076 563978 557355 548982 538186 526360
57736E26360j0147p517o662p437p347n383l024j612j119j441k530l147j733J139
$$ 526360 516213 508696 502034 494597 487250 481867 478843 477231 476112 474671 472141 468994 467261 468400
57722D68400L165L345K792K409J868J220J354K334L116L445M283N755O342M915
$$ 468400 471565 474910 477702 480111 481979 483199 484553 486887 490003 493448 497731 503486 509828 514743
57708E14743K325L24J1J494L860N146L813O83j677j798m80R32K086L105L843M306
$$ 514743 517068 517392 517403 518897 522757 527903 531716 532399 530722 528924 528444 529376 531462 534567 538410 542716
57692E42716M872N622O047N663M481K978K083K710M548N896N548M100K544O45
$$ 542716 547588 553210 559257 564920 569401 572379 574462 577172 581720 587616 593164 597264 599808 600453
57678F00453j828l511l125j855j829k703k333n84L04n29j154j10J359J568Q32
$$ 600453 598625 595114 591989 590134 588305 585602 583269 582685 582989 582460 581306 581196 582555 584123 584955
57663E84955K47k10p11k18J981M263M071J146k137l675l640l380l364k963j767
$$ 584955 585202 584992 584281 584063 586044 590307 594378 595524 593387 589712 586072 582692 579328 576365 574598
57648E74598k67Q69J625K175K126J055k78m60N79J158R2j688k480j889p48J05
$$ 574598 574331 575200 576825 579000 581126 582181 581903 581443 582022 583180 583272 581584 579104 577215 576467 576572
57632E76572J88o22j505j185J42M73j289l485l988l105k441k097r42J030K731
$$ 576572 576760 576138 574633 573448 573590 574063 572774 569289 565301 562196 559755 557658 556716 557746 560477
57617E60477L899N180O663Q128J0201J3432J6763J8932K0849K4411K9341L3371
$$ 560477 564376 569556 576219 584347 594548 607980 624743 643675 664524 688935 718276 751647
57605G51647L5145L4402K9612J8733L175j1690k1338k5620k6854k6548k5216k3532
$$ 751647 786792 821194 850806 869539 872714 861024 839686 814066 787212 760664 735448 711916
57593G11916k2076k0772j9554j8759j8410j8006j7307j6277j4419j1567r168q912
$$ 711916 689840 669068 649514 630755 612345 594339 577032 560755 546336 534769 525601 516689
57581E16689r967r663p250m768l744l290k444j912k128j711K61K109J673o09k546
$$ 516689 506722 497059 489809 485041 481297 478007 475563 473651 471523 469812 470073 472182 473855 473246 470700
57566D70700l190l344l705m119m322m158l315j869p54q48j877k795k895k150j101
$$ 470700 467510 464166 460461 456342 452020 447862 444547 442678 441924 441076 439199 436404 433509 431359 430258
57551D30258q76k354m798o123n218l164j553o73j71m29j895l703m193k793n15
$$ 430258 429382 427028 422230 416107 410889 407725 406172 405499 405328 404899 403004 399301 395108 392315 391800
57536C91800J147J248k54k464m044m384m085m030m356m613m449l774k718j794
$$ 391800 392947 394195 393941 391477 387433 383049 378964 374934 370578 365965 361516 357742 355024 353230
57522C53230j581j901j794p20O92J384R67k24j572k415k312j436m70%k63j209
$$ 353230 351649 349748 347954 347234 347926 349310 350277 350053 348481 346066 343754 342318 341848 341848 341585 340376
57506C40376k319k666j926j036j075j760k026j653j151m35Q85K100J989R27O38
$$ 340376 338057 335391 333465 332429 331354 329594 327568 325915 324764 324329 325214 327314 329303 330230 330868
57491C30868J611K530K623K757L447L678K623R56n38k062l519l717k169k63P27
$$ 330868 332479 335009 337632 340389 343836 347514 350137 351093 350555 348493 344974 341257 339088 338825 339552
57476C39552J423K703L660L074J778J615K623L229K876K536K633K277R79l15o15
$$ 339552 340975 343678 347338 350412 352190 353805 356428 359657 362533 365069 367702 369979 370958 370643 370028
57461C70028l09m86j348j945j464l54O0r02k530l768m476m970m944m164l777n156
$$ 370028 369719 369233 367885 365940 364476 364122 364182 363280 360750 356982 352506 347536 342592 338428 334651 329495
57445C29495p236p055l720j3J167L84J98J530L217M151M074K860Q39o20l67Q91
$$ 329495 322259 315204 311484 311471 312638 313022 313220 314750 317967 322118 326192 329052 329891 329271 328904 329795
57429C29795J664J928K804M206M597L229J190j43m17J78J456K695K702J130p64
$$ 329795 331459 333387 336191 340397 344994 348223 349413 349270 348853 349031 350487 353182 355884 357014 356250
57414C56250j362l38J223K037J798J326J709L139M640N065M236K918K099K447
$$ 356250 354888 354550 355773 357810 359608 360934 362643 365782 370422 375487 379723 382641 384740 387187
57400C87187L913N322M988K545j07n25J603M141M928L867K525K243K972L728L816
$$ 387187 391100 396422 401410 403955 403848 403323 404926 409067 413995 417862 420387 422630 425602 429330 433146
57385D33146L396K910K387J710J266J650K764L809M262M160L503K350J518K077
$$ 433146 436542 439452 441839 443549 444815 446465 449229 453038 457300 461460 464963 467313 468831 470908
57371D70908L684M644M159L412L737M784N521N986O839P874Q194P524O381N226
$$ 470908 474592 479236 483395 486807 490544 495328 500849 506835 513674 521548 529742 537266 543647 548873
57357E48873M259L631L162K473J968K848N198P098O905N656N649P177Q317P753
$$ 548873 553132 556763 559925 562398 564366 567214 572412 579510 586415 592071 597720 604897 613214 620967
57343F20967O216N040M883N971Q143J0116J0081P829N344M643N703P080P864Q251
$$ 620967 627183 632223 637106 643077 651220 661336 671417 679246 684590 689233 694936 702016 709880 718131
57329G18131Q732R507J0655J2244J3999J5076J4543J2394J0074R444J0982J3344
$$ 718131 726863 736370 747025 759269 773268 788344 802887 815281 825355 834799 845781 859125
57317H59125J4862J5103J4699J4274J4051J3978J3618J2416J0730J0068J1524
$$ 859125 873987 889090 903789 918063 932114 946092 959710 972126 982856 992924 1004448
57306A004448J4248J6329J6983J7072J7681J8934K0239K0988K0970K0514K0174
$$ 1004448 1018696 1035025 1052008 1069080 1086761 1105695 1125934 1146922 1167892 1188406 1208580
57295A208580J9992J9405J8207J7172J7192J8217J9574K0749K1303K0734J9277
$$ 1208580 1228572 1247977 1266184 1283356 1300548 1318765 1338339 1359088 1380391 1401125 1420402
57284A420402J8312J8950K0643K2056K2710K2746K1842J9824J8012J8145J9970
$$ 1420402 1438714 1457664 1478307 1500363 1523073 1545819 1567661 1587485 1605497 1623642 1643612
57273A643612K1431K1542K1525K2582K4017K4443K3807K3162K3089K3282K3395
$$ 1643612 1665043 1686585 1708110 1730692 1754709 1779152 1802959 1826121 1849210 1872492 1895887
57262A895887K3567K4117K5161K6503K7747K8510K8563K7826K6570K5721K6229
$$ 1895887 1919454 1943571 1968732 1995235 2022982 2051492 2080055 2107881 2134451 2160172 2186401
57251B186401K7731K8614K8177K7933K9502L1918L2678L1370L0410L1757L4476
$$ 2186401 2214132 2242746 2270923 2298856 2328358 2360276 2392954 2424324 2454734 2486491 2520967
57240B520967L6484L7362L8209L9572M0883M1730M2582M3966M5558M6489M6471
$$ 2520967 2557451 2594813 2633022 2672594 2713477 2755207 2797789 2841755 2887313 2933802 2980273
57229B980273M6324M7100M8678M9723M9481M9090N0373N3575N7146N9666O1039
$$ 2980273 3026597 3073697 3122375 3172098 3221579 3270669 3321042 3374617 3431763 3491429 3552468
57218C552468O1789O2120O2063O1815O1583O1360O0952N9762N6918N2301M7295
$$ 3552468 3614257 3676377 3738440 3800255 3861838 3923198 3984150 4043912 4100830 4153131 4200426
57207D200426M3566M1154L8710L5580L2550L0483K9459K9473L0732L2927L5447
$$ 4200426 4243992 4285146 4323856 4359436 4391986 4422469 4451928 4481401 4512133 4545060 4580507
57196D580507L8818M4502N2579O0924O7648P3095P8253Q2374Q3826Q2645Q0615
$$ 4580507 4619325 4663827 4716406 4777330 4844978 4918073 4996326 5078700 5162526 5245171 5325786
57185E325786P8823P6419P1981O5129N6662M7765L9149L0550K1191J1057J422
$$ 5325786 5404609 5481028 5553009 5618138 5674800 5722565 5761714 5792264 5813455 5824512 5825934
57174E825934o373j2033j5739j7071j5569j1941p617k979L041J1426K1724L2308
$$ 5825934 5819561 5807528 5791789 5774718 5759149 5747208 5739591 5736612 5739653 5751079 5772803 5805111
57162E805111M1625M9242N5978O2841O9608P4943P8176Q0181Q1899Q2944Q2669
$$ 5805111 5846736 5895978 5951956 6014797 6084405 6159348 6237524 6317705 6399604 6482548 6565217
57151F565217Q1838Q1809Q2423Q2095Q0013P7082P4707P3596P3510P3168P0822
$$ 6565217 6647055 6728864 6811287 6893382 6973395 7050477 7125184 7198780 7272290 7345458 7416280
57140G416280O6317O2209O1257O3013O4683O5072O5416O6209O5927O3863O1633
$$ 7416280 7482597 7544806 7606063 7669076 7733759 7798831 7864247 7930456 7996383 8060246 8121879
57129H121879O0346N8441N4210M8578M3287L7996L1369K3740J6192Q048k065j3165
$$ 8121879 8182225 8240666 8294876 8343454 8386741 8424737 8456106 8479846 8496038 8504086 8502021 8488856
57117H488856k2484k9004l4062l8687m2593m5965m9830n4226n7947o0511o2479
$$ 8488856 8466372 8437368 8403306 8364619 8322026 8276061 8226231 8172005 8114058 8053547 7991068
57106G991068o3705o3388o2179o1980o2928o2829o0367n6786n3399m9532m4148
$$ 7991068 7927363 7863975 7801796 7739816 7676888 7614059 7553692 7496906 7443507 7393975 7349827
57095G349827l7687l0952k3898j6912j1699r531r956j2431j7751k6438l7107m7780
$$ 7349827 7312140 7281188 7257290 7240378 7228679 7219148 7209192 7196761 7179010 7152572 7115465 7067685
57083G067685n7709o6654p3820p8987q3624q9547r7370j07115j18954j32314j45716
$$ 7067685 7009976 6943322 6869502 6790515 6706891 6617344 6519974 6412859 6293905 6161591 6015875
57072F015875j58780j73039j89812k08785k29572k52869k78847l06267l34461
$$ 6015875 5857095 5684056 5494244 5285459 5055887 4803018 4524171 4217904 3883443
57063C883443l64461l97233m32786m71841n15690n63296E26585a33272p11512
$$ 3883443 3518982 3121749 2688963 2217122 1701432 1138136 526585 -133272 -844784
57054h44784p69206q32883r03393r83879j075075j173853j279575j397769j534872
$$ -844784 -1613990 -2446873 -3350266 -4334145 -5409220 -6583073 -7862648 -9260417 -10795289
57045a0795289j694289j880483k100593k357693k648833k974843l346232l775944
$$ -10795289 -12489578 -14370061 -16470654 -18828347 -21477180 -24452023 -27798255 -31574199
57037c1574199m275647m864844n572360o420847p421830q591869r950022j1481722
$$ -31574199 -35849846 -40714690 -46287050 -52707897 -60129727 -68721596 -78671618 -90153340
57029i0153340j3134122j4882275j6770959j8826626k0930959k2857304k4453662
$$ -90153340 -103287462 -118169737 -134940696 -153767322 -174698281 -197555585 -222009247
57022b22009247k5692663k6447291k6271467k4560369k1027410j6015359j0313811
$$ -222009247 -247701910 -274149201 -300420668 -324981037 -346008447 -362023806 -372337617
57015c72337617m678797N00455N182346R445681J3290357J6577820J9098665K0699515
$$ -372337617 -377016414 -376515959 -371333613 -361887932 -348597575 -332019755 -312921090 -292221575
57007b92221575K1379187K1286098K0630394J9595152J8313757J6902121J5486943
$$ -292221575 -270842388 -249556290 -228925896 -209330744 -191016987 -174114866 -158627923
57000a58627923J4191600J3092651J2190230J1422828J0715257J0019165R319169
$$ -158627923 -144436323 -131343672 -119153442 -107730614 -97015357 -86996192 -77677023
56993g7677023Q615499P909451P201214O492931N791825N112655M475840L899191
$$ -77677023 -69061524 -61152073 -53950859 -47457928 -41666103 -36553448 -32077608 -28178417
56985b8178417L390406K947856K566083K238314J956527J713404J504286J325643
$$ -28178417 -24788011 -21840155 -19274072 -17035758 -15079231 -13365827 -11861541 -10535898
56977a0535898J173140J043115R33901Q43150P65552O95841O32437N75623N23879
$$ -10535898 -9362758 -8319643 -7385742 -6542592 -5777040 -5081199 -4448762 -3873139 -3349260
56968c349260M75120M30289L92324L61789L36062L12534K90348K69119b33837
$$ -3349260 -2874140 -2443851 -2051527 -1689738 -1353676 -1041142 -750794 -481675 -233837
56958h683A91003J70517J38270J04992P2184M0301J0858j2892k8923l8475m3978
$$ -8683 191003 361520 499790 604782 676966 717267 728125 715233 686310 647835 603857
56947F03857m6680m7740m9524n3864o0483o8762p9083r0695F693i8590j06267
$$ 603857 557177 509437 459913 406049 345566 276804 197721 107026 6693 -98590 -204857
56936b04857j05035j01179r3713q4224p5365o7260n8106m7608l7257k7862j9146
$$ -204857 -309892 -411071 -504784 -589008 -664373 -731633 -789739 -837347 -874604 -902466 -921612
56925i21612j1357n125j56M023O636O797N444M389M222M769O608J0080J3707J5644
$$ -921612 -932969 -938094 -938250 -934227 -927591 -920794 -915350 -910961 -906739 -901970 -895362 -885282 -871575 -855931
56911h55931J6168J6823J7841J8299J8194J8535J9775K1690K4049K6102K6453
$$ -855931 -839763 -822940 -805099 -786800 -768606 -750071 -730296 -708606 -684557 -658455 -632002
56900f32002K4988K3722K4032K4406K2779J9589J6305J2546P369K219m47q46j373
$$ -632002 -607014 -583292 -559260 -534854 -512075 -492486 -476181 -463635 -456266 -454047 -454494 -455340 -456713
56887d56713k839l863l714l149k405p93J608L820N559P312R131J1034J3896J8109
$$ -456713 -459552 -463415 -467129 -470278 -472683 -473476 -471868 -468048 -462489 -455177 -446046 -435012 -421116 -403007
56873d03007K2152K4414K5409K5970K4485J8926J0851M253O90j478l384m398m722
$$ -403007 -380855 -356441 -331032 -305062 -280577 -261651 -250800 -246547 -245857 -247335 -250719 -255117 -259839
56860b59839n862p833q667p566o121n753o116o547o907o419m060o23J670K191
$$ -259839 -265701 -273534 -282201 -289767 -295888 -301641 -307757 -314304 -321211 -327630 -331690 -332313 -330643 -328452
56846c28452K466L462M534N391O811Q755J0014J0255J0420J0763J0748J1072J3166
$$ -328452 -325986 -322524 -317990 -312599 -305788 -297033 -287019 -276764 -266344 -255581 -244833 -233761 -220595
56833b20595J6260J7763J7271J7224J8656J9395J7915J6059J5811J6013J4580
$$ -220595 -204335 -186572 -169301 -152077 -133421 -114026 -96111 -80052 -64241 -48228 -33648
56822c3648J1981J0049b652E008O209N612O078O958P798Q119P287N891O079Q972
$$ -33648 -21667 -11618 -2652 5008 11217 16829 22907 29865 37663 45782 53069 58960 65039 74011
56808G4011J2766J4941J5603J7008K0287K4146K6720K7595K7909K8789K9546K7507
$$ 74011 86777 101718 117321 134329 154616 178762 205482 233077 260986 289775 319321 346828
56796C46828K0628J0376Q30n335q621j0330j0440q787o488m686l073r80J232L194
$$ 346828 367456 377832 378662 373327 364706 354376 343936 335149 328661 323975 320902 319922 321154 324348
56782C24348N850J0235J5737K0903K5310K9452L3472L7204M0719M3399M3033L7299
$$ 324348 330198 340433 356170 377073 402383 431835 465307 502511 543230 586629 629662 666961
56770F66961K6325J2860P7j0256j7830k3030k6205k7372k6726k5149k3470k1193
$$ 666961 693286 706146 706223 695967 678137 655107 628902 601530 574804 549655 526185 504992
56758E04992j7071j1425o522l893k292O85N712J1452J6491K0486K3595K5535K5271
$$ 504992 487921 476496 469974 466081 463789 464474 470186 481638 498129 518615 542210 567745 593016
56745E93016K1489J3830L768o338j5082k2201k7229k9390k9047k7727k6138k3570
$$ 593016 614505 628335 632103 625765 610683 588482 561253 531863 502816 475089 448951 425381
56733D25381j9861j6390j4157j2307r784p101n070k959L77M305P108Q472R520
$$ 425381 405520 389130 374973 362666 352882 345781 340711 337752 338129 342434 349542 358014 367534
56720C67534J0488R904O573J182m534r464j3430j6343j7822j7787j7000j6452
$$ 367534 378022 387926 394499 395681 391147 381683 368253 351910 334088 316301 299301 282849
56708B82849j6102j4866j2307r701q587q829r165r214r584j0230j0387j0150j0441
$$ 282849 266747 251881 239574 229873 221286 212457 203292 194078 184494 174264 163877 153727 143286
56695A43286j1020j0266p566m391k273j222q24j274k218k173n51J024Q22n92j477
$$ 143286 132266 122000 114434 110043 107770 106548 105724 104450 102232 100059 99508 100532 101354 100762 99285
56680I9285j537j792k370k156o60R82J332L28n93m6J547K128N26j651j876k03
$$ 99285 97748 95956 93586 91430 90770 91752 93084 93412 92819 92773 94320 96448 96974 95323 93447 93244
56664I3244Q26n1j101m07J519L114L916L969K650n6k238j932K85K106K350J677
$$ 93244 94070 94019 92918 92511 94030 97144 101060 105029 107679 107623 105385 103453 103738 105844 108194 109871
56648A09871R84O27Q20J541K218K431K622L196L544K942J837J265J525K404L980
$$ 109871 110855 111482 112302 113843 116061 118492 121114 124310 127854 130796 132633 133898 135423 137827 141807
56633A41807N943O761N029J543j084j094Q24K437K077J44j156j98J863K376R49
$$ 141807 147750 154511 159540 161083 159999 158905 159729 162166 164243 164387 163231 163033 164896 167272 168221
56618A68221K50K107M627M876L052J809K310L145K968K189J778J906K236K421
$$ 168221 168471 170578 175205 180081 183133 184942 187252 190397 193365 195554 197332 199238 201474 203895
56604B03895K136J475J227J974L090L547L439L682M423M818M417L806L820M694
$$ 203895 206031 207506 208733 210707 213797 217344 220783 224465 228888 233706 238123 241929 245749 250443
56590B50443N960O645N989M419L268K976K299J86k356l419k712j692j470j754
$$ 250443 256403 263048 269037 273456 276724 279700 281999 282185 279829 276410 273698 272006 270536 268782
56576B68782j714r29M53J703J803M26j565l121m103m799m947m129k756j840j944
$$ 268782 267068 266139 266592 268295 270098 270524 268959 265838 261735 256936 251989 247860 245104 243264 241320
56561B41320k769l449k996j152Q40J210k56k065l231m194m977m413k384r78j627
$$ 241320 238551 235102 232106 230954 231794 233004 232748 230683 227452 223258 218281 213868 211484 210506 208879
56546B08879k675j849M6L58j294k572j902r7J473K414K720K407K066K391K857
$$ 208879 206204 204355 204401 204759 203465 200893 198991 198894 200367 202781 205501 207908 209974 212365 215222
56531B15222K181K72j438j768r12K81J100J106M26n9L23J170J757K194K932L676
$$ 215222 217403 217675 216237 214469 213557 213838 214938 216044 216470 216411 216734 217904 219661 221855 224787 228463
56515B28463L911L844L797L325K192J472K135L275L426L090L990O114P534P313
$$ 228463 232374 236218 240015 243340 245532 247004 249139 252414 255840 258930 262920 269034 276568 283881
56501B83881O810P700J0055J2708J4307J3886J1509Q519O212M472K600R04J44
$$ 283881 290691 298391 308446 321154 335461 349347 360856 369375 375587 380059 382659 383563 383707
56488C83707K5j88mJ504L501M007K713J268M98o97l133n725o906o424n020l489
$$ 383707 383732 383544 383540 385044 388545 392552 395265 396533 397031 396334 393201 387476 380570 374146 369126 365637
56472C65637k618l037m461n710n924n263m327l546l102k906k727k783l636m943
$$ 365637 363019 359982 355521 349811 343887 338624 334297 330751 327649 324743 322016 319233 315597 310654
56458C10654n214l842k389k495l439l393k408k096k793l149k524j904k027k213
$$ 310654 305440 301598 299209 296714 293275 289882 287474 285378 282585 279436 276912 275008 272981 270768
56444B70768j511J43K095L429L457K686K722M061M821L178J93j611j677j371j291
$$ 270768 269257 269400 271495 274924 278381 281067 283789 287850 292671 295849 296042 294431 292754 291383 290092
56429B90092j038j122k443l989l728j931r99j671k000p62O96R26M02O0j70l66
$$ 290092 289054 287932 285489 281500 277772 275841 274842 273171 271171 270409 271105 272031 272433 272493 272323 271957
56413B71957R7J201J817J423R04R78J249J361J584J863J648J103R04P09m06j733
$$ 271957 272054 273255 275072 276495 277399 278377 279626 280987 282571 284434 286082 287185 288089 288798 288392 286659
56397B86659j348O94J770K58k130k746j258N54J147N38R9J289L793N202L769R80
$$ 286659 285311 286005 287775 288033 285903 283157 281899 282453 283600 284138 284237 285526 289319 294521 298290 299270
56381B99270l03L39J038J038J242J557O70j104j584k4J775K389K358K307K044
$$ 299270 298967 299306 300344 301382 302624 304181 304851 303747 302163 302139 303914 306303 308661 310968 313012
56366C13012K047L280M833M381J704r59k528l998n156l982m79K402L184L763N167
$$ 313012 315059 318339 323172 327553 329257 328298 325770 321772 316616 312634 312155 314557 317741 321504 326671
56351C26671N167K359p80j635j242j542j711k30J774K344J788J266M10r97j259
$$ 326671 331838 334197 333417 331782 330540 328998 327287 327057 328831 331175 332963 334229 334639 333642 332383
56336C32383M21J580qk564l099j948j152m20J551L391K713L38j035j369k567l933
$$ 332383 332804 334384 334376 331812 328713 326765 325613 325193 326744 330135 332848 333186 332151 330782 328215 324282
56320C24282k687R71L428K893J500J399K023K384L077M503N351M461K602J318
$$ 324282 321595 322566 325994 328887 330387 331786 333809 336193 339270 343773 349124 353585 356187 357505
56306C57505J158J802K858L909M649N246N816N800M723L160J868N75j067k008
$$ 357505 358663 360465 363323 367232 371881 377127 382943 388743 393466 396626 398494 399069 398002 395994
56292C95994r77J331K915L098K832K664K104J152P58J397K216K124J131M67J498
$$ 395994 395017 396348 399263 402361 405193 407857 409961 411113 411871 413268 415484 417608 418739 419206 420704
56277D20704M102O172N708L565K531L339L666K055M34J036K996M203M681N601
$$ 420704 424806 430978 436686 440251 442782 446121 449787 451842 452276 453312 456308 460511 465192 470793
56263D70793O446N965M843M684N155M667L319K561K567K420K437L656N351N629
$$ 470793 477239 483204 488047 492731 497886 502553 505872 508433 511000 513420 515857 519513 524864 530493
56249E30493M497L841M315M631M230M382O043Q405J0095J0458R501P936P228Q248
$$ 530493 534990 538831 543146 547777 552007 556389 562432 570837 580932 591390 600891 608827 616055 624303
56235F24303J0015J1001J1217J1689J2442J2631J2225J1949J1895J1719J1798
$$ 624303 634318 645319 656536 668225 680667 693298 705523 717472 729367 741086 752884
56224G52884J2706J4090J5329J6689J8379J9490J9401J9237K0242K1802K2776
$$ 752884 765590 779680 795009 811698 830077 849567 868968 888205 908447 930249 953025
56213I53025K3590K4960K6005K5969K6572K9823L4496L7650L8975M0710M3753
$$ 953025 976615 1001575 1027580 1053549 1080121 1109944 1144440 1182090 1221065 1261775 1305528
56202A305528M6817M9358N2432N6543O1076O6036P2065P8780Q5158R1482R8825
$$ 1305528 1352345 1401703 1454135 1510678 1571754 1637790 1709855 1788635 1873793 1965275 2064100
56191B064100J06963J14905J22986J32194J41964J50964J59401J68051J75756
$$ 2064100 2171063 2285968 2408954 2541148 2683112 2834076 2993477 3161528 3337284
56182C337284J80541J82559J83080J81325J75414J65886J54734J41382J23219
$$ 3337284 3517825 3700384 3883464 4064789 4240203 4406089 4560823 4702205 4825424
56173D825424J00238P5518N0864K5536k21k4142m5386o5538q4992j01451j13495
$$ 4825424 4925662 5001180 5052044 5077580 5077359 5053217 5007831 4942293 4857301 4755850 4642355
56162D642355j22862j31713j39905j46189j50053j51425j50550j48765j47388
$$ 4642355 4519493 4387780 4247875 4101686 3951633 3800208 3649658 3500893 3353505
56153C353505j45471j40968j34318j28258j23741j18889j12599j06274j01032
$$ 3353505 3208034 3067066 2932748 2804490 2680749 2561860 2449261 2342987 2241955
56144B241955r6015r0561q5539q1283p6471p0219o3436n7302n2245m8705m6802
$$ 2241955 2145940 2055379 1969840 1888557 1812086 1741867 1678431 1621129 1568884 1520179 1473377
56133A473377m4982m1330l6434l2557l0007k7202k4238k3015k3303k2270j8910
$$ 1473377 1428395 1387065 1350631 1318074 1288067 1260865 1236627 1213612 1190309 1168039 1149129
56122A149129j5611j4070j2928j0853q936q182p414n413k976j273k17L70O2o85
$$ 1149129 1133518 1119448 1106520 1095667 1086731 1078549 1071135 1065722 1062746 1061473 1061256 1061626 1061688 1061003
56108A061003m96O15J230J380K788N591P606P901Q274J0085J2339J4045J5761
$$ 1061003 1060507 1061122 1062352 1063732 1066520 1072111 1079717 1087618 1095892 1105977 1118316 1132361 1148122
56095A148122J7622J8557J8646J9698K2286K4755K6161K7677L0149L3005L6385
$$ 1148122 1165744 1184301 1202947 1222645 1244931 1269686 1295847 1323524 1353673 1386678 1423063
56084A423063M1441M7592N2579N6201O0895O7596P4309P9827Q5418R1419R5620
$$ 1423063 1464504 1512096 1564675 1620876 1681771 1749367 1823676 1903503 1988921 2080340 2175960
56073B175960R6575R5301R2332Q6621P8878P2378O8571O5250O0760N6395N2735
$$ 2175960 2272535 2367836 2460168 2546789 2625667 2698045 2766616 2831866 2892626 2949021 3001756
56062C001756M7413L8864K8885J9239R165j462j0169j5781k1167k9291l9428m9594
$$ 3001756 3049169 3088033 3116918 3136157 3145322 3143860 3133691 3117910 3096743 3067452 3028024 2978430
56050B978430n9604o9135p5887p8438p8362p7224p4275o9320o4632o1588n8402
$$ 2978430 2918826 2849691 2773804 2695366 2617004 2539780 2465505 2396185 2331553 2269965 2211563
56039B211563n3603m8731m5202m1659l6907l2322k8892k5068k0044j5822j3519
$$ 2211563 2157960 2109229 2064027 2022368 1985461 1953139 1924247 1899179 1879135 1863313 1849794
56028A849794j0994o842l200j787p56J706M137N222O795J0209J3202J3819J4160
$$ 1849794 1838800 1831958 1828758 1826971 1826215 1827921 1832058 1837280 1844075 1854284 1867486 1881305 1895465
56015A895465J6766K0411K2740K4100K5531K6098K5277K4818K5395K4947K3013
$$ 1895465 1912231 1932642 1955382 1979482 2005013 2031111 2056388 2081206 2106601 2131548 2154561
56004B154561K2770K5646K8227K8020K7890L0888L4953L6983L8084M0365M2497
$$ 2154561 2177331 2202977 2231204 2259224 2287114 2318002 2352955 2389938 2428022 2468387 2510884
55993B510884M2924M3600M5980M7214M5025M2616M3849M7199M9297N0838N3984
$$ 2510884 2553808 2597408 2643388 2690602 2735627 2778243 2822092 2869291 2918588 2969426 3023410
55982C023410N7435N9124O0552O3709O6923O8346P0019P4031P8329Q0740Q3169
$$ 3023410 3080845 3139969 3200521 3264230 3331153 3399499 3469518 3543549 3621878 3702618 3785787
55971C785787Q7423R1343R3583R7330J04325J10427J12390J13650J17854J22513
$$ 3785787 3873210 3964553 4058136 4155466 4259791 4370218 4482608 4596258 4714112 4836625
55961D836625J25220J29935J40003J50951J57963J64726J76486J89926J99006
$$ 4836625 4961845 5091780 5231783 5382734 5540697 5705423 5881909 6071835 6270841
55952F270841K06007K17334K32340K45559K56447K68153K80147K90581L02418
$$ 6270841 6476848 6694182 6926522 7172081 7428528 7696681 7976828 8267409 8569827
55943H569827L18831L36424L51208L66841L88395M12783M34402M55348M80706
$$ 8569827 8888658 9225082 9576290 9943131 10331526 10744309 11178711 11634059 12114765
55934A2114765N08807N35714N64170N98327O35050O70276P07780P51405P95654
$$ 12114765 12623572 13159286 13723456 14321783 14956833 15627109 16334889 17086294 17881948
55925A7881948Q35102Q75826R25810R82182J040505J107347J188995J277046J361454
$$ 17881948 18717050 19592876 20518686 21500868 22541373 23648720 24837715 26114761 27476215
55916B7476215J449158J553254J673443J805503J959586K147945K363493K592080
$$ 27476215 28925373 30478627 32152070 33957573 35917159 38065104 40428597 43020677
55908D3020677K836530L106339L395252L695664M025365M412819M866928N390352
$$ 43020677 45857207 48963546 52358798 56054462 60079827 64492646 69359574 74749926
55900G4749926O010244O764479P672271Q750421J0033094J1530517J3198377J5009649
$$ 74749926 80760170 87524649 95196920 103947341 113980435 125510952 138709329 153718978
55892A53718978J7025403J9313371K1821405K4409663K6901269K8830139K9085343
$$ 153718978 170744381 190057752 211879157 236288820 263190089 292020228 321105571
55885C21105571K6174519J9301720R320646j519356j0878883j7459877k1138828
$$ 321105571 347280090 366581810 375902456 374383100 363504217 346044340 324905512
55878C24905512k2432239k2029301k0615603j8785114j6952651j5349514j4083734
$$ 324905512 302473273 280443972 259828369 241043255 224090604 208741090 194657356
55871A94657356j3161520j2486199j1920772j1378693j0837345j0286095r707719
$$ 194657356 181495836 169009637 157088865 145710172 134872827 124586732 114879013
55864A14879013r104932q501784p911806p330491o758196o205550n677233n172308
$$ 114879013 105774081 97272297 89360491 82030000 75271804 69066254 63389021 58216713
55856E8216713m698423m265476l868254l494380l145833k834291k559455k310673
$$ 58216713 53518290 49252814 45384560 41890180 38744347 35910056 33350601 31039928
55848C1039928k086266j892339j724916j571589j429816j306877j202591j108078
$$ 31039928 28953662 27061323 25336407 23764818 22335002 21028125 19825534 18717456
55840A8717456j021249r48261q89236q36455p87216p45459p10266o74909o37901
$$ 18717456 17696207 16747946 15858710 15022255 14235039 13489580 12779314 12104405 11466504
55831A1466504o03611n71747n37070m99556m64351m31770l97637l63196l34432
$$ 11466504 10862893 10291146 9754076 9254520 8790169 8358399 7960762 7597566 7263134
55822G263134l11492k88624k64662k43987k27341k11353j97286j90302j89298
$$ 7263134 6951642 6663018 6398356 6154369 5927028 5715675 5518389 5328087 5138789
55813E138789j86942j80955j76446j75788j74911j71333j67770j65702j62529
$$ 5138789 4951847 4770892 4594446 4418658 4243747 4072414 3904644 3738942 3576413
55804C576413j56921j50512j43076j32450j20265j11392j06602j01749r5069q9233
$$ 3576413 3419492 3268980 3125904 2993454 2873189 2761797 2655195 2553446 2458377 2369144
55794B369144q5467q1570p6568p1798o6818n9895n2799m9450m9373m8165m4672
$$ 2369144 2283677 2202107 2125539 2053741 1986923 1927028 1874229 1824779 1775406 1727241 1682569
55783A682569m2015m1220l9754l6878l4764l3639l1387k8529k8026k9547k9401
$$ 1682569 1640554 1599334 1559580 1522702 1487938 1454299 1422912 1394383 1366357 1336810 1307409
55772A307409k6765k4687k4399k4049k3419k4256k5455k3818k0279j9403k1700
$$ 1307409 1280644 1255957 1231558 1207509 1184090 1159834 1134379 1110561 1090282 1070879 1049179
55761A049179k2486j9675j6699j5934j5213j2974j1337j1503j1262r526q577r372
$$ 1049179 1026693 1007018 990319 974385 959172 946198 934861 923358 912096 902570 893993 884621
55749H84621r216o661m334m290m714l779k802k905k256M56L196L818L327L421
$$ 884621 875405 868744 864410 860120 855406 851627 848825 845920 843664 844120 847316 851134 854461 857882
55735H57882L654L162K517J802l19l706n655m784l397l965n693o537o243n655
$$ 857882 861536 864698 867215 869017 868698 864992 859337 854553 851156 847191 841498 834961 828718 823063
55721H23063n098n185p076j0265j2082j0967q466o796o245o028n768n077l490
$$ 823063 817965 812780 805704 795439 783357 772390 763924 757128 750883 744855 739087 734010 730520
55708G30520j676j017j519j946k240l599o065q447j0612j3151j4801j3442r993
$$ 730520 728844 727827 726308 724362 722122 718523 712458 704011 693399 680248 665447 652005 642012
55695F42012p936q444r327r406j0179j2027j2650j1008r458r935j0991j0553q980
$$ 642012 634076 625632 616305 606899 596720 584693 572043 561035 551577 541642 530651 520098 511118
55682E11118p518o286n460n970p306p168m992l383m328o314o999o403n684n005
$$ 511118 503600 497314 491854 485884 478578 471410 466418 463035 458707 452393 445394 438991 433307 428302
55668D28302m449m939o414p116o314n785o833p882o925m537k593j545p38p8J54
$$ 428302 423853 418914 412500 405384 399070 393285 386452 378570 371645 367108 364515 362970 362232 362154 362308
55653C62308Q3j98p11n91J285M237O106O149N387L899O23l446n224m089l286n023
$$ 362308 362391 362193 361482 360891 362176 366413 372519 378668 384055 387954 388577 385131 379907 375818 372532 367509
55637C67509p176p052n593n164n550m980l474k485k438k689k938k958k167q48
$$ 367509 360333 353281 347688 342524 336974 331994 328520 326035 323597 320908 317970 315012 312845 311997
55623C11997l94j158j730j373j053q91O48L439M405J864j516k674k554l517m637
$$ 311997 311603 310445 308715 307342 306289 305398 306046 309485 313890 315754 314238 311564 309010 305493 300856
55608C00856l317r9J839J438P32J212K132K461K145J282L4n55N42K614L838L583
$$ 300856 297539 297440 299279 300717 301449 302661 304793 307254 309399 310681 310715 310160 310702 313316 317154 320737
55592C20737K813K436K434K425K050J153J89o1L27M81K80M27N54q25l604n480
$$ 320737 323550 325986 328420 330845 332895 334048 334237 334176 334503 334984 335264 335691 336245 335420 331816 326336
55576C26336n211m350m319m133k882k075l101m476m305l627m355n504m754k721
$$ 326336 321125 316775 312456 308323 305441 303366 300265 295789 291484 287857 283502 277998 273244 270523
55562B70523k224l772m971m399l180k545k290k067k056k111j900j902k531k718
$$ 270523 268299 264527 259556 255157 251977 249432 247142 245075 243019 240908 239008 237106 234575 231857
55548B31857j316M93L82j648l204k973k083j734j632j298j053r72m37O61J513
$$ 231857 230541 231034 231416 229768 226564 223591 221508 219774 218142 216844 215791 214819 214382 215043 216556
55533B16556J617J287O27p81k767m202m121k580l92J287J407N4j147o01J393L141
$$ 216556 218173 219460 220087 219306 216539 212337 208216 205636 205244 206531 207938 207992 206845 206244 207637 210778
55517B10778L538K794J623P38P50J578K345K615L025L897M206L160J766J337J331
$$ 210778 214316 217110 218733 219471 220221 221799 224144 226759 229784 233681 237887 241047 242813 244150 245481
55502B45481L04j690l305l919l747k662p21N87l75k992n005n337m668l621k298
$$ 245481 245785 244095 240790 236871 233124 230462 229741 230328 229953 226961 221956 216619 211951 208330 206032
55487B06032j500k313m259n518n270m289l234j980q08n54j222j821j870j747j519
$$ 206032 204532 202219 197960 192442 187172 182883 179649 177669 176861 176307 175085 173264 171394 169647 168128
55472A68128q50j22j54o61m75N12J079N66l09p70q43p71p75j288k253k413q81
$$ 168128 167278 167156 167002 166341 165866 166378 167457 168023 167714 166944 166101 165330 164555 163267 161014 158601 157720
55455A57720J023J380P38J317L097L452J332q44p79N00P60m1m31k19m24j116j260
$$ 157720 158743 160123 160861 162178 165275 168727 170059 169215 168436 168936 169696 169655 169224 169005 168581 167465 166205
55438A66205n44P8k04j199k203k658k292j386p74j057j782j823n71J465L103L342
$$ 166205 165661 165739 165535 164336 162133 159475 157183 155797 155023 153966 152184 150361 149790 151255 154358 157700
55422A57700K031L2j317j136L74K019K462J382r6n65p0J5r38j831j582q34q42
$$ 157700 159731 159763 158446 157310 157684 159703 162165 163547 163451 162886 162816 162831 161893 160062 158480 157646 156804
55405A56804j447j470o25L01Q12R82N62p26k098k307j481j153k173l625m095l094
$$ 156804 155357 153887 153262 153563 154375 155357 155919 155193 153095 150788 149307 148154 145981 142356 138261 135167
55389A35167j116R36K183K354J977J477M48j409l045k900p47K141M348M989L674
$$ 135167 134051 134987 137170 139524 141501 142978 143426 142017 138972 136072 135325 137466 141814 146803 150477
55374A50477J073r48j061p0L88J46Q3J50l48r62n40P03J435J399J470J747J679
$$ 150477 151550 150602 149541 149471 149859 150005 150088 150238 149890 148928 148388 149091 150526 151925 153395 155142 156821
55357A56821J860L295M878M219J436o30o65n59j714k555j395O24J507J300R45
$$ 156821 158681 161976 166854 171073 172509 171879 171214 170655 168941 166386 164991 165615 167122 168422 169367
55342A69367R4j609k626j405Q02J460L46o85r91j723l101l571k357r20q86j694
$$ 169367 169461 167852 165226 163821 164623 166083 166429 165744 164753 163030 159929 156358 154001 153081 152195 150501
55326A50501j534J85K240L247L040K339J635R83O21Q70J167J83k206l934l070
$$ 150501 148967 149152 151392 154639 157679 160018 161653 162636 163257 164127 165294 165477 163271 159337 156267
55311A56267o10O87K2q35p30p01j654k514k037q09O2Q73K342L648L241J101j228
$$ 156267 155657 156344 156366 155531 154801 154100 152446 149932 147895 147086 147148 148021 150363 154011 157252 158353 157125
55294A57125k517k646j901o83L40O84N85N35O38Q92J390J709R52q50k204j941
$$ 157125 154608 151962 150061 149378 149718 150402 150987 151522 152160 153052 154442 156151 157103 156253 154049 152108
55278A52108p70j36k60l72j32K38O76R75L89j241k418j445J225L224K951J021
$$ 152108 151338 151202 150942 150570 150438 150676 151352 152327 152716 151475 149057 147612 148837 152061 155012 156033
55262A56033q57j591j262p02o79j138j307p67L5O16J171J916K434K290J708R70
$$ 156033 155176 153585 152323 151621 150942 149804 148497 147730 147765 148381 149552 151468 153902 156192 157900 158870
55246A58870j43j589k461k124j322j129j339r65M4P34O07J26j20kM44J114J664
$$ 158870 158727 157138 154677 152553 151231 150102 148763 147798 147842 148576 149183 149309 149189 149187 149631 150745 152409
55229A52409J661R74k14j460k019j455m62k67q44q06L95J366Q23n08j096p65k87
$$ 152409 154070 155044 154830 153370 151351 149896 149434 149167 148323 147517 147912 149278 150101 149593 148497 147732 147445
55212A47445K45J161K012K066J546J149Q54M56M41R65Q02r16k578j802J001K907
$$ 147445 147690 148851 150863 152929 154475 155624 156478 156934 157375 158340 159142 158226 155648 153846 154847 157754
55196A57754K395R06J46k9k83j76Q49K091K352J446J29p92p78L18J760K155Q58
$$ 157754 160149 161055 161201 161172 160889 160713 161562 163653 166005 167451 167580 166788 166010 166328 168088 170243 171101
55179A71101j209k515k402j395l75K43P29J523K392K374Q98j241k470j881R6K102
$$ 171101 169892 167377 164975 163580 163205 163448 164177 165700 168092 170466 171364 170123 167653 165772 165868 167970
55163A67970K714J450o59k034k345k488k709k210j159j193k661l250j258J472
$$ 167970 170684 172134 171475 169441 167096 164608 161899 159689 158530 157337 154676 151426 150168 151640
55149A51640K286J809K291L092J557j910l482j488J160J456J88l42J25N89R60
$$ 151640 153926 155735 158026 161118 162675 160765 157283 155795 156955 158411 158599 158257 158382 158971 159931
55134A59931J337Q07j033k553k002N2J749K320K086J234J47j35O93J259L66j154
$$ 159931 161268 162075 161042 158489 156487 156539 158288 160608 162694 163928 164075 163940 164633 165892 166258 165104
55118A65104j766j319m18J029K992M142L412J801R00N51j77p07K9J099O05j166
$$ 165104 163338 162019 161601 162630 165622 169764 173176 174977 175877 176428 176251 175544 175573 176672 177277 176111
55102A76111k136j789j654k222k005l71J039P98k37m94K05J105J813K116J596
$$ 176111 173975 172186 170532 168310 166305 165934 166973 167771 167534 167040 167245 168350 170163 172279 173875
55087A73875L31q17j282j260q91m9O96K92j076j790r72M61J433K013K373J982
$$ 173875 174206 173389 172107 170847 169956 169907 170603 170895 169819 168029 167057 167518 168951 170964 173337 175319
55071A75319P56l94j130k250l581l178k02K987L619K110P75J91o36j432r61J56
$$ 175319 176075 175681 174551 172301 168720 165542 165340 168327 171946 174056 174831 175022 174386 172954 171993 172149
55055A72149o2j359j094J500L660L060J078L11P99P51k77j142j258j016n00N39
$$ 172149 172087 170728 169634 171134 174794 177854 178932 179243 180042 180793 180516 179374 178116 177100 176600 177139
55039A77139J577J667Q01j84r16j524j652p02R47K114K303K086K026K183K570
$$ 177139 178716 180383 181184 181000 180084 178560 176908 176206 177153 179267 181570 183656 185682 187865 190435
55024A90435L016K691R70j206k120j544q12m86L91K171L402K911J564P10K7j418
$$ 190435 193451 196142 197112 195906 193786 192242 191430 190944 191335 193506 196908 199819 201383 202093 202120 200702
55008B00702k916k848j237J89N57O95J207J422R24O03J117J453L42j594k517j853
$$ 200702 197786 194938 193701 193890 194447 195142 196349 197771 198695 199298 200415 201868 202210 200616 198099 196246
54992A96246p94l11l8M75O08k60j327j234j49K15j072k785l134j933m20O03J396
$$ 196246 195452 195141 195103 195578 196186 195926 194599 193365 193216 193431 192359 189574 186440 184507 184087 184690 186086
54975A86086K130K271J439K10m93l67L03J103J502R01o45k000j974p85J25r1o13
$$ 186086 188216 190487 191926 192136 191643 191276 191579 192682 194184 195085 194440 192440 190466 189681 189806 189715 189102
54958A89102m3J720L192K918J027r86j828j482p34j60J48K16J35K55Q41J503J479
$$ 189102 189059 190779 193971 196889 197916 196930 195102 193620 192886 192726 192874 193090 193225 193480 194321 195824 197303
54941A97303N48p42j790k287j858k03K041L324K752J177R6j37l92j327k559l122
$$ 197303 197851 197109 195319 193032 191174 190971 193012 196336 199088 200265 200361 200224 199832 198505 195946 192824
54925A92824k340k67K166L586L206J526j57q48l39R17J981J861L90j414k308j970
$$ 192824 190484 190217 192383 195969 199175 200701 200544 199696 199357 200274 202255 204116 204506 203092 200784 198814
54909A98814q50O98K447L645L231R85j860l458k777m09J819K314J180K6Q2R15
$$ 198814 197964 198662 201109 204754 207985 208970 207110 203652 200875 200466 202285 204599 205779 205805 205887 206802
54893B06802J370J237J253J770K256K129J385L79m69p93n71l13m86q51q74n94
$$ 206802 208172 209409 210662 212432 214688 216817 218202 218581 218112 217319 216748 216435 215949 215098 214224 213630
54877B13630m99p55j146j576j918j556KK124L503L673L248K730K108J700K244
$$ 213630 213131 212376 211230 209654 207736 206180 206182 208306 211809 215482 218730 221460 223568 225268 227512
54862B27512L637M610M311L460L331M183N315O105O316N896N066M316L788L035
$$ 227512 231149 235759 240070 243530 246861 251044 256359 262464 268780 274676 279742 284058 287846 290881
54848B90881J769L77p20j742k886l627l469l094l651m909n265l907k104j593k311
$$ 290881 292650 293027 292307 290565 287679 284052 280583 277489 273838 268929 263664 259757 257653 256060 253749
54833B53749k693j903p60k19j8M02M71o99k335k346j17K302K726J573J016J995
$$ 253749 251056 249153 248393 248174 248156 248558 249029 248330 245995 243649 243532 245834 248560 250133 251149 253144
54817B53144L401L920L391K455J930K664M820P124P753O288L937J827J50r42r95
$$ 253144 256545 260465 263856 266311 268241 270905 275725 282849 290602 296890 300827 302654 302804 301862 300867
54802C00867m39p92k677m576m622l108k071k743m346n345n121m300l960m615n728
$$ 300867 300428 299636 296959 292383 287761 284653 282582 279839 275493 270148 265027 260727 256767 252152 246424
54787B46424o224n493l786j760q4O09J02r17j441j382j521k086k320j876j568
$$ 246424 240200 234707 230921 229161 229077 229686 229788 228871 227430 226048 224527 222441 220121 218245 216677
54772B16677k110k846k666j444P8J227J446K61j829l047k131p5R85L17r26j487
$$ 216677 214567 211721 209055 207611 207689 208916 210362 210623 208794 205747 203616 203541 204526 204843 203917 202430
54756B02430j047L12K376M202M408K715O10r5R04K267K452J114p11j650j220N5
$$ 202430 201383 201695 204071 208273 212681 215396 216006 215911 216815 219082 221534 222648 221937 220287 219067 219122
54740B19122J430K334K047J73k193k837r79J409J942P44k75l35k83n08k76O30
$$ 219122 220552 222886 224933 225106 222913 220076 219097 220506 222448 223192 222917 222582 222299 221791 221515 222145
54724B22145J315J315J206J121L87o48j01K656N215M886K324N42Q03J569J439
$$ 222145 223460 224775 225981 227102 227489 226841 226740 229396 234611 239497 241821 242363 243166 244735 246174
54709B46174J104J661K733L382L798M754O031O690O663O881P702Q253P611N851
$$ 246174 247278 248939 251672 255054 258852 263606 269637 276327 282990 289871 297573 305826 313437 319288
54695C19288L430M72k594m334l602j432n12k144m710n758m991m123m294m761m365
$$ 319288 322718 323190 320596 316262 312660 311228 310716 308572 303862 298104 293113 288990 284696 279935 275570
54680B75570l206k264k030k120j958j298k73O92J088P88K04k21m38m49N0J167
$$ 275570 272364 270100 268070 265950 263992 262694 262421 263113 264201 264989 265193 264972 264534 264085 264135 265302
54664B65302K154K124J428J529L068M827N226M370L667L757L910L476K850K475
$$ 265302 267456 269580 271008 272537 275605 280432 285658 290028 293695 297452 301362 304838 307688 310163
54650C10163J852L56j591l005l674m148m710n180n627o372p182p340o586n293
$$ 310163 312015 312371 310780 307775 304101 299953 295243 290063 284436 278064 270882 263542 256956 251663
54636B51663l637j517M29Q35p04k695l275k213p93j61m50j236k028k435k382k116
$$ 251663 248026 246509 246938 247773 247069 244374 241099 238886 238093 237932 237482 236246 234218 231783 229401 227285
54620B27285j700q25M66J309R57k6l59K26N52m38k197l039j972J58J448R10m40
$$ 227285 225585 224760 225226 226535 227492 227466 227107 227333 227885 227447 225250 222211 220239 220397 221845 222755 222315
54603B22315q16J59J185J234Q79J064J512J275L76k87m27o07r91r67l72m6o34
$$ 222315 221499 221658 222843 224077 224956 226020 227532 228807 229183 228896 228469 227862 226871 225904 225532 225486 224852
54586B24852j519j572n31Q87J921K332K205J683R60L78L95J342K990M372M435
$$ 224852 223333 221761 221230 222117 224038 226370 228575 230258 231218 231596 231991 233333 236323 240695 245130
54571B45130K984Q62r32k071k863l524l769l168j888q12n58n33L84K047K816J631
$$ 245130 248114 248976 248044 245973 243110 239586 235817 232649 230761 229949 229391 228858 229242 231289 234105 235736
54555B35736l75j329j075r62j499j689r82l91q01j309m96J265K101J136m19r33
$$ 235736 235361 234032 232957 231995 230496 228807 227825 227434 226633 225324 224828 226093 228194 229330 228911 227978
54539B27978j45J111K172K793K642J445l82j922k762l173l129k011R3J607J111
$$ 227978 227833 228944 231116 233909 236551 237996 237614 235692 232930 229757 226628 224617 224710 226317 227428
54524B27428n96j305l04Q24O84n7j61O0n14j569j485K03J873J813L53o09J54J914
$$ 227428 226832 225527 225223 226047 226731 226674 226513 226573 226059 224490 223005 223208 225081 226894 227247 226638 226792 228706
54506B28706K875K149P33K30P73Q83l17j696j635k12J224K125L001L820L549J751
$$ 228706 231581 233730 234463 234693 235466 236349 236032 234336 232701 232489 233713 235838 238839 242659 246208 247959
54490B47959m63j581j184K9J141J634J593J463J290M79j035j839l79K702M885
$$ 247959 247496 245915 244731 244760 245901 247535 249128 250591 251881 252360 251325 249486 249107 251809 256694
54475B56694M661L018J707J259J237J319J171K67j256k193j687n03p1p36j802
$$ 256694 261355 264373 266080 267339 268576 269895 271066 271333 270077 267884 266197 265694 265623 264887 263085
54460B63085k764l499l558k347q3K121L187K729J078p62j494o84N25O23m26j258
$$ 263085 260321 256822 253264 250917 250834 252955 256142 258871 259949 259187 257693 257009 257534 258157 257731 256473
54444B56473j057n18n83j026r84l51J38K15N90J775K959K875J658R20J623K638
$$ 256473 255416 254898 254315 253289 252305 251954 252092 252307 252897 254672 257631 260506 262164 263084 264707 267345
54428B67345K229M07j152j387q61m17M2R11J883K369K345K160J942J712J701K006
$$ 267345 269574 269981 268829 267442 266581 266164 266206 267117 269000 271369 273714 275874 277816 279528 281229 283235
54412B83235K208J951J483J265J288J332J563K265L145L517L110K260J403P46
$$ 283235 285443 287394 288877 290142 291430 292762 294325 296590 299735 303252 306362 308622 310025 310771
54398C10771L03k5l58n73l65K15O26N12J51j60p17j822k926l082k242j476j720
$$ 310771 311074 311049 310691 310118 309753 309968 310594 311106 311257 311097 310380 308558 305632 302550 300308 298832 297112
54381B97112k668l118k294o95L42M3r95j711j958k328k586j472J304L826L853
$$ 297112 294444 291326 289032 288337 288679 288722 287727 286016 284058 281730 279144 277672 278976 282802 286655
54366B86655J569o04q61K24Q52J35j307k269k091j069L8Q31J528K367L105L236
$$ 286655 288224 287620 286759 286983 287835 287970 286663 284394 282303 281234 281272 282103 283631 285998 289103 292339
54350B92339K406N43j832l336k676m62R02L6j499j280N63J622O93o89o00Q61K236
$$ 292339 294745 295288 293456 290120 287444 286982 287884 287920 286421 285141 285704 287326 288019 287330 286730 287591 289827
54333B89827K684K327J516P01M81R71J340P59m38j166r73l09L77J094J815K253
$$ 289827 292511 294838 296354 297055 297536 298507 299847 300606 300168 299002 298029 297720 298097 299191 301006 303259
54317C03259K379K559K808K414R17p57r29Q38K977L626K693J671J602K098K421
$$ 303259 305638 308197 311005 313419 314336 313579 312650 313488 316465 320091 322784 324455 326057 328155 330576
54302C30576K602K891K810J641l33j808j799o29M50L56r69k436k771j890j067
$$ 330576 333178 336069 338879 340520 340187 338379 336580 335951 336401 336757 335788 333352 330581 328691 327624
54287C27624j356k302k822k912l443m476m929m145k782j687q42m9J32r22k667
$$ 327624 326268 323966 321144 318232 314789 310313 305384 301239 298457 296770 295928 295879 296011 295089 292422
54272B92422l720l354k005m54Q45J528J188n1j256j386m05N98M58q35j977j563
$$ 292422 288702 285348 283343 282889 283734 285262 286450 286399 285143 283757 283352 283950 284408 283573 281596 280033
54256B80033M94K820L952L677K835J957O63j301k920k592j40K480L031J347p62
$$ 280033 280527 283347 287299 290976 293811 295768 296431 295130 292210 289618 289478 291958 294989 296336 295574
54241B95574j777j945k318k992l055j968m27M03J95j47M55J890K718J719n69k330
$$ 295574 293797 291852 289534 286542 283487 281519 281092 281495 281690 281543 281998 283888 286606 288325 287756 285426
54225B85426k426j280J90J695L102L709K862J000p31j746k210k182j424j11R91
$$ 285426 283000 281720 281910 283605 286707 290416 293278 294278 293547 291801 289591 287409 285985 285874 286865
54210B86865J332J094P90P07Q32R84R38P28P19J102J463J320Q63O37O48M94K64
$$ 286865 288197 289291 290081 290788 291620 292604 293542 294270 294989 296091 297554 298874 299737 300374 301022 301516 301780
54193C01780M76J086J395J183J124J612J930J194l09j377j292m79J56J12m53j056
$$ 301780 302256 303342 304737 305920 307044 308656 310586 311780 311471 310094 308802 308323 308479 308591 308138 307082
54177C07082j318j117m73M58J254J444J187J282K065K706K245R95%n53j337k313
$$ 307082 305764 304647 304174 304632 305886 307330 308517 309799 311864 314570 316815 317810 317810 317257 315920 313607
54161C13607k510j642p31n38m53K87J247J567J265P86M1r54j202P3J706J546p15
$$ 313607 311097 309455 308724 308186 307733 308020 309267 310834 312099 312885 312926 311972 310770 310843 312549 314095 313380
54144C13380k972l263j901o40p05j989l385l424j423J460K957K096L51k12O27
$$ 313380 310408 307145 305244 304604 303899 301910 298525 295101 293678 295138 298095 300191 300542 300330 300957
54129C00957J360Q74m82j733k326k194j462m60L85Q56R75P80L70J47N11J235J587
$$ 300957 302317 303191 302709 300976 298650 296456 294994 294534 294919 295775 296750 297530 297900 298047 298558 299793 301380
54112C01380J243O64M24N07M73n0j237k979m625n219m367k661r55L93J338J813
$$ 301380 302623 303287 303711 304218 304691 304641 303404 300425 295800 290581 286214 283553 282598 282991 284329 286142
54096B86142K022K378K590J562q55k767k275k40P21o0l92J327L644M197K924J597
$$ 286142 288164 290542 293132 294694 293839 291072 288797 288557 289278 289218 288826 290153 293797 297994 300918 302515
54080C02515R69K8j979m160m818l128n5K161K009N81N49K620M187K710o95k762
$$ 302515 303484 303512 301533 297373 292555 289427 289372 291533 293542 294123 294672 297292 301479 304189 303494 300732
54064C00732k323j053l64Q2O36O73J85M34J954L358L280K393K320L440M768N365
$$ 300732 298409 297356 296992 297074 297710 298383 298568 299002 300956 304314 307594 309987 312307 315747 320515 325880
54048C25880M990L967L040K762K682J993J259K061M322N657M561K666K184K565
$$ 325880 330870 334837 337877 340639 343321 345314 346573 348634 352956 358613 363174 365840 368024 370589
54034C70589J756j41r90n7R80P06m23j460k180k287j247L85R80R5o92j57P15M80
$$ 370589 372345 372204 371214 371157 372137 372843 372420 370960 368780 366493 365246 365631 366611 366706 366014 365857 366572 367052
54016C67052l86m35K91L80o50j647j541o22J80M51M87Q65J873K912K703P63j529
$$ 367052 366666 366231 366522 366902 366252 364605 363064 362442 362622 363073 363560 364425 366298 369210 371913 372676 371147
53999C71147k234j127K25O73O45P95P01k21j258r92R80L643N781O876O959O315
$$ 371147 368913 367786 368011 368684 369329 370124 370825 370604 369346 368354 369334 372977 378758 385634 392593 398908
53983C98908N428M724M251L975M170N070O262P042P285P434P776Q321R170J0168
$$ 398908 404336 409060 413311 417286 421456 426526 432788 439830 447115 454549 462325 470646 479816 489984
53969D89984J0318Q725O174M672M971N710N594N065M969M774L538J790R37J156
$$ 489984 500302 509027 515201 519873 524844 530554 536148 541213 546182 550956 554494 556284 557221 558377
53955E58377J293O12n96j955l272l936l457k607k753l935m885n086n372o180o754
$$ 558377 559670 560282 559686 557731 554459 550523 547066 544459 541706 537771 532886 527800 522428 516248 509494
53940E09494o634o560p042p307o511m950l332j863r67j638l912n941n952m370
$$ 509494 502860 496300 489258 481951 475440 470490 467158 465295 464328 462690 458778 452837 446885 442515
53926D42515k894k170j719j401j436j326l26J096J634R27k54j474k854l752k851
$$ 442515 439621 437451 435732 434331 432895 431569 431243 432339 433973 434900 434646 433172 430318 426566 423715
53911D23715j72K276K727J774J450K733M708N867N741N249N661P243Q938R608
$$ 423715 423543 425819 428546 430320 431770 434503 439211 445078 450819 456068 461729 468972 477910 487518
53897D87518R257Q520P371N210K232k55j227r76m13k2J05j90r18j598j629r38
$$ 487518 496775 505295 512666 517876 520108 519853 518626 517650 517237 517215 517320 517130 516212 514614 512985 512047
53881E12047K1P72J243J771K766M126N081M974M156L630L769L993L815L580L813
$$ 512047 512068 512840 514083 515854 518620 522746 527827 532801 536957 540587 544356 548349 552164 555744 559557
53866E59557M362M680M683M862N642O889P948Q083P220O400P092R525J2034J2626
$$ 559557 563919 568599 573282 578144 583786 590675 598623 606706 613926 620326 627418 636943 648977 661603
53852F61603J1125R243Q463Q540Q341P645P275P523P351N649K895Q81Q01K092
$$ 661603 672728 681971 690434 698974 707315 714960 722235 729758 737109 742758 745653 746534 747335 749427
53838G49427L208L071J613n32k563l971m824n519o165o501o522o781p819r533
$$ 749427 752635 755706 757319 756787 754224 750253 745429 739910 733745 727244 720722 713941 706122 696589
53824F96589j1241j2154j1823j0534r331r154r713r789q869p698o997o481n809
$$ 696589 685348 673194 661371 650837 641506 632352 622639 612850 603981 596283 589286 582805 576996
53811E76996n624o655q256q943q241p181o860p207p295o455n032m188m710n928
$$ 576996 571372 564717 556461 547518 539277 532096 525236 518029 510734 504279 499247 495059 490349 484421
53797D84421o330n438m321l775l132j733o41j402l638n312n297m345l465k669
$$ 484421 478091 472653 468332 464557 461425 459692 459051 457649 454011 448699 443402 439057 435592 432923
53783D32923j665o95k05k54n37o55m21k58r27k293k984k063l79P10J277K134K996
$$ 432923 431258 430563 430358 430104 429567 428912 428491 428233 427306 425013 422029 419966 419587 420297 421574 423708 426704
53766D26704K990K438K253K005Q02k20R59L295L034q28m289l493K16K806L207
$$ 426704 429694 432132 434385 436390 437192 436972 437931 441226 444260 443432 439143 435650 435866 438672 441879
53751D41879L529M715N140L722J807J177J924L058L944M472M697M947N722P029
$$ 441879 445408 450123 455263 458985 460792 461969 463893 466951 470895 475367 480064 485011 490733 497762
53737D97762Q186Q611Q490Q483Q910R268Q604O631M435L541M098M760M538L889
$$ 497762 505948 514559 523049 531532 540442 549710 558314 564945 569380 572921 577019 581779 586317 590206
53723E90206L444K758J159q46k185k643k814l011l249l896n293o897p719p487
$$ 590206 593650 596408 597567 596721 594536 591893 589079 586068 582819 578923 573630 566733 559014 551527
53709E51527o596n266l666k586k866m152n130n100m637m574n029n472n290m366
$$ 551527 544931 539665 535999 533413 530547 526395 521265 516165 511528 506954 501925 496453 491163 486797
53695D86797l471l719n083n973n081l142j922j848j821j199o52q71j527j910j789
$$ 486797 483326 479607 474524 468551 463470 460328 458406 456558 454737 453538 452886 452015 450488 448578 446789
53680D46789j298o64k92n56j234j664j556j189q53n54k63Q4P60J861K952L567
$$ 446789 445491 444827 444535 443979 442745 441081 439525 438336 437483 436929 436666 436750 437510 439371 442323 445890
53664D45890L829L883L196J371o20j166R5K101L951N488O281N585L753K500K971
$$ 445890 449719 453602 456798 458169 457549 456383 456478 458579 462530 468018 474299 479884 483637 486137 489108
53649D89108M422N363N255M440L294K141J547J894K902L948M602M676M250L794
$$ 489108 493530 498893 504148 508588 511882 514023 515570 517464 520366 524314 528916 533592 537842 541636
53635E41636L820M213M400M244M066L765K786J308N12J190K748M030M441L876
$$ 541636 545456 549669 554069 558313 562379 566144 568930 570238 570750 571940 574688 578718 583159 587035
53621E87035K413N75q40j686k514l324l239k109j306j833k644k085m52M37j44
$$ 587035 589448 590023 589183 587497 584983 581659 578420 576311 575005 573172 570528 568443 567991 568428 568284
53606E68284r91q87m1O75R04P89N55N35R71J489J367N56q3L5L84J83m64p85n37
$$ 568284 567293 566406 566365 567040 567944 568733 569288 569823 570794 572283 573650 574206 574123 574158 574542 574725 574261 573476 572939
53587E72939k10j51n0M89J268J743J728J610J950L122N140P404Q708Q086N932
$$ 572939 572729 572578 572528 573017 574285 576028 577756 579366 581316 584438 589578 596982 605690 613776 619708
53572F19708L808K864K848L018L385M355N521N868N131M159L674L518L366L544
$$ 619708 623516 626380 629228 632246 635631 639986 645507 651375 656506 660665 664339 667857 671223 674767
53558F74767M603O450Q260R079Q441O801N315M728M563M001L397L901N403O156
$$ 674767 679370 685820 694080 703159 711600 718401 723716 728444 733007 737008 740405 744306 749709 755865
53544G55865N056L301K760L481L998L573K949K903L193L181K623J565J07j306
$$ 755865 760921 764222 766982 770463 774461 778034 780983 783886 787079 790260 792883 794448 794555 793249
53530G93249j880j251q3N18J14p36j269j379j482j774k064k428l423n160o569
$$ 793249 791369 790118 790035 790553 790667 789931 788662 787283 785801 784027 781963 779535 776112 770952 764383
53515G64383o338m542k623j729j692j738j500j092p22n42m97k85J05Q5n98r65
$$ 764383 758045 753503 750880 749151 747459 745721 744221 743129 742407 741865 741368 741083 741188 741273 740675 739710
53499G39710M1J626J840L80q92p53j82j84K56K514N792P915P873O274M124K635
$$ 739710 739751 741377 743217 743597 742705 741952 741770 741586 741842 744356 750148 758063 765936 772210 776334 778969
53483G78969L280O209R182R931R170R378J1055J2303J2085J1569J1906J2791J3890
$$ 778969 782249 788458 797640 807571 816741 826119 837174 849477 861562 873131 885037 897828 911718
53470I11718J5656J7754J8586J7686J7062J8723K2018K4785K6135K6637K6627
$$ 911718 927374 945128 963714 981400 998462 1017185 1039203 1063988 1090123 1116760 1143387
53459A143387K5964K5227K5629K7573L0080L1899L2687L3165L4334L6377L8207
$$ 1143387 1169351 1194578 1220207 1247780 1277860 1309759 1342446 1375611 1409945 1446322 1484529
53448A484529L8689L8225L8332L9390M0110L9757L9593M0946M2971M3791M3116
$$ 1484529 1523218 1561443 1599775 1639165 1679275 1719032 1758625 1799571 1842542 1886333 1929449
53437A929449M2092M0989L8910L5885L3615L3378L4358L4794L4044L2777L1699
$$ 1929449 1971541 2012530 2051440 2087325 2120940 2154318 2188676 2223470 2257514 2290291 2321990
53426B321990L0885L0154K9495K8943K8295K7184K5494K3657K2280K1473K0695
$$ 2321990 2352875 2383029 2412524 2441467 2469762 2496946 2522440 2546097 2568377 2589850 2610545
53415B610545J9278J6790J2962P914K639j303l089l329l297m022o244j0219j4953
$$ 2610545 2629823 2646613 2659575 2667489 2670128 2668825 2665736 2662407 2659110 2655088 2648844 2638625 2623672
53402B623672j8526k0099k0952k2585k4542k5255k4631k4357k5759k8460l1130
$$ 2623672 2605146 2585047 2564095 2541510 2516968 2491713 2467082 2442725 2416966 2388506 2357376
53391B357376l2574l2164l0309k8531k8142k8798k9166k8630k7320k4929k1167
$$ 2357376 2324802 2292638 2262329 2233798 2205656 2176858 2147692 2119062 2091742 2066813 2045646
53380B045646j7215j4853j3960j2726j0692r493r697r107n756r58K542M132N295
$$ 2045646 2028431 2013578 1999618 1986892 1976200 1966707 1957010 1947903 1942147 1941189 1943731 1947863 1953158
53367A953158O948Q909J1322J4596J8094K0703K2617K4885K7376K9020L0232L3039
$$ 1953158 1960106 1969015 1980337 1994933 2013027 2033730 2056347 2081232 2108608 2137628 2167860 2200899
53355B200899L8056M3091M5799M6461M7053M8685N1106N3993N7425O1346O5420
$$ 2200899 2238955 2282046 2327845 2374306 2421359 2470044 2521150 2575143 2632568 2693914 2759334
53344B759334O9323P2673P4909P5923P6578P8065Q0791Q4130Q7036Q8666Q8801
$$ 2759334 2828657 2901330 2976239 3052162 3128740 3206805 3287596 3371726 3458762 3547428 3636229
53333C636229Q8081Q7517Q7472Q7382Q6723Q5753Q4892Q3813Q1812P8804P5400
$$ 3636229 3724310 3811827 3899299 3986681 4073404 4159157 4244049 4327862 4409674 4488478 4563878
53322D563878P2022O8432O4121N8903N3138M7531M2535L7794L2371K5769J8422
$$ 4563878 4635900 4704332 4768453 4827356 4880494 4928025 4970560 5008354 5040725 5066494 5084916
53311E084916J0987L488m609j3610k3165l2334m0069m6158n1815n8652o6583p3432
$$ 5084916 5095903 5099391 5094782 5081172 5058007 5025673 4985604 4939446 4887631 4828979 4762396 4688964
53299D688964p7233p8372p8862q0058q1922q3944q5621q6287q5564q4107q2979
$$ 4688964 4611731 4533359 4454497 4374439 4292517 4208573 4122952 4036665 3951101 3866994 3784015
53288C784015q2283q1336q0096p9295p8934p7893p5604p3004p1065o9305o6661
$$ 3784015 3701732 3620396 3540300 3461005 3382071 3304178 3228574 3155570 3084505 3015200 2948539
53277B948539o3089n9322n5531n1408m7300m4132m2036m0039l7306l4061l1012
$$ 2948539 2885450 2826128 2770597 2719189 2671889 2627757 2585721 2545682 2508376 2474315 2443303
53266B443303k8611k7160k6879k7290k7051k5154k2132j9354j7251j4933j1787
$$ 2443303 2414692 2387532 2360653 2333363 2306312 2281158 2259026 2239672 2222421 2207488 2195701
53255B195701q668o953o766o774n664l268k81K549M842O803R159J2335J5396J6594
$$ 2195701 2187033 2180080 2173314 2166540 2160876 2157608 2157327 2159876 2164718 2171521 2180680 2193015 2208411 2225005
53241B225005J5630J4755J6650K1413K6590L0126L2193L3980L5849L7413L8539
$$ 2225005 2240635 2255390 2272040 2293453 2320043 2350169 2382362 2416342 2452191 2489604 2528143
53230B528143L9225L8900L6980L4154L2133L1693L1592L0066K7004K3905K1617
$$ 2528143 2567368 2606268 2643248 2677402 2709535 2741228 2772820 2802886 2829890 2853795 2875412
53219B875412J9023J4611Q859M056J635N41j275m636r080j4166j9609k4367k7218
$$ 2875412 2894435 2909046 2917905 2921961 2923596 2924137 2922862 2918226 2909146 2894980 2875371 2851004 2823786
53206B823786k8511l0228l3610l7626m0555m2248m3899m5977m7496m7509m6519
$$ 2823786 2795275 2765047 2731437 2693811 2653256 2611008 2567109 2521132 2473636 2426127 2379608
53195B379608m6110m7309m9538n1157n1114n0053m9493n0002n0589n0068m8457
$$ 2379608 2333498 2286189 2236651 2185494 2134380 2084327 2034834 1984832 1934243 1884175 1835718
53184A835718m6749m5719m5360m5114m4296m2597m0497l8872l7977l7176l5866
$$ 1835718 1788969 1743250 1697890 1652776 1608480 1565883 1525386 1486514 1448537 1411361 1375495
53173A375495l4116l2091k9594k6803k4747k4160k4244k3486k1573j9719j9122
$$ 1375495 1341379 1309288 1279694 1252891 1228144 1203984 1179740 1156254 1134681 1114962 1095840
53162A095840j9802k0865k1306k0627j9243j8264j8306j8653j8214j7011j5992
$$ 1095840 1076038 1055173 1033867 1013240 993997 975733 957427 938774 920560 903549 887557
53151H87557j5545j5110j4271j3377j2903j3040j3968j5613j6885j6212j3433
$$ 887557 872012 856902 842631 829254 816351 803311 789343 773730 756845 740633 727200
53140G27200j0416r059r323r815r774r576r598r476q829p945p435p420p458p209
$$ 727200 716784 707725 698402 688587 678813 669237 659639 650163 641334 633389 625954 618534 611076 603867
53126F03867o893o929p277p410o964o045m958l961l461l843m782n239m603l424
$$ 603867 596974 590045 582768 575358 568394 562349 557391 553430 549969 546126 541344 536105 531502 528078
53112E28078k553k034j576j467k094k911k937k119j211n27O6J36r66k674l556
$$ 528078 525525 523491 521915 520448 518354 515443 512506 510387 509176 508649 508715 508851 507885 505211 501655
53097E01655l304k897k537j132J359K808J507j343l148l010j871m87J026K123
$$ 501655 498351 495454 492917 491785 493144 495952 497459 496116 492968 489958 488087 487600 488626 490749
53083D90749K000R46R3k66r27k159l091l066k579k344k184j429R7J865L186L695
$$ 490749 492749 493695 493788 493522 492595 490436 487345 484279 481700 479356 477172 475743 475840 477705 480891 484586
53067D84586L471K727J408n79k500k857j014J640L093L031K829L435M323M661
$$ 484586 488057 490784 492192 491613 489113 486256 485242 486882 489975 493006 495835 499270 503593 508254
53053E08254M414L889L130K192J346O09l05j339j998k190k373k593k162q55L83
$$ 508254 512668 516557 519687 521879 523225 523834 523529 522190 520192 518002 515629 513036 510874 510019 510402
53038E10402O64L22J43L2n86j597k494l450m804n637m390j361Q53L40j645k447
$$ 510402 511066 511388 511531 511563 510977 509380 506886 503436 498632 492995 488605 487244 488097 488437 486792 484345
53022D84345j512o47j039j752j634j181j317j515o33Q94J389M09o44q17j016k375
$$ 484345 482833 482186 481147 479395 477761 476580 475263 473748 473115 474009 475398 475807 475163 474346 473330 470955
53006D70955m294n164m315k416m63P41P29j70q38o84l97o45p95m8Q00K86j313
$$ 470955 466661 461497 457182 454766 454303 455044 455773 455603 454765 454081 453684 453039 452244 452196 452996 453282 451969
52989D51969k134j330l2N14K91l90j590k862l013j638R0R49J026Q07J07j121j960
$$ 451969 449835 448505 448473 448987 449278 448888 447298 444436 441423 439785 439875 440824 441850 442657 442764 441643 439683
52972D39683j676r62q08q89l08O71J007O84O18R45Q85L51L33J283K352K657K273
$$ 439683 438007 437045 436237 435348 435040 435711 436718 437402 438020 438965 439850 440201 440534 441817 444169 446826 449099
52955D49099J514L03j107j760j218m35m29n90N76L115N077M682K334K1q77o60
$$ 449099 450613 450916 449809 448049 446831 446396 445967 445377 445953 449068 454145 458827 461161 461182 460305 459645
52939D59645l87n69r53j106p62K25J728L092L541K977J993J033J5r44j139j81
$$ 459645 459258 458689 457736 456630 455868 456093 457821 460913 464454 467431 469424 470457 470472 469528 468389 468208
52923D68208J125J544Q68O6M9P69J567J917J855J876K270K513J709l1j388j500
$$ 468208 469333 470877 471745 471811 471860 472629 474196 476113 477968 479844 482114 484627 486336 486305 484917 483417
52907D83417j085j038p31Q79K953L418J952N28L81K66j239l188l559k184p54l66
$$ 483417 482332 481294 480563 481442 484395 487813 489765 490293 490674 490940 489701 486513 482954 480770 480016 479650
52891D79650n08m48k73l55p10j166j497j336n84J01p9r94j761j917j630q15Q60
$$ 479650 479142 478694 478421 478066 477356 476190 474693 473357 472773 472874 472795 471801 470040 468123 466493 465678 466538
52874D66538K870L735K662N74r87j472j315r43n35l91q47j703k199j583L10K753
$$ 466538 469408 473143 475805 476379 475392 473920 472605 471662 471127 470736 469889 468186 465987 464404 464714 467467
52858D67467M269L660J295j028j929j760j665j919j976j670j257m53J331L527
$$ 467467 471736 475396 476691 475663 473734 471974 470309 468390 466414 464744 463487 463034 464365 467892
52844D67892M351K879M28r43q38o11j403k812l568k919j226M38J203J114Q31O50
$$ 467892 472243 475122 475550 474607 473769 473158 471755 468943 465375 462456 461230 461668 462871 463985 464816 465466
52828D65466J68p06j130l92P17P62j94n31M74J396Q24k87J78K284L684K790R49
$$ 465466 465634 464928 463798 463406 464123 464885 464691 464160 464634 466030 466854 466567 466745 469029 472713 475503 476452
52811D76452N47J859K933K368J049Q17K119L574L658K310P40o9k91o87j369j623
$$ 476452 476999 478858 481791 484159 485208 486025 488144 491718 495376 497686 498426 498357 498066 497379 496010 494387
52795D94387j027l10n42j625k256j640p42j216l291n401o069n489m823m373l358
$$ 494387 493360 493050 492508 490883 488627 486987 486245 485029 481738 476337 470268 464779 459956 455583 452225
52780D52225j423M37R99L76k57k80l45j284k851l908l629k209n38O10J063J180
$$ 452225 450802 451239 452238 452614 452357 452077 451732 450448 447597 443689 440060 437851 437313 437923 438986 440166
52764D40166J258J074K29r63j435o44M17J53j655l462l739k622j355o58k45L00
$$ 440166 441424 442498 442727 441764 440329 439685 440102 440255 438600 435138 431399 428777 427422 426764 426519 426819
52748D26819Q80J215J276J204J147J311J861K531K637J724Q4j484k368k493k236
$$ 426819 427699 428914 430190 431394 432541 433852 435713 438244 440881 442605 442689 441205 438837 436344 434108
52733D34108k114k396k809k722j829n67K92M32L15O22J396J766P96j247k838k809
$$ 434108 431994 429598 426789 424067 422238 421671 421963 422395 422710 423332 424728 426494 427290 426043 423205 420396
52717D20396j763j174j320j072N0Q29M9j588k331j627m05N78J536K796M068M821
$$ 420396 418633 417459 416139 415067 415117 415946 415995 414407 412076 410449 410044 410622 412158 414954 419022 423843
52701D23843M682L446J468j05l60K8l92j564j704Q6K243K662J306j35m76J46J148
$$ 423843 428525 431971 433439 433334 432974 433002 432610 431046 429342 429428 431671 434333 435639 435504 435028 435174 436322
52684D36322K108K692K881L141L655L647K367N43j96N80J537J332J94o42m39N12
$$ 436322 438430 441122 444003 447144 450799 454446 456813 457356 457160 457740 459277 460609 460803 460161 459722 460234
52668D60234J518K208K643K878K546J189q81k532k990k658k292j906j133k35J74
$$ 460234 461752 463960 466603 469481 472027 473216 472335 469803 466813 464155 461863 459957 458824 458589 458763
52653D58763J49K00K66j31p75q37k27J73j47o45o86l57QL55O73Q71J064J310J054
$$ 458763 458912 459112 459378 459247 458472 457635 457408 457581 457434 456789 456103 455746 455754 456109 456782 457653 458717 460027 461081
52634D61081j92j679k062j382j007j271q12R20K158J178j031k082j299k7O00O81
$$ 461081 460889 459210 457148 455766 454759 453488 452676 453596 455754 456932 455901 453819 452520 452493 453093 453774
52618D53774O40P71J444K524K843J467o74j790j608j394j661j501m47N45N35j40
$$ 453774 454414 455185 456629 459153 461996 463463 462789 460999 459391 457997 456336 454835 454388 454933 455468 455328
52602D55328o41o85k86O21J768K602L096L699M229L871K719K129K894M038M245
$$ 455328 454687 454002 453716 454337 456105 458707 461803 465502 469731 473602 476321 478450 481344 485382 489627
52587D89627L551K751J916N78j052k007j529K89K353K851O53k923m834l651j193
$$ 489627 493178 495929 497845 498423 497371 495364 493835 494124 496477 499328 499981 497058 492224 488573 487380
52572D87380J59N18J324K345K081P48M36J917L408L339K497K376K827K720J863
$$ 487380 487539 488057 489381 491726 493807 494555 494991 496908 500316 503655 506152 508528 511355 514075 515938
52557E15938Q90k1j034j787j811j508j501j447p29p7r40l027m065k794r06q53
$$ 515938 516828 516807 515773 513986 512175 510667 509166 507719 506990 506913 505973 502946 498881 496087 495181 494328
52541D94328k541l595k563m80R05J216J098Q63M64K95R81K313L286L330K830K238
$$ 494328 491787 488192 485629 485149 486054 487270 488368 489231 489695 489990 490971 493284 496570 499900 502730 504968
52525E04968J499P35O84J635K518K099Q44M39J289J720K79k118l298k553j129
$$ 504968 506467 507202 507886 509521 512039 514138 514982 515421 516710 518430 518709 516591 513293 510740 509611
52510E09611j88M97J385J812Q17j097k184j597n13m61j194j109L28J681J535N13
$$ 509611 509423 509920 511305 513117 513934 512837 510653 509056 508543 508082 506888 505779 506107 507788 509323 509836
52494E09836L78J483K252J399l60j438j478j429j789j817p93O16R60k67j972k738
$$ 509836 510214 511697 513949 515348 514988 513550 512072 510643 508854 507037 506244 506860 507820 507553 505581 502843
52478E02843k289j404n83N64K310L733L484J737M61J240L302M417L536J695L93
$$ 502843 500554 499150 498567 499131 501441 505174 508658 510395 510856 512096 515398 519815 523351 525046 525439
52463E25439kM9L03Q08J317J351P68r8q00r67l84O15J085M44m25K19L001O474
$$ 525439 525437 525486 525789 526597 527914 529265 530033 529935 529135 528168 527784 528399 529484 529928 529503 529722 532723 539197
52445E39197Q475Q060N844K954K25j809k854l063k890k481j509R3J484J374o32
$$ 539197 547672 555732 561576 564530 564755 562946 560092 557029 554139 551658 550149 550242 551726 553100 552468
52430E52468l397n198n253m113k660j150M65J799K190J570N79k63r64j486j414
$$ 552468 549071 543873 538620 534507 531847 530697 531162 532961 535151 536721 537300 537037 536073 534587 533173
52415E33173o60Q5J84R3P76K295L630L949L456K814K325J920J554J313J343J798
$$ 533173 532513 532598 532782 532875 533651 535946 539576 543525 546981 549795 552120 554040 555594 556907 558250 560048
52399E60048K486K665J705J48n87J19J225J329K73j084k204l119l692l511k687
$$ 560048 562534 565199 566904 567052 566465 566584 567809 569138 569411 568327 566123 563004 559312 555801 553114
52384E53114j975j912k318k791l114l005k114o32N97R82Q51P57N92m1q81j143
$$ 553114 551139 549227 546909 544118 541004 537999 535885 535253 535850 536832 537683 538440 539032 538991 538110 536967
52368E36967p01l63p58j407j365n23K86N06P44K035M334O212O229M471K366J217
$$ 536967 536266 535903 535145 533738 532373 531850 532136 532642 533386 535421 539755 545967 552196 556667 559033 560250
$$ [...]
##END NTUPLES=NMR SPECTRUM
##END=
