
##TITLE=UV1134_M4-1010-1000_6275194_EanHfBuagE
##JCAMPDX= 6.0         $$ Bruker NMR JCAMP-DX V2.0
##DATA TYPE= NMR SPECTRUM
##DATA CLASS= NTUPLES
##ORIGIN= BRUKER
##OWNER= Administrator
$$ 1.72 TOPSPIN		Version 2.1
$$ 2012-06-03 00:53:45.031 -0500  Administrator@TOPSPIN
$$ Compression mode = diff/dup
##.OBSERVE FREQUENCY= 400.13188235
##.OBSERVE NUCLEUS= ^1H
##.ACQUISITION MODE= SIMULTANEOUS (DQD)
##.ACQUISITION SCHEME= undefined
##.AVERAGES= 8
##.DIGITISER RES= 22
##SPECTROMETER/DATA SYSTEM= spect
##.PULSE SEQUENCE= zg30
##.SOLVENT NAME= COFFEE_meoh
##.SHIFT REFERENCE= INTERNAL, COFFEE_meoh, 1, 14.98061
##AUDIT TRAIL= $$ (NUMBER, WHEN, WHO, WHERE, PROCESS, VERSION, WHAT)
$$ ##TITLE= Audit trail, TOPSPIN		Version 2.1
$$ ##JCAMPDX= 5.01
$$ ##ORIGIN= Bruker BioSpin GmbH
$$ ##OWNER= Administrator
$$ $$ C:\Bruker\TOPSPIN/data/COFFEE/nmr/UV1134_M4-1010-1000_6275194_EanHfBuagE/10/pdata/1/auditp.txt
$$ ##AUDIT TRAIL=  $$ (NUMBER, WHEN, WHO, WHERE, PROCESS, VERSION, WHAT)
(   1,<2012-06-03 00:53:31.000 -0500>,<Administrator>,<TOPSPIN>,<go>,<TOPSPIN 2.1>,
      <created by zg
	started at 2012-06-03 00:52:22.234 -0500,
	POWCHK enabled, PULCHK disabled,
       configuration hash MD5:
       D5 CA 7A 23 FE 6B EE E2 50 67 74 61 24 F7 5E 3B
       data hash MD5: 64K
       4C B4 F4 96 56 4D D4 DF 43 79 B3 44 5D 79 43 EB>)
(   2,<2012-06-03 00:53:40.328 -0500>,<Administrator>,<TOPSPIN>,<proc1d>,<TOPSPIN 2.1>,
      <Start of raw data processing
       efp LB = 0 FT_mod = 6 PKNL = 1 PHC0 = 0 PHC1 = 0 SI = 32K 
       data hash MD5: 32K
       B5 50 9F AE C7 D1 40 E3 75 57 B8 21 95 DE 4D FE>)
(   3,<2012-06-03 00:53:40.984 -0500>,<Administrator>,<TOPSPIN>,<proc1d>,<TOPSPIN 2.1>,
      <pk PHC0 = 212.2833 PHC1 = 0 
       data hash MD5: 32K
       69 41 05 F1 E5 8A D4 CC CC 34 FC 6B 2B D8 64 C4>)
(   4,<2012-06-03 00:53:41.234 -0500>,<Administrator>,<TOPSPIN>,<proc1d>,<TOPSPIN 2.1>,
      <abs ABSG = 1 
       data hash MD5: 32K
       72 14 06 73 A3 B3 E5 86 8A 29 93 C4 1A 44 F1 77>)
(   5,<2012-06-03 00:53:41.265 -0500>,<Administrator>,<TOPSPIN>,<proc1d>,<TOPSPIN 2.1>,
      <abs ABSG = 2 
       data hash MD5: 32K
       05 AC 6C 80 A6 02 7F 16 BF 40 01 9E AD 10 B2 35>)
(   6,<2012-06-03 00:53:41.296 -0500>,<Administrator>,<TOPSPIN>,<proc1d>,<TOPSPIN 2.1>,
      <abs ABSG = 3 
       data hash MD5: 32K
       67 FE 07 FF 31 5A AB 3A 22 4C 15 DA 85 E2 E9 4B>)
(   7,<2012-06-03 00:53:41.328 -0500>,<Administrator>,<TOPSPIN>,<proc1d>,<TOPSPIN 2.1>,
      <abs ABSG = 4 
       data hash MD5: 32K
       BB CC 66 E1 A6 7A DB 6A F3 AA 8E DB DA 06 32 42>)
(   8,<2012-06-03 00:53:41.359 -0500>,<Administrator>,<TOPSPIN>,<proc1d>,<TOPSPIN 2.1>,
      <abs ABSG = 5 
       data hash MD5: 32K
       15 A2 6A 76 14 0B C6 56 F0 6E 58 51 66 09 55 C9>)
$$ ##END=
$$ 
$$ $$ hash MD5
$$ $$ CA B1 C8 28 5B 72 C1 3E 00 AF 68 AD 6F 0C C4 5A
##$RELAX= 
##$RELAX= 
##$RELAX= 
##$RELAX= 
##$RELAX= 
##$RELAX= 
##$RELAX= 
$$ Bruker specific parameters
$$ --------------------------
$$ [...]
##$TP= (0..7)
150 150 150 150 150 150 150 150
##$TP07= 0
##$TPNAME0= <>
##$TPNAME1= <>
##$TPNAME2= <>
##$TPNAME3= <>
##$TPNAME4= <>
##$TPNAME5= <>
##$TPNAME6= <>
##$TPNAME7= <>
##$TPOAL= (0..7)
0.5 0.5 0.5 0.5 0.5 0.5 0.5 0.5
##$TPOFFS= (0..7)
0 0 0 0 0 0 0 0
##$TUNHIN= 0
##$TUNHOUT= 0
##$TUNXOUT= 0
##$USERA1= <user>
##$USERA2= <user>
##$USERA3= <user>
##$USERA4= <user>
##$USERA5= <user>
##$V9= 5
##$VALIST= <valist>
##$VCLIST= <CCCCCCCCCCCCCCC>
##$VD= 0
##$VDLIST= <DDDDDDDDDDDDDDD>
##$VPLIST= <PPPPPPPPPPPPPPP>
##$VTLIST= <TTTTTTTTTTTTTTT>
##$WBST= 2048
##$WBSW= 25
##$XGAIN= (0..3)
0 0 0 0
##$XL= 0
##$YL= 0
##$YMAX_a= 535128
##$YMIN_a= -639984
##$ZGOPTNS= <>
##$ZL1= 120
##$ZL2= 120
##$ZL3= 120
##$ZL4= 120
##$ABSF1= 14.98061
##$ABSF2= -5.57192
##$ABSG= 5
##$ABSL= 3
##$ALPHA= 0
##$AQORDER= 0
##$ASSFAC= 0
##$ASSFACI= 0
##$ASSFACX= 0
##$ASSWID= 0
##$AUNMP= <proc_prof1d_extract_pilot.lims>
##$AXLEFT= 0
##$AXNAME= <>
##$AXNUC= <1H>
##$AXRIGHT= 0
##$AXTYPE= 0
##$AXUNIT= <>
##$AZFE= 0.1
##$AZFW= 0.1
##$BCFW= 0
##$BC_mod= 0
##$BYTORDP= 0
##$COROFFS= 0
##$CY= 15
##$DATMOD= 1
##$DC= 0
##$DFILT= <>
##$DTYPP= 0
##$F1P= 0
##$F2P= 0
##$FCOR= 0.5
##$FTSIZE= 32768
##$FT_mod= 6
##$GAMMA= 0
##$GB= 0
##$INTBC= 1
##$INTSCL= 1
##$ISEN= 128
##$LB= 0
##$LEV0= 0
##$LPBIN= 0
##$MAXI= 10000
##$MC2= 0
##$MEAN= 0
##$ME_mod= 0
##$MI= 0
##$NCOEF= 0
##$NC_proc= -8
##$NLEV= 6
##$NOISF1= 0
##$NOISF2= 0
##$NSP= 0
##$NTH_PI= 0
##$NZP= 0
##$OFFSET= 14.98061
##$PC= 1
##$PHC0= 212.2833
##$PHC1= 0
##$PH_mod= 1
##$PKNL= yes
##$PPARMOD= 0
##$PPDIAG= 0
##$PPIPTYP= 0
##$PPMPNUM= 2147483647
##$PPRESOL= 1
##$PSCAL= 4
##$PSIGN= 0
##$PYNMP= <proc.py>
##$REVERSE= no
##$SF= 400.13
##$SI= 32768
##$SIGF1= 0
##$SIGF2= 0
##$SINO= 400
##$SIOLD= 32768
##$SPECTYP= <>
##$SREGLST= <1H.CDCl3>
##$SSB= 0
##$STSI= 32768
##$STSR= 0
##$SW_p= 8223.68421052632
##$SYMM= 0
##$S_DEV= 0
##$TDeff= 65536
##$TDoff= 0
##$TI= <>
##$TILT= no
##$TM1= 0
##$TM2= 0
##$TOPLEV= 0
##$USERP1= <user>
##$USERP2= <user>
##$USERP3= <user>
##$USERP4= <user>
##$USERP5= <user>
##$WDW= 1
##$XDIM= 32768
##$YMAX_p= 463749708
##$YMIN_p= -684104
##$CURPLOT= <Network HP LaserJet P1505>
##$CURPRIN= <$Network HP LaserJet P1505>
##$DFORMAT= <normdp>
##$LAYOUT= <+/1D_H.xwp>
##$LFORMAT= <normlp>
##$PFORMAT= <normpl>
##$SURQMSG= 1
$$ End of Bruker specific parameters
$$ ---------------------------------
##NTUPLES= NMR SPECTRUM
##VAR_NAME=  FREQUENCY,     SPECTRUM/REAL,   SPECTRUM/IMAG
##SYMBOL=    X,             R,               I
##VAR_TYPE=  INDEPENDENT,   DEPENDENT,       DEPENDENT
##VAR_FORM=  AFFN,          ASDF,            ASDF
##VAR_DIM=   32768,         32768,           32768
##UNITS=     HZ,            ARBITRARY UNITS, ARBITRARY UNITS
##FACTOR=    0.250966925370066, 1,           1
##FIRST=     8223.43324360095, 232349,       54065
##LAST=      0,             27530,           922
##MIN=       0,             -684104,         0
##MAX=       8223.43324360095, 463749708,    0
$$ Real data points
##PAGE= N=1
##DATA TABLE= (X++(R..R)), XYDATA
$$ [...]
19559a57977c5765j01538q8113B82752c23228J13243Q0111k8933E1907a64348
19548a33538r086A59889o3036f1687m7702o2781f4626B009g431A57954a42947
19536b07307a1895k9650l9316I2409K6576N4594a48367G9912c1874j5607j17927
19525a65408k27053A8329a00062c0768j35951f5040K9661A17443D2875P7381a49171
19513a46500E1187a24117e9336I8302a94047L6587j46964J41506E7960i8521c6402
19501a90328l47905E179a21257B28925q4438F6169b55567b9026A37167R7012b52758
19489A29642f2473n6933N947i579I8429e7888A25488h8590j8326j28596B69889
19477c2548m2642q7112g6782l18060H254c58235N7265d0920j94960A47148k3406
$$ y = [-157977, -35765, -137303, -225416, 282752, -323228, -209985, -129874, -158807, 51907, -164348, -133538, -142624, 159889, 96853, -61687, -109389, -172170, -64626, 2009, -7431, 157954, -142947, -207307, -11895, -41545, -80861, 92409, 118985, 173579, -148367, 79912, -31874, -47481, -165408, -392461, 18329, -100062, -30768, -166719, -65040, -35379, 117443, 42875, 120256, -149171, -146500, 51187, -124117, -59336, 98302, -194047, -157460, -304424, -162918, 57960, -98521, -36402, -190328, -538233, 5179, -121257, 228925, 144487, 66169, -255567, -29026, 137167, 234179, -252758, 129642, -62473, -119406, -113459, -9579, 98429, -57888, 125488, -88590, -106916, -235512, 269889, -32548, -75190, -162302, -76782, -394842, 8254, -358235, -300970, -40920, -235880, 147148, 123742]
19466A23742a25414C20098a45636G5281a00260A19491e9013k72247J42126j98674
19456c87808B11542j04384i612j08932k5353E7226i9169A97723c23536C0740a65191
19444D6379e4639H1480P8445C2869b69354n3815a26699A07821J75247D5513O113
19433E1626K3351k348P6381J24233J29770b14287j5806f7295D6099e8744m80198
19422e38942a20475I9357D9198i4718q1318Q2992j92767Q5046g5656C43983j67545
19411A76438a70317d4204B3002a78341c4231o4148l6903f4902F0715r658b64006
19399g4543a7404j82011j34941a02625n8270e0584p5395j45204J02936b0948E9750
19387A58010p2969K5719h2377j24929H5973m1989a17365K9612a9954k8225j53227
$$ y = [123742, -125414, 320098, -145636, 75281, -100260, 119491, -59013, -331260, -189134, -387808, 211542, 107158, -9612, -118544, -143897, 57226, -99169, 197723, -323536, 30740, -165191, 46379, -54639, 81480, 159925, 32869, -269354, -323169, -126699, 107821, 283068, 45513, 51626, 74977, 72629, 149010, 273243, 403013, -214287, -230093, -67295, 46099, -58744, -538942, -120475, 99357, 49198, -94718, -176036, -93044, -285811, -200765, -75656, 343983, 176438, -170317, -44204, 23002, -178341, -34231, -98379, -135282, -64902, 60715, 51057, -264006, -74543, -17404, -199415, -334356, -102625, -160895, -50584, -125979, -271183, -168247, -20948, 59750, 158010, 85041, 110760, -82377, -207306, 85973, 43984, -117365, -87753, -19954, -48179, -201406]
19376b01406E0528b57483A64357o0671L5710a38545I0191D4220b50831j47320
19366c98151a82010D0281c1813A5352a58075c9451J4497a1047j30359f3240E4537
19354a4779k18284A05386b65243k35714b17554D08750A23066a63377B62980g9528
19343c31632B62741a30647A59739b30705G3963b2678j38409e5695C39258j12626
19333B26632C5561a38827A49340c5671j8700j39410A51253E8739K00890a9469
19322c17581m5478A3536P2417b48357A19933P657l5827J53840g1857f958F7628
19310h5734I6537b30670K6874j7869n0513A91977c39280j0908a06761K96D1942
19298F5657a78702a6838B0704D679R853a14541m7662f2081E9662a46627P2987
$$ y = [-201406, 50528, -257483, 164357, 103686, 139396, -138545, 90191, 44220, -250831, -398151, -182010, 40281, -31813, 15352, -158075, -39451, -24954, -11047, -141406, -63240, 54537, -14779, -233063, 105386, -265243, -500957, -217554, 408750, 123066, -163377, 262980, -79528, -331632, 262741, -130647, 159739, -230705, 73963, -22678, -161087, -55695, 339258, 226632, 35561, -138827, 149340, -35671, -54371, -193781, 151253, 58739, 259629, -19469, -317581, -363059, 13536, 85953, -248357, 119933, 127590, 91763, 245603, -71857, -6958, 67628, -85734, 96537, -230670, -203796, -221665, -272178, 191977, -339280, -350188, -106761, -106465, 41942, 65657, -178702, -16838, 20704, 4679, 14532, -114541, -162203, -62081, 59662, -146627, -73640]
19287g3640j33723q746R9384J1948r5105g7388B31778a66460f3561P801k04819
19276b60579C7403h090j13367A33012h4370q5302l05245b7105E5595a62703j63371
19265c26074a59357c5410q3589j61345B34589d9461o9384k1909j68715A29637
19254e6446j93112C4892b35311F829k715M2172g4512D9974e6984J0547j03185
19243a49622A20795a12069N3052j47337O5753f7549B89654A42487d4775k37534
19233b82309O2486A10824a79977F1351b2106l19875r4345a20346C0384c01400
19222G2896l1936a97690Q8742b1713r7526F1655R4697b28159J03819K5110A80569
19210A16042E0921K24580F0446a2232A71260b84333a33011k16802g2132D94415
$$ y = [-73640, -207363, -216109, -116725, -104777, -199882, -77388, 231778, -166460, -63561, -55760, -260579, 37403, -8090, -121457, 133012, -84370, -169672, -474917, -27105, 55595, -162703, -326074, -159357, -35410, -118999, -280344, 234589, -49461, -118845, -140754, -309469, 129637, -56446, -249558, 34892, -235311, 6829, 4114, 46286, -74512, 49974, -56984, -46437, -149622, 120795, -112069, -59017, -206354, -140601, -67549, 289654, 142487, -44775, -282309, -219823, 110824, -179977, 61351, -22106, -341981, -436326, -120346, 30384, -301400, 72896, 40960, -197690, -108948, -21713, -119239, 61655, 156352, -228159, -124340, -99230, 180569, 116042, 50921, 275501, 60446, -12232, 171260, -284333, -133011, -349813, -72132, 494415]
19199d8569a7769j32609r2668J8232L1638L8658b9993b988D06863A96734f8425
19187b37503G0090e8C6543b07178k14214h4925k0229j26184I8437b2606n9098
19176h1704M0760J8950j25917G0623a95364B60479a75741j165A01197b64746A39882
19164f7641j33828N2902D8600G950R8874M1048a58625m4635j79382A60552b8342
19152B0606J2637b54772R2000N1949D09655G2969K56762d75473Q5761A36970n8736
19141G8234b3254d029A6721J84527a12597D7918K5747Q3600f1256k71130e107
19129a7883Q305j96847A0197b79913J02534E0378j1966a90198b9467j43695B14371
19117I8326P4394c1050p5849K6211n2391d138k48469q766I9517h670l1001E9358
$$ y = [-48569, -17769, -150378, -243046, -224814, -193176, -154518, -29993, -2988, 406863, 196734, -68425, -237503, 70090, -58, 36543, -207178, -421392, -84925, -105154, -231338, 98437, -22606, -81704, -40944, -21994, -147911, 70623, -195364, 260479, -175741, -176906, 101197, -264746, 139882, -67641, -201469, -148567, 48600, 7950, 106824, 147872, -158625, -203260, -382642, 160552, -28342, 20606, 33243, -254772, -162772, -110823, 409655, 72969, 329731, -475473, -389712, 136970, 78234, -23254, -4029, 16721, 201248, -112597, 47918, 73665, 157265, -61256, -332386, -5107, -17883, -9578, -206425, 10197, -279913, -177379, 50378, 38412, -190198, -29467, -173162, 214371, 98326, 172720, -31050, -106899, -80688, -133079, -4138, -252607, -261373, 99517, -8670, -39671, 59358]
19104a5376k98788B05180b13006A1033a05608B97137G1608a54440B12379c0390
19093B17032i6423j76497g3543n3480e8337j19161b8627B57630B5927P1152b23912
19081e116j96257P8979D1621e5114b3391A26773D3384b73405A9990f8378D6341
19069E5643K14306a81217d1867k53886D5960A2197a42181b1636f641F9339B0423
19057a19496C29087C3593a10869j56071B98414a99707g8980B5348e6658k0912
19047g7570A33480a30817G7153J51523f1599R362j03716k35602c9288j62706j08573
19036c10567G4198b71271E1326J57916D5142a64393A86672p8512b75166A8234
19025a48651j59261A25659C6324a44426J0516f0553k9936B07145G0764e20923
$$ y = [-15376, -314164, 205180, -213006, 11033, -105608, 297137, 71608, -154440, 212379, -30390, 217032, -96423, -272920, -73543, -127023, -58337, -177498, -28627, 257630, 25927, 97079, -223912, -5116, -201373, -122394, 41621, -55114, -23391, 126773, 43384, -273405, 19990, -68378, 46341, 55643, 269949, -181217, -41867, -295753, 45960, 12197, -142181, -21636, -6641, 69339, 20423, -119496, 329087, 33593, -110869, -266940, 298414, -199707, -78980, 25348, -56658, -77570, 133480, -130817, 77153, 228676, -61599, -52237, -155953, -391555, -39288, -201994, -310567, 74198, -271271, 51326, 209242, 45142, -164393, 186672, 108160, -275166, 18234, -148651, -307912, 125659, 36324, -144426, -133910, -60553, -90489, 207145, 70764, -520923]
19014a19271C2608N3396B7661a2297n7772H9770a22122n3528B0921a5730o6719
19003h2449A03586m7685J03254b60618F2177f1108G7638b01602f770p659b476
18991E8606L8918a90446A81076b01492i2169j67922i5287A11100C0057c79063
18980b73573D6695b80320J33443A24430c23804J23158C6220b057A74078i6366
18969a63329f6522A4475d2888j14620l8389G68Q3881a50537k27883A27842b40670
18957A04219h6804B45751k1989F6119M357b86974a9003k35809f5699j7760m702
18946h8161m7146A55166b31601a4321m04k11265j01377A46973J18391b08084j9852
18935b27936G6945a81782A4803L6268g028A89754o0972E3177J83786o6217H3670
$$ y = [-119271, 32608, 86004, 27661, -12297, -70069, 89770, -122122, -175650, 20921, -15730, -82449, 103586, 55901, 159155, -260618, 62177, -61108, 77638, -201602, -6770, -14429, -2476, 58606, 97524, -190446, 181076, -201492, -92169, -260091, -95287, 111100, 30057, -379063, -273573, 46695, -280320, -146877, 124430, -323804, -200646, 36220, -2057, 174078, -96366, -163329, -66522, 14475, -42888, -157508, -195897, 768, 84649, -150537, -378420, 127842, -240670, 104219, -86804, 245751, 223762, 66119, 70476, -286974, -19003, -254812, -65699, -83459, -88161, -135307, 155166, -231601, -14321, -14725, -225990, -327367, 146973, 265364, -208084, -227936, 76945, -181782, 14803, 51071, -7028, 189754, 128782, 53177, 236963, 170746, 83670]
18923b60699R3503e1247l1178A33192j9995E1064d1192E3092L5562N785c78145
18911e6009A55292a31993B81298b2573O681B69697h5888A02785b88845J27783
18901a61062c690n6225j05618O2503k45957g5535j6423J8649j48625q675k3516
18890b54125h7149j87138D6732j3846L7104R5486c74158a09227A44464i3418a0131
18878e0306C3978A5319i1480c3278I6689c06076H953b72102D2714M0295h748A05422
18865e8969k45673A56053a89869B58557F1961e9926D6899b91450B6616L78802
18855D05418a5201k05580F8460c1580j09535H4339c48165A15136b48487H5178
18844B70558F3291J30739Q3202p4232b9387C26206A579c4658m2362G0107c8886
$$ y = [-260699, -167196, -51247, -82425, 133192, 113197, 51064, -41192, 53092, 88654, 94439, -378145, -56009, 155292, -131993, 281298, -22573, -15892, 269697, -85888, 102785, -288845, -161062, -3690, -59915, -165533, -103030, -348987, -75535, -91958, -73309, -221934, -230609, -254125, -87149, -274287, 46732, 32886, 69990, 165476, -374158, -109227, 144464, -93418, -10131, -50306, 33978, 15319, -91480, -33278, 96689, -306076, 8953, -272102, 42714, 83009, -8748, 105422, -58969, -304642, 156053, -189869, 258557, 61961, -59926, 46899, -291450, 26616, 405418, -15201, -220781, 68460, -31580, -141115, 84339, -348165, 115136, -248487, 85178, 270558, 63291, 194030, 277232, 203000, -29387, 326206, 1579, -34658, -77020, 70107, -38886]
18832a50154B36094H1087i4014m10741h0541p213r5137h9235A68807p8710h0690
18820a86746j48618Q5327M8128c4079A48704c01006a46662k8710D8328O8918a10189
18808b5690r3077k0032C5601K42397c6276l6671E9209O9858J3913F0591a9701
18796B34686D5779b09187E294M7395Q0776o5607Q3606Q7166r4470b07985G7757
18784a05841j7850H9203a46515B66193a05140H9908a44835C01070c09934I7843
18773b38173B1085a12078k5360b964j92819j17262J48925k247O7539c5535G6312
18761b71278J428B5622O6109a62767Q0966d012k5326A0825C232O6526F868J45062
18749A51930f36387a32743o0632b6481j67345b8925A50755k0448a71938r3458
$$ y = [-150154, 236094, 81087, -94014, -504755, -80541, -87754, -182891, -89235, 168807, 90097, -80690, -186746, -335364, -250037, -201909, -34079, 148704, -301006, -146662, -175372, 48328, 117246, -110189, -25690, -118767, -138799, 35601, 277998, -36276, -72947, 59209, 129067, 142980, 60591, -19701, 234686, 45779, -209187, 5294, 52689, 133465, 67858, 151464, 238630, 144160, -207985, 77757, -105841, -123691, 89203, -146515, 266193, -105140, 89908, -144835, 301070, -309934, 97843, -238173, 21085, -112078, -137438, -2964, -195783, -313045, -164120, -166367, -98828, -35535, 76312, -271278, -269850, 25622, 91731, -162767, -81801, -4012, -29338, 10825, 3232, 69758, 6868, 151930, -636387, -132743, -193375, -26481, -193826, -28925, 150755, 130307, -171938, -265396]
18739b65396r9992L7443B11330i7083j95860k9562J36659P5721c3442F8622c8764
18727C53485b62955O4100C22516a38537k35897G1486k5420e9353E5815L1900a93277
18715i7894A52590h9520k10815A68624b18238h3730o600I1155g0706A04791f2401
18703H4888L4516a46560g0316o5674o6618A42472b42289A59578a43746A70092
18692b88210M0584B52621c46975B357a66620q5341A58486B3427J54316b93276
18681a8257k16016J9969F1966a09017B03502h3520A16412L3780G203a736q0598
18670h2334c8910j9890k4676A17101C9307A3262P3359c50112A75201d4242D4530
18658b11441h5007d885H6030f0484C10368a35960K7918i109k57979g9737r641
$$ y = [-265396, -365388, -327945, 211330, -97083, -292943, -322505, -185846, -110125, -33442, 68622, -38764, 353485, -262955, -198855, 322516, -138537, -374434, 71486, 46066, -59353, 55815, 87715, -193277, -97894, 152590, -89520, -300335, 168624, -218238, -83730, -90330, 91155, -70706, 104791, -62401, 84888, 119404, -146560, -70316, -135990, -202608, 142472, -242289, 159578, -143746, 170092, -288210, -247626, 252621, -346975, 2357, -166620, -251961, 158486, 23427, 177743, -293276, -18257, -234273, -214304, 61966, -109017, 203502, -83520, 116412, 150192, 7203, -1736, -82334, -38910, -58800, -83476, 117101, 39307, 13262, 86621, -350112, 175201, -44242, 44530, -211441, -85007, -4885, 86030, -60484, 310368, -135960, -108042, -9109, -267088, -79737, -89378]
18647h9378j20336m6867d8626k1217k19134I3140C9112b64527c536j55611j15076
18636b74223R0934D6464f976B5687a28030N1996A54861G5049h2849p9579B6544
18624A44267a40198N3694o099j32884n4429a15432A43492b14756B4935Q128J87127
18613B20190b39395D0368d36789A36362N3730d11572a64019A77501F1322a58661
18602A25201L5777g0030I7506g4038k60682P8208R3804A69914A9744b87275I4432
18590A30369k5832b88739I1138K1788g8720a1069A13545a02482d5653n7389B44774
18578d3215j87525G7756b24516A58316i9494j23000E9089b59500c8851G5665J00507
18567A76172b29141F9986a42168A98217I6188K37783H6748f940j44555d6616n021
$$ y = [-89378, -209714, -256581, -48626, -69843, -288977, 93140, 39112, -264527, -3536, -159147, -274223, -183289, 46464, -6976, 25687, -128030, -76034, 154861, 75049, -82849, -162428, 26544, 144267, -140198, -86504, -92603, -225487, -279916, -115432, 143492, -214756, 24935, 33063, 220190, -239395, 40368, -436789, 136362, 190092, -411572, -164019, 177501, 61322, -158661, 125201, 160978, -70030, 97506, -74038, -334720, -256512, -162708, 169914, 19744, -287275, 94432, 130369, 104537, -288739, 91138, 112926, -78720, -11069, 113545, -102482, -45653, -103042, 244774, -43215, -230740, 77756, -224516, 158316, -99494, -222494, 59089, -259500, -38851, 75665, 176172, -229141, 69986, -142168, 198217, 96188, 333971, 86748, -6940, -151495, -46616, -51637]
18556e1637j7440k76083B3108h2516p3809m4419A15786m1482g4219E7796a06608
18544G9509L1351E3460b19178O9105b3927j83519A99388b94020k01232H8159e2416
18532f7654q8886B24788A02670a74804j91857D1475K07485I3329c28013M1538
18522b86475D4388a13906G3079k8031a4760j50379D1614j5841J39770a63054B05356
18510d4372n2895m7513M8370d163B01068C1088K4422k945b14561R2683f527l08475
18498c15002f3381l72124b3865A7650d8546J4720r6271J3331j9691j52754P8614
18487b10597j45545d6064j56454d741E4265a38526l6285A8152J94734m2347a75035
18475A76860a28035B2782L2782J15132N5323a57762M0929j89734D5380nb60785
$$ y = [-51637, -69077, -345160, 23108, -82516, -156325, -200744, 115786, 74304, -74219, 57796, -106608, 79509, 110860, 53460, -219178, -150073, -23927, -207446, 199388, -294020, -495252, 88159, -52416, -67654, -156540, 224788, 102670, -174804, -366661, 41475, 248960, 93329, -328013, -286475, 44388, -113906, 73079, 45048, -14760, -165139, 41614, 25773, 165543, -163054, 205356, -44372, -97267, -144780, -96410, -4163, 201068, 31088, 55510, 52565, -214561, -121878, -6527, -315002, -63381, -435505, -23865, 17650, -48546, -33826, -130097, -116766, -136457, -289211, -210597, -356142, -46064, -202518, -4741, 54265, -138526, -174811, 18152, 212886, 170539, -175035, 176860, -128035, 22782, 55564, 170696, 226019, -157762, -116833, -306567, 45380, 45375, -260785]
18463a5350A60485A8216a23731q6671B2675b01726C09278B2878R2077m0438a02519
18451A56827K54270A60976g9306E123L7182O8399a834j01915l7877L8254B367
18439b0690F9075K05831a59373P8728F8698b96545a38877j30826c6603E6516f282
18427b60735m3844d3112H9776g5878a5712A5090a51912j96636I5380c5074A79795
18415b62120o8998C0896a38492J3329k03117d1988a7643j24121j34662L8719F2833
18403E0513b22570a657l20114A56464A7304a02153a8820p0612D235a05652j57238
18392b62890b1984j74947L1984J2903C4952L985a14695J5963C2496a67544b5015
18380A1360c01717J01106J2807f0841k51801j4966A21975j7444c94719Q4439f7294
$$ y = [-15350, 160485, 18216, -123731, -210402, 22675, -201726, 309278, 22878, 114955, 74517, -102519, 156827, 411097, 160976, -79306, 5123, 42305, 110704, -1834, -103749, -141626, -103372, 2367, -20690, 69075, 274906, -159373, -80645, 68698, -296545, -138877, -269703, -36603, 56516, -6282, -260735, -304579, -43112, 89776, -75878, -15712, 15090, -151912, -348548, 95380, -35074, 179795, -262120, -331118, 30896, -138492, -125163, -328280, -41988, -17643, -141764, -276426, -237707, 62833, 50513, -222570, -1657, -321771, 156464, 17304, -102153, -18820, -89432, 4235, -105652, -262890, -21984, -196931, -164947, -152044, 34952, 38937, -114695, -98732, 32496, -167544, -25015, 11360, -301717, -200611, -187804, -60841, -312642, -327608, 121975, 104531, -394719, -310280, -67294]
18368B13735i3259a8504j8273i343B88767b04737c2628D4230a50984o5543B18002
18356a91937f8709n0127j92973J40968B71646l0829a59289E2508a74324c6829
18345c7287C5103N0645P5891A5361J37597b54780h7177D7321a04718b1665M373
18334a7292I0453M6044a2896F5230b14236d2998j95841h5806B1271c29749b6315
18322g0815n7687L586N7165B01321E8977g8575o755i427C1705a48657N0994l71909
18310d69572g0941m1738e2169p6112B11071D0222M7280c9318j33591a3870r979
18299b3849j69551O7398p287j63048G5374b9766j90616J00922e2886j52409H8788
18287B14074a35336D51650a34917j03760P9212p4751a9084m41204C29474a30975
$$ y = [213735, -93259, -18504, -36777, -9343, 288767, -204737, -32628, 44230, -150984, -216527, 218002, -191937, -68709, -118836, -311809, -170841, 271646, 240817, -159289, 52508, -174324, -36829, -37287, 35103, 85748, 161639, 15361, 152958, -254780, -87177, 47321, -104718, -21665, -17292, 90453, 136497, -12896, 65230, -214236, -42998, -238839, -85806, 21271, -329749, -26315, -70815, -128502, -124916, -67751, 201321, 58977, -78575, -85330, -9427, 31705, -148657, -97663, -469572, -70941, -112679, -52169, -128281, 211071, 40222, 87502, -39318, -172909, -13870, -23849, -193400, -126002, -133289, -296337, 75374, -29766, -220382, -119460, -52886, -205295, 88788, 214074, -135336, 451650, -134917, -238677, -159465, -234216, -19084, -460288, 329474, -130975]
18276b91052i6441A90062p2990J43919m2762b32200B43587b59230A02313e6230
18265b27764A39953a584k20860f3351j36846k67705a00440A75829h3032A42508
18254A04424a27922J8867A01583d38180H9901n827a6170M3E7723R0227g9194E2066
18241c12748D4020c02175E3883r82g7921A22964B3053M896L0695B0132e4038k46249
18229c00287d144A8907e5664C34913G7719a0326I9887g7366b083A24151B7593
18217A6179R1356a69212j72880d8411C1017d87440b33851b7692j53193g7644C58948
18205a48059q6839A71155b76647f7947j77335J07554A58648J13667l4590k6198
18195B11527b19322A51566L9975H5571b29923e5330r0609A79564a68540b0391
$$ y = [-291052, -96441, 190062, 117072, 260991, 218229, -232200, 243587, -259230, 102313, -56230, -227764, 139953, -1584, -222444, -63351, -200197, -467902, -100440, 175829, -83032, 142508, 104424, -127922, -109055, 101583, -438180, 89901, 84074, -16170, -16127, 57723, 147950, -79194, 52066, -312748, 44020, -302175, 53883, 52901, -77921, 122964, 23053, 27949, 58644, 20132, -54038, -300287, -4144, 18907, -55664, 334913, 77719, -10326, 99887, -77366, -2083, 124151, 27593, 16179, 107535, -169212, -342092, -48411, 31017, -487440, -233851, -27692, -180885, -77644, 358948, -148059, -234898, 171155, -276647, -67947, -245282, -137728, 158648, 272315, 237725, 211527, -219322, 151566, 191541, 85571, -229923, -55330, -145939, 179564, -168540, -20391]
18184h2647l15140a24083j20746H3212a06740o8130P9682A96880b13091B4168
18173a06596A56418K13430a54980j04508C8030g2448k568j74445P4321P5145A35501
18161i957A15193f3321l8029K8630A30309e9888B29609D5552K7840c10695a39153
18149H0628A2976i4847I5707P9772a84040H4311e8964A62219a95573e4770B12126
18137A17873E8317b48759D1118J54710D0314K56529B2303b30724A19536L0840
18127A50376a40930K0253A75468b19946D7574j1215b4913j1086k5845I7190a75831
18115i5927r6330M1788n33635B41937n7999c24488H1309n578f3416a4272G0243
18103g3221C38618F2897a28549q0651k03583d6551A949a25364d0166k46380B33052
$$ y = [-82647, -397787, -124083, -244829, 83212, -106740, -174870, -95188, 196880, -213091, 24168, -106596, 156418, 369848, -154980, -259488, 38030, -72448, -75016, -249461, -175140, -99995, 135501, -9957, 115193, -63321, -101350, -72720, 130309, -59888, 229609, 45552, 73392, -310695, -139153, 80628, 12976, -94847, 95707, 175479, -184040, 84311, -58964, 162219, -195573, -54770, 212126, 117873, 58317, -248759, 41118, 195828, 40314, 296843, 22303, -230724, 119536, 150376, -140930, -120677, 175468, -219946, 47574, 36359, -24913, -35999, -61844, 97190, -175831, -95927, -192257, -150469, -684104, 241937, 183938, -324488, 81309, 75731, -63416, -14272, 70243, -73221, 338618, 62897, -128549, -209200, -412783, -46551, 1949, -125364, -40166, -286546, 233052]
18091d3266r269A3365b35037j14443C4717b60705e6348a142I0273l2696Q5465
18080A43042e2391G8269A8070j223b6239k09350a7986k59179E2579K309b4095
18068D4523a86695A18179f6079a0107B34370B6125J2338b69712L5159L9118E2587
18056b7033B34458H6155b58541A10455j3032J28503b106j98362A19525b13342
18045A2517R533f0461A23615a41454j75857A51729B6400K5515e7127n5183j41958
18034b54268i0170j59413A88306b3906A03072f9856a6976E390a32742n5376E3626
18022B28183a35290j46142A67142d2955a6348j29542l3329A22493K1559a12154
18011a16025p9777l11653a2338B22187K97064A96568A3269m403J34201n4981c51165
$$ y = [-43266, -52535, 13365, -235037, -349480, 34717, -260705, -56348, -1142, 90273, 57577, 143042, -52391, 78269, 18070, 16847, -26239, -235589, -17986, -277165, 52579, 54888, -24095, 44523, -186695, 118179, -66079, -10107, 234370, 26125, 38463, -269712, -234553, -195435, 52587, -27033, 234458, 86155, -258541, 110455, 97423, 225926, -2106, -200468, 119525, -213342, 12517, 22050, -60461, 123615, -141454, -317311, 151729, 26400, 51915, -57127, -112310, -254268, -90170, -249583, 188306, -23906, 103072, -69856, -16976, 5390, -132742, -188118, 53626, 228183, -135290, -281432, 167142, -42955, -16348, -145890, -179219, 122493, 144052, -112154, -116025, -195802, -507455, -12338, 222187, 519251, 196568, 13269, 8866, 143067, 88086, -351165]
17999D0540j8515a44193o147J8933k70962A23779N6300M6521P0862b36590H937
17987B75905b35319e6741r3574d2609j75022B69461F1339P6829a22639B09653
17976b799k72492I284b93497G9843N6292b03045b0416o4902c159F0662B1803M78395
17964E00198A28203a9541A37975B2855M0799f4212B1860J8278K4652a2397H7311
17952B54552G4714R6773d2841A6181n189b23285a1623j40728j30492c3058B0308
17940a51268f1148n7227G6542J17794a9869j85272E2543a01823A1135b75197I303
17928a15413A44501a83705d4761C43665A65431h5518E3108a56078l19670a49464
17917F920c2296D7642M3539e19629D6770c9317B52398b38649G5246K7203O8313
$$ y = [40540, 22025, -144193, -150340, -131407, -402369, 123779, 180079, 226600, 297462, -236590, 8937, 275905, -235319, -56741, -150315, -42609, -217631, 269461, 61339, 138168, -122639, 209653, -2799, -275291, 9284, -293497, 79843, 136135, -203045, -20416, -85318, -3159, 60662, 21803, 500198, 128203, -19541, 137975, 22855, 63654, -64212, 21860, 40138, 64790, -12397, 87311, 254552, 74714, 171487, -42841, 16181, 10992, -223285, -11623, -152351, -282843, -33058, 20308, -151268, -61148, -118375, 76542, 194336, -19869, -205141, 52543, -101823, 11135, -275197, 9303, -115413, 144501, -183705, -44761, 343665, 165431, -85518, 53108, -156078, -475748, -149464, 6920, -32296, 47642, 91181, -519629, 46770, -39317, 252398, -238649, 75246, 102449, 170762]
17906A70762g387a274C2523a40479C78811A476J2071i3761H2830a41487c1996
17894b8519B96404a62997A79579f0417j5523C6840g3216c2028l2486l088F9865
17882A24429b2740A48200P3714b7895C19933j55163a91616f3887q1857j78261
17872c24005J61062P3681B09811c02491A10617J1477a38586B04546b63687e8834
17861A51681b63977A277h7263C06883e2738j39231D3700N876e6480H8654a45426
17849c040F7a7411C72356j53800c6971m4794F4988j5183c12850P8056R4440M3667
17837i6687A15401J17754E2187b36488b5342m2144A78659b11918m6925Q2470P5068
17826a01305A21804b65554a10874a3338A05120h7510L1089B15383a68275A56068
$$ y = [170762, -7387, -1274, 32523, -140479, 378811, 1476, 13547, -93761, 82830, -141487, -31996, -28519, 296404, -162997, 179579, -60417, -75940, 36840, -73216, -32028, -64514, -67602, 69865, 124429, -22740, 148200, 221914, -27895, 319933, 164770, -191616, -63887, -145744, -324005, -162943, -89262, 209811, -302491, 110617, 122094, -138586, 204546, -263687, -58834, 151681, -263977, 1277, -87263, 306883, -52738, -191969, 43700, 49576, -56480, 88654, -145426, -3040, 67, -17411, 372356, 218556, -36971, -81765, 64988, 49805, -312850, -234794, -140354, -96687, 115401, 233155, 52187, -236488, -25342, -67486, 178659, -211918, -258843, -176373, -101305, 121804, -265554, -110874, -13338, 105120, -87510, -56421, 215383, -168275, 156068]
17815C26071E7079J85847F0610M2856a20211B1113K02196p6588B0359K64529a42148
17803e0771g73A70115i3958D8349a88787B17578p8835g995k0298C89527H3720
17791A991J43436J24321n7133Q8135A03919a03487A94687A548J45353l465h5020
17779a67129D2537E05J102J33612a67283n0730A12567j8236a93567A57864a23831
17767A63080E1018a24396r8790C13459i082B16946a24920A17797a72952A18752
17756A374a19430A96894K20198a57417g3502p8831A3060a55367A23068Q9152a19438
17744G2454a42056J1932B45945c02710J48461L1718a2314A2949b4998p6661k64615
17733c66274D7365a36286j56746a7695G5758O437J96397p1119r2993a40759d2288
$$ y = [326071, 57079, 242926, 60610, 103466, -120211, 21113, 223309, 146721, 20359, 284888, -142148, -50771, -773, 170115, -93958, 48349, -188787, 217578, 138743, -7995, -28293, 389527, 83720, 1991, 145427, 269748, 212615, 300750, 103919, -103487, 194687, 1548, 146901, 143436, -85020, -167129, 42537, 505, 1607, 135219, -167283, -218013, 112567, 94331, -193567, 157864, -123831, 163080, 51018, -124396, -223186, 313459, -9082, 216946, -124920, 117797, -172952, 118752, 1374, -119430, 196894, 417092, -157417, -73502, -152333, 13060, -155367, 123068, 212220, -119438, 72454, -142056, -130124, 245945, -302710, -154249, -122531, -12314, 12949, -24998, -101659, -366274, 47365, -136286, -293032, -17695, 75758, 82195, 278592, 207473, 114480, -140759, -42288]
17721b7725m6236A57369f9855A28055C2315N2565c39032g5386D2912G749J92223
17710A99972b12120g7046A27235b94037C4612b48881i3483A86441G3985c6029
17699A11878d7361C94329G1689i6249k02601M1507m99n267H6475g6696D10673
17687a90682I6626l0824M1192K36736E9713A3112e2806G070c9673F4605b00378
17675D2832Q9596a20923E4168J5025P9898f7136o6365B17319a00j23638o9464
17664a93202l8093L0515g9154A29191b5119A97547C5631e6853C31676e8736F8684
17652d2078A1941M5772a08854j39901d5245I8529L03627f015q8400k5946k84678
17641d05039g869A76262a94976h1882E7124L21456b02123r1140E0412A2865a15871
$$ y = [-27725, -73961, 157369, -69855, 128055, 32315, 84880, -339032, -75386, 42912, 7749, 199972, -212120, -77046, 127235, -294037, 34612, -248881, -93483, 186441, 73985, -36029, 111878, -47361, 394329, 71689, -96249, -298850, -257343, -257842, -263109, 86475, -76696, 410673, -190682, 96626, 65802, 106994, 343730, 59713, 13112, -52806, 7070, -39673, 64605, -200378, 42832, 132428, -120923, 54168, 69193, 149091, -67136, -133501, 217319, -100, -123738, -193202, -231295, -200780, -79154, 129191, -25119, 197547, 35631, -56853, 331676, -58736, 68684, -42078, 11941, 57713, -108854, -248755, -45245, 98529, 402156, -6015, -94415, -120361, -405039, -7869, 176262, -194976, -81882, 57124, 378580, -202123, -293263, 50412, 12865, -115871]
17629a18738j28250G1570b77337B10673b5724j63175A6088N13341a72621B72388
17618A83378a6017C09808f6494J6459C14637b08099A22718Q2611G2403J19319
17608A91722a55318B8726a664m4812l14985c741j99940R7742a1007B11106F2995
17596B5030a73326A55337J42553c0936I508K28395F656c5403C87746D5921E431
17584E1583K46567c29101a56965D3138c513j30776D8253e8948J4308B58661f040
17572A28962a25077F6027i377B59353I3443c0787k5727C70682h965B44357H3991
17560A2195K00766m3469p6026N8577F5847e3646n9051E0939O9007B5232O0190
17549H5422a9839B41285K9025d0588A60525J39016a16897A13497L01355b77634
$$ y = [-118738, -246988, 71570, -277337, 210673, -25724, -188899, 16088, 529429, -172621, 272388, 183378, -16017, 309808, -66494, -50035, 314637, -208099, 122718, 205329, 72403, 191722, -155318, 28726, -1664, -46476, -361461, -3741, -203681, -105939, -11007, 211106, 62995, 25030, -173326, 155337, 297890, -30936, 9508, 237903, 6656, -35403, 387746, 45921, 5431, 51583, 298150, -329101, -156965, 43138, -3513, -134289, 48253, -58948, -44640, 258661, -6040, 128962, -125077, 66027, -9377, 259353, 93443, -30787, -56514, 370682, -8965, 244357, 83991, 12195, 212961, 169492, 93466, 152043, 65847, -53646, -112697, 50939, 119946, 25232, 85422, -19839, 241285, 270310, -40588, 160525, 299541, -116897, 113497, 414852, -277634]
17538B00979J46212l0586A18600c7344j29297m8840A48844a60778a1983N124B061
17526A20426Q3567G9536b8047C9462L05882C6928a18080B52319a07992p0746B40550
17514C53406a62891C19964H6112J53402H3665M9030J78309J03247A33890J17591
17504B51481J38896d4400k0828g330A79716G6566C6647H625a17100A25125D0064
17492G0701k3981B2299K41288Q6561j58232D5669K17083a19492B2116a07978B59867
17480a40506c430a562I3297D1481a67649A48559o2461J19727g919m8991A83970
17468A85023h6185A98624G4050J96472a09723n2705P9736A72824k2257P5191g3049
17456C13112D1982i8494A08343C8674K25175L1002A9503J4917i8247A15649J1699
$$ y = [200979, 347191, 316605, 118600, -37344, -166641, -215481, 148844, -160778, -11983, -6859, 2061, 120426, 203993, 79536, -28047, 39462, 345344, 36928, -118080, 252319, -107992, -178738, 240550, 353406, -162891, 319964, 86112, 239514, 83665, 132695, 311004, 414251, 133890, 251481, 390377, -44400, -65228, -7330, 179716, 76566, 36647, 8625, -117100, 125125, 40064, 70701, 46720, 22299, 263587, 350148, 191916, 45669, 262752, -119492, 22116, -107978, 259867, -140506, -3430, -1562, 93297, 41481, -167649, 148559, 86098, 205825, -7919, -56910, 183970, 185023, -86185, 198624, 74050, 270522, -109723, -162428, -82692, 172824, 150567, 225758, -73049, 313112, 41982, -98494, 108343, 38674, 263849, 294851, 19503, 34420, -98247, 115649, 127348]
17445A27348J04945p1682J02357H7365K12599l753a5998C58708E2406L52323A42586
17433A85328c844A49222M4038p3799m8849J42856L8291P6686Q0252J4108j4350
17422D08455a8055A93915J9415J14165A32204L46445j76787N4118j19326k7262
17412B09392J91482j03085E8453J10200P5143L616Q5685b1398A83879K27041A01013
17400a53012B61040m6426J50450n0015o9127q1425K8960J94401c5405n9527C84879
17388B26976q5535K052L0685H5511K31765A1467K0390J72366r8711M2109e0660
17376a68048A00488K38511a30531L6378B32983a13624A93467A4040J88819b7843
17365C04719q7168j04961K3355M61600B47692J0160B8394L21620A12103m9202
$$ y = [127348, 232293, 160611, 262968, 87365, 299964, 296211, -15998, 358708, 52406, 404729, 142586, 185328, -3844, 149222, 193260, 119461, 70612, 213468, 251759, 328445, 408697, 422805, 408455, -18055, 193915, 213330, 327495, 132204, 478649, 301862, 355980, 236654, 209392, 400874, 297789, 58453, 168653, 243796, 247412, 333097, -21398, 183879, 410920, 101013, -153012, 261040, 214614, 365064, 315049, 245922, 164497, 193457, 387858, -35405, -94932, 384879, 226976, 141441, 143493, 174178, 85511, 317276, 11467, 31857, 204223, 105512, 147621, -50660, -168048, 100488, 338999, -130531, -94153, 232983, -113624, 193467, 14040, 202859, -27843, 304719, 217551, 112590, 135945, 597545, 247692, 257852, 28394, 350014, 112103, 62901]
17355F2901K72346H7567B7551f4325k12251G4967h0092c3362B90a23190G8575
17343D1635K47265f3074C0422L93434A98876F6466J38643N0640P183a5435A36240
17331I5813c8636D20106A26106O4282q4970K0575B4100M16978A31739o5819J62376
17320B28296b1413n6637r6093C39137o2461j23877k5855F274O8399J8621m4210
17309D9084J51796j748l6237G8973E388J63129O1282a21221a5138O682E46601
17297D5886L21618A37123R7641Q440A18657k3452j5133K55786r116H1938J65018
17286B46956p2721K85215d6755D2549j1342e083D8390L88273A26086J6727a65814
17274B24828f4192p514C47594j65424O688R7995l4547I0549R9366o8523N6723
$$ y = [62901, 335247, 87567, 27551, -64325, -276576, 74967, -80092, -33362, 290, -123190, 78575, 41635, 288900, -63074, 30422, 423856, 198876, 66466, 205109, 255749, 262932, -15435, 136240, 95813, -38636, 420106, 126106, 190388, 105418, 125993, 24100, 441078, 131739, 65920, 228296, -21413, -78050, -174143, 339137, 276676, 152799, 126944, 6274, 74673, 93294, 49084, 200880, 199132, 162895, 78973, 5388, 168517, 229799, -121221, -15138, -8456, 546601, 45886, 367504, 137123, 234764, 243204, 118657, 95205, 80072, 335858, 326742, 81938, 246956, 174235, 459450, -46755, 42549, 31207, -5083, 48390, 436663, 126086, 142813, -165814, 224828, -64192, -71706, 347594, 182170, 188858, 286853, 252306, 90549, 189915, 121392, 178115]
17263A78115a851m8921j9342A51700e1009C10082Q908B7830d2360j22248a2331
17251A40420K1813h556A18416a31111B27667J54449A3438J86796k575J28791I9979
17239A26565Q4256Q1335J75647j93663a065E13615A15824P0676J17675o6708P3926
17228C11393A23014K88888M1178A44425Q555a1870A47816R7553L37557B87639
17217I6277C2562L5877L4284J97432H4759K66099A37292O4562K93850E7568a172
17205E9890e3173F9326L75123A72207C539M1541L1444L3621r356q122M20559A05732
17192C49294N7679F7239R2811J08095D0111J80904N2881J62386j88459L109D9947
17180A16182K63879A58933D9469L12369K0414J87542B47928m4490K1118E3857
$$ y = [178115, -1851, -50772, -70114, 151700, -51009, 310082, 318990, 27830, -42360, -164608, -12331, 140420, 162233, -8556, 118416, -131111, 227667, 382116, 13438, 200234, 197659, 326450, 99979, 126565, 210821, 292156, 467803, 274140, -1065, 513615, 115824, 186500, 304175, 237467, 311393, 123014, 411902, 453080, 144425, 152980, -11870, 147816, 245369, 582926, 287639, 96277, 32562, 68439, 102723, 300155, 84759, 350858, 137292, 201854, 495704, 57568, -1172, 59890, -53173, 69326, 444449, 172207, 3539, 45080, 76524, 110145, 100789, 92667, 513226, 105732, 349294, 406973, 67239, 160050, 268145, 40111, 221015, 273896, 436282, 247823, 250932, 49947, 116182, 380061, 158933, 49469, 361838, 382252, 569794, 247928, 203438, 224556, 53857]
17169D48330j48366m6074p7975K41492A22053J80122j39871K6703o2633K71986
17159C98360c7987D99582c33824C71705J03902B26155K71651A50892p582K61596
17149D04906o9361D2440L53396A00630J66972G0296L69282j60117Q4988o4593
17139B99856A21469K35058L0838j5262R8619j36325j36168J09253A13657j3219
17129A00438M62121B7641K59466p7122J33700j54508B3545K78295o4931G2438
17118D20929C9204K28976j4326J58779J01874B43374K71811k09709j44379e928
17107A45704K23390j67334J78356j59705K02608A87789J07737k8151J16442K2161
17097D05978j34431M83365k81357O0676J6780K72588C86721j68704N99322k65098
$$ y = [448330, 299964, 253890, 175915, 417407, 122053, 302175, 162304, 189007, 126374, 398360, -37987, 499582, -333824, 371705, 475607, 226155, 497806, 150892, 143310, 404906, 335545, 42440, 395836, 100630, 267602, 70296, 439578, 279461, 364449, 299856, 121469, 356527, 387365, 372103, 470722, 334397, 198229, 307482, 113657, 100438, 562559, 27641, 287107, 209985, 343685, 189177, 23545, 301840, 236909, 72438, 420929, 39204, 268180, 253854, 412633, 514507, 243374, 515185, 305476, 161097, -5928, 145704, 369094, 201760, 380116, 220411, 423019, 187789, 295526, 267375, 383817, 405978, 271547, 754912, 473555, 534231, 551011, 823599, 386721, 218017, 817339, 552241]
17087E52241B40554N0106j2757a539B81479J32000q8761J33155B7016J81864C8306
17075E63568B36803L2620K04118R981K89546k65463j85116J06825q5039j41286
17065B02989L85319k88037J49355k8715A67700Q9152J99897j95482K63987p7183
17055D48071L94131m06119n0133k8358N08727B87108p480K7121L81689C32363
17044C39584K69904j23022m3086o0515L55429j36468k55634p9418K69890J98259
17034G34923F4574N08220j44033j02136L24372o9539k56025M1506L17659j08606
17024E75992L04660l45517k05817M94447k35350q2183R380K19151l31309M04456
17014H07910k92277n5779m2150K40862J11107l62134J13175J25862Q723m2132
$$ y = [552241, 240554, 290660, 277903, -1539, 281479, 413479, 324718, 457873, 27016, 208880, 38306, 563568, 236803, 269423, 473541, 483522, 773068, 507605, 322489, 429314, 344275, 202989, 588308, 300271, 449626, 420911, 167700, 256852, 456749, 261267, 525254, 448071, 842202, 436083, 385950, 357592, 866319, 287108, 279628, 306749, 688438, 332363, 339584, 609488, 486466, 443380, 382865, 738294, 601826, 346192, 266774, 536664, 734923, 64574, 572794, 428761, 326625, 650997, 581458, 325433, 366939, 684598, 575992, 880652, 535135, 329318, 823765, 588415, 506232, 515612, 734763, 403454, 807910, 515633, 459854, 417704, 658566, 769673, 407539, 520714, 646576, 655299, 613167]
17004F13167j67862K26642o2513r884O249L36522j06669j0188j34722J62510J18616
16993I71868j65878l27626L25679l32361L56695p7583m8992J89O3063O3425C83780
16981F67088K1890L38007j36517k10067k57989L24151k8571j6362J20448J58928
16971I81006L8942k54292j00831k43203P4795J29337J70368r2227K9929J30344
16961H64168M410M6824q6514j3324k28660J31820J42197J46973k60277N67072
16951A314689E79531L72726j87275K49498P2091L7972P9940m83127k03856N91826
16941A109326P028j45802K11610r1919J24379j31219N4907j98194P9734J39459
16931A159309j95761J20098P1964P0822l67084J86475L7852J61905J06325R8521
$$ y = [613167, 445305, 671947, 609434, 599550, 605799, 942321, 835652, 825464, 690742, 853252, 971868, 805990, 478364, 804043, 471682, 828377, 750794, 701802, 701991, 765054, 828479, 383780, 667088, 688978, 1026985, 890468, 680401, 422412, 746563, 717992, 701630, 822078, 981006, 1019948, 765656, 664825, 421622, 496417, 625754, 796122, 703895, 733824, 864168, 868578, 915402, 828888, 815564, 586904, 718724, 860921, 1007894, 747617, 1314689, 579531, 952257, 764982, 1014480, 1086571, 1124543, 1204483, 721356, 517500, 1109326, 1116354, 970552, 1182162, 1090243, 1214622, 1083403, 1138310, 940116, 1019850, 1159309, 963548, 1083646, 1155610, 1226432, 859348, 1045823, 1083675, 1245580, 1351905, 1450426]
16921A450426p6057k91487Q5529Q4312r3047m8595O7989J92521M2509q8455j34990
16910A190655K25802L3857O7250L9218j0421J89341l53566L00196j38623l54923
16900A188786M26804j95556K76265j5272k36371J07982J4703m4581j03847K49087
16890A668000J3366j84450J37291j21755O4617K37850O7526k21466J77951m70986
16880A367944J64185O08219l22755J8626J46923k11696M50150l90686K21371K97189
16870B349470m69913J03224p6903M43580l7976N508J03738o85410O56143j16405
16860B275056J31858k01966L14689J09419l89952R817L95009l20232M07583P8922
16850B810203m10276m3689L67034j5963j2221M92887o35618L76030j40579N24356
$$ y = [1450426, 1374369, 1082882, 1168411, 1252723, 1159676, 1111081, 1179070, 1371591, 1414100, 1325645, 1190655, 1416457, 1450314, 1517564, 1556782, 1546361, 1735702, 1382136, 1682332, 1543709, 1188786, 1615590, 1420034, 1696299, 1681027, 1444656, 1552638, 1567341, 1522760, 1418913, 1668000, 1681366, 1496916, 1634207, 1512452, 1577069, 1814919, 1882445, 1660979, 1838930, 1367944, 1532129, 2140348, 1817593, 1836219, 1983142, 1771446, 2221596, 1830910, 2052281, 2349470, 1879557, 1982781, 1905878, 2349458, 2311482, 2316990, 2420728, 1735318, 2391461, 2275056, 2406914, 2204948, 2519637, 2629056, 2239104, 2248921, 2643930, 2323698, 2731281, 2810203, 2399927, 2356238, 2723272, 2707309, 2695088, 3187975, 2552357, 2928387, 2787808, 3312164]
16840C312164j61580m00657N48521j88118N0047J22226N7292J38057K43410k71058
16830C450304K47809j92815J95104k22904K78188L66148l6760k85978M8324J60356
16820D007776l6351j59849N71512j82396L33856L01101j39398O3644K1877j11571
16810D670201K78725L17836j60547L72501k02355L24798K9171J55058K43153M6726
16800F075267j98689N9158M26511m1807o1080K82052Q8411K81479L98912m4565
16790G265649K0174K25902L61281J20282j62691K82021M82916r3406L40623K68720
16780I111471p3133O19529R6244L49877K49331K58179L77911O4107J5087R45684
16770A2014287J81806L47447O10541K94315K49948N32370M76563M02565M46564
$$ y = [3312164, 3150584, 2749927, 3298448, 3110330, 3160377, 3282603, 3339895, 3477952, 3721362, 3450304, 3698113, 3505298, 3700402, 3477498, 3755686, 4121834, 4085074, 3799096, 3847420, 4007776, 3971425, 3811576, 4383088, 4200692, 4534548, 4835649, 4696251, 4759895, 4781772, 4670201, 4948926, 5266762, 5106215, 5478716, 5276361, 5601159, 5630330, 5785388, 6028541, 6075267, 5876578, 5935736, 6362247, 6320440, 6259360, 6541412, 6629823, 6911302, 7310214, 7265649, 7285823, 7511725, 7873006, 7993288, 7830597, 8112618, 8595534, 8502128, 8842751, 9111471, 9038338, 9657867, 9754111, 10103988, 10353319, 10611498, 10989409, 11053516, 11068603, 12014287, 12196093, 12543540, 13154081, 13448396, 13698344, 14230714, 14707277, 15109842, 15556406]
16761A5556406L05884Q15221P33835Q28693N07371N00641P12886R18273R91706
16752B1870916O09732L99329R35856J391668R03475Q62942J608070J111437J021775
16743C0715200J755523J430404K080525J395994J662004J827290K276433K339067
16735D5482440K477076K278189K974934L017206K882122L767304L694850M091674
16727G0665795M582017M190143N195206N186040N792672O166075O827118O903858
16719A15508924P259633P523109Q095523Q214652Q404775Q112394Q298530P713976
16711A79131516P466185O559093N487335M722422L149453J840845L40917q58640
16703B07839126k695330l789841n191052n800123o784659p453529p860455q056745
$$ y = [15556406, 15862290, 16677511, 17411346, 18240039, 18747410, 19248051, 19960937, 20879210, 21870916, 22480648, 22879977, 23815833, 25207501, 26110976, 26973918, 28581988, 29693425, 30715200, 32470723, 33901127, 35981652, 37377646, 39039650, 40866940, 43143373, 45482440, 47959516, 50237705, 53212639, 56229845, 59111967, 62879271, 66574121, 70665795, 75247812, 79437955, 84633161, 89819201, 95611873, 101777948, 108605066, 115508924, 122768557, 130291666, 138387189, 146601841, 155006616, 163119010, 171417540, 179131516, 186597701, 193156794, 198644129, 203366551, 206516004, 208356849, 208697766, 207839126, 205143796, 201353955, 196162903, 190362780, 183578121, 176124592, 168264137, 160207392]
16695A60207392q348090q469048q221928p767817p859761p086677o902977o442045
16687I9109049o365908n744256n362928m956375m615578m241448l934238l955116
16679E9933202l651544l493698k691272k819872k314530k657675k149041k412146
16671C7743424j799506j776964j762904j328510j624634j642997j217072r18557
16663B5672280j198806j032230r77330r35612q74595q24738q61090q97730l66877
16654A7703272r17637l15044n53233q90257l74924o65423j00548p96432K5773
16645A3115547n61030o23535n17106L552m85445k82844n58652j89255m50662k3189
16635I427381k25245j98127n74577l0406m98916p2219k48811L7198k81752m26026
$$ y = [160207392, 151859302, 143390254, 135168326, 127400509, 119540748, 112454071, 105551094, 99109049, 92743141, 86998885, 81635957, 76679582, 72064004, 67822556, 63888318, 59933202, 56281658, 52787960, 50096688, 47276816, 44962286, 42304611, 40155570, 37743424, 35943918, 34166954, 32404050, 31075540, 29450906, 27807909, 26590837, 25672280, 24473474, 23441244, 22463914, 21528302, 20653707, 19828969, 18967879, 18070149, 17703272, 16785635, 16470591, 15917358, 15027101, 14652177, 13986754, 13886206, 13089774, 13115547, 12554517, 11930982, 11413876, 11417428, 10931983, 10649139, 10090487, 9901232, 9450570, 9427381, 9202136, 9004009, 8429432, 8399026, 7900110, 7827891, 7579080, 7616278, 7334526, 6908500]
16625F908500K60474l17588m95967J56732l99090N4609k15503p9771l45437J01009
16615E627968l89960p6663p4126o6829j58913j37843Q2388j25085n27110L96070
16605D549897J7591n61261L17564k91414j67126K21615j55166N6876l54271Q0558
16595C714863J09493m52053q3390J27865k69460K10326m16799n6172K77296j3539
16585C148430l40806J67733L6953q7406k5891K51301n89267n2662l9194j63116
16575B306075K5435M56585o77256N2944K43029k85923J91514j87719J53623j49214
16565B129093k09116L65868l19507J94722l8677l9915j65124K4893J30294m37851
16555A634680N35179n00131L89174l31874m1358j18830J38594k13525N47388m28072
$$ y = [6908500, 7168974, 6851386, 6355419, 6512151, 6113061, 6167670, 5952167, 5872396, 5526959, 5627968, 5238008, 5161345, 5087219, 5020390, 4861477, 4723634, 4806022, 4680937, 4153827, 4549897, 4567488, 4006227, 4323791, 4032377, 3865251, 4086866, 3931700, 3988576, 3634305, 3714863, 3824356, 3372303, 3288913, 3416778, 3147318, 3357644, 2940845, 2884673, 3161969, 3148430, 2807624, 2975357, 3012310, 2924904, 2899013, 3150314, 2561047, 2508385, 2469191, 2306075, 2331510, 2788095, 2110839, 2163783, 2406812, 2120889, 2312403, 2124684, 2278307, 2129093, 1919977, 2285845, 1966338, 2161060, 2122383, 2082468, 1917344, 1942237, 2072531, 1634680, 2169859, 1669728, 2058902, 1727028, 1685670, 1566840, 1705434, 1491909, 2039297, 1611225]
16545A611225k7776k64343K50324k15015L6397M96474m16570J09601k43795P6087
16535A412609J86104m27943O30710o22922L40271k86590J55420K1187j8552l30003
16525A060291O2585L2277k82595L13362J86585j73689j61865K3159K51782M6237
16515A358129l60108M5792p7274j3730K09144l15654L08403m39824M15241j20084
16505A010035O5273j31003n9508o7873J7215k42721J76323N53787k41172j97161
16495H83195k75422L26531l99296L96941j48155l3041j98444J49169K72289m46007
16485E27760n394K98267l56959M37872j20286j11660j04592m6692K4325O4653
16475F07294q8103J75549Q0601l0601n1724k6364J69842K6940j46243q6717L7471
$$ y = [1611225, 1583449, 1319106, 1569430, 1354415, 1390812, 1887286, 1470716, 1580317, 1336522, 1412609, 1598713, 1170770, 1801480, 1178558, 1518829, 1232239, 1387659, 1408846, 1390294, 1060291, 1122876, 1155153, 872558, 1185920, 1372505, 1198816, 1036951, 1060110, 1311892, 1358129, 998021, 1043813, 966539, 952809, 1161953, 846299, 1154702, 714878, 1130119, 1010035, 1075308, 944305, 884797, 816924, 834139, 591418, 767741, 1321528, 1080356, 883195, 607773, 934304, 535008, 931949, 783794, 750753, 552309, 701478, 973767, 527760, 522366, 820633, 463674, 901546, 781260, 669600, 565008, 518316, 542641, 607294, 519191, 694740, 775341, 744740, 693016, 666652, 836494, 863434, 717191, 630474, 667945]
16464F67945Q4452k42436L99178k07543j30596M1343J58827j0324k89041P7820
16454E49625j96906L75995l07250k1535K889L57535C22476K27767j67505J26048
16444E08786P3499j70609A08893K18285A19371M52337q8471K0454B00847K16041
16434D16888F1798O62723l27270L6699P3747j79373j36989O8848A08532P1681
16424A80213R2422j07093K14356L04341C30661J9554K81529l13151L9138n5531
16414C02200J03759K5882j28938j7522J33378B03655K98500j76417k3875A44719
16403D57482m3639i1480D02931K73980k37175K6473n8562L6178j20394G8182K90218
16392C68400P1300p7341o6032G7441K46544l8984l9422j08472M03392B17452P3798
$$ y = [667945, 752397, 509961, 909139, 701596, 571000, 612343, 771170, 760846, 471805, 549625, 352719, 728714, 421464, 399929, 402818, 760353, 322476, 550243, 382738, 508786, 582285, 411676, 108893, 327178, 119371, 571708, 483237, 503691, 200847, 416888, 61798, 724521, 397251, 433950, 507697, 328324, 191335, 260183, 108532, 180213, 272635, 165542, 379898, 684239, 330661, 350215, 631744, 318593, 357731, 302200, 405959, 431841, 302903, 285381, 418759, 203655, 502155, 325738, 301863, 144719, 457482, 413843, -91480, 402931, 676911, 439736, 466209, 407647, 443825, 323431, 78182, 368400, 439700, 362359, 296327, 77441, 323985, 285001, 245579, 137107, 540499, 217452, 291250]
16381B91250K00402A63652L01123L6007q0189A51738K79438j47269q6211K14432
16371D12128A67316E0351J34776K50484A38596d2969C07338r9867H1685L50913
16361D32598j93563N8121a17237A78480n4670K04043N8808F1631N04068A66869
16350E03085B11684r3396J53711p5855J64802p0232H019L22039e4176A54964J18605
16339B73569A09464J05297G6185K27523f3812A22434a1596B94617j00718M8644
16329B42543J34723d20677C8512M85N05975k41587C7408i291E84682A61359C6686
16317A02316L87230a99530E6341K41022j38568e4802D81134c3565A46554l1822
16307A14732m1617R3064a86701I1034K538a45119G6854c45234C0808R3357j1488
$$ y = [291250, 491652, 163652, 464775, 500782, 420593, 151738, 431176, 283907, 197696, 412128, 167316, 50351, 185127, 435611, 138596, -42969, 307338, 207471, 81685, 432598, 239035, 297156, -117237, 178480, 123810, 327853, 386661, 61631, 565699, 166869, 503085, 211684, 118288, 271999, 196144, 360946, 290714, 8019, 330058, -54176, 154964, 273569, 109464, 214761, 76185, 303708, -63812, 122434, -11596, 294617, 193899, 242543, 377266, -420677, 38512, 38997, 544972, 303385, 37408, -9291, 584682, 161359, 36686, 102316, 489546, -199530, 56341, 297363, 158795, -54802, 481134, -33565, 146554, 114732, 73115, 166179, -186701, 91034, 93572, -145119, 76854, -345234, 30808, 124165, 112677]
16296A12677b42993C12306M1332J1440I4932B8633J7867a14637D33432k09887
16286B23545C7953J06666J31602d1181n933j01859H9797K06670F4015A7285a36496
16274b6938A35624l2556c8743D9032K8684J75634J10740A37411K2027e8530A24277
16262C75219a47733A02100J03512O265e956D77804a28078F9636e956A67586F8369
16250B812c79520e5459k3704I6956a30477a5017D811K72734K04091j35689o588
16239C39359A05014O8796a28050I5750K42047a71815f6142D70948A12282j8603
16229I3679g2381A90435J58105f9863a0213A98117h1868B96166j44492L003c49210
16217f8002D9201J04643f2371n8541H3184K67080b4181r4721m9299B35597J2643
$$ y = [112677, -242993, 312306, 353638, 365078, 94932, 28633, 46500, -114637, 433432, 223545, 37953, 144619, 276221, -41181, -47114, -148973, 89797, 296467, 64015, 17285, -136496, -26938, 135624, 103068, -38743, 49032, 77716, 253350, 364090, 137411, 159438, -58530, 124277, 375219, -147733, 102100, 205612, 211877, -5956, 477804, -128078, 69636, -5956, 167586, 68369, 2812, -379520, -55459, -79163, 96956, -130477, -15017, 4811, 277545, 481636, 345947, 339359, 105014, 173810, -128050, 95750, 337797, -171815, -66142, 470948, 112282, 93679, -72381, 190435, 348540, -69863, -10213, 198117, -81868, 296166, 151674, 154677, -349210, -68002, 49201, 153844, -62371, -120912, 83184, 350264, -24181, -118902, -168201, 235597, 248240]
16206B48240E0938b06448A66175h2616B04145J30029a93351D2830i1373B11635
16195A11550P9566o9641D0486K88536r4217a34613L0994e1264j20718A58470a24055
16183b26882N5033A18764B7291M1057b18785o496P8735A28154J30809H6649r309
16172G7340B1557L96868a93432Q6016d911J217A38767m8075a14862R601A43814
16160A3578e8233o3276A11405c9055J4134r3608L1091B03283c66181D2765Q0434
16149A23199k0713b76276M4010n2232i989m7758k5033A22472f7748j7988A49361
16137a95560k8240C47954e1916q9810e1090J737n9622J1805k12801A59042B7022
16125b02652A28788E2308i9440r8096A04976K13818d3923p0167j0138j68516j37656
$$ y = [248240, 50938, -206448, 166175, -82616, 204145, 334174, -193351, 42830, -91373, 211635, 111550, 191116, 121475, 40486, 329022, 234805, -134613, -103619, -51264, -171982, 158470, -124055, -226882, -171849, 118764, 27291, 68348, -218785, -225281, -146546, 128154, 258963, 86649, 77340, 21557, 418425, -193432, -107416, -4911, -3694, 138767, 90692, -114862, -105261, 143814, 13578, -58233, -121509, 111405, -39055, -24921, -118529, -87438, 203283, -366181, 42765, 123199, 102486, -276276, -232266, -284498, -9989, -57747, -82780, 122472, -67748, -85736, 149361, -195560, -223800, 347954, -51916, -141726, -51090, -49353, -108975, -97170, -309971, 159042, 27022, -202652, 128788, 52308, -99440, -197536, 104976, 318794, -43923, -114090, -124228, -292744, -430400]
16114d30400J48809a38781G6770a06663J7568M0833p9803a6384k04008J03730
16104a16662J6616r1039F4570J15206l6161D3289M5424b3907A37869a37137C9248
16092b75140P0600R3764E6703J3638M3160K63772A70044a27352j3184B87155a90802
16080B03370J34273F8073a17713H7927B8348a91673L5259r4285N5143A58654a49811
16068b66387A60534b71593I8057A6529i1431d1160N061j19666J7585A72817b6918
16056B43030f0079b2163I3046g9170C21541p6205D7816b45581a095D3809b12007
16044g2632G0058c9371J6569m0822A75833b04855F2014b58870A5732b41882Q0594
16033a61288O5668B23951o5300g3013L2700j59981j14684B34233O9882j36953
$$ y = [-430400, -281591, -138781, 76770, -106663, -89095, -48262, -128065, -16384, -220392, -116662, -100046, -191085, 64570, 179776, 143615, 43289, 88713, -23907, 137869, -137137, 39248, -275140, -204540, -110776, 56703, 70341, 113501, 377273, 170044, -127352, -140536, 287155, -190802, 203370, 337643, 68073, -117713, 87927, 28348, -191673, -156414, -250699, -195556, 158654, -149811, -266387, 160534, -271593, 98057, 16529, -91431, -41160, -36099, -155765, -138180, 172817, -26918, 243030, -60079, -22163, 93046, -79170, 321541, 245336, 47816, -245581, -1095, 43809, -212007, -72632, 70058, -39371, -22802, -63624, 175833, -204855, 62014, -258870, 15732, -241882, -161288, -95620, 223951, 158651, -73013, -40313, -200294, -314978, 234233, 304115, 167162]
16023A67162d2599B78643h2313P472N647B7270J9241b1714A98419Q2102D2065
16011a14647b3061E0902R9681C9345L08290c3276I0802o638a73955A05929c14903
15999i5846j00290A54785b87125O7078H0534K11412a97460R07f0102B25850r4850
15988A31000B9556A097J49268L3111e2517k9248F0186b91183c8944j27933E5254
15976I0154a45276k41384J70268N0582g9738r535A53998A5591g3413A37794J80142
15965C17936J7682H3035J87668a12687A9112P0144a58011A51997a97360R8364
15955i8996p8887A52859b86652R7951E4711N1041a300A15286J17897D4941J05058
15944A49999a78944c16I6549K18958g6632j46030B31833B5304b56701a02105B51047
$$ y = [167162, -42599, 278643, -82313, -74841, -69194, 27270, 46511, -21714, 198419, 280521, 42065, -114647, -23061, 50902, 150583, 39345, 347635, -33276, 90802, 84164, -173955, 105929, -314903, -95846, -196136, 154785, -287125, -220047, 80534, 291946, -197460, -196553, -60102, 225850, 131000, 29556, 1097, 150365, 183476, -52517, -81765, 60186, -291183, -38944, -166877, 55254, 90154, -145276, -386660, -216392, -165810, -79738, -89273, 153998, 15591, -73413, 137794, 317936, 335618, 83035, 270703, -112687, 19112, 89256, -158011, 151997, -197360, -98996, -177883, 152859, -286652, -188701, 54711, 105752, -1300, 115286, 233183, 44941, 149999, -178944, -316, 96549, 315507, -76632, -222662, 231833, 25304, -256701, -102105, 251047]
15932a08881E1098K12718a85449f579A70723e0538A23522J52051A19987b12013
15921c7020p8476M5230a7999p2758p9289a5374q6017j190n9316b0338l11826J48346
15909a83818B3428a57202B65339A23420O1667B3008b34026e7697B81348b59333
15898a19113j73306A46856B6080b39488N6930k53666A30084a32783a7302G338
15887b40016j88138G8746J41549a06600j0961D658K96983a15457b5182J2569o5143
15876g7756B94907G0152d7903A55656a45572e2436B66999g6340j1506m7354K457
15865a32743j80236b1483A22920a40373l4191I3832K4281b53197N4433D4514h3949
15853A53337a38406b9308C40608c19662B50548K3655a24845l68573A76083b18055
$$ y = [-108881, 51098, 263816, -185449, -6579, 170723, -50538, 123522, 275573, 119987, -212013, -37020, -115496, -70266, -17999, -90757, -170046, -15374, -101391, -102581, -161897, -20338, -332164, -183818, 23428, -157202, 265339, 123420, 185087, 23008, -234026, -57697, 281348, -259333, -119113, -292419, 146856, 26080, -239488, -182558, -436224, 130084, -132783, -17302, 7338, -240016, -428154, 78746, 220295, -106600, -117561, 4658, 301641, -115457, -25182, -12613, -77756, 294907, 70152, -47903, 155656, -145572, -52436, 266999, -76340, -87846, -135200, -132743, -312979, -21483, 122920, -140373, -174564, 93832, 118113, -253197, -198764, 44514, -83949, 153337, -138406, -29308, 340608, -319662, 250548, 274203, -124845, -493418, 176083, -218055]
15842a60001e4691D0385q762K40044c04948K5066A1894g051A7920Q0060B3864
15830b38407B71385a68914D3891b86166K0524P5936j9798n8958M2841I5592b53338
15818C1518b42907m0526a00741C38576b36649A04201b38408G9136e2952j69045
15808b21997A972J37618b74617c5869j63931A58551L822b00301b1070G5697b67428
15796a53593A20413c745A89654F3532d9200k251a941j74406B10745a87302I2597
15784A1787f8158n5016A13858J08851k1474a79050b3311j12213E264d01213Q7995
15773c13218A85958c687j423j42652p1352o9391O8630A97037g489C03670J24946
15762D28616a89227A24197b38583e062A19981b7874n6819j3157c3185j11143j01890
$$ y = [-160001, -54691, 40385, 31623, 271667, -304948, -279882, 11894, -7051, 17920, 97980, 23864, -238407, 271385, -168914, 43891, -286166, -265642, -189706, -209504, -268462, -225621, 95592, -253338, 31518, -242907, -283433, -100741, 338576, -236649, 104201, -238408, 79136, -52952, -221997, 1972, 139590, -274617, -35869, -199800, 158551, 162373, -200301, -21070, 75697, -267428, -153593, 120413, -3745, 189654, 63532, -49200, -51451, -1941, -176347, 210745, -187302, 92597, 11787, -68158, -123174, 113858, 222709, 201235, -179050, -23311, -135524, 5264, -401213, -313218, 185958, -3687, -5110, -147762, -219114, -288505, -219875, 197037, -7489, 303670, 428616, -189227, 124197, -238583, -5062, 119981, -27874, -84693, -97850, -33185, -144328, -246218]
15751b46218j51447a77969A07626J41162A02259a59327A62258a23010m9975P6905
15741i6080A32567o187K29263A26170a324A76096B5861L0124J44067r0853l6204
15730G2995h1505A35652C8988b03200D1396a82954q473D7650b02948J9506m203
15719a87645N1154e0660A17862O4148a62225L4440A9477i0274p5138C99686d5933
15707d1763j22171l7713R2363j09990R993r0938d7292B25404d4615o8955c6219
15695g1208G5308a1414l10739A82613a26272L2753D7679J89291b51703b5408k33204
15684b58612a14284B07302K89411C4349a4180I6609a55702C08279A4061a5253
15673B18307a76335L5421H9085O9067n7747f650k63235M2963A19756B4294R2360
$$ y = [-246218, -397665, -177969, 107626, 248788, 102259, -159327, 162258, -123010, -172985, -96080, 132567, 126380, 355643, 126170, -1324, 176096, 25861, 55985, 200052, 109199, 72995, -81505, 135652, 38988, -203200, 41396, -182954, -191427, 47650, -202948, -183442, -187645, -136491, -50660, 117862, 182010, -162225, -127785, 19477, -90274, -165412, 399686, -45933, -41763, -163934, -201647, -109284, -219274, -209281, -300219, -47292, 225404, -44615, -113570, -36219, -71208, 75308, -11414, -322153, 182613, -126272, -93519, 47679, 236970, -251703, -25408, -258612, -114284, 207302, 496713, 34349, -14180, 96609, -155702, 308279, 14061, -15253, 218307, -176335, -140914, 89085, 158152, 100405, -6650, -269885, -226922, 119756, 24294, 116654]
15662A16654b40400b6505j26129j15650B09872F6856e2521F2503J8467a8424n2047
15651g0471k0367k11310a14692J9355b8294A03602b90822e8275j55847D6114f3074
15639a91379n1658A54294b11027r1523A85901J22837B9179b8322m2484C117b33467
15627H4740P263a78311j8562f1954k00589e26j8101j57122L5434k7495e4518A39134
15614c66199J26147A01965c942B11014a97n0904C5129c1259k0034j85067n79A33727
15601B42569e0399A62814B6748C809K4871N1788O4949h2287A68499i2428J1907
15590h0521E5585k3156b37646A76692b4281j4813j04670A2830N9833L7888L76366
15579D86917b2651E2975J70573a00804A9617a09546G4975K38808a10809A29144
$$ y = [116654, -240400, -26505, -152634, -268284, 209872, 66856, -52521, 62503, 80970, -18424, -70471, -90838, -302148, -114692, -95337, -28294, 103602, -290822, -58275, -214122, 46114, -63074, -191379, -243037, 154294, -211027, -302550, 185901, 308738, 29179, -28322, -70806, 3117, -233467, 84740, 92003, -178311, -196873, -61954, -262543, -526, -18627, -175749, -140315, -167810, -54518, 139134, -366199, -240052, 101965, -3942, 211014, -197, -51101, 35129, -31259, -51293, -236360, -236939, 133727, 242569, -50399, 162814, 26748, 3809, 28680, 80468, 145417, -82287, 168499, -92428, -80521, 55585, 32429, -237646, 176692, -24281, -39094, -143764, 12830, 72663, 110551, 486917, -22651, 52975, 223548, -100804, 19617, -109546, 74975, 313783, -110809, 129144]
15568A39017b88410l1941K2589j0450O5907B31415d0423m7805m9528B76701g6875
15556b17572h9242k58288a30591N8754A8496b17524A00529a29889e4160k26834
15546b80994P2997h4356q3387B39315i0332j05115L7268A21573Q023C5308a59103
15534B92650a44561j00049A42121M833m6469a30702C6529J39601b37139h5797
15523A18374Q1893H9991l2257b32817A17173g7193j59872j38639B02941J45880
15513C48821c9383G1617J47266a95412B53609A21923a63883j9623M5189B67612
15502a93228i645m9237A63317b8263A91774a19867A39229f0322A78576a1946I9545
15490a47654I4112b34399F5405A8771b35549Q4053A80821d3668A03875g8994k75487
$$ y = [139017, -288410, -320351, -297762, -308212, -242305, 231415, -40423, -88228, -137756, 276701, -76875, -217572, -89242, -347530, -130591, -71837, 18496, -217524, 100529, -129889, -54160, -280994, -207997, -84356, -167743, 239315, -90332, -195447, -158179, 121573, 129596, 35308, -159103, 292650, -144561, -244610, 142121, 146954, 100485, -130702, 36529, 176130, -237139, -85797, 118374, 200267, 89991, 57734, -232817, 117173, -77193, -237065, -375704, 202941, 348821, -39383, 71617, 218883, -195412, 253609, 121923, -163883, -183506, -138317, 267612, -193228, -9645, -58882, 163317, -28263, 191774, -119867, 139229, -60322, 178576, -11946, 99545, -147654, 94112, -234399, 65405, 18771, -235549, -151496, 180821, -43668, 103875, -78994, -354481]
15479c54481a00150p5697r13A89293C9474K16573a05149A57778b5262o5866D9071
15467A7556J79234G715J09514m9373N8746a05631D22556a40448c601G0286Q2860
15456A53146J2046o9370m7662J56180a5572k76758A68358a73995A39529b99411
15445b53871e6666A31454c02903a6183G5191a10999P960C75323j47492H9933J76625
15434B66558q2419f310F3351a60068A02659a44727M1258K97J7965D1489b0601
15422C2265M6665a76357E6129d2600a3109H5175P2119j1180a30895F5057g9537
15410B9377P5513j6144K36035K3769I4111E083g959k52960D4439N4418b4410r5193
15398a19603k11701A49292o4911l0980P7136J70309j04003q6086a05k6017F9720
$$ y = [-354481, -100150, -175847, -176760, 189293, 39474, 256047, -105149, 157778, -25262, -91128, 49071, 17556, 196790, 7715, 117229, 67856, 126602, -105631, 422556, -140448, -3601, 70286, 153146, 165192, 95822, 48160, 204340, -15572, -292330, 168358, -173995, 139529, -299411, -253871, -56666, 131454, -302903, -16183, 75191, -110999, -103039, 375323, 227831, 89933, 266558, 184139, -6310, 63351, -160068, 102659, -144727, -103469, -103172, -85207, 41489, -20601, 32265, 78930, -176357, 56129, -42600, -13109, 85175, 157294, 146114, -130895, 65057, -79537, 29377, 104890, 88746, 324781, 348550, 94111, 5083, -7959, -260919, 44439, 98857, -24410, -119603, -331304, 149292, 84381, 53401, 130537, 300846, 196843, 110757, -105, -26122, 69720]
15386A0080e5129l2525B81808c8670P066j08494B30355H5128a5325F3095k0741
15375D2354L2913J49068b1985H4060J81192j28292C753g1639A57160b47643A92378
15363e4135j73507a5282k29635d5215A0210O3559a37929j4659C75711A27463B3349
15351G6440c4827o8168B15783a86786L337d1168C6189b346r6677F3469a36496
15339e4565l4734I2758j0516J06384a18332k06588f1236A52681c96244J71803
15329b24441B44343B1211d9538j39696a0250B56433A13905c22067F1132J18203
15319A79335J92898j65722I9818M4616J76359a56271N866l5315d8218K1189A62222
15307i3463k1912L7262B39682p5367G4954L5784a36969A13589K60103j69629F5775
$$ y = [10080, -55129, -87654, 281808, -38670, -31604, -140098, 230355, 85128, -15325, 63095, 42354, 75267, 224335, -21985, 84060, 265252, 136960, 3753, -71639, 157160, -247643, 192378, -54135, -227642, -15282, -244917, -45215, 10210, 73769, -137929, -152588, 375711, 127463, 23349, 76440, -34827, -102995, 215783, -186786, -183449, -41168, 36189, -2346, -99023, 63469, -136496, -54565, -89299, 92758, 82242, 188626, -118332, -324920, -61236, 152681, -396244, -224441, 244343, 21211, -49538, -189234, -10250, 256433, 113905, -322067, 61132, 179335, 372233, 206511, 99818, 144434, 320793, -156271, -150405, -185720, -48218, -27029, 162222, -93463, -115375, -78113, 239682, 164315, 74954, 110738, -136969, 113589, 373692, 204063, 65775]
15295D9690N9341b63048E8956L5213N4887c72676G9173e0769A03203b37291E8277
15283a34384A76038K59980a27235k51760J76059g110A85965b05868A54589E6788
15272A47316g4968C23670H9851d8167p4868C9593K40105H2128J30903N4466m3947
15261B23550F6344k4679Q9001M0949i8951B55454M3427I5756g6463K472j88293
15250b62284e8998p665A49286k5306b43853B48839o4218r2238K43725b0331A1216
15238C31325I3593K15938Q5680q9637J56544P18679j63664K20656K49275j23106
15228A363958E84534r963B55594L45139A59872b4206I9618l0067b71864C66709
15217B33320q5830C5313a0952B58185C6i048B23296b90637e9044A08959a41441
$$ y = [49690, 109031, -263048, 58956, 94169, 149056, -372676, 79173, -50769, 103203, -237291, 58277, -134384, 176038, 436018, -127235, -378995, -202936, -7110, 185965, -205868, 154589, 56788, 147316, -74968, 323670, 89851, -48167, -123035, 39593, 279698, 82128, 213031, 267497, 223550, 66344, 41665, 130666, 171615, -98951, 255454, 298881, 95756, -76463, -73991, -262284, -58998, -66663, 149286, 123980, -243853, 248839, 184621, 92383, 336108, -20331, 11216, 331325, 93593, 309531, 395211, 305574, 462118, 1180797, 1017133, 1237789, 1487064, 1363958, 584534, 574571, 255594, 600733, 159872, -24206, 99618, 69551, -271864, 366709, 233320, 147490, 35313, -10952, 258185, 36, -9048, 223296, -290637, -59044, 108959, -141441]
15205C65349D4501b1193B83611A06938B7034J67831R2861b89523A77840j385q4481
15194I1974a4866D2040i4728A06316K32693b02234A06153P9364J3590a63077M4343
15183a18734e6123j2058H4912J52854Q6302E0494e79A21691J2540L22268F5698
15171B32067C6168K26706g160B56124p3700K4412A01256d7429H2924k7666a16347
15159G1727d6924C59J14086J59349c11456Q5214F8251P9654m1008J64503K4705
15148B96105c38469A45741h982F6571K85012G8555J66312I1116K00584I3198a32264
15136A29714r533n999M972L8242b67845k2892B57266r6859p43f0367A17696P502
15124A25198d980A43303o1934R0334K02284b9796j49021B09074j393a08386a9451
$$ y = [365349, 44501, -21193, 283611, 106938, 27034, 194865, 287726, -289523, 177840, 176455, 91974, -14866, 42040, -94728, 106316, 339009, -202234, 106153, 185517, 199107, -163077, -118734, -56123, -68181, 84912, 237766, 324068, 50494, -579, 121691, 134231, 456499, 65698, 232067, 36168, 262874, -7160, 256124, 182424, 206836, 101256, -47429, 82924, 55258, -116347, 71727, -46924, 359, 114445, 273794, -311456, -226242, 68251, 147905, 106897, 271400, 296105, -338469, 145741, -8982, 66571, 351583, 78555, 244867, 91116, 291700, 93198, -132264, 129714, 120181, 114182, 119154, 157396, -267845, -290737, 257266, 160407, 159664, -60367, 117696, 125198, -4980, 143303, 81369, 171703, 373987, -29796, -178817, 209074, 207681, -108386, -19451]
15112b24424C54747k7782E6800M42758A83122k7249K14759q9334H8551K50972
15102C39523j33426r0810f3425H6839L3353m8322C3225K90120j60392J66031A46628
15090g132C69123a2254A93837K58914j92951H3457K5742l2400c2202B98711a57943
15078I3709j647L7970Q3277r9701j6024Q0058J4212a95877A11361a87990A03556
15066E5464b67318A67605K8269Q1189P899m2668a70829F7845c2507B07219G9247
15054D15797a22717l3974e3458B92508A07846K7133m7214k7318a01770G3097a01497
15042A44571L5819L1040q0062R5925a21301A24232J3095J24484N7345A884J82200
15031A84084G9162K51943A31947n8112L37647A70152A303c0357A71788J03107
$$ y = [-224424, 354747, 326965, 56800, 499558, 183122, 155873, 370632, 281298, 88551, 339523, 206097, 115287, -63425, 86839, 120192, 71870, 33225, 323345, 162953, 328984, 146628, -7132, 369123, -12254, 193837, 452751, 259800, 83457, 109199, 76799, -32202, 298711, -157943, 93709, 92062, 130032, 213309, 113608, 97584, 177642, 191854, -195877, 111361, -187990, 103556, 55464, -267318, 167605, 195874, 277063, 284962, 242294, -170829, 67845, -32507, 207219, 79247, 415797, -122717, -156691, -53458, 292508, 107846, 134979, 87765, 60447, -101770, 73097, -101497, 144571, 180390, 211430, 131368, 227293, -121301, 124232, 137327, 261811, 319156, 1884, 184084, 79162, 331105, 131947, 73835, 411482, 170152, 1303, -30357, 171788, 274895]
15021B74895M5595A32989L3810J55039j38313L9071f3989D45884G9199r627K14683
15010B84255a3586B75491a78265C06887f1092a0403A7014J43456a4166G9715K47693
14999C27408C3353R2280M70432C7221J27103J0667J00870J3979A10765B8271J70782
14988A99053J1010O8286j19098b04421Q7422A63047F8680K97897m295H7655B7812
14976B19354H3469K32872k5974G7251L28449A87863m1958J03315F2028L05206
14966C67234A46624J52258C4936K819K40030G1469d8318A27829M85179C00861
14955b6506B70503P6111D3174L86300A70265q2457M7736D2597K47418J93312I5136
14943A18723E6937K84698g4434C95907A87427J15831C2284R4266J72286A32490
$$ y = [274895, 320490, 132989, 166799, 321838, 183525, 222596, -63989, 445884, 79199, 69572, 284255, -13586, 275491, -178265, 306887, -61092, -10403, 17014, 160470, -14166, 79715, 327408, 33353, 125633, 596065, 37221, 164324, 174991, 275861, 289840, 110765, 28271, 199053, 210063, 278349, 159251, -204421, -116999, 163047, 68680, 366577, 362282, 87655, 27812, 219354, 83469, 316341, 290367, 77251, 405700, 187863, 145905, 249220, 62028, 367234, 146624, 298882, 34936, 37755, 277785, 71469, -48318, 127829, 613008, 300861, -26506, 270503, 346614, 43174, 429474, 170265, 87808, 135544, 42597, 290015, 483327, 95136, 118723, 56937, 341635, -74434, 395907, 187427, 303258, 32284, 126550, 298836, 132490]
14932D21631j54671j1544K65861r3828p1840N2873F5778L54371R5510J21840p6482
14921E61017A27132E0402L41900p5978a05390B35533L4245L99480B98395m066
14911B94329J50779A02169K6230K27822O4884A97232k306L60788G6090N85887
14901F61977B92891D5789J47546J80919A23742L33311k4086q7599A54383J48891
14891C03274A10702M31616A93696P6097J95241j81500l5638o9516K26426J11080
14881E15886j76617j7191A38661M56536A50164n6889M13077R9567k75017J30748
14871D61650B12673l6685M9738J60295A56454N44246A71063J50615R6734P4029
14861D92441o9846Q6911A39646R0767J97111N3228j90473J11378L49028C70355
$$ y = [421631, 266960, 255416, 521277, 427449, 355609, 408482, 65778, 420149, 515659, 637499, 561017, 127132, 50402, 392302, 316324, -105390, 235533, 269778, 669258, 298395, 294329, 445108, 102169, 128399, 356221, 421105, 197232, 194926, 555714, 76090, 661977, 292891, 45789, 193335, 374254, 123742, 457053, 432967, 345368, 154383, 303274, 110702, 542318, 193696, 269793, 465034, 283534, 247896, 178380, 404806, 515886, 339269, 322078, 138661, 595197, 150164, 93275, 506352, 605919, 330902, 461650, 212673, 175988, 225726, 386021, 156454, 700700, 171063, 321678, 418412, 492441, 422595, 509506, 139646, 230413, 427524, 480752, 290279, 401657, 750685, 370355]
14850E26557k44550A05510L46020j38976j14041h4160A48986J56890j17494L33724
14840E22106k22239l2262J45639N08537D35638K76356C52571K63014j24836J06937
14830E97686k59743L77326l40237J78469M4321j39334j26505p8145k223J74506
14820D26121M383L5634j78958J17145J01674O612j53715K88951j81826J49791
14810F15812B99521N5051Q213H4037L59144j9279j34714L35110j80375j5856j63005
14799B65062M94597k55417J31611m9532B01555L99406p8701q7193J70398k67625
14789C37840J78186B26266O2223K57621N5074P2704j04233j55828K4886J05224
14779E43937k5251J07537l08721K29393A95757K71674K57513p6964K2050k63478
$$ y = [526557, 282007, 105510, 451530, 312554, 198513, -84160, 148986, 305876, 188382, 522106, 299867, 267605, 413244, 921781, 435638, 711994, 352571, 615585, 490749, 597686, 337943, 715269, 375032, 553501, 597822, 458488, 331983, 253838, 251615, 426121, 430504, 466138, 287180, 404325, 505999, 512611, 358896, 647847, 466021, 615812, 299521, 354572, 362785, 84037, 443181, 423902, 289188, 624298, 443923, 428067, 265062, 759659, 504242, 635853, 586321, 201555, 600961, 522260, 435067, 605465, 337840, 516026, 226266, 288489, 546110, 601184, 673888, 569655, 413827, 438713, 543937, 518686, 626223, 317502, 546895, 195757, 467431, 724944, 647980, 670030, 406552]
14769D06552m9905L25800j87964J21953k1204M4994j22660L12941k23701O8121
14759F74927p4509j71807J47864K91010k00571B96589N33712C77013O3172J43868
14749E84053j27607M79673k77672j01218P3197L45916m73386P0193j8076K64894
14739H19967k47023J81889j6641o3238q5885P1475L1580N5020P6428l21016L41850
14728H44406j72577C10659O08911j81521J46516k49129k98350L57504L1949M0463
14718G67002J81697j06030j35142K26736j46770L5606j24335J93969j29772J08700
14708H71661p8451o1500J11997j53948Q7511O824l5943L012J74426k64600K7967
14697F88956K89170j27862j0717l91168L43139l774j0649p1252K95514j83646
$$ y = [406552, 356647, 682447, 494483, 616436, 595232, 640226, 517566, 830507, 606806, 674927, 600418, 428611, 576475, 867485, 666914, 296589, 830301, 377013, 440185, 584053, 456446, 936119, 658447, 557229, 630426, 976342, 502956, 573149, 555073, 819967, 572944, 754833, 738192, 674954, 589069, 660544, 692124, 747144, 823572, 502556, 844406, 671829, 310659, 919570, 738049, 884565, 635436, 337086, 694590, 726539, 767002, 948699, 842669, 707527, 934263, 787493, 823099, 698764, 892733, 762961, 871661, 793210, 731710, 843707, 689759, 777270, 784094, 748151, 751163, 925589, 660989, 688956, 978126, 850264, 839547, 448379, 791518, 787744, 777095, 705843, 1001357, 817711]
14687H17711J68274k89303j15566L38715j68136P0160J60571r2221p0372K22815
14677A042648Q9702k67868m017J21424l82436K93063q4313J89568J13606k47165
14667H64212O1476J07253k2480J9431P8356j60985K38225k07964K13393l04765
14657H86152L38099R9465k52205L00765n72927J40348L62626l96534L37760j07678
14647A135871j21068j2952k94174K22548L45655k66212J7954Q9230M944J50289
14637A272085j09931n873k17728Q2412M29743j77957j34212K29435j93697N9227
14627A233504O3847J5478j85545n9062l2158o8749J61264K58637l27252M17576
14617A477540J11341k48255l3228J10249p8803L5258j07029K78629l39506K30763
$$ y = [817711, 985985, 696682, 581116, 919831, 751695, 821855, 982426, 890205, 819833, 1042648, 1132350, 864482, 860465, 981889, 599453, 892516, 808203, 997771, 1111377, 864212, 925688, 1032941, 1010461, 1029892, 1108248, 947263, 1185488, 977524, 1190917, 886152, 1224251, 1323716, 1071511, 1372276, 799349, 939697, 1302323, 905789, 1243549, 1135871, 1014803, 1001851, 707677, 930225, 1275880, 1009668, 1027622, 1116852, 1121796, 1272085, 1162154, 1156281, 938553, 1020965, 1450708, 1272751, 1138539, 1367974, 1174277, 1233504, 1297351, 1312829, 1127284, 1068222, 1036064, 967315, 1128579, 1387216, 1059964, 1477540, 1588881, 1340626, 1307398, 1417647, 1338844, 1374102, 1267073, 1545702, 1206196, 1436959]
14607A436959J96196j2371m76283L65334l47738M97377j53077l670O9601r4205
14597A478123n111K0528J29495k9535l25624L18500k6538n6105K89625m03197
14587A390161L03429k31850J48106Q1653q8020j30554J78602K00626l00616J84934
14577A736471m7595J08510m2421M2430o911q2662j08877M49699r7863n3418l1178
14566A866185J78960J0941J39094j13298K07837j02504M16266n94326M45010l99900
14556B054265Q1819j75939L78529m1528J46433L91147k03239j49819N1262J43484
14546B676414J427N6837L81839k23394M82660J91997J02341L24738N71607Q45146
14536E411612N03671J439176K957663L654851Q109151R297994m690892p320601
$$ y = [1436959, 1633155, 1620784, 1144501, 1509835, 1162097, 1659474, 1506397, 1502727, 1572328, 1478123, 1473012, 1493540, 1623035, 1593500, 1267876, 1586376, 1559838, 1503733, 1793358, 1390161, 1693590, 1461740, 1609846, 1691499, 1603479, 1472925, 1651527, 1852153, 1551537, 1736471, 1688876, 1797386, 1754965, 1797395, 1790484, 1707822, 1598945, 2048644, 1950781, 1897363, 1866185, 2045145, 2056086, 2195180, 2081882, 2289719, 2187215, 2603481, 2009155, 2454165, 2054265, 2136084, 1960145, 2338674, 2297146, 2443579, 2834726, 2631487, 2481668, 2532930, 2676414, 2677841, 2734678, 3116517, 2893123, 3375783, 3567780, 3670121, 3994859, 4566466, 5411612, 5915283, 7354459, 10312122, 13966973, 22076124, 31374118, 26683226, 19362625]
14528A9362625n162777m017415l080416j971160j639170p24667m7260k78609K75114
14519B716265k34373k29275J305j01280K34062N0176k40456J57276j26427M3623
14509B270896R4484K62675k56099J48213j20589K41736J03853m05636K75691k41668
14499B373556L09360L51786n54415J58120J82198j34784j35971M24985j00254
14490B874581j10375J84443j70681N07455K5473k06892K76866k54129J68753j60962
14480C134532L03785k738K15k12250K09344M64804l02804J85985R0739k68591
14470C603021L07467k47532p6683K79860l7773J12753J64514k22204r2197M31138
14460D222364O7126k44015L5635P9696L78611k60963K86635k20167Q3665P5393
$$ y = [19362625, 14199848, 10182433, 7102017, 5130857, 3491687, 2767020, 2719760, 2441151, 2716265, 2481892, 2252617, 2253922, 2152642, 2386704, 2436880, 2196424, 2353700, 2227273, 2270896, 2365380, 2628055, 2371956, 2520169, 2399580, 2641316, 2745169, 2339533, 2615224, 2373556, 2682916, 3034702, 2480287, 2638407, 2820605, 2685821, 2549850, 2974835, 2874581, 2764206, 2948649, 2777968, 3285423, 3310896, 3104004, 3380870, 3126741, 3295494, 3134532, 3438317, 3435579, 3435794, 3223544, 3432888, 3897692, 3594888, 3780873, 3871612, 3603021, 3910488, 3662956, 3586273, 3866133, 3828360, 3941113, 4105627, 3883423, 3791226, 4222364, 4289490, 4045475, 4081110, 4160806, 4539417, 4278454, 4565089, 4344922, 4428587, 4503980]
14450D503980J33839P9653k95768K25907P4174K81548k07237L90433k14302L56731
14440E328958j06712k97793L18026j09920k6370N29372j43248j17917M61238J98701
14430F034335l15755L04330K05392j88429L52735j61171j6642L46844j32337J80257
14420F609559k06455L77009M4247N3186j94276K56375J70176j83822N35671K42057
14410G703727q3565k6219J53299j16373J15808M19679p4709L31067K01752R9940
14400H724406L2847L37224K9120l29299L84519R9486J93760j39398K13890J26996
14390I673551M5862M13550j90554L52815M48571K75989k07506K63708L88364J80877
14380A1645227J75006m1911J46009O25268j37024M58139P8235L37389Q3282L00507
$$ y = [4503980, 4637819, 4717472, 4421704, 4647611, 4721785, 5003333, 4796096, 5186529, 4972227, 5328958, 5222246, 4924453, 5242479, 5132559, 5106189, 5635561, 5492313, 5374396, 5835634, 6034335, 5718580, 6022910, 6228302, 6039873, 6392608, 6231437, 6214795, 6561639, 6429302, 6609559, 6403104, 6780113, 6824360, 6877546, 6683270, 6939645, 7109821, 6925999, 7461670, 7703727, 7620162, 7593943, 7747242, 7630869, 7746677, 8166356, 8091647, 8422714, 8624466, 8724406, 8757253, 9094477, 9123597, 8794298, 9178817, 9278303, 9472063, 9332665, 9546555, 9673551, 9719413, 10132963, 9942409, 10295224, 10743795, 11019784, 10812278, 11075986, 11464350, 11645227, 11820233, 11778322, 11924331, 12549599, 12412575, 12870714, 12948949, 13286338, 13369620, 13670127]
14370A3670127M85075J67194N549N81344J7236J42337P60234J5230q375N45556
14360A6381507K47727J43442N04292N88312J20647L56939K84923O25791K01779
14351A9455359K66560J040718k42501Q04696P16574K63362J95333Q67122M97354
14342B3864577M94828K48168Q27251N73575P89666K61281P98217R50496N59582
14333B9367641N06201R89858N78792O79649R96883Q50582J126188P36715R74734
14324C6807243J104425J016161J411891J075815J064133J271649J305757J685403
14316D6742477J354842J297478J548049J521513J608095J951666K230751J941175
14308F0196046J684632K043061K572474K149571K549118L187155K339337K958336
$$ y = [13670127, 14155202, 14322396, 14327945, 14909289, 14926525, 15068862, 15829096, 15844326, 15835951, 16381507, 16629234, 16772676, 17276968, 17865280, 17985927, 18342866, 18627789, 19253580, 19455359, 19721919, 20762637, 20520136, 21324832, 22041406, 22304768, 22500101, 23367223, 23864577, 24359405, 24607573, 25434824, 26008399, 26798065, 27059346, 27857563, 28808059, 29367641, 29873842, 30863700, 31442492, 32122141, 33119024, 33969606, 35095794, 35832509, 36807243, 37911668, 38927829, 40339720, 41415535, 42479668, 43751317, 45057074, 46742477, 48097319, 49394797, 50942846, 52464359, 54072454, 56024120, 58254871, 60196046, 61880678, 63923739, 66496213, 68645784, 71194902, 74382057, 76721394, 79679730]
14300G9679730L122363L378898L358232L636762L794189M137253L958612M863329
14292A09929368M721670M616701N501762N557158O074691O629690O611356P058536
14284A56700932P891059Q054916Q236470Q963160R470561R512511J1011630J0972201
14276B30813440J2026685J2151604J2898725J3824938J3979004J4589422J5075421
14269C25359239J5526315J5000420J5010435J4130564J2567913J2221318J1233417
14262D21049621J0603710R721771Q726157O585110L177247J434666K451426o384723
14254D57364985o357950l729278m893348n768055m905513o790575j0323866j3502714
14246D01093686j4114882j5077853j4027578j4584951j4420483j3934888j4215367
$$ y = [79679730, 82802093, 86180991, 89539223, 93175985, 96970174, 101107427, 105066039, 109929368, 114651038, 119267739, 124769501, 130326659, 136401350, 143031040, 149642396, 156700932, 164591991, 172646907, 180883377, 189846537, 199317098, 208829609, 219841239, 230813440, 242840125, 254991729, 267890454, 281715392, 295694396, 310283818, 325359239, 340885554, 355885974, 370896409, 385026973, 397594886, 409816204, 421049621, 431653331, 441375102, 450101259, 456686369, 459863616, 461298282, 463749708, 457364985, 451007035, 447277757, 442384409, 436616354, 431710841, 424920266, 414596400, 401093686, 386978804, 371900951, 357873373, 343288422, 328867939, 314933051, 300717684]
14239C00717684j2725995j2369591j2473678j2193594j1425427j1322021j0061035
14232B18146343j1304348j0181995j0239335r786258q466806q610237p601510
14225A51955854p155907o656108o387778n938180n590406n253230m743479m577545
14217A05653221m229334m229330l795438l653287l687913l414650k866631l168927
14209G6607711k804541k624228k350328k379817k216877k302660k112399k138685
14201E7678176k063449j596090j447365j437947j836718j243678j191428j981396
14193D4880105j168585p36748j099495j540309j081124r88579j244020n80150
14185C6441095j194911q82116r35875p88324j022250l73183r89678n74295o92658
$$ y = [300717684, 287991689, 275622098, 263148420, 250954826, 239529399, 228207378, 218146343, 206841995, 196660000, 186420665, 176634407, 168167601, 159557364, 151955854, 144799947, 138143839, 131756061, 125817881, 120227475, 114974245, 110230766, 105653221, 101423887, 97194557, 93399119, 89745832, 86057919, 82643269, 79776638, 76607711, 73803170, 71178942, 68828614, 66448797, 64231920, 61929260, 59816861, 57678176, 55614727, 54018637, 52571272, 51133325, 49296607, 48052929, 46861501, 44880105, 43711520, 42974772, 41875277, 40334968, 39253844, 38265265, 37021245, 36441095, 35246184, 34364068, 33428193, 32639869, 31617619, 31244436, 30254758, 29680463, 28987805]
14176B8987805j198529k33633q80625p46980o34905l66651o30428l30635r02842
14167B3062577l12385k51543q82394q1206l63019r99032j9768n02070m53671j35607
14157A9061882k41298o73341j08141n10419l33000o55160K07346p26301p7509
14148A5944059l0203o68519k0160m22020l67209k75065l25832J76405n58939O4396
14138A3516913k52446k26327o42360M182j37840J2604l60773l18898j81713L4868
14128A1448210m22149J28047Q4361m46315l18347n9521j81519O5354j18167m29073
14118I750881J22027m45523K54090m43434l87327L97327l69126r9848k16942n1574
14108H510551j4321j85089l91247K59202o948J9259l76913k85135J22820l29941
$$ y = [28987805, 27789276, 27555643, 26675018, 25928038, 25293133, 24926482, 24296054, 23965419, 23062577, 22750192, 22498649, 21616255, 21535049, 21172030, 20172998, 20153230, 19651160, 19197489, 19061882, 18820584, 18147243, 18039102, 17528683, 17195683, 16540523, 16747869, 16021568, 15944059, 15913856, 15245337, 15225177, 14803157, 14435948, 14160883, 13835051, 14011456, 13452517, 13516913, 13264467, 13038140, 12395780, 12399962, 12262122, 12274726, 11913953, 11595055, 11413342, 11448210, 11026061, 11154108, 11238469, 10792154, 10473807, 10414286, 10232767, 10298121, 10179954, 9750881, 9872908, 9427385, 9681475, 9238041, 8850714, 9248041, 8878915, 8779067, 8562125, 8510551, 8496230, 8311141, 7919894, 8179096, 8172148, 8191407, 7814494, 7529359, 7652179, 7322238]
14098G322238K17210k13904J95533m66551J55276l64180j83605k76206J33337
14089F519148P3161J01463J20602l47306l82413j00713P2171M8578k66086Q8402
14079E927007K05113j71042l55772O4105n0926K5551k44026J31682K3566m92134
14069E063124J62831J90863j08967j21658j78998j91069L82657k53014J65419
14060E111188m27351r1349L8637o3874Q9483o236p2298l46173K35802l0332j87945
14049D249552r5579P99J16404J52555o3448j14208J17178k45120J47771j23994
14039D141910J07146l01977J21021j55149k28841J74207m9513l36735O4869r68
14029C535970K98262m553k40542n7554J43541n06738M37228o9697k77136R2947
$$ y = [7322238, 7539448, 7325544, 7521077, 7054526, 7209802, 6845622, 6662017, 6385811, 6519148, 6592309, 6693772, 6814374, 6467068, 6084655, 5983942, 6056113, 6104691, 5838605, 5927007, 6132120, 5961078, 5605306, 5669411, 5618485, 5644036, 5400010, 5531692, 5555258, 5063124, 5225955, 5416818, 5307851, 5186193, 5007195, 4816126, 5198783, 4945769, 5111188, 4683837, 4592488, 4631125, 4567251, 4656734, 4650498, 4578200, 4232027, 4467829, 4437497, 4249552, 4153973, 4154772, 4271176, 4423731, 4360283, 4246075, 4363253, 4118133, 4265904, 4141910, 4249056, 3947079, 4068100, 3912951, 3684110, 3858317, 3808804, 3472069, 3536938, 3535970, 3834232, 3829679, 3589137, 3531583, 3675124, 3168386, 3605614, 3535917, 3258781, 3351728]
14019C351728R832j80690J69887k57792J47191j75119K48359l26748R0857k94934
14009B782571K16547k34850J98616k39600K23110k95523K76642k82835j52657
14000B492021p6006K30336j79809K74659j15274j10011k08527k85457M90498M2160
13990B554590j71084k47537K59641L883j36515O0798r8474J02218M3044K8099
13980B398663J65537L49267j55389J48856M36411J028061K134932L264539P023352
13971A6794229J2052498j136554o488037n788757l485199k936100k160833j571913
13963E279334o75483p02962N5784m22470l24773k80891j4339k78764K10000J66952
13953C012388l70454j29670k5090J14442m9981k09099N9222k11001L03349k57691
$$ y = [3351728, 3361560, 3180870, 3350757, 3092965, 3240156, 3065037, 3313396, 2986648, 3077505, 2782571, 2999118, 2764268, 2962884, 2723284, 2946394, 2650871, 2927513, 2644678, 2492021, 2416015, 2646351, 2466542, 2741201, 2625927, 2515916, 2307389, 2021932, 2512430, 2554590, 2383506, 2135969, 2395610, 2399493, 2262978, 2323776, 2225302, 2327520, 2370564, 2398663, 2564200, 2913467, 2758078, 2906934, 3343345, 4371406, 6506338, 9770877, 16794229, 28846727, 27710173, 21222136, 15433379, 11948180, 9012080, 6851247, 5279334, 4603851, 3900889, 3956673, 3534203, 3209430, 2928539, 2914200, 2635436, 2845436, 3012388, 2641934, 2512264, 2487174, 2601616, 2551635, 2342536, 2401758, 2190757, 2494106, 2236415]
13943B236415j24970J69839M3970j68266q6739K14489j33802j13123J42201r7102
13933B082912p8817K11801k91712J4338n8084L03531j34262R0504k22839m2856
13923A874516o5292m8219k1348J25492m6878j45907o966j14046O7367K16350K3907
13912A858976N932k426k76011M82837l89921N8307q2329k41191K02393j44916
13902A471651J05091J0016J15805N4767N4240q0462k87755p6421M51219j75832
13892A642319r9194l65405L24891j5509r7242O4478R7366r7465J48434l296j85663
13881A413714l0997M0220L69812n32149L51955k14844J09872k39621K03175m39310
13871A031827K36027k0393R0149J03859j41113N4378p8476q0458M75949m85704
$$ y = [2236415, 2111445, 2281284, 2325254, 2156988, 2070249, 2284738, 2150936, 2037813, 2180014, 2082912, 2004095, 2215896, 1924184, 1938522, 1880438, 2183969, 2049707, 2140211, 1917372, 1874516, 1809224, 1761005, 1739657, 1865149, 1818271, 1672364, 1665398, 1551352, 1618719, 1835069, 1858976, 1864908, 1862482, 1586471, 2069308, 1679387, 1737694, 1655365, 1414174, 1616567, 1471651, 1576742, 1586758, 1702563, 1757330, 1811570, 1731108, 1443353, 1366932, 1818151, 1642319, 1543125, 1177720, 1502611, 1487102, 1389860, 1454338, 1551704, 1454239, 1602673, 1599377, 1413714, 1382717, 1422937, 1792749, 1260600, 1612555, 1397711, 1507583, 1267962, 1471137, 1031827, 1267854, 1247461, 1337610, 1441469, 1300356, 1354734, 1276258, 1195800, 1671749, 1186045]
13861A186045o788K43202n2808j43622N4717l10811R4776J62717r671j80227m4972
13850I92558j41424M37718j14774j50915j74725N23085l79035J38279J1737j84683
13840I57821M78899J55317n43307k7783J04255J22057j97396k06812J43808j99103
13830G87756K21846J2879O9649K24108l79080Q4629K14561l66841L00397l7782
13820A132122l24530L21117k11664l5806K53584J38348l90220m0201L47704k87786
13810I02668j65307P4866K24795l29205K7069M7936K63517j07374p3753K4831
13800H90043j09228L17863n36869K60348K7646J15430j54618J1920L14765l5889
13790A101411j83122J73734k64427L38753n8200j59554j78697l69687O19654k45869
$$ y = [1186045, 1179257, 1422459, 1369651, 1226029, 1280746, 969935, 1064711, 1227428, 1217757, 1037530, 992558, 851134, 1288852, 1174078, 1023163, 848438, 1371523, 992488, 1130767, 1142504, 957821, 1436720, 1592037, 1048730, 1020947, 1125202, 1247259, 1049863, 843051, 986859, 787756, 1009602, 1022481, 1092130, 1316238, 937158, 1021787, 1236348, 869507, 1169904, 1132122, 807592, 1128709, 917045, 881239, 1134823, 1273171, 882951, 842750, 1190454, 902668, 737361, 812227, 1037022, 707817, 734886, 782822, 1046339, 938965, 865212, 890043, 780815, 1098678, 561809, 822157, 849803, 965233, 810615, 822535, 1137300, 1101411, 918289, 1092023, 827596, 1166349, 1108149, 948595, 769898, 400211, 1019865, 773996]
13780G73996J0153l21212L47053K7003k4297j75732L01545P493j34439J52537
13770I64100l10606o6388J85476J27588l32494L95180l3903j47636j53841L08184
13760I35660l02043r6128M8805Q6271A49223P70290j3788k36430K06410j39715
13750G35990B23794P69211k19093L75141m00160K35782l49807O4328k0582J43826
13740H22440D07846L57128L4175j76852K23575j27531j10626J60790k0767n3515
13730F94223m0140k22092L45258Q1995j30390k39127L6430k3733R2787R2705j77467
13719E10449J30441k51805L26886r675n316L2987k19098k4595n2012K44242k68074
13708D14430J58906N1205j03052K12829k19257K94215j70861k7249j65621j00499
$$ y = [773996, 784149, 462937, 809990, 836993, 812696, 636964, 938509, 946002, 811563, 964100, 653494, 587106, 772582, 900170, 567676, 962856, 928953, 781317, 627476, 935660, 633617, 537489, 586294, 672565, 149223, 919513, 905725, 669295, 875705, 735990, 223794, 993005, 773912, 1149053, 748893, 984675, 634868, 699196, 678614, 822440, 407846, 764974, 799149, 622297, 845872, 718341, 607715, 768505, 747738, 694223, 654083, 431991, 777249, 859244, 728854, 489727, 526157, 502424, 595211, 687916, 510449, 640890, 389085, 715971, 706296, 700980, 733967, 514869, 490274, 438262, 682504, 414430, 573336, 624541, 521489, 734318, 515061, 809276, 638415, 611166, 445545, 345046]
13698C45046K10004j69167L24997K20152l58412m3346J0299q7287N2664j12084
13688C92866O98050j59993C78001L5506L72476J2744C79475o2578K34785B65478
13677E84360J71890A15562L51571M28644j79880C16984L65445q5782k3628J01047
13667F74066l06671P0963L0774J57913l05683m219l7471J47035K05123o0651J61023
13656G32202C36720J02607K81993k27587Q5170R8061o5039k79788L63513k80820
13646D14830N5792J15338K1929k33144J76334L33133m26604j04172Q1668K47149
13636F82253k02035l4223D0563K98373K70701K0377j32935L9449l0388q2375q4192
13625C39573A38462L50233P1854J4045j08024n929A70993J33891j06722M74584
$$ y = [345046, 555050, 385883, 710880, 931032, 572620, 529274, 539573, 452286, 504950, 392866, 1090916, 930923, 378001, 413507, 785983, 798727, 379475, 316897, 551682, 265478, 584360, 756250, 115562, 467133, 895777, 715897, 316984, 682429, 596647, 573019, 674066, 367395, 438358, 469132, 627045, 321362, 317143, 279672, 426707, 631830, 571179, 732202, 336720, 439327, 721320, 493733, 578903, 676964, 611925, 332137, 695650, 414830, 470622, 585960, 607889, 374745, 551079, 884212, 457608, 353436, 435104, 682253, 480218, 445995, 40563, 338936, 609637, 630014, 497079, 536528, 506140, 423765, 339573, 138462, 488695, 560549, 574594, 466570, 460641, 170993, 304884, 198162, 672746]
13615F72746B93900k5124K01955m7291O7206j79116K18014N5306A3298M19617
13605D32915k4376o8198J03099j54237O44127m62055j36753P649O7121J89736
13595E99028A44043L40733Q4465j06945r8436J40004j5883n6169j25341I6705
13584C29324A14644K73176A42174K30541A63283K82594R0501j27571P8325O7012
13574E54144k54589J51282o1234N1391m6567M6975B08858L90334B09366K80507
13564D89873J06051j39049J82450B77904K12868n0132B14273L69887k42299j12547
13554B29314J95739B12302O6054A35562J1892M02897O0515k18010A90695J10786
13544C01481J62073j46359N0724D1890L85474j14452k3274m8711K44592A82693
$$ y = [672746, 293900, 268776, 470731, 423440, 490646, 311530, 529544, 584850, 13298, 432915, 408539, 340341, 443440, 289203, 933330, 471275, 334522, 342171, 409292, 599028, 144043, 484776, 569241, 462296, 363860, 503864, 487981, 431812, 306471, 96705, 329324, 114644, 387820, 142174, 372715, 163283, 445877, 536378, 408807, 487132, 554144, 299555, 450837, 389603, 440994, 394427, 441402, 208858, 599192, 209366, 489873, 595924, 456875, 639325, 277904, 490772, 440640, 214273, 584160, 341861, 229314, 425053, 212302, 278356, 135562, 147454, 550351, 610866, 392856, 190695, 301481, 463554, 317195, 367919, 41890, 427364, 312912, 289638, 240927, 485519, 182693]
13533E13965c9471D85550A50251J81325J00236j96205m1010K12976M2336j94991
13523B54918K11151B14842J65276r1334r7574L38509k61247m2093j08016L32732
13513D51095o2748J89130K13149C57526A4450R9451O2217M19493F3062K39511
13503C02573A47651L24718j96797K35517N5430k61880n5351L69147j88745A12791
13492A93506L4299J77753j7439C2799K92165N6484A23035L89080j70262O2207
13482D04060j33807L0662J78093I4090K75534A74308K58834B8157M16541b11605
13471B08067b5940B77342K96880j22133j56958P336j13184P6848J85529j40225
13461C11435A36640J65107l3441C8379L59680H7648K01701A26809J49636h211
$$ y = [513965, -39471, 485550, 150251, 331576, 431812, 235607, 194597, 407573, 449909, 254918, 466069, 214842, 380118, 288784, 191210, 529719, 268472, 226379, 118363, 451095, 388347, 577477, 790626, 357526, 14450, 113901, 176118, 595611, 63062, 302573, 147651, 472369, 275572, 511089, 566519, 304639, 249288, 618435, 429690, 112791, 193506, 227805, 405558, 388119, 32799, 324964, 381448, 123035, 512115, 341853, 404060, 270253, 300915, 479008, 94090, 369624, 174308, 433142, 28157, 444698, -211605, 208067, -25940, 277342, 574222, 452089, 295131, 302467, 189283, 266131, 451660, 311435, 136640, 301747, 268306, 38379, 398059, 87648, 289349, 126809, 276445, -8211]
13450B5335J98502B4668O30682k87163A61764P9707J40970o7284A40809P2892
13440B13701J69345A88974j6842K04956j17470n2735h209C46367K81875B92563
13429C09980j28681m5368J62638m9679L25818j95597l4245K38796B34654J73218
13419D07872j38995a11227C93151N0355B17207J40442I3871J13952O758b4292
13408C6986M81612A79053d6783B77986F3008A2786K24333J34141a91844B74957
13397B54012j17523K4860g2559C87420A39629j9965k7317J64667A16836D1276
13386C27443a40581C45084j28688Q6528A29581L5371m1707K0357b0475B92570
13375D31600B0202R5152Q6525Q5324K75831k06564g3343B6585K97398A28483N9348
$$ y = [25335, 223837, 24668, 655350, 368187, 161764, 241471, 382441, 315157, 140809, 213701, 383046, 188974, 172132, 377088, 259618, 206883, -8209, 346367, 628242, 292563, 309980, 181299, 135931, 298569, 248890, 574708, 379111, 344866, 583662, 234654, 407872, 268877, -111227, 393151, 443506, 217207, 357649, 93871, 207823, 214581, -24292, 36986, 518598, 179053, -46783, 277986, 63008, 12786, 237119, 371260, -191844, 274957, 254012, 136489, 161349, -72559, 387420, 139629, 119664, 92347, 257014, 116836, 41276, 327443, -140581, 345084, 216396, 302924, 129581, 164952, 123245, 143602, -20475, 292570, 431600, 20202, 115354, 201879, 287203, 563034, 356470, -73343, 26585, 323983, 128483, 187831]
13364A87831k022K6113J04890j53780M8353m7310L846K93903D8398J22833M7276
13353B18507E1547M19427A69013J47987l6282j36775K56723A87409M46106k15920
13343D17595n7289C5491b32899B17346P2413q1453k1259m9191D2525K01130Q3749
13332C27404o098o9659p6226J93999P7316q1682A6181L35433l9692J95908J3283
13321E21113H0289J89989m3782J29300A66971H3394L46455A43904o9200J52531
13311B27235j13385a00043H2520p903J66467K23403j26245j58597M4457G2117
13300A90645j3578b02225A60524A0211M94738B1386K11527l1266B8122K39411
13290B67533r1667M7594F4235K35093j27275C7207f6011B40089c01779B15431
$$ y = [187831, 185809, 211922, 316812, 163032, 211385, 164075, 167921, 461824, 48398, 171231, 218507, 51547, 470974, 169013, 317000, 280718, 143943, 400666, 187409, 633515, 417595, 360306, 35491, -232899, 217346, 289759, 208306, 187047, 137856, 42525, 243655, 327404, 321306, 251647, 175421, 369420, 446736, 365054, 16181, 351614, 311922, 507830, 521113, 80289, 270278, 226496, 355796, 166971, 83394, 429849, 143904, 74704, 227235, 113850, -100043, 82520, 74617, 241084, 464487, 338242, 179645, 224102, 72117, 190645, 177067, -202225, 160524, 10211, 504949, 21386, 232913, 201647, 28122, 267533, 175866, 223460, 64235, 299328, 172053, 37207, -66011, 240089, -301779, 215431]
13279C03233m8355j6345b2040j70918C04013a32C21104p0816a05456q6800A76303
13267A35836P2727J54367J28326k40302q1863P9929l4013E1731K34019F9635J55261
13256B24896a42305N7989G1970P1755e0193k1517F2110J40936K1260a05594C03843
13244D34078c1093D0889R1705m5244c8998B78041J50754A85146b7969G2350a6234
13232A48258Q9967L488A11936Q3522K1948k1606o0418n2161L84494A27181R2803
13221B19984a40973J0859C06968a65073H5608P9220m8008D23J44779K12616a23672
13209E372L23216C2800n424K4692J59626o0949L1711J32479A37218N2432a58424
13197C34582A63719l5506a9135A68387O8842l7792J66311j58228a19317C43753
$$ y = [303233, 254878, 238533, -22040, -192958, 304013, -132, 321104, 250288, -105456, -192256, 176303, 135836, 208563, 362930, 491256, 250954, 169091, 249020, 215007, 51731, 285750, 69635, 224896, -142305, -84316, 71970, 143725, -50193, -71710, 62110, 203046, 224306, -105594, 303843, 434078, -31093, 40889, 132594, 87350, -38998, 278041, 428795, 185146, -27969, 72350, -16234, 148258, 238225, 241713, 111936, 195458, 217406, 195800, 135382, 83221, 467715, 127181, 219984, -140973, -130114, 306968, -165073, 85608, 164828, 116820, 423, 145202, 357818, -123672, 5372, 328588, 32800, 27376, 52068, 211694, 150745, 182456, 314935, 137218, 189650, -158424, 334582, 163719, 128213, -19135, 168387, 237229, 199437, 365748, 207520, -119317, 343753]
13186i6652C18363m8694l0570h8013A20386J60487O145a04452A90109b40586h5833
13174A11865a25709D06796E3270N0470h399B02729B9631L3292a49648A04240k0864
13163H3376K15928A9061R0397K4217a91897f9647C12387j19541g831C8194R2476
13152A30670P403o6768D67K6331C203J46114a26375A82941a30730B66302a74812
13140C14248d348k0153B39132C838J20625i2988l9829A05454P9324n2443a61331
13128b97137a17444B06283L289a32339B03413a42581f7536A57420a31294B50067
13117B62514H5561P3827a70823C22997c6849i143j24374B78520G1354K91414j17479
13106B45289i2467A04544K4762m2582B0692F14f8188A34792J01737H4110K26989
$$ y = [-96652, 318363, 269669, 239099, -88013, 120386, 280873, 287018, -104452, 190109, -240586, -85833, 111865, -125709, 406796, 53270, 103740, -8399, 202729, 29631, 62923, -149648, 104240, 83376, 299304, 19061, 109458, 133675, -191897, -69647, 312387, 192846, -7831, 38194, 130670, 138073, 71305, 467, 26798, 3203, 149317, -126375, 182941, -130730, 266302, -174812, 314248, -4348, -24501, 239132, 3838, 124463, -92988, -132817, 105454, 184778, 132335, -161331, -297137, -117444, 206283, 209572, -132339, 203413, -142581, -67536, 157420, -131294, 250067, 262514, 85561, 159388, -170823, 322997, -36849, -9143, -133517, 278520, 71354, 362768, 245289, -92467, 104544, 129306, 86724, 20692, 614, -68188, 134792, 236529, 84110, 311099]
13095C11099a15749A37117o8231N5428Q4939a73244O6460L0004B76233a86459
13084B02066q0229A3950n601R9206a17927A89636m5140K89965j33756j34168b32986
13072A02868K0304n8816k1643A3041e4965B36594a34081A21405n5377b07893B42902
13060B951g5058J2489B23763a09073K0968a2839p5658B50575L7281R4918j54016
13049B28758j3230J68061A35477a15086B4721O8306J97603K9735n7672p7588b15994
13037H0393L68394a23971B1955j0197J28074j0694J47749L6413J05076A5721K91515
13026C07236f1509F0482d3535i917p0310B8452i7628D89696A45770E4956n376
13015D9580P233e4349r779A44113M9454J06190p6567p7176P4307r2169h010D8473
$$ y = [311099, -115749, 137117, 68886, 124314, 209253, -173244, -106784, -76780, 276233, -186459, 202066, 121837, 13950, 8349, 107555, -117927, 189636, 144496, 434461, 300705, 166537, -232986, 102868, 123172, 64356, 42713, 13041, -54965, 236594, -134081, 121405, 66028, -207893, 242902, 2951, -75058, -62569, 223763, -109073, -88105, -12839, -88497, 250575, 287856, 382774, 228758, 215528, 383589, 135477, -115086, 24721, 93027, 290630, 320365, 262693, 185105, -215994, 80393, 448787, -123971, 21955, 11758, 139832, 129138, 276887, 313300, 418376, 15721, 307236, -61509, 60482, -43535, -9917, -80227, 28452, -97628, 489696, 145770, 54956, 49580, 56813, -54349, -64128, 144113, 193567, 299757, 223190, 146014, 220321, 128152, -8010, 48473]
13002a87556E6304P2210B9407J17089C0924K55628a14844e0913B27225h1488A86268
12990A25756e2684a6437F8551J42175j8265B8865e730k2662A49386K2481D9148
12978e3223A4573K26271G9668K82406d279j19453l4581C35499j61835H3628c291
12966A10353J17237f0467A31571d1957C1719J12274C6144a43658D6464J83749
12956B30213a79557d5996G636K46028c06955d458I6765b4530k83305b9388B8556
12944D6378a05935A47743J69047a22546e1113A57168N8041I1929K999K25156J24425
12933D44509A66216a68325j24243a36944A40601A5800L78451A07319K25703c4065
12922B4316Q878g4806L5977A52439k0597d9575C3145J28503a27796A89779b2395
$$ y = [-187556, 56304, 128514, 29407, 146496, 30924, 286552, -114844, -50913, 227225, -81488, 186268, 125756, -52684, -16437, 68551, 210726, 192461, 28865, -5730, -28392, 149386, 171867, 49148, -53223, 14573, 240844, 79668, 362074, -4279, -123732, -158313, 335499, 173664, 83628, -3291, 110353, 227590, -60467, 131571, -41957, 31719, 143993, 36144, -143658, 46464, 230213, -179557, -45996, 7636, 253664, -306955, -4458, 96765, -24530, -307835, -29388, 28556, 46378, -105935, 147743, 316790, -122546, -51113, 157168, 215209, 91929, 94928, 320084, 444509, 166216, -168325, -292568, -136944, 140601, 15800, 394251, 107319, 333022, -34065, 24316, 33194, -74806, -38829, 152439, 131842, -49575, 33145, 161648, -127796, 189779, -22395]
12910B78233j25883B7027K24242L3345C3623a26372A54431R031L951c259B9910
12898i2344j89704B47020e1050B71149a07030A1483J1136P449Q3958l6073L60743
12887D38696j2346b0938I8122a75555C70170E1926b3461f002C4591J25204a75963
12875f2032a2079j01560A94043H5620P9428F9603K9405b31926E4845R455g2265
12863a55356N8392b3167A42462K53742E4340b21573B10990i5441B46486C218P1472
12852G4690J93270a72243O8813D5619g788r0512A31530b0704A31891g7631K6973
12841e0658B44396H5344l0966R0390l3114N7197B3925Q4309J47919c06255M6553
12830b59702a385I2005e8628C26959k2994a94352e2877E491N08805G3114J05028
$$ y = [278233, 152350, 27027, 251269, 284614, 33623, -126372, 154431, 163462, 167413, -3259, 29910, -92344, -282048, 247020, -51050, 271149, -107030, 11483, 22619, 30068, 114026, 77953, 438696, 426350, -20938, 98122, -175555, 370170, 51926, -23461, -6002, 34591, 159795, -175963, -62032, -12079, -113639, 194043, 85620, 165048, 69603, 99008, -231926, 54845, 64300, -72265, -155356, -96964, -23167, 142462, 396204, 54340, -221573, 210990, -95441, 246486, 3218, 74690, 267960, -172243, -103430, 45619, -7788, -98300, 131530, -20704, 131891, -77631, -50658, 244396, 85344, 54378, 144768, 111654, 168851, 23925, 108234, 256153, -306255, -259702, -1385, 92005, -58628, 326959, 303965, -194352, -52877, 5491, 514296, 73114, 178142]
12819A78142K35741b29364A97012a01676K6459A37943O5615p5427a08193E6389
12808e9970b162l0692B67129k8196j0228d4439C517J67137a14998A36184c04682
12796A1038b36380A1485J81704i4990G9293a14389e2466p1077F9635a2855D6624
12784d9912n0132B42575a89463B94031B9044a55738K7795c6650D7553a18687A96481
12772D68947f3279j46147C16563F782Q3842f5513A5908K7673J05949C5964q272
12761B7692n200J27943b90636a28307e7490p3381B78103j7034o5579f9704A37242
12749g15j43195N634A55622J67290j40770e8122j14350A46321h3231F4424L3117
12738I7541b9651H9776a03619A12784L7144P7223q4028b7460A02316l983J00734
$$ y = [178142, 413883, -229364, 197012, -101676, -75217, 137943, 203558, 128131, -108193, 56389, -59970, -2162, -32854, 267129, 238933, 228705, -44439, 3517, 170654, -114998, 136184, -304682, 11038, -236380, 11485, 193189, -94990, 79293, -114389, -52466, -123543, 69635, -12855, 46624, -49912, -100044, 242575, -189463, 294031, 29044, -155738, -127943, -36650, 47553, -118687, 196481, 468947, -63279, -209426, 316563, 6782, 90624, -65513, 15908, 43581, 149530, 35964, 27692, 22492, 150435, -290636, -128307, -57490, -130871, 278103, 261069, 195490, -69704, 137242, -715, -143910, -138276, 155622, 322912, 182142, -58122, -172472, 146321, -83231, 64424, 97541, -29651, 89776, -103619, 112784, 149928, 227151, 143123, -27460, 102316, 98333, 199067]
12727A99067J29146B2250J85783a71652j15230C05677c649q1078A70830m7527
12717A23303a07167B18905i787C22714m7388g1437m0551C6505J4513a2551A61720
12705B57145r4089A0287a7256B39719g9380A45207b90251M4462A28604a64013
12694b64421b6098E4961J55663n6140o1472M24080a40085D58007j24493q0526
12684B52988o2890K39225g9967B67591g8813A59895a88015B17205C4130J90072
12674B24202L5241a96028B43200n2410H3909J20188a31105A43244g4677j31740
12664b06417O2015A99480a6364B10041n4306A5366e6697K6402C23260n1736G666
12652a01910C07271N0749j6410a02813A5970L1049b74162I2414P0102D4789K74210
$$ y = [199067, 328213, 22250, 208033, -171652, -286882, 305677, -3649, -84727, 170830, 123303, -107167, 218905, -9787, 322714, 275326, -71437, -111988, 36505, 51018, -12551, 161720, 257145, 163056, 10287, -17256, 239719, -79380, 145207, -290251, -245789, 128604, -164013, -264421, -26098, 54961, 210624, 154484, 93012, 517092, -140085, 458007, 333514, 252988, 190098, 429323, -79967, 267591, -78813, 159895, -188015, 217205, 34130, 224202, 259443, -196028, 243200, 190790, 83909, 204097, -131105, 143244, -74677, -206417, -144402, 199480, -16364, 210041, 155735, 15366, -56697, -30295, 323260, 271524, 7666, -101910, 307271, 358020, 341610, -102813, 15970, 47019, -274162, 92414, 162516, 44789, 318999]
12641C18999I1462M36892A9525l613K04324r8629K61182B511a81018E645J12332
12630A17977f3668H5032a64536G5939b55643a14127R661A55848a8319j76771j51762
12619c46852i6677H4057K15013A25692b19148B78762A5126K92302K13623h2331
12608a47248H1551C3221K50398A05372B1149a5079A84741m1070j8562f0019B6314
12596a72165k32990C90527I9746K10311F2697K69078c2422A22604J7359D2271
12585e0305B21338q5540Q6483J03737a8090j96690A43582b6657B31683n8299P0361
12574B43745K499i803G2373J92103l8057E4448i7932A67209D4506b81451A38953
12562A73503b90870H7581Q4091K0624a29921A3714o822L15212A60379k7709a43143
$$ y = [318999, 91462, 528354, 19525, 15912, 220236, 121607, 382789, 2511, -181018, 5645, 117977, -63668, 85032, -164536, 75939, -255643, -114127, -104466, 155848, -18319, -195090, -346852, -96677, 84057, 299070, 125692, -219148, 278762, 15126, 307428, 521051, -82331, -147248, 81551, 33221, 283619, 105372, 21149, -15079, 184741, 143671, 125109, -60019, 26314, -172165, -405155, 390527, 99746, 310057, 62697, 331775, -32422, 122604, 139963, 42271, -50305, 221338, 135798, 222281, 326018, -18090, -214780, 143582, -26657, 231683, 173384, 243745, 246244, -9803, 72373, 264476, 226419, 54448, -97932, 167209, 44506, -281451, 138953, 173503, -290870, 87581, 171672, 192296, -129921, 13714, 6892, 322104, 160379, 132670, -143143]
12550a14266B51740B7236b23374B0340a21489C7773J54040q2240K5136D1209P9761
12539A20970L6875R425b79507a3072C18835f8021l315j3553d0288C9180J27174
12528A66354p2778K753N111i6962A17120b02080B56807q8630b95102A7512L7719
12517E5231a13741A56645A0042P1948H806a60997B75447b60489A22704n2426b54187
12505C15090A07761K4434a90978K4100m9397B4610J09136c330F7804R2135m5249
12494A14690K5611D2930J18889m8641J27966B7336J00255B8809K22546c2057j36951
12483a69008A62271J68765i607F8274L67290E1820a17056C338K8486K5775J29422
12472A87021b06202e1594k4633h735C0579g8883C0920c55503F7918f7756D3783
$$ y = [-114266, 251740, 27236, -223374, 20340, -121489, 37773, 191813, 109573, 134709, 41209, 120970, 157845, 167270, -279507, -13072, 318835, -68021, -71336, -84889, -40288, 39180, 166354, 93576, 96329, 101440, -96962, 117120, -202080, 256807, 168177, -295102, 17512, 55231, -113741, 156645, 10042, 81990, 8806, -160997, 275447, -260489, 122704, 70278, -254187, 315090, 107761, 132195, -190978, -166878, -216275, 24610, 133746, -3330, 67804, 159939, 114690, 140301, 42930, 161819, 113178, 241144, 27336, 127591, 28809, 251355, -32057, -169008, 162271, 331036, -9607, 68274, 435564, 51820, -117056, 3338, 31824, 57599, 187021, -206202, -51594, -76227, -8735, 30579, -78883, 30920, -355503, 67918, -67756, 43783]
12460b61445a23464D7118m932m420a57567k6587B68013c8675C43449a40760l8542
12449a79302c210C8084b3868B8388R8960b15629D6607a20470A85000a15207n7971
12438a73178D0791a28245A19255a83907B15870E2747K34280j26126b32616i6424
12427B37750B5247g0018A38913a01554A92081F0480a03811I5214J12780f5952
12416a91040A33219g5389j18293A3429b11609f547A08791a32759o5481A79961
12405e18938A34494P6363C0277a58274G0527a43525f310k70014A81202q0210a51697
12393G3392J79936m0711c2584C0150c37811A30263a22956B20467a00862A71732
12382A68769q211E280O7757b27079E0912J7355j4247a2881k97066R2754A96873
$$ y = [-261445, -123464, 47118, 42186, 37766, -157567, -184154, 268013, -38675, 343449, -140760, -179302, -3210, 38084, -23868, 28388, 127348, -215629, 46607, -120470, 185000, -115207, -173178, 40791, -128245, 119255, -183907, 215870, 52747, 287027, 160901, -232616, -96424, 237750, 25247, -70018, 138913, -101554, 192081, 60480, -103811, 95214, 207994, -65952, -191040, 133219, -75389, -193682, 13429, -211609, -6547, 108791, -132759, -198240, 179961, -518938, 134494, 210857, 30277, -158274, 70527, -143525, -6310, -276324, 181202, 100992, -151697, 73392, 253328, 212617, -32584, 30150, -337811, 130263, -122956, 220467, -100862, 171732, 168769, 160558, 5280, 73037, -227079, 50912, 68267, 54020, -12881, -309947, -217193, 196873]
12370a48034B05628a28061E9661A0465K60633a67296B63309K8375B9865K19567
12360B49432K09075f1681n9242r7727A32098o0985P8576K07326j72799D3965a93262
12348a8622H81a6670A8013b41226F0796J85917g3258j42597H2737h2138j1568
12337i3706A93367a91470F1905c8891F7406i2431B53651a9401B52555b0589C90858
12325C65132F2891K94585j76254e6283G4913Q5670N0350p403C9522J45598B2471
12313B81555H0477a40329A6293c6711C63913c1576j81530N8278A04107k3573d9719
12301F114L36009h643H0566c427D8797a79151c5240j77547C1533K09157C8999
12289a36756A05109j6393b68974e4599j61050H3987l5347h7600G0492a57004n110
$$ y = [-148034, 205628, -128061, 59661, 10465, 271098, -167296, 263309, 291684, 29865, 249432, 458507, -61681, -120923, -218650, 132098, 71113, 149689, 357015, 184216, 43965, -193262, -18622, 881, -16670, 18013, -241226, 60796, 246713, -73258, -215855, 82737, -82138, -93706, 193367, -191470, 61905, -38891, 67406, -92431, 253651, -19401, 252555, -20589, 390858, 365132, 62891, 357476, 181222, -56283, 74913, 160583, 210933, 203530, 39522, 185120, 22471, 281555, 80477, -140329, 16293, -36711, 363913, -31576, -213106, -154828, 104107, 80534, -49719, 6114, 342123, -8643, 80566, -3427, 48797, -179151, -35240, -212787, 31533, 240690, 38999, -136756, 105109, 88716, -268974, -54599, -215649, 83987, 48640, -87600, 70492, -157004, -162114]
12278a62114d4154E3273J02953i2474C81511D1661a25190G7850a04631A0270P0184
12267H0454c5201q9968B68211b19223A0852K4716a2176B97714a48011C52718n2221
12256C00497j07599a28705l4184d6268g041B26003k7518C943a45417d9441A81070
12244B4684b25399a9791j53176H9274e3092I965K2647a46844e3627b6434A68590
12232B80376A36806a81318l4862B05245Q2720k7572A7627R8604J44745J0159a15762
12220b0854n9916I1172O554l5341a46432c5298D02171j82954m9981J1113J43692
12209C24041n5475k5731m7849M1537R9333H7804J34191g7996B51166M1486Q0000
12198C72652D5271b30192N395A40999F7024L77775A08795J24966P902q2859M6362
$$ y = [-162114, -44154, 53273, 156226, -92474, 381511, 41661, -125190, 77850, -104631, 10270, 80454, -35201, -125169, 268211, -219223, 10852, 35568, -12176, 297714, -148011, 352718, 300497, 192898, -128705, -162889, -46268, -7041, 226003, 198485, 3943, -145417, -49441, 181070, 24684, -225399, -19791, -172967, 89274, -53092, 9965, 32612, -146844, -53627, -26434, 168590, 280376, 136806, -181318, -216180, 205245, 287965, 260393, 17627, 116231, 260976, 271135, -115762, -20854, -80770, 91172, 97726, 62385, -146432, -35298, 402171, 219217, 169236, 180349, 324041, 268566, 242835, 194986, 236523, 335856, 87804, 221995, -77996, 251166, 292652, 372652, 45271, -230192, -224797, 140999, 67024, 444799, 108795, 233761, 241663, 158804, 205166]
12187B05166K67629n2536C4442J64523J45894j42123E6741B6497K39827l389a62826
12175b46637e7947D50877r7092r2786m0976j2103R8351j00821e8116A92661b9922
12163D58789j14646A24964o1846L07083a21576j17568d2385o694m0946A39602
12152C4787J07947J00421p5536a15489I5239a61510A75640P8185d27479A18461
12141i0548B72039b37687g776j09261B06005E3352i874n9273A48998b8561n9986
12130h8547a7775G2026R920A7391P8939M17341c24876B92029A08421a49940k265
12119a52205E5399c97A46078o201J1351b9417A19560L188n3915a08943h904C83774
12106B63046n7850j2481k8985J47794e1721b1988k9265B18746A9701J72515C8601
$$ y = [205166, 472795, 420259, 34442, 198965, 344859, 202736, 56741, 26497, 266324, 262935, -162826, -246637, -57947, 450877, 353785, 260999, 220023, 207920, 306271, 205450, -58116, 192661, -29922, 458789, 344143, 124964, 63118, 370201, -121576, -239144, -42385, -49079, -90025, 139602, 34787, 142734, 243155, 167619, -115489, 95239, -161510, 175640, 253825, -427479, 118461, -90548, 272039, -237687, -7776, -117037, 206005, 53352, -9874, -69147, 148998, -28561, -88547, -17775, 72026, 81946, 17391, 96330, 513671, -324876, 292029, 108421, -149940, -152205, 55399, -397, 146078, 139877, 151228, -29417, 119560, 122748, 68833, -108943, -8904, 383774, 263046, 205196, 192715, 163730, 311524, -51721, -21988, -51253, 218746, 19701, 192216, 38601]
12094e8261j58122F91b10493c1901k01246D70128k30700a34980B05110f2190j8560
12083h0750A09077e141E4420K2698b71555B59621H2383b03560j39187P1905J30733
12072a40109A56106f3724D0848a06824A6362g7768o9407G8932b5228A69025L443
12061A72468J43142P92329P8863D54549N1045K41931C73215B3464A0430a25979
12050C62516a20662A23063d0990B18914N1897E1031K06920E9819J95921e9217
12039A71957a42626j02114a08703k58583b0803o8627B44539b6151n8997A14328
12028G6197d3044A37787E0361a28140k78729A3162o556d7877j03634n2701C033
12016A16328L1582C1628b14669e8801B91959D7286a96317M4629A04694f8003j39401
$$ y = [-58261, -216383, 691, -210493, -31901, -233147, 470128, 239428, -134980, 205110, -62190, -80750, 109077, -5141, 54420, 77118, -271555, 259621, 82383, -203560, -342747, -270842, -140109, 156106, -63724, 40848, -106824, 16362, -77768, -147175, 78932, -25228, 169025, 172468, 315610, 1107939, 1186802, 454549, 505594, 747525, 373215, 23464, 10430, -125979, 362516, -120662, 123063, -40990, 218914, 270811, 51031, 257951, 59819, 255740, -59217, 171957, -142626, -244740, -108703, -367286, -20803, -89430, 244539, -26151, -85148, 114328, 76197, -43044, 137787, 50361, -128140, -406869, 13162, 6606, -47877, -151511, -204212, 3033, 116328, 147910, 31628, -214669, -58801, 291959, 47286, -196317, -151688, 104694, -68003, -207404]
12005b07404q455c817k67163A52606A8558M598J15269o6117J99379A04261h8679
11993a33880q74L1032G6155a88026f1616k41992J14940C29331o9786J65690a07104
11981A41576a08594n0229F7024f2772D0761j8957f5591j49423F3928b07486A48702
11969d06747I0007c5748I9019k4514J35449L159p6239J64407j23297a29459G6469
11957e7188k15155I3648b2084H9822b97083A06321a81372h5997a024m2882B64226
11945A06353a77666E6368L383a94456A8953B593a53674A40842B5399a24603H7560
11933B35997a90179D4523c05878A07863a31903B9290b97816J20792c841j35619
11923a39460k34835b1053I5399b45404j55291e2074B21507b92713h5655n3149
$$ y = [-207404, -215859, -3817, -270980, 152606, 18558, 23156, 138425, 72308, 271687, 104261, -88679, -133880, -134754, -103722, 76155, -188026, -61616, -303608, -188668, 329331, 259545, 425235, -107104, 141576, -108594, -158823, 67024, -62772, 40761, 21804, -65591, -215014, 63928, -207486, 148702, -406747, 90007, -35748, 99019, 74505, 209954, 213113, 136874, 301281, 177984, -129459, 76469, -57188, -272343, 93648, -22084, 89822, -297083, 106321, -181372, -85997, -1024, -43906, 264226, 106353, -177666, 56368, 59751, -194456, 18953, 2593, -153674, 140842, 25399, -124603, 87560, 235997, -190179, 44523, -305878, 107863, -131903, 29290, -297816, -177024, -3841, -139460, -374295, -21053, 95399, -245404, -400695, -52074, 221507, -292713, -85655, -138804]
11913a38804C01284b44813k8072j28344B23711o9126M551d0423j57198C2384c97182
11901I0513b20912m2801b4917k9992a5721j02858a8609C48380a16990G0422Q2980
11890A53402C3844c8869A96511E875a79725A13384a97071A6682K40610G5951J34422
11879B10373B7131K1938N2532d9212G8311Q084d011H1582B4061a02383B15564
11867A31725j1107e276j11574B18512F6350P5877a41111B29577d05198a04233
11856I2014h9735P674r0349B66122b11589A13684h7916D0999D821J1043a42837
11844a90758P4823L4582A32683A1914a026E9586d055C97022G1448b03689d3091
11832i6368J8183b9918j643B6673K73383A25099K6069c08422d9917J4460A4842
$$ y = [-138804, 301284, -244813, -272885, -401229, 223711, 154585, 159136, -40423, -197621, 32384, -397182, 90513, -220912, -263713, -24917, -54909, -15721, -118579, -18609, 348380, -116990, 70422, 153402, 33844, -38869, 196511, 5875, -179725, 113384, -197071, 16682, 257292, 75951, 210373, 27131, 49069, 101601, -49212, 78311, 86395, -4011, 81582, 24061, -102383, 215564, 131725, 120618, -5276, -116850, 218512, 66350, 142227, -141111, 229577, -405198, -104233, 92014, -89735, -82061, -172410, 266122, -211589, 113684, -87916, 40999, 4821, 15864, -142837, -190758, -115935, -81353, 132683, 11914, -1026, 59586, -4055, 397022, 71448, -203689, -43091, -96368, -78185, -29918, -31561, 26673, 300056, 125099, 151168, -308422, -49917, -35457, 14842]
11820B00515b09591J00343K6536j7749j19078k01097A79504b73399i0494A17538
11809b13742Q1122d6139j35295G9702J48708g3134A72569a49028A48735a68619
11798b39858A49018b08367A26989J23606P6606a54225A12052e3909a2276I2946
11787A5330J34535f4336A92195h8772M4017A03099O5025a49656K0851B69711E1094
11775B30813F9314A9789P7796K04068c7673j27200L6913A18700A7384J13373a49446
11763b48269f7187m8329j14862L4860j01265f8703p4865G3019a92782A34694L3122
11752A67816b43694c3756p438A44511e5646j3352q295C55453E7619r722a14070
11740B09377e5265j35638f8473A00287e4874k00929A17510d997D9471K63658a90736
$$ y = [200515, -209591, -109248, -82712, -100461, -219539, -420636, 179504, -273399, -90494, 117538, -213742, -132620, -46139, -181434, 79702, 228410, -73134, 172569, -149028, 148735, -168619, -239858, 149018, -208367, 126989, 250595, 327201, -154225, 112052, -53909, -12276, 92946, 15330, 149865, -64336, 192195, -88772, -44755, 103099, 168124, -149656, -128805, 269711, 51094, 230813, 69314, 19789, 97585, 301653, -37673, -164873, -127960, 118700, 17384, 130757, -149446, -248269, -67187, -115516, -230378, -195518, -296783, -68703, -143568, 73019, -192782, 134694, 167816, -243694, -33756, -41194, 144511, -55646, -68998, -77293, 355453, 57619, 47897, -114070, 209377, -55265, -190903, -68473, 100287, -54874, -255803, 117510, -4997, 49471, 313129, -190736]
11728a0491F9004d0824j05995H7779J54557a38324N0753B82766h9739m1050j32783
11717b63572D5337A8001J51344d6031F4026K5126b50191i8257k9523H1345k7595
11706E3750c05325i2827B16149a25062C55955a36389o1305p5792C04483A5462
11695C26758J730B4889b23306K9418h960I9943O445a33168G6247Q2468a89416
11683C19919a74117C47770j40066D438c36344G0282O8494h0554k5402J1110q0293
11672a75139P6650C37548a41664C70547q8370b7923C2128M04189g7729C45019
11661A96875o7395F4017K38364a36028j70468A04668J01533c1644B2209c7452
11650a62946O6000A36639m8577c1498j34315I223K71682l644E8579L3761a09429
$$ y = [-10491, 69004, -40824, -146819, 87779, 242336, -138324, -87571, 282766, -89739, -130789, -263572, 45337, 18001, 169345, -46031, 64026, 89152, -250191, -98257, -127780, 81345, 53750, -305325, -92827, 216149, -125062, 355955, -136389, -197694, -273486, 304483, 15462, 326758, 328488, 24889, -223306, -193888, -8960, 99943, 106388, -133168, 76247, 158715, -189416, 319919, -174117, 347770, 207704, 4438, -336344, 70282, 138776, -80554, -105956, -94846, -175139, -98489, 337548, -141664, 370547, 282177, -27923, 32128, 436317, -77729, 345019, 196875, 129480, 64017, 302381, -136028, -306496, 104668, 206201, -31644, 22209, -37452, -162946, -96946, 136639, 88062, -31498, -165813, 9223, 280905, 277261, 58579, 92340, -109429]
11638a84749E7591a30157A60352p8480J2697J24024I0364K19821c4238k6942C07701
11626a21832B01732d7417B19758q7216D8601a85632a9968r2150q0230D354b14922
11614a03445j77010h8202C20440a95302B920a36860f0684A33891n8204a33353
11603G4754N2731b03599A18979h2949L8388A87444B0806C26K0278P5839j2488
11592H3955J1572d23969G9816c1535B10969D187a76313l7545p4378B4990a82370
11580A36357P1674C9691P5745d9908A13340e4276k72694f8526G3501K05835a00615
11568A4205C636e6814B08923a28898j0642I2263h3406A8566b11282Q2805F3598
11556b2455A40282J1940E3414A8507K29486o5569f8506o4002A94545a93486B09811
$$ y = [-184749, 57591, -130157, 160352, 81872, 94569, 218593, 90364, 310185, -34238, -61180, 307701, -121832, 201732, -47417, 219758, 132542, 48601, -185632, -19968, -112118, -192348, 4354, -214922, -103445, -280455, -88202, 320440, -195302, 2920, -136860, -60684, 133891, 75687, -133353, 74754, 127485, -203599, 118979, -82949, -44561, 187444, 20806, 326, 20604, 96443, 83955, 95527, -423969, 79816, -31535, 210969, 4187, -176313, -213858, -288236, 24990, -182370, 136357, 208031, 39691, 115436, -49908, 113340, -54276, -326970, -68526, 73501, 279336, -100615, 14205, 3636, -56814, 208923, -128898, -139540, 92263, -83406, 18566, -211282, -128477, 63598, -22455, 140282, 152222, 53414, 18507, 247993, 182424, -68506, -132508, 194545, -193486, 209811]
11544B66252A0192a98465H6455b80274B59798A2187f2496b3905B43592O5810a9674
11532g2403B87742d1845j80319Q9116H9717e3506A05455P81m6894M8732a5024
11520I0921K6972a71166B22341M1337g0724K2966A65428Q1649g1234B98892E2643
11508a37315N3692k5241B22576J84105g9765A36132l9690b18826k10749d5171
11497C33948e8139m0284A73015b17469D1219A0349I77g4178G4991K7516q72O5849
11485A67484d322C53269h042B66634J4649o6833H9158a84438I7092N6267O1067
11474B14426B2526M96473H4877b96339B17082E3451K8936L49563A13025a42782
11463B23833E8000M77871j54217b27382e8738m6130A70593K15223Q7526g9879
$$ y = [266252, 10192, -198465, 86455, -280274, 259798, 12187, -62496, -23905, 243592, 309402, -19674, -72403, 287742, -41845, -222164, -133048, 89717, -53506, 105455, 106236, 59342, 108074, -15024, 90921, 117893, -171166, 222341, 263678, -70724, -47758, 165428, 247077, -71234, 298892, 52643, -137315, -83623, -108864, 222576, 406681, -79765, 136132, 96442, -218826, -429575, -45171, 333948, -58139, -98423, 173015, -217469, 41219, 10349, 977, -74178, 74991, 102507, 101635, 167484, -4322, 353269, -8042, 266634, 281283, 214450, 89158, -184438, 97092, 153359, 214426, 22526, 518999, 84877, -296339, 217082, 53451, 82387, 431950, 113025, -142782, 223833, 58000, 535871, 381654, -227382, -58738, -104868, 170593, 385816, 473342, -79879]
11452B74147G9737B3132g6493A4550L27120P217A07050J28622a98114F7664P541
11441G5205A0307c1915A19480h1481q7913I4684J9703L7897N7849k2706g2315
11429a6310k54545r2062H5447J65517M020d7630B20179r227G8940h6652l2453
11418a19105C33990N8536A40657a64569c1044D5673c159C55466a20157I6738J7114
11407A13852N0875K8929J1328i7634K4181D19477b9830J154k86297A83070B1178
11395A0320K62907e1141k82329g3699C55782J5680C2754J42607A7111b72064l813
11384b75877e4803k2611C87149A20060J05650J6402H7699a19140A4766a42385
11373A4046a27229L8244A66268f7502j9754j16263j94170E0695Q5136M3389a00007
$$ y = [274147, 79737, 23132, -76493, 14550, 341670, 348887, 107050, 235672, -198114, 67664, 75205, 10307, -31915, 119480, -81481, -169394, 94684, 114387, 152284, 210133, 187427, -72315, -16310, -270855, -362917, 85447, 250964, 254984, -47630, 220179, 210952, 78940, -86652, -119105, 333990, 392526, 140657, -164569, -31044, 45673, -3159, 355466, -120157, 96738, 113852, 164727, 193656, 204984, -97634, -73453, 419477, -29830, -28676, -314973, 183070, 21178, 10320, 273227, -51141, -333470, -73699, 355782, 371462, 32754, 175361, 17111, -272064, -275877, -54803, -77414, 387149, 120060, 225710, 242112, 87699, -119140, 14766, -142385, 14046, -127229, -88985, 166268, -67502, -87256, -203519, -397689, 50695, 135831, 179220, -100007]
11361A38500a53126B72916a22958C6853A5052J76218H792K9184K39044d92418
11350A14105J00357j9083b04239M3335J7907M2988A18784e1859G8746c04412J4060
11339b90352K9757F5128a33943M0931J1753F5178e5521j69727F6422c9756H4500
11327d63431H790g094I4709a64592e9597C1690g5723A61261F9072c32248J50004
11316a82244b2600j35790a9673B21546b41071j13054Q3353A43475k7225D6797
11305A52535G172a59026F3904J7795b3574g755j48839i547p280B45770e1099K2578
11293b8521E985L84529A86078b7227Q42C9120A4201h9B26462f4615o2857A61776
11280c39860J50847A77f8321C12751a06694l7528c9356q0223m0849C45413b43202
$$ y = [138500, -153126, 272916, -122958, 36853, 15052, 191270, 8792, 37976, 277020, -492418, 114105, 214462, 195379, -204239, -160904, -142997, -100009, 118784, -51859, 78746, -304412, -290352, -260595, 65128, -133943, -93012, -81259, 65178, -55521, -225248, 66422, -39756, 84500, -463431, 8790, -7094, 94709, -164592, -59597, 31690, -75723, 161261, 69072, -332248, -182244, -22600, -158390, -19673, 221546, -241071, -354125, -270772, 143475, 116250, 46797, 152535, 7172, -159026, 63904, 81699, -23574, -7755, -156594, -9547, -16827, 245770, -51099, -28521, 5985, 390514, 186078, -27227, -26385, 39120, 14201, -89, 226462, -64615, -127472, 161776, -339860, -189013, 177, -68321, 312751, -106694, -144222, -39356, -119579, -160428, 345413, -243202]
11268A54760a23959m2344E3787J30178d9848A10405c20364b2337r6960a7459k65181
11257b82640J26149A97986B4162d1512o3661A20594c3514A91378K51702F6545
11246A14302a18736K9820r8354A28239e9196k14620a20592A12627K54009e5061
11235a3954j42464k69980H6637K2201a3479B97867F2271J33451d5513J2550q3192
11224a16155F727a40823A59082b7564C4214h0647o2007q0814j05940a33009A29724
11212B0122b89437J5771c2013B18860h753j32948D12024b03954h3911B34284a58796
11200b52734o4210c6903k67530B9016J48650a58950n9019p7300G0650J62906c22048
11188c02251N7374L741g9258D1003Q6086D6580a26757k0039A9457L4191L6358
$$ y = [154760, -123959, -166303, 53787, 183965, -49848, 110405, -320364, -22337, -119297, -17459, -282640, -156491, 197986, 24162, -41512, -105173, 120594, -33514, 191378, 443080, 66545, 114302, -118736, -88916, -187270, 128239, -59196, -273816, -120592, 112627, 366636, -55061, -13954, -156418, -426398, 86637, 108838, -13479, 297867, 62271, 195722, -45513, -32963, -116155, 6727, -140823, 159082, -27564, 34214, -80647, -142654, -223468, -329408, -133009, 129724, 20122, -289437, -273666, -32013, 218860, -8753, -141701, 412024, -203954, -83911, 234284, -158796, -252734, -316944, -36903, -304433, 29016, 177666, -158950, -217969, -295269, 70650, 233556, -322048, -302251, -244877, -241136, -79258, 41003, 127089, 46580, -126757, -146796, 19457, 53648, 90006]
11177I0006r897B9309b37669d2380j0107l2957C5593i3444R501B28813e982A97329
11164c34839A12619i2862c8121j30463C75532D1023K68819a07227j91448J47159
11154a51516O3330I7917a74967h1499b1217K414A5474L0342P9502d6474H1713
11142A55307F1019Q4110B5867L47700E4475P6327b59568f1100a7802q7665j03793
11131b09260g4332I1735i2302E6784L9417i5208o6450b6174r4301N9177J0044
11120e1254A92785a22151k18179B11735i4612A19736a50537I2412Q8323G8478
11109d7000b0484A53168l4539a97085g1557C63137D2503i426H0674K07083C8945
11097b40110A69955e8732D202a70508a166B4084D231j890J47473J29862A03493
$$ y = [90006, 80109, 29309, -237669, -42380, -52487, -85444, 35593, -93444, -83943, 228813, -5982, 197329, -334839, 112619, -92862, -38121, -168584, 375532, 41023, 309842, -107227, -298675, -151516, -88186, 97917, -174967, -81499, -21217, -18803, 15474, 45816, 125318, -46474, 81713, 155307, 61019, 145129, 25867, 373567, 54475, 130802, -259568, -61100, -17802, -105467, -209260, -74332, 91735, -92302, 56784, 96201, -95208, -161658, -26174, -120475, -61298, -51254, 192785, -122151, -340330, 211735, -94612, 119736, -150537, 92412, 180735, 78478, -47000, -20484, 153168, 118629, -197085, -71557, 363137, 42503, -9426, 80674, 287757, 38945, -240110, 169955, -58732, 4202, -170508, -1166, 24084, 4231, 2341, 149814, 279676, 103493]
11085A75289P7800C734a13568B77417O9860d8655A16619J55217g2756C98876A01743
11073A59807C5177J50116H7600L06819j2659j86922F8807L10738h4611D86376
11062B56540J35362A58701J34959a17779B99341K4938A47300K08385J43444k27268
11052B71861K8882J7621p8439K19776k6954j64335H5831M13390M3730A74776M85132
11041F59908m924k41193J59281K22810j16916K01547j28247P0802J44605k61990
11031G05683M5606j35826J17357j78807L39976k57158J40594J02895k90517L2717
11021F22520j40816L38869J64942r6905j54938q8369q6218q5515K37862L06312
11011A017744n1707k82316K97916k52295n1466k83329J08218K61321j84283L6555
$$ y = [175289, 253089, 3734, -113568, 277417, 347277, -48655, 116619, 271836, -72756, 398876, 101743, 159807, 35177, 185293, 87600, 394419, 381760, 194838, 68807, 379545, -84611, 486376, 256540, 391902, 158701, 293660, -117779, 299341, 324279, 147300, 355685, 499129, 271861, 300743, 318364, 239925, 459701, 432747, 268412, 85831, 499221, 542951, 174776, 659908, 654984, 413791, 573072, 795882, 678966, 880513, 752266, 823068, 967673, 705683, 751289, 615463, 732820, 554013, 893989, 636831, 777425, 880320, 589803, 622520, 481704, 820573, 985515, 888610, 733672, 645303, 559085, 473570, 711432, 1017744, 966037, 683721, 981637, 729342, 677876, 394547, 502765, 764086, 579803, 616358]
11001F16358j22917J17484J89952k00757J81869p9457j4966k905j19943j51851
10991D12867K87842n0169J67096C15537L56307j14443M9045R6037j15336J97437
10981G84584j72815m6274J79562N402n7307K88113l60683L01762q9589k143L0237
10970H60849n2463K82169M0311J30415k48655K12344L48510M2991k66634M52486
10960A802323J24321p8691N70370L40080J41444n9179O5659M2093k75298n82333
10950B090789J05099m09991p1066k39175o2408J20458O2880j45194k76859L08093
10940A482626j7836j06394j66144k35485m0126k23937O5303P9582k05859q2906
10930E48824j01896p2091q4339K32681a08150A07730P6594a68095B67141j10480
$$ y = [616358, 493441, 610925, 800877, 600120, 781989, 702532, 687566, 684661, 564718, 412867, 700709, 650540, 817636, 315537, 671844, 557401, 606446, 702483, 587147, 784584, 611769, 565495, 745057, 750459, 693152, 981265, 620582, 922344, 832755, 830612, 860849, 808386, 1090555, 1130866, 1261281, 1012626, 1224970, 1573480, 1616471, 1349837, 1802323, 1926644, 1847953, 2418323, 2758403, 2899847, 2840668, 2906327, 2948420, 2673122, 2090789, 2195888, 1785897, 1714831, 1475656, 1413248, 1533706, 1596586, 1451392, 1174533, 1482626, 1464790, 1358396, 1192252, 956767, 916641, 692704, 758007, 837589, 631730, 548824, 446928, 374837, 290498, 523179, -108150, 107730, 184324, -168095, 267141, 156661]
10920A56661J89059r9882G4847Q6283a7555I1942a26332H8320a286C65970a60362
10908c75439B23432J36536A42538b55779A4427J4288h2558k35962f0423A56997
10897A10458O3771K4264r7257f0611j21635G3987a20799e4754C4524L07744B4563
10885A84422b27135j53628c2106j8060G7862g0857p0099i449r1801E6462b17381
10873A95543K18061H4587B8657R551a01533q8429h3437l0250c0003j80428I9010
10861i252l33060d719B47937I4425a1346l05300O3318a07615j09622D573e6966
10849g6189j43420o3899f2620K1750q006A26734m3309a5581m8486p1284E6761
10837G3424N0726P6353B6354M7011b07945d9657j98737e4949G1223a76806J5608
$$ y = [156661, 345720, 245838, 74847, 161130, -17555, 91942, -126332, 88320, -1286, 365970, -160362, -375439, 223432, 359968, 142538, -255779, 14427, 28715, -82558, -318520, -60423, 156997, 110458, 174229, 198493, 101236, -60611, -182246, 73987, -120799, -54754, 34524, 342268, 24563, 184422, -227135, -380763, -32106, -50166, 77862, -70857, -140956, -9449, -101250, 56462, -217381, 195543, 413604, 84587, 28657, 38208, -101533, -189962, -83437, -113687, -30003, -210431, 99010, -9252, -342312, -4719, 247937, 94425, -11346, -316646, -253328, -107615, -217237, 4573, -56966, -76189, -219609, -283508, -62620, -40870, -48876, 126734, 83425, -15581, -64067, -135351, 56761, 73424, 124150, 200503, 26354, 73365, -207945, -49657, -248394, -54949, 71223, -176806, -161198]
10826a61198B8409a2843A93622Q1648d4148A30238b48838f8533G9930b0280F7184
10814a61135C8638i7593A96672a63150A80189O4481F5875a76123A84662E0608
10803B31389d9870o1431H010J15118A8133a78419C6687a82455A70021a1712n1842
10792f3554m8122n1356B10968H6362K06671o4561a1598A16087n7151A3548a3152
10780A02210a75107Q3180C1734J9858R3800N2989b59404a00612p8710j8341M9937
10769a47726L4706N6290k97903B34003i5718E6002n073b04383H6193a54758g3853
10757E3613a71093B4259c124F047J18702m6720c01786A17514i6284A6206b10163
10745A89515a54565D51531C7064a94485F9668j6722k2529i0698j8056G3624r510
$$ y = [-161198, 28409, -12843, 193622, 275270, -44148, 130238, -248838, -68533, 79930, -20280, 67184, -161135, 38638, -97593, 196672, -163150, 180189, 244670, 65875, -176123, 184662, 50608, 231389, -49870, -111301, 8010, 123128, 18133, -178419, 36687, -182455, 170021, -11712, -63554, -111676, -163032, 210968, 86362, 293033, 228472, -11598, 116087, 58936, 13548, -13152, 102210, -175107, -91927, 31734, 51592, 145392, 198381, -259404, -100612, -179322, -197663, -147726, -113020, -56730, -354633, 234003, -95718, 56002, 50929, -204383, 86193, -154758, -73853, 53613, -171093, 24259, -3124, 6047, 124749, 78029, -301786, 117514, -96284, 16206, -210163, 189515, -154565, 451531, 37064, -194485, 69668, 52946, 30417, -90698, -108754, 73624, 64114]
10734F4114c2668j83973n5060j40096G7044h7599K8497j63797h9638j71595A58145
10722f2185k4962o881o7298N452e6031k13365f0867p7908j7304k7439I9675B3740
10709b14071B90097a17543j25874P9215A75717a14281p7983d6147k94303A41338
10698b72940C59029f0049q0052A35729J68348a9484n3003k23066J27071E9453
10687b295j443j71736H7991i158k68007L4028c4394k65749d2741D2664K2034c8171
10674C1698h966A52088d4713A92994e6526C40921b85793i7623A90258b80003B13255
10662A4572h592l1726C64441a43285K6423E8065a13090d5295r5483A20999j373
10651A19626b46610a06820H5726a07577A85426F0963j9620i9756A74438a18000
$$ y = [64114, -32668, -216641, -271701, -411797, 77044, -87599, -59102, -222899, -89638, -261233, 158145, -62185, -87147, -94028, -161326, -155874, -56031, -269396, -60867, -138775, -156079, -183518, 99675, 23740, -214071, 290097, -117543, -243417, -164202, 175717, -114281, -192264, -46147, -340450, 141338, -272940, 359029, -60049, -140101, 135729, 304077, -19484, -72487, -295553, -168482, 59453, -2295, -3738, -175474, 87991, -9158, -277165, -243137, -34394, -300143, -42741, 42664, 64698, -38171, 31698, -8966, 152088, -44713, 192994, -56526, 340921, -285793, -97623, 190258, -280003, 213255, 14572, -8592, -40318, 364441, -143285, -116862, 58065, -113090, -45295, -140778, 120999, 119626, -246610, -106820, 85726, -107577, 185426, 60963, 41343, -99756, 174438, -118000]
10640I817L0550B25a93876R0026m4014A25743O5088a39661B9779c47991A14624
10628g1085k9592L7012A37410a48242A23587J33298G807Q3354j0998a71301l6160
10617b07461L3412k9698A98502a61474g4370A03580a23699d2574j37095N2422
10607a27247L0024H0167c2444l5501A10027a85112D9871P5857b31719F0195k4814
10596C5381a61290E473a795G4969C0204d3525B63448n8628H1026b25725A02357
10584B37249d23242a11503j76861O7172o5510g8466A64613h9804A88857a57910
10573A71788b31836O1484g7385a194C2203K4403R540O6212b3924B0117a73817
10561c7108r3882a378k31429a09996l9756C28746c78315B5970b26935E0594j9968
$$ y = [9817, 40367, 225, -193876, -103850, -147864, 125743, 190831, -139661, 29779, -347991, 114624, -71085, -100677, -63665, 137410, -148242, 123587, 256885, 7807, 91161, 80163, -171301, -207461, -174049, -203747, 198502, -161474, -74370, 103580, -123699, -42574, -179669, -127247, -97223, 80167, -32444, -67945, 110027, -185112, 49871, 125728, -231719, 60195, 35381, -161290, 5473, -1795, 74969, 30204, -43525, 263448, 204820, 81026, -225725, 102357, 237249, -423242, -111503, -288364, -221192, -286702, -78466, 164613, -89804, 188857, -157910, 171788, -231836, -170352, -77385, -1194, 32203, 56606, 66146, 132358, -23924, 20117, -173817, -37108, -130990, -1378, -232807, -109996, -149752, 328746, -378315, 25970, -226935, 50594, 30626]
10550C0626c8616q5648A91668a27776A38539a32906G1161c45809h8933A83724
10539e3339r0399C5674a2467j16304o6019P9110e1154I6106b77763J19057a4755
10527e58448J57277a46906E9429d21540A02628c4441B19794a96264A91145J3061
10517B04206b4599A6268J3688g7280A49061n3097d495m7681C4621f0551A82085
10505e22687C4778O2501c6904r8344b2527M133L608A73607d56661J71248J34605
10494a50808B5565c0788E9190J63108b3265B76543C6916b04799A20996k4373K6896
10483A23519c4795A87049a83363D3233R5318F1874a4370p1557K1230A41466a1406
10471g1864A08938l5973K64145o9585A09973b6327B08731E425K2614J20266D0399
$$ y = [30626, -38616, -124264, 191668, -127776, 138539, -132906, 71161, -345809, -88933, 183724, -53339, -143738, 35674, -12467, -128771, -194790, -115680, -51154, 96106, -277763, -158706, -14755, -558448, -401171, -146906, 59429, -421540, 102628, -34441, 219794, -196264, 191145, 204206, -24599, 16268, 29956, -77280, 149061, 95964, -4495, -52176, 34621, -60551, 182085, -522687, 34778, 97279, -36904, -135248, -22527, -18394, -14786, 173607, -456661, -285413, -150808, 25565, -30788, 59190, 222298, -23265, 276543, 36916, -204799, 120996, 96623, 123519, -34795, 187049, -183363, 43233, 138551, 61874, -14370, -85927, -64697, 141466, -11406, -71864, 108938, 72965, 337110, 267525, 109973, -26327, 208731, 5425, 28039, 148305, 40399]
10459b11211A30715K9727D5088M4982l3745P0432a71965E7969a53149D8651a64660
10447b15919j30630I8660a30918d6386k39547B79164a01571m800M8386A00719
10436A0269a20601r5437G1661b78573i5438B47186B4946a10584j00018c1560A73465
10424G5248b03541D217h2891j31036b7186A38389M8186c6849l4348G506b34603
10412e9994C8309m305P048R0337N3896C1820J29973R3091J73575h9806B66776
10400b01532C51636j74017F9889B6660a78184d2464k41557j22751A15294B4061
10389A25668j3751a13695A55646b64507A31040g5186J1520A95565i7827K9985
10379f7842K4130k5517C19831a98076E3614O1243f8900r3181C57398F6035K48579
$$ y = [-211211, 130715, 160442, 45088, 90070, 56325, 126757, -171965, 57969, -153149, 48651, -164660, -215919, -346549, 98660, -130918, -46386, -285933, 279164, -101571, -106371, -57985, 100719, 10269, -120601, -216038, 71661, -278573, -95438, 247186, 24946, -110584, -210602, -31560, 173465, 75248, -203541, 4217, -82891, -213927, -27186, 138389, 186575, -36849, -71197, 7506, -234603, -59994, 38309, 34004, 41052, 131389, 185285, 31820, 161793, 254884, 428459, -89806, 266776, -201532, 351636, 177619, 69889, 26660, -178184, -42464, -284021, -406772, 115294, 24061, 125668, 111917, -113695, 155646, -264507, 131040, -75186, -63666, 195565, -97827, -67842, -43712, -69229, 319831, -198076, 53614, 114857, -68900, -162081, 357398, 66035, 314614]
10368C14614H5316d8104G537J16816J72729h649C95093A74735K98463A36898R8056
10357B34954N6606A40861J50963L2290q4770M20518l04224J08092j12507j23077
10347B28146K03646j57462A27270K31826j27058O6470B629K93871O6518J39290
10337E02308o5335J3526O5054k07386A19115L38375j5144I013L77784j60324I9375
10325C99926j26062j17489K05505K9037n5127a10484F1177N1923A9908K8337L0423
10314G8668a22448J0990F5999K98056N5193J78702a80232E09388F9860K17161
10304B87021A18192K51516A57024J39499A45477a36358K3421r3856B15405B7428
10293e1745k66861A54528e373A50733C6821a14809j38953J16287c621B43120g403
$$ y = [314614, 85316, -48104, 7537, 124353, 297082, -8649, 395093, 174735, 473198, 136898, 234954, 291560, 140861, 291824, 324114, 239344, 659862, 355638, 463730, 351223, 228146, 431792, 274330, 127270, 359096, 232038, 298508, 2629, 296500, 363018, 502308, 436973, 450499, 515553, 308167, 119115, 457490, 442346, 9013, 386797, 226473, 99375, 399926, 273864, 156375, 361880, 390917, 335790, -110484, 61177, 113100, 19908, 48245, 78668, -122448, -111458, 65999, 364055, 419248, 597950, -180232, 509388, 69860, 287021, 118192, 369708, 157024, 296523, 145477, -136358, -112937, -206793, 215405, 27428, -51745, -318606, 154528, -5373, 150733, 36821, -114809, -253762, -137475, -3621, 243120, -7403]
10281a02924A1043J11173b6086N46I841a09353a2127k51400R0766f921k59913
10270b66834i4405I7959a90260F7317J32115L3917g5289j98431B23668m8928G3709
10258b1278l6727E7724J17252H2147C5185h555j38783N4048R380I5634Q7335b04230
10245f0516C14861j55585K22781I4111d5914O663C24109j11892N487I3025O2060
10234A55085k4503a88978i2015k16109Q1697B3055b0165C6628P8684a36789O0615
10223g6174M659j4043a9596o9188E622L3320d07127J64995a4539m14486a54984
10211H7214A6889h1577b2837E3791O3367a51331A29319a47778g2902A21215a86478
10199a53172j40170e9473B05456B4002P5880J58870a19560K0352n2711B0071J16776
$$ y = [-102924, 11043, 122216, -26086, -25540, 9841, -109353, -12127, -263527, -172761, -6921, -266834, -94405, 97959, -190260, 67317, 199432, 233349, -75289, -273720, 223668, 174740, 73709, -21278, -58005, 57724, 174976, 82147, 35185, -8555, -147338, -93290, -83910, 95634, 182969, -204230, -60516, 314861, 159276, 382057, 94111, -45914, -39251, 324109, 212217, 217704, 93025, 155085, 130582, -188978, -92015, -308124, -226427, 23055, -20165, 36628, 115312, -136789, -76174, -71515, -85558, -19596, -88784, 5622, 38942, -407127, -242132, -14539, -429025, -154984, 87214, 16889, -81577, -22837, 53791, 117158, -151331, 129319, -147778, -72902, 121215, -186478, -153172, -293342, -59473, 205456, 24002, 99882, 258752, -119560, -99208, -151919, 20071, 136847]
10188A36847b51864e8935m44115i5483K4604b5794B16462n8507a94229b0398A74456
10176i5365l3047A24044P7497d60532K17064C28259A02486a98221F7820P355c8751
10164b02593J3035C41a21273A01580h7250n9998B32061c78399b935j4690j66435
10153a84060j5506B83617a54661B14804e7959B05201C2358d2970j96239A0019
10142a99350G8697P501c9809j67670B07357I2972b87900I924a5680G4319j4846
10131E9473d1031J3835n0074D199A248c35810C12491e0147D7986d01974f6053
10119b3105k40703I6943b44619j62018a69223M6049b7718B2196J72892a62647
10108f9634m020q3781L3921j21227F689A285K9817b25961G6717L5576eA51431
$$ y = [136847, -251864, -58935, -503050, -95483, -70879, -25794, 216462, 157955, -194229, -20398, 174456, -95365, -128412, 124044, 201541, -460532, -243468, 328259, 102486, -198221, 67820, 75175, -38751, -202593, -189558, 341, -121273, 101580, -87250, -147248, 232061, -378399, -2935, -17625, -184060, -199566, 283617, -154661, 214804, -57959, 205201, 32358, -42970, -239209, 10019, -199350, 78697, 86198, -39809, -207479, 207357, 92972, -287900, 9924, -15680, 74319, 59473, -41031, -27196, -77270, 4199, 1248, -335810, 312491, -50147, 47986, -401974, -66053, -23105, -263808, 96943, -244619, -406637, -169223, -123174, -27718, 22196, 195088, -162647, -69634, -73654, -157435, -123514, -244741, 6689, 1285, 31102, -225961, 76717, 112293, -5, 151431]
10095a06590H8475m300B2968D629J87572l0488d22625h4853j50726h2104A19165
10083a38731A23711a81230a6022A68903A6452J90111e0694m52373B1967J00171
10073A22138b31006N1172B9592a18619C9086a58622R327C2766J16825O1202A04461
10061a23675e7840C9308a26277M0238k93755d2866r2993A83346E1249b16144Q0802
10050a35342f3551e388j56832A70414g0878k28377a45142B20905b8540B2618b81571
10038d3246A5146b19084A9491a90302e8109n6422B19791b44563f2542n435n9318
10027a27295p4476A35979c98376e0436k8752j36180i7218J3785o0442D8752c0019
10015I7351a28554I0786f7265k37683P5905L9524D8424a39182J308r4226H010
$$ y = [-106590, 88475, 84175, 22968, 4629, 192201, 161713, -422625, -84853, -235579, -82104, 119165, -138731, 123711, -181230, -16022, 168903, 16452, 206563, -50694, -503067, 21967, 122138, -231006, -179834, 29592, -118619, 39086, -158622, -149295, 32766, 149591, 210793, 104461, -123675, -57840, 39308, -126277, -86039, -379794, -42866, -135859, 183346, 51249, -216144, -135342, -63551, -5388, -162220, 170414, -70878, -299255, -145142, 220905, -28540, 22618, -281571, -43246, 15146, -219084, 19491, -190302, -58109, -114531, 219791, -244563, -62542, -67977, -127295, -201771, 135979, -398376, -50436, -79188, -215368, -97218, -83433, -143875, 48752, -30019, 97351, -128554, 90786, -67265, -304948, -229043, -189519, 48424, -139182, -137874, -232100, 8010]
10003c71210c0015H2871g3197k372K1687o9968d6703E0679K46497A43796B4328
9991b06700A01176g1599I4309C0966b48278C8882J8782N610a00715j22280g7024
9979b11389A58729c09427e227k81008J22411k67195a17706D6J70318a21949b3035
9967c49798g6580b6588B45913E3967b82365a6185D8852a8269D2931P3544B1708
9955A01996a7977p4916r1500d4371j03396O009L3021p6760D38374c8861j66338
9944b05199A35762L8578F809b16350A1038M364a39779H2577K31576a89261B1217
9932a26807d2424B108a29346C93909e8146j04753j10513a6865A88949k1820c01191
9920b89822E05b03264j71045a452m9666l83570p3908b25384j5881A72591f1375
$$ y = [-371210, -30015, 82871, -73197, -75569, -53882, -123850, -46703, 50679, 297176, 143796, 24328, -206700, 101176, -71599, 94309, 30966, -248278, 38882, 57664, 63274, -100715, -222995, -77024, -211389, 158729, -309427, -5227, -286235, -163824, -431019, -117706, 46, 170364, -121949, -23035, -349798, -76580, -26588, 245913, 53967, -282365, -16185, 48852, -18269, 42931, 116475, 21708, 101996, -17977, -92893, -184393, -44371, -147767, -141758, -108737, -185497, 438374, -38861, -205199, 135762, 174340, 6809, -216350, 11038, 15402, -139779, 82577, 314153, -189261, 21217, -126807, -42424, 2108, -129346, 393909, -58146, -162899, -273412, -16865, 188949, 167129, -301191, -289822, 505, -203264, -374309, -1452, -51118, -434688, -508596, -225384, -241265, 172591, -61375]
9908C6197b41140M3579A2806J7237a69079K6323O4128j56177H989J32478a76306
9896b74892B00397a47721K5160M0715K7794l46374a53445A72807a87016j48330
9886c35346a14857j51790b625F9692C2768a53671B76588e6421B69692b8186l4750
9875f2936K3960j79786g1881C6804a10137c2006A2232J3347b93695A05348f2994
9863c04531J18167d0935b419k18184b2822p4550I0428c36284h2377A77465i1768
9851c30505h1216D2883o554d48264J1254a47598K4982J0708L443d5815B48847
9839A68958a63187f4899k8884l52567j11672a59685D262a73779L6179B6382g34
9827a33553A4567b34949b3143m9365G4964b17247A7051c3843j86934a446j44209
$$ y = [36197, -241140, -197561, 12806, 30043, -169079, -142756, -78628, -234805, 8989, 141467, -176306, -274892, 200397, -147721, -122561, -81846, -54052, -400426, -153445, 172807, -187016, -335346, -114857, -266647, -2625, 69692, 32768, -153671, 276588, -56421, 269692, -28186, -62936, -38976, -218762, -71881, 36804, -110137, -32006, 12232, 25579, -293695, 105348, -62994, -304531, -186364, -40935, -2419, -220603, -22822, -97372, 90428, -336284, -82377, 177465, -91768, -330505, -81216, 42883, 36329, -448264, -437010, -147598, -122616, -111908, -108465, -45815, 248847, 168958, -163187, -64899, -93783, -446350, -558022, -159685, 4262, -173779, -137600, 26382, -734, -133553, 14567, -234949, -23143, -72508, 74964, -217247, 17051, -33843, -220777, -1446, -145655]
9816a45655r6381k48657b03098A8236Q993C898J32251E7391a33507q654D6651
9804A65699G3364a53514k32622A25907a77916j61861J20427l37020B70653a91480
9793B51164a76714A42141b88045k66208A86479a77363D5435b38063j43538a56718
9782b49544A93676a26849A6945Q8274g3760q2308K8348B54525b12874c6134j4430
9771e0564A19628E800b14256A20482n3540a0334j14136q0937p8806A00450B6728
9759a13356A14562h4031C00318a09153A98508i9512l0694F3687a65111k0635J3605
9748a72141f0642l4910d7607j44023k1130P9673D5771a43416N3647A66959a09509
9736D2985a69102n7905A59607m6995J7262K8741a0214q5587D5055b89134c4314
$$ y = [-145655, -242036, -490693, -203098, 18236, 27229, 3898, 136149, 57391, -133507, -142161, 46651, 165699, 73364, -153514, -386136, 125907, -177916, -339777, -219350, -556370, 270653, -191480, 251164, -176714, 142141, -288045, -554253, 186479, -177363, 45435, -238063, -381601, -156718, -249544, 193676, -126849, 16945, 105219, -73760, -156068, -127720, 254525, -212874, -36134, -50564, 119628, 5800, -214256, 120482, 66942, -10334, -124470, -205407, -284213, 100450, 26728, -113356, 114562, -84031, 300318, -109153, 198508, -99512, -130206, 63687, -165111, -185746, -172141, -60642, -95552, -47607, -191630, -212760, -133087, 45771, -143416, -89769, 166959, -109509, 42985, -169102, -227007, 159607, 112612, 129874, 158615, -10214, -95801, 45055, -289134, -34314]
9724D3628p779b14378IJ1493N013b11319A44511a11781A55434G1725f3930l3787
9712i7717A53034b64810a13018K314j5859D0181N5903L12028A48637D9667a68971
9700a1970r5288K8812A68419a53432f6855H9716a64049D2462O0037h4638p4006
9689a58644Q916L9991l9527f2377a8485l01580A51994a19139A33986E5899L22127
9678C78026c14119A89754c91941J14612Q1051G5692d72424b22163A15917b55079
9667E8397a60356j43192i2652a7665k80408E9998b56715K3310I302N3695a36559
9655a88199j10368A24264A0280K75624G6826C3343J21471a33764R75A9446K76313
9644B95759h3592A83626a14104k86286i29A28379a69890P7269l6975m4083B16302
$$ y = [43628, 35849, -214378, 9, 11502, 16515, -211319, 144511, -111781, 155434, 71725, -63930, -97717, 153034, -264810, -113018, -110704, -126563, 40181, 96084, 408112, 148637, 49667, -168971, -11970, -107258, -78446, 168419, -153432, -66855, 89716, -164049, 42462, 102499, -84638, -158644, -149728, -109737, -149264, -62377, -18485, -320065, 151994, -119139, 133986, 55899, 378026, -314119, 189754, -391941, -277329, -196278, 75692, -472424, -222163, 115917, -255079, 58397, -160356, -303548, -92652, -17665, -298073, 59998, -256715, -233405, 9302, 62997, -136559, -188199, -298567, 124264, 10280, 285904, 76826, 33343, 154814, -133764, -132789, 19446, 295759, -83592, 183626, -114104, -400390, -929, 128379, -169890, -92621, -129596, -173679, 216302]
9632h2641B15852a1844j87528a6829B09558a16218B4320J4306Q721A4390a32326
9620a89334E7475d9000j04766N5873k2274N0849A36733a90691A0112P2053K05481
9609B87646f7622m80A51393b73407m7142F8297b321D435h9367a87j73539G8816
9596B6290m890d7292r7360A21283l2842b3973k00136d8452j54908C8130a42465
9584f0617j17007j69688J08309f836j71186q5514P1673B00037q549i8192G0512
9572c38971i5147K08j65566p5647a47982L9678o6115B26475h3624I5065p859e2002
9559c10857d1906j3197K7181p1800E1710J34259p5463E1031J8208J44058q7330
9548A25967f4067b8149B9907a93352A65835e5847l10561E2914a20963j14799A95311
$$ y = [-82641, 215852, -11844, -199372, -16829, 209558, -116218, 24320, 38626, 47347, 14390, -132326, -189334, 57475, -49000, -153766, -97893, -120167, -69318, 136733, -190691, 10112, 82165, 287646, -67622, -68102, 151393, -273407, -320549, 68297, -2321, 4435, -89367, -187, -173726, 78816, 26290, 21400, -47292, -144652, 121283, 88441, -23973, -224109, -48452, -203360, 38130, -142465, -60617, -177624, -347312, -239003, -6836, -178022, -263536, -191863, 200037, 191488, -98192, 70512, -338971, -95147, -94939, -260505, -336152, -147982, -108304, -174419, 226475, -83624, 95065, 87206, -52002, -310857, -41906, -55103, -27922, -99722, 51710, 185969, 110506, 51031, 69239, 213297, 125967, -64067, -28149, 29907, -193352, 165835, -55847, -366408, 52914, -120963, -235762, 195311]
9536a04944n21667i0032A0797L271a09646m9250O8043G50b10998B78496b46543
9524B62144E8594b5269D0389K80839j48895A1453b6446q97E5197B3428c12848
9512e1116p6869B17572b45919b2078j14860j61954A7609a69097b3905j34887K7919
9501a30873D7005b65532R2243A41760k3988i4396a0601l2313H6935J32624a19287
9489d88625E1305a6579E372a47021k58869g4937l4581l931j04515O0687j10469
9478b67746B71194e2757A47544a21739k64549p2908A43287o0902i853k43807J1150
9467b42510h3472j82460A04231e5364j13343g9954B10597c58222d2823m7640P993
9456h2470j26204f4439L0937A45153G494M6076J48516a56400H6436N3815e07842
$$ y = [-104944, -626611, -90032, 10797, 14068, -109646, -158896, -90853, 750, -210998, 278496, -246543, 262144, 58594, -25269, 40389, 321228, 172333, 11453, -26446, -27343, 55197, 23428, -312848, -51116, -127985, 217572, -245919, -22078, -136938, -298892, 17609, -169097, -23905, -158792, -130873, 47005, -265532, -173289, 141760, 117772, -94396, -10601, -42914, 86935, 219559, -119287, -488625, 51305, -16579, 5372, -147021, -405890, -74937, -109518, -113449, -217964, -157277, -267746, 271194, -52757, 147544, -121739, -386288, -459196, 143287, 82385, -9853, -253660, -242510, -83472, -265932, 104231, -55364, -168707, -79954, 210597, -358222, -42823, -90463, -82470, -208674, -64439, -33502, 145153, 7494, 53570, 202086, -156400, 86436, 140251, -507842]
9444b76101d0792k24590A01740D000d33552a3189D5496L9669l1977i3453L5802
9433e7651r0550B0060a71471f3240k17107b6440l90487J34461B83353g9010c0058
9421a22434C05135a75899c1796G463L80245A24202b05021g1954d457n0354E988
9409b92085B1543a49723A43030L3415a24770j93110g6214c312C05986b24783a1977
9397B9492J38178a25315K7612j14309C48513j72994j0489A9235P0944L5290c64137
9385c03677L4810B82073a72435I9011K26646M0613a40739J5945K5769k09500B9581
9373g4457j05251d6048j93130E8515f6859p6699q322B2950c85086A27490a99700
9361A77180c06038O4380B20054c43116d8729l9715B6408q222L7697b17995B18246
$$ y = [-276101, -40792, -265382, 101740, 4000, -433552, -13189, 45496, 85165, 53188, -93453, -57651, -148201, 20060, -171471, -63240, -280347, -26440, -416927, -282466, 283353, -79010, -30058, -122434, 305135, -175899, -31796, 7463, 387708, 124202, -205021, -71954, -4457, -54811, 5988, -292085, 21543, -149723, 143030, 176445, -124770, -317880, -76214, -3312, 305986, -224783, -11977, 29492, 167670, -125315, -97703, -212012, 348513, 175519, 165030, 19235, 90179, 125469, -364137, -303677, -268867, 282073, -172435, 99011, 325657, 366270, -140739, -124794, -99025, -308525, 29581, -74457, -179708, -46048, -239178, 58515, -66859, -143558, -151880, 22950, -385086, 127490, -199700, 177180, -306038, -241658, 220054, -343116, -48729, -88444, 26408, 18186, 55883, -217995, 218246]
9349E0168a39673Q27f4633l25196i4984k40166A31962d5670q6850A78162a68762
9337d9054p086n382A69944a13513o7452A18177a45494f5457l1158G2495b78379
9325a27832B51356a13716B18290G6988a00816j23147B22222G345a15204j26031
9315b41235H1282a08097j20273f6910k6405Q905E9115E273J6291a55339j04104
9304b59443i5571o4010A21144a25916q9287P8355F1847a06126H4181b43467K9080
9293b14387k2324l2317B04233I1175b9405r0054b5561n4967A11602j1814c7099
9281d2074r9337l874l0314j65483J63190j57406h9858Q603b2673k2327B96633
9269C55230A55184a03047B08017b67225G7125a05675j42926j93155a36332M6843
$$ y = [50168, -139673, -138846, -64633, -389829, -94984, -335150, 131962, -45670, -132520, 178162, -168762, -49054, -56140, -61522, 169944, -113513, -180965, 118177, -145494, -65457, -96615, 72495, -278379, -127832, 251356, -113716, 218290, 76988, -100816, -223963, 222222, 7345, -115204, -241235, 81282, -108097, -228370, -66910, -93315, -84410, 59115, 5273, 21564, -155339, -259443, -95571, -159581, 121144, -125916, -215203, -136848, 61847, -106126, 84181, -243467, -214387, -236711, -269028, 204233, 91175, -29405, -119459, -25561, -80528, 111602, 99788, -37099, -42074, -141411, -145285, -175599, -341082, -177892, -335298, -89858, -81255, -22673, -45000, 296633, 355230, 155184, -103047, 208017, -267225, 77125, -105675, -248601, -441756, -136332, -89489]
9259h9489l8010d5637H974b56040a0572I1842a17577F9978a69469A82442c09853
9247e0483i192n8688m813k96325a07156C8519f8064j42772l0848R0740O0492o3681
9235a54133O5842E2128b00127A1827R2043m7081h6101D2703d0631j58161E1732
9223b12379A66504a87624j6977A06081a41097I8936a28596k74920J73639B2170
9212i3805C60256b81808A02171a4448A998K01295a14108D5588K56482j17727B2743
9200a48316q3938A51618a39973A31687a67140k21675A2630a18471D3538l594e7836
9188a8033G8307F330b39077f9928G2723b6335j15146C0261N8418M04614B13507
9176E506M33657F7749E745e63740h039o4814j15934o6616C7331J26031k4792b1818
$$ y = [-89489, -127499, -45637, 8974, -256040, -10572, 91842, -117577, 69978, -169469, 182442, -309853, -50483, -9192, -67880, -72693, -369018, -107156, 38519, -68064, -210836, -241684, -150944, -90452, -154133, -88291, 52128, -200127, 11827, 103870, 56789, -86101, 42703, -40631, -198792, 51732, -212379, 166504, -187624, -204601, 106081, -141097, 98936, -128596, -403516, -229877, 22170, -93805, 360256, -281808, 102171, -14448, 1998, 203293, -114108, 45588, 302070, 184343, 22743, -148316, -232254, 151618, -139973, 131687, -167140, -388815, 12630, -118471, 43538, 39944, -57836, -18033, 78307, 6330, -239077, -69928, 72723, -26335, -141481, 30261, 88679, 493293, 213507, 5506, 439163, 67749, 5745, -563740, -8039, -72853, -188787, -255403, 37331, 163362, 138570, -21818]
9163c1997A14026B5397P7978b30068d4431o2364C0617R8927h7937b4796j46172
9152a70968k9384G3722J61458F1755e1072p950k8253j29494C5202i8613l9953
9141a38566m1173j42320E6852e4039j90960A88751J712a13894j28256b0270C9401
9129a30506f2005B02657a74687l0359b8558j21912c3595p3639K7398j06413O7524
9118a18725J0056B12574b71944R9802Q2103J5563l00701e909j52071A39165P9229
9107B18394L621e4581D9793A5727a8935j9327j03883D7732L6429g3283F0920h6449
9094b57922B18506b58291c8543k82455R6160P4046H200h6150k7436o6227i505
9082A65566a78050b3424l7996q5998l23589b25532N3889B86361a24973A1151b13531
$$ y = [-31997, 114026, 25397, 103375, -230068, -44431, -106795, 30617, 129544, -87937, -24796, -170968, -200352, 73722, 235180, 61755, -51072, -59022, -87275, -216769, 35202, -98613, -138566, -179739, -322059, 56852, -54039, -244999, 188751, 190463, -113894, -242150, -20270, 39401, -130506, -62005, 202657, -174687, -205046, -28558, -150470, -33595, -107234, -79836, -186249, -118725, -108669, 212574, -271944, -172142, -90039, -74476, -375177, -5909, -157980, 139165, 218394, 222015, -54581, 49793, 15727, -18935, -38262, -142145, 47732, 84161, -73283, 60920, -86449, -257922, 218506, -258291, -38543, -320998, -224838, -150792, 8200, -86150, -113586, -179813, -9505, 165566, -178050, -23424, -61420, -147418, -471007, -225532, -171643, 286361, -124973, 11151, -213531]
9070E7248M3936l2131c79024M8459A15261i0007p5257B20065C8699P0707h9833
9058a26580C21025j21379b27553b6087j55527I493f1425C7411m931N5247a63931
9046a86094b4467A01483G78b21614G9781B1165M5620M0410D2239K7845a0261I8543
9033b8146A64550q496b2372F5513q206J42104R1938F3121J61353d62360D6637
9021B9371c10934i6684A17006E4766b1056j87810G7111K15396b54415R2908e8092
9009D1817b38350L1203G1759h4417C01398a48232k1578A80012D8959b54523D3009
8997a5730H1988c8300k21760B79379b91206J37125q7659H7816e705k16818a5133
8985A6356a19515R474J5047k49670J52299A14668A6156a64790c5117C3504i6357
$$ y = [57248, 101184, 69053, -379024, -330565, 115261, -90007, -165264, 220065, 38699, 109406, -89833, -126580, 321025, 199646, -227553, -26087, -181614, 9493, -61425, 37411, 32480, 87727, -163931, -186094, -24467, 101483, 778, -221614, 79781, 21165, 66785, 107195, 42239, 70084, -10261, 98543, -28146, 164550, 156054, -22372, 65513, 57307, 199411, 291349, 63121, 224474, -462360, 46637, 29371, -310934, -96684, 117006, 54766, -21056, -208866, 77111, 292507, -254415, -161507, -58092, 41817, -238350, -207147, 71759, -84417, 301398, -148232, -169810, 180012, 48959, -254523, 43009, -15730, 81988, -38300, -260060, 279379, -291206, -154081, -241740, 87816, -5705, -222523, -15133, 16356, -119515, -110041, -94994, -344664, -192365, 114668, 16156, -164790, -35117, 33504, -96357]
8973a80714j07j32380B99758b63680k0399a01759g975j27498A2364Q6202j112
8962I7454k5879b32717a00569A40963C0108a4103j63728h6496A3728i5254b0365
8950A55952C0301b44918j02208a1560C7000N3797K47874B9939O8518b21341E6095
8938a2902A98054a79074D49255c78493J87880h9761A68023c12743c1035B2893
8927D3888g247j42293l6589B31a70531B70373e7515j06902B15362p5477G374a85092
8914C29940k8362q768J62801J80485k0574L98332R91542J299827M824452j253407
8904F876268k363720j554130q36722I41283q8194B84724m3530K2194b2319C08206
8893B8954K72641j16269l1470l8778A3831c629A08584f991k6556j68718j07924
$$ y = [-180714, -180821, -313201, 299758, -263680, -284079, -101759, -7975, -135473, 12364, 98566, 97454, 71575, -232717, -100569, 140963, 30108, -14103, -177831, -86496, 13728, -95254, -20365, 155952, 30301, -244918, -347126, -11560, 37000, 90797, 338671, 29939, 98457, -221341, 56095, -12902, 198054, -179074, 449255, -378493, -190613, -89761, 168023, -312743, -31035, 22893, 43888, -7247, -149540, -186129, 231, -170531, 270373, -57515, -164417, 215362, 139885, 7374, -185092, 329940, 301578, 292810, 455611, 636096, 615522, 1013854, 2005396, 3305223, 8129675, 6876268, 4512548, 2958418, 2121696, 941283, 853089, 284724, 241194, 263388, -22319, 308206, 28954, 301595, 185326, 153856, 115078, 13831, -3629, 108584, -6991, -33547, -202265, -310189]
8882c10189a09929C17712c7273k42213i4076n0303p1013C2676N1361g72k48068
8871b48840m0317i4897A17753n1083b21119D76601a19491A12165a72472g3043
8860b30846A07497a82615d9568j5297k91968C7395i4114c7697k18596I7458A576
8848d42432I9427g203k60127C13143B0325J2170g7543b0607k03554A56566m8288
8837A08278b5030G8496a98795B88811d82020C9731a13654k76997j78587G6021
$$ y = [-310189, -109929, 317712, -37273, -279486, -94076, -144379, -215392, 32676, 84037, -772, -248840, -289157, -94897, 117753, 66670, -221119, 476601, -119491, 112165, -172472, -73043, -230846, 107497, -182615, -49568, -64865, -356833, 37395, -94114, -37697, -256293, 97458, 1576, -442432, 99427, -7203, -267330, 313143, 20325, 32495, -77543, -20607, -224161, 156566, 108278, -25030, 78496, -198795, 288811, -482020, 39731, -113654, -390651, -569238, 76021]
$$ [...]
##END NTUPLES=NMR SPECTRUM
##END=
