
##TITLE=UV1134_M4-1010-1000_6275194_EanHfBuagE
##JCAMPDX= 6.0         $$ Bruker NMR JCAMP-DX V2.0
##DATA TYPE= NMR SPECTRUM
##DATA CLASS= NTUPLES
##ORIGIN= BRUKER
##OWNER= Administrator
$$ 1.72 TOPSPIN		Version 2.1
$$ 2012-06-03 01:06:48.546 -0500  Administrator@TOPSPIN
$$ Compression mode = diff/dup
##.OBSERVE FREQUENCY= 400.13188235
##.OBSERVE NUCLEUS= ^1H
##.ACQUISITION MODE= SIMULTANEOUS (DQD)
##.ACQUISITION SCHEME= undefined
##.AVERAGES= 64
##.DIGITISER RES= 22
##SPECTROMETER/DATA SYSTEM= spect
##.PULSE SEQUENCE= noesygpps1d.comp
##.SOLVENT NAME= COFFEE_meoh
##.SHIFT REFERENCE= INTERNAL, COFFEE_meoh, 1, 14.96675
##AUDIT TRAIL= $$ (NUMBER, WHEN, WHO, WHERE, PROCESS, VERSION, WHAT)
$$ ##TITLE= Audit trail, TOPSPIN		Version 2.1
$$ ##JCAMPDX= 5.01
$$ ##ORIGIN= Bruker BioSpin GmbH
$$ ##OWNER= Administrator
$$ $$ C:\Bruker\TOPSPIN/data/COFFEE/nmr/UV1134_M4-1010-1000_6275194_EanHfBuagE/12/pdata/1/auditp.txt
$$ ##AUDIT TRAIL=  $$ (NUMBER, WHEN, WHO, WHERE, PROCESS, VERSION, WHAT)
(   1,<2012-06-03 01:06:43.390 -0500>,<Administrator>,<TOPSPIN>,<go>,<TOPSPIN 2.1>,
      <created by zg
	started at 2012-06-03 00:55:13.125 -0500,
	POWCHK enabled, PULCHK disabled,
       configuration hash MD5:
       D5 CA 7A 23 FE 6B EE E2 50 67 74 61 24 F7 5E 3B
       data hash MD5: 64K
       0C 3B 41 1C 79 A2 55 EA 6F 12 6B 60 12 9E D5 8E>)
(   2,<2012-06-03 01:06:46.234 -0500>,<Administrator>,<TOPSPIN>,<proc1d>,<TOPSPIN 2.1>,
      <Start of raw data processing
       efp LB = 0.3 FT_mod = 6 PKNL = 1 PHC0 = 0 PHC1 = 0 SI = 128K 
       data hash MD5: 128K
       EC 99 BE A0 0A F2 FB 09 1C F2 CB BF 34 58 76 B4>)
(   3,<2012-06-03 01:06:47.468 -0500>,<Administrator>,<TOPSPIN>,<proc1d>,<TOPSPIN 2.1>,
      <pk PHC0 = 34.26636 PHC1 = 0 
       data hash MD5: 128K
       53 C3 A0 E4 7D 14 BD 79 6C 52 18 26 31 42 CB 4E>)
(   4,<2012-06-03 01:06:48.203 -0500>,<Administrator>,<TOPSPIN>,<proc1d>,<TOPSPIN 2.1>,
      <abs ABSG = 1 
       data hash MD5: 128K
       EB 40 05 52 88 C6 07 42 9A BD BC CB 9D 06 C8 3E>)
(   5,<2012-06-03 01:06:48.281 -0500>,<Administrator>,<TOPSPIN>,<proc1d>,<TOPSPIN 2.1>,
      <abs ABSG = 2 
       data hash MD5: 128K
       EF 42 4C 6A CD 04 7F E7 A6 37 30 76 CA DB 73 41>)
(   6,<2012-06-03 01:06:48.328 -0500>,<Administrator>,<TOPSPIN>,<proc1d>,<TOPSPIN 2.1>,
      <abs ABSG = 3 
       data hash MD5: 128K
       47 D2 C2 8C 55 E4 67 A5 FC 30 17 99 69 AA EA E8>)
(   7,<2012-06-03 01:06:48.390 -0500>,<Administrator>,<TOPSPIN>,<proc1d>,<TOPSPIN 2.1>,
      <abs ABSG = 4 
       data hash MD5: 128K
       7D D7 4C AC AA D0 2F C1 41 55 36 3A 88 7B 5E 3A>)
(   8,<2012-06-03 01:06:48.453 -0500>,<Administrator>,<TOPSPIN>,<proc1d>,<TOPSPIN 2.1>,
      <abs ABSG = 5 
       data hash MD5: 128K
       6A 15 5D 22 03 C4 B0 37 F8 E7 1E 70 9B 9E 9D F0>)
$$ ##END=
$$ 
$$ $$ hash MD5
$$ $$ 2C 0B 13 9D 8D 8A 79 23 82 44 31 A9 3D 00 00 0A
##$RELAX= 
##$RELAX= 
##$RELAX= 
##$RELAX= 
##$RELAX= 
##$RELAX= 
##$RELAX= 
##$RELAX= 
$$ Bruker specific parameters
$$ [...]
##$TP07= 0
##$TPNAME0= <>
##$TPNAME1= <>
##$TPNAME2= <>
##$TPNAME3= <>
##$TPNAME4= <>
##$TPNAME5= <>
##$TPNAME6= <>
##$TPNAME7= <>
##$TPOAL= (0..7)
0.5 0.5 0.5 0.5 0.5 0.5 0.5 0.5
##$TPOFFS= (0..7)
0 0 0 0 0 0 0 0
##$TUNHIN= 0
##$TUNHOUT= 0
##$TUNXOUT= 0
##$USERA1= <user>
##$USERA2= <user>
##$USERA3= <user>
##$USERA4= <user>
##$USERA5= <user>
##$V9= 5
##$VALIST= <valist>
##$VCLIST= <CCCCCCCCCCCCCCC>
##$VD= 0
##$VDLIST= <DDDDDDDDDDDDDDD>
##$VPLIST= <PPPPPPPPPPPPPPP>
##$VTLIST= <TTTTTTTTTTTTTTT>
##$WBST= 2048
##$WBSW= 25
##$XGAIN= (0..3)
0 0 0 0
##$XL= 0
##$YL= 0
##$YMAX_a= 10909740
##$YMIN_a= -6420082
##$ZGOPTNS= <>
##$ZL1= 120
##$ZL2= 120
##$ZL3= 120
##$ZL4= 120
##$ABSF1= 14.96675
##$ABSF2= -5.58578
##$ABSG= 5
##$ABSL= 3
##$ALPHA= 0
##$AQORDER= 0
##$ASSFAC= 0
##$ASSFACI= 0
##$ASSFACX= 0
##$ASSWID= 0
##$AUNMP= <proc_prof1d_extract.lims>
##$AXLEFT= 0
##$AXNAME= <>
##$AXNUC= <1H>
##$AXRIGHT= 0
##$AXTYPE= 0
##$AXUNIT= <>
##$AZFE= 0.1
##$AZFW= 0.1
##$BCFW= 0
##$BC_mod= 0
##$BYTORDP= 0
##$COROFFS= 0
##$CY= 15
##$DATMOD= 1
##$DC= 0
##$DFILT= <>
##$DTYPP= 0
##$F1P= 0
##$F2P= 0
##$FCOR= 0.5
##$FTSIZE= 131072
##$FT_mod= 6
##$GAMMA= 0
##$GB= 0
##$INTBC= 1
##$INTSCL= 1
##$ISEN= 128
##$LB= 0.3
##$LEV0= 0
##$LPBIN= 0
##$MAXI= 10000
##$MC2= 0
##$MEAN= 0
##$ME_mod= 0
##$MI= 0
##$NCOEF= 0
##$NC_proc= -3
##$NLEV= 6
##$NOISF1= 0
##$NOISF2= 0
##$NSP= 0
##$NTH_PI= 0
##$NZP= 0
##$OFFSET= 14.96675
##$PC= 1
##$PHC0= 34.26636
##$PHC1= 0
##$PH_mod= 1
##$PKNL= yes
##$PPARMOD= 0
##$PPDIAG= 0
##$PPIPTYP= 0
##$PPMPNUM= 2147483647
##$PPRESOL= 1
##$PSCAL= 4
##$PSIGN= 0
##$PYNMP= <proc.py>
##$REVERSE= no
##$SF= 400.130005548352
##$SI= 131072
##$SIGF1= 0
##$SIGF2= 0
##$SINO= 400
##$SIOLD= 131072
##$SPECTYP= <>
##$SREGLST= <1H.CDCl3>
##$SSB= 0
##$STSI= 131072
##$STSR= 0
##$SW_p= 8223.68421052632
##$SYMM= 0
##$S_DEV= 0
##$TDeff= 65536
##$TDoff= 0
##$TI= <>
##$TILT= no
##$TM1= 0
##$TM2= 0
##$TOPLEV= 0
##$USERP1= <user>
##$USERP2= <user>
##$USERP3= <user>
##$USERP4= <user>
##$USERP5= <user>
##$WDW= 1
##$XDIM= 131072
##$YMAX_p= 451981676
##$YMIN_p= -354839344
##$CURPLOT= <Network HP LaserJet P1505>
##$CURPRIN= <$Network HP LaserJet P1505>
##$DFORMAT= <normdp>
##$LAYOUT= <+/1D_H.xwp>
##$LFORMAT= <normlp>
##$PFORMAT= <normpl>
##$SURQMSG= 1
$$ End of Bruker specific parameters
$$ ---------------------------------
##NTUPLES= NMR SPECTRUM
##VAR_NAME=  FREQUENCY,     SPECTRUM/REAL,   SPECTRUM/IMAG
##SYMBOL=    X,             R,               I
##VAR_TYPE=  INDEPENDENT,   DEPENDENT,       DEPENDENT
##VAR_FORM=  AFFN,          ASDF,            ASDF
##VAR_DIM=   131072,        131072,          131072
##UNITS=     HZ,            ARBITRARY UNITS, ARBITRARY UNITS
##FACTOR=    0.0627417313425165, 1,          1
##FIRST=     8223.62146879498, 5233,         -104569
##LAST=      0,             8362,            -104399
##MIN=       0,             -354839344,      0
##MAX=       8223.62146879498, 451981676,    0
$$ Real data points
##PAGE= N=1
##DATA TABLE= (X++(R..R)), XYDATA
$$ [...]
63524A367395k7591k7038k6094k5188k4011k2599k1310j9974j8154j6237j5036
63513A124163j4123j1855p818m077k792l245k639L82M351P293R006J0455J2058
63500A121159J3564J4976J6468J7671J8094J8337J9880K3356K7672L1400L4390
63489A356967L7438M0814M4016M6876M9788N2307N2364M7892L9117K8532J8641
63478A814752J0377L604j749n529p772q808r283j0131j2120j5106j8329k1600
63466A718306k5491l0067l4333l7528m0090m2520m4175m4234m3245m2402m1728
63455A292493m0269l7851l5312l3095l0906k8816k7308k6100k4262k1841j9925
63444I66808j8677j6811j3746j0999j0314j1439j2637j2623j1074q217n030l161
$$ y = [1367395, 1339804, 1312766, 1286672, 1261484, 1237473, 1214874, 1193564, 1173590, 1155436, 1139199, 1124163, 1110040, 1098185, 1090367, 1086290, 1083498, 1080253, 1077614, 1077996, 1082347, 1089640, 1098646, 1109101, 1121159, 1134723, 1149699, 1166167, 1183838, 1201932, 1220269, 1240149, 1263505, 1291177, 1322577, 1356967, 1394405, 1435219, 1479235, 1526111, 1575899, 1628206, 1680570, 1728462, 1767579, 1796111, 1814752, 1825129, 1828733, 1826984, 1821455, 1813683, 1804875, 1795592, 1785461, 1773341, 1758235, 1739906, 1718306, 1692815, 1662748, 1628415, 1590887, 1550797, 1508277, 1464102, 1419868, 1376623, 1334221, 1292493, 1252224, 1214373, 1179061, 1145966, 1115060, 1086244, 1058936, 1032836, 1008574, 986733, 966808, 948131, 931320, 917574, 906575, 896261, 884822, 872185, 859562, 848488, 840271, 835241, 832080]
63432H32080l391m453m314k435m9J412J440M64m74m04N24R97K17q91q02P61K846
63415H23528M521N182M192J497j588l363l538l250l431m030m678n051m655l227
63401H02109j527q01j272j917j904j411q51k6J484L601N698P109P706Q157R314
63386H35469J1066J2324J2652J3161J4829J6715J7246J6942J8145K1933K6889
63375A017371L1295L5009L8434M1053M2062M1536L9956L7248L3250K8732K5116
63364A411062K3406K3825K5967K8841L1313L3194L5542L9240M3640M7086M8413
63353A791529M7368M4044L8576L1225K2415J2947M480j023l109l723n418q929
63341A970382j3190j7275k1242k5164k8595l1461l4508l8138m1445m3140m3143
$$ y = [832080, 828689, 824236, 819922, 817487, 817438, 818850, 820290, 820754, 820280, 819876, 820400, 821397, 821614, 820723, 819921, 820682, 823528, 828049, 833231, 837423, 838920, 837332, 833969, 830431, 827181, 823750, 819720, 815042, 809991, 805336, 802109, 800582, 799781, 798509, 796592, 794688, 793277, 792426, 792400, 793884, 797485, 803183, 810292, 817998, 826155, 835469, 846535, 858859, 871511, 884672, 899501, 916216, 933462, 950404, 968549, 990482, 1017371, 1048666, 1083675, 1122109, 1163162, 1205224, 1246760, 1286716, 1323964, 1357214, 1385946, 1411062, 1434468, 1458293, 1484260, 1513101, 1544414, 1577608, 1613150, 1652390, 1696030, 1743116, 1791529, 1838897, 1882941, 1921517, 1952742, 1975157, 1988104, 1992584, 1991561, 1988452, 1984729, 1979311, 1970382, 1957192, 1939917, 1918675, 1893511, 1864916, 1833455, 1798947, 1760809, 1719364, 1676224, 1633081]
63330A633081m2446m1538l9815l6908l3711l1419k9864k7831k5000k2489k0949
63319A281111j9086j5164r553m559j725l26J192L348N805Q554J1868J5374J8057
63306A294896J9491K0613K2889K6724L0885L3813L5459L7274M0182M3255M5107
63295A650588M5908M6816M7600M6368M1936L5209K7761K0233J2895O514J565k594
63283A980799o666j0158j2293j3644j5697j9042k3082k7257l1451l5257l8065
63272A748187m0040m2002m3948m4600m2880l9321l5583l2867l1022k8883k5311
63261A341730k0258j4978j1249j0384j2779j7705k3161k6713k7390k6436k5527
63250A125150k4766k3359k1606k0703k0626j9807j7428j4696j3145j2703j2253
$$ y = [1633081, 1590635, 1549097, 1509282, 1472374, 1438663, 1407244, 1377380, 1349549, 1324549, 1302060, 1281111, 1262025, 1246861, 1237308, 1232749, 1231024, 1230698, 1231890, 1235238, 1241043, 1249597, 1261465, 1276839, 1294896, 1314387, 1335000, 1357889, 1384613, 1415498, 1449311, 1484770, 1522044, 1562226, 1605481, 1650588, 1696496, 1743312, 1790912, 1837280, 1879216, 1914425, 1942186, 1962419, 1975314, 1981828, 1983393, 1980799, 1974133, 1963975, 1951682, 1938038, 1922341, 1903299, 1880217, 1852960, 1821509, 1786252, 1748187, 1708147, 1666145, 1622197, 1577597, 1534717, 1495396, 1459813, 1426946, 1395924, 1367041, 1341730, 1321472, 1306494, 1295245, 1284861, 1272082, 1254377, 1231216, 1204503, 1177113, 1150677, 1125150, 1100384, 1077025, 1055419, 1034716, 1014090, 994283, 976855, 962159, 949014, 936311, 924058]
63239I24058j1260j0063r111q737r267j0559j1726j1832j0751r065p554o983p623
63226G99527q544q156o202m554n135p533r538r608p926n513l370k318k469k816
63212G15845k320j404j338k151k424j411j15L41K71N72J248J794K242K833L211
63197G17194L029K933L731M855M876L627K581K825L782M526N262O639Q367R557
63183G83784J0168J1092J2878J5163J7424J9543K1284K1947K1135J9658J9072
63172I73148K0260K2662K4890K5909K5613K4611K3669K3243K3351K3867K4912
63161A236135K6684K8638K9272K7410K3796K0772J9863K0241J9966J8259J5776
63150A486812J3050R772N747J540k239n584q566j0902j2545j4037j5667j6815
$$ y = [924058, 912798, 902735, 893624, 884887, 875620, 865061, 853335, 841503, 830752, 821687, 814133, 807150, 799527, 790983, 782827, 776625, 772071, 766936, 759403, 749865, 740257, 732331, 726818, 723448, 721130, 718661, 715845, 713525, 712121, 710783, 708632, 706208, 704797, 704682, 705023, 705294, 705866, 707114, 708908, 711150, 713983, 717194, 720223, 723156, 726887, 731742, 736618, 740245, 742826, 745651, 749433, 753959, 759221, 765860, 774227, 783784, 793952, 805044, 817922, 833085, 850509, 870052, 891336, 913283, 934418, 954076, 973148, 993408, 1016070, 1040960, 1066869, 1092482, 1117093, 1140762, 1164005, 1187356, 1211223, 1236135, 1262819, 1291457, 1320729, 1348139, 1371935, 1392707, 1412570, 1432811, 1452777, 1471036, 1486812, 1499862, 1509634, 1515381, 1516921, 1514682, 1509098, 1500532, 1489630, 1477085, 1463048, 1447381, 1430566]
63138A430566j6834j6016j4939j3391j0920q048n779m127k321l44J122K455N190
63125A346614R623J3707J5482J5595J6154J7787J9316J9940K0160K0508K0800
63114A535686K1016K1648K2463K2065J9612J6198J3484J1540R069N417J185l149
63102A696234p919j3194j8025k1592k4283k6889k9208l0438l0663l0850l1399
63091A431774l1609l0922k9829k8975k8091k6455k4058k1610j9612j8046j6860
63080A155707j6135j5681j4959j3538j1427r004o850n484m853m118k377L11K991
63067A054583M849N898O697P696Q958J0073J0403R701Q525P701P375P050O481
63054A155990N995N792N506M811M034L816M410N553O661O975N894L574J077l74
$$ y = [1430566, 1413732, 1397716, 1382777, 1369386, 1358466, 1350418, 1344639, 1340512, 1338191, 1337847, 1338969, 1341424, 1346614, 1356237, 1369944, 1385426, 1401021, 1417175, 1434962, 1454278, 1474218, 1494378, 1514886, 1535686, 1556702, 1578350, 1600813, 1622878, 1642490, 1658688, 1672172, 1683712, 1692781, 1698198, 1699383, 1696234, 1688315, 1675121, 1657096, 1635504, 1611221, 1584332, 1555124, 1524686, 1494023, 1463173, 1431774, 1400165, 1369243, 1339414, 1310439, 1282348, 1255893, 1231835, 1210225, 1190613, 1172567, 1155707, 1139572, 1123891, 1108932, 1095394, 1083967, 1074963, 1068113, 1062629, 1057776, 1053658, 1051281, 1051592, 1054583, 1059432, 1065330, 1072027, 1079723, 1088681, 1098754, 1109157, 1118858, 1127383, 1135084, 1142459, 1149509, 1155990, 1161985, 1167777, 1173283, 1178094, 1182128, 1185944, 1190354, 1195907, 1202568, 1209543, 1215437, 1219011, 1220088, 1219714]
63040A219714k81R13K256K809K185Q03m59j006r13o43o72j149j512o74J738M368
63024A227477N253M137K788K693L397L766L819M259M889M934M674N370P293R030
63010A293779R299Q693Q959J1036J4319J7502J9758K1308K3184K6199K9868L2702
62998A516606L3958L4782L7010M0914M4788M6962M7715M8724N0948N3696N5833
62987B011936N7240N8671O0492O2224O3245O3415O2911O1891O0632N9572N8833
62976B681062N7910N6207N3832N1384M8910M5475M0061L2692K4336J5696O469
62965C114034l861j4775k4768l2772l9025m4282m8551n1138n1692n0749m9236
62954B703185m7673m5775m2644l7720l1800k6571k2574j8283j2118m823J351N624
$$ y = [1219714, 1219433, 1220346, 1222602, 1225411, 1227596, 1228399, 1227940, 1226934, 1226021, 1225378, 1224706, 1223557, 1222045, 1221371, 1223109, 1227477, 1232730, 1236867, 1239655, 1242348, 1245745, 1249511, 1253330, 1257589, 1262478, 1267412, 1272086, 1277456, 1284749, 1293779, 1303078, 1311771, 1320730, 1331766, 1346085, 1363587, 1383345, 1404653, 1427837, 1454036, 1483904, 1516606, 1550564, 1585346, 1622356, 1663270, 1708058, 1755020, 1802735, 1851459, 1902407, 1956103, 2011936, 2069176, 2127847, 2188339, 2250563, 2313808, 2377223, 2440134, 2502025, 2562657, 2622229, 2681062, 2738972, 2795179, 2849011, 2900395, 2949305, 2994780, 3034841, 3067533, 3091869, 3107565, 3114034, 3110173, 3095398, 3070630, 3037858, 2998833, 2954551, 2906000, 2854862, 2803170, 2752421, 2703185, 2655512, 2609737, 2567093, 2529373, 2497573, 2471002, 2448428, 2430145, 2418027, 2413204, 2414555, 2420179]
62942B420179R337J3576J7678K0700K2929K5045K6854K7980K9052L1077L3916
62931B678323L6274L6949L5639L2899K9755K6869K3665J8958J2752O423O05n975
62919B933136j4514k4110l2831m0033m6279n1786n6461o0797o5135o8319o8810
62908B404061o7005o4891o3377o1513n8525n5041n1971m9423m7169m5096m2949
62897A797101m0617l8808l8326l8654l8530l7830l7358l6772l4655l1095k8223
62886A396233k7333k7107k5901k4106k3006k2614k2140k1492k0828j9541j7087
62875A145078j4225j2171j1202j1009j1510j2133j1286q145m246j799j139j346
62863A044867k503n185q168r028p368n367m694m698m329m017m518n311n460n173
$$ y = [2420179, 2429516, 2443092, 2460770, 2481470, 2504399, 2529444, 2556298, 2584278, 2613330, 2644407, 2678323, 2714597, 2751546, 2787185, 2820084, 2849839, 2876708, 2900373, 2919331, 2932083, 2938506, 2939111, 2933136, 2918622, 2894512, 2861681, 2821648, 2775369, 2723583, 2667122, 2606325, 2541190, 2472871, 2404061, 2337056, 2272165, 2208788, 2147275, 2088750, 2033709, 1981738, 1932315, 1885146, 1840050, 1797101, 1756484, 1717676, 1679350, 1640696, 1602166, 1564336, 1526978, 1490206, 1455551, 1424456, 1396233, 1368900, 1341793, 1315892, 1291786, 1268780, 1246166, 1224026, 1202534, 1181706, 1162165, 1145078, 1130853, 1118682, 1107480, 1096471, 1084961, 1072828, 1061542, 1053397, 1049151, 1047352, 1046213, 1044867, 1042364, 1037179, 1029011, 1019983, 1012615, 1007248, 1002554, 997856, 993527, 989510, 984992, 979681, 974221, 969048]
62849I69048n246n632n620n092m589m280l666k401q91O1J15j67J89J424K649K917
62833I38819K517K505L094L294K215Ok556m615n259m019j783l97p89k019k624
62818I28389k239j521j052q68o75j65M53J44j914m859o649o445n438m867m408
62803H87886l412k389k027j756q91l15j200k558k150J61J982J756O99N34R02L33
62787H77555j325k802l129k355r53N36J387J113Rj108j576j097K20J688K332J815
62771H72310P32k72j021j125J91K675M344L489J017m17M97K601M072M108K913
62756H96114J394J129L259O723Q751P909N773M740N177N840O304P398R389J1185
62742I81085J1835J1838J2335J3656J5239J6589J7643J8313J8313J7723J7455
$$ y = [969048, 963802, 958170, 952550, 947458, 942869, 938589, 934923, 932522, 931631, 931692, 931807, 931640, 931829, 933253, 935902, 938819, 941336, 943841, 946935, 950229, 952444, 952450, 949894, 945279, 940020, 936001, 934218, 933821, 933032, 931013, 928389, 926150, 924629, 923577, 922709, 922034, 921869, 922322, 922466, 920552, 915693, 909044, 902599, 897161, 892294, 887886, 884474, 882085, 880058, 878302, 877411, 877096, 875896, 873338, 871188, 871349, 873331, 875087, 875786, 876320, 877222, 877555, 876230, 873428, 870299, 867944, 866991, 867527, 868914, 870027, 870036, 868928, 867352, 866255, 866475, 868163, 870495, 872310, 873042, 872770, 871749, 870624, 870815, 873490, 877834, 881323, 882340, 881923, 882420, 885021, 889093, 893201, 896114, 897508, 898637, 901896, 908619, 917370, 925279, 931052, 935792, 940969, 946809, 953113, 960511, 969900, 981085, 992920, 1004758, 1017093, 1030749, 1045988, 1062577, 1080220, 1098533, 1116846, 1134569, 1152024]
62731A152024J8763K2151K6847L1469L5218L8351M1650M5607N0103N4649N8854
62720A575686O2730O6615P0735P4956P8934Q2213Q3980Q3196P9608P4376O8947
62709B401976O3355N6290M6953L5933K4095J1625j120j2723k1832k8877l5740
62698B539935m3616n1814n8691o3317o6069o7911o9271o9676o8628o6657o4979
62687A849306o4016o2971o1083n8514n5593n2130m8318m5342m3879m2574l9352
62676A275534l4101k8742k4704k1569j8457j5523j3559j2933j3288j3628j2542
62665A066488r260m807j291L73J178K310L793N412P781J1343J4990J6985J7150
62652A132445J7177J8692K1703K5167K8395L1595L5252L9352M3379M7091N1015
$$ y = [1152024, 1170787, 1192938, 1219785, 1251254, 1286472, 1324823, 1366473, 1412080, 1462183, 1516832, 1575686, 1638416, 1705031, 1775766, 1850722, 1929656, 2011869, 2095849, 2179045, 2258653, 2333029, 2401976, 2465331, 2521621, 2568574, 2604507, 2628602, 2640227, 2639107, 2626384, 2604552, 2575675, 2539935, 2496319, 2444505, 2385814, 2322497, 2256428, 2188517, 2119246, 2049570, 1980942, 1914285, 1849306, 1785290, 1722319, 1661236, 1602722, 1547129, 1494999, 1446681, 1401339, 1357460, 1314886, 1275534, 1241433, 1212691, 1187987, 1166418, 1147961, 1132438, 1118879, 1105946, 1092658, 1079030, 1066488, 1057228, 1052421, 1051130, 1051503, 1052681, 1054991, 1058784, 1064196, 1071977, 1083320, 1098310, 1115295, 1132445, 1149622, 1168314, 1190017, 1215184, 1243579, 1275174, 1310426, 1349778, 1393157, 1440248, 1491263]
62641A491263N5761O0954O5375O8365P0536P2822P5278P7307P8641P9434P9463
62630B275199P7756P3337O6191N7312M7680L7391K6023J3843K023q718j9011k9672
62618B619354m0201m9405n7177o4376p0929p5361p6741p6024p4903p4128p3378
62607A886731p1925o9043o4658o0123n7255n6031n4361n0932m7060m4474m2479
62596A268390l9034l4010k9456k6737k5071k3245k1347k0213k0151k0649k0693
62585I87784j9188j5911j2321j0379j0236r963q097n528m066l885l491j951n9
62572H82709Q56M76n95j767k759l310l255k877k594k204j117M86J471J276Q50
62557H67646J275K075K097J609K075L836N607O638P810R903J2145J3470J4068
$$ y = [1491263, 1547024, 1607978, 1673353, 1741718, 1812254, 1885076, 1960354, 2037661, 2116302, 2195736, 2275199, 2352955, 2426292, 2492483, 2549795, 2597475, 2634866, 2660889, 2674732, 2676755, 2668037, 2649026, 2619354, 2579153, 2529748, 2472571, 2408195, 2337266, 2261905, 2185164, 2109140, 2034237, 1960109, 1886731, 1814806, 1745763, 1681105, 1620982, 1563727, 1507696, 1453335, 1402403, 1355343, 1310869, 1268390, 1229356, 1195346, 1165890, 1139153, 1114082, 1090837, 1069490, 1049277, 1029126, 1008477, 987784, 968596, 952685, 940364, 929985, 919749, 909786, 901689, 896161, 892095, 888210, 884719, 882768, 882709, 883565, 884041, 883446, 881679, 878920, 875610, 872355, 869478, 866884, 864680, 863563, 864049, 865520, 866796, 867646, 868921, 870996, 873093, 874702, 876777, 880613, 886220, 892858, 900668, 910571, 922716, 936186, 950254]
62544I50254J4619J5031J5101J5536J7037J9002K0415K1461K3129K5714K8746
62533A166045L1845L4510L5726L5153L4107L3970L4073L2598K9134K4793K0162
62522A512116J4825Q783K728l044q521j3035j6085j8840k2854k7341k9948l0395
62510A368389l0974l2823l4184l3358l1188k9223k7440k5420k3935k3599k3351
62499A052894k2062k0401j9344j8091j5402j2002r592q235o786n354n119n838
62487I04668n739m060j952n16L41P83M67j69L78K737N439O497N614M137L410L823
62471I25858N044O587Q192R848J1435J2577J3233J4185J6292J9343K2291K4622
62459A089507K6840K9580L2849L6283L9577M2579M5373M8300N1476N4367N6204
$$ y = [950254, 964873, 979904, 995005, 1010541, 1027578, 1046580, 1066995, 1088456, 1111585, 1137299, 1166045, 1197890, 1232400, 1268126, 1303279, 1337386, 1371356, 1405429, 1438027, 1467161, 1491954, 1512116, 1526941, 1535724, 1538452, 1535408, 1526887, 1513852, 1497767, 1478927, 1456073, 1428732, 1398784, 1368389, 1337415, 1304592, 1270408, 1237050, 1205862, 1176639, 1149199, 1123779, 1099844, 1076245, 1052894, 1030832, 1010431, 991087, 972996, 957594, 945592, 936000, 927765, 920979, 915625, 910506, 904668, 898929, 894869, 892917, 892401, 892742, 893525, 893992, 893823, 894201, 896938, 902377, 908874, 914488, 918625, 922035, 925858, 930902, 937489, 945681, 955529, 966964, 979541, 992774, 1006959, 1023251, 1042594, 1064885, 1089507, 1116347, 1145927, 1178776, 1215059, 1254636, 1297215, 1342588, 1390888, 1442364, 1496731, 1552935]
62448A552935N6633N5623N3290N0375M8179M7018M5168M0655L3867K7096K1678
62437B032517J7160J3423J1756J2883J5427J7515J9051K1293K4959K9884L5952
62426B251820M3016N0097N5787N9726O2905O6316O9710P1741P0933O6558N9011
62415B927620M9535L9330K8834J7779N644p974k2975l8345n2433o4096p3447q1233
62403B728239q7699r2345r4636r4589r2759r0020q7163q4446q1387p7204p1542
62392A774449o4832n8078n2333m8020m4660m1354l7582l3461k9325k5460k2105
62381A317239j9230j6364j3174j0221q454p784o948n234l557l285m576o568q586
62368A203258j0353j1418j1324j0406r737j0159j1655j3505j4655j4383j3124
$$ y = [1552935, 1609568, 1665191, 1718481, 1768856, 1817035, 1864053, 1909221, 1949876, 1983743, 2010839, 2032517, 2049677, 2063100, 2074856, 2087739, 2103166, 2120681, 2139732, 2161025, 2185984, 2215868, 2251820, 2294836, 2344933, 2400720, 2460446, 2523351, 2589667, 2659377, 2731118, 2802051, 2868609, 2927620, 2977155, 3016485, 3045319, 3063098, 3068742, 3060768, 3037793, 2999448, 2947015, 2882919, 2809472, 2728239, 2640540, 2548195, 2453559, 2358970, 2266211, 2176191, 2089028, 2004582, 1923195, 1845991, 1774449, 1709617, 1651539, 1599206, 1551186, 1506526, 1465172, 1427590, 1394129, 1364804, 1339344, 1317239, 1298009, 1281645, 1268471, 1258250, 1249796, 1242012, 1235064, 1229830, 1226273, 1222988, 1218412, 1211844, 1203258, 1192905, 1181487, 1170163, 1159757, 1150020, 1139861, 1128206, 1114701, 1100046, 1085663, 1072539]
62357A072539j2314j2763j3490j2992j1361j0095r854r603q355o752o212p012
62345I51736p887p412n404l049j759j709j618l08J769L163L367L279L660M215
62331I42043M523M805N183N085M409M393O213R111J1114J1525J1566J2441J3814
62318A046225J4701J5022J5585J6861J8377J9309J9438J9502K0664K3510K7583
62307A256777L1858L5553L8487M0988M3737M7245N1149N4433N6933O0089O5293
62296A782542P1799P7316Q0577Q2170Q2683Q1414P7563P1476O3697N3861M1777
62285B566875K9002J7884R082J189p151j5746k3612l0238l5729m0455m4771m8519
62273B377811n0763n0838m9787m9540n0313n0018m7182m3389m1498m2035m2849
$$ y = [1072539, 1060225, 1047462, 1033972, 1020980, 1009619, 999524, 989670, 980067, 971712, 964960, 958748, 951736, 943849, 936437, 931033, 927984, 926225, 924516, 922898, 922590, 924359, 927522, 930889, 934168, 937828, 942043, 946566, 951371, 956554, 961639, 966048, 970441, 976654, 985765, 996879, 1008404, 1019970, 1032411, 1046225, 1060926, 1075948, 1091533, 1108394, 1126771, 1146080, 1165518, 1185020, 1205684, 1229194, 1256777, 1288635, 1324188, 1362675, 1403663, 1447400, 1494645, 1545794, 1600227, 1657160, 1717249, 1782542, 1854341, 1931657, 2012234, 2094404, 2177087, 2258501, 2336064, 2407540, 2471237, 2525098, 2566875, 2595877, 2613761, 2622843, 2624032, 2616881, 2601135, 2577523, 2547285, 2511556, 2471101, 2426330, 2377811, 2327048, 2276210, 2226423, 2176883, 2126570, 2076552, 2029370, 1985981, 1944483, 1902448, 1859599]
62262A859599m2177m0624l9759m0046m0813m1293m0906l9151l6161l3056l1051
62251A434562l0198k9533k8345k6858k5652k4851k3875k1843j8315j3901r983
62240A181208p531o438o181o598p384p365n408k030R77K710L970N576P109Q064
62226A160679R031J0613J1968J1963J1340J2053J4410J6481J6890J6708J7674
62215A309810J9733K1575K2891K4653K7350L0158L2137L3300L4163L4902L5441
62204A626113L5996L7077L9066M1992M5605M9551N3625N7950O2729O7729P2112
62193B189545P4977P6014P5465P3432O9354O2480N2881M1851L1053K1289J2219
62182B780560L110o425j6298k6155l5642m4605n2936o0055o4945o7228o7979o8615
$$ y = [1859599, 1817422, 1776798, 1737039, 1696993, 1656180, 1614887, 1573981, 1534830, 1498669, 1465613, 1434562, 1404364, 1374831, 1346486, 1319628, 1293976, 1269125, 1245250, 1223407, 1205092, 1191191, 1181208, 1173677, 1167239, 1161058, 1154460, 1147076, 1139711, 1134303, 1132273, 1133250, 1135960, 1139930, 1145506, 1152615, 1160679, 1169710, 1180323, 1192291, 1204254, 1215594, 1227647, 1242057, 1258538, 1275428, 1292136, 1309810, 1329543, 1351118, 1374009, 1398662, 1426012, 1456170, 1488307, 1521607, 1555770, 1590672, 1626113, 1662109, 1699186, 1738252, 1780244, 1825849, 1875400, 1929025, 1986975, 2049704, 2117433, 2189545, 2264522, 2340536, 2416001, 2489433, 2558787, 2621267, 2674148, 2715999, 2747052, 2768341, 2780560, 2783670, 2777245, 2760947, 2734792, 2699150, 2654545, 2601609, 2541554, 2476609, 2409381, 2341402, 2272787]
62170B272787o9030o7914o5061o2165o0537n9153n6077n1177m6129m2105l8846
62159A654593l6031l4123l3166l1792k8502k3638j9294j7076j6388j5341j3096
62148A386146j0708r298q134n548j666J167J249k80r88P6K194M772P804J0868
62134A377654J3014J3789J3522J2761J2309J3309J6005J8783J9756J9154J8644
62123A548700J8682J8373J7864J8571K0414K1142J9475J7115J6294J6987J8003
62112A751620J9254K1194K3321K5195K7970L2961L9291M4794M8746N1889N4189
62101B140424N4692N3465N1583M9033M4529L7859L0527K3427J5744P052j163p510
62089B499662j2949j9401k6728l2746l6124l7837l9403m0823m1075m0097l9218
$$ y = [2272787, 2203757, 2135843, 2070782, 2008617, 1948080, 1888927, 1832850, 1781673, 1735544, 1693439, 1654593, 1618562, 1584439, 1551273, 1519481, 1490979, 1467341, 1448047, 1430971, 1414583, 1399242, 1386146, 1375438, 1366140, 1358006, 1352458, 1350792, 1351959, 1353208, 1352928, 1351940, 1352016, 1354210, 1358982, 1366786, 1377654, 1390668, 1404457, 1417979, 1430740, 1443049, 1456358, 1472363, 1491146, 1510902, 1530056, 1548700, 1567382, 1585755, 1603619, 1622190, 1642604, 1663746, 1683221, 1700336, 1716630, 1733617, 1751620, 1770874, 1792068, 1815389, 1840584, 1868554, 1901515, 1940806, 1985600, 2034346, 2086235, 2140424, 2195116, 2248581, 2300164, 2349197, 2393726, 2431585, 2462112, 2485539, 2501283, 2508335, 2507172, 2499662, 2486713, 2467312, 2440584, 2407838, 2371714, 2333877, 2294474, 2253651, 2212576, 2172479, 2133261]
62078B133261l9283l9214l7304l3773l0829k9800k9381k7658k4873k2796k1872
62067A796478k0797j8812j6770j5501j4631j3688j2990j2541j1197q100m227j345
62055A645879L3O79J115J168Q85O84M64n69k796n414p117p237o076m478l394l621
62039A610205n509q608j1695j3490j3538j2361j0662q653o380m209k447p41J515
62026A513427M188O525Q196R604J1191J3129J5699J9057K2522K4964K6266K7508
62014A702276K9443L1629L3498L5196L6712L7309L6772L6365L7367L9283M0628
62003B096478M1077M1575M2530M3056M1971L8653L2963K5407J7397J0388M511
61992B436006j233p458j3868k0205k6627l3013l8880m4199m9328n3858n6657n7569
$$ y = [2133261, 2093978, 2054764, 2017460, 1983687, 1952858, 1923058, 1893677, 1866019, 1841146, 1818350, 1796478, 1775681, 1756869, 1740099, 1724598, 1709967, 1696279, 1683289, 1670748, 1659551, 1651451, 1647224, 1645879, 1645912, 1646591, 1647706, 1648874, 1649759, 1650443, 1650907, 1650338, 1647542, 1642128, 1635011, 1627774, 1621698, 1617220, 1613826, 1610205, 1604696, 1596088, 1584393, 1570903, 1557365, 1545004, 1534342, 1525689, 1519309, 1515100, 1512653, 1511912, 1513427, 1517615, 1524140, 1532336, 1541940, 1553131, 1566260, 1581959, 1601016, 1623538, 1648502, 1674768, 1702276, 1731719, 1763348, 1796846, 1832042, 1868754, 1906063, 1942835, 1979200, 2016567, 2055850, 2096478, 2137555, 2179130, 2221660, 2264716, 2306687, 2345340, 2378303, 2403710, 2421107, 2431495, 2436006, 2434773, 2427315, 2413447, 2393242, 2366615, 2333602, 2294722, 2250523, 2201195, 2147337, 2090680, 2033111]
61980B033111n7875n8499n8769n7900n6506n5388n3685m9954m4838m0783l8876
61969A460038l7413l4373l0120k6651k4917k3964k2450k0075j7563j5940j5874
61958A190698j7093j8280j8079j6409j4519j3529j3223j2499j0670q080n577l678
61946A039062k227o46J383L388M411M114L417L678N208O944P668P156N816L702
61932A093074N95k947n439n966n408n477o685q013q690r267j0405j1447j1243
61919A002682j0001r006q578p734o209n411o353p700p258m899k675k197l184m554
61905I16923n623n840m562j933P97K554L521M299M608L736K145J677L737P666
61891I33705J1201J2655J2443J2376J3512J5233J6705J8481K1654K5751K8848
$$ y = [2033111, 1975236, 1916737, 1857968, 1800068, 1743562, 1688174, 1634489, 1584535, 1539697, 1498914, 1460038, 1422625, 1388252, 1358132, 1331481, 1306564, 1282600, 1260150, 1240075, 1222512, 1206572, 1190698, 1173605, 1155325, 1137246, 1120837, 1106318, 1092789, 1079566, 1067067, 1056397, 1048317, 1042740, 1039062, 1036835, 1036189, 1037572, 1040960, 1045371, 1049485, 1052902, 1056580, 1061788, 1068732, 1076400, 1083556, 1089372, 1093074, 1093669, 1090722, 1085283, 1079317, 1073909, 1068432, 1061747, 1053734, 1045044, 1035777, 1025372, 1013925, 1002682, 992681, 983675, 975097, 967363, 961154, 955743, 949390, 941690, 934432, 929533, 926858, 924661, 921477, 916923, 911300, 905460, 900898, 898965, 899762, 902316, 905837, 910136, 914744, 918480, 920625, 922302, 926039, 933705, 944906, 957561, 970004, 982380, 995892, 1011125, 1027830, 1046311, 1067965, 1093716, 1122564]
61880A122564L0161L1162L3374L6108L7604L7607L7418L7682L7626L6630L5280
61869A513216L4229L3067L1000K8062K4848K1421J7345J2742Q487N126K139j161
61857A730521m337o043n539l386m62L002O888J0404J2771J4388J6213J8093J8869
61844A811382J8305J7462J6632J4409R819M203m95m332q657j3291j6394j7206
61832A831837j7311j8624k1306k4094k5734k5731k4692k4146k5021k6118k5359
61821A573701k2906k1433k2561k4611k5186k4467k4150k4076k2297j8367j4464
61810A329183j2496j1708r966o375j808K374N307O974Q371J0941J5109J9624K2976
61797A378506K5197K7624L1156L5517M0204M5168N0196N4343N6787N7932N8914
$$ y = [1122564, 1152725, 1183887, 1217261, 1253369, 1290973, 1328580, 1365998, 1403680, 1441306, 1477936, 1513216, 1547445, 1580512, 1611512, 1639574, 1664422, 1685843, 1703188, 1715930, 1724417, 1729543, 1731682, 1730521, 1726184, 1720141, 1714602, 1711216, 1710754, 1713756, 1720644, 1731048, 1743819, 1758207, 1774420, 1792513, 1811382, 1829687, 1847149, 1863781, 1878190, 1888009, 1892212, 1891717, 1887385, 1878728, 1865437, 1849043, 1831837, 1814526, 1795902, 1774596, 1750502, 1724768, 1699037, 1674345, 1650199, 1625178, 1599060, 1573701, 1550795, 1529362, 1506801, 1482190, 1457004, 1432537, 1408387, 1384311, 1362014, 1343647, 1329183, 1316687, 1304979, 1295013, 1288638, 1286830, 1289204, 1294511, 1301485, 1309856, 1320797, 1335906, 1355530, 1378506, 1403703, 1431327, 1462483, 1498000, 1538204, 1583372, 1633568, 1687911, 1744698, 1802630, 1861544]
61786A861544N9994O0137N8313N4650M9831M4052L7213K9858K2918J6507R912
61775B304929L094k594n823o774o504n349k949L65L421N665P847J0665J3328J4150
61761B333471J2330Q604M214l89n731j2447k0307k8113l4590l9330m2687m5020
61749B130005m6399m6939m6802m5789m3659m1196m0088m1036m2446m2049l9612
61738A653990l7088l5994l5687l4702l2905l1334l0354k9062k6753k4126k2324
61727A313661k1264j9702j7033j4278j2770j2438j2112j1284j0615j0522j0261
61716A161382q985p072n626n130n373o185p230p373n651k915j293j524k002j056
61702A093967J039L192N447Q259J0556J0350P429L938J850J053N09P3J27K05p24
$$ y = [1861544, 1921538, 1981675, 2039988, 2094638, 2144469, 2188521, 2225734, 2255592, 2278510, 2295017, 2304929, 2308023, 2305429, 2299606, 2292832, 2286328, 2280979, 2278030, 2278395, 2281816, 2287481, 2295328, 2305993, 2319321, 2333471, 2345801, 2354405, 2358619, 2358230, 2352499, 2340052, 2319745, 2291632, 2257042, 2217712, 2175025, 2130005, 2083606, 2036667, 1989865, 1944076, 1900417, 1859221, 1819133, 1778097, 1735651, 1693602, 1653990, 1616902, 1580908, 1545221, 1510519, 1477614, 1446280, 1415926, 1386864, 1360111, 1335985, 1313661, 1292397, 1272695, 1255662, 1241384, 1228614, 1216176, 1204064, 1192780, 1182165, 1171643, 1161382, 1152397, 1145325, 1139699, 1134569, 1129196, 1123011, 1115781, 1108408, 1102757, 1099842, 1098549, 1097025, 1095023, 1093967, 1095006, 1098198, 1103645, 1111904, 1122460, 1132810, 1140239, 1144177, 1146027, 1147080, 1147589, 1147662, 1147789, 1147994, 1147270]
61687A147270k694m502n259n432o009p116p945p809o799n385l791k104p84n04
61673A081137j256j968j522r8R04M35j112k451k738j994n62J266L045M076L998
61658A081160L251K673K601K677K472J927J045l49k171l821m923n910p211q141
61644A065280p686o346o033p630r717j0456r738q682p822p024o522o685p055o882
61630I57002o463o680p352p386o657o189o199n567l978l043m090n976o495n316
61616H75611m098l936m075l377k069j476k333l803m251l042j274l93l38K17J892
61601H43255L843N061N316M564K792J066J289L730O074O265N212N089N910N896
61587I05362M716M017M629N388N315N056N226N005L528J574M87L57L44J73J67
$$ y = [1147270, 1144576, 1140074, 1134815, 1129383, 1123374, 1116258, 1108313, 1100504, 1093705, 1088320, 1084529, 1082425, 1081641, 1081137, 1079881, 1077913, 1076391, 1076293, 1077197, 1077632, 1076520, 1074069, 1071331, 1069337, 1068775, 1070041, 1073086, 1077162, 1081160, 1084411, 1087084, 1089685, 1092362, 1094834, 1096761, 1097806, 1097457, 1095286, 1091465, 1086542, 1080632, 1073421, 1065280, 1057594, 1051248, 1045215, 1037585, 1027868, 1017412, 1007674, 998992, 991170, 984146, 977624, 970939, 963884, 957002, 950539, 943859, 936507, 929121, 922464, 916275, 910076, 904509, 900531, 897488, 893398, 887422, 880927, 875611, 871513, 867577, 863502, 860125, 858056, 856580, 854247, 850444, 846193, 843151, 841877, 841484, 841146, 841363, 843255, 847098, 852159, 857475, 862039, 864831, 865897, 867186, 870916, 876990, 883255, 888467, 893556, 899466, 905362, 910078, 914095, 918724, 924112, 929427, 934483, 939709, 944714, 948242, 949816, 950303, 950660, 951004, 951177, 951344]
61572I51344K77J51j03q2Q5j55r84k171l555n004o071o401o310o404o618o369
61556I01630n505m525l860l599l964n275p172q567q945r154j0188j1492j1428
61543H07956r578p604p190p784p472n864m878o092q363r098p459n136l993m033
61529G13412m054l550l139l537m609n542n647m916l952l354l247l326l085k016
61515F59438J5K260L431L023J919J188O98j87j138j168l18K81J55J0K84M93N65
61498F70949J447L454N235N498M767M216L682K309N28l07n1J24j75M7J278K473
61482G05474K625K276K496L158L267K550J885K071K891L518L515L176K833K129
61468G43864M77j639k532j257Q35J476K54j100j286j008j570k924l894l546j752
$$ y = [951344, 951621, 951772, 951669, 951587, 951672, 951517, 950533, 948362, 944807, 939803, 933732, 927331, 921021, 914617, 907999, 901630, 896125, 891600, 887740, 884141, 880177, 874902, 867730, 859163, 850218, 841064, 830876, 819384, 807956, 798378, 790774, 783584, 775800, 768328, 762464, 757586, 751494, 743131, 734033, 726574, 721438, 717445, 713412, 709358, 705808, 702669, 699132, 694523, 688981, 683334, 678418, 674466, 671112, 667865, 664539, 661454, 659438, 659453, 661713, 665144, 668167, 670086, 671274, 671972, 671785, 670647, 669479, 669161, 669442, 669597, 669607, 669891, 670384, 670949, 672396, 675850, 681085, 686583, 691350, 695566, 699248, 701557, 702085, 701778, 701727, 701851, 701676, 701723, 703001, 705474, 708099, 710375, 712871, 716029, 719296, 721846, 723731, 725802, 728693, 732211, 735726, 738902, 741735, 743864, 744341, 742702, 740170, 738913, 739748, 741224, 741478, 740378, 739092, 738084, 736514, 733590, 729696, 726150, 724398]
61453G24398Q05K608K098n52l147l844l160k688k476j241J191L198L398K118N36
61438G23242n57p80L5J385K238K132J533Q70J3q43p43Q14K936M307M524L883K587
61421G47576J008R9N55J888L151M102M828M779L425J528N03N78Q27R46J569K626
61405G79988K902J897Q08P83J253R87J7n93m13R7P27J851L412M458M089K602J291
61388H06156J103J622J632P26j4N72K067K983K688J945J525J453J681K375L133
61373H31647L165K749L184M629N391M381K834K241J965O33j151j572m51Q43J868
61358H62356L344M865M762K853J241J508K709L147K599J727N80j022k461k990
61344H85218k813k574k255j469m89r2n40j308j722j519r29m22j43L01J051J291
$$ y = [724398, 725203, 727811, 729909, 729357, 726210, 722366, 719206, 716518, 714042, 712801, 713992, 717190, 720588, 722706, 723242, 722685, 721905, 721940, 723325, 725563, 727695, 729228, 730098, 730111, 729268, 728525, 729339, 732275, 736582, 741106, 744989, 747576, 748584, 748683, 749238, 751126, 754277, 758379, 763207, 767986, 771411, 772939, 773442, 774020, 774847, 775793, 777362, 779988, 782890, 784787, 785595, 786378, 787631, 788618, 788635, 788042, 787629, 787726, 788453, 790304, 793716, 798174, 802263, 804865, 806156, 807259, 808881, 810513, 811239, 811225, 811797, 813864, 816847, 819535, 821480, 823005, 824458, 826139, 828514, 831647, 834812, 837561, 840745, 845374, 850765, 855146, 857980, 860221, 862186, 862819, 861668, 860096, 859645, 860488, 862356, 865700, 870565, 875327, 878180, 879421, 880929, 883638, 886785, 889384, 891111, 891691, 890669, 888208, 885218, 882405, 879831, 877576, 876107, 875618, 875526, 874986, 873678, 871956, 870437, 869508, 869086, 868943, 869244, 870295, 871586]
61328H71586K53j261j533k53J075J362J250J612K127K172K034K179K393K546L236
61313H90778M677N878O020N727N787N659M562L264L109L860M090L474L126L884
61299I53895N592P840J0052J1015R986Q241Q012R631J1240J1631J1842J3316J5787
61286A088080J7798J8356J7361J5282J3090J1767J1288J0663R396Q109P272O255
61274A234717M432K458J456J221K59k268n266o758o051m557m241n350o289n844
61260A197919m741m310m397l830k497j420q00M17K694N008O429P346Q429R501
61246A215748J0287J1187J2441J3472J3938J4429J5076J4504J1608P488M147J775
61234A346100r31m139o474p345p814q664r183q662p695p006o216m945m193n069
$$ y = [871586, 871839, 870578, 869045, 868792, 869867, 871229, 872479, 874091, 876218, 878390, 880424, 882603, 884996, 887542, 890778, 895455, 901333, 907353, 913080, 918867, 924526, 929088, 932352, 935461, 939321, 943411, 946885, 950011, 953895, 959487, 967327, 977379, 988394, 998380, 1006621, 1014633, 1024264, 1035504, 1047135, 1058977, 1072293, 1088080, 1105878, 1124234, 1141595, 1156877, 1169967, 1181734, 1193022, 1203685, 1213081, 1221190, 1228462, 1234717, 1239149, 1241607, 1243063, 1244284, 1244543, 1242275, 1237009, 1230251, 1224200, 1219643, 1215402, 1210052, 1203763, 1197919, 1193178, 1188868, 1184471, 1180641, 1178144, 1176724, 1175924, 1176341, 1179035, 1184043, 1190472, 1197818, 1206247, 1215748, 1226035, 1237222, 1249663, 1263135, 1277073, 1291502, 1306578, 1321082, 1332690, 1340178, 1344325, 1346100, 1345169, 1341030, 1334556, 1327211, 1319397, 1310733, 1301550, 1292888, 1285193, 1278187, 1271971, 1267026, 1262833, 1257764]
61220A257764o695o868m884k289o23L41J530K838L468L491L925N265O664O951
61206A270878O039N049N177O605Q444R775J0746J2401J5129J7691J8439J7464
61194A403837J6568J6871J7220J5812J2669R446P021M492R18k957n513o241o140
61181A484003o296o842p411q014q903r868j0243r787r119q829q390o646l514n67
61167A379574O69N11O00J837L601M902N452N349M663L856L938N297O713O464M574
61152A438000L094L761N900P291O806N545N221O067O815O433N248M352M398N333
61138A514264O937R117J1627J3850J5259J6018J6962J8629K0302K0360J7836J3475
61126A694636R046N798L960L311L587M298M800M702L808J869r29l463m634m872
$$ y = [1257764, 1251069, 1244201, 1239317, 1237028, 1236405, 1236746, 1238276, 1241114, 1244582, 1248073, 1251998, 1257263, 1263927, 1270878, 1276917, 1281966, 1287143, 1293748, 1302192, 1311967, 1322713, 1335114, 1350243, 1367934, 1386373, 1403837, 1420405, 1437276, 1454496, 1470308, 1482977, 1492423, 1499444, 1503936, 1504854, 1501897, 1496384, 1490143, 1484003, 1477707, 1470865, 1463454, 1455440, 1446537, 1436669, 1426426, 1416639, 1407520, 1398691, 1390301, 1383655, 1380141, 1379574, 1380243, 1380754, 1381354, 1383191, 1386792, 1391694, 1397146, 1402495, 1407158, 1411014, 1414952, 1420249, 1426962, 1433426, 1438000, 1441094, 1444855, 1450755, 1458046, 1464852, 1470397, 1475618, 1481685, 1488500, 1494933, 1500181, 1504533, 1508931, 1514264, 1521201, 1530318, 1541945, 1555795, 1571054, 1587072, 1604034, 1622663, 1642965, 1663325, 1681161, 1694636, 1703682, 1709480, 1713440, 1716751, 1720338, 1724636, 1729436, 1734138, 1737946, 1739815, 1738886, 1735423, 1730789, 1725917]
61112A725917n562o877p527p135p325r488j2850j5973j8849k1899k3901k3029
61100A565502j9668j6350j4903j5085j5917j6699j6664j5269j3204j1794j1133
61089A398816j0097q296o545n283m166l528m438o739q734r543j0076j0800j0460
61076A300111q270n658m292l711k598j113j24Q49K863N357O846P534R290J2889
61062A319973J6968K0054K2179K4115K6143K8042K9463L0118L0250L0821L2417
61051A610543L4204L4866L4428L3970L3699L2668L0588K8580K7570K6962K5462
61040A953540K2538J8521J3969R367N024Q73l343p632j1867j6073j9958k2411
61028A942548k2486k1053k0353k1565k3529k4275k3163k1140j9573j9138j9356
$$ y = [1725917, 1720355, 1713478, 1705951, 1698816, 1691491, 1682003, 1669153, 1653180, 1634331, 1612432, 1588531, 1565502, 1545834, 1529484, 1514581, 1499496, 1483579, 1466880, 1450216, 1434947, 1421743, 1409949, 1398816, 1388719, 1380423, 1373878, 1368595, 1364429, 1360901, 1356463, 1349724, 1340990, 1331447, 1321371, 1310571, 1300111, 1291841, 1286183, 1281891, 1278180, 1275582, 1274469, 1274345, 1275194, 1278057, 1283414, 1290260, 1297794, 1307084, 1319973, 1336941, 1356995, 1379174, 1403289, 1429432, 1457474, 1486937, 1517055, 1547305, 1578126, 1610543, 1644747, 1679613, 1714041, 1748011, 1781710, 1814378, 1844966, 1873546, 1901116, 1928078, 1953540, 1976078, 1994599, 2008568, 2017935, 2022959, 2023832, 2020489, 2012857, 2000990, 1984917, 1964959, 1942548, 1920062, 1899009, 1878656, 1857091, 1833562, 1809287, 1786124, 1764984, 1745411, 1726273, 1706917]
61017A706917j8942j7070j4355j2014j0200q077n468l163j234J553N723R632J1288
61004A644590J0951J0693J1698J3271J4580J6121J8901K2836K6698K9468L1380
60993A851187L3592L7044M1617M6213M9502N0778N0630N0939N3677N9053O5019
60982B389251O9230P1550P3976P8127Q3560Q8749R3013R6861J00948J05396J10087
60971C360748J15111J20615J26377J31780J36513J41140J46455J52104J56619
60962D587462J59403J62111J67067J74786J84042J94133K05739K19651K36037
60953F290431K55275K78065L04355L33642L67054M07777M58376N19082N89773
60944I803830O72046P67408Q74871R93166J125305J278681J461605J683876J959820
$$ y = [1706917, 1687975, 1670905, 1656550, 1644536, 1634336, 1626259, 1620791, 1617628, 1616394, 1617947, 1623670, 1633302, 1644590, 1655541, 1666234, 1677932, 1691203, 1705783, 1721904, 1740805, 1763641, 1790339, 1819807, 1851187, 1884779, 1921823, 1963440, 2009653, 2059155, 2109933, 2160563, 2211502, 2265179, 2324232, 2389251, 2458481, 2530031, 2604007, 2682134, 2765694, 2854443, 2947456, 3044317, 3145265, 3250661, 3360748, 3475859, 3596474, 3722851, 3854631, 3991144, 4132284, 4278739, 4430843, 4587462, 4746865, 4908976, 5076043, 5250829, 5434871, 5629004, 5834743, 6054394, 6290431, 6545706, 6823771, 7128126, 7461768, 7828822, 8236599, 8694975, 9214057, 9803830, 10475876, 11243284, 12118155, 13111321, 14236626, 15515307, 16976912, 18660788, 20620608]
60935B0620608K298289K672419K993319L128051K970379K516333J879356J230422
60927D0309176P16046M15791L45296M64466O70535Q06461P18010L36476k79223
60918D4503034r79205j607185k068062k342070k458261k460975k390175k275948
60910B7921153k139191j993248j845651j700363j560102j427849j307151j201051
60902A4746547j110193j031753r60851q93528q28264p64714p02098o39590n77628
60893G237928n17802m61602m09883l63094l21208k83698k50505k22610k00802
60884D206724j84208j70945j59865j50551j42072j33361j24661j17061j10430
60875B913570j03403r5659q8551q2901p8006p3464p0150o8144o5479o0747n5640
$$ y = [20620608, 22918897, 25591316, 28584635, 31712686, 34683065, 37199398, 39078754, 40309176, 41025222, 41441013, 41786309, 42250775, 42921310, 43727771, 44445781, 44782257, 44503034, 43523829, 41916644, 39848582, 37506512, 35048251, 32587276, 30197101, 27921153, 25781962, 23788714, 21943063, 20242700, 18682598, 17254749, 15947598, 14746547, 13636354, 12604601, 11643750, 10750222, 9921958, 9157244, 8455146, 7815556, 7237928, 6720126, 6258524, 5848641, 5485547, 5164339, 4880641, 4630136, 4407526, 4206724, 4022516, 3851571, 3691706, 3541155, 3399083, 3265722, 3141061, 3024000, 2913570, 2810167, 2714508, 2625957, 2543056, 2465050, 2391586, 2321436, 2253292, 2187813, 2127066, 2071426]
60864B071426n2764n1724m9571m4944l9722l6226l4531l3163l1112k8367k5409
60853A643893k2884k1176j9830j7939j5539j3961j4217j5482j5865j4471j2199
60842A460330j0527j0030j0212j0428j0497j0531j0588j0852j1755j3342j4762
60831A336806j5091j4632j4584j5260j5639j5108j4554j5040j6205j6980j7073
60820A166640j6769j5995j4766j4037j4658j5782j5655j3813j1321q992o846n139
60808A012867m389m186l589k865l237m484m606k651j93J046J503K524M091N246
60794I97077N621N227L784J764J084K924N557O244M860L663L664L393J654m80
60780A046036j391j190j206k131l642n255o663p539p621o935n708m380l623l841
$$ y = [2071426, 2018662, 1966938, 1917367, 1872423, 1832701, 1796475, 1761944, 1728781, 1697669, 1669302, 1643893, 1621009, 1599833, 1580003, 1562064, 1546525, 1532564, 1518347, 1502865, 1487000, 1472529, 1460330, 1449803, 1439773, 1429561, 1419133, 1408636, 1398105, 1387517, 1376665, 1364910, 1351568, 1336806, 1321715, 1307083, 1292499, 1277239, 1261600, 1246492, 1231938, 1216898, 1200693, 1183713, 1166640, 1149871, 1133876, 1119110, 1105073, 1090415, 1074633, 1058978, 1045165, 1033844, 1024852, 1018006, 1012867, 1008478, 1004292, 1000703, 997838, 994601, 990117, 985511, 982860, 982667, 983713, 985216, 987740, 991831, 997077, 1002698, 1007925, 1011709, 1013473, 1014557, 1017481, 1023038, 1029282, 1034142, 1037805, 1041469, 1044862, 1046516, 1046036, 1044645, 1043455, 1042249, 1040118, 1036476, 1031221, 1024558, 1017019, 1009398, 1002463, 996755, 992375, 988752, 984911]
60766I84911m508m658m137l890m663o020o928o896o354o140o783p985q783q543
60752H98623p610o717o115n862o386p785q862q134n903m129m016m829n350n332
60738H11593m985m170k950k029j849j934j759j604j856k262k565l151m143m448
60724G71888k827L54L258M397L771K508J888K465L625M168L617K631J988J802
60710H05533K000K716L664M009L406K411J341j40j686j886m11Q35L50m88L48J830
60694H23832J086j949m004l120j262r71j721j444j28K74j078k874l714l741l854
60679G95332m307m688m807n059n807o675o778n815m494l566k903k102j489j587
60665G35255j962j716j067j066j704j688m90P41R15M19R6j5L9Q17K423L648L479
$$ y = [984911, 980403, 975745, 971608, 967718, 963055, 957035, 950107, 943211, 936857, 930717, 923934, 915949, 907166, 898623, 891013, 884296, 878181, 872319, 865933, 858148, 849286, 841152, 835249, 831120, 827104, 822275, 816925, 811593, 806608, 802438, 799488, 797459, 795610, 793676, 791917, 790313, 788457, 786195, 783630, 780479, 776336, 771888, 769061, 769415, 772673, 777070, 780841, 783349, 785237, 787702, 791327, 795495, 799112, 801743, 803731, 805533, 807533, 810249, 813913, 817922, 821328, 823739, 825080, 824940, 823254, 821368, 820957, 821792, 822142, 821654, 822002, 823832, 824918, 822969, 818965, 815845, 814583, 813612, 811891, 810447, 810319, 810593, 809515, 806641, 802927, 799186, 795332, 791025, 786337, 781530, 776471, 770664, 763989, 757211, 751396, 746902, 743336, 740433, 738331, 736842, 735255, 733293, 731577, 730510, 729444, 727740, 726052, 725562, 726303, 727218, 727637, 727733, 727718, 727757, 728574, 730997, 734645, 738124]
60648G38124K622K273K228J686J301K507M925O253N261L339K395K405K059J018
60634G78396L79R87K260K958K715K322K524K974K763J739N75m03j546k652k512
60619G93479n28J958L073K736K431L019L963M537M491L442R53k329m763n552n563
60604H05347n840o207n955n033l738k053k25P04L4j295j597n34O87J106J003R53
60588G77357R08O97O68J197J952K202J605L42j303l023m288m572l866k754j949
60573G65173j779j972j820p82P76J673J126k46j145j115p05j99Q60K472L454K800
60557G68571J234L59N49P03J31m53j47Q36J682K130K436K592K297J626J226J755
60541G87527L145M432M409K849R70J83N05J021J751L737O803Q634P324L933J291
$$ y = [738124, 740746, 743019, 745247, 746933, 748234, 750741, 755666, 761919, 767180, 770519, 772914, 775319, 777378, 778396, 778775, 779762, 782022, 784980, 787695, 790017, 792541, 795515, 798278, 800017, 800592, 800189, 798643, 795991, 793479, 792951, 794909, 797982, 800718, 803149, 806168, 810131, 814668, 819159, 822601, 823554, 821225, 816462, 810910, 805347, 799507, 793300, 787345, 782312, 778574, 776521, 776296, 777000, 777034, 775739, 774142, 773608, 774295, 775401, 776404, 777357, 778265, 778962, 779630, 780827, 782779, 784981, 786586, 786928, 785625, 782602, 778314, 773742, 769876, 767122, 765173, 763394, 761422, 759602, 758820, 759596, 761269, 762395, 762149, 761004, 759889, 759184, 758985, 759845, 762317, 765771, 768571, 769805, 770164, 770713, 771416, 771547, 771094, 770947, 771783, 773465, 775595, 778031, 780623, 782920, 784546, 785772, 787527, 790672, 795104, 799513, 802362, 803332, 803515, 804020, 805041, 806792, 810529, 817332, 825966, 833290, 837223, 838514]
60526H38514P91J627K717L821M746M900M105K927J989J664K388M323O674Q430
60512H89616R834J1894J4282J5327J4740J4773J7374K1231K3120K1702J8706J6515
60500A089114J5681J4846J2348P911L240O70O93J227J54j874k289o9K914M431
60486A148997M666N624Q356J1677J3798J4571J5754J9071K4432L0277L5360L9568
60474A372151M3014M5150M5232M3128L9217L4012K8300K2898J7599J1073K877
60463A704651n062j0277j2718j4321j5756j5453j2548r043p651q518r443q761
60451A575100o631l782m68L046O122Q558J1151J4902J9922K5569L1451L7840M5065
60438A767845N2747N9862O5583O9953P3630P6995P9486P9788P6728P0305O2135
$$ y = [838514, 839305, 840932, 843649, 847470, 852216, 857116, 861221, 864148, 866137, 867801, 870189, 874512, 881186, 889616, 899450, 911344, 925626, 940953, 955693, 970466, 987840, 1009071, 1032191, 1053893, 1072599, 1089114, 1104795, 1119641, 1131989, 1139900, 1143140, 1143810, 1144503, 1145730, 1145884, 1144010, 1141721, 1141652, 1144566, 1148997, 1153663, 1159287, 1167643, 1179320, 1193118, 1207689, 1223443, 1242514, 1266946, 1297223, 1332583, 1372151, 1415165, 1460315, 1505547, 1548675, 1587892, 1621904, 1650204, 1673102, 1690701, 1701774, 1704651, 1699589, 1689312, 1676594, 1662273, 1646517, 1631064, 1618516, 1609473, 1601822, 1593304, 1583861, 1575100, 1568469, 1564687, 1564219, 1567265, 1573387, 1581945, 1593096, 1607998, 1627920, 1653489, 1684940, 1722780, 1767845, 1820592, 1880454, 1946037, 2015990, 2089620, 2166615, 2246101, 2325889, 2402617, 2472922, 2535057]
60427B535057N4609M9083M4739L9584L2562K4343J6090P936j185j2678k7233m3940
60415B718967o0116p2732q0600q4919q7420q8616q8199q6278q3325p9427p4575
60404A832760o9511o5245o1818n8391n4533n0599m6821m2953l9050l5689l3076
60393A275074l0643k8011k5658k4124k3046k1523j9203j6610j4572j3505j2997
60382A045182j2035j0129q136p359p634p354n709l985l790m853n640n570n357
60369I57631n365n056m252l706l887m090l549k717k653l443m026l593k553j834
60355I06907j635j299l84M45Q4j477k720k103K30K684L987M194L990L702L307
60340I19912K853K386J808J224J145J901K935L301K815K270K311K570K318J638
$$ y = [2535057, 2589666, 2638749, 2683488, 2723072, 2755634, 2779977, 2796067, 2804003, 2802818, 2790140, 2762907, 2718967, 2658851, 2586119, 2505519, 2420600, 2333180, 2244564, 2156365, 2070087, 1986762, 1907335, 1832760, 1763249, 1698004, 1636186, 1577795, 1523262, 1472663, 1425842, 1382889, 1343839, 1308150, 1275074, 1244431, 1216420, 1190762, 1166638, 1143592, 1122069, 1102866, 1086256, 1071684, 1058179, 1045182, 1033147, 1023018, 1014882, 1007523, 999889, 992535, 986826, 982841, 979051, 974198, 968558, 962988, 957631, 952266, 947210, 942958, 939252, 935365, 931275, 927726, 925009, 922356, 918913, 914887, 911294, 908741, 906907, 905272, 903973, 903589, 904034, 904118, 902641, 899921, 897818, 898048, 900732, 904719, 908913, 912903, 916605, 919912, 922765, 925151, 926959, 928183, 929328, 931229, 934164, 937465, 940280, 942550, 944861, 947431, 949749, 951387]
60326I51387J458K336L656M278L770K783K245K433K835K792K274K033K833M418
60312I91531N506N244M388M391N318N536L816J020q54q00P41K912N027O427O808
60297A047011O748P111P862Q355Q765J0065J2242J3741J3533J2706J2811J3332
60285A174282J2159Q470L822J81k075l702n121o079o298n748m549l160k455l037
60271A156690m464n598n807n455n174n058m860m581m542m886n318n283m262k079
60257A089323P08K918L838M336O158R724J3261J4818J4672J4810J6370J8758K1284
60244A230978K4157K7208K8875K7727K4324K0292J5979J0301K835n245j2431j7978
60232A377022k1522k2858k2660k2300k2164k1087j8231j4624j1863j0126q719
$$ y = [951387, 952845, 955181, 958837, 963115, 966885, 969668, 971913, 974346, 977181, 979973, 982247, 984280, 987113, 991531, 997037, 1002281, 1006669, 1011060, 1016378, 1021914, 1025730, 1026750, 1025896, 1025096, 1025837, 1028749, 1033776, 1040203, 1047011, 1053759, 1060870, 1068732, 1077087, 1085852, 1095917, 1108159, 1121900, 1135433, 1148139, 1160950, 1174282, 1186441, 1194911, 1198733, 1198914, 1196839, 1193137, 1188016, 1181937, 1175639, 1169891, 1165342, 1162182, 1159727, 1156690, 1152226, 1146628, 1140821, 1135366, 1130192, 1125134, 1120274, 1115693, 1111151, 1106265, 1100947, 1095664, 1091402, 1089323, 1090031, 1092949, 1096787, 1101123, 1107281, 1117005, 1130266, 1145084, 1159756, 1174566, 1190936, 1209694, 1230978, 1255135, 1282343, 1311218, 1338945, 1363269, 1383561, 1399540, 1409841, 1412676, 1407431, 1395000, 1377022, 1355500, 1332642, 1309982, 1287682, 1265518, 1244431, 1226200, 1211576, 1199713, 1189587, 1180868]
60221A180868p811q177r499j0483j0634j0460r926q373o305n494o519p769p936
60208A071482p908q799r549q421n983m429m299m073l050k465l089l611k572n18
60194A002716Q74R76L99k26o93q69p45m96o4Q83K142K752K177J077L76K07L27
60177A011813Q24J616J967J388N72N54J379K317K939L173K842K071J692K346L610
60162A041103M801O051P594Q689Q482P379O402N773N503O568R662J3165J4529
60149A145701J3676J2921J3323J3432J2162J0608R853R155P814P016P979R633
60137A273273J0027R092Q124P398O185M591L451K673J452L1n64n84j509l561n086
60122A314993n180n217o602q315q360o913o113o814p216n459k335k37j60j085
$$ y = [1180868, 1173057, 1164880, 1155381, 1144898, 1134264, 1123804, 1113878, 1105505, 1099200, 1093706, 1087187, 1079418, 1071482, 1063574, 1054775, 1045226, 1036805, 1030822, 1026393, 1022094, 1018021, 1014971, 1012506, 1009417, 1005806, 1003234, 1002716, 1003590, 1004566, 1004965, 1004739, 1004046, 1003177, 1002432, 1001936, 1001872, 1002755, 1004897, 1007649, 1009826, 1010903, 1011279, 1011486, 1011813, 1012637, 1014253, 1016220, 1017608, 1018180, 1018734, 1020113, 1022430, 1025369, 1028542, 1031384, 1033455, 1035147, 1037493, 1041103, 1045904, 1051955, 1059549, 1068238, 1076720, 1084099, 1090501, 1096274, 1101777, 1108345, 1118007, 1131172, 1145701, 1159377, 1172298, 1185621, 1199053, 1211215, 1221823, 1231676, 1240831, 1248645, 1255661, 1263640, 1273273, 1283300, 1292392, 1300516, 1307914, 1314099, 1318690, 1322141, 1324814, 1326266, 1326297, 1325733, 1325149, 1323640, 1320079, 1314993, 1309813, 1304596, 1297994, 1289679, 1281319, 1274406, 1268293, 1261479, 1254263, 1248804, 1246469, 1246232, 1246072, 1244987]
60108A244987k132l664n674o560n002k278j113k292l847l777k179l21J038J625
60094A208811J203K21L6J358L019L368K475J873K367L154L103K122J099J020K198
60079A237427M010N489O390P366Q765R896J0028R603R705J0532J1189J0870R634
60066A350904Q078O819O275O596P675R306J1171J2681J3397J3620J3959J4310
60054A474791J4047J3351J3133J3264J2267R521O460M558L423K076Q49L42l47
60041A567735k375m851n900n587n741o958p870p601o882o341n570m630m618n870
60027A486941p052p046o466o316o397o188o261p493r417j0602j0465r734r289
60014A384215r299r563j0009j0710j1596j2382j2840j3135j3589j4044j3876j2969
$$ y = [1244987, 1242855, 1239191, 1233517, 1226957, 1221955, 1219677, 1218564, 1216272, 1212425, 1208648, 1206469, 1206148, 1207186, 1208811, 1210014, 1210235, 1210271, 1211629, 1214648, 1218016, 1220491, 1222364, 1224731, 1227885, 1230988, 1233110, 1234209, 1235229, 1237427, 1241437, 1246926, 1253316, 1260682, 1269447, 1279343, 1289371, 1298974, 1308679, 1319211, 1330400, 1341270, 1350904, 1358982, 1365801, 1372076, 1378672, 1386347, 1395653, 1406824, 1419505, 1432902, 1446522, 1460481, 1474791, 1488838, 1502189, 1515322, 1528586, 1540853, 1550374, 1556834, 1561392, 1564815, 1566891, 1567740, 1568082, 1567735, 1565360, 1560509, 1554609, 1549022, 1543281, 1536323, 1528453, 1520852, 1513970, 1507629, 1502059, 1497429, 1492811, 1486941, 1479889, 1472843, 1466377, 1460061, 1453664, 1447476, 1441215, 1433722, 1424305, 1413703, 1403238, 1393504, 1384215, 1374916, 1365353, 1355344, 1344634, 1333038, 1320656, 1307816, 1294681, 1281092, 1267048, 1253172, 1240203]
60002A240203j2044j1488j0634r043p726p801q548q336p074o100n769n032l588
59989A137020k541k343j846j83J933L635N122O573P278O878O207N897N402M500
59975A183532M360N701P096O683M645K487O72j318l245m333m954o284q197r153
59961A177692q607q005q637r744r724q607q169r556j1672j2406j1167r423q567
59948A053408q097o695m470k895k704l251l918m669m885l494j025J26j126k653
59934A003652j946L66J693J291Q13J373K149K210J990K378L517N029O437O964
59920A037916N797L155M71j021j462j808k512l140l249l173l637m476m373k512
59906A015976j26P90K73M61K374M180L703J405n42j105q45k15Q49J984K420K007
$$ y = [1240203, 1228159, 1216671, 1206037, 1196994, 1189268, 1181467, 1172919, 1164583, 1157509, 1151409, 1145640, 1140608, 1137020, 1134479, 1132136, 1130290, 1130107, 1132040, 1135675, 1140797, 1147370, 1154648, 1161526, 1167733, 1173630, 1179032, 1183532, 1187892, 1193593, 1200689, 1207372, 1212017, 1214504, 1215176, 1213858, 1210613, 1206280, 1201326, 1195042, 1186845, 1177692, 1169085, 1161080, 1152443, 1142699, 1132975, 1124368, 1116199, 1106643, 1094971, 1082565, 1071398, 1061975, 1053408, 1045311, 1038616, 1034146, 1031251, 1028547, 1025296, 1021378, 1016709, 1011824, 1008330, 1007305, 1007431, 1006305, 1003652, 1001706, 1002072, 1003765, 1005056, 1005869, 1007242, 1009391, 1011601, 1013591, 1015969, 1019486, 1024515, 1030952, 1037916, 1043713, 1046868, 1047339, 1046318, 1044856, 1043048, 1040536, 1037396, 1034147, 1030974, 1027337, 1022861, 1018488, 1015976, 1015850, 1016640, 1016913, 1017374, 1019748, 1023928, 1027631, 1029036, 1028494, 1027389, 1026544, 1026329, 1027178, 1029162, 1031582, 1033589]
59890A033589J103j87j596k041q06R51J370L36o66r69j287j799j538k09Q55M67
59874A027573p92j414o05J382L814N814O878P455Q395R607R959Q813O920N442
59860A099241M713M326L920L576L560L814L704K759J894K884N814Q161P765N749
59846A161880M762N048M613L013K311L622N202N144L983L236L115L185L906N794
59832A218814P959R125R430R776J0122R905R618J0378J1949J2615J1313Q925P216
59819A347145P082P924Q393P701O458N874O027N495L144l51l336m866m999m215
59805A387476l436l930n957p880p808o057m829n297o075n090k220O14J749J494
59791A332754J441K528M283N930P495R187J0380J0287R428R095R212Q238N697
$$ y = [1033589, 1034692, 1034505, 1032909, 1030868, 1030062, 1031013, 1032383, 1032719, 1032053, 1031084, 1029797, 1027998, 1026460, 1026251, 1027106, 1027573, 1026781, 1025367, 1024762, 1026144, 1029958, 1035772, 1042650, 1050105, 1058500, 1068107, 1078066, 1086879, 1093799, 1099241, 1103954, 1108280, 1112200, 1115776, 1119336, 1123150, 1126854, 1129613, 1131507, 1134391, 1140205, 1148366, 1156131, 1161880, 1166642, 1171690, 1176303, 1179316, 1181627, 1185249, 1190451, 1195595, 1199578, 1202814, 1205929, 1209114, 1213020, 1218814, 1226773, 1235898, 1245328, 1255104, 1265226, 1275131, 1284749, 1295127, 1307076, 1319691, 1331004, 1339929, 1347145, 1354227, 1362151, 1370544, 1378245, 1384703, 1390577, 1396604, 1402099, 1405243, 1404892, 1401556, 1396690, 1391691, 1387476, 1384040, 1380110, 1374153, 1366273, 1358465, 1352408, 1347579, 1342282, 1336207, 1331117, 1328897, 1329511, 1331260, 1332754, 1334195, 1336723, 1341006, 1346936, 1354431, 1363618, 1373998, 1384285, 1393713, 1402808, 1412020, 1420258, 1425955]
59778A425955L398L028L799L825K953K653L508M349L881J937r25m030o671q384
59764A439276r319r820r943j0018j1105j3646j5988j5810j3081j0263r218r309
59752A301756r089q481q219q266p959p200o436n727m859m129m136m780n314n424
59738A211737n550n922n956m974l176j581j150k039l373l773k553o57P8j034k622
59723A167455k891j779p61p51j139j061p13p39j072j094o44j87j36n36j114j242
59707A151596k46J601K857K526J570J742L194M436M697M898N945P430Q742J0183
59693A211171J1945J3056J2688J1822J2196J3766J4595J3393J1044R276Q717Q736
59681A352405Q593Q075P274O287N239M347L738L212K324Q62q37k253l242l921
$$ y = [1425955, 1429353, 1432381, 1436180, 1440005, 1442958, 1445611, 1449119, 1453468, 1457349, 1459286, 1458361, 1454331, 1447660, 1439276, 1429957, 1420137, 1410194, 1400176, 1389071, 1375425, 1359437, 1343627, 1330546, 1320283, 1311065, 1301756, 1292667, 1284186, 1275967, 1267701, 1259742, 1252542, 1246106, 1240379, 1235520, 1231391, 1227255, 1222475, 1217161, 1211737, 1206187, 1200265, 1194309, 1189335, 1186159, 1184578, 1183428, 1181389, 1178016, 1174243, 1171690, 1171033, 1171111, 1170077, 1167455, 1164564, 1162785, 1162024, 1161273, 1160134, 1159073, 1158360, 1157621, 1156549, 1155455, 1154811, 1154624, 1154488, 1153952, 1152838, 1151596, 1151350, 1152951, 1155808, 1158334, 1159904, 1161646, 1164840, 1169276, 1173973, 1178871, 1184816, 1192246, 1200988, 1211171, 1223116, 1236172, 1248860, 1260682, 1272878, 1286644, 1301239, 1314632, 1325676, 1334952, 1343669, 1352405, 1360998, 1369073, 1376347, 1382634, 1387873, 1392220, 1395958, 1399170, 1401494, 1402356, 1401519, 1399266, 1396024, 1392103]
59667A392103m224m108m024m491n118m979m113l761m632n864o318o048n702n303
59653A323418m627m108m161m055k779p88L63J60j54P78K983N504P273P500O230
59638A333537M727M435N281N763N034L919L500L660L666L368K960K239R89k68
59624A382810p55m26J46N11L29r54l410n792o544n790n286o066p200p451p169
59609A326953p456q144q015o795n588n036m323k634n36R15J648K156K356J999
59595A287500J803K830M843O398O578N623L989K122J100J795K951J898k011o195
59581A321224q172q475q892r387q908q057q345r192q328n543l552m216n955o268
59567A217934n213m735n633o868p410p284o924o643o787p511q335q513p931p109
$$ y = [1392103, 1387879, 1383771, 1379747, 1375256, 1370138, 1365159, 1361046, 1357285, 1352653, 1346789, 1340471, 1334423, 1328721, 1323418, 1318791, 1314683, 1310522, 1306467, 1303688, 1302900, 1303263, 1303423, 1303269, 1304047, 1307030, 1312534, 1319807, 1327307, 1333537, 1338264, 1342699, 1347980, 1353743, 1358777, 1362696, 1366196, 1369856, 1373522, 1376890, 1379850, 1382089, 1383078, 1382810, 1382055, 1381629, 1381775, 1382286, 1382615, 1381661, 1378251, 1372459, 1365915, 1360125, 1354839, 1348773, 1341573, 1334122, 1326953, 1319497, 1311353, 1303338, 1296543, 1290955, 1285919, 1281596, 1278962, 1278426, 1279341, 1280989, 1283145, 1285501, 1287500, 1289303, 1292133, 1296976, 1303374, 1309952, 1315575, 1319564, 1321686, 1322786, 1324581, 1327532, 1329430, 1327419, 1321224, 1313052, 1304577, 1295685, 1286298, 1277390, 1269333, 1260988, 1251796, 1243468, 1237925, 1234373, 1230157, 1224202, 1217934, 1212721, 1207986, 1202353, 1195485, 1188075, 1180791, 1173867, 1167224, 1160437, 1152926, 1144591, 1136078, 1128147, 1121038]
59553A121038o512o249o227o006m883k788q39j17p1P77K456L126J586q63k057
59538A092371j632r58q70r13p02n36k41J105L387M557K987n8j813j612j333k165
59522A091574k819j902m98p90k880m563m107k024O7J111R19k44j678k373j871
59507A067922r52r24k102l320l211j860o78n32p05l08Lr74k570k523j89K165K366
59490A051608J246J170K640M170M905N471O275O800O942P565R229J1595J4415
59477A134031J7912K1540K3491K2229J7956J2195O688K784R05R8r49k093j952
59464A254835k19J578K341K953M434N793N320L216J280L32n31k092l897n246o206
59449A263891p192q351r699j1233j2593j3151j2669j1508j0144q892q014p560
$$ y = [1121038, 1114526, 1108277, 1102050, 1096044, 1091161, 1088373, 1087534, 1087417, 1087346, 1088123, 1090579, 1093705, 1095291, 1094428, 1092371, 1090739, 1089781, 1088911, 1087998, 1087296, 1086760, 1086519, 1087624, 1091011, 1095568, 1098555, 1098497, 1096684, 1095072, 1093739, 1091574, 1088755, 1086853, 1086355, 1085565, 1082685, 1078122, 1074015, 1071991, 1072058, 1073169, 1074088, 1073844, 1072166, 1069793, 1067922, 1066970, 1066046, 1063944, 1060624, 1057413, 1055553, 1054875, 1054343, 1053638, 1053330, 1053333, 1052359, 1049789, 1047266, 1047077, 1049242, 1051608, 1052854, 1054024, 1056664, 1060834, 1065739, 1071210, 1077485, 1084285, 1091227, 1098792, 1108021, 1119616, 1134031, 1151943, 1173483, 1196974, 1219203, 1237159, 1249354, 1256042, 1258826, 1259731, 1259829, 1258880, 1256787, 1254835, 1254616, 1256194, 1258535, 1261488, 1265922, 1271715, 1277035, 1280251, 1281531, 1281863, 1281332, 1279240, 1275343, 1270097, 1263891, 1256699, 1248348, 1238649, 1227416, 1214823, 1201672, 1189003, 1177495, 1167351, 1158459, 1150445, 1142885]
59437A142885p016n744l816j961o71J04L79K1n93n39M89J529J424M07PJ325L705
59420A131935N314N029L689L286M828P303Q914R041Q478P949P231N896M262L095
59406A216250K698K718K690K463K206K231K655L131L191L010L521N292P579Q976
59392A268611R007Q575Q746R552J0226J0251R787R143Q234O626M024O27k885n699
59378A354825p272p461o402m508k643j916k849m697n950n635l983j808M58K828
59364A302987N263P554R697J2037J4831J7777K0154K1493K2179K3324K5918K9979
59352A513193L4569L8433M0219L8324L1528K0630Q978K64m489o983q592q131l573
59339A694370M576J2606J6580J5381J0559L968l567j1368j7913k1748k3066k3258
$$ y = [1142885, 1135869, 1130125, 1126309, 1124348, 1123677, 1123781, 1124160, 1124181, 1123588, 1123049, 1123538, 1125067, 1126491, 1126898, 1126905, 1128230, 1131935, 1137249, 1142278, 1145967, 1149253, 1154081, 1161384, 1170298, 1179339, 1187817, 1195766, 1202997, 1208893, 1213155, 1216250, 1218948, 1221666, 1224356, 1226819, 1229025, 1231256, 1233911, 1237042, 1240233, 1243243, 1246764, 1252056, 1259635, 1268611, 1277618, 1286193, 1294939, 1304491, 1314717, 1324968, 1334755, 1343898, 1352132, 1358758, 1362782, 1363409, 1360524, 1354825, 1347553, 1340092, 1333690, 1329182, 1326539, 1324623, 1321774, 1317077, 1311127, 1305492, 1301509, 1299701, 1300159, 1302987, 1308250, 1315804, 1325501, 1337538, 1352369, 1370146, 1390300, 1411793, 1433972, 1457296, 1483214, 1513193, 1547762, 1586195, 1626414, 1664738, 1696266, 1716896, 1725874, 1726138, 1721649, 1714666, 1706074, 1697943, 1694370, 1698946, 1711552, 1728132, 1743513, 1754072, 1758040, 1754473, 1743105, 1725192, 1703444, 1680378, 1657120]
59327A657120k2769k0447j5815j0938q679r252r981q701o179m534m465m957m939
59314A525464m045k292j36J261R90l52j280j295j142j230r80j43M73L66L64J364
59298A517387K793L517L793M984P487J0104J1620J2059J2213J2807J4381J7010
59286A630155J9782K1324K1298K0724K0527K0481K0037J9188J7934J5825J2881
59275A840156J0132Q237O242K859j518n357q101j0347j2220j3231j3827j5433
59263A787592j8402k1292k2770k3059k2913k2431k1654k1143k0981k0218j8402
59252A554327j6756j6609j7430j7653j6877j5868j4875j3378j1348r385p591n521
59240A391036l379k011j401k38K533O508J0454J3312J4233J2472Q028K024l953
$$ y = [1657120, 1634351, 1613904, 1598089, 1587151, 1578472, 1569220, 1559239, 1550538, 1544359, 1539825, 1535360, 1530403, 1525464, 1521419, 1519127, 1518991, 1520252, 1521242, 1520890, 1519610, 1518315, 1517173, 1515943, 1514963, 1514820, 1515293, 1515659, 1516023, 1517387, 1520180, 1523697, 1527490, 1532474, 1539961, 1550065, 1561685, 1573744, 1585957, 1598764, 1613145, 1630155, 1649937, 1671261, 1692559, 1713283, 1733810, 1754291, 1774328, 1793516, 1811450, 1827275, 1840156, 1850288, 1858525, 1864767, 1867626, 1866108, 1860751, 1852650, 1842303, 1830083, 1816852, 1803025, 1787592, 1769190, 1747898, 1725128, 1702069, 1679156, 1656725, 1635071, 1613928, 1592947, 1572729, 1554327, 1537571, 1520962, 1503532, 1485879, 1469002, 1453134, 1438259, 1424881, 1413533, 1404148, 1396557, 1391036, 1387657, 1385646, 1384245, 1384007, 1386540, 1393048, 1403502, 1416814, 1431047, 1443519, 1451547, 1453571, 1449618]
59227A449618q759j1954j3691j4496j4683j3868j1506q021m806k841j725k81K191
59214A345178N384Q208R554R296Q716R398J1515J3651J4477J4086J3435J2989
59202A475887J2321J0761Q075M635J203j470k955l217k699k328k869l927m139
59189A489278k913j341o92o02P3J202J613J340J907L894N702N641M146K970K988
59174A515206L746M611N314N590N175M125K681R64r72l062n467q471j1737j4143
59160A503560j4794j3869j2286j0873j0209j0610j1796j2936j3473j3457j2833
59149A366424j1057q010m803k947k938m013m964m809l260j108L14O39J007K389
59135A322864L922L843J944N0k7J666L718N016N569O027O883Q088R165R528Q717
$$ y = [1449618, 1440859, 1428905, 1415214, 1400718, 1386035, 1372167, 1360661, 1352640, 1347834, 1344993, 1343268, 1342987, 1345178, 1350562, 1358770, 1368324, 1377620, 1386336, 1395734, 1407249, 1420900, 1435377, 1449463, 1462898, 1475887, 1488208, 1498969, 1507044, 1511679, 1512882, 1511412, 1508457, 1505240, 1502541, 1500213, 1497344, 1493417, 1489278, 1486365, 1485024, 1484332, 1483730, 1483803, 1485005, 1486618, 1487958, 1489865, 1493759, 1499461, 1505102, 1509248, 1512218, 1515206, 1518952, 1523563, 1528877, 1534467, 1539642, 1543767, 1546448, 1547412, 1546440, 1543378, 1537911, 1529440, 1517703, 1503560, 1488766, 1474897, 1462611, 1451738, 1441529, 1430919, 1419123, 1406187, 1392714, 1379257, 1366424, 1355367, 1347357, 1342554, 1339607, 1336669, 1332656, 1327692, 1322883, 1319623, 1318515, 1318829, 1319468, 1320475, 1322864, 1326786, 1330629, 1332573, 1332623, 1332596, 1334262, 1337980, 1342996, 1348565, 1354592, 1361475, 1369563, 1378728, 1388256, 1396973]
59120A396973O649L899J618O40P01Q54O52M16L94L69K55M01R17J274Q44m91k407
59103A413958m239n053m449l425l421m298m566l966m326o825r936j1463j1492
59090A336499j1583j1963j1611j0692j0732j2115j3321j3201j2389j1790j1097
59079A206005r845q678q408q622q230p057n836m987m234l368k635k162j511o0
59065A130372K268M774O593P589Q495R937J1580J2705J3371J4293J5459J5834
59053A253270J4882J3635J3510J4430J4976J4331J3274J2979J3430J3495J2435
59042A404647J0814R760R540R184P646N082K706J388O95l88j949k839k102m37
59028A453747K16j316m269o880q124q240q001q036q771j0297j2180j3715j4463
$$ y = [1396973, 1403622, 1407521, 1409139, 1409779, 1410480, 1411334, 1411986, 1412402, 1412796, 1413165, 1413420, 1413821, 1414738, 1416012, 1416856, 1416365, 1413958, 1409719, 1404666, 1400217, 1396792, 1393371, 1389073, 1384507, 1380541, 1376215, 1369390, 1359454, 1347991, 1336499, 1324916, 1312953, 1301342, 1290650, 1279918, 1267803, 1254482, 1241281, 1228892, 1217102, 1206005, 1196160, 1187482, 1179074, 1170452, 1162222, 1155165, 1149329, 1144342, 1140108, 1136740, 1134105, 1131943, 1130432, 1130372, 1132640, 1137414, 1144007, 1151596, 1160091, 1170028, 1181608, 1194313, 1207684, 1221977, 1237436, 1253270, 1268152, 1281787, 1295297, 1309727, 1324703, 1339034, 1352308, 1365287, 1378717, 1392212, 1404647, 1415461, 1425221, 1434761, 1443945, 1451591, 1456673, 1459379, 1460767, 1461462, 1461074, 1459125, 1456286, 1454184, 1453747, 1453963, 1452647, 1448378, 1441498, 1433374, 1425134, 1417133, 1409097, 1400326, 1390029, 1377849, 1364134, 1349671]
59015A349671j4304j3176j1335r721r297r897j0379j0005r017p821o551n679n952
59002A226537p051p261n393k436m89n60k028l703m522l850k214j364k489m532
58988A178645n378m539l425k891j948M03L179M322L203J289L72P75J555J974K294
58973A179830L118M433N742O855P991R117R902J0445J1366J2807J4131J5079J6460
58960A307276J8902K1476K2519K1456J9022J6042J2939J0162Q051O210L924J316
58948A469295o33j247p70J64R40R70K19k07J087L950O347O363M147J628N81J147
58932A493981J908J344n43k174k306j654j874l167l980l307k235k405l598l867
58918A466123j972J040L022L177K910M149P117J0111J1475J1344J1143J1861J3166
$$ y = [1349671, 1335367, 1322191, 1310856, 1301135, 1291838, 1281941, 1271562, 1261557, 1252540, 1244719, 1238168, 1232489, 1226537, 1219486, 1212225, 1206832, 1204396, 1203907, 1203347, 1201319, 1197616, 1193094, 1189244, 1187030, 1185666, 1183177, 1178645, 1173267, 1168728, 1165303, 1162412, 1160464, 1160867, 1164046, 1168368, 1171571, 1172860, 1173232, 1174007, 1175562, 1177536, 1179830, 1182948, 1187381, 1193123, 1199978, 1207969, 1217086, 1226988, 1237433, 1248799, 1261606, 1275737, 1290816, 1307276, 1326178, 1347654, 1370173, 1391629, 1410651, 1426693, 1439632, 1449794, 1457845, 1464055, 1467979, 1469295, 1468662, 1467415, 1466645, 1466809, 1467749, 1468719, 1468938, 1468731, 1469818, 1473768, 1480115, 1486478, 1490625, 1492253, 1492834, 1493981, 1495889, 1497233, 1496690, 1494516, 1492210, 1490556, 1488682, 1485515, 1481535, 1478228, 1475993, 1473588, 1469990, 1466123, 1464151, 1465191, 1468213, 1471390, 1474300, 1478449, 1485566, 1495677, 1507152, 1518496, 1529639, 1541500, 1554666]
58905A554666J4071J4026J3386J2946J2874J2244J0093O918M223K332j87m242
58893A653350q444j0873j1764j2979j5175j7142j7876j7758j7320j6315j4637
58882A493067j3049j2162j1507j0347q812p538o684o001n618n883o487o403n135
58869A387441l572l029l436l249j713m31j443m036n155l385q24n3q83j592j882
58854A352758k507k887j602R51K645K588K013J981K241K962N429R882J4387J7112
58840A407953J8413J9441K0039J9527J8538J8354J8910J8992J8250J7763J8516
58829A614696K0378K2685K5024K7062K8212K7877K5952K2992J9876J7290J5445
58818A867489J4239J3344J1996R233M990N25l026o101r607j2770j3699j2292j0824
$$ y = [1554666, 1568737, 1582763, 1596149, 1609095, 1621969, 1634213, 1644306, 1651224, 1655447, 1657779, 1657592, 1653350, 1644906, 1634033, 1622269, 1609290, 1594115, 1576973, 1559097, 1541339, 1524019, 1507704, 1493067, 1480018, 1467856, 1456349, 1446002, 1437190, 1429652, 1422968, 1416967, 1411349, 1405466, 1398979, 1392576, 1387441, 1383869, 1380840, 1377404, 1374155, 1372442, 1372011, 1370568, 1366532, 1361377, 1357992, 1357168, 1357115, 1356232, 1354640, 1352758, 1350251, 1347364, 1345762, 1346713, 1349358, 1351946, 1353959, 1355940, 1358181, 1361143, 1366572, 1376454, 1390841, 1407953, 1426366, 1445807, 1465846, 1485373, 1503911, 1522265, 1541175, 1560167, 1578417, 1596180, 1614696, 1635074, 1657759, 1682783, 1709845, 1738057, 1765934, 1791886, 1814878, 1834754, 1852044, 1867489, 1881728, 1895072, 1907068, 1916301, 1921291, 1921816, 1918790, 1912689, 1903082, 1890312, 1876613, 1864321, 1853497]
58805A853497j0950j1698j1539j1050j1918j4128j5971j6607j7041j8224j9593
58794A694778k0040j9506j8825j8479j8204j7681j7019j6399j5685j4737j3912
58783A504291j3802j4496j5445j6099j6287j5959j5251j4837j5297j5798j4567
58772A336453j1463q846q622r482q833o614n128n267n365m216k954k812k855j451
58758A252545J122L052L335K542J705J511K231L589M634M392K622j51k974m708
58744A275447m535k702o24J15j199m042o918q337q222p966q448q591p093n010
58730A201875m826o943q907q617o583m380k347N1K676M635N251M641L829M285
58716A184640O306P916O749L152j21j526k249l611n066n760o245p216p955p469
$$ y = [1853497, 1842547, 1830849, 1819310, 1808260, 1796342, 1782214, 1766243, 1749636, 1732595, 1714371, 1694778, 1674738, 1655232, 1636407, 1617928, 1599724, 1582043, 1565024, 1548625, 1532940, 1518203, 1504291, 1490489, 1475993, 1460548, 1444449, 1428162, 1412203, 1396952, 1382115, 1366818, 1351020, 1336453, 1324990, 1316144, 1307522, 1298040, 1289207, 1282593, 1277465, 1272198, 1266833, 1262617, 1259663, 1256851, 1253996, 1252545, 1253667, 1256719, 1260054, 1262596, 1264301, 1265812, 1268043, 1271632, 1276266, 1280658, 1283280, 1283129, 1280155, 1275447, 1270912, 1268210, 1267586, 1267701, 1266502, 1262460, 1255542, 1247205, 1238983, 1231017, 1222569, 1213978, 1206885, 1201875, 1197049, 1190106, 1181199, 1172582, 1165999, 1161619, 1159272, 1159323, 1161999, 1166634, 1171885, 1176526, 1180355, 1184640, 1190946, 1198862, 1205611, 1208763, 1208642, 1207116, 1204867, 1201256, 1196190, 1190430, 1184185, 1176969, 1169014, 1161545]
58702A161545o029m384k637j094r00k421m029m003k700j628j269j182j252j426
58688A126591j008L80J813K348K535L441M977O405P613Q504Q095N916L701L912
58674A185223O821J0433J2944J3928J3563J2222J0839J0468J1218J2299J2892
58663A312850J2511J1113R506Q821R061Q994Q264Q314J0169J2546J3496J2849
58651A438494J1644J0177Q068N502K879p6l621p199j0460j4005j7963k1113k2819
58638A379508k4278k6195k6899k4974k2268k1657k2938k3530k2385k0524j8443
58627A125417j5955j4080j4083j4765j3708j1168r837j0509j0967r760q124p279
58615I85182o467m836l061j874r01J09P29J293L045N938Q219R047R691J1141J2364
$$ y = [1161545, 1155516, 1151132, 1148495, 1147401, 1146501, 1144080, 1140051, 1136048, 1133348, 1131720, 1130451, 1129269, 1128017, 1126591, 1125583, 1125963, 1127776, 1130124, 1132659, 1136100, 1141077, 1147482, 1155095, 1163599, 1171694, 1177610, 1181311, 1185223, 1192044, 1202477, 1215421, 1229349, 1242912, 1255134, 1265973, 1276441, 1287659, 1299958, 1312850, 1325361, 1336474, 1345980, 1354801, 1363862, 1372856, 1381120, 1389434, 1399603, 1412149, 1425645, 1438494, 1450138, 1460315, 1468383, 1473885, 1476764, 1476688, 1473067, 1465868, 1455408, 1441403, 1423440, 1402327, 1379508, 1355230, 1329035, 1302136, 1277162, 1254894, 1233237, 1210299, 1186769, 1164384, 1143860, 1125417, 1109462, 1095382, 1081299, 1066534, 1052826, 1041658, 1031821, 1021312, 1010345, 1000585, 992461, 985182, 978715, 973879, 970818, 968944, 968043, 968152, 968881, 970174, 973219, 979157, 987376, 996423, 1006114, 1017255, 1029619]
58600A029619J2064J0502Q374N399J352k646n154n949n778n445n486n819n441
58587A025592l688j841j905l655m755m201l522l931m430l832k632j592k97J415
58573I86726K280J457K64L97J461J811J005n4p85j398k076k673k923k366o64J643
58557I84105L408M299N000N719N770M992M300M170M057L857M386N581N870M475
58543A049989K757K100J884R79j16k18M46P18M13K66N46R16J223J541J971L047
58527A068462N386Q330J0149J0489J1250J3794J6662J7577J6573J5399J4858J4550
58515A223479J4587J5518J6797J7129J6437J6154J7501K0431K4141K7562K9634
58504A439370L0228L0608L2089L4511L6881L8903M0624M1026L8552L3171K6741
$$ y = [1029619, 1041683, 1052185, 1060559, 1065958, 1067310, 1064664, 1059510, 1053561, 1047783, 1042338, 1036852, 1031033, 1025592, 1021904, 1020063, 1018158, 1014503, 1009748, 1005547, 1002025, 998094, 993664, 989832, 987200, 985608, 985311, 986726, 989006, 990463, 990727, 991124, 992585, 994396, 995401, 995347, 994562, 993164, 991088, 988415, 985492, 983126, 982462, 984105, 987513, 991812, 996812, 1002531, 1008301, 1013293, 1017593, 1021763, 1025820, 1029677, 1034063, 1039644, 1045514, 1049989, 1052746, 1054846, 1056730, 1057709, 1057593, 1057375, 1057821, 1058539, 1058952, 1059218, 1059764, 1060680, 1061903, 1063444, 1065415, 1068462, 1073848, 1082178, 1092327, 1102816, 1114066, 1127860, 1144522, 1162099, 1178672, 1194071, 1208929, 1223479, 1238066, 1253584, 1270381, 1287510, 1303947, 1320101, 1337602, 1358033, 1382174, 1409736, 1439370, 1469598, 1500206, 1532295, 1566806, 1603687, 1642590, 1683214, 1724240, 1762792, 1795963, 1822704]
58493A822704K1055J6351J1883P160K407j716m644o428p524q013p672p171q265
58480A830127j2000j7287k2130k5700k8389l0560l2246l3567l4280l3386l0352
58469A530230k6480k3795k2732k2019k0840j9706j8984j7870j5607j2941j1398
58458A317858j1380j1666j0937r365q340q735r776r881q396o097m168l228l253
58445A212636l773m034l507k431j437o61J78Q81P91q8p50k86J161K756L822M242
58429A209500M531N439P087Q759J0018J1434J3381J4985J5448J5713J7139J9183
58417A352617K0279K0509K1093K1460J9582J5535J1888R782P352L326n84k563
58405A500276l629n497p481p862o806n706m604k521M30L122N054O414P147P300
$$ y = [1822704, 1843759, 1860110, 1871993, 1879153, 1881560, 1879844, 1875200, 1868772, 1861248, 1853235, 1845563, 1838392, 1830127, 1818127, 1800840, 1778710, 1753010, 1724621, 1694061, 1661815, 1628248, 1593968, 1560582, 1530230, 1503750, 1479955, 1457223, 1435204, 1414364, 1394658, 1375674, 1357804, 1342197, 1329256, 1317858, 1306478, 1294812, 1283875, 1274510, 1266170, 1257435, 1247659, 1237778, 1229382, 1223285, 1219117, 1215889, 1212636, 1208863, 1204829, 1201322, 1198891, 1197454, 1196793, 1196971, 1197852, 1198643, 1198555, 1197805, 1197519, 1198680, 1201436, 1205258, 1209500, 1214031, 1219470, 1226557, 1235316, 1245334, 1256768, 1270149, 1285134, 1300582, 1316295, 1333434, 1352617, 1372896, 1393405, 1414498, 1435958, 1455540, 1471075, 1482963, 1492745, 1500097, 1503423, 1502839, 1500276, 1496647, 1491150, 1483669, 1475807, 1469001, 1463295, 1458691, 1456170, 1456600, 1459722, 1464776, 1471190, 1478337, 1485637]
58391A485637P567Q174Q221P168N842M644K347j670n510p172p595q876j0555j0366
58377A477856q184o443o431o666n476l222j280m14p65k095l314k819l4L893P254
58362A441860R244J0142J0463J0080Q179M394k02l934o322q069r363r622r171
58349A447679r269r917r597q074p332q346r241q364p120p358p946o674m101k466
58335A341874j762n2K801M816N283N570O119N405K822L99M67L026O243Q456R000
58320A400467Q123O777N932N818O051O203N836M594L069K910N131Q790J2090J4014
58306A495805J4280J2887J0739R640J0377J1894J3288J5238J8078K0195K0124
58295A652545J8855J8137J7791J6795J5570J4942J3980J1474Q587P519Q187Q812
$$ y = [1485637, 1493204, 1501378, 1509599, 1516767, 1522609, 1527253, 1529600, 1527930, 1522420, 1515248, 1507653, 1498777, 1488222, 1477856, 1469672, 1463229, 1456798, 1450132, 1444656, 1441434, 1440154, 1439740, 1438975, 1436880, 1433566, 1430747, 1430713, 1434606, 1441860, 1451104, 1461246, 1471709, 1481789, 1489968, 1494362, 1494160, 1490226, 1483904, 1475835, 1466472, 1456850, 1447679, 1438410, 1428493, 1418896, 1410822, 1403490, 1395144, 1385903, 1377539, 1370419, 1363061, 1355115, 1348441, 1344340, 1341874, 1340112, 1340060, 1342861, 1347677, 1352960, 1358530, 1364649, 1370054, 1372876, 1373275, 1373742, 1376768, 1383011, 1391467, 1400467, 1408590, 1415367, 1421299, 1427117, 1433168, 1439371, 1445207, 1449801, 1452870, 1455780, 1460911, 1469701, 1481791, 1495805, 1510085, 1522972, 1533711, 1543351, 1553728, 1565622, 1578910, 1594148, 1612226, 1632421, 1652545, 1671400, 1689537, 1707328, 1724123, 1739693, 1754635, 1768615, 1780089, 1788676, 1796195, 1804382, 1813194]
58283A813194R088J0142J1763J2482J2252J2650J4303J6292J8012J9609K0741
58272A970528K0965K1166K2500K4206K4462K3172K1781K0657J8820J6079J3417
58261B197753J1353R820R338J0324J1601J1644J0944J1283J2950J4695J5935J7141
58249B344781J8418J9593K1110K3109K4491K4707K5308K7659L0441L1690L1948
58238B623255L2828L4010L4457L5155L7420L9813M0146L9478M0575M3319M5249
58227C045705M5822M6525M7400M7219M6571M7193M8766M9788N0858N3434N6349
58216C585630N7558N8475O2238O8361P3458P6744Q0321Q4598Q8038R1204R6284
58205D422909J02759J08053J12187J17132J22152J24867J26431J30191J35492
$$ y = [1813194, 1822282, 1832424, 1844187, 1856669, 1868921, 1881571, 1895874, 1912166, 1930178, 1949787, 1970528, 1991493, 2012659, 2035159, 2059365, 2083827, 2106999, 2128780, 2149437, 2168257, 2184336, 2197753, 2209106, 2218926, 2228264, 2238588, 2250189, 2261833, 2272777, 2284060, 2297010, 2311705, 2327640, 2344781, 2363199, 2382792, 2403902, 2427011, 2451502, 2476209, 2501517, 2529176, 2559617, 2591307, 2623255, 2656083, 2690093, 2724550, 2759705, 2797125, 2836938, 2877084, 2916562, 2957137, 3000456, 3045705, 3091527, 3138052, 3185452, 3232671, 3279242, 3326435, 3375201, 3424989, 3475847, 3529281, 3585630, 3643188, 3701663, 3763901, 3832262, 3905720, 3982464, 4062785, 4147383, 4235421, 4326625, 4422909, 4525668, 4633721, 4745908, 4863040, 4985192, 5110059, 5236490, 5366681, 5502173]
58196E502173J38627J39864J43484J50503J57438J62933J69589J78395J87279
58187F930285J96131K07455K21330K35561K51236K71782K96123L19609L42386
58178I271898L69658M02855M38093M74366N15179N60544O05465O48293O92613
58169A3978964P39268P84994Q30596Q81395R37672R94233J051381J115853J188514
58160B2502870J262652J337698J422678J521925J629880J744782J874430K022710
58152C5319625K184278K359442K560473K795891L063125L365052L719128M142192
58144E9509206M642380N232571N930003O732519P621653Q606136R735665J1051560
58136A19061693J2553700J4239800J6139366J8280872K0694477K3522260K7024181
$$ y = [5502173, 5640800, 5780664, 5924148, 6074651, 6232089, 6395022, 6564611, 6743006, 6930285, 7126416, 7333871, 7555201, 7790762, 8041998, 8313780, 8609903, 8929512, 9271898, 9641556, 10044411, 10482504, 10956870, 11472049, 12032593, 12638058, 13286351, 13978964, 14718232, 15503226, 16333822, 17215217, 18152889, 19147122, 20198503, 21314356, 22502870, 23765522, 25103220, 26525898, 28047823, 29677703, 31422485, 33296915, 35319625, 37503903, 39863345, 42423818, 45219709, 48282834, 51647886, 55367014, 59509206, 64151586, 69384157, 75314160, 82046679, 89668332, 98274468, 108010133, 119061693, 131615393, 145855193, 161994559, 180275431, 200969908, 224492168, 251516349]
58129B51516349L1210644L5290846L7577503L6223930L0350961K0670755R140688
58122D51981676k010527j1158147j7597859k1358897k2864050k2710848k1581423
58115C32699925k0134707j8833165j7833026j7057395j6382935j5764066j5222070
58108B11472561j4774836j4396831j4023926j3581196j3017632j2326623j1532752
58101A17818765j0662500r736982q787875p861813p002198o234248n566922m996292
58093E6969935m504166m066293l669198l313221k998183k715783k458738k227388
58085C1016965k022467j839194j672984j524046j392221j273403j164713j067310
58077A9060627r80912r01363q27038p61951p08889o64542o24599n88731n57294
$$ y = [251516349, 282726993, 318017839, 355595342, 391819272, 422170233, 442840988, 451981676, 449971149, 438813002, 421215143, 399856246, 376992196, 354281348, 332699925, 312565218, 293732053, 275899027, 258841632, 242458697, 226694631, 211472561, 196697725, 182300894, 168276968, 154695772, 141678140, 129351517, 117818765, 107156265, 97419283, 88631408, 80769595, 73767397, 67533149, 61966227, 56969935, 52465769, 48399476, 44730278, 41417057, 38418874, 35703091, 33244353, 31016965, 28994498, 27155304, 25482320, 23958274, 22566053, 21292650, 20127937, 19060627, 18079715, 17178352, 16351314, 15589363, 14880474, 14215932, 13591333, 13002602, 12445308]
58068A2445308n27936m99059m72592m50101m29775m09841l91281l74566l57485
58059H532672l38790l20562l04709k90410k76951k65337k55146k43709k30625
58050F006433k19275k11493k04487j95540j86025j78015j70581j62485j55375
58041D323157j50916j47524j43122j38671j35879j33568j29379j23480j17778
58032C102840j12812j07844j02704r7544r1917q5791q0115p5037o9228o2322n6124
58021B161402n1921m8504m4520m0842l8892l8323l8039l7884l7780l6785l4602
58010A713310l2468l1251l0170k8696k7732k7609k6885k4725k2557k1727k1300
57999A418190j9987j8462j7896j7752j7016j6231j6435j7277j7883j8383j8966
$$ y = [12445308, 11917372, 11418313, 10945721, 10495620, 10065845, 9656004, 9264723, 8890157, 8532672, 8193882, 7873320, 7568611, 7278201, 7001250, 6735913, 6480767, 6237058, 6006433, 5787158, 5575665, 5371178, 5175638, 4989613, 4811598, 4641017, 4478532, 4323157, 4172241, 4024717, 3881595, 3742924, 3607045, 3473477, 3344098, 3220618, 3102840, 2990028, 2882184, 2779480, 2681936, 2590019, 2504228, 2424113, 2349076, 2279848, 2217526, 2161402, 2109481, 2060977, 2016457, 1975615, 1936723, 1898400, 1860361, 1822477, 1784697, 1747912, 1713310, 1680842, 1649591, 1619421, 1590725, 1562993, 1535384, 1508499, 1483774, 1461217, 1439490, 1418190, 1398203, 1379741, 1361845, 1344093, 1327077, 1310846, 1294411, 1277134, 1259251, 1240868, 1221902]
57988A221902j8588j6361j3274j1053j0219j0496j1899j4009j5313j4781j3221
57977A072688j1951j1144j0554j0472j0817j0683j0086j0607j2890j5042j5283
57966I43159j4683j5231j6371j5657j2301q138n422n083o669q634r190q038o772
57953H10970o692p170p160p012p329p313o036m339l649l596k802j466j200k437
57939G42769l801m140l640k820j776p46l42q74k023l140l416k234q2J382J115
57924G16232Q1r4N63N18r39k635l007j950q58j039k289l141k662j577r99o29N07
57907F96082J879J831L02p33j70P10O19K12M55P62K85m81j069k475n305p759p748
57890F77397o052n143n533n616m732l949l742l164j822p30n15k30J147L187M638
$$ y = [1221902, 1203314, 1186953, 1173679, 1162626, 1152407, 1141911, 1130012, 1116003, 1100690, 1085909, 1072688, 1060737, 1049593, 1039039, 1028567, 1017750, 1007067, 996981, 986374, 973484, 958442, 943159, 928476, 913245, 896874, 881217, 868916, 860778, 855356, 850273, 843604, 834970, 825780, 817742, 810970, 804278, 797108, 789948, 782936, 775607, 768294, 762258, 757919, 754270, 750674, 747872, 746406, 745206, 742769, 738968, 734828, 731188, 728368, 726592, 725846, 725504, 724630, 722607, 719467, 716051, 713817, 713735, 715117, 716232, 716313, 716219, 716782, 717300, 716361, 713726, 710719, 708769, 707911, 706872, 704583, 701442, 698780, 697203, 696204, 695575, 696082, 697961, 699792, 700094, 699361, 699191, 699901, 700520, 700732, 701187, 701949, 702234, 701753, 700684, 698209, 692904, 685145, 677397, 671345, 666202, 660669, 655053, 650321, 646372, 642630, 639466, 637644, 636914, 636399, 636169, 637316, 640503, 645141]
57875F45141M913M463M169M629N635O432O693O763O566N220K634M25r7o0j443
57860G02083l933n278m663l785m201n368n992n803n239m458l479k505j538l54
57846F45487P44R54J93n75p01p09j242j873j803j196r77j398j564n99J164K467
57830F38372K506J732J181J306J843K577L511M244M057L046K325K539K796J880
57816F73915l0j690k467k872l567m574n351n210l990k589k308l180l665k687j189
57801F28546p22j251j498r24o5P95J964L395M577N449O386P227P271O295M800
57786F72245L266J958J245J191J065M07L02K159N085O043L398q67l373l003j566
57771F89555j277k541m133m854m603l916k971j643n38r79l403o407q155q267p565
$$ y = [645141, 650054, 654517, 658686, 663315, 668950, 675382, 682075, 688838, 695404, 700624, 703258, 703683, 703586, 703526, 702083, 698150, 692872, 688209, 684424, 680223, 674855, 668863, 663060, 657821, 653363, 649884, 647379, 645841, 645487, 646231, 647185, 647378, 646803, 646102, 645393, 644151, 642278, 640475, 639279, 638302, 636904, 635340, 634741, 635905, 638372, 640878, 642610, 643791, 645097, 646940, 649517, 653028, 657272, 661329, 664375, 666700, 669239, 672035, 673915, 673885, 672195, 669728, 666856, 663289, 658715, 653364, 648154, 644164, 641575, 639267, 636087, 632422, 629735, 628546, 627824, 626573, 625075, 624151, 624086, 624881, 626845, 630240, 634817, 640266, 646652, 653879, 661150, 667445, 672245, 675511, 677469, 678714, 679905, 680970, 681377, 681679, 683838, 688923, 694966, 698364, 697497, 694124, 691121, 689555, 688278, 685737, 681604, 676750, 672147, 668231, 665260, 663617, 663079, 662100, 658697, 652290, 644135, 635868, 628303]
57756F28303o588n395m368l987l941l649l492m408o255p704p989p694p704q183
57742E46946q749q803p715n570l705l524m726n684n403m138k285j39J413J487
57728D89405Q21J072K229K436J112L01J669L757L999K371J254K102M046N668O629
57713E28871P171P204O696O337P012Q518R273P803M596J892J294J976K082J283
57699F02008P84J005P90o19k211k753k651l208m612n666n277l522j377J05N31
57684E73327L58J84j09j018k278k974k859k639k570j989p53L6l28q48l09P40Q03
57667E56774j84o82K78J884K730K486K030K311L287L898L284J968J298J662K033
57652E85057J576Q23N89O31J73q59k037l268m472n046m569l688l288l247l012
$$ y = [628303, 621715, 616320, 611952, 607965, 604024, 600375, 596883, 592475, 586220, 578516, 570527, 562833, 555129, 546946, 538197, 529394, 521679, 516109, 512404, 508880, 504154, 498470, 493067, 488929, 486644, 486505, 487918, 489405, 490226, 491298, 493527, 495963, 497075, 497376, 499045, 502802, 506801, 509172, 510426, 512528, 516574, 522242, 528871, 536042, 543246, 549942, 556279, 563291, 571809, 581082, 588885, 593481, 595373, 596667, 598643, 600725, 602008, 602792, 603797, 604587, 603968, 601757, 599004, 596353, 593145, 588533, 582867, 577590, 574068, 572691, 572796, 573327, 573685, 573869, 573760, 572742, 570464, 567490, 564631, 561992, 559422, 557433, 556680, 556716, 556388, 555540, 555231, 555971, 556774, 556590, 555908, 556186, 558070, 560800, 563286, 565316, 567627, 570914, 574812, 578096, 580064, 581362, 583024, 585057, 586633, 587456, 588045, 588676, 588849, 587990, 585953, 582685, 578213, 573167, 568598, 564910, 561622, 558375, 555363]
57637E55363k904l495m100l433j899j607l552o033o662n070k856j536j290j387
57623E09539j114k82P81J727K718M204O164P995R382J0930J3578J7514K2000K6284
57609F31420L0538L5548M1294M5849M6173M0205K8265J2634l511j6842k4890k7530
57597H39153k7168k6539k6408k5972k4912k3907k3205k2049j9931j7480j5551
57586E86031j4104j2678j1406j0848j0991j1046j0246q600o807n650n403n618
57574D72634n428m266k398q49n68j499k574k778k178j622j583j863k370l336m464
57559D34858m742l676k173j454j559j681j516j451j677j950k159k298k085j292
57545D05145m15k24p58j424j948k397k439j686p56q35j908k517j847r73j360k817
$$ y = [555363, 552459, 548964, 544864, 541431, 539532, 537925, 534373, 528340, 521678, 516608, 513752, 512216, 510926, 509539, 508425, 508143, 508924, 510651, 513369, 517573, 523737, 531732, 541114, 552044, 565622, 583136, 605136, 631420, 661958, 697506, 738800, 784649, 830822, 871027, 899292, 911926, 908415, 891573, 866683, 839153, 811985, 785446, 759038, 733066, 708154, 684247, 661042, 638993, 619062, 601582, 586031, 571927, 559249, 547843, 536995, 526004, 514958, 504712, 496112, 489305, 483655, 478252, 472634, 467206, 462940, 460542, 459693, 459125, 457626, 455052, 452274, 450096, 448474, 446891, 445028, 442658, 439322, 434858, 430116, 426440, 424267, 422813, 421254, 419573, 418057, 416606, 414929, 412979, 410820, 408522, 406437, 405145, 404730, 404506, 403748, 402324, 400376, 397979, 395540, 393854, 393098, 392263, 390355, 387838, 385991, 385018, 383658, 380841]
57529C80841l794l367k143j395j777k867l580l163j900p75m26o80j093j546k179
57514C50156l144m447n696o017m790k610r58p36j512k334k683k495j858j122q08
57499C08946j065j407j286o79Q7P21J054J061R67J099J444J637J480J169J008
57484C16236J080J145P26l72j346q19J406L593M035L186K676K771K362J360J010
57469C39049J593J673M81p52r51j051k206l487l203j705j028j959l048k631o71
57454C20104J509K519J934P09M37J592K938L291L139L477L779K641L00j159m22
57439C46788J421K466K233J681J599J730J348K08j188k180k615k700k403j470
57425C46918j62P51Q55L82n43j989l269l116j602o53j555l000k893j279QK1n73
$$ y = [380841, 377047, 373680, 371537, 370142, 368365, 365498, 361918, 358755, 356855, 356080, 355654, 354974, 353881, 352335, 350156, 347012, 342565, 336869, 330852, 326062, 323452, 322494, 321758, 320246, 317912, 315229, 312734, 310876, 309754, 308946, 307881, 306474, 305188, 304509, 304596, 305317, 306371, 307432, 308399, 309498, 310942, 312579, 314059, 315228, 316236, 317316, 318461, 319187, 318815, 317469, 316650, 318056, 321649, 325684, 328870, 331546, 334317, 336679, 338039, 339049, 340642, 342315, 342796, 342044, 341093, 340042, 337836, 334349, 331146, 329441, 328413, 326454, 323406, 320775, 320104, 321613, 324132, 326066, 326775, 327212, 328804, 331742, 335033, 338172, 341649, 345428, 348069, 348369, 347210, 346788, 348209, 350675, 352908, 354589, 356188, 357918, 359266, 359474, 358286, 356106, 353491, 350791, 348388, 346918, 346756, 347507, 348362, 348744, 348201, 346212, 342943, 339827, 338225, 337572, 336017, 333017, 330124, 328845, 328853, 328874, 328301]
57408C28301r90j052o60R8N03J93K92K052M636N890N146L622K319J326J182K678
57392C55536M887N527M024K337J951J974J287O85J360K738L423L234K874K498
57378C94335K023K042L007M130M334L741L093K371J246L41O91K093L238L346K772
57363D32803K144J801J936K516L111L411L609L816L599K682J595R57O94O03R01
57348D66178J432J224Qo36R48M030O210O303N082L474J639j1n34K13J144J437
57332D98141J589K443L958N406O155N969N133M610N350P146Q695R068Q522P764
57318E79949P149O826O905O977O207M539L298L905O126Q127Q290O677M826M246
57304F64047N078O053N925M787L781L628M041M622N535O876P971P995P070O067
$$ y = [328301, 327311, 326259, 325599, 325697, 326200, 326393, 326685, 328737, 333373, 339263, 344409, 348031, 350350, 351676, 352858, 355536, 360423, 365950, 369974, 372311, 374262, 376236, 377523, 378208, 379568, 382306, 385729, 388963, 391837, 394335, 396358, 398400, 401407, 405537, 409871, 413612, 416705, 419076, 420322, 420663, 421354, 423447, 426685, 430031, 432803, 434947, 436748, 438684, 441200, 444311, 447722, 451331, 455147, 458746, 461428, 463023, 463980, 464674, 465277, 466178, 467610, 468834, 468842, 468206, 469154, 473184, 479394, 485697, 490779, 494253, 495892, 495881, 495347, 495560, 496704, 498141, 499730, 502173, 506131, 511537, 517692, 523661, 528794, 533404, 538754, 545900, 554595, 563663, 572185, 579949, 587098, 593924, 600829, 607806, 614013, 618552, 621850, 625755, 631881, 640008, 648298, 654975, 659801, 664047, 669125, 675178, 681103, 685890, 689671, 693299, 697340, 701962, 707497, 714373, 722344, 730339, 737409, 743476]
57290G43476N522N422N983P657R973J1216J0206P980O785P510R077J0376J1540
57277H52723J2859J3693J3438J2642J1981J0887Q597O073N219O276P669Q504R516
57264I80077J0985J1577J0338Q504Q034R188J0597J1082J0414Q965P669P696R243
57251A104369J0948J1405J0867J0719J1671J3233J4535J4995J4434J3188J1943
57240A242307J1083J0573J0610J1604J3230J4444J4871J5196J5737J5833J5311
57229A390799J5028J5157J4431J2452J1178J2317J4450J4915J3640J2839J3268
57218A540474J3149J1122Q338O938P847J0618J4319J8052K1196K3605K5437K7003
57206A728098K8943L1665L4222L4856L3416L1991L2019L2239L0952K8881K7847
$$ y = [743476, 748998, 754420, 760403, 768060, 778033, 789249, 799455, 807435, 814220, 821730, 830807, 841183, 852723, 865582, 879275, 892713, 905355, 917336, 928223, 936820, 942893, 948112, 954388, 962057, 970561, 980077, 991062, 1002639, 1012977, 1021481, 1029515, 1038703, 1049300, 1060382, 1070796, 1079761, 1087430, 1095126, 1104369, 1115317, 1126722, 1137589, 1148308, 1159979, 1173212, 1187747, 1202742, 1217176, 1230364, 1242307, 1253390, 1263963, 1274573, 1286177, 1299407, 1313851, 1328722, 1343918, 1359655, 1375488, 1390799, 1405827, 1420984, 1435415, 1447867, 1459045, 1471362, 1485812, 1500727, 1514367, 1527206, 1540474, 1553623, 1564745, 1573083, 1580021, 1587868, 1598486, 1612805, 1630857, 1652053, 1675658, 1701095, 1728098, 1757041, 1788706, 1822928, 1857784, 1891200, 1923191, 1955210, 1987449, 2018401, 2047282, 2075129]
57195B075129K7882K7892K8055K9058K9697K8045K4721K2300K1598K1174K0537
57184B356088K1017K2899K4452K4601K4416K5091K6472K8275L0718L3219L4440
57173B651688L4328L4244L4534L4001L2313L0642K9195K6552K2499J9094J7547
57162B966637J6313J3895J1525J1184J2660J4456J6305J8957K2552K6695L1403
57151C162582L6616M1674M6274N0976N5868N9898O2477O4559O7103O9731P1914
57140C789672P4166P6822P8915P9535P9414Q0038Q1967Q4655Q6740Q5842P9670
57129D677436O8648N6386M6490L9695L4692L0266K5850K1318J7199J3995J0782
57118E042757O015R0m732p669j0461j4139j7167j8313j9129k1663k5543k9251
$$ y = [2075129, 2103011, 2130903, 2158958, 2188016, 2217713, 2245758, 2270479, 2292779, 2314377, 2335551, 2356088, 2377105, 2400004, 2424456, 2449057, 2473473, 2498564, 2525036, 2553311, 2584029, 2617248, 2651688, 2686016, 2720260, 2754794, 2788795, 2821108, 2851750, 2880945, 2907497, 2929996, 2949090, 2966637, 2982950, 2996845, 3008370, 3019554, 3032214, 3046670, 3062975, 3081932, 3104484, 3131179, 3162582, 3199198, 3240872, 3287146, 3338122, 3393990, 3453888, 3516365, 3580924, 3648027, 3717758, 3789672, 3863838, 3940660, 4019575, 4099110, 4178524, 4258562, 4340529, 4425184, 4511924, 4597766, 4677436, 4746084, 4802470, 4848960, 4888655, 4923347, 4953613, 4979463, 5000781, 5017980, 5031975, 5042757, 5048772, 5048862, 5044130, 5036461, 5026000, 5011861, 4994694, 4976381, 4957252, 4935589, 4910046, 4880795]
57106D880795l2757l6975m1914m7237n3514o1257o9529p6896q2814q7187q9765
57095D200950r0997r2052r3118r3218r2306r1558r0864q8453q4182q0581p9133
57084C224488p8080p5693p3274p2986p5010p8834q4986r3411j02219j10100j17734
57073B262161j25163j30388j32733j34857j39185j44903j50950j59203j72094
57064I72685j89670k11540k39065E9607b50780l49671l91612m38185m90272n49645
57054b470165o19251o99015p85308q77208r79200j095088j224188j366269j524653
57045a1640345j701053j893936k106279k348174k627502k948015l326779l808268
57037c2400351m450220n292114o333438p532709q830003j0191854j1642561j3227122
$$ y = [4880795, 4848038, 4811063, 4769149, 4721912, 4668398, 4607141, 4537612, 4460716, 4377902, 4290715, 4200950, 4109953, 4017901, 3924783, 3831565, 3739259, 3647701, 3556837, 3468384, 3384202, 3303621, 3224488, 3146408, 3070715, 2997441, 2924455, 2849445, 2770611, 2685625, 2592214, 2489995, 2379895, 2262161, 2136998, 2006610, 1873877, 1739020, 1599835, 1454932, 1303982, 1144779, 972685, 783015, 571475, 332410, 59607, -250780, -600451, -992063, -1430248, -1920520, -2470165, -3089416, -3788431, -4573739, -5450947, -6430147, -7525235, -8749423, -10115692, -11640345, -13341398, -15235334, -17341613, -19689787, -22317289, -25265304, -28592083, -32400351, -36850571, -42142685, -48476123, -56008832, -64838835, -75030689, -86673250, -99900372]
57029i9900372j4923354j6610875j8153789j9498430k0659443k1624808k2311273
57022b33682344k2592107k2301759k1208087j9070405j5807603j1603439o810627
57015c53076371j762973L301753Q190537J2715300J6714125K0046895K2538290
57008b71332444K3972907K4204002K3275711K1430043J9006787J6340325J3709915
57001a29392754J1323441R311687P737329O617267N939721N664312N710798N951951
56993g1136248O228909O396128O371525O150755N776770N300916M768330M220057
56985b5922858L690382L200669K761505K378674K052586J775973J539205J337219
56977g186645J167894J026687R07646Q07618P25075O56339N96559N43026b61059
$$ y = [-99900372, -114823726, -131434601, -149588390, -169086820, -189746263, -211371071, -233682344, -256274451, -278576210, -299784297, -318854702, -334662305, -346265744, -353076371, -354839344, -351537591, -343347054, -330631754, -313917629, -293870734, -271332444, -247359537, -223155535, -199879824, -178449781, -159442994, -143102669, -129392754, -118069313, -108757626, -101020297, -94403030, -88463309, -82798997, -77088199, -71136248, -64907339, -58511211, -52139686, -45988931, -40212161, -34911245, -30142915, -25922858, -22232476, -19031807, -16270302, -13891628, -11839042, -10063069, -8523864, -7186645, -6018751, -4992064, -4084418, -3276800, -2551725, -1895386, -1298827, -755801, -261059]
56967A89655M11237L78440L53032L32735L16195L04987K98579K90522K73688K47277
56957C396347K15517J81932J48321J16902Q9330O4858M2629K4404J2140M509j371
56946D295518o547j1304j7579k7002l8182m8905n9573p1538q3766r4328j03800
56935C732994j14261j26269j39507j54484j70541j84190j93040j99491k06453
56926B244758k11050k07336j94638j78478j63221j48436j33069j18627j06384
56917G83519r5055q3382p2518o4045n7597n2003m7053m2799l8561l3922k9497
56906A67087k5637k1483j6335j1020o908l966o67M167R764J3649J3705J0115N047
56893A37518M00l368o173p482p270o516n719m101j297J396K837L842N670P806
$$ y = [189655, 600892, 979332, 1332364, 1665099, 1981294, 2286281, 2584860, 2875382, 3149070, 3396347, 3611864, 3793796, 3942117, 4059019, 4148349, 4213207, 4255836, 4280240, 4292380, 4296889, 4295518, 4288971, 4277667, 4260088, 4233086, 4194904, 4145999, 4086426, 4014888, 3931122, 3836794, 3732994, 3618733, 3492464, 3352957, 3198473, 3027932, 2843742, 2650702, 2451211, 2244758, 2033708, 1826372, 1631734, 1453256, 1290035, 1141599, 1008530, 889903, 783519, 688464, 605082, 532564, 468519, 410922, 358919, 311866, 269067, 230506, 196584, 167087, 141450, 119967, 103632, 92612, 85704, 81738, 81071, 85238, 95002, 108651, 122356, 132471, 137518, 137918, 134550, 128377, 120895, 113625, 107109, 101390, 97289, 95992, 97388, 100225, 104067, 109737, 117543]
56879A17543R046R822J1552J4281J6832J8834K0746K2202K1970J9356J4342P001
56867C03527j740r343j3540j4677j4807j5075j5608j6987j9563k1642k0759j7003
56855A22783j3130j1196j0835j0890j0787r969p947n510m282m505m656l770k638
56842B2668k114j632k53J862L815N088N751O152O621P023O646N227L954M539P201
56827H2548J0375J2239J1896R392N721K610J164P64J03r90j793k244k786k939
56813A26060j591J199M154O672R444J2874J6192J8605K0323K2138K4766K8666
56801B89502L3469L7422L8351L5381K9194K0913J1810L647k154n845q683j0922
56789D72085j1646j0526q317n572k189J545M936Q119J2036J6770K1334K5464L0404
$$ y = [117543, 126589, 136411, 147963, 162244, 179076, 197910, 218656, 240858, 262828, 282184, 296526, 303527, 301787, 292444, 278904, 264227, 249420, 234345, 218737, 201750, 182187, 160545, 139786, 122783, 109653, 98457, 87622, 76732, 65945, 55976, 48029, 42519, 38237, 33732, 29076, 25306, 22668, 20554, 18922, 18669, 20531, 24346, 29434, 35185, 41337, 47958, 54981, 61627, 66854, 70808, 75347, 82548, 92923, 105162, 117058, 126450, 132171, 134781, 135945, 136709, 136812, 135822, 134029, 131785, 128999, 126060, 124469, 125668, 129822, 136494, 145938, 158812, 175004, 193609, 213932, 236070, 260836, 289502, 322971, 360393, 398744, 434125, 463319, 484232, 496042, 499689, 497535, 491690, 483007, 472085, 460439, 449913, 441596, 436024, 433835, 435380, 440316, 448435, 460471, 477241, 498575, 524039, 554443]
56776E54443L7238M5377N2899N7149N4887M3821K5327M725j2360k3663l0107l3163
56764G76573l3393l1136k7416k3754k1051j8733j5380j0586n683k057O98L924
56752E92006P913J2168J7110K3669L0769L4850L2656K3707J0097m906j7894k6621
56740G35524l1101l2709l2103k9144k4770k1067j8860j6834j3876j0843r012q033
56728D87172o612m257j249K319O361J0145J2657J3271J1588P353J286m812r546
56715E25676j3111j6411j9505k1587k1981k0633j8014j5145j3225j2729j3009
56704C40326j3073j2490j1528j0830j0997j1906j2522j2084j1159j0719j0449
56693B12569r307p615p018p937q670p709n620l837k715j719n98M97J354J588R68
$$ y = [554443, 591681, 637058, 689957, 747106, 801993, 845814, 871141, 875866, 863506, 839843, 809736, 776573, 743180, 712044, 684628, 660874, 639823, 621090, 605710, 595124, 589441, 587384, 588082, 592006, 599919, 612087, 629197, 652866, 683635, 718485, 751141, 774848, 784945, 780039, 762145, 735524, 704423, 671714, 639611, 610467, 585697, 564630, 545770, 528936, 515060, 504217, 495205, 487172, 480560, 476303, 475054, 477373, 483734, 493879, 506536, 519807, 531395, 538748, 540034, 535222, 525676, 512565, 496154, 476649, 455062, 433081, 412448, 394434, 379289, 366064, 353335, 340326, 327253, 314763, 303235, 292405, 281408, 269502, 256980, 244896, 233737, 223018, 212569, 203262, 195647, 188629, 180692, 172022, 164313, 158693, 154856, 152141, 150422, 149824, 150321, 151675, 153263, 154231]
56678A54231K40N75J716J948N88q67r16j27J58L8N56J769K700K720J862K47j696
56661A65742k862k364o30J161K368K913K618J419k4p55m25O31J888K833L205L364
56645A81082L796M042L044R20p75j155j050j199q02Q03K346K090K61j558k718
56630A89127l531l606k069O32K801L566L535L311K728J855J436J761K047J590
56616B05183P46L13M24O26P23R70J461J692J088Jl66N54J734J843J159J087J933
56599B21171K616K624K616K622J607l12j168j0J279Q38k70j01N76m43k758l568
56583B27319j989l69o08j574j281K18J395J420N87n71j582j991j678r82j96N53
56567B18671R32O07q8l57Q2Q56J679K403K464J337l84j327r91k07J17j58q69j848
$$ y = [154231, 154471, 155046, 156762, 158710, 159298, 158431, 157515, 157388, 157546, 157584, 158140, 159909, 162609, 165329, 167191, 167438, 165742, 162880, 160516, 159886, 161047, 163415, 166328, 168946, 170365, 170341, 169586, 169161, 169792, 171680, 174513, 177718, 181082, 184878, 188920, 191964, 192884, 192109, 190954, 189904, 188705, 187903, 188706, 191052, 193142, 193403, 191845, 189127, 185596, 181990, 179921, 180553, 183354, 186920, 190455, 193766, 196494, 198349, 199785, 201546, 203593, 205183, 205929, 206242, 206666, 207292, 208015, 208985, 210446, 212138, 213226, 213227, 212861, 213415, 215149, 216992, 218151, 219238, 221171, 223787, 226411, 229027, 231649, 233256, 232944, 231776, 231766, 233045, 233883, 233613, 233512, 234088, 233645, 230887, 227319, 225330, 224961, 224353, 222779, 221498, 221716, 223111, 224531, 225118, 224547, 222965, 220974, 219296, 218314, 218118, 218671, 219603, 220210, 220122, 219765, 219847, 220703, 222382, 224785, 227249, 228586, 228202, 226875, 225884, 225677, 225794, 225636, 224767, 222919]
56549B22919k513k138q35N00J368J971K384K379K165K190K082R22j023k181j698
56534B28492n70j12l97p95r87p10M76K282L354K862J666J096J192J203J164J721
56518B41937K702L121K736K454K992L970M702N133N445N305M307K980K664M092
56504B94540O436Q154Q619Q642R394J1105J2873J3511J2448J0132P686O013N067
56491D14620M185L008J786P64j83j069j604j642j393r58k27N74R01O47Q9j049
56475D18449l318n925o769n142l079k790l787m099l347k775k792k549j754j118
56461C69205q88o59p45k010l955m778l954l229m092n550n487l345o32Q28M69q37
56445C30341j786k033k356l117l337k311j345k126l779l752j684p2m36j230p81
$$ y = [222919, 220406, 218268, 217433, 217933, 219301, 221272, 223656, 226035, 228200, 230390, 232472, 233394, 232371, 230190, 228492, 227922, 227810, 227413, 226618, 225631, 224921, 225397, 227679, 231033, 233895, 235561, 236657, 237849, 239052, 240216, 241937, 244639, 247760, 250496, 252950, 255942, 259912, 264614, 269747, 275192, 280497, 284804, 287784, 290448, 294540, 300976, 309130, 317749, 326391, 335785, 346890, 359763, 373274, 385722, 395854, 403540, 409553, 414620, 418805, 421813, 423599, 424363, 424180, 423111, 421507, 419865, 418472, 417514, 417287, 417861, 418762, 419409, 419498, 418449, 415131, 409206, 402437, 397295, 394216, 391426, 387639, 383540, 380193, 377418, 374626, 372077, 370323, 369205, 368317, 367658, 366913, 364903, 360948, 356170, 352216, 348987, 344895, 339345, 333858, 330513, 329881, 330709, 331178, 330341, 328555, 326522, 324166, 321049, 317712, 315401, 314056, 311930, 308151, 304399, 302715, 302643, 302207, 300977, 300196]
56430C00196k2m44j142k58J704K472J425K53J63M89M01K35L08Rq88j097N35K791
56412C07130L006M19k590l286j638K21Q98P96O14M11M44J292K523K665J481P07
56396C15093J384K014J047l28p8J268J672J131J227J661N58j619j920M86K772
56381C26368K766J858K041K825L079L378M211L983J446j484j957o3J771K221J608
56366C54051K16j563k215p27J226J084j007k556k275j062K86J977L693M387L990
56351C59505L516L228K405J141M79M88l0j371k208j633m03N51J394K428L141L103
56335C75734K799K823L028L104L088K841J969P71L74J179K135K294K290L318N053
56320D12800N665L996J097p02j10J903L207K759J442N73K60k72j134j482o88Q07
$$ y = [300196, 300174, 299730, 298588, 298330, 300034, 302506, 303931, 304184, 304347, 304836, 305237, 305472, 305780, 305789, 304901, 303804, 304339, 307130, 310136, 310555, 307965, 304679, 303041, 303262, 304160, 304956, 305570, 305981, 306425, 307717, 310240, 312905, 314386, 315093, 316477, 318491, 319538, 319210, 319132, 320400, 322072, 323203, 324430, 326091, 326649, 325030, 323110, 323596, 326368, 329134, 330992, 333033, 335858, 338937, 342315, 346526, 350509, 351955, 350471, 348514, 348451, 350222, 352443, 354051, 354267, 352704, 350489, 349762, 350988, 352072, 351065, 348509, 346234, 345172, 345458, 347435, 351128, 355515, 359505, 363021, 366249, 368654, 369795, 370274, 370762, 370732, 369361, 367153, 365520, 365117, 365668, 367062, 369490, 372631, 375734, 378533, 381356, 384384, 387488, 390576, 393417, 395386, 396157, 396531, 397710, 399845, 402139, 404429, 407747, 412800, 418465, 422461, 423558, 422856, 422746, 424649, 427856, 430615, 432057, 432630, 432890, 432618, 431484, 430002, 429314, 430121]
56304D30121J901J756M91p27o13P42J746J193k26r30m74L53Q99J162J140Q06N99
56287D39939J042J846K217J954J567J457J677K287L161L743L768L825M363M623
56273D77469L700K279J945K978M144M593M641M618M265L556K970K653K291J978
56259E24080K273L192M083M618M969N017M358L186K100J199M52O95K714N331O177
56244E74444M856L666M453O283P267P265P447Q139Q602Q563Q733R717J1148J2034
56230F82617J1737J0697J0123J0665J1512J1428J0550J0222J1103J2435J3409
56219H06498J4186J5063J5753J6153J7003J8906K1262K2940K3758K4605K6187
56208A022314K8147K9640L0583L2096L5260L9579M3343M5855M8328N1916N5990
$$ y = [430121, 432022, 433778, 434269, 433542, 432929, 433671, 435417, 436610, 436384, 435454, 434980, 435333, 436232, 437394, 438534, 439340, 439939, 440981, 442827, 445044, 446998, 448565, 450022, 451699, 453986, 457147, 460890, 464658, 468483, 472846, 477469, 481169, 483448, 485393, 488371, 492515, 497108, 501749, 506367, 510632, 514188, 517158, 519811, 522102, 524080, 526353, 529545, 533628, 538246, 543215, 548232, 552590, 555776, 557876, 559075, 559527, 560222, 562936, 568267, 574444, 579300, 582966, 587419, 593702, 600969, 608234, 615681, 623820, 632422, 640985, 649718, 659435, 670583, 682617, 694354, 705051, 715174, 725839, 737351, 748779, 759329, 769551, 780654, 793089, 806498, 820684, 835747, 851500, 867653, 884656, 903562, 924824, 947764, 971522, 996127, 1022314, 1050461, 1080101, 1110684, 1142780, 1178040, 1217619, 1260962, 1306817, 1355145, 1407061, 1463051]
56197A463051N9658O3948P0671P9457Q7936R4958J01856J10202J19948J30184
56187B381869J40134J48808J55303J60198J65202J70483J73618J72268J66884
56178C834767J59683J51631J41390J26872J07289Q4051N9919L6788J4355q433
56168D708312l0978n1412o9124q5120r9653j11370j19638j25926j31711j36426
56158C746954j38699j38586j37344j35774j33901j31519j28243j23666j18153
56149B561069j12715j07547j01745r5113q8996q4332q0071p4777o8834o3710n9667
56138A623562n5644n1089m6731m3407m0914l8147l4130k9077k4494k1806k0862
56127A217261k0383j9725j9163j8552j7074j4577j1920r620p444n610m881m925
$$ y = [1463051, 1522709, 1586657, 1657328, 1736785, 1824721, 1919679, 2021535, 2131737, 2251685, 2381869, 2522003, 2670811, 2826114, 2986312, 3151514, 3321997, 3495615, 3667883, 3834767, 3994450, 4146081, 4287471, 4414343, 4521632, 4605683, 4665602, 4702390, 4716745, 4708312, 4677334, 4625922, 4556798, 4471678, 4372025, 4260655, 4141017, 4015091, 3883380, 3746954, 3608255, 3469669, 3332325, 3196551, 3062650, 2931131, 2802888, 2679222, 2561069, 2448354, 2340807, 2239062, 2143949, 2054953, 1970621, 1890550, 1815773, 1746939, 1683229, 1623562, 1567918, 1516829, 1470098, 1426691, 1385777, 1347630, 1313500, 1284423, 1259929, 1238123, 1217261, 1196878, 1177153, 1157990, 1139438, 1122364, 1107787, 1095867, 1086247, 1078803, 1073193, 1068312, 1063387]
56115A063387m224k302n64o2PO42J392J581J724K533L685M706N965P662R051R705
56099A104888J0335J1345J2010J2242J3615J7084K1066K3523K4779K6494K8926
56088A306307L1116L3075L5944M0296M5795N2239N9574O7181P4231Q0574Q6520
56077A912852R2261R8018J03839J08529J09863J06682R9909R1169Q1841P3903
56067B878866O9467O8174O6902O3397N8305N2298M3757L1653J8668Q601J819m194
56055C357713j1119j9193k9229m2224n7165p1422q3142r1653r6373r7394r6246
56044B662553r4123r0159q3453p5590o8826o2872n6131m9185m4107m0842l7261
56033A960004l2678k8625k5896k3353j9978j6125j2474r473p728p269o647m307
$$ y = [1063387, 1059163, 1056861, 1056297, 1056235, 1056242, 1056884, 1058276, 1059857, 1061581, 1064114, 1067799, 1072505, 1078470, 1086132, 1095183, 1104888, 1115223, 1126568, 1138578, 1150820, 1164435, 1181519, 1202585, 1226108, 1250887, 1277381, 1306307, 1337423, 1370498, 1406442, 1446738, 1492533, 1544772, 1604346, 1671527, 1745758, 1826332, 1912852, 2005113, 2103131, 2206970, 2315499, 2425362, 2532044, 2631953, 2723122, 2804963, 2878866, 2948333, 3016507, 3083409, 3146806, 3205111, 3257409, 3301166, 3332819, 3351487, 3360088, 3361907, 3357713, 3346594, 3327401, 3298172, 3255948, 3198783, 3127361, 3044219, 2952566, 2856193, 2758799, 2662553, 2568430, 2478271, 2394818, 2319228, 2250402, 2187530, 2131399, 2082214, 2038107, 1997265, 1960004, 1927326, 1898701, 1872805, 1849452, 1829474, 1813349, 1800875, 1791402, 1783674, 1776405, 1769758, 1765451]
56021A765451m95L541P321J0538J2084J1816J1939J4095J6438J6340J4827J5173
56009A899068J7999K1110K3504K5886K7706K7415K5817K5552K6903K7473K6571
55998B175004K6510K8757L1785L3781L4794L5310L5152L4681L4998L6330L7941
55987B545043L9650M1480M2188M0662L8496L8571M1316M4864M8190N1209N2623
55976C024292N1332M9680N1441N6634O2021O6558P2145P8752Q3343Q4779Q5734
55965C766711Q8417R1916R4981R7918J00658J02261J03542J06951J12971J19569
55955D785895J25758J32372J39078J44427J49337J56572J66290J76078J85816
55946F161623J98028K12787K27108K40383K55742K74904K96355L19785L47353
$$ y = [1765451, 1764956, 1768497, 1775818, 1786356, 1798440, 1810256, 1822195, 1836290, 1852728, 1869068, 1883895, 1899068, 1917067, 1938177, 1961681, 1987567, 2015273, 2042688, 2068505, 2094057, 2120960, 2148433, 2175004, 2201514, 2230271, 2262056, 2295837, 2330631, 2365941, 2401093, 2435774, 2470772, 2507102, 2545043, 2584693, 2626173, 2668361, 2709023, 2747519, 2786090, 2827406, 2872270, 2920460, 2971669, 3024292, 3075624, 3125304, 3176745, 3233379, 3295400, 3361958, 3434103, 3512855, 3596198, 3680977, 3766711, 3855128, 3947044, 4042025, 4139943, 4240601, 4342862, 4446404, 4553355, 4666326, 4785895, 4911653, 5044025, 5183103, 5327530, 5476867, 5633439, 5799729, 5975807, 6161623, 6359651, 6572438, 6799546, 7039929, 7295671, 7570575, 7866930, 8186715, 8534068]
55937H534068L79195M12448M46126M82150N20426N58114N94924O33598O73914
55928A3234963P12227P48554P87959Q33144Q81786R32757R88238J048016J109260
55919B1276904J174123J249784J338365J435037J538848J656397J791313J939926
55911C3400697K101846K285195K496380K735136L005777L323641L704873M160236
55903E7213781M703058N348554O098538O943992P892411Q972515J0197143J1544186
55895A18914178J2999827J4607947J6461253J8674088K1388844K4724065K8531083
55888B56301285L2069164L3969786L2736077K7552925J8845826Q173181k474191
55881D07174053j1489637j8093618k2256842k4343712k4817434k4134821k2724635
$$ y = [8534068, 8913263, 9325711, 9771837, 10253987, 10774413, 11332527, 11927451, 12561049, 13234963, 13947190, 14695744, 15483703, 16316847, 17198633, 18131390, 19119628, 20167644, 21276904, 22451027, 23700811, 25039176, 26474213, 28013061, 29669458, 31460771, 33400697, 35502543, 37787738, 40284118, 43019254, 46025031, 49348672, 53053545, 57213781, 61916839, 67265393, 73363931, 80307923, 88200334, 97172849, 107369992, 118914178, 131914005, 146521952, 162983205, 181657293, 203046137, 227770202, 256301285, 288370449, 322340235, 355076312, 382629237, 401475063, 409648244, 407174053, 395684416, 377590798, 355333956, 330990244, 306172810, 282037989, 259313354]
55874B59313354k0940843j9020190j7106785j5310644j3726143j2410284j1373294
55867A49425171j0591831j0015580r568873r173267q779421q369576p932504p451580
55859G7542539o918594o344418n750978n161388m598516m081083l615732l199255
55851C7872575k830177k511386k241333k011408j813932j645422j500778j372229
55843B1945910j256245j154710j067163r88257r14488q46994p85838p28017o73227
55834A3530971o25377n85552n49060n12209m76971m46148m18690l92689l68990
55825I155285l48834l31188l14590k98767k82856k65132k46037k28567k14620
55816F624694k03807j96287j93097j92982j92781j91930j92752j95237j95569
$$ y = [259313354, 238372511, 219352321, 202245536, 186934892, 173208749, 160798465, 149425171, 138833340, 128817760, 119248887, 110075620, 101296199, 92926623, 84994119, 77542539, 70623945, 64279527, 58528549, 53367161, 48768645, 44687562, 41071830, 37872575, 35042398, 32531012, 30289679, 28278271, 26464339, 24818917, 23318139, 21945910, 20689665, 19534955, 18467792, 17479535, 16565047, 15718053, 14932215, 14204198, 13530971, 12905594, 12320042, 11770982, 11258773, 10781802, 10335654, 9916964, 9524275, 9155285, 8806451, 8475263, 8160673, 7861906, 7579050, 7313918, 7067881, 6839314, 6624694, 6420887, 6224600, 6031503, 5838521, 5645740, 5453810, 5261058, 5065821, 4870252]
55807D870252j91348j84522j77538j70150j61863j54171j48368j43771j39711
55798C398810j36743j34689j32101j28695j25669j22915j18872j13766j09621
55789B275739j06174j00408r1541q2806p6596p1233o4566n7647n2481m8677m4620
55778A478990l9993l5343l1002k7744k6596k6777k6001k3794k2201k2297k2634
55767A174608k2158k1918k2527k2714k1854k1266k1481k0831j8407j5899j4805
55756I50748j4314j3555j3386j4191j4407j3189j2070j2093j1651r311o465m982
55744H11134m355l331k282j775q32J051K242J649J149K760N123N573M194K971
55730H25271K098J21k958n467o725p609q671r586j0282j0921j1018j0091q837
$$ y = [4870252, 4678904, 4494382, 4316844, 4146694, 3984831, 3830660, 3682292, 3538521, 3398810, 3262067, 3127378, 2995277, 2866582, 2740913, 2617998, 2499126, 2385360, 2275739, 2169565, 2069157, 1977616, 1894810, 1818214, 1746981, 1682415, 1624768, 1572287, 1523610, 1478990, 1438997, 1403654, 1372652, 1344908, 1318312, 1291535, 1265534, 1241740, 1219539, 1197242, 1174608, 1152450, 1130532, 1108005, 1085291, 1063437, 1042171, 1020690, 999859, 981452, 965553, 950748, 936434, 922879, 909493, 895302, 880895, 867706, 855636, 843543, 831892, 822581, 816116, 811134, 806779, 803448, 801166, 799391, 798559, 799610, 801852, 803501, 804650, 807410, 812533, 818106, 822300, 825271, 827369, 827490, 824532, 819065, 812340, 804731, 796060, 786474, 776192, 765271, 754253, 744162, 735325]
55717G35325q339q467q277p447o122m012r03K427M832N881N596L924J152k012
55703G13558n418r366j3014j4504j3642j2708j3385j4556j4597j4082j4496j5638
55691E58152j6260j6075j5293j3307r887o759n947p057p864p128n332l268j406
55678D42569j95K72M35K50j044l280m833n024n480p501r542r400p623o497o482
55663C76625o066m617l067j971j009l37o81j888k910l093k352m35K479M897N278
55648C60853L972K651K170K218K410K200M31l272p148r037q976q371p331n145
55634C27625k890k846m917o095m406j412J34m21j794k805l050k427j106L29J374
55619B95293J989K244J974J132J07n28n04j83l73j492k711k617j088K43Qj190
$$ y = [735325, 726986, 718519, 710242, 702795, 696673, 692661, 691758, 694185, 699017, 704898, 710494, 714418, 715570, 713558, 708140, 698774, 685760, 671256, 657614, 644906, 631521, 616965, 602368, 588286, 573790, 558152, 541892, 525817, 510524, 497217, 487330, 480571, 474624, 467567, 459703, 452575, 447243, 443975, 442569, 442374, 442646, 443081, 443331, 442287, 439007, 434174, 429150, 423670, 416169, 406627, 397227, 389604, 383107, 376625, 370559, 365942, 362875, 360904, 359895, 359558, 358877, 356989, 354079, 350986, 348634, 348199, 350678, 355575, 360853, 364825, 367476, 369646, 371864, 374274, 376474, 376905, 373633, 366485, 357448, 348472, 340101, 332770, 327625, 324735, 321889, 316972, 310877, 306471, 305059, 305193, 304772, 302978, 300173, 297123, 294696, 293590, 293919, 295293, 297282, 299526, 301500, 302632, 302739, 302211, 301707, 301524, 301151, 299659, 296948, 294331, 293243, 293486, 293494, 292304]
55603B92304j835j478p87l14k06n12q76m43J031K623L553M212M987N166M179K857
55587C14461K018R47j087k790k357m01O40l01k141l805n127n758n161l967l563
55572B81608m127m527m308m149m216l713k438j360j173j570k151k831l176k674
55558B39195j862j926k935l714l617l132k675k114j663j868k477k645k459k802
55544B03306l528l240j474L46O73m88k104l163k893j182Q26J612J017J21o02j570
55528A87657k520k389j246o40j304j990j417N3J446K634L722M169L555K382J305
55513A95417M69J79J100K977M229L833K728K399K893L274L261L325L654L908L645
55498B37291K394j56l365n620n860m712l535k830k168j229k90l3j121l468n660
$$ y = [292304, 290469, 288991, 288204, 287890, 287684, 287172, 286296, 285853, 286884, 289507, 293060, 297272, 302259, 307425, 311604, 314461, 316479, 317426, 316339, 313549, 311192, 310791, 311431, 311130, 308989, 305184, 300057, 294299, 289138, 285171, 281608, 277481, 272954, 268646, 264497, 260281, 256568, 254130, 252770, 251597, 250027, 247876, 245045, 241869, 239195, 237333, 235407, 232472, 228758, 225141, 222009, 219334, 217220, 215557, 213689, 211212, 208567, 206108, 203306, 199778, 196538, 195064, 195410, 196083, 195595, 193491, 190328, 187435, 186253, 187079, 188691, 189708, 189829, 189227, 187657, 185137, 182748, 181502, 180862, 179558, 177568, 176151, 176204, 177650, 180284, 184006, 188175, 191730, 194112, 195417, 195886, 196065, 197165, 200142, 204371, 208204, 210932, 213331, 216224, 219498, 222759, 226084, 229738, 233646, 237291, 239685, 239529, 236164, 230544, 224684, 219972, 216437, 213607, 211439, 210210, 209920, 209887, 208766, 205298, 199638]
55483A99638n992m440k750k122j838r09N6j25j038j057K73J480J126m28j597j557
55467A78720j132j741l629n469n826m701l230k161j405q40n73l83M4R6j405m170
55451A42195n870m559j117J641J986P08k38J76J336J952J544Q49O81P82L61m94
55435A41933q96o32n49j153j701j224J61J432J724R53j83p07l57M6j37n1J448
55418A40107L457L500Q51k172l033j867m82K33N78O21N5q34j350j436j558j649
55402A35021j072L08J739K353J940R41O1k07L9L39N32P90R59N60k59n56L5N27
55384A44050q0j257j656j033m73p63j344j248l96L96M71N4j39J44L98J50k36O8
55366A37106J242K468K761J921O98J98Q69J909K043J188O38J063J305K04j176
$$ y = [199638, 193646, 189206, 186456, 184334, 182496, 181587, 181643, 181518, 180480, 179423, 179696, 181176, 182302, 181874, 180277, 178720, 177588, 175847, 172218, 166749, 160923, 156222, 152992, 150831, 149426, 148586, 148013, 147630, 147674, 147770, 146365, 142195, 136325, 131766, 130649, 132290, 134276, 134984, 134746, 134922, 136258, 138210, 139754, 140603, 141284, 142066, 142427, 141933, 141037, 140405, 139856, 138703, 137002, 135778, 135939, 137371, 139095, 140048, 139865, 139158, 138801, 138847, 138710, 138659, 140107, 143564, 147064, 147915, 145743, 142710, 140843, 140361, 140594, 141172, 141793, 141848, 141014, 139664, 138228, 136670, 135021, 133949, 134257, 135996, 138349, 140289, 141230, 141291, 141084, 141123, 141462, 141994, 142784, 143743, 144303, 144044, 143488, 143523, 144050, 143970, 142713, 141057, 140024, 139551, 138788, 137444, 136196, 135800, 136196, 136667, 136721, 136582, 136726, 137124, 137274, 137038, 137106, 138348, 140816, 143577, 145498, 146196, 146394, 147263, 149172, 151215, 152403, 153041, 154104, 155409, 155613, 154437]
55351A54437q62R26J822O41j197j941j583q92N9J340K269K148J241J96q27j804
55335A55973k296j950j116m94n34j182j658p70J588L513L015P08j029j410j764
55320A50594k623k682j403k02P8N68J819K143L93j663j938j306j870l312l535
55305A35061j968J36J904L112L028J385j17L36J849K241J685K180L679L809J798
55290A60118k80j040j765l517m716l430m07J951K562K071J237L64k43m12m44o51
55274A51398q79r70j136j449j535j272j104j224j038o3J219J918J806J338Q89
55259A47898L50n86j858k720k201k82J757K735K854K857K474R44j091j899j046
55244A50186j05l42j040r09q2M05L05J95J89j86q60r74q2R65Q53o36k304k885
$$ y = [154437, 153575, 154501, 156323, 156964, 155767, 153826, 152243, 151351, 151410, 152750, 155019, 157167, 158408, 158604, 157777, 155973, 153677, 151727, 150611, 150117, 149583, 148401, 146743, 145973, 147561, 151074, 154089, 154797, 153768, 152358, 150594, 147971, 145289, 143886, 143684, 143762, 144330, 146149, 148292, 148685, 147022, 145084, 143778, 141908, 138596, 135061, 133093, 133229, 135133, 138245, 141273, 142658, 142541, 142877, 144726, 146967, 148652, 150832, 154511, 158320, 160118, 159838, 158798, 157033, 153516, 148800, 145370, 144963, 146914, 149476, 151547, 152784, 153148, 152905, 152493, 152049, 151398, 150519, 149549, 148413, 146964, 145429, 144157, 143053, 141829, 140791, 140728, 141947, 143865, 145671, 147009, 147898, 148248, 147662, 145804, 143084, 140883, 140601, 142358, 145093, 147947, 150804, 153278, 154222, 153131, 151232, 150186, 150081, 149739, 148699, 147790, 147708, 148113, 148418, 148613, 148802, 148616, 147756, 146782, 146700, 147665, 148518, 147882, 145578, 142693]
55226A42693k364j578q33L33J873K695J990N00l53j57M44Q99J169J303J471K048
55210A52133K875K812J037j503k911k468r23Q29K232K544J360k71p20j9J22j118
55194A56011k412k224q42K90M29q1n83o46k74Jl69j122j328n14Q57K089K788K737
55176A54807J923Q62J82p6j70R8R57J672J144m58j710j726r48j62K04k57j621
55159A54721k974l183k506k119k022j091O22J545J163J026K182L352L005J778
55145A55499J323J811K089J570N82m72j220j211p23q99k067k757j602N29J631
55130A54083J079j61j243j960j986j039L05J146J504K018K648K762K298J771J239
55115A64464L19p95j357j153o86k47M01J288J974K152J928J504J065Q74R72Q71
$$ y = [142693, 140329, 138751, 137918, 138251, 140124, 142819, 144809, 145309, 144956, 144799, 145243, 146142, 147311, 148614, 150085, 152133, 155008, 157820, 158857, 157354, 154443, 151975, 151052, 151881, 154113, 156657, 158017, 157746, 157026, 157007, 157129, 156011, 153599, 151375, 150533, 150823, 151252, 151171, 150588, 149942, 149668, 149669, 149300, 148178, 146850, 146336, 147193, 149282, 152070, 154807, 156730, 157592, 157774, 157698, 157528, 157626, 158583, 160255, 161399, 160941, 159231, 157505, 156557, 156395, 156599, 156342, 154721, 151747, 148564, 146058, 143939, 141917, 140826, 141448, 142993, 144156, 145182, 147364, 150716, 153721, 155499, 156822, 158633, 160722, 162292, 162874, 162402, 161182, 159971, 159248, 158349, 156282, 153525, 151923, 152452, 154083, 155162, 155001, 153758, 151798, 149812, 148773, 149078, 150224, 151728, 153746, 156394, 159156, 161454, 163225, 164464, 164783, 163988, 162631, 161478, 160792, 160545, 160946, 162234, 164208, 166360, 168288, 169792, 170857, 171731, 172703, 173574]
55099A73574J64p84j219r33l27K36O63R38J120J310J308P48j28n35m30p81j921
55082A73003k589j666KP74M69Qn36j848l471l770k167p4R27P41K87J99L98L36
55064A61023n39k023l010k711j737j105o19O01K273L041K417J275K86o84j418
55049A57070j109K28J405J748J901K349K395J511N14M72J250K040K517K620K029
55034A78940P79l68r97j703k801l273k206n53J4m52l42J032K662L617M201M803
55018A83353M808L499J335m20j075j012r85j266j461j140o13q13k082l332l088
55003A75708j320M28R39O78R03J964L012L088J958J1k109l659l998l037j468l65
54987A72733l08q74j060l24Q58J597J628J477J636J904J713R33J35jN61J078P57
$$ y = [173574, 173738, 172954, 171735, 170802, 170475, 170711, 171374, 172312, 173432, 174742, 176050, 176798, 176670, 176135, 175705, 174924, 173003, 170414, 168748, 168750, 169524, 169993, 170001, 169465, 167617, 164146, 160376, 158209, 158135, 159062, 159803, 160090, 160289, 160687, 161023, 160484, 158461, 155451, 152740, 151003, 149898, 149279, 149880, 152153, 155194, 157611, 158886, 159172, 158488, 157070, 155961, 156189, 157594, 159342, 161243, 163592, 165987, 167498, 168012, 168484, 169734, 171774, 174291, 176911, 178940, 179719, 179351, 178354, 176651, 173850, 170577, 168371, 167818, 167832, 167380, 167038, 168070, 170732, 174349, 178550, 183353, 188161, 191660, 192995, 192575, 191500, 190488, 189503, 188237, 186776, 185636, 185023, 184210, 182128, 178796, 175708, 174388, 174816, 175755, 176433, 177336, 179300, 182312, 185400, 187358, 187369, 185260, 181601, 177603, 174566, 173098, 172733, 172425, 171551, 170491, 170167, 171025, 172622, 174250, 175727, 177363, 179267, 180980, 181913, 182048, 182047, 182608, 183686, 184443]
54970A84443k79r12k35J207J804O79j277k444k142q37Q36K488L462K958J063r16
54954A89898j720j362o91k05R4P3l78p00q1J309K236J880P85O1J45P95J662K394
54936A96195K491J775Q15M18O98J021P76No76o02K73J133J054J03p80j136j539
54919B02024k440l212l074k246j309m3J948L849M297L350K405J969J021r11k490
54904B05138k329q70N20J390J959J914R38m8K39J451J974J359Q87J273J367N7
54888B17219j708k070q08M73M74n09j380j418n43P37J523J229L26j14K66Q21J026
54871B15544J219J828K491K484J682O65J09M18J599L038L760L493L262M264O271
54856B52127P750P563O034M346L435L538M095M004K607O84k27J96M07j124l985
$$ y = [184443, 184164, 183252, 183017, 184224, 186028, 186707, 185430, 182986, 180844, 180007, 180843, 183331, 186793, 189751, 190814, 189898, 188178, 186816, 186125, 185920, 186014, 186087, 185709, 185009, 184928, 186237, 188473, 190353, 191138, 191199, 191344, 192139, 193801, 196195, 198686, 200461, 201276, 201694, 202392, 203413, 204189, 204194, 203518, 202916, 203189, 204322, 205376, 205479, 204699, 203563, 202024, 199584, 196372, 193298, 191052, 189743, 189700, 191648, 195497, 199794, 203144, 205549, 207518, 208539, 207628, 205138, 202809, 201939, 202459, 203849, 205808, 207722, 208660, 208612, 208851, 210302, 212276, 213635, 214522, 215795, 217162, 217219, 215511, 213441, 212633, 213106, 213580, 213071, 211691, 210273, 209730, 210467, 211990, 213219, 213545, 213431, 213697, 214518, 215544, 216763, 218591, 221082, 223566, 225248, 225913, 226022, 226440, 228039, 231077, 234837, 238330, 241592, 245856, 252127, 259877, 267440, 273474, 277820, 281255, 284793, 288888, 292892, 295499, 296183, 295956, 296152, 296559, 295435, 291450]
54841B91450o369p079o259m540k542j083r00j721k449k566k723l393l752k780
54827B43294j028j63o06q19N92K892M231M032L305K801K184J354J328K838M828
54812B71063N545M873M401N027N657M818K722Q68j15j194l283n634o509n418l870
54797B78951l522m149m256l441k991l770m760m640l876l884m659m699l283j386
54783B25635j38L50K45o07j904k683k644k692l323l476k130j93M91l86j450j711
54767B03384j549j517j406r26m12k74j75N32J822K751K365P82p26q55M39J994
54751B06229K694K382J544O97L34Q56K028K906K729J724P14L04O85J622K200J227
54735B30875j364l954m815l936k618j561k57J838M202N554M922K555q0j488j476
$$ y = [291450, 285081, 278002, 271743, 267203, 264661, 263578, 262678, 260957, 258508, 255942, 253219, 249826, 246074, 243294, 242266, 242103, 241497, 240678, 241270, 244162, 248393, 252425, 255730, 258531, 260715, 262069, 263397, 266235, 271063, 276608, 281481, 285882, 290909, 296566, 301384, 304106, 304974, 304859, 303665, 300382, 294748, 288239, 282821, 278951, 275429, 271280, 267024, 263583, 260592, 256822, 252062, 247422, 243546, 239662, 235003, 230304, 227021, 225635, 225497, 225847, 226092, 225485, 223581, 220898, 218254, 215562, 212239, 208763, 206633, 206440, 206931, 206545, 205095, 203384, 201835, 200318, 198912, 197986, 197574, 197300, 197125, 197657, 199479, 202230, 204595, 205377, 204651, 203796, 204235, 206229, 208923, 211305, 212849, 213546, 213880, 214736, 216764, 219670, 222399, 224123, 224837, 225141, 225826, 227448, 229648, 230875, 229511, 225557, 220742, 216806, 214188, 212627, 212370, 214208, 218410, 223964, 228886, 231441, 231361, 229873, 228397]
54720B28397q69RJ517L086K939O39j337k89L115N581N222L178J445R86K089M686
54704B60394P565Q777P822O418O355P538Q616Q544O821L335r48l967m358l016
54690C19896k078k624m053n311n935n952n527m850m087l289k440j583r76j097
54676B70094k190l542l681j986K51J169N23l07l81r3J2J24N00R82J592K701M192
54659B69960N369O018O526O643N407K911Q25K92M16j31j198j982k686l771m417
54644B90182l509j786j229k276l295l157k834l780n685o797n955l726j668q77
54630B43608j154j455j091k91L02L46j47q36r00L43K129K476O63j384j415j3J77
54613B41358j858m226m828l761k326j071J56J063J086L63l39n43k97K72J020J511
$$ y = [228397, 227528, 227537, 229054, 232140, 235079, 235718, 234381, 234092, 237207, 242788, 248010, 251188, 252633, 253619, 255708, 260394, 267959, 276736, 284558, 290976, 297331, 304869, 313485, 322029, 328850, 332185, 331237, 327270, 322912, 319896, 317818, 315194, 311141, 305830, 299895, 293943, 288416, 283566, 279479, 276190, 273750, 272167, 271191, 270094, 267904, 264362, 260681, 258695, 258946, 260115, 260638, 260331, 259950, 259857, 259869, 259993, 260493, 261475, 263067, 265768, 269960, 275329, 281347, 287873, 294516, 299923, 302834, 303659, 303951, 304367, 304236, 303038, 301056, 298370, 294599, 290182, 286673, 284887, 283658, 281382, 278087, 274930, 272096, 268316, 262631, 255834, 249879, 246153, 244485, 243608, 242454, 240999, 239908, 239617, 239919, 240265, 240118, 239282, 238382, 238725, 240854, 243330, 243993, 242609, 241194, 241181, 241358, 239500, 235274, 230446, 226685, 224359, 223288, 223444, 224507, 225593, 225956, 225617, 225074, 224777, 225049, 226069, 227580]
54597B27580J243J65j289k642l488l380k072k6J670K150J476M41j74j47L04Q82
54581B22693J363J553J405J208J390J922K174J589L74p30j244j262j109j093j497
54566B28736k410l376l580k616j003K37N92N56J058K349L631L960L332K450J523
54551B35439M0j937k995j767J168L564L846K501J068K90k14q57j322j046j91L26
54535B37913n4n67J03J885K837J285j812l662k873j027m83j401j853n63J605L052
54519B34385L314K947K304J395O96R07J750J917P62o95j104n62k69p41j268j130
54503B44608n59l34q62j746j956o21J886L976M467L766K794J457n74k174j709
54488B52419K82J288K39j066q16L22P44N46Q73J736K099J643R38L76J03M84J439
$$ y = [227580, 228823, 228988, 227699, 225057, 221569, 218189, 216117, 216091, 217761, 219911, 221387, 221828, 221654, 221507, 221811, 222693, 224056, 225609, 227014, 228222, 229612, 231534, 233708, 235297, 235671, 234941, 233697, 232435, 231326, 230233, 228736, 226326, 222950, 219370, 216754, 215751, 215988, 216580, 217136, 218194, 220543, 224174, 228134, 231466, 233916, 235439, 235479, 233542, 230547, 228780, 229948, 233512, 237358, 239859, 240927, 241217, 241003, 240146, 238824, 237778, 237587, 237913, 237859, 237292, 237395, 239280, 242117, 243402, 241590, 237928, 235055, 234028, 233545, 232144, 230291, 229728, 231333, 234385, 237699, 240646, 242950, 244345, 245041, 245948, 247698, 249615, 250377, 249682, 248578, 248016, 247747, 247006, 245738, 244608, 244049, 243715, 242853, 241107, 239151, 238530, 240416, 244392, 248859, 252625, 255419, 256876, 256302, 254128, 252419, 252701, 253989, 254228, 253162, 252346, 252668, 253412, 253958, 254831, 256567, 258666, 260309, 261247, 261623, 261726, 262210, 263649]
54471B63649J928J400R23J522K193J321o90k163k924l971m758l532o38J133L65
54456B55758j200j667j302o41J129L958N314L310J1j097J09P49m52j729j544o41
54440B60065j68Q4M62K70r94k371k627j821p40M34J841K952K952J946R75Q62J651
54423B65773K937M146M471L273Q21j514k187p92J422K550J932Q72J037K265K810
54408B89816J896Q06Q97J591J576J157J783L433M269L250J613Q36O03q1p82l05
54392C12358J034J489L54j106j526j068o37n92r28j845l213m103l720k521j621
54377B92355j382j346j234j239j304r52J6J163J951K203J959J242J82r38j822
54362B90854k321k400k103j425k74J248K516K871K596K721L536L952K962J108
$$ y = [263649, 265577, 266977, 267900, 269422, 271615, 272936, 272246, 270083, 267159, 263188, 258430, 254898, 254260, 255393, 255758, 254558, 252891, 251589, 250948, 252077, 256035, 261349, 264659, 264670, 263573, 263682, 264431, 263979, 262250, 260706, 260065, 259897, 259981, 260443, 260713, 259719, 257348, 254721, 252900, 252160, 252594, 254435, 257387, 260339, 262285, 263260, 264122, 265773, 268710, 272856, 277327, 280600, 281421, 279907, 277720, 276928, 278350, 280900, 282832, 283704, 284741, 287006, 289816, 291712, 292518, 293415, 295006, 296582, 297739, 299522, 302955, 307224, 310474, 312087, 312923, 313526, 313445, 312663, 312358, 313392, 314881, 315235, 314129, 312603, 311535, 310898, 310306, 309378, 307533, 304320, 300217, 296497, 293976, 292355, 290973, 289627, 288393, 287154, 285850, 284898, 284914, 286077, 288028, 290231, 292190, 293432, 293614, 292676, 290854, 288533, 286133, 284030, 282605, 282331, 283579, 286095, 288966, 291562, 294283, 297819, 301771, 304733, 305841]
54348C05841l59j133j752k267k202j567q66j33R07J797J752J139J233K171K581
54333C07142J780R31J147J675J147l13j439j650j304o17L57J020P23PK04J652
54317C12462L255L952L642K486M31j934k964j533J320L180K849J441P81J307K036
54302C32711K215K156K349K455J752K58j232k103k377k269j955j752j913k046
54288C28249j510o52p67k305l835l728k371j594k055k311r38J330K320J014j445
54273C09402l272l907l870l321j837J93R94p45l852n596m635k135P5J400K156
54258B81050K507K461K252J871Q49q37k184k244j366n97l81n47j055j718j655
54243B78406k30J657K382J654N89j43q83j492q80J127K750K328O21k56K74P29
$$ y = [305841, 305482, 304349, 302597, 300330, 298128, 296561, 295695, 295562, 296469, 298266, 300018, 301157, 302390, 304561, 307142, 308922, 309853, 311000, 312675, 313822, 313509, 312070, 310420, 309116, 308499, 308856, 309876, 310599, 310606, 310810, 312462, 315717, 319669, 323311, 325797, 326228, 324294, 321330, 319797, 321117, 324297, 327146, 328587, 329368, 330675, 332711, 334926, 337082, 339431, 341886, 343638, 343896, 342664, 340561, 338184, 335915, 333960, 332208, 330295, 328249, 326739, 326087, 325320, 323015, 319180, 315452, 313081, 311487, 309432, 307121, 306183, 307513, 309833, 310847, 309402, 306130, 302223, 298353, 295032, 293195, 293388, 294382, 293637, 289785, 284189, 279554, 277419, 277494, 278894, 281050, 283557, 286018, 288270, 290141, 290990, 290153, 287969, 285725, 284359, 283762, 283381, 282834, 281779, 280061, 278406, 278176, 279833, 282215, 283869, 284458, 284315, 283432, 281940, 281060, 282187, 284937, 287265, 287886, 287630, 287904, 288633]
54227B88633L9q66n37Q15J586J031K77P01J857J808l77l138l948k102O31K081
54211B88491J809R37L64j44j123k239k479j401K27J273J359Q27k7r43j155Q4K167
54194B88027L248K326M86o17o85l48L18J458K180J236r22k283j811o05j25m38
54178B91445p30m19P30K546L809K975L38j738j828j415k489m319m635l224k063
54163B78983j951j360P46L060M011L986M080L960K612N04p41n84l8Q0M5J49o9
54146B97473r54j891j938r83J97P74N84J86K20N85M70m21j124n99O46J149O62
54129B95036M09R05R40m62k283k948k557k304k193j020J457L840M875M741M173
54114C02609L372K290J159K18m82p10k95J60k94j509k205j680n66M57J386J805
$$ y = [288633, 288672, 287806, 287269, 288084, 289670, 290701, 290978, 291679, 293536, 295344, 294967, 291829, 287881, 285779, 286410, 288491, 290300, 291237, 291601, 291457, 290334, 288095, 285616, 284215, 284442, 285715, 287074, 287901, 287874, 286931, 285776, 285860, 288027, 291275, 293601, 294087, 293470, 292785, 292437, 292755, 294213, 296393, 297629, 296707, 294424, 292613, 292008, 291883, 291445, 290715, 290296, 291026, 293572, 297381, 300356, 300694, 298956, 297128, 295713, 293224, 288905, 284270, 281046, 278983, 277032, 275672, 276418, 279478, 283489, 287475, 291555, 295515, 298127, 298631, 297890, 297306, 297268, 297348, 297393, 297542, 297473, 296519, 294628, 292690, 291707, 291904, 292678, 293262, 293448, 293668, 294253, 294723, 294302, 293178, 292579, 293225, 294374, 295036, 295445, 296350, 297290, 296828, 294545, 291597, 289040, 286736, 284543, 283523, 284980, 288820, 293695, 298436, 302609, 305981, 308271, 309430, 309648, 309166, 308456, 308161, 308321, 308027, 306518, 304313, 302633, 302067, 302524, 303910, 305715]
54098C05715P01j556k604j050J143J150q08k178k016j740k020j623j0J269J008
54083B95381K53K82L09j076l225m035k823r39K54P48J192J865K560K824K390J651
54067B97611J418J721J550L87o53k77J052J798J555J291J479J431O86j15j57N61
54051C11338J500K125K062J395R67J481K330K141O99o42o62N13K099L457L922
54036C34725L086J803J796L445N081N200M281L468K632J128n37j427j893k786
54022C60002l429k354r9Q07p05k501k006N70K820L119J865L79l81j93M65Q53P37
54005C59949O59J159K056K782K968K475J299j38j087j300j344j656j786j069L88
53990C65355J888K874L041K274J109P02J573K873L730M587O156P543P045M803
$$ y = [305715, 306416, 304860, 302256, 301206, 302349, 303499, 302691, 300513, 298497, 296757, 294737, 293114, 293104, 294373, 295381, 295634, 295916, 296225, 295149, 291924, 287889, 285066, 284127, 284381, 285129, 286321, 288186, 290746, 293570, 295960, 297611, 299029, 300750, 302300, 302687, 302034, 301757, 302809, 304607, 306162, 307453, 308932, 310363, 311049, 310934, 310777, 311338, 312838, 314963, 317025, 318420, 319387, 320868, 323198, 325339, 326038, 325396, 324734, 325247, 327346, 330803, 334725, 337811, 339614, 341410, 344855, 349936, 355136, 359417, 362885, 365517, 366645, 366108, 364681, 362788, 360002, 356573, 354219, 354120, 354927, 354222, 351721, 349715, 350285, 353105, 356224, 358089, 358468, 358087, 357894, 358359, 359212, 359949, 360608, 361767, 363823, 366605, 369573, 372048, 373347, 373209, 372122, 370822, 369478, 367822, 366036, 364967, 365355, 367243, 370117, 373158, 375432, 376541, 377243, 378816, 381689, 385419, 390006, 396162, 403705, 410750, 415553]
53976D15553L178M040O870R927J2007J2481J0965Q138N934N609O119N578L937
53963E10336K865L144L621L141K249K271L410M645N008M280K658N48j336k351
53949E44489k585k705l036l238l070k961l446m356n187n950o994q027q131p049
53935D77754n848n701o415o679n631l684j969j333j860k834l252k691j827j725
53921D26305k632l729m010l228j941r62p04r27j129j211j426j599r89O29K350
53906D04797L164L085K550J543K58q7J302L000K882J464J631M482P566Q432Q155
53891D54224R535J3114J6695J8086J6617J2668P581L640K287K297J314q24j945
53878E55289q03J306K608K857K591J921J093J095K427M054M520L600K199J190
$$ y = [415553, 418731, 422771, 429641, 439568, 451575, 464056, 475021, 483159, 489093, 494702, 500821, 506399, 510336, 513201, 516345, 519966, 523107, 525356, 527627, 531037, 535682, 540690, 544970, 547628, 548176, 546840, 544489, 541904, 539199, 536163, 532925, 529855, 526894, 523448, 519092, 513905, 507955, 500961, 492934, 484803, 477754, 471906, 466205, 459790, 453111, 447480, 443796, 441827, 440494, 438634, 435800, 432548, 429857, 428030, 426305, 423673, 419944, 415934, 412706, 410765, 409803, 409099, 408172, 407043, 405832, 404406, 402807, 401818, 402447, 404797, 407961, 411046, 413596, 415139, 415397, 415310, 416612, 419612, 422494, 423958, 425589, 430071, 437637, 446069, 454224, 463759, 476873, 493568, 511654, 528271, 540939, 548520, 552160, 554447, 556744, 558058, 557234, 555289, 554486, 555792, 558400, 561257, 563848, 565769, 566862, 567957, 570384, 574438, 578958, 582558, 584757, 585947]
53864E85947J000J680K707L382L964N465P723Q902Q120P311Q733J1487J2630J1510
53850F80561J0491J0990J1164Q945N510L724M155M664L739K308J882K291K195
53837G52619R89n91j481j378j002j577l833p238j0254j1572j1124j0031r659j0541
53823F73327j1844j2046j0616q810q143q350p888o537o023p300q663q031o184
53810E62892n840p741r578r212p283n779n366n293n055m906n125n733o709p649
53796D71623p588n960l611k088j991k657l226l340k957k262j795j982k437k442
53782D27287k144k517l806m732l795j180J138J249p58k811k845q60J190J615O28
53767D07659l73n91l23o9J4o9j72J26J067K102K324J556N45O0L62J399K875M085
$$ y = [585947, 586947, 588627, 591334, 594716, 598680, 604145, 611868, 620770, 628890, 636201, 644934, 656421, 669051, 680561, 691052, 702042, 713206, 722151, 727661, 731385, 735540, 740204, 743943, 746251, 748133, 750424, 752619, 753608, 753017, 751536, 750158, 749156, 747579, 743746, 736508, 726254, 714682, 703558, 693527, 683868, 673327, 661483, 649437, 638821, 630011, 621868, 613518, 605630, 599093, 593070, 585770, 577107, 569076, 562892, 557052, 549311, 539733, 530521, 523238, 517459, 512093, 506800, 501745, 496839, 491714, 485981, 479272, 471623, 464035, 458075, 454464, 452376, 450385, 447728, 444502, 441162, 438205, 435943, 434148, 432166, 429729, 427287, 425143, 422626, 418820, 414088, 410293, 409113, 410251, 411500, 410742, 407931, 405086, 404226, 405416, 407031, 407659, 407286, 406695, 406372, 406303, 406317, 406248, 406076, 406202, 407269, 409371, 411695, 413251, 413796, 413856, 414218, 415617, 418492, 422577]
53749D22577M407M124M088M584N149N556O128O919P449P532P613P898P938P565
53735E09527P424P971Q621Q611Q104P706P276O153M327K683J982K114K327J930
53721E86756Q53j90l52K92O59j16j790l664n511p219q130p649o286n124m403l548
53705E34578k606k464l326m053l816l585m853p252q682q006o653o674p826p687
53691D57095m803q42J125R4k002k910k615k702l743m413l388j286M6r5m62L01
53675D29400J758K354J635P29N00K50j010k716l170j581J151L534M544L787J690
53660D42855k38l78J278L075L745L790M303N171N262L982K000N40M11J564L125
53645D80485M098M247M196M461M870N053M958M589L850L128L293M522N713N807
$$ y = [422577, 426984, 431108, 435196, 439780, 444929, 450485, 456613, 463532, 470981, 478513, 486126, 494024, 501962, 509527, 516951, 524922, 533543, 542154, 550258, 557964, 565240, 571393, 575720, 578403, 580385, 582499, 584826, 586756, 587609, 587419, 587067, 587359, 588018, 587902, 586112, 582448, 576937, 569718, 561588, 553939, 547653, 542529, 538126, 534578, 531972, 529508, 526182, 522129, 518313, 514728, 509875, 502623, 493941, 485935, 479282, 472608, 464782, 457095, 452292, 451450, 452575, 452669, 450667, 447757, 445142, 442440, 438697, 434284, 430896, 429610, 429656, 429561, 429099, 429400, 431158, 433512, 435147, 435876, 436376, 436626, 435616, 432900, 429730, 428149, 429300, 432834, 437378, 441165, 442855, 442617, 442239, 443517, 446592, 450337, 454127, 458430, 463601, 468863, 472845, 474845, 475385, 475796, 477360, 480485, 484583, 488830, 493026, 497487, 502357, 507410, 512368, 516957, 520807, 523935, 527228, 531750, 537463, 543270]
53631E43270N142M733M764M650M179L511K408O06j170j856j737k251l672m333
53617E58244k817p7J564J026o88j933j952j099j65L40M17K93k7o04j112j047n69
53600E49794n57j478k524k445j054M72Q43o7j147j139J38J498J563L66n41J17
53584E43839J782K822K639K249K575L011K399R83L50J372L007L664L113K379K248
53569E78432K664L448M628N846O326N799M950M546M647M993N484N851N597M908
53555F48119M958O353P862P868O715O286P161P683O433M337L351L869M571M469
53541G30035L937L707L785L745L431K975K496K099J964K057J948J278L34k38l58
53526G63195p34j860l162l651l271l047l705m739n143m682l917l287k735k167
$$ y = [543270, 548412, 553145, 557909, 562559, 566738, 570249, 572657, 573263, 572093, 570237, 568500, 566249, 562577, 558244, 555427, 555350, 556914, 557940, 557252, 555319, 553367, 552268, 552103, 552443, 552860, 553153, 553126, 552522, 551410, 550363, 549794, 549237, 547759, 545235, 542790, 541736, 542208, 543051, 542984, 541837, 540698, 540836, 542334, 543897, 544263, 543722, 543839, 545621, 548443, 551082, 553331, 555906, 558917, 561316, 562299, 562649, 564021, 567028, 570692, 573805, 576184, 578432, 581096, 584544, 589172, 595018, 601344, 607143, 612093, 616639, 621286, 626279, 631763, 637614, 643211, 648119, 653077, 659430, 667292, 675160, 681875, 688161, 695322, 703005, 709438, 713775, 717126, 720995, 725566, 730035, 733972, 737679, 741464, 745209, 748640, 751615, 754111, 756210, 758174, 760231, 762179, 763457, 763791, 763553, 763195, 762461, 760601, 757439, 753788, 750517, 747470, 743765, 739026, 733883, 729201, 725284, 721997, 719262, 717095]
53512G17095j794j866k357k992l359l069k131j247j273k136k600j524O94K382
53498F93823K477J813K072L542M605L736J502j32j99N02R69J407K618M696O959
53483G30390Q713R501R072P710O355N912O472P562Q856J0256J1641J2962J4319
53470H49721J5572J6346J6770J7658J9359K1066K2036K2809K4198K5621K5812
53459A076968K4984K4929K6765K9741L2519L4458L5402L5391L5209L6195L8624
53448A431185M0999M1569M0201L8311L7474L8430M0701M2703M2866M1185L9251
53437A874875L8408L8527L8880L9293L9623L8994L6704L3578L1489L1470L2901
53426B274742L4272L4304L2667L0270K8541K7907K7366K6089K4665K3800K2552
$$ y = [717095, 715301, 713435, 711078, 708086, 704727, 701658, 699527, 698280, 697007, 694871, 692271, 690747, 691441, 693823, 696300, 698113, 700185, 703727, 708332, 712068, 713570, 713438, 713239, 713741, 714710, 716117, 718735, 723431, 730390, 739103, 748604, 757676, 765386, 771741, 777653, 784125, 791687, 800543, 810799, 822440, 835402, 849721, 865293, 881639, 898409, 916067, 935426, 956492, 978528, 1001337, 1025535, 1051156, 1076968, 1101952, 1126881, 1153646, 1183387, 1215906, 1250364, 1285766, 1321157, 1356366, 1392561, 1431185, 1472184, 1513753, 1553954, 1592265, 1629739, 1668169, 1708870, 1751573, 1794439, 1835624, 1874875, 1913283, 1951810, 1990690, 2029983, 2069606, 2108600, 2145304, 2178882, 2210371, 2241841, 2274742, 2309014, 2343318, 2375985, 2406255, 2434796, 2462703, 2490069, 2516158, 2540823, 2564623, 2587175]
53415B587175J9462J5130J1847J0256Q233M056p71l550m292n742r568j4360j7868
53402B600008j9753k1072k2162k2514k2398k3198k5743k9233l2211l3884l4222
53391B313618l3534l2521l2085l2412l2620l1981l0953l0332k9768k8229k5711
53380A973472k3417k1968k0486j7819j4054j0406q071p435p799p679n843k286
53368A826209K179O998J1885J5967J8283J9251K0463K2613K4880K6858K9467L2982
53356B058035L5847L7142L8836M3347M9555N3748N4532N4377N5730N7966N9570
53345B598685O1364O5352P1158P5777P7175P6747P7584Q1003Q5436Q8386Q8923
53334C447590Q8192Q7803Q8333Q9444R0867R2404R3257R2370Q9728Q6455Q3356
$$ y = [2587175, 2606637, 2621767, 2633614, 2643870, 2652103, 2656159, 2655388, 2651838, 2647546, 2641804, 2632236, 2617876, 2600008, 2580255, 2559183, 2537021, 2514507, 2492109, 2468911, 2443168, 2413935, 2381724, 2347840, 2313618, 2280084, 2247563, 2215478, 2183066, 2150446, 2118465, 2087512, 2057180, 2027412, 1999183, 1973472, 1950055, 1928087, 1907601, 1889782, 1875728, 1865322, 1857251, 1849816, 1842017, 1834338, 1828495, 1826209, 1828388, 1835386, 1847271, 1863238, 1881521, 1900772, 1921235, 1943848, 1968728, 1995586, 2025053, 2058035, 2093882, 2131024, 2169860, 2213207, 2262762, 2316510, 2371042, 2425419, 2481149, 2539115, 2598685, 2660049, 2725401, 2796559, 2872336, 2949511, 3026258, 3103842, 3184845, 3270281, 3358667, 3447590, 3535782, 3623585, 3711918, 3801362, 3892229, 3984633, 4077890, 4170260, 4259988, 4346443, 4429799]
53323D429799Q0186P6697P3353P0209O6101O0129N3224M7034M1722L6231L0294
53312E064979K4475J8245J0002m10j0951k0165k9049l8876m8621n6372o2217o7660
53300D783380p2810p6384p8472q0933q4509q7537q8475q8015q7618q7492q7255
53289C863880q7314q7993q8281q7071q5027q3645q2953q1560p8808p5423p2077
53278B953728o8719o5323o2104n8921n5520n2260m9547m6635m2422l7436l3665
53267B381176l2081l1630l0935k9632k7663k4625k0664j6923j4385j3034j2533
53256B127071j2617j2437j0816p880n180l391j201K499O536Q899R405R621J0780
53243B121289J3010J6013J9337K2379K5103K8229L1809L4424L4955L4497L5102
$$ y = [4429799, 4509985, 4586682, 4660035, 4730244, 4796345, 4856474, 4909698, 4956732, 4998454, 5034685, 5064979, 5089454, 5107699, 5117701, 5117291, 5106340, 5086175, 5057126, 5018250, 4969629, 4913257, 4851040, 4783380, 4710570, 4634186, 4555714, 4474781, 4390272, 4302735, 4214260, 4126245, 4038627, 3951135, 3863880, 3776566, 3688573, 3600292, 3513221, 3428194, 3344549, 3261596, 3180036, 3101228, 3025805, 2953728, 2885009, 2819686, 2757582, 2698661, 2643141, 2590881, 2541334, 2494699, 2452277, 2414841, 2381176, 2349095, 2317465, 2286530, 2256898, 2229235, 2204610, 2183946, 2167023, 2152638, 2139604, 2127071, 2114454, 2102017, 2091201, 2083321, 2078141, 2074750, 2073549, 2076048, 2082584, 2091483, 2100888, 2110509, 2121289, 2134299, 2150312, 2169649, 2192028, 2217131, 2245360, 2277169, 2311593, 2346548, 2381045, 2416147]
53232B416147L7168L9318M0448M0395L9093L6667L4330L3483L3812L3587L1995
53221B816443K9733K7236K3850J9306J4531J0275O067J382l194o781r485j2105
53209B917258j5074j8419k2353k7214l2871l8433m2576m4313m4024m3619m4976
53198B543386m8003n0912n2337n2468n2004n1120m9964m9269m9678n0901n2097
53187A984633n2716n2598n1661n0094m8506m7460m6901m6291m5210m3636m1834
53176A457726m0004l8055l5814l3590l2066l1233k9995k7612k5028k3684k3306
53165A117339k2184j9716j7374j6672j7391j8412j9217j9793j9894j9308j8319
53154I09059j7273j6153j5052j4457j4527j4679j4427j4058j3925j3779j3360
$$ y = [2416147, 2453315, 2492633, 2533081, 2573476, 2612569, 2649236, 2683566, 2717049, 2750861, 2784448, 2816443, 2846176, 2873412, 2897262, 2916568, 2931099, 2941374, 2947441, 2948823, 2945629, 2938848, 2929363, 2917258, 2902184, 2883765, 2861412, 2834198, 2801327, 2762894, 2720318, 2676005, 2631981, 2588362, 2543386, 2495383, 2444471, 2392134, 2339666, 2287662, 2236542, 2186578, 2137309, 2087631, 2036730, 1984633, 1931917, 1879319, 1827658, 1777564, 1729058, 1681598, 1634697, 1588406, 1543196, 1499560, 1457726, 1417722, 1379667, 1343853, 1310263, 1278197, 1246964, 1216969, 1189357, 1164329, 1140645, 1117339, 1095155, 1075439, 1058065, 1041393, 1024002, 1005590, 986373, 966580, 946686, 927378, 909059, 891786, 875633, 860581, 846124, 831597, 816918, 802491, 788433, 774508, 760729, 747369]
53143G47369j3020j3040j2903j1977j0546r484r228r550r892r510p983o136n613
53130F18487o838q132p858o540n817n899n616m604l907m332n524o810p689p365
53116E31556n181k096l84j128k902l771l654l679l988l617k322j207j157j705
53102D94765j920j729j625j628j395j140j481k251k360j384m23o44j558j816j221
53087D72190p09n21N5Q65N62j105k248j440n7l43j884k168k58K055L084L165L110
53070D74353K568J157j88m68k74o20q95L58K750L984K975J449J568L058L950L557
53054D99282L222M038N043M418J880r51k359k081j005J8P19J008O17o53k462l970
53038E06764m564m419m143l806k837j084M21M49q45k016k088j579j429j611j396
$$ y = [747369, 734349, 721309, 708406, 696429, 685883, 676399, 667171, 657621, 647729, 638219, 630236, 624100, 618487, 611649, 603517, 595659, 589119, 583302, 577403, 571787, 567183, 563276, 558944, 553420, 546610, 538921, 531556, 526375, 524279, 523895, 522767, 519865, 516094, 512440, 508761, 504773, 501156, 498834, 497627, 496470, 494765, 492845, 491116, 489491, 487863, 486468, 485328, 483847, 481596, 479236, 477852, 477429, 476785, 475227, 473411, 472190, 471481, 470960, 471015, 471880, 472442, 471337, 469089, 467649, 467592, 467249, 465365, 463197, 462939, 464994, 468078, 471243, 474353, 476921, 478078, 477890, 477422, 477148, 476528, 475633, 475991, 478741, 482725, 485700, 487149, 488717, 491775, 495725, 499282, 502504, 506542, 511585, 516003, 517883, 516932, 514573, 512492, 511487, 511505, 512224, 513232, 513849, 513196, 510734, 506764, 502200, 497781, 493638, 489832, 486995, 485911, 486332, 486781, 485936, 483920, 481832, 480253, 478824, 477213, 475817]
53023D75817o15rk96j364k418k670j895o72Km36j635k799l418l251k022J91K289
53006D54799K664Q58j690l040k684j648r20m05L61J120J113J51j181k398l483
52991D43617m231l881k075K29J540J442Q73P95J180J352P80n10j882k352j477
52976D35400n8N72Q8n88o78n05p06j200j356p84L92J632K154J526L04n43r19j522
52958D33209k225j735M05K612L144K318J664J511R31k62j076r20l42J19O18J183
52942D41154J260O23j36n44r24j623k212k065j288n25j34N4L53R91J978K986L463
52925D43411L120K203J270Q69J241K085K616K351J718J512J831J984J434L67o32
52910D67380r79k90J252K729L272K879J967N14j482k967k598p42O26L82n09p98
$$ y = [475817, 475202, 475193, 474897, 473533, 471115, 468445, 466550, 465878, 465880, 465444, 463809, 461010, 457592, 454341, 452319, 452510, 454799, 457463, 458321, 456631, 453591, 450907, 449259, 448339, 447934, 448295, 449415, 450528, 450679, 449498, 447100, 443617, 439386, 435505, 433430, 433659, 435199, 436641, 437514, 438309, 439489, 440841, 441621, 441111, 439229, 436877, 435400, 435342, 435914, 436002, 435414, 434736, 434231, 433525, 432325, 430969, 430185, 430577, 432209, 434363, 435889, 436193, 435650, 434731, 433209, 430984, 429249, 429654, 432266, 435410, 437728, 439392, 440903, 441834, 441572, 440496, 439576, 439234, 439353, 439971, 441154, 442414, 443037, 442901, 442357, 441433, 439810, 437598, 435533, 434245, 433720, 433586, 433640, 433993, 434984, 436962, 439948, 443411, 446531, 448734, 450004, 450873, 452114, 454199, 456815, 459166, 460884, 462396, 464227, 466211, 467645, 468012, 467380, 466401, 466111, 467363, 470092, 473364, 476243, 478210, 478724, 477242, 474275, 471677, 470935, 471561, 471943, 471434, 470636]
52894D70636o26n88l19O72J593J246o9q69n75l8K5r2q4m15j488k675k886j871
52876D61577n92k76j166k197k181j442j729l879o087n618k222J285K227Q81n34
52861D38047p05j60J33p3n40r83j058n46J43K24l94p69n9J321K112J661N61k6
52843D38889N24J749K389J464o39k358k550j647p90k58M78J523K303K607K796
52828D46480K819K129R39L45N70L49r73j994j257L19P51K3q3J015K003K108K184
52811D57727K762K933K176J645K415L701M130L739L418L279K907K465K111J072
52797D96480j240l650m372l485k715k887l213l162l351m001m104l005j690j640
52783D53965l042m845n940n721m223k381j540k020k710k579j956j592j212n2J520
$$ y = [470636, 470010, 469422, 469103, 469775, 471368, 472614, 472545, 471676, 471101, 471063, 471088, 470996, 470912, 470497, 469009, 466334, 463448, 461577, 460985, 460709, 459543, 457346, 455165, 453723, 451994, 448115, 442028, 436410, 434188, 435473, 437700, 438581, 438047, 437342, 437182, 437315, 437242, 436702, 435719, 434661, 434115, 434258, 434482, 434088, 433319, 433260, 434581, 436693, 438354, 438915, 438889, 439413, 441162, 443551, 445015, 444376, 442018, 439468, 437821, 437031, 436773, 437251, 438774, 441077, 443684, 446480, 449299, 451428, 452367, 452712, 453282, 453631, 452658, 450664, 449407, 449726, 450477, 450500, 450417, 451432, 453435, 455543, 457727, 460489, 463422, 465598, 467243, 469658, 473359, 477489, 481228, 484646, 487925, 490832, 493297, 495408, 496480, 495240, 491590, 487218, 483733, 481018, 478131, 474918, 471756, 468405, 464404, 460300, 457295, 455605, 453965, 450923, 446078, 440138, 434417, 430194, 427813, 426273, 424253, 421543, 418964, 417008, 415416, 414204, 414152, 415672]
52768D15672K117J093o97j960k074j163O7M26q68k880l358j127K421M838N231
52753D17738M562L851L089K028R65J86m88r82m75J402L294L196R64j301j817j140
52737D35072r74j786k566k643k492k675k909k702k196j789j301j65J636L277L855
52722D19642L128J508m29k218l490l847k971r82J195K132R65j588l457k882j14
52707D06592K635L099J030j682k894k219j016p21j442k267k481k099j372l67P76
52692C95572J569J600J143R19J214J621J713J712K177L233M377M959M672L621
52678D30102K168P85L0L71J744L150L194J591j21j67J211K025J302L49O17J470
52662D49821J326J88o14p36j120j899j894p02K65k20j442j937j478q25m05k65
$$ y = [415672, 417789, 418882, 418185, 416225, 414151, 412988, 413055, 413481, 412613, 409733, 406375, 405248, 407669, 412507, 417738, 422300, 426151, 429240, 431268, 432233, 432419, 431931, 430949, 430474, 431876, 435170, 438366, 439330, 438029, 436212, 435072, 434098, 432312, 429746, 427103, 424611, 421936, 419027, 416325, 414129, 412340, 411039, 410874, 412510, 415787, 419642, 422770, 424278, 423849, 421631, 418141, 414294, 411323, 410341, 411536, 413668, 414633, 413045, 409588, 406706, 406592, 409227, 412326, 413356, 411674, 408780, 406561, 405545, 404824, 403382, 401115, 398634, 396535, 395163, 394796, 395572, 397141, 398741, 399884, 400803, 402017, 403638, 405351, 407063, 409240, 412473, 416850, 421809, 426481, 430102, 432270, 433055, 433085, 433456, 435200, 438350, 441544, 443135, 443014, 442847, 444058, 446083, 447385, 447734, 448351, 449821, 451147, 451335, 450721, 449985, 448865, 446966, 445072, 444370, 444635, 444415, 442973, 441036, 439558, 438733, 438328, 438063]
52646D38063n86j177j190l87Q2o60j493q14Q55J544R16O45J416J541m06l085l866
52629D31398k062N41J966J847J133P71R31J138J053R64J263J640J440P14K09K21
52613D45167L22M25R80J755J454n10k706l159j628M66J907K531K617K490K581
52598D54692L028L307K968K498K598K967K870K621L158M091L686J349j254k254
52584D86325j776j127q62p55j019k108l498l800k306K39K438L303K662J209J11
52569D79036K8O22J365K326L363L226Q51k480l879k256K76J037k67j947k612k092
52553D76597r44j18m74j672k074p89R28J352P36O12J294J740J635J764K145J659
52537D84391M9j389j859k176k946l135j750L01J385J333J171J407J838K378K872
$$ y = [438063, 437477, 436300, 435110, 434723, 434805, 434145, 432652, 431838, 432693, 434237, 435153, 435798, 437214, 438755, 438349, 435264, 431398, 429336, 429877, 431843, 433690, 434823, 435594, 436525, 437663, 438716, 439680, 440943, 442583, 444023, 444737, 444946, 445167, 445489, 445914, 446894, 448649, 450103, 449593, 446887, 443728, 442100, 442566, 444473, 447004, 449621, 452111, 454692, 457720, 461027, 463995, 466493, 469091, 472058, 474928, 477549, 480707, 484798, 488484, 489833, 488579, 486325, 484549, 483422, 482560, 481805, 480786, 478678, 475180, 471380, 469074, 469313, 471751, 475054, 477716, 478925, 479036, 479064, 479686, 481051, 483377, 486740, 489966, 490817, 488337, 484458, 482202, 482478, 483515, 483248, 481301, 478689, 476597, 475653, 475535, 475061, 473389, 471315, 470526, 471454, 472806, 473542, 474154, 475448, 477188, 478823, 480587, 482732, 484391, 484440, 483051, 481192, 479016, 476070, 472935, 471185, 471486, 472871, 474204, 475375, 476782, 478620, 480998, 483870]
52522D83870K687J708J128J833K788K473J400J325K349K749J810P33M23L09L0
52507E07615L73J498J981R74j76NO44j07k068l295l002k402k517k861k742k421
52491D91499k288j920q68L35P66L27l23p37q96p36j35N85Q22O11Q24K047L554
52474D93467L976K873J150k5l28j04K45M40K65j71l13K35J196J958K158J722P32
52457E09476k18n5J649L802M850M512L776L324L025K837K984L057K125K94j006
52442E44432r85p73j752l402m008l015j601r66j093j223q42m8M60k24k245m274
52426E18441m435k295L91J282k41k445k888q07K086L321K133P4q78k83Q18J456
52410E15730J682K106K978L808L845L028K293K568L481L707K760J675J544K086
$$ y = [483870, 486557, 488265, 489393, 491226, 494014, 496487, 497887, 499212, 501561, 504310, 506120, 506853, 507276, 507585, 507615, 507988, 509486, 511467, 512441, 512265, 512270, 512914, 512807, 510739, 507444, 504442, 502040, 499523, 496662, 493920, 491499, 489211, 487291, 486423, 486758, 487524, 487851, 487528, 486791, 485895, 485159, 485024, 485609, 486431, 487042, 487866, 489913, 493467, 497443, 500316, 501466, 501441, 501113, 501009, 501254, 501694, 501959, 501788, 501475, 501710, 502906, 504864, 507022, 508744, 509476, 509258, 509203, 510852, 514654, 519504, 524016, 527792, 531116, 534141, 536978, 539962, 543019, 545144, 545438, 544432, 543447, 542674, 540922, 537520, 533512, 530497, 528896, 527930, 526837, 525614, 524772, 524724, 525184, 524960, 522715, 518441, 514006, 511711, 512102, 513384, 513143, 510698, 507810, 507003, 509089, 512410, 514543, 514617, 513739, 513456, 514274, 515730, 517412, 519518, 522496, 526304, 530149, 533177, 535470, 538038, 541519, 545226, 547986, 549661, 551205, 553291]
52396E53291K254J605L57j358l264m367l812k326j825l113m773m836l150j384
52382E23299q90j153p68M20Q94m84k719l766l104k126j874j671o40N56N53p05
52366E05822j902j943q63O24J709J877J443J469K458L519L483K451J468J113J322
$$ y = [553291, 555545, 557150, 557507, 556149, 552885, 548518, 544706, 542380, 540555, 537442, 532669, 527833, 524683, 523299, 522409, 521256, 520488, 520908, 521802, 521318, 518599, 514833, 511729, 509603, 507729, 506058, 505418, 505974, 506527, 505822, 503920, 501977, 501114, 501738, 503447, 505324, 506767, 508236, 510694, 514213, 517696, 520147, 521615, 522728, 524050]
$$ [...]
##END NTUPLES=NMR SPECTRUM
##END=
