
##TITLE=UV1135_M4-1010-1000_6275302_IIIKKVbreX
##JCAMPDX= 6.0         $$ Bruker NMR JCAMP-DX V2.0
##DATA TYPE= NMR SPECTRUM
##DATA CLASS= NTUPLES
##ORIGIN= BRUKER
##OWNER= Administrator
$$ 1.72 TOPSPIN		Version 2.1
$$ 2012-06-03 03:53:54.640 -0500  Administrator@TOPSPIN
$$ Compression mode = diff/dup
##.OBSERVE FREQUENCY= 400.13188235
##.OBSERVE NUCLEUS= ^1H
##.ACQUISITION MODE= SIMULTANEOUS (DQD)
##.ACQUISITION SCHEME= undefined
##.AVERAGES= 8
##.DIGITISER RES= 22
##SPECTROMETER/DATA SYSTEM= spect
##.PULSE SEQUENCE= zg30
##.SOLVENT NAME= COFFEE_meoh
##.SHIFT REFERENCE= INTERNAL, COFFEE_meoh, 1, 14.98061
##AUDIT TRAIL= $$ (NUMBER, WHEN, WHO, WHERE, PROCESS, VERSION, WHAT)
$$ ##TITLE= Audit trail, TOPSPIN		Version 2.1
$$ ##JCAMPDX= 5.01
$$ ##ORIGIN= Bruker BioSpin GmbH
$$ ##OWNER= Administrator
$$ $$ C:\Bruker\TOPSPIN/data/COFFEE/nmr/UV1135_M4-1010-1000_6275302_IIIKKVbreX/10/pdata/1/auditp.txt
$$ ##AUDIT TRAIL=  $$ (NUMBER, WHEN, WHO, WHERE, PROCESS, VERSION, WHAT)
(   1,<2012-06-03 03:53:46.812 -0500>,<Administrator>,<TOPSPIN>,<go>,<TOPSPIN 2.1>,
      <created by zg
	started at 2012-06-03 03:52:39.875 -0500,
	POWCHK enabled, PULCHK disabled,
       configuration hash MD5:
       D5 CA 7A 23 FE 6B EE E2 50 67 74 61 24 F7 5E 3B
       data hash MD5: 64K
       C5 70 24 A0 16 90 20 6A 54 09 CA E4 AB 4D 45 E7>)
(   2,<2012-06-03 03:53:50.656 -0500>,<Administrator>,<TOPSPIN>,<proc1d>,<TOPSPIN 2.1>,
      <Start of raw data processing
       efp LB = 0 FT_mod = 6 PKNL = 1 PHC0 = 0 PHC1 = 0 SI = 32K 
       data hash MD5: 32K
       AD A0 57 FD CC FA 19 3D 78 5A 8A 45 24 C5 E1 FC>)
(   3,<2012-06-03 03:53:50.953 -0500>,<Administrator>,<TOPSPIN>,<proc1d>,<TOPSPIN 2.1>,
      <pk PHC0 = 212.6239 PHC1 = 0 
       data hash MD5: 32K
       34 2E EC 76 68 47 09 DD 4F B5 A8 E3 F6 27 2D 9D>)
(   4,<2012-06-03 03:53:51.015 -0500>,<Administrator>,<TOPSPIN>,<proc1d>,<TOPSPIN 2.1>,
      <abs ABSG = 1 
       data hash MD5: 32K
       14 5F 51 25 04 A0 25 3D BB 86 56 08 40 4E 48 20>)
(   5,<2012-06-03 03:53:51.046 -0500>,<Administrator>,<TOPSPIN>,<proc1d>,<TOPSPIN 2.1>,
      <abs ABSG = 2 
       data hash MD5: 32K
       62 B6 72 6A AC 98 B8 6F F5 44 50 24 E0 13 0C 57>)
(   6,<2012-06-03 03:53:51.078 -0500>,<Administrator>,<TOPSPIN>,<proc1d>,<TOPSPIN 2.1>,
      <abs ABSG = 3 
       data hash MD5: 32K
       1C D0 99 A7 AB 44 C9 11 22 5A 15 8D 78 33 C9 DD>)
(   7,<2012-06-03 03:53:51.109 -0500>,<Administrator>,<TOPSPIN>,<proc1d>,<TOPSPIN 2.1>,
      <abs ABSG = 4 
       data hash MD5: 32K
       5C 8D AE B0 3D DB F7 D9 54 A7 48 A8 B5 0F AF 8E>)
(   8,<2012-06-03 03:53:51.140 -0500>,<Administrator>,<TOPSPIN>,<proc1d>,<TOPSPIN 2.1>,
      <abs ABSG = 5 
       data hash MD5: 32K
       02 FA A6 8D AC 69 F3 7C 09 F5 A1 3A D3 5F B0 E3>)
$$ ##END=
$$ 
$$ $$ hash MD5
$$ $$ 0E B6 5F C8 D8 F8 AE 42 39 87 63 11 71 5B 14 A9
##$RELAX= 
##$RELAX= 
##$RELAX= 
##$RELAX= 
##$RELAX= 
##$RELAX= 
##$RELAX= 
$$ Bruker specific parameters
$$ --------------------------
$$ [...]
##$TP= (0..7)
150 150 150 150 150 150 150 150
##$TP07= 0
##$TPNAME0= <>
##$TPNAME1= <>
##$TPNAME2= <>
##$TPNAME3= <>
##$TPNAME4= <>
##$TPNAME5= <>
##$TPNAME6= <>
##$TPNAME7= <>
##$TPOAL= (0..7)
0.5 0.5 0.5 0.5 0.5 0.5 0.5 0.5
##$TPOFFS= (0..7)
0 0 0 0 0 0 0 0
##$TUNHIN= 0
##$TUNHOUT= 0
##$TUNXOUT= 0
##$USERA1= <user>
##$USERA2= <user>
##$USERA3= <user>
##$USERA4= <user>
##$USERA5= <user>
##$V9= 5
##$VALIST= <valist>
##$VCLIST= <CCCCCCCCCCCCCCC>
##$VD= 0
##$VDLIST= <DDDDDDDDDDDDDDD>
##$VPLIST= <PPPPPPPPPPPPPPP>
##$VTLIST= <TTTTTTTTTTTTTTT>
##$WBST= 2048
##$WBSW= 25
##$XGAIN= (0..3)
0 0 0 0
##$XL= 0
##$YL= 0
##$YMAX_a= 544406
##$YMIN_a= -650872
##$ZGOPTNS= <>
##$ZL1= 120
##$ZL2= 120
##$ZL3= 120
##$ZL4= 120
##$ABSF1= 14.98061
##$ABSF2= -5.57192
##$ABSG= 5
##$ABSL= 3
##$ALPHA= 0
##$AQORDER= 0
##$ASSFAC= 0
##$ASSFACI= 0
##$ASSFACX= 0
##$ASSWID= 0
##$AUNMP= <proc_prof1d_extract_pilot.lims>
##$AXLEFT= 0
##$AXNAME= <>
##$AXNUC= <1H>
##$AXRIGHT= 0
##$AXTYPE= 0
##$AXUNIT= <>
##$AZFE= 0.1
##$AZFW= 0.1
##$BCFW= 0
##$BC_mod= 0
##$BYTORDP= 0
##$COROFFS= 0
##$CY= 15
##$DATMOD= 1
##$DC= 0
##$DFILT= <>
##$DTYPP= 0
##$F1P= 0
##$F2P= 0
##$FCOR= 0.5
##$FTSIZE= 32768
##$FT_mod= 6
##$GAMMA= 0
##$GB= 0
##$INTBC= 1
##$INTSCL= 1
##$ISEN= 128
##$LB= 0
##$LEV0= 0
##$LPBIN= 0
##$MAXI= 10000
##$MC2= 0
##$MEAN= 0
##$ME_mod= 0
##$MI= 0
##$NCOEF= 0
##$NC_proc= -8
##$NLEV= 6
##$NOISF1= 0
##$NOISF2= 0
##$NSP= 0
##$NTH_PI= 0
##$NZP= 0
##$OFFSET= 14.98061
##$PC= 1
##$PHC0= 212.6239
##$PHC1= 0
##$PH_mod= 1
##$PKNL= yes
##$PPARMOD= 0
##$PPDIAG= 0
##$PPIPTYP= 0
##$PPMPNUM= 2147483647
##$PPRESOL= 1
##$PSCAL= 4
##$PSIGN= 0
##$PYNMP= <proc.py>
##$REVERSE= no
##$SF= 400.13
##$SI= 32768
##$SIGF1= 0
##$SIGF2= 0
##$SINO= 400
##$SIOLD= 32768
##$SPECTYP= <>
##$SREGLST= <1H.CDCl3>
##$SSB= 0
##$STSI= 32768
##$STSR= 0
##$SW_p= 8223.68421052632
##$SYMM= 0
##$S_DEV= 0
##$TDeff= 65536
##$TDoff= 0
##$TI= <>
##$TILT= no
##$TM1= 0
##$TM2= 0
##$TOPLEV= 0
##$USERP1= <user>
##$USERP2= <user>
##$USERP3= <user>
##$USERP4= <user>
##$USERP5= <user>
##$WDW= 1
##$XDIM= 32768
##$YMAX_p= 460380905
##$YMIN_p= -686310
##$CURPLOT= <Network HP LaserJet P1505>
##$CURPRIN= <$Network HP LaserJet P1505>
##$DFORMAT= <normdp>
##$LAYOUT= <+/1D_H.xwp>
##$LFORMAT= <normlp>
##$PFORMAT= <normpl>
##$SURQMSG= 1
$$ End of Bruker specific parameters
$$ ---------------------------------
##NTUPLES= NMR SPECTRUM
##VAR_NAME=  FREQUENCY,     SPECTRUM/REAL,   SPECTRUM/IMAG
##SYMBOL=    X,             R,               I
##VAR_TYPE=  INDEPENDENT,   DEPENDENT,       DEPENDENT
##VAR_FORM=  AFFN,          ASDF,            ASDF
##VAR_DIM=   32768,         32768,           32768
##UNITS=     HZ,            ARBITRARY UNITS, ARBITRARY UNITS
##FACTOR=    0.250966925370066, 1,           1
##FIRST=     8223.43324360095, -49909,       -44468
##LAST=      0,             167717,          -22836
##MIN=       0,             -686310,         0
##MAX=       8223.43324360095, 460380905,    0
$$ Real data points
##PAGE= N=1
##DATA TABLE= (X++(R..R)), XYDATA
$$ [...]
$$ plain form
19543 343356 81498 17097 -282292 -195404 -121739 61721 -124562 124530 50383 -84577 -159284
19532 -159284 -40763 -107695 161394 16474 -392947 70332 -138463 -132697 116306 159616 125787
19521 125787 -176437 -202716 -87360 -259080 -370262 -65691 -219207 33951 -192650 -16365
19510 -144572 -32673 -27977 141123 -125383 -244651 -239882 -85899 107470 -434160 27112 -274560
19498 -69326 256988 -261419 -359846 -77814 400872 -261825 43112 94748 -208602 -126859 -51449
19486 -101496 -60466 -217331 170103 -99469 -348029 -79546 -72529 80428 -8399 156106 109616
19475 109616 97607 -424088 -122331 -108878 65980 -469446 -49667 -62567 -167943 7333 37483
19464 37483 65346 -59899 -123856 -165486 110594 -47111 -65320 71737 -83922 -195261 16602
$$ packed form
19543C43356H1498A7097b82292Q6888P3665F1721a24562A24530E0383h4577p4707
19532a59284d0763o6932A61394A6474c92947G0332a38463N766A16306M3310l3829
19521A25787a76437k6279h7360j71720j11182f5691j53516C3951a92650a6365
19510a44572c2673M696A41123a25383j19268M769h5899A07470d34160B7112b74560
19498f9326B56988b61419r8427g7814D00872b61825D3112N1636b08602Q1743e1449
19486a01496M1030j56865A70103i9469k48560g9546P017H0428h399A56106m6490
19475A09616j2009d24088a22331J3453F5980d69446d9667j2900j05376G333L0150
19464C7483K7863e9899o3957m1630A10594d7111j8209G1737h3922j11339A6602
$$ plain form
19452 -92962 111241 -322020 7320 -269683 -228540 -517551 -114776 -110490 178688 45554 -88270
19440 -278479 161602 3165 119573 4394 -284344 -46741 -33067 88268 -185721 -302329 30712
19428 70197 16209 -97453 -76492 -67000 123707 -231822 -126519 -122704 81605 192634 57832
19416 35026 214613 -135503 -365 -329361 79177 -138454 -21363 -17800 180139 -296977 166442
19404 400654 -109589 73669 -238562 26601 67542 124287 -15920 57817 288097 -36850 -326242
19393 -326242 110797 67322 -39082 -157105 104643 -158488 -68654 -325046 -39570 47853
19382 -94560 62868 -219752 -122081 -246235 51933 -159407 -155209 -565008 160566 310271 -185910
19370 -58687 -188732 -46884 68079 128163 -276228 97431 104321 -383904 -78729 103590 -197443
$$ packed form
19452i2962A11241c22020G320b69683M1143k89011a14776M286A78688D5554h8270
19440b78479A61602C165J16408D394b84344d6741J3674H8268a85721j16608C0712
19428G0197A6209i7453K0961R492A23707b31822J05303L815H1605J11029E7832
19416C5026J79587a35503c65l28996G9177a38454b1363L563A80139b96977A66442
19404D00654a09589G3669b38562B6601M0941N6745a5920E7817K30280c6850k89392
19393c26242A10797m3475c9082j18023A04643a58488f8654k56392c9570D7853
19382i4560F2868b19752R7671j24154E1933a59407M198m09799A60566J49705a85910
19370e8687j30045d6884F8079O0084b76228I7431O890c83904g8729A03590a97443
$$ plain form
19358 28541 -1837 -210260 -390965 -206526 -147133 -547988 -128418 -248973 -14095 -31278 72754
19346 -34046 -141446 -264048 -140020 -185334 -146976 -16129 29298 4955 89518 -253262 -88072
19334 -286048 63374 127149 -12176 -87860 -130118 31899 -96600 -92960 -202790 -43980 230285
19322 -516219 194312 181474 -283879 -81914 -189932 33266 92100 102176 114187 132759 -60056
19310 -59206 61421 -184545 -202787 86732 -170252 127706 47966 -205127 68527 -52927 145231
19298 -233377 -358340 250681 118919 -203443 84973 272352 -42725 81700 143149 231904
19288 231904 -29484 138800 -258560 -73926 -198059 1934 -37022 -11739 257787 -17903 -213367
19277 -213367 57575 11564 -390669 51300 39136 22603 -172174 13046 -48847 45618 -291074
$$ packed form
19358B8541a837k08423j80705J84439N9393m00855a28418j20555a4095j7183G2754
19346c4046j07400j22602J24028m5314L8358a6129B9298D955Q4563b53262h8072
19334b86048F3374O3775a2176p5684m2258C1899i6600L640j09830d3980B30285
19322e16219A94312j2838b83879h1914j08018C3266N8834J0076J2011J8572f0056
19310e9206F1421a84545j8242H6732a70252A27706D7966b05127F8527e2927A45231
19298b33377j24963B50681A18919b03443H4973J87379d2725H1700O1449Q8755
19288B31904b9484A38800b58560g3926j24133A934c7022a1739B57787a7903j95464
19277b13367E7575A1564c90669E1300j2164j6533a72174A3046d8847D5618b91074
$$ plain form
19265 93714 144476 -255116 -39098 22558 -368885 -242885 -260562 226501 24555 321584 -163967
19253 404119 -126590 126995 -369193 -59137 5641 249542 -67040 -1854 -187203 -56524 148129
19241 -144564 5276 -226927 -58265 -185354 -63534 90789 -336374 -178670 -278764 -100152
19230 26404 -30779 261920 383791 110296 -204111 166738 -25577 -185514 116574 206622
19220 206622 -309666 -55974 27356 4650 -232852 -188975 -2693 8859 60900 45912 87706 67653
19208 67653 -72693 -404249 -120512 -221987 -179223 -22854 -104619 -91628 -225271 -83363 -206635
19197 -206635 -133886 -324440 -55860 -95324 85933 -184960 50933 314002 -399842 -24097 305935
19185 44687 398468 -269222 35113 -236799 90116 39429 -80469 -197754 -88795 -284689 54312
$$ packed form
19265I3714N0762b55116c9098B2558c68885J26000j7677B26501B4555K97029a63967
19253D04119a26590A26995c69193e9137E641K43901f7040a854j85349e6524A48129
19241a44564E276b26927e8265j27089f3534I0789c36374J57704j00094a00152
19230B6404c0779B61920J21871A10296b04111A66738b5577j59937A16574R0048
19220B06622c09666e5974B7356D650b32852M3877b693H859N2041j4988M1794k0053
19208F7653g2693l31556a20512j01475M2764b2854q1765J2991j33643h3363j23272
19197b06635P2749j90554e5860l9464H5933a84960E0933K63069c99842b4097C05935
19185D4687L53781b69222C5113b36799I0116C9429h0469j17285h8795j95894E4312
$$ plain form
19173 -281995 -85294 -178601 -31978 -309735 -2021 -185354 166536 -182373 112967 159204 -285487
19161 -96822 -363393 -450542 -66480 105473 -120504 -54230 129302 -76708 -64099 -112768 -182230
19150 -182230 116229 -183172 -6005 -102658 22566 -249975 23587 36282 -367796 -171036 -175817
19139 -175817 -87307 -258582 -67603 33274 -181564 107580 -272152 49449 -147234 -312859
19129 -312859 37709 206798 -280472 -38913 104638 -31916 -143802 -302362 225294 251846
19119 251846 -765 -346716 159469 75862 153605 -129960 -141678 -50087 9814 -5619 -7943 212190
19106 -233160 -91285 70240 122602 -433271 181906 -152140 117935 74376 -181577 328072
19095 -102860 -270846 -169220 -155094 -164987 -2462 145416 77627 -125236 -149871 19840 -171581
$$ packed form
19173b81995h5294r3307c1978k77757b021j83333A66536a82373A12967M6237b85487
19161i6822k66571q7149f6480A05473a20504e4230A29302g6708J2609m8669o9462
19150a82230A16229a83172f005r6653B2566b49975B3587J2695c67796a71036m781
19139a75817h7307j71275f7603C3274a81564A07580b72152D9449a47234j65625
19129c12859C7709J69089b80472c8913A04638c1916j11886j58560B25294K6552
19119B51846g65l45951A59469G5862P7743a29960j1718e0087I814e619k324B12190
19106b33160i1285G0240N2362d33271A81906a52140A17935m3559a81577C28072
19095a02860j67986J01626J4126r893b462A45416o7789a25236k4635A9840a71581
$$ plain form
19083 -175163 -134484 -27284 162794 -90310 -36697 26606 50573 187377 -113890 -247099 -213190
19072 -213190 45972 -360744 123076 -213515 171522 366458 -145323 154768 265801 -171461
19061 -2004 94563 43318 -60622 -249551 118760 11822 209474 -120150 -61158 -258752 55670
19049 42685 149515 -198292 -128992 14557 -309110 -155755 51290 -30269 -71072 28071 -448938
19037 -11916 89400 48830 -58040 -236177 -42780 6271 204844 175408 -102992 -62899 208095
19025 -136953 -173957 -143038 -135171 -131039 289335 -70004 -19424 43122 -205732 27520 57330
19014 57330 66127 -103511 166906 6822 175272 -255006 -22982 -42649 135064 18773 -195906
19002 -86166 -190486 1101 90598 -137368 -454727 -110537 106326 23407 31577 -202450 161883
$$ packed form
19083a75163M0679b7284A62794i0310c6697B6606K3967J36804a13890j33209L3909
19072b13190D5972c60744A23076b13515A71522J94936a45323A54768J11033a71461
19061b004I4563D3318f0622j88929A18760A1822J97652a20150N8992j97594E5670
19049D2685J06830a98292O9300A4557c09110J53355E1290c0269m0803B8071d48938
19037a1916H9400m0570e8040j78137d2780F271J98573k9436a02992M0093B08095
19025a36953l7004L0919P867M132B89335g0004a9424D3122b05732B7520K9810
19014E7330Q797a03511A66906F822J68450b55006b2982j9667A35064A8773a95906
19002h6166j04320A101Q9497a37368l17359a10537A06326B3407Q170b02450A61883
$$ plain form
18990 84263 -2809 -42066 -247009 -320589 -160977 25493 -115639 203398 -17774 -292826 -330179
18979 -330179 -69578 -1613 -146012 -72389 -95724 172831 290801 28745 -210040 -81887 -178463
18968 -178463 774 -82316 164285 -503263 -243021 74910 -181828 71486 -100997 -106085 -79194
18957 -79194 156599 -22379 18255 83646 -29365 -30400 38103 161827 13896 -74753 -214855
18946 -214855 -132978 -37436 -177090 298323 -145515 -314138 96867 -407996 219810 -91756
18935 -57704 -239531 -55744 324340 -246291 -16714 -29984 -22678 -136541 -207378 -146565 -96078
18924 -96078 296598 1019 -138293 -214671 -251708 71709 387092 -53110 88530 -155971 -62421
18912 -195503 -23294 -49504 -268667 196682 -460616 -1900 268548 133508 96065 157741 -150716
$$ packed form
18990H4263b809l9257k04943p3580J59612B5493a15639B03398a7774k75052l7353
18979c30179f9578a613j44399g2389k3335A72831J17970B8745b10040h1887r6576
18968a78463G74h2316A64285e03263b43021G4910a81828G1486a00997n088K6891
18957g9194A56599b2379A8255O5391b9365j035C8103J23724A3896g4753j40102
18946b14855Q1877c7436j39654B98323a45515j68623I6867d07996B19810i1756
18935e7704j81827e5744C24340b46291a6714j3270P306j13863p0837O0813N0487
18924i6078B96598A019a38293p6378l7037G1709L15383e3110H8530a55971f2421
18912a95503b3294k6210k19163A96682d60616a900B68548A33508l7443O1676a50716
$$ plain form
18900 181804 -271850 -503517 103440 -37739 141910 338101 -76349 -71894 33110 -25662 -12429
18888 -34020 -324064 361812 96706 48771 398054 -158438 -96680 -1552 84274 108201 10114
18876 -180945 139567 -34150 26867 -371870 -175890 26953 -33441 -37071 -195740 -158977 -56643
18864 -20740 -42410 -53288 145494 -80308 74957 -131158 -115460 -344059 170001 101413 -110123
18852 -34974 -395532 -102641 72976 -217617 123737 -491092 -327220 44814 -144820 -311636
18842 -311636 -93234 132837 -105784 563591 -40713 125999 -376084 200474 27761 59497
18832 59497 128583 -201286 -66272 -61379 -26320 -151343 -191998 -186221 179182 -422482 63568
18820 65036 -212328 42288 -92838 163752 -54213 -103644 111985 41218 -333746 -1499 30044
$$ packed form
18900A81804b71850k31667A03440c7739A41910J96191g6349M455C3110b5662a2429
18888c4020k90044C61812I6706m7935L49283a58438O1758a552H4274K3927A0114
18876a80945A39567c4150B6867c71870a75890B6953c3441l630j58669L6763e6643
18864b0740k1670j0878A45494h0308G4957a31158J5698k28599A70001o8588a10123
18852c4974l60558a02641G2976b17617A23737d91092J63872D4814a44820j66816
18842c11636i3234A32837a05784E63591d0713A25999c76084B00474B7761L1736
18832E9497O9086b01286f6272M893b6320j25023m0655N777A79182d22482F3568
18820F5036b12328D2288i2838A63752e4213m9431A11985D1218c33746a499C0044
$$ plain form
18808 -243505 158531 -346148 -13028 45643 -98041 189927 415856 -20349 -216997 16411
18797 90049 -131859 -157649 154414 -268510 -141394 9887 -75096 37977 281801 -414830 37350
18785 -45914 -40708 -64659 -260356 -160836 170428 -129989 82167 81433 255218 -363546 -138095
18773 -187086 -262640 -210870 -204372 39037 33541 -133135 82250 -126909 3217 -81276 -138211 -181754
18761 -181754 146210 316760 74306 -178261 -220881 68206 -25631 -22274 -507867 169639 -152737
18749 39852 -153683 21226 -440552 362436 -131663 20737 29357 -226263 -311339 142437 947
18737 -273872 -201701 113312 293282 -104088 -241176 -82890 -214844 -86122 -254640 -209109
18727 -209109 155572 -367281 149118 -198217 174714 -205660 -230860 8830 105589 -103044
$$ packed form
18808b43505A58531c46148a3028D5643i8041A89927K25929b0349j96648A6411
18797I0049a31859k5790A54414b68510J27116I887g5096C7977K43824d14830C7350
18785d5914N206k3951j95697R9520A70428a29989H2167p34J73785c63546a38095
18773a87086p5554N1770O498C9037n496a33135H2250a26909C217h1276n6935m3543
18761a81754A46210J70550G4306a78261m2620F8206b5631L357m85593A69639a52737
18749C9852a53683B1226d40552C62436a31663B0737Q620b26263q5076A42437I47
18737b73872P2171A13312J79970a04088j37088h2890j31954h6122j68518M5531
18727b09109A55572c67281A49118a98217A74714b05660k5200H830R6759a03044
$$ plain form
18716 -203333 -316531 -221195 -76447 35897 31824 137521 -107516 50584 51083 7383 24274 42270
18704 42270 -97481 -84713 -104605 -28605 164120 20428 60649 -66500 -32886 166668 -43728
18692 -806 -34129 -330806 -73772 -2346 209225 -86315 -105654 166185 -182224 -107504 177774
18680 6693 133566 33648 -119813 33277 -43432 -138936 137452 -62602 -216396 161801 -307847
18668 -108945 -84094 313236 -118537 -196276 -72733 -221014 -8531 -176511 227177 -140321
18657 174640 -61823 29475 -8139 -233596 -53444 49553 -155477 -242923 -125512 46043 -63556
18645 -219416 162284 -82267 -205184 194440 -57631 -155056 -5251 -159775 -118096 -76960 -214562
18634 -214562 123797 -195358 -124338 52437 -474017 -315888 -396478 -60634 -155959 105681
$$ packed form
18716b03333j13198R5336g6447C5897m073J05697a07516E0584M99G383J6891J7996
18704D2270i7481J2768j9892b8605A64120B0428M0221f6500c2886A66668d3728
18692h06l3323k96677g3772b346B09225h6315j9339A66185a82224P4720A77774
18680F693J26873C3648a19813C3277d3432r5504A37452f2602j53794A61801c07847
18668a08945K4851C13236a18537p7739g2733j48281h531j67980B27177a40321
18657A74640f1823B9475h139k25457e3444D9553a55477q7446J17411D6043f3556
18645b19416A62284h2267j22917A94440e7631r7425e251j54524M1679M1136j37602
18634b14562A23797a95358P1020E2437d74017J58129q0590f0634r5325A05681
$$ plain form
18623 -267758 -143349 -154428 -132164 -119118 -58016 -170823 207431 55584 150083 73929 71066
18612 71066 -14526 274073 18403 -197763 35437 38998 -284118 -34398 -41209 157913 -100648
18600 78089 73299 -217965 51934 28354 80452 -281821 -47813 -154902 -99520 -235618 -100367
18588 -38924 -386146 -51917 -202784 162718 -384615 -202271 -84851 -277985 -138003 -245144
18578 -245144 -93243 -267338 -24022 -16301 159276 203331 -193806 67971 -120066 320881 90965
18566 -313731 47245 -89901 -81038 -445740 326997 19061 117287 308960 -565615 -46760 78048
18554 -3858 90102 -66069 -20502 69859 -47078 38086 -164509 160988 79542 -238165 292746
18542 -156710 -45922 -129412 23584 -142566 -405992 225089 126137 -188319 -20902 155823
$$ packed form
18623b67758J24409j1079K2264J3046e8016j12807B07431E5584R4499G3929k863
18612G1066a4526B74073A8403a97763C5437L561b84118c4398o811A57913a00648
18600G8089m790b17965E1934k3580N2098b81821d7813j07089N5382j36098a00367
18588c8924l47222e1917j50867A62718c84615J82344h4851j93134a38003j07141
18578b45144i3243j74095b4022P721A59276M4055a93806F7971a20066C20881I0965
18566c13731D7245h9901Q863l64702C26997A9061R8226J91673e65615d6760G8048
18554c858I0102f6069b0502F9859d7078C8086a64509A60988G9542b38165B92746
18542a56710d5922q3490B3584a42566k63426B25089r8952a88319b0902A55823
$$ plain form
18531 134411 -10180 -119541 -97673 -13355 -98474 168074 -260188 -208688 55450 214227 75638
18519 -137404 -250890 -301227 -101540 -291747 -81382 83282 -556932 22859 -174847 -252418
18509 -252418 208786 -60917 -85456 -306985 -5081 46454 -550020 -263130 95535 136788 78786
18498 78786 -41298 -313253 -83058 12454 -6451 -120580 -359352 -96721 55784 310045 -243445
18486 -104300 -38202 143032 307308 104733 -37641 -432633 -134354 -70266 40224 -310879
18475 -259088 121444 156218 -165332 -4271 -208310 91834 41043 -120663 -39772 -329922 73768
18463 -59734 -5221 -65006 241026 -171559 278072 -10390 -115902 -298510 -29369 183548 252034
18452 252034 92629 -3024 -184818 -68048 202024 3257 -213544 111969 200605 -253800 -262910
$$ packed form
18531A34411a0180j09361K1868a3355q5119A68074b60188N1500E5450J58777G5638
18519a37404j13486n0337a01540j90207h1382H3282e56932B2859a74847p7571
18509b52418B08786f0917k4539k21529e081D6454e50020b63130I5535M1253n8002
18498G8786d1298k71955h3058A2454f451j14129k38772i6721E5784K54261b43445
18486a04300c8202A43032J64276A04733c7641l94992a34354O4088D0224c10879
18475b59088A21444L4774a65332d271k04039I1834D1043a20663c9772k90150G3768
18463e9734e221n9785B41026a71559B78072a0390j05512j82608b9369A83548O8486
18452B52034I2629c024j81794f8048B02024C257b13544A11969Q8636b53800r110
$$ plain form
18441 -262910 -41668 187678 -123003 -305664 -101177 -81407 -67628 -185341 74205 -32433
18430 -21601 16774 -167155 76787 -237174 111995 -89646 319323 143472 199307 113550 139362
18419 139362 -34519 223114 -611321 -48501 -52965 -81972 198094 -109555 242000 5200 -11109
18407 151183 144078 168924 1875 39423 -116144 48512 -134778 -116902 -340910 -140110 -182179
18396 -182179 88452 336554 -135267 -50560 -121840 -302599 -149967 33646 159316 572402
18386 572402 88911 25790 -49 40286 98916 53254 -186986 -58907 -118436 -75879 -100656 137158
18373 -170075 -276375 -44346 -59251 -32159 -122513 -33381 -467229 56552 -248066 -2319 39520
18361 -2443 -33010 185742 -142796 44875 98771 -360602 -538398 35349 -66193 -101343 -46153
$$ packed form
18441b62910d1668A87678a23003j82661a01177J9770J3779j17713G4205c2433
18430b1601A6774a67155G6787b37174A11995h9646C19323A43472N5835q5757K5812
18419A39362c4519B23114f11321d8501m464k9007A98094a09555B42000E200a1109
18407A51183p105K4846A875L7548a16144D8512a34778J7876k24008a40110m2069
18396a82179H8452K48102a35267e0560p1280j80759a49967C3646J25670M13086
18386E72402H8911B5790d9D0286N8630m5662a86986e8907n9529M2557k4777A37158
18373a70075j06300d4346j4905K7092r0354c3381m33848E6552b48066b319C9520
18361b443l0567A85742a42796D4875N3896c60602j77796C5349f6193l5150d6153
$$ plain form
18349 -166969 -5445 142778 -246175 265947 65033 -248850 156616 21349 72521 21154 -26543
18337 -85202 -44897 -166846 118409 -190808 241842 243522 80903 -111924 -94256 -24233 75807
18325 -362550 -116097 45044 104615 -106586 179058 -327469 -176718 -78974 121351 72973
18315 72973 40534 -284491 -238555 -55325 -56593 -372909 -174094 -208969 34225 -62849 -301556
18304 -301556 -60178 -78683 -136238 -336618 -88232 -91626 -89793 -29979 90416 -479592 -231471
18292 -194248 24240 -207507 137305 49552 3055 -117716 -311565 70569 -356528 -83717 -192106
18281 -192106 123280 300289 104793 172399 26052 -21885 209066 -40019 -43767 119276 137946
18270 137946 -58725 179195 -73164 -30084 13547 84392 -80917 -310210 -132016 -216280 -10168
$$ packed form
18349a66969e445A42778b46175B65947F5033b48850A56616B1349N1172B1154b6543
18337h5202M0305j21949A18409a90808B41842J680H0903a11924J7668b4233G5807
18325c62550a16097D5044N9571a06586A79058c27469J50751g8974A21351m8378
18315G2973l2439b84491M5936e5325j268l16316a74094l4875C4225f2849k38707
18304c01556f0178j8505n7555k00380h8232l394J833b9979I0416d79592b31471
18292a94248B4240b07507A37305D9552C055a17716j93849G0569c56528h3717j08389
18281a92106A23280J77009A04793O7606B6052b1885B09066d0019l748A19276J8670
18270A37946e8725A79195g3164c0084A3547P0845h0917k29293a32016q4264a0168
$$ plain form
18258 47472 2604 -175612 -164148 158389 55823 -222983 -8355 316397 25524 -131719 -68578
18247 -68578 -293626 61805 -150950 -174400 -274519 -73363 -75189 244431 120134 266807 5377
18235 -118942 226414 -136695 157430 -19346 -79867 75637 274544 -4430 -57289 -7982 71166
18223 12304 -234831 -2289 -425347 -424220 -146340 -43208 50001 -245700 176639 202315 104860
18212 104860 -117796 -52221 86868 -31768 94719 -133930 42400 300564 -290364 -132425
18201 -156305 123795 -212653 -191634 -21791 77477 16937 -36007 215278 -129678 -240448
18191 -240448 38191 -26955 -44293 -60530 -127735 -522478 141169 -188120 117356 174834 249339
18180 249339 32041 -12380 -18502 -404872 -123042 -153870 -279950 8792 -9781 -189212 16531
$$ packed form
18258D7472B604a75612J1464A58389E5823b22983h355C16397B5524a31719O3141
18247f8578k25048F1805a50950k3450j00119g3363j826B44431A20134J46673E377
18235a18942B26414a36695A57430a9346o0521G5637J98907d430n2859g982G1166
18223A2304b34831b289m23058J127a46340d3208E0001b45700A76639K5676r7455
18212A04860a17796e2221H6868c1768I4719a33930D2400K58164b90364a32425
18201a56305A23795b12653K1019b1791G7477A6937c6007B15278a29678j10770
18191b40448C8191b6955j7338j6237o7205l94743A41169a88120A17356N7478P4505
18180B49339C2041a2380o122l86370a23042l0828j26080H792i781j79431A6531
$$ plain form
18168 -207395 -184744 -22006 167188 -43018 -138282 -2559 -217389 -31367 -256506 19160 331760
18157 331760 -114448 -93890 147493 13667 -407528 -46405 36128 159052 217605 -25008 43043
18145 48841 -200512 173484 51777 176509 -98207 -19381 -119210 130713 -40131 -268186 213447
18133 75804 -209799 -102453 -223337 -190438 5504 162811 154293 41188 238476 -127647 110757
18121 -127860 -149825 -326 -35632 -316182 -124954 -51252 218235 -227956 -99176 190802 -364340
18109 214890 -360570 170477 94013 -25990 124955 -28976 -176982 128424 -97375 -79049
18099 -79049 25876 -417568 -41134 -415726 -62499 199766 10580 -168355 225105 -61048 154309
18087 89729 -143011 275024 -338367 114617 198865 84207 99501 -217500 128915 -259637
$$ packed form
18168b07395K2651b2006A67188d3018r5264b559k14830c1367k25139A9160L12600
18157C31760a14448K0558A47493A3667d07528d6405C6128J22924N8553b5008D3043
18145D8841b00512A73484E1777J24732i8207a9381r9829A30713d0131k28055B13447
18133G5804b09799a02453j20884L2899E504J57307q518D1188J97288a27647A10757
18121a27860k1965c26l5306k80550a24954e1252B18235b27956i9176A90802c64340
18109B14890c60570A70477p6464b5990A24955b8976j48006A28424i7375J8326
18099g9049B5876d17568d1134l74592f2499A99766A0580a68355B25105f1048A54309
18087H9729a43011B75024c38367A14617Q4248H4207J5294b17500A28915b59637
$$ plain form
18076 -127498 151064 -213351 -141632 85880 152308 228554 -133920 -111057 278304 244779 32306
18064 67331 171027 30305 2511 32611 -171720 -148413 -157645 -92898 72279 -133323 -246810
18053 -246810 -226729 40446 -205461 -116819 -110240 220733 68380 -48069 11577 99531 8713
18041 -167538 30860 94425 -124883 -110803 -92488 -88071 -128196 -258105 -124669 186690 310009
18030 310009 -81849 -2922 46813 -102461 107652 -83909 3912 -441629 -163340 -255584 39850
18018 -64005 -388157 117461 134944 86194 57789 -53985 184375 -319071 -56624 51877 -138500
18006 -208304 31549 66243 224586 -211651 -217727 -171909 -91026 326275 -81415 52082 -64844
17994 80271 208370 -214680 -69501 -199952 -312854 246458 -183226 2501 46280 -258262
$$ packed form
18076a27498A51064b13351P1719H5880O6428P6246a33920K2863B78304l3525C2306
18064F7331J03696C0305B511L0100a71720K3307r232O4747G2279a33323j13487
18053b46810K0081D0446b05461Q8642O579B20733F8380d8069A1577Q7954H713
18041a67538C0860O3565a24883J4080J8315M417m0125j29909a24669A86690J23319
18030C10009h1849b922D6813a02461A07652h3909C912d41629a63340r2244C9850
18018f4005l24152A17461J7483m8750k8405e3985A84375c19071e6624E1877a38500
18006b08304C1549L4694J58343b11651o076M5818Q0883C26275h1415E2082f4844
17994H0271J28099b14680f9501j30451j12902B46458a83226B501M3779b58262
$$ plain form
17983 -5473 62427 164732 79562 -24101 -337783 69041 -102890 -49706 -111059 -82481 62218
17971 -186277 -302285 -148942 292664 -49229 73307 -321608 -161800 128225 -142322 -120473
17961 -120473 114762 -77210 218218 119145 -286678 54303 -247259 -299156 -132818 12774
17950 2006 -255672 -214506 -182939 76718 -231482 -1366 159963 -84775 104077 -59576 -70230
17939 -70230 90068 150397 119105 -86722 -136905 197973 -47738 71773 167200 -350702 -18677
17927 265609 248479 33620 107521 -149699 279613 -274232 -205465 -33619 67589 84176 -51630
17915 13590 61884 -46290 -131017 -103623 83031 143579 -91377 65076 -21849 142872 -76510
17903 -130773 143346 32669 -299074 123885 12226 9708 110001 73485 177946 242258 -46664
$$ packed form
17983e473F2427J02305G9562b4101l13682F9041a02890d9706o1353K8578F2218
17971a86277j16008a48942B92664d9229G3307c21608J59808A28225a42322K1849
17961a20473A14762g7210B18218r9073b86678E4303b47259n1897a32818A2774
17950B006b55672M1166L1567G6718b31482a366A59963h4775A04077e9576j0654
17939g0230I0068O0329l1292h6722n0183A97973d7738G1773R5427c50702a8677
17927B65609j7130C3620P3901a49699B79613b74232O8767c3619F7589J6587e1630
17915A3590M8294d6290q4727K7394H3031O0548i1377F5076b1849A42872g6510
17903a30773A43346C2669b99074A23885A2226k518J00293l6516J04461O4312d6664
$$ plain form
17891 51822 -109973 63641 -210918 -38841 5779 46843 -130646 76449 -92531 -42071 164313
17879 202559 -287150 -16854 -18452 73911 -172089 23976 15851 29696 -229064 188546 -187413
17867 25823 27648 12733 -207015 17788 -147099 -416099 273926 77558 249639 414066 44086
17855 -49371 -20797 252711 -33565 -461898 -299744 -111345 32969 44864 441773 137066
17844 -143987 -79908 -275053 210413 236783 -100424 410049 -42259 -29747 -353679 -179734
17834 -179734 -16183 16546 -131240 -280408 -7930 -119398 -99001 -100256 45088 -204204 122467
17822 -22971 -16971 -63876 -229235 -57422 -107200 57477 42537 -2281 -299367 121794 75542
17811 75542 168893 -270297 197713 131942 -73573 -183798 -339890 -133766 -6317 228668 -192153
$$ packed form
17891E1822a09973F3641b10918c8841E779M1064a30646G6449i2531d2071A64313
17879B02559b87150a6854j598G3911a72089B3976q125J3845b29064A88546a87413
17867B5823J825A2733b07015A7788a47099k69000B73926G7558J72081J64427D4086
17855d9371b0797B52711c3565m28333J62154a11345C2969J1895L96909A37066
17844a43987O4079j95145B10413K6370a00424D10049d2259J2512l23932J73945
17834a79734a6183A6546a31240j49168g930j11468K0397j255D5088b04204A22467
17822b2971O000m6905j65359e7422m9778E7477j4940b281k97086A21794m6252
17811G5542R3351b70297A97713o5771g3573j10225j56092a33766f317B28668a92153
$$ plain form
17799 -111515 -31918 26919 30086 -191479 171345 -338661 -470 126940 -88893 -65997 -13005
17787 83019 23091 187318 150319 137591 38928 -98222 -230326 108525 -160067 34184 234491
17776 234491 -226248 211163 -88667 -129424 -1759 75645 380455 -14572 330445 18537 -206271
17764 183410 446374 228374 200645 -40329 210285 -40145 333470 -116207 145055 7205
17753 -92942 -34211 142751 81902 -226226 -133735 44056 143414 387370 -117945 -149286 34662
17741 127812 138693 -96833 -229270 -43106 -135622 -110575 392065 -239021 130628 -76322 23948
17729 -69499 -42365 114048 -34529 -189227 37857 -123447 4270 -290960 226235 18202 -62044
17717 -83399 -151608 -36122 12897 -27175 -44501 -269316 -154199 -2482 117904 207274 162455
$$ packed form
17799a11515c1918B6919L167a91479A71345c38661d70A26940h8893K2896a3005
17787H3019B3091J64227l6999j2728C8928i8222j32104A08525a60067C4184K00307
17776B34491b26248B11163h8667m0757a759G5645L04810a4572C30445A8537b06271
17764A83410K62964k18000k7729d0329B10285d0145C33470a16207A45055G205
17753i2942c4211A42751o0849b26226R2491D4056R9358K43956a17945l1341C4662
17741A27812J0881i6833j32437d3106r2516K5047C92065b39021A30628g6322B3948
17729f9499K7134A14048c4529j54698C7857a23447D270b90960B26235A8202f2044
17717h3399o8209c6122A2897b7175j7326k24815J15117b482A17904Q9370m4819
$$ plain form
17706 162455 173844 32936 -71341 -125891 190249 92017 -150380 302487 32173 -91960 18535
17694 54274 -183000 246637 171639 -184640 306878 244359 -7754 167549 -125609 -392854
17684 -392854 -167075 12937 -115617 -171453 86429 -3227 58059 -19971 161803 5753 79322
17673 79322 -179784 140115 13001 -61931 -156897 -138372 274627 -274010 113184 95286 218266
17662 218266 256153 -114478 126567 -37082 44942 196412 -186729 -188672 377852 -123818
17651 101488 -13101 164488 132537 273637 4904 131290 466638 269699 147618 -14851
17640 -136695 -135215 -108748 338048 111521 147258 258007 -22717 -120506 69073 -258311 269043
17628 48504 -115476 98925 -385558 112352 272358 113700 53292 55702 372768 249636
$$ packed form
17706A62455J1389C2936g1341n4550A90249I2017a50380C02487C2173i1960A8535
17694E4274a83000B46637p4998a84640C06878o2519g754A67549a25609k67245
17684c92854a67075A2937a15617n5836H6429c227E8059a9971A61803E753P3569
17673G9322a79784A40115A3001f1931r4966J8525B74627b74010A13184j7898J22980
17662B18266L7887a14478A26567c7082D4942J51470a86729j943C77852a23818
17651A01488a3101A64488l1951J41100D904J26386L35348j96939j22081a4851
17640a36695J480K6467C38048A11521L5737J10749b2717r7789F9073b58311B69043
17628D8504a15476I8925c85558A12352J60006A13700E3292K410L17066j23132
$$ plain form
17618 249636 -15868 219852 -162408 180535 -70697 -421 -105527 106733 5473 61406 47105
17607 47105 -16007 -63618 167128 -28237 46897 111184 -4000 44119 86788 62753 -162349
17595 137781 43259 3657 1544 -150517 116297 172537 -81833 66167 68924 -3165 -306293 67621
17582 71077 -74424 162945 -198865 391458 115576 58374 177347 -118558 -191282 55460
17571 -21977 127920 -42191 50269 -173407 137542 311894 313955 296840 175958 146919 182144
17560 182144 85876 162429 46823 84002 64126 -369219 2391 67627 -159943 -99226 -249649
17549 -249649 -10250 104453 199769 -26871 157326 261679 -183596 13175 159792 51487
17538 -146349 -179303 204480 119435 -63287 93677 438068 -33196 159145 111549 33678 -137478
$$ packed form
17618B49636a5868B19852a62408A80535g0697d21j05106A06733E473N5933j4301
17607D7105a6007m7611A67128b8237D6897O4287d000D4119M2669k4035a62349
17595A37781D3259C657A544a50517A16297N6240h1833F6167K757c165l03128F7621
17582G1077g4424A62945a98865C91458A15576n7202J18973a18558p2724E5460
17571b1977A27920d2191E0269a73407A37542J74352K061j7115j20882k9039L5225
17560A82144H5876P6553D6823L7179j9876c69219B391O5236a59943O0717j50423
17549b49649a0250A04453R5316b6871A57326J04353a83596A3175J46617E1487
17538a46349l2954B04480q5045f3287I3677L44391c3196A59145m7596C3678a37478
$$ plain form
17526 -34520 92856 -90535 172328 23158 -65918 -247240 -83193 101325 309473 112827 67965
17515 67965 205012 -266394 432536 -110285 -133726 348449 -205464 -79814 95306 -7297 -26549
17504 -26549 178865 253366 71644 -216695 -208064 -87844 -46789 503968 -104689 461455 -139591
17492 -40859 129759 109410 154057 58611 135009 113271 230406 255568 306411 149107 13709
17480 -57534 -116834 226379 -18672 472108 136572 311541 -59934 -312173 83228 143084 198142
17469 198142 -156567 -148680 -51450 135442 493836 114531 26353 260941 113998 27621
17458 -60101 -29899 -34205 -72667 113835 137911 -60070 185503 -68479 299956 -22867 73840
17446 97125 -119874 -186216 82585 194969 150176 458030 -19027 440893 197910 519663
$$ packed form
17526c4520I2856i0535A72328B3158f5918j81322h3193A01325K08148A12827m4862
17515F7965J37047b66394D32536a10285k3441C48449b05464g9814I5306g297j9252
17504b6549A78865P4501G1644b16695Q631h7844M1055E03968a04689D61455a39591
17492d0859A29759k0349M4647E8611P6398k1738J17135K5162N0843A49107A3709
17480e7534n9300B26379a8672D72108A36572J74969e9934k52239H3228N9856N5058
17469A98142a56567P887e1450A35442L58394A14531B6353K34588A13998B7621
17458f0101b9899m306l8462A13835K4076f0070A85503f8479B99956b2867G3840
17446I7125a19874o6342H2585J12384m4793L07854a9027D40893A97910L21753
$$ plain form
17436 519663 194148 324770 222807 416252 473821 186245 306812 198385 603203 394331
17426 394331 367488 174013 326060 252602 202837 173538 343874 189497 76190 145495 297259
17415 297259 224933 152639 -109898 350442 332680 129657 397483 617385 113857 66662
17405 66662 379181 368201 313605 484340 93725 31004 425028 360543 82025 105150 -73014
17393 92894 349162 173061 402843 -167973 130176 151906 135753 306592 -165489 66319
17382 45004 -104961 32853 122512 326967 196260 158304 314464 336974 320771 233931 244176
17371 244176 24368 198075 146411 -14279 467400 247275 388216 -193916 -192657 134573
17360 389443 62568 -82043 345145 432948 -30849 -138010 39490 111698 -193819 35885 155625
$$ packed form
17436E19663A94148J30622j01963J93445N7569A86245J20567j08427M04818k08872
17426C94331k6843A74013J52047p3458m9765k9299J70336j54377G6190O9305J51764
17415B97259p2326p2294a09898C50442j7762A29657K67826K19902A13857m7195
17405F6662L12519j0980n4596J70735I3725C1004L94024o4485H2025K3125g3014
17393I2894K56268A73061K29782a67973A30176K1730j6153J70839a65489F6319
17382D5004a04961C2853Q9659K04455j30707l7956J56160K2510j6203q6840J0245
17371B44176B4368J73707n1664a4279D67400k20125J40941a93916J259A34573
17360C89443F2568h2043C45145Q7803c0849j07161C9490P2208a93819C5885J19740
$$ plain form
17349 155625 85937 376020 -79470 244677 190540 352140 63626 96768 244604 6730 -13017
17337 193310 -12073 353744 -233886 267342 -171306 212580 36965 193588 415863 -48466
17326 422474 256239 179040 175337 29156 74279 345295 20793 187054 597243 341548 281008
17315 281008 269409 -149454 127835 252089 174245 284280 317543 505578 291111 8377
17304 186598 124099 293588 176735 301678 -80991 108246 -84415 304260 416138 65567
17293 81097 137437 351814 116551 265305 326717 235071 71087 157122 298631 -6040 242263
17281 -139745 474314 140773 113884 -14047 423695 298526 320633 -55174 207382 231976
17271 231976 375782 376557 89907 287274 -154034 34567 350182 158145 334298 -76080 117213
$$ packed form
17349A55625o9688K90083g9470B44677n4137J61600F3626L3142J47836F730a3017
17337A93310a2073C53744b33886B67342a71306B12580C6965J56623K22275d8466
17326D22474j66235p7199l703B9156M5123K71016B0793J66261M10189k55695o0540
17315B81008j1599a49454A27835J24254p7844J10035L3263J88035k14467H377
17304A86598o2499J69489j16853J24943h0991A08246h4415C04260J11878F5567
17293H1097N6340K14377A16551J48754O1412r1646G1087Q6035J41509f040B42263
17281a39745D74314A40773k6889a4047D23695j25169K2107e5174B07382K4594
17271B31976J43806P75H9907J97367a54034C4567L15615A58145J76153g6080A17213
$$ plain form
17259 -49024 162555 -105989 312811 180498 18288 176178 229163 277663 102789 184566
17249 184566 357488 219629 -92294 201319 234722 209981 130254 275691 -64949 203798
17238 5457 178044 530947 30094 -28389 98083 450403 444737 -34619 28388 288636 -172212
17226 31246 226604 338557 115100 207409 199372 182912 -27554 422481 264999 542794 278321
17215 278321 179547 234453 279474 291689 171531 229400 -6725 167131 170464 -94126 337206
17203 333816 121769 -171642 300954 -2642 -167318 401765 -22585 110870 183801 431495
17193 431495 234128 320609 207833 209012 322833 228360 148403 420896 43006 67677 43015
17182 43015 168681 125268 7432 294306 212824 300370 547258 407146 402146 73555 199417
$$ packed form
17259d9024A62555a05989C12811j32313A8288J57890N2985M8500A02789Q1777
17249A84566J72922j37859i2294B01319L3403k4741p9727J45437f4949B03798
17238E457J72587L52903C0094b8389I8083L52320n666c4619B8388K60248a72212
17226C1246J95358J11953A15100R2309q037j6460b7554D22481j57482K77795k64473
17215B78321r8774N4906M5021J2215j20158N7869f725A67131L333i4126C37206
17203C33816A21769a71642C00954b642j64676D01765b2585A10870P2931K47694
17193D31495j97367Q6481j12776J179J13821r4473p9957K72493D3006K4671k4662
17182D3015J25666m3413G432K86874q1482Q7546K46888j40112n000G3555J25862
$$ plain form
17171 199417 126361 130955 238167 420739 354290 214873 261102 455587 198042 231997 22066
17159 389067 445618 195706 -71225 398638 315135 279834 278326 724256 262447 449638 335889
17148 335889 264732 125181 356276 195867 260987 195020 239771 327088 462121 361486
17138 361486 572145 243436 188624 500403 416970 345720 267040 68235 387021 137565
17127 311029 323752 28866 357324 102169 491565 7259 446248 153271 390252 362737
17117 362737 555579 225023 488568 507379 440642 151917 375737 300380 179520 399469
17107 399469 571066 284593 255908 332049 718927 401724 31152 360425 324692 77127
17096 608809 388124 487989 369376 277823 321388 268018 73716 370222 432485 174668 327115
$$ packed form
17171A99417p3056M594J07212J82572o6449j39417M6229J94485A98042L3955B2066
17159C89067N6551A95706g1225C98638q3503l5301j508M45930B62447J87191j13749
17148C35889p1157A25181K31095j60409O5120o5967M4751Q7317J35033j00635
17138C61486K10659B43436n4812L11779q3433p1250p8680F8235L18786A37565
17127C11029J2723B8866L28458A02169L89396G259M38989A53271K36981k7515
17117C62737J92842B25023K63545J8811o6737A51917K23820p5357j20860K19949
17107C99469J71597B84593k8685P6141L86878l17203C1152L29273l5733G7127
17096F08809k20685R9865j18613r1553M3565n3370G3716K96506O2263A74668J52447
$$ plain form
17085 327115 272385 379255 375962 341112 399417 208215 443985 492429 402883 334180 253336
17074 253336 162135 477658 499430 704591 422685 316363 191986 239463 754116 708105
17064 708105 425476 457386 229321 251266 454900 413477 402779 370552 85767 452568 187864
17052 693024 513418 183720 684017 588081 402027 497546 867609 592495 608997 639731
17042 639731 626402 505938 435736 496743 657545 411496 321063 277545 194780 368941 522571
17031 522571 750136 405946 573882 600470 653012 761903 839786 598164 860491 545646
17021 545646 496002 646762 360164 730584 632366 331680 1012648 766771 778955 381682
17010 662294 683867 678145 758737 932582 818324 259552 556990 458627 664466 1007390
$$ packed form
17085C27115n4730J06870l293l4850N8305j91202K35770M8444q9546o8703q0844
17074B53336r1201L15523K1772K05161k81906j06322j24377M7477N14653m6011
17064G08105k82629L1910k28065K1945K03634m1423j0698l2227H5767L66801A87864
17052F93024j79606A83720N00297r5936j86054R5519L70063k75114J6502L0734
17042F39731j3329j20464p0202O1007J60802k46049r0433m3518q2765J74161J53630
17031E22571K27565l44190J67936K6588N2542J08891P7883k41622K62327l14845
17021E45646m9644J50760k86598L70420r8218l00686O80968k45877J2184C81682
17010F62294K1573n722Q0592J73845j14258B59552K97438r8363K05839L42924
$$ plain form
17000 1007390 701019 706930 248010 648724 656521 763366 784071 376763 1211821 729424
16990 729424 660526 835763 722051 585151 634581 724644 825835 816970 738075 1023895 1038571
16979 1038571 458197 801715 985208 563155 854748 759843 636385 1026524 708690 975835
16969 975835 689487 623948 831974 1162435 1075021 854370 1006896 777691 815551 971427
16959 971427 776135 925581 560143 941639 1079895 1086907 754601 595760 1176774 745914
16949 745914 1034467 945386 998533 1231259 845926 1077239 1282080 1186809 1367393 1263190
16939 1263190 1026470 1162734 1154849 1221110 1132777 1667660 1264444 773348 986024 1210863
16929 1210863 1077214 1278611 914827 1189989 1382886 1665734 1143250 1079906 1547705 1339538
$$ packed form
17000A007390l06371N911B48010M00714P797J06845K0705C76763Q35058m82397
16990G29424o8898J75237j13712j36900M9430R0063J01191q865p8895K85820J4676
16979A038571D58197L43518J83493m22053K91593r4905j23458L90139l17834K67145
16969I75835k86348o5539K08026L30461q7414k20651J52526k29205L7860J55876
16959I71427j95292J49446l65438L81496J38256P012l32306j58841N81014m30860
16949G45914K88553q9081N3147K32726l85333K31313K04841r5271J80584j04203
16939A263190k36720J36264p885O6261q8333N34883m03216m91096K12676K24839
16929A210863j33649K01397l63784K75162J92897K82848n22484o3344M67799k08167
$$ plain form
16919 1339538 1464208 1369576 1123599 1199113 1231724 1393907 794958 1461252 1429514 1444220
16909 1444220 1665861 1465614 1368894 1486227 1111593 1302971 1828124 1501503 1646530 1735697
16899 1735697 1504210 1685052 1692657 1745899 1950238 1758996 1304450 1914824 1783115 1976650
16889 1976650 1700476 2067682 1491623 1945175 1772745 1627972 1563490 2037010 1936446 1981770
16879 1981770 1778782 1843762 2324568 2005040 2248282 1890849 2074830 2057772 2473802 2391796
16869 2391796 2082568 2140992 2029573 2169398 2206279 2181022 2568158 2358053 2453483 2595500
16859 2595500 2586323 2523910 2506483 2747000 2741102 2683190 2558099 2666933 2443207 2707313 2589797
16848 2589797 2810232 2789268 3080914 3194874 3061100 2911993 3163802 3072459 3179700 2857653
$$ packed form
16919A339538J24670r4632k45977P5514L2611J62183n98949O66294l1738J4706
16909A444220K21641k00247r6720J17333l74634J91378N25153l26621J45027Q9167
16899A735697k31487J80842P605N3242K04339j91242m54546O10374j31709J93535
16889A976650k76174L67206n76059M53552j72430j44773o4482M73520j00564M5324
16879A981770k02988O4980M80806l19528K43242l57433J83981j7058M16030q2006
16869B391796l09228N8424j11419J39825L6881k5257L87136k10105R5430J42017
16859B595500r177o2413j7427K40517n898n7912j25091J08834k23726K64106j17516
16848B589797K20435k0964K91646J13960j33774j49107K51809r1343J07241l22047
$$ plain form
16838 2857653 3138285 3445982 3373922 3706158 3533492 3402336 3789484 3298375 3782448 3994514
16828 3994514 3489748 4063750 3685275 3695532 4015294 3900961 4153195 4168453 4513332 4819318
16818 4819318 4691023 4465725 4613436 4814208 4867762 5017648 5198750 5239391 5377053 5401028
16808 5401028 5798610 5590088 5392996 5805139 5577089 6166525 6066567 5963683 6280078 6768758
16798 6768758 6962219 6644534 6859648 7254080 7136316 7109789 7463058 7696699 7936715 7815093
16788 7815093 8214808 8470108 8576160 8655942 9065048 9481525 9395635 9798020 10396842 10565886
16778 10565886 10714717 10842405 11273413 11548042 11934228 12134823 12705687 12461917 13330756
16769 13330756 13641674 13996124 14297954 15140374 15284277 15916731 16285120 17179677 17572723
$$ packed form
16838B857653K80632L07697p2060L32236j72666j31156L87148m91109M84073K12066
16828C994514n04766N74002l78475J0257L19762j14333K52234J5258L44879L05986
16818D819318j28295k25298J47711K00772N3554J49886J81102M0641J37662K3975
16808E401028L97582k08522j97092M12143k28050N89436r9958j02884L16395M88680
16798F768758J93461l17685K15114L94432j17764k6527L53269K33641K40016j21622
16788G815093L99715K55300J06052P9782M09106M16477q5890M02385N98822J69044
16778A0565886J48831J27688M31008K74629L86186K00595N70864k43770Q68839
16769A3330756L10918L54450L01830Q42420J43903O32454L68389Q94557L93046
$$ plain form
16760 17572723 18346158 18891451 19747519 20385569 20796290 21569269 22896224 23361068 24416897
16751 24416897 25128042 26559729 27526380 28721938 29694828 31153098 32450807 34118965
16743 34118965 35556712 37300014 38945671 40849534 42867411 44991561 47782141 49855947
16735 49855947 52596769 55889307 58551098 61911307 65843464 69626335 73607360 78164428
16727 78164428 82962227 88136468 93512788 99372573 105424775 112006887 118791801 125994279
16719 125994279 133402892 141161049 148691652 156898226 165006898 172221446 179669755 186275482
16711 186275482 192275237 197818302 201773165 204391309 206043928 206223625 205078569 202413505
16703 202413505 198883026 194056514 188253654 181511639 174981730 167133773 158879390 150999025
$$ packed form
16760A7572723P73435N45293Q56068O38050M10721P72979J326955M64844J055829
16751B4416897P11145J431687R66651J195558R72890J458270J297709J668158
16743C4118965J437747J743302J645657J903863K017877K124150K790580K073806
16735D9855947K740822L292538K661791L360209L932157L782871L981025M557068
16727G8164428M797799N174241N376320N859785O052202O582112O784914P202478
16719A25994279P408613P758157P530603Q206574Q108672P214548P448309O605727
16711A86275482N999755N543065L954863K618144J652619J79697j145056k665064
16703B02413505l530479m826512n802860o742015o529909p847957q254383p880365
$$ plain form
16695 150999025 143364906 135352548 127470474 120498029 113262786 106405754 100153062 93866290
16687 93866290 88246169 83155754 78447125 73668247 69148585 64923392 61384817 58168179
16679 58168179 54908308 51848153 48949587 46190633 43734741 41600656 39430740 37400701
16671 37400701 35686340 33700513 32607781 30689923 29485540 28084112 27131141 25574283
16663 25574283 24865717 23434164 22429806 21393808 20706014 20173256 19282342 18442609 17633637
16654 17633637 16913578 16526856 15418887 15377213 14708777 14485230 13923338 13562799 13162046
16645 13162046 12540103 11962086 11737972 11595301 11192416 10659629 10401720 10204504 9892195
16636 9892195 9324957 9121643 9028427 8587990 8550993 8455368 8173464 7937092 7625300 7333613
$$ packed form
16695A50999025p634119q012358p882074o972445p235243o857032o252692o286772
16687I3866290n620121n090415m708629m778878m519662m225193l538575l216638
16679E8168179l259871l060155k898566k758954k455892k134085k169916k030039
16671C7400701j714361j985827j092732j917858j204383j401428r52971j556858
16663B5574283p08566j431553j004358j035998o87794n32758q90914q39733q08972
16654A7633637p20059l86722j107969m1674o68436k23547n61892l60539m00753
16645A3162046o21943n78017k24114j42671m02885n32787k57909j97216l12309
16636I892195n67238k03314r3216m40437l6997r5625k81904k36372l11792k91687
$$ plain form
16626 7333613 7250687 7134865 6963869 7049482 6872794 6233090 6036290 6175401 6198593 5485956
16616 5485956 5720448 5433794 5345284 5037535 5332727 4948339 5184981 4863989 4683439 4906647
16606 4906647 4501946 4698542 4177397 4239692 4182632 3921712 3869327 3873037 3725285 4036477
16596 4036477 3536043 3669239 3605175 3326941 3312653 3364437 3606344 3432965 3286145 3343361
16586 3343361 3239399 3109070 2985240 3022633 2684320 2921762 2517464 2648190 2961361 2829845
16576 2829845 2847944 2221540 2572778 2310273 2589196 2496593 2169561 2513039 2159165 2143875
16566 2143875 2052137 2072805 2085229 2008759 2021524 2218488 2247097 1635927 2088236 1784913
16556 1784913 1891371 1855516 1894005 1793425 1597256 2181233 1816485 1536328 1596349 1708193
$$ packed form
16626G333613q2926j15822j70996Q5613j76688o39704j96800J39111K3192p12637
16616E485956K34492k86654q8510l07749K95192l84388K36642l20992j80550K23208
16606D906647m04701J96596n21145O2295n7060k60920n2385L710j47752L11192
16596D036477n00434J33196o4064k78234j4288N1784K41907j73379j46820N7216
16586C343361j03962j30329j23830L7393l38313K37442m04298J30726L13171j31516
16576B829845J8099o26404L51238k62505K78923r2603l27032L43478l53874j5290
16566B143875r1738K0668J2424p6470J2765J96964K8609o11170M52309l03323
16556A784913J06458l5855L8489j00580j96169N83977l64748k80157O0021J11844
$$ plain form
16546 1708193 1701482 1725636 1668748 1814973 1792780 1768479 1484919 1526054 1600702 1351630 1596727
16535 1596727 1374200 1551579 1530863 1023625 1449556 1437996 1260758 933078 1469616 1231727
16525 1231727 1639712 1057139 1271982 1023232 1322149 1149312 886102 957189 1084539 1254732
16515 1254732 1264725 897255 1129331 960427 998284 649070 1162622 1117699 1041035 1090219
16505 1090219 869630 1316173 809261 1124241 1011757 794089 1056364 1440954 832824
16496 832824 767249 787060 934419 887893 706292 775413 736125 823145 481852 814116 921257
16485 921257 533639 928344 736138 846253 727809 474543 551121 805259 751982 887056
16475 887056 606245 431109 1040346 646928 504886 604058 952547 554702 539044 742738
$$ packed form
16546A708193o711K4154n6888J46225k2193k4301k83560M1135P4648k49072K45097
16535A596727k22527J77379k0716n07238M25931j1560j77238l27680N36538k37889
16525A231727M07985n82573K14843k48750K98917j72837k63210P1087J27350J70193
16515A254732R993l67470K32076j68904L7857l49214N13552m4923p6664M9184
16505A090219k20589M46543n06912L14980j12484k17668K62275L84590o08130
16496H32824o5575J9811J47359m6526j81601O9121l9288Q7020l41293L32264J07141
16485I21257l87618L94705j92206J10115j18444k53266P6578K54138n3277J35074
16475H87056k80811j75136O09237l93418j42042R9172L48489l97845j5658K03694
$$ plain form
16465 742738 570227 245735 752184 728457 701146 586112 755895 688878 665360 536556
16455 536556 410255 574523 732410 163643 651533 581871 609602 426616 267778 656781
16445 656781 466781 589619 753454 491231 622014 509841 334889 565412 683453 541967
16435 541967 549905 454425 629439 403914 311247 308350 458479 493616 442385 457185 703885
16424 703885 667935 207353 384908 365795 312554 373280 503559 160460 600313 555545
16414 555545 438286 235491 341805 714775 239856 516716 209066 432530 374997 -10255
16403 272503 461870 627574 380661 436790 239498 260454 356571 129513 434002 177319
16392 227366 496722 229808 440085 199554 -14977 321371 97416 177803 638755 340191
$$ packed form
16465G42738j72511B45735N06449k3727k7311j15034J69783o7017k3518j28804
16455E36556j26301J64268J57887A63643M87890o9662K7731j82986j58838L89003
16445F56781j90000J22838J63835k62223J30783j12173j74952K30523J18041j41486
16435E41967P938r5480J75014k25525r2667k897J50129L5137n1231J4800K46700
16424G03885l5950B07353J77555j9113n3241O0726J30279A60460M39853m4768
16414E55545j17259k02795J06314L72970B39856K76860B09066K23464n7533a0255
16403B72503J89367J65704k46913N6129j97292K0956R6117A29513L04489A77319
16392B27366K69356B29808K10277A99554a4977C21371I7416Q0387M60952k98564
$$ plain form
16382 340191 314946 536375 60598 97210 -651 253536 383758 85955 -58935 356965 273179
16371 273179 34777 238791 123008 190442 260181 29802 158918 317465 206002 14145
16360 109990 418834 99616 224244 135997 233156 124872 412479 182460 146365 368967
16350 368967 245570 382518 -5209 348821 219098 75925 737225 275274 150977 -68163
16339 -54746 130127 231484 256704 -59879 384882 -168861 185655 -200839 355154 631492
16329 631492 3432 -119614 290499 266088 178792 131879 213012 -2141 417217 300021 53666
16317 343366 -298162 -6930 67138 173945 98767 215496 192729 283666 118328 -16698 -105010
16306 -105010 248089 80133 158878 165378 378611 619723 62168 239760 241070 415344 29461
$$ packed form
16382C40191k5245K21429F0598L6612f51B53536J30222H5955e8935C56965q3786
16371B73179C4777K04014j15783O7434O9739B9802J29116J58547j11463A4145
16360A09990L08844I9616J24628q8247R7159j08284K87607A82460l6095K22602
16350C68967j23397J36948e209C48821j29723G5925O61300B75274j24297f8163
16339e4746A30127J01357K5220e9879C84882a68861A85655b00839C55154K76338
16329F31492C432a19614B90499k4411q7296m6913Q1133b141D17217j17196E3666
16317C43366b98162f930F7138J06807p5178J16729k2767R0937A18328a6698q8312
16306a05010B48089H0133P8745O500K13233K41112F2168J77592J310J74274B9461
$$ plain form
16294 -60005 124928 -43268 -47871 -107966 127062 -67003 275221 253102 143778 46741 167553
16283 167553 -77114 99805 274074 340315 131106 -104391 203498 402162 110848 28085
16272 126035 277392 94705 -170317 -268814 314603 -58022 -323929 106093 345665 5451
16261 170946 -196430 -69813 431572 22652 -51165 71092 -97403 140319 350622 12067 52352
16250 52352 138984 154188 -1772 653813 -36777 -34361 234068 -72979 194965 328968 -71515
16238 127413 93862 -4746 94488 163351 237926 528195 111114 -430960 75145 -165715 239215
16226 249340 49580 84353 100448 49670 342010 5895 186978 120485 196183 450502 -166088
16214 38009 324759 58389 -162499 -116738 11970 291220 83115 -47020 288730 232478 57788
$$ packed form
16294f0005A24928d3268m603o0095A27062f7003B75221k2119j09324D6741J20812
16283A67553g7114I9805J74269O6241A31106a04391B03498J98664A10848B8085
16272A26035J51357I4705a70317r8497C14603e8022k65907A06093K39572E451
16261A70946a96430f9813D31572B2652e1165G1092i7403A40319K10303A2067M0285
16250E2352Q6632J5204a772F53813c6777K416B34068g2979A94965J34003g1515
16238A27413l3551d746I4488O8863P4575K90269A11114d30960G5145a65715B39215
16226B49340D9580L4773J6095D9670K92340E895J81083o6493P5698K54319a66088
16214C8009K86750E8389a62499M5761A1970K79250H3115d7020B88730n6252E7788
$$ plain form
16202 152926 142994 16 54146 -127925 107133 -34632 253858 13888 160430 135689 186998
16191 186998 -15210 94187 -10498 -19765 463380 -75653 199873 91786 -199356 106553 50423
16179 341872 -263703 -109320 -72968 44589 -153999 216653 131803 411414 -243597 -68804
16168 -29244 -27644 -92486 253519 297233 -104890 147575 219697 -47926 -144118 -37119 -75410
16157 -75410 -59877 -44589 148057 240568 217408 -48799 1995 134386 -132188 150976 248185
16146 248185 -22754 -116368 13542 68562 -408061 44482 -196927 27540 36838 -5360 157265
16134 -87068 -157587 -12276 76132 59563 -418930 157267 -41820 34887 -15240 -193758 279510
16122 -5278 -83209 107645 143073 91870 145746 -290464 -91743 -62585 -292547 -76442 173961
$$ packed form
16202A52926r932A6N4130a27925A07133c4632B53858A3888J46542k4741N1309
16191A86998a5210I4187a0498r267D63380g5653A99873I1786a99356A06553E0423
16179C41872b63703a09320L6352D4589a53999B16653q4850K79611b43597f8804
16168b9244J600o4842B53519M3714a04890A47575P2122d7926r6192c7119l8291
16157g5410J5533J5288A48057R2511k3160d8799A995J32391a32188A50976R7209
16146B48185b2754r3614A3542N5020d08061D4482a96927B7540R298e360A57265
16134h7068p0519a2276G6132j6569d18930A57267d1820C4887a5240j78518B79510
16122e278p7931A07645L5428n1203N3876b90464i1743K9158k29962g6442A73961
$$ plain form
16110 140917 -100236 3622 -262762 -145013 -250478 -113884 476845 -215116 -34917 76269
16099 -293784 -21499 94403 63065 -373276 -181758 41183 -202446 66336 -20404 -22554 -97473
16088 -97473 115778 -52491 172331 -184410 -240297 -75294 -163932 42372 -150747 36956 122092
16077 122092 87205 -67212 47935 -63645 -150361 236333 -143631 168246 -233458 -65832 -396526
16066 -396526 132218 317174 -75443 -4604 -140947 -166302 -240677 317228 -309247 215622
16055 -470676 168170 -246495 -297923 -179469 -130032 -179336 388871 68887 -271955 79505
16044 -192617 179275 -190550 -4298 159990 -201962 21908 -192122 -60989 -70333 -159674 38545
16032 223888 138335 -133682 -100199 34924 52292 -167088 -13623 171419 -58793 -184392 -57604
$$ packed form
16110A40917a00236C622b62762J17749j05465a13884D76845b15116c4917G6269
16099b93784b1499I4403l1338c73276a81758D1183b02446F6336b0404k150p4919
16088i7473A15778e2491A72331a84410n5887g5294q8638D2372a50747C6956Q5136
16077A22092l4887f7212D7935f3645q6716B36333a43631A68246b33458f5832l30694
16066c96526A32218J84956g5443d604j36343k5355p4375C17228c09247B15622
16055d70676A68170b46495n1428J18454M9437m9304C88871F8887b71955G9505
16044a92617A79275a90550d298A59990b01962B1908a92122f0989r344q9341C8545
16032B23888q5553a33682L3483C4924J7368a67088a3623A71419e8793j25599e7604
$$ plain form
16020 -310439 164209 37244 179772 17619 65282 -66890 -299611 -185620 -452885 -109753
16009 -82383 -9235 -290866 417303 80119 52124 402813 -132313 9515 -242734 58927 35789
15998 35789 535 53870 36328 -132918 -4588 -50250 -339163 -65359 124080 268820 34110
15986 69033 90286 -12131 -371914 70861 53926 -80422 10755 191007 216798 -36752 54082
15974 156960 206001 -138383 159466 99790 -104533 292871 317977 182281 98990 159542
15964 159542 386132 -83478 -67674 215079 -5623 21959 -342962 -308525 -114501 -109493 226254
15952 79955 -187021 240534 115259 -39743 -42702 -79693 -165795 153526 70762 -23745 10694
15940 -410652 -325620 143172 -271028 -288871 -275351 -133951 255449 209330 27831 -139996
$$ packed form
16020c10439A64209C7244J42528A7619M7663f6890k32721J13991k67265a09753
16009h2383i235k81631D17303H0119k7995L50689a32313I515b42734E8927k3138
15998C5789E35N3335j7542a32918d588m5662k88913f5359A24080J44740C4110
15986F9033K1253a2131l59783G0861j6935h0422A0755J80252K5791c6752E4082
15974A56960M9041a38383A59466n9676a04533B92871K5106j35696q3291O0552
15964A59542K26590h3478J5804B15079e623B1959c42962L4437a14501N008B26254
15952G9955a87021B40534A15259c9743k959l6991q6102A53526G0762b3745A0694
15940d10652Q5032A43172b71028j7843J3520a33951B55449m6119B7831a39996
$$ plain form
15929 -237359 8310 98002 -193084 -75225 23401 -226600 -201380 188904 -106793 -185871 242037
15917 -133774 -25011 -149989 -116246 137966 -39451 97276 -132928 -172803 -208844 -141743 -351639
15906 -351639 -164661 -309921 -164936 16229 161871 182966 -60630 -169590 178569 119619
15896 119619 -72831 -153789 333850 111631 -261146 -19134 -78316 -169958 -33545 160476 -24716
15884 -169125 -14159 150379 -192259 214648 -211970 173875 -29868 188992 28434 312023
15874 312023 46885 -49706 195497 -67161 93066 -54231 267034 -280666 -104928 85158 -110330
15862 70802 63875 -77253 267666 -102811 -111764 301981 -293799 -49971 -107945 -48267 -60902
15851 -60902 433875 -62010 -74172 -371877 -273606 -196541 194806 34725 219894 -24431 229982
$$ packed form
15929b37359H310Q9692a93084g5225B3401b26600K5220A88904a06793p9078B42037
15917a33774b5011j24978L3743A37966c9451I7276a32928l9875l6041O7101k09896
15906c51639a64661j45260J44985A6229J45642K1095f0630j08960A78569n8950
15896A19619g2831q0958C33850A11631b61146a9134n9182r1642c3545A60476b4716
15884a69125a4159A50379a92259B14648b11970A73875b9868A88992B8434K83589
15874C12023D6885d9706A95497f7161I3066e4231B67034b80666a04928H5158a10330
15862G0802o927g7253B67666a02811q953C01981b93799d9971n7974d8267j2635
15851f0902D33875f2010j2162k97705R8271P7065A94806C4725J85169b4431B29982
$$ plain form
15839 -58185 114684 -286638 203109 -10673 -271220 78236 -63522 -199673 -171709 -1727 -140766
15828 -140766 -64317 1506 -169533 -183779 42391 328534 68233 -29727 -350343 -242852 -519339
15817 -519339 78899 1336 269551 103481 -437617 -93291 295213 -193993 -132279 -161055 103837
15805 -27662 61099 74806 13744 -110957 124016 66973 410581 -195617 -21040 10686 81524
15794 81524 -94733 -315730 -87231 -91585 -240617 64569 -19648 360180 -22968 -116870 -3432
15782 138265 -336205 -210946 -2199 117295 76821 -3028 -222000 -380624 -238286 -274623 -132018
15770 -56162 122927 95941 -13634 -421082 -381814 -169566 -129738 -45507 -413276 -115401 -99879
15759 -99879 -32901 68814 -44468 211669 120067 2451 258966 -173027 -86943 70749 -35665
$$ packed form
15839e8185A14684b86638B03109a0673k60547G8236f3522j36151K7964a727j39039
15828a40766f4317A506a69533j4246D2391K86143F8233b9727l20616J07491k76487
15817e19339G8899A336K68215A03481d37617i3291B95213a93993O1714k8776A03837
15805b7662F1099J3707A3744a10957A24016n7043L43608a95617b1040A0686P0838
15794H1524i4733k20997h7231m354j49032F4569a9648C60180b2968r3902c432
15782A38265c36205J25259b199A17295m0474c028k18972j58624J42338l6337a32018
15770e6162A22927k6986a3634m07448L9268a69566L9828d5507l67769a15401J5522
15759i9879c2901F8814d4468B11669r1602B451K56515a73027Q6084G0749c5665
$$ plain form
15747 -70615 -57524 -111379 223967 249536 -207887 346506 7674 -46608 -166887 238194 -24784
15735 72550 11730 -166260 -22640 -52622 -198749 49782 -55334 -317965 287480 11389 -290339
15723 7993 -96571 96168 -174635 -220731 71564 -90769 -97387 -97392 -97756 54657 -10744 110449 199933
15710 199933 -94873 -205845 -6146 34201 -24762 -84517 358532 198761 183893 -38902 7090
15698 -78679 -216035 35888 -13535 176211 -403729 -150715 36659 247724 58761 230792
15688 230792 -49055 -255389 294831 -54842 27428 50159 295937 66788 113950 77585 -200439
15676 238466 197332 227676 -54054 -13852 202021 73594 6027 -276026 -191314 195274 -51440
15664 -68067 -105956 -160698 -180567 -194714 -311110 -187206 177367 -4071 -80502 110476 -225005
$$ packed form
15747g0615J3091n3855B23967K5569b07887C46506G674d6608j20279B38194b4784
15735G2550A1730a66260b2640k9982j46127D9782e5334k62631B87480A1389b90339
15723G993i6571I6168a74635m6096G1564i0769o618nl64E4657a0744A10449Q9484
15710A99933i4873j10972f146C4201b4762n9755C58532j59771j4868c8902G090
15698g8679j37356C5888a3535A76211d03729a50715C6659K11065E8761J72031
15688B30792d9055k06334B94831e4842B7428K2731K45778F6788M7162l6365b00439
15676B38466m1134L0344e4054a3852B02021G3594F027b76026Q4712A95274e1440
15664f8067l7889n4742j9869j4147j16396J23904A77367d071p6431A10476b25005
$$ plain form
15652 101737 -152807 45905 4206 -199475 -152227 -46771 -229853 -143271 -252580 -149008 -291573
15641 -291573 130275 -30781 290456 -148 -388150 66357 -178012 -58710 -342272 -71822 117079
15629 -62871 164163 -139989 35026 87838 67202 -280915 109750 136543 -200910 130898
15618 8919 87593 15471 -280575 55984 89438 -262773 -33068 156098 -119519 -35036 -12433
15606 14256 -430851 266629 155240 -189416 239307 400041 -181069 -121502 -190572 180435
15595 -32154 -2166 -17864 -448700 37698 -257539 -344307 -155414 66349 -96619 296019 -95477
15583 -173827 39032 260993 -207255 141956 -90320 -83056 302411 21213 39584 -43675 171048
15571 142222 -9846 373753 171701 160967 -320929 10991 81240 191785 -352615 110206
$$ packed form
15652A01737a52807D5905D206a99475M7248d6771j83082Q6582j09309J03572j42565
15641b91573A30275c0781B90456a48l88002F6357a78012e8710k83562g1822A17079
15629f2871A64163a39989C5026N2812k0636b80915A09750K6793b00910A30898
15618H919P8674A5471b80575E5984L3454b62773c3068A56098a19519c5036a2433
15606A4256d30851B66629j11389a89416B39307J60734a81069N9567o9070A80435
15595c2154b166j5698m30836C7698b57539q6768a55414F6349i6619B96019i5477
15583a73827C9032K21961b07255A41956i0320P264C02411B1213J8371d3675A71048
15571A42222i846C73753A71701j0734c20929A0991P0249J10545c52615A10206
$$ plain form
15560 -26721 268889 15028 142610 26946 120394 -88678 114471 -433972 -131081 144855
15549 -331149 -165357 -240000 39817 27498 -15299 -14776 71896 3283 45032 74690 -151575 86690
15536 26515 -145652 -59012 11818 153723 54574 135128 201113 33052 -384846 -317053 11707
15524 11148 -28147 -153404 -203061 -69549 84974 144038 -16234 -92887 -25855 -169178 48657
15512 -177680 50247 6778 153741 112507 164070 137787 119644 114362 -83967 -100514 -500223
15501 -500223 -43238 -170422 -212098 224501 -249328 197541 228939 158563 -11953 127466
15490 -23705 -150975 158368 -96795 73863 -517444 178916 150471 175548 -147439 -204735 -198724
15479 -198724 -333472 -247205 -45119 -266737 14967 -106578 33460 755 -251918 -50391 195113
$$ packed form
15560b6721B68889A5028J27582B6946R3448h8678A14471d33972a31081A44855
15549c31149a65357p4643C9817j2319a5299N23G1896C283M1749K9658a51575H6690
15536B6515a45652e9012A1818J41905E4574Q0554O5985C3052c84846O7793A1707
15524A1148b8147j25257m9657f9549H4974N9064a6234p6653b5855j43323D8657
15512a77680E0247F778J46963m1234N1563k6283j8143n282h3967j6547l99709
15501e00223d3238j27184m1676B24501b49328A97541L1398p0376a1953A27466
15490b3705j27270A58368i6795G3863e17444A78916k8445K5077a47439n7296O011
15479a98724j34748Q6267d5119k21618A4967a06578C3460G55b51918e0391A95113
$$ plain form
15467 122492 78999 36339 14321 87857 163999 338311 -127242 -76848 -27122 -161135 219357
15455 129008 -365554 44569 -109332 234109 262268 -281579 -6950 -203992 43732 34609 -4372
15443 -68962 -206426 134861 -52310 104700 298299 -80121 -210034 141670 -242563 -110322
15432 89048 -275874 -39998 -350206 225966 -133425 -26506 -61088 -337920 199932 -108941
15421 242517 170083 89377 -42220 -14509 199646 -198647 230374 133298 -185645 -130521 302336
15409 19413 -75460 128437 73451 -450266 -128787 83123 11171 -86527 -88707 235685 -173513
15397 52487 -184671 3775 222197 70864 55709 120941 1522 173057 132023 32363 -172978
15385 -128748 25894 26491 -17156 -8177 -93619 98248 86696 83937 90885 -42455 323134 -194887
$$ packed form
15467A22492m3493C6339A4321P3536P6142J74312a27242N0394b7122j34013B19357
15455A29008c65554D4569a09332B34109K8159b81579f950j97042D3732r123d372
15443f8962j37464A34861e2310A04700J93599h0121j29913A41670b42563a10322
15432H9048b75874c9998l10208B25966a33425b6506l4582k76832A99932a08941
15421B42517p2434q0706d2220a4509A99646a98647B30374r7076a85645N5124C02336
15409A9413g5460A28437n4986d50266a28787H3123A1171h6527k180B35685a73513
15397E2487a84671C775K18422G0864j5155O5232A522J71535m1034C2363a72978
15385a28748B5894N97a7156h177q5442I8248j1552k759O948d2455C23134a94887
$$ plain form
15372 105471 68581 -65070 194798 -79609 -170621 -89182 139805 -123860 -75954 116151 341562
15361 341562 413258 -21947 -89422 -274236 -1709 -193334 -194040 146930 -26413 -231010 90852
15349 -136408 13705 251685 362499 141 88115 116305 -114848 -27751 -21994 -293673 1697
15337 -184320 -182143 -76373 327685 229689 25030 -180254 131202 -61021 36424 -17854 98555
15325 -151892 -10293 247354 171501 -151124 97797 87782 -465399 25174 8375 -23155 136111
15313 4275 -418039 -153922 337748 -92112 -53094 168027 243248 394305 217883 18377 409200
15302 409200 149462 -43155 204919 309402 -125645 510185 64923 251474 292449 -72189
15291 147169 266543 208159 -91612 -44100 -69295 411 268044 -132733 339396 -14824 176416
$$ packed form
15372A05471l6890f5070A94798g9609r1012Q1439A39805a23860M7906A16151K25411
15361C41562P1696b1947o7475j84814a709j91625p06A46930b6413k04597I0852
15349a36408A3705K37980J10814A41Q7974K8190a14848b7751N757k71679A697
15337a84320K177g6373C27685r7996B5030a80254A31202f1021C6424a7854I8555
15325a51892a0293B47354p5853a51124I7797j0015d65399B5174H375b3155A36111
15313D275d18039a53922C37748i2112L9018A68027P5221J51057j76422A8377L90823
15302D09200A49462d3155B04919J04483a25645E10185F4923J86551M0975g2189
15291A47169J19374n8384i1612d4100k5195D11K67633a32733C39396a4824A76416
$$ plain form
15279 -186214 158598 246570 73522 6806 41832 -74566 5001 -31689 -52093 68902 139999 -74373
15266 258714 -157906 305648 -394497 -48715 166207 -108226 167205 -111312 135634 296837
15256 296837 33870 15822 22985 323667 -453268 -17922 -89416 -55018 330105 211396 -75549
15244 100624 86276 65366 334637 70500 -60284 107152 219128 107557 545275 488297
15234 488297 444583 983457 1511307 1644718 1374087 1294771 856387 674045 477603 438840
15224 438840 -126469 172395 10551 570429 282693 261449 226983 -32554 -16966 -49616 170024
15212 108628 -139536 124414 -31693 359601 422390 -114471 39881 -19083 -14985 -262443 178219
15200 -140 -212396 17553 -290147 144133 314256 413948 47440 33868 311807 100076 105193
$$ packed form
15279a86214A58598Q7972G3522F806L5026g4566E001c1689k0404F8902P1097g4373
15266B58714a57906C05648c94497d8715A66207a08226A67205a11312A35634J61203
15256B96837C3870A5822P163L00682d53268a7922p1494L4398C30105j18709g5549
15244A00624j4348k0910K69271G0500f0284A07152J11976A07557M37718n6978
15234D88297m3714N38874N27850J33411k70631p9316m38384j82342j96442l8763
15224D38840a26469A72395A0551N59878B82693k1244l4466c2554J5588l2650A70024
15212A08628a39536A24414c1693C59601O2789a14471C9881a9083M098k47458A78219
15200a40k12256A7553b90147A44133J70123R9692D7440j3572K77939A00076N117
$$ plain form
15189 105193 70510 113774 58243 152027 755 67206 61198 -278579 89751 224916 -135834
15177 246910 12178 -58153 160834 327701 166355 80978 -116657 -292786 238766 -168466
15166 108879 -163899 105038 184776 -121662 87406 182586 206287 42220 60651 142601 358457
15155 358457 -159544 87485 105986 -218069 222457 20627 315171 -59933 11514 -88445 -223065
15144 -223065 90256 142922 90992 281350 -176019 46111 52772 -4351 -24630 135764 398563
15133 398563 -92797 272360 415265 -96921 56735 349736 64767 -153662 45519 438224
15123 438224 87256 233206 123677 138520 227243 269729 975 221183 56767 268050 241100
15112 241100 565780 185779 67096 72335 -48762 251267 -65257 -64093 177657 218823 61695
$$ packed form
15189A05193l4683M3264n5531R3784G55O6451o008b78579H9751J35165a35834
15177B46910A2178e8153A60834J66867j61346H0978a16657j76129B38766a68466
15166A08879a63899A05038P9738a21662H7406R5180K3701D2220J8431Q1950K15856
15155C58457a59544H7485J8501b18069B22457B0627K94544e9933A1514h8445j34620
15144b23065I0256N2666n1930J90358a76019D6111O661d351k0279A35764K62799
15133C98563i2797B72360J42905i6921E6735K93001F4767a53662D5519L92705
15123D38224H7256J45950j09529J4843Q8723M2486I75K20208E6767K11283k6950
15112B41100L24680A85779F7096N239d8762B51267f5257J164A77657M1166F1695
$$ plain form
15100 30673 85699 107764 261132 203250 -31514 -116022 -6065 295340 282812 352313 -33371
15088 222949 329510 216964 177538 102403 354573 305282 285588 -69436 203019 263898 39088
15076 -41717 91290 123138 286751 158039 346048 372536 -79835 -154973 -205266 389223 26973
15064 177715 415008 1865 -105064 -129876 403733 299327 -67804 277606 -171810 227251
15053 293540 136735 441435 426674 60018 20251 88351 603030 919 148903 344332 293026
15042 293026 234904 143329 384515 -41677 385411 307083 56633 283045 53944 200576 201592
15031 201592 157452 320743 139171 564083 -18826 -101484 166647 236358 211780 -12561 183370
15019 194048 219571 258182 -95381 222216 470407 178573 484137 -147440 -79358 176561
$$ packed form
15100C0673N5026K2065J53368n7882c1514q4508f065B95340j2528O9501c3371
15088B22949J06561j12546l9426p5135K52170m9291j9694f9436B03019O0879C9088
15076d1717I1290L1848J63613j28712J88009K6488g9835p5138n0293C89223B6973
15064A77715K37293A865a05064k4812D03733j04406f7804B77606a71810B27251
15053B93540A36735L04700j4761F0018B0251O8100N14679I19J47984J95429n1306
15042B93026n8122r1575K41186d1677C85411p8328E6633K26412E3944J46632J016
15031B01592m4140J63291A39171M24912a8826q2658A66647O9711k4578a2561A83370
15019A94048K5523L8611i5381B22216K48191A78573L05564a47440O8082A76561
$$ plain form
15008 528521 250839 362766 205572 126872 325040 301125 518611 380878 254176 -135588
14997 66492 280338 190960 -20170 636242 205217 347849 472225 242318 20135 -27910
14986 103342 547416 376036 158240 304188 159738 213791 569199 -117208 268264 148336
14976 148336 306010 481659 597527 92722 375481 188163 527591 133085 125694 240279
14966 240279 241844 447720 366539 153070 182615 375133 339032 367954 362721 304032 93186
14954 204503 121862 169244 272795 80520 82799 248435 207388 139622 300212 339181 481977
14943 481977 206330 363113 393204 210021 -69028 588750 703960 246984 224704 327806
14933 327806 470746 287044 406345 494224 51151 417171 404457 170109 434195 232236
$$ packed form
15008E28521B50839J11927j57194p8700J98168k3915K17486j37733j26702a35588
14997F6492K13846q9378b0170F36242B05217J42632J24376k29907B0135b7910
14986A03342M44074j71380A58240J45948j44450N4053L55408a17208B68264j19928
14976A48336J57674J75649J15868I2722K82759j87318L39428A33085p391J14585
14966B40279J565K05876q1181A53070K9545J92518l6101K8922n233n8689I3186
14954B04503q2641M7382J03551H0520K279J65636m1047o7766J60590L8969J42796
14943D81977B06330J56783L0091j83183f9028E88750J15210B46984k2280J03102
14933C27806J42940j83702J19301Q7879E1151L66020j2714A70109K64086k01959
$$ plain form
14923 232236 343263 176758 284558 324163 155733 438217 316573 228642 315485 65340
14912 217872 220911 386813 242475 362071 318380 -121574 290512 458375 272803 282719
14902 282719 -274618 160407 355471 175215 300353 248800 443992 120278 489326 233173
14891 486796 301593 287660 -8077 798844 247413 377970 133789 625092 268171 573620
14881 573620 415408 60723 330462 469843 387592 233305 330013 312825 633763 320808
14871 320808 608878 -68399 324405 517991 80157 677588 616356 237001 242093 487698
14861 487698 149263 131486 131274 548865 356050 425987 373589 253098 -81203 254954 390264
14850 390264 526288 614984 265256 542080 236470 460942 389831 445663 418723 605671
$$ packed form
14923B32236J11027j66505J07800L9605A55733K82484j21644q7931Q6843F5340
14912B17872L039J65902j44338J19596m3691a21574B90512J67863j85572R916
14902B82719b74618A60407J95064A75215J25138n1553J95192A20278L69048B33173
14891D86796j85203j3933h077G98844B47413J30557A33789M91303B68171L05449
14881E73620j58212F0723K69739J39381q2251j54287R6708j7188L20938l12955
14871C20808K88070f8399C24405J93586H0157N97431o1232B37001N092K45605
14861D87698A49263j7777k12M17591j92815O9937n2398j20491h1203B54954J35310
14850C90264J36024Q8696B65256K76824B36470K24472p1111N5832k6940J86948
$$ plain form
14840 605671 470939 344747 417336 516660 200542 505091 330637 404768 251062 675773
14830 675773 463191 435102 546007 517471 481521 456116 408849 239277 371600 328745 445270
14819 445270 400213 460757 650345 219625 445918 330811 318164 481641 485350 245241
14809 245241 629896 374549 466366 363250 407458 507707 504930 273485 783915 169341
14798 412406 506830 136226 104731 495554 522913 583678 383125 383321 550827 720449 567536
14787 567536 507242 175441 337701 684253 499093 512971 633097 641050 662847 616036 619588
14776 619588 656760 544290 951755 378099 585469 448377 650752 462405 572754 907475
14766 907475 538722 478181 651373 661005 555784 909790 692447 524323 640476 663157
$$ packed form
14840F05671j34732j26192P2589R9324B00542L04549j74454P4131j53706M24711
14830F75773k12582k8089J10905k8536l5950k5405m7267j69572J32323m2855J16525
14819D45270m5057O0544J89588B19625K26293j15107j2647J63477L709k40109
14809B45241L84655k55347R1817j03116M4208J00249k777k31445N10430A69341
14798D12406R4424A36226l1495L90823K7359O0765k00553J96J67506J69622j52913
14787E67536o0294A75441J62260L46552j85160J3878J20126P953K1797m6811L552
14776F19588L7172j12470M07465C78099K07370j37092K02375j88347J10349L34721
14766I07475l68753o0541J73192R632j05221L54006k17343j68124J16153K2681
$$ plain form
14756 663157 290701 589425 924469 450815 849919 348051 646390 660566 626428 527532
14746 527532 788016 511040 659768 358832 823691 739705 529548 908498 532921 890819
14736 890819 786057 651856 811611 1026079 683849 722404 839370 801440 775741 583512
14726 583512 626090 783614 960689 699462 1070471 297778 810635 1011503 493409 765227
14716 765227 692680 802929 866397 954515 908455 982259 992215 683550 698187 817862 473374
14705 473374 596067 914458 1028647 1178761 874851 880572 886002 689583 994222 802950
14695 802950 919764 802742 814014 1026320 579334 619528 661130 706526 959269 828666
14685 828666 974981 964106 1237554 1018974 1099608 1103673 1123155 805641 888795 1064529 791989
$$ packed form
14756F63157B90701K98724L35044D50815L99104C48051K98339J4176l4138r8896
14746E27532K60484k76976J48728l00936M64859q3986k10157L78950l75577L57898
14736H90819j04762j34201J59755K14468l42230L8555J16966l7930k5699j92229
14726E83512M2578J57524J77075k61227L71009B97778N12857K00868D93409K71818
14716G65227p2547J10249O3468Q8118m6060P3804R956l08665J4637J19675l44488
14705D73374J22693L18391J14189J50114l03910N721N430j96419L04639j91272
14695H02950J16814j17022J1272K12306m46986M0194M1602M5396K52743j30603
14685H28666J46315j0875K73448k18580Q0634M065J9482l17514Q3154J75734k72540
$$ plain form
14674 791989 806723 803995 849660 1114053 801747 1046902 1339731 809944 1117407 1188028
14664 1188028 1033388 976070 1370176 1243232 663746 1190679 1385542 1086339 1026651 1130159
14654 1130159 809018 1374157 1111806 876372 1382968 1142662 1306328 754731 1314574
14645 1314574 1308302 1437756 1089464 1185329 1172998 1395597 1089070 1182165 1160194 1192358 1165339
14634 1165339 1436249 1008307 1270297 991061 1106700 1447895 1612748 1390071 1350206 1337912
14624 1337912 1137824 1366283 1284926 1561507 1255974 1785145 1638805 1182385 1555306 1764716
14614 1764716 1412862 1399235 1130078 1628476 1495336 1343632 1363719 1375884 1419142 1458598
14604 1458598 1488143 1532298 1692317 1342467 1556587 1473211 1684775 1628497 1668386 1556727
$$ packed form
14674G91989J4734k728M5665K64393l12306K45155K92829n29787L07463P0621
14664A188028j54640n7318L94106j26944n79486N26933J94863k99203n9688J03508
14654A130159l21141N65139k62351k35434N06596k40306J63666n51597N59843
14645A314574o272J29454l48292R5865j2331K22599l06527R3095k1971L2164k7019
14634A165339K70910m27942K61990k79236J15639L41195J64853k22677l9865j2294
14624A337912k00088K28459q1357K76581l05533N29171j46340m56420L72921K09410
14614A764716l51854j3627k69157M98398j33140j51704K0087J2165M3258L9456
14604A458598K9545M4155J60019l49850K14120q3376K11564n6278L9889j11659
$$ plain form
14594 1556727 1368866 1260553 1404570 1660342 1717068 1836113 1703403 1631067 1948731 1990453
14584 1990453 1641675 1640803 1725369 1888456 2043472 1907412 1910172 1727093 1617606 1725158
14574 1725158 1704777 1974661 2268584 1696434 1960093 1800344 2214700 1946256 2015201 1839394
14564 1839394 2101421 2229127 2051229 2058522 2059269 2117932 2044669 2392885 2031196 2554901 2503333
14553 2503333 2454351 2566962 2713814 2644205 2898101 2658777 2652926 2923929 2985782 3425225
14543 3425225 3070202 3368014 3755608 3890346 4605986 5001142 5665110 6585215 7857556
14534 7857556 10768049 15420427 23151285 30488057 27489977 18315319 13603625 10060742
14526 10060742 6998197 4687737 3639781 3159475 2946044 2966886 2356383 2540789 2395838
$$ packed form
14594A556727j87861j08313J44017K55772N6726J19045j32710p2336L17664M1722
14584A990453l48778q72Q4566J63087J55016j36060K760j83079j09487J07552
14574A725158k0381K69884K93923n72150K63659j59749M14356k68444O8945j75807
14564A839394K62027J27706j77898P293P47N8663p3263L48216l61689N23705n1568
14553B503333m8982J12611J46852o9609K53896k39324n851K71003O1853M39443
14543C425225l55023K97812L87594J34738P15640L95156O63968R20105J272341
14534G857556K910493M652378P730858P336772k998080r174658m711694l542883
14526A0060742l062545k310460j047956m80306k13431K0842o10503J84406j44951
$$ plain form
14517 2395838 2107409 2247179 2469138 2334668 2286942 2346153 2516238 2259641 2480061 2922269
14507 2922269 2426499 2513871 2783076 2588729 2928790 2704015 2666891 2545035 3007066 3014328
14497 3014328 2867981 3046584 2958894 2980312 2812724 3000989 2908411 3453539 3057259 3040360
14487 3040360 2732502 3271861 3264306 3422706 2984285 3416852 3289329 3424681 3406744 3115114
14477 3115114 3737295 3356329 3583956 3488950 3874862 3896374 3789915 3744649 3688019 3979067
14467 3979067 4152831 3783544 3984191 4290127 3855832 4213601 4481166 4478397 4421907 4321778
14457 4321778 4553027 4755965 4513338 4571331 4566731 4769497 4739728 4468214 4937119 4598502
14447 4598502 4878958 5266793 5244189 4995528 5211037 5274148 5267096 5325214 5868174 5532900
$$ packed form
14517B395838k88429J39770K21959j34470m7726N9211J70085k56597K20420M42208
14507B922269m95770Q7372K69205j94347L40061k24775l7124j21856M62031P262
14497C014328j46347J78603q7690K1418j67588J88265r2578N45128l96280j6899
14487C040360l07858N39359p555J58400m38421M32567j27523J35352j7937k91630
14477C115114O22181l80966K27627r5006L85912K1512j06459m5266n6630K91048
14467C979067J73764l69287K00647L05936m34295L57769K67565k769n6490j00129
14457D321778K31249K02938k42627N7993m600K02766k9769k71514M68905l38617
14447D598502K80456L87835k2604k48661K15509O3111p052N8118N42960l35274
$$ plain form
14437 5532900 5437107 5671164 5647961 5578047 5850407 5792273 6086350 6227932 6143057 6047927
14427 6047927 6509405 6381700 6950826 6855850 6695566 6883793 6643821 6756264 6907942 7297951
14417 7297951 7167932 7160000 7332203 7587440 7624247 7673809 7742342 7739533 7886981 8355081 8022483
14406 8022483 8171735 8652842 8509112 8686818 8553438 8927294 9095762 9335208 9455542
14397 9455542 9465933 9477456 9724106 10206372 9675568 10082869 10569717 10463380 10776205 11016980
14387 11016980 10938606 11076136 11345485 11405165 11799355 11549571 11963113 12197079 12390045 12471356
14377 12471356 13103502 13249664 13285502 13618137 13672492 14028167 14268467 14494544 14812543 14836415
14367 14836415 15274932 15601178 15750827 15766068 16606298 16879137 16747623 17211932 17344368
$$ packed form
14437E532900r5793K34057k3203o9914K72360n8134K94077J41582q4875r5130
14427F047927M61478j27705N69126r4976j60284J88227k39972J12443J51678L90009
14417G297951j30019p932J72203K55237L6807M9562O8533k809J47448M68100l32598
14406H022483J49252M81107j43730J77706j33380L73856J68468K39446J20334
14397I455542J0391J1523K46650M82266n30804M07301M86848j06337L12825K40775
14387A1016980p8374J37530K69349N9680L94190k49784M13542K33966J92966Q1311
14377A2471356O32146J46162L5838L32635N4355L55675K40300K26077L17999K3872
14367A4836415M38517L26246J49649J5241Q40230K72839j31514M64309J32436
$$ plain form
14358 17344368 17999045 18369184 18846909 19033908 19288798 19863183 20451034 20427942 21165501
14349 21165501 21480417 22076923 22552293 22812470 23783365 23568028 24666342 25235193 26006008
14340 26006008 26282617 26624699 27594174 28114555 28850654 29836230 30415151 31119512 31681368
14331 31681368 32717446 33711160 34613982 35000474 36504924 37313080 38451044 39296649 40823940
14322 40823940 41397652 42760372 44273279 45476006 46700410 48716822 49595741 51555608
14314 51555608 53145136 54471035 56573687 58240371 60203667 62268938 64465283 66501652
14306 66501652 68873636 71107530 74177695 76589368 79506771 82931405 85869375 89254236
14298 89254236 92858231 96717908 100018498 104490376 108996514 113612368 118357720 123630832
$$ packed form
14358A7344368O54677L70139M77725J86999K54890N74385N87851k3092P37559
14349B1165501L14916N96506M75370K60177R70895k15337J098314N68851P70815
14340B6006008K76609L42082R69475N20381P36099R85576N78921P04361N61856
14331C1681368J036078R93714R02822L86492J504450Q08156J137964Q45605J527291
14322D0823940N73712J362720J512907J202727J224404K016412Q78919J959867
14314E1555608J589528J325899K102652J666684J963296K065271K196345K036369
14306F6501652K371984K233894L070165K411673K917403L424634K937970L384861
14298H9254236L603995L859677L300590M471878M506138M615854M745352N273112
$$ plain form
14290 123630832 129405991 135373135 141394080 148003091 154977263 162559625 170340781 179003244
14282 179003244 187431572 196651439 206597985 216847872 227453930 239101207 251025609
14275 251025609 263916551 277221745 290780604 305046393 319303674 333710261 347174798
14268 347174798 360718984 374265547 387087934 399334421 410980197 421635165 431871885
14261 431871885 441051255 449437087 455593568 458179739 459511065 460380905 458541723 454398746
14253 454398746 448906865 442312988 437732228 432138008 424630228 413881072 400823981 386765218
14245 386765218 372854913 358952848 344893844 330725144 317142517 303624671 290533571
14238 290533571 277501343 265537523 253048365 241577272 229999206 219012178 208941346
$$ packed form
14290A23630832N775159N967144O020945O609011O974172P582362P781156Q662463
14282A79003244Q428328R219867R946546J0249887J0606058J1647277J1924402
14275B51025609J2890942J3305194J3558859J4265789J4257281J4406587J3464537
14268C47174798J3544186J3546563J2822387J2246487J1645776J0654968J0236720
14261D31871885R179370Q385832O156481K586171J331326Q69840j839182m142977
14253D54398746n491881o593877m580760n594220p507780j0749156j3057091j4058763
14245C86765218j3910305j3902065j4059004j4168700j3582627j3517846j3091100
14238B90533571j3032228j1963820j2489158j1471093j1578066j0987028j0070832
$$ plain form
14231 208941346 199018478 189815934 180557933 172047572 163880472 155850051 148397823 141776359
14223 141776359 135280867 129307149 123563893 118142016 113070984 108211847 103939487 99922534
14215 99922534 95661682 91967510 88242578 85039035 81631139 78502446 75912717 72892951
14207 72892951 70618420 68147232 65643094 63430951 61305159 59436028 57500561 55768193
14199 55768193 53891884 52585306 51189165 49168410 47742845 46460807 45177025 44070851
14191 44070851 42805870 41660505 40435458 39270211 38367154 37229705 36622141 35568004
14183 35568004 34604110 33368089 32630899 31665335 31038142 30424029 29263255 28720464 27994251
14174 27994251 27405991 26631356 26197131 25515449 24912861 24580129 23930372 23289582 23101403
$$ packed form
14231B08941346r922868r202544r258001q510361q167100q030421p452228o621464
14223A41776359o495492n973718n743256n421877n071032m859137m272360m016953
14215I9922534m260852l694172l724932l203543l407896l128693k589729l019766
14207G2892951k274531k471188k504138k212143k125792j869131j935467j732368
14199E5768193j876309j306578j396141k020755j425565j282038j283782j106174
14191D4070851j264981j145365j225047j165247r03057j137449o07564j054137
14183C5568004r63894j236021p37190r65564o27193o14113j160774n42791p26213
14174B7994251n88260p74635m34225o81682o02588l32732o49757o40790j88179
$$ plain form
14165 23101403 22366524 21984487 21386601 20980183 20347846 19931182 19672803 19217507 18986262
14156 18986262 18724346 18231929 17764175 17826495 16934578 16664886 16679582 16429000 16002739 15715560
14146 15715560 15562571 15312952 15214884 14581436 14510879 14512700 14146397 14002132 13600186 13332376
14136 13332376 12972215 12842232 12934863 12511475 12523006 12181485 11911330 11649077 11452161 11458711
14126 11458711 11186168 11141445 10597698 10835754 10584616 10453852 10096188 9921357 10077343
14117 10077343 9586445 9722321 9461895 9399014 9466815 9043966 9101371 9040205 8821425 8765948
14107 8765948 8497070 8334708 8250356 8096642 8056328 8133759 7930251 7823914 8013951 7936676
14097 7936676 7392370 7524141 7502603 6972397 7031005 7002266 6975914 6714622 6851945 6597273
$$ packed form
14165B3101403p34879l82037n97886m06418o32337m16664k58379m55296k31245
14156A8986262k61916m92417m67754O2320q91917k69692J4696k50582m26261k87179
14146A5715560j52989k49619r8068o33448p0557J821l66303j44265m01946k67810
14136A3332376l60161j29983R2631m23388J1531l41521k70155k62253j96916O550
14126A1458711k72543m4723n43747K38056k51138j30764l57664j74831J55986
14117A0077343m90898J35876k60426o2881O7801m22849N7405o1166k18780n5477
14107H765948k68878j62362q4352j53714m0314P7431k03508j06337J90037p7275
14097G936676n44306J31771k1538n30206N8608k8739k6352k61292J37323k54672
$$ plain form
14087 6597273 6992218 6262518 6188300 6533917 6157278 6159497 6159614 6199034 6099391 5981566 6010424
14076 6010424 5863019 5898667 5792470 5608342 5658382 5299955 5432948 5333910 4962557 4918560
14066 4918560 5048219 5344250 4985884 4962428 5208148 5057781 4989543 4839040 4808939 4926895
14056 4926895 4534711 4483199 4692754 4596701 4717535 4551583 4569362 4534645 4165981 4297876
14046 4297876 4246216 4542405 4221654 4431231 4082659 4483404 3836412 4108416 4208512 3784466
14036 3784466 4124446 3834000 3905329 3792897 3410711 3700871 3657258 3520733 3544158 3565147
14026 3565147 3517654 3451393 3467899 3646520 3212728 3607675 3425496 3496607 3434215 3171544
14016 3171544 3192446 3266278 3323669 3162202 3082376 2968107 3267399 3020642 3130556 2979798
$$ packed form
14087F597273L94945p29700p4218L45617l76639K219J17L9420r9643j17825K8858
14076F010424j47405L5648j06197j84128N0040l58427J32993r9038l71353m3997
14066D918560J29659K96031l58366k3456K45720j50367o8238j50503l0101J17956
14056D926895l92184n1512K09555r6053J20834j65952J7779l4717l68664J31895
14046D297876n1660K96189l20751K09577l48572M00745o46992K72004J00096m24046
14036C784466L39980k90446P1329j12432l82186K90160m3613j36525K3425K0989
14026C565147m7493o6261J6506J78621m33792L94947j82179P1111o2392k62671
14016C171544K0902P3832N7391j61467p9826j14269K99292k46757J09914j50758
$$ plain form
14006 2979798 2974927 2669485 2497975 2661513 2809150 2625389 2670080 2953527 2475221 2830748
13996 2830748 2412551 2652797 2763822 2615255 2619049 2435127 2696764 2541327 2401952 2607951
13986 2607951 2580329 2554045 2447951 2763937 2672220 2438090 2844802 2875915 3064622 3287048
13976 3287048 4113909 4954472 7026911 11048983 18334192 28244108 28916599 20634579 15133166
13967 15133166 11408033 8717047 6571911 5307612 4366423 4211863 3828925 3557233 3533456
13958 3533456 3309904 3100575 3098065 2860581 2774648 2845397 2937436 2793485 2589641 2478298
13948 2478298 2381085 2568933 2530687 2205069 2244214 2237002 2129311 1788950 2137586 2242955
13938 2242955 2221531 2072587 2055922 1874780 1883877 2073619 2148914 1870723 1898869 1839957 2230737
$$ packed form
14006B979798m871l05442j71510J63538J47637j83761M4691K83447m78306L55527
13996B830748m18197K40246J11025j48567L794j83922K61637j55437j39375K05999
13986B607951k7622k6284j06094L15986r1717k34130M06712L1113J88707K22426
13976C287048Q26861Q40563K072439M022072P285209R909916O72491q282020n501413
13967A5133166l725133k690986k145136j264299r41189j54560l82938k71692k3777
13958C533456k23552k09329k510k37484q5933P0749R2039j43951k03844j11343
13948B478298r7213J87848l8246l25618L9145p212j07691l40361L48636J05369
13938B242955k1424j48944j6665j81142R097J89742P5295k78191K8146n8912L90780
$$ plain form
13927 2230737 1653958 1643852 1963895 1928354 1911794 1939810 2115567 1661011 1736956 1785692
13917 1785692 2077330 1815499 1581786 1542963 1613491 1948313 1504655 1561758 1521371 1797990
13907 1797990 1714414 1852114 1868742 1631747 1810716 2034880 1543748 1244051 1530091 1653439
13897 1653439 1672124 1512133 1486969 1725088 1682207 1496141 1588703 2102992 1869803 1208920
13887 1208920 1511438 1349226 1304207 1303548 1494612 1482817 1690376 1498200 1380872 1302043
13877 1302043 1480186 1670569 1502492 1198846 1365897 1523926 1219045 1291014 1422192 1122420
13867 1122420 1516651 1350089 1229939 1223367 1123988 1265398 1033489 1000076 1173529 1050563
13857 1050563 1391474 1121098 1108666 1013654 1602300 1274031 1405317 1091956 1163490 1665308
$$ packed form
13927B230737n76779j0106L20043l5541j6560K8016J75757m54556P5945M8736
13917A785692K91638k61831k33713l8823P0528L34822m43658N7103m0387K76619
13907A797990q3576J37700J6628k36995J78969K24164m91132k99697K86040J23348
13897A653439J8685j59991k5164K38119m2881j86066R2562N14289k33189o60883
13887A208920L02518j62212m5019o59J91064j1795K07559j92176j17328p8829
13877A302043J78143J90383j68077l03646J67051J58029l04881P1969J31178k99772
13867A122420L94231j66562j20150o572r9379J41410k31909l3413J73453j22966
13857A050563L40911k70376j2432r5012N88646l28269J31286l13361P1534N01818
$$ plain form
13847 1665308 1087335 816136 1432326 1349302 1396258 870259 1046053 1394741 969972 1289989
13837 1289989 1131795 965088 1132704 1109881 1184086 1118955 1173135 1047268 1159382 878272
13827 878272 1206769 1247953 1155975 910031 1078953 985573 1015219 1172623 1051660 895572
13817 895572 1187727 453328 1095357 952642 1079422 957034 788625 1070134 796540 1069083
13807 1069083 1061490 1017160 1182605 757353 1139758 692863 644730 1167774 741010 1094986
13797 1094986 812699 601771 818257 883400 997806 857594 1032499 943187 1156134 842833
13787 842833 783763 620899 866435 838237 507570 1010843 622456 512949 522113 716121
13777 716121 1090501 1020797 796817 413129 897867 824403 1075092 794285 839436 875617
$$ packed form
13847A665308n77973k71199O16190q3024M6956n25999J75794L48688m24769L20017
13837A289989j58194j66707J67616k2823P4205o5131N4180j25867J12114k81110
13827H78272L28497M1184r1978k45944J68922r3380K9646J57404j20963j56088
13817H95572K92155D53328O42029j42715J26780j22388j68409K81509k73594K72543
13807A069083p593m4330J65445m25252L82405m46895m8133N23044m26764L53976
13797A094986k82287k10928K16486O5143J14406j40212J74905q9312K12947l13301
13787H42833n9070j62864K45536k8198l30667N03273l88387j09507R164J94008
13777G16121L74380o9704k23980l83688M84738p3464K50689k80807M5151L6181
$$ plain form
13767 875617 799155 584632 954718 1105186 817830 975995 646005 867503 493317 766416
13757 766416 834083 407398 751350 716454 382963 315497 1006236 707483 397152 809647
13747 809647 1008682 464480 760981 500222 610381 815823 792216 1086968 571648 700075
13737 700075 648135 673593 469473 822188 329283 576695 437666 443349 900781 927753
13727 927753 468628 637408 576625 849097 502431 829149 689514 741696 591437 360122
13717 360122 677571 695111 724818 849350 506012 257847 661423 540768 536831 880205
13707 880205 602108 713095 467321 733954 574338 339310 579730 483405 487091 553062
13697 553062 679475 461617 581693 888292 657378 562557 812452 339440 420923 423651
$$ packed form
13767H75617p6462k14523L70086J50468k87356J58165l29990K21498l74186K73099
13757G66416O7667D07398L43952l4896l33491o7466O90739k98753l10331M12495
13747H09647J99035D64480K96501k60759J10159K05442k3607K94752n15320J28427
13737G00075n1940K5458k04120L52715C29283K47412j39029N683M57432K6972
13727I27753m59125J68780o0783K72472l46666L26718j39635N2182j50259k31315
13717C60122L17449J7540K9707J24532l43338k48165M03576j20655l937L43374
13707H80205k78097J10987k45774K66633j59616k35028K40420r6325L686O5971
13697E53062J26413k17858J20076L06599k30914r4821K49895C39440Q1483K728
$$ plain form
13687 423651 533426 705008 230053 323906 643327 608730 250990 265697 448472 237793
13677 237793 487241 419450 659182 466106 762464 470544 343263 530998 378144 428550
13667 428550 596486 379222 387330 665042 628542 543280 720593 324904 638793 223825
13656 635048 654556 275183 416472 519372 600665 479963 511570 268694 436867 633196
13646 633196 517959 504322 637886 371263 630943 240346 428359 341910 650651 404469
13636 404469 787534 474817 348294 356163 358063 539148 419839 470471 415419 543843 192761
13624 490683 636416 457925 208353 618548 306071 235882 383688 505738 303231 477531
13614 477531 306294 409183 598686 495906 382200 440851 198423 490710 269378 513074
$$ packed form
13687D23651J09775J71582B30053R3853L19421l4597B50990J4707J82775k10679
13677B37793K49448o7791K39732j93076K96358k91920j27281J87735j52854N0406
13667D28550J67936k17264Q108K77712l6500q5262J77313C24904L13889B23825
13656F35048J9508B75183J41289J02900Q1293j20702L1607k42876J68173J96329
13646F33196j15237j3637J33564k66623K59680B40346J88013q6449L08741k46182
13636D04469L83065l12717j26523P869J900J81085j19309N0632n5052J28424A92761
13624D90683J45733j78491B08353M10195C06071p0189J47806J22050k02507J74300
13614D77531j71237J02889J89503j02780j13706N8651A98423K92287k21332K43696
$$ plain form
13604 513074 133281 424228 621429 539586 505741 500444 596705 427235 517470 374933 353902
13593 353902 439633 423740 -30462 558933 349770 301075 278705 607251 396992 509060
13583 509060 454295 442601 488007 274392 299331 691925 753285 260493 323318 365726 137979
13571 770834 173372 266200 572918 114761 114720 205376 203335 184992 59009 123589 421335
13560 421335 347951 253325 445748 398637 229419 151876 502416 616958 256816 545707
13550 545707 305878 187445 364483 282146 157220 556419 331263 398833 299935 286908
13540 286908 243211 326161 199503 576317 332669 572872 -47307 298311 -72288 309807
13529 305268 448082 -240045 426614 576922 224551 227952 282747 356634 365387 537438 424932
$$ packed form
13604E13074A33281K90947J97201q1843l3845n297R6261j69470R0235j42537k1031
13593C53902Q5731j5893c0462E58933k09163m8695k2370L28546k10259J12068
13583E09060n4765j1694M5406k13615K4939L92594O1360B60493O2825M2408A37979
13571G70834A73372R2828L06718A14761m1R0656k041j8343E9009O4580K97746
13560D21335p3384r4626J92423m7111j69218p7543L50540J14542B56816K88891
13550E45707k39829j18433J77038q2337j24926L99199k25156O7570r8898j3027
13540B86908m3697Q2950j26658L76814k43648K40203d7307B98311g2288C09807
13529C05268J42814b40045D26614J50308B24551L401N4795P3887Q753J72051j12506
$$ plain form
13518 424932 306965 264873 204309 326540 544523 305018 259318 169670 535228 344019
13508 344019 219604 414047 337513 258213 21102 -25802 219151 270241 256855 167805 345087
13497 345087 247242 424397 287599 150184 221218 665796 558355 199298 454837 411936
13487 411936 210856 213366 518489 33404 107212 205020 293626 269415 87332 140831 253078
13476 253078 574351 317493 657911 145132 321341 214231 316757 264511 475494 147913
13465 446484 316457 472680 365768 248919 304011 -138589 415327 406201 352525 626371
13455 626371 176875 397684 191496 421857 -42417 -32299 209753 244744 399371 408513
13445 408513 339955 -69738 -23678 299229 399847 30399 54197 306733 131665 83617 531390
$$ packed form
13518D24932j17967m2092o0564J22231K17983k39505m5700q9648L65558j91209
13508C44019j24415J94443p6534p9300B1102b5802B19151N1090j3386q9050J77282
13497C45087r7845J77155j36798j37415P1034M44578j07441A99298K55539m2901
13487D11936k01080K510L05123C3404P3808R7808Q8606k4211H7332N3499J12247
13476B53078L21273k56858L40418A45132J76209j07110J02526n2246K10983A47913
13465D46484j30027J56223j06912j16849N5092a38589D15327r126n3676K73846
13455F26371A76875K20809A91496K30361d2417J0118B09753L4991J54627R142
13445D08513o8558f9738b3678B99229J00618C0399K3798K52536A31665m8048M47773
$$ plain form
13434 531390 285594 -21427 275191 287445 485022 23832 441117 159240 367169 143846
13423 212056 225881 -170108 240597 242769 571779 265789 94723 376414 342166 142063
13412 -322990 228820 175384 170298 224671 160161 357895 29410 67363 209926 47580 210244
13401 210244 27885 98881 249528 439573 224132 443999 -103534 62828 58292 49972 219480
13390 219480 203949 200899 59736 534308 251423 60414 36589 458765 -120739 587802 171703
13378 188570 267991 160999 121683 -78585 70814 -252535 326388 755606 315783 129711
13367 239511 210688 310681 365808 272463 222188 55224 502047 158941 244526 196850 321218
13356 321218 197849 372620 366303 220613 361475 163076 113883 471000 671101 87642
$$ packed form
13434E31390k45796b1427B75191J2254J97577B3832M17285A59240K07929A43846
13423B12056J3825a70108B40597K172L29010B65789I4723K81691l4248A42063
13412c22990B28820n3436n086N4373o4510J97734B9410L7953J42563D7580J62664
13401B10244B7885P0996J50647J90045k15441K19867a03534F2828m536q320J69508
13390B19480j5531l050E9736M74572B51423F0414k3825M22176a20739E87802A71703
13378A88570P9421j06992l9316g8585G0814b52535C26388M29218C15783A29711
13367B39511k8823R9993N5127r3345n0275E5224M46823A58941Q5585m7676J24368
13356C21218j23369J74771o317j45690J40862A63076m9193L57117K00101H7642
$$ plain form
13345 327412 426630 342686 79974 -199233 34075 357617 280621 253554 263654 337533 -165772
13333 207488 -3473 259998 184008 565106 203229 420287 146828 181609 328360 32224
13322 182145 560430 305672 430263 709006 96346 235785 313108 112447 125659 392802
13312 392802 80887 272702 -78750 188004 324561 253679 174482 -5193 52213 86072 198771
13301 198771 85322 561566 31250 354351 123187 373411 104698 91399 118694 11559
13290 312706 257029 237187 227931 117663 92177 270695 113151 156217 -113398 128025 4942
13278 121508 189370 -225341 -133906 209368 264299 22221 200282 336217 209501 163812
13268 163812 371349 -98508 215858 155446 484444 84505 169635 342944 324677 479491
$$ packed form
13345C27412R9218q3944G9974a99233C4075L23542p6996k7067J0100P3879a65772
13333B07488c473B59998p5990L81098B03229K17058A46828L4781J46751C2224
13322A82145L78285k54758J24591K78743I6346J39439P7323A12447J3212K67143
13312C92802H0887J91815g8750A88004J36557p0882p9197e193E2213L3859J12699
13301A98771H5322M76244C1250L23101A23187K50224A04698j3299K7295A1559
13290C12706n5677j9842r256j10268k5486J78518A13151M3066a13398A28025D942
13278A21508O7862b25341R1435B09368N4931B2221J78061J35935j26716m5689
13268A63812K07537i8508B15858o0412L28998H4505Q5130J73309j8267J54814
$$ plain form
13258 479491 384008 282457 -113849 351795 343776 41495 400205 326846 1511 -36719 142416
13246 147652 72704 308300 225703 219444 -26632 358506 44323 168541 22502 -64901 204287
13234 52756 173961 175124 12123 169163 -183783 -8708 80686 349496 57883 297274 -116798
13222 161519 228897 195713 -5516 92029 241714 126495 133929 -122239 106654 386068 -109960
13210 182165 54859 89850 229088 146151 17010 -143407 -164330 11895 40658 106115 634711
13199 634711 -10924 -104942 28327 12102 51038 203576 -27462 -47917 -9659 320325 338867
13188 338867 181099 199119 283407 253811 209879 3209 -56456 323545 -15387 189727 202077
13177 202077 87535 37779 381694 259730 46524 -161498 -34483 294736 -275651 241565
$$ packed form
13258D79491r5483j01551a13849C51795q019D1495L58710p3359A511c6719A42416
13246A47652G2704K35596q2597o259b6632C58506D4323J24218B2502f4901B04287
13234E2756J21205J163A2123J57040a83783h708H0686K68810E7883K39391a16798
13222A61519O7378l3184e516I2029J49685j15219P434a22239A06654K79414a09960
13210A82165E4859L4991J39238q2937A7010a43407k0923A1895K8763O5457N28596
13199F34711a0924r4018B8327A2102L8936J52538b7462k0455i659C20325J8542
13188C38867j57768J8020Q4288k9596m3932C209e6456C23545a5387A89727J2350
13177B02077H7535C7779L43915j21964D6524a61498c4483B94736b75651B41565
$$ plain form
13166 213019 94888 315095 44394 304626 -49519 138212 231874 389377 120960 25308
13155 189315 286898 -180571 82851 109210 473342 -119807 140022 -31127 -186598 448856
13144 93802 78128 -5707 502836 10702 196482 86637 41593 594658 259126 163959 116286
13133 116286 -32826 -168512 122906 170288 -28426 4697 303868 -110580 -34094 258892 152501
13122 152501 284203 -247601 -195234 232713 59436 143417 4684 250164 -81588 139783 46149
13110 -26112 250765 102172 44757 327532 275269 227133 -47535 213763 -209575 9918 -99237
13098 -28696 -218459 -236166 267720 -95898 143207 -9277 -141462 -226747 -125875 -58287 107620
13086 -139846 -129511 384206 210945 198878 -25530 -376515 184074 57251 354042 112113
$$ packed form
13166B13019I4888K20207D4394K60232d9519A38212R3662J57503A20960B5308
13155A89315R7583a80571H2851K6359L64132a19807A40022c1127j55471D48856
13144I3802j5674e707E02836A0702J85780H6637D1593N53065B59126r5167m7673
13133A16286c2826j35686A22906M7382b8426D697K99171a10580c4094B58892j06391
13122A52501J31702b47601N2367B32713E9436Q3981D684K45480h1588A39783D6149
13110b6112B50765A02172D4757K82775n2263m8136d7535B13763b09575I918i9237
13098b8696j89763j7707B67720i5898A43207i277j32185q5285J00872e8287A07620
13086a39846J0335C84206j73261j2067b5530l50985A84074E7251K96791A12113
$$ plain form
13075 400362 -113249 66143 321970 213324 -43668 179515 193827 -35045 -38963 167021 -169811
13063 140540 260227 -94793 -50842 -104689 177640 386212 297665 50518 165668 -63957 124600
13051 -42226 152940 101439 80668 107618 114901 303811 -89589 -14734 183042 137638 98332
13040 98332 273594 -73130 46192 212105 53202 38108 -38399 253763 18853 70149 178285
13029 178285 265923 -37557 -46290 147835 -118209 8091 171211 -258490 -164411 164854 -98612
13017 45328 -84899 80222 284211 184570 28019 67109 164891 -93997 135052 82820 -345358
13005 288331 188856 400782 122539 69679 40270 149995 465102 16011 436400 -21523
12994 165528 112452 -72855 294252 379814 24979 193177 -11653 109253 94683 155630 265142
$$ packed form
13075D00362a13249F6143K55827j08646d3668A79515J4312c5045l918A67021a69811
13063A40540J19687i4793M3951n3847A77640K08572q8547E0518J15150f3957A24600
13051d2226A52940n1501k0771K6950P283J88910h9589a4734A83042m5404l9306
13040I8332J75262g3130D6192J65913E3202j5094c8399B53763A8853N1296J08136
13029A78285Q7638c7557q733A47835a18209H091J63120b58490R4079A64854i8612
13017D5328h4899H0222K03989r9641B8019L9090R7782i3997A35052n2232c45358
13005B88331r9475K11926A22539n2860k9409J09725L15107A6011M20389b1523
12994A65528n3076g2855B94252Q5562B4979J68198a1653A09253j4570O0947J09512
$$ plain form
12983 265142 -250881 118966 127878 59685 220481 -65969 58626 219405 -127103 301024
12972 -153956 70927 85680 306807 264616 161763 -56474 -64799 -133613 370154 47157 -335206
12960 85963 34995 -292761 140896 -150377 -45401 74589 193096 275792 77834 31354 -44014
12948 368582 43943 57526 245635 -13580 440462 13785 180603 10034 -87444 69811 346799
12937 346799 75520 144483 -276914 15126 -130282 -212976 150103 75767 100642 38265 47783
12926 47783 343476 -391849 16528 277364 -51050 244565 173007 -201699 45542 131157 8373
12914 224472 25228 43256 -106821 60632 18259 -58514 41778 -106679 -12689 165973 40466
12902 -28744 -76596 125479 -76930 -35467 -50753 -117614 119374 -195365 207358 67401 189663
$$ packed form
12983B65142b50881A18966Q912E9685J60796f5969E8626J60779a27103C01024
12972a53956G0927J4753K21127m2191j02853e6474q325o8814C70154D7157c35206
12960H5963C4995b92761A40896a50377d5401G4589J18507Q2696G7834C1354d4014
12948C68582D3943J3583J88109a3580D40462A3785J66818A0034h7444F9811K76988
12937C46799G5520O8963b76914A5126a30282q2694A50103p4336K4875C8265R518
12926D7783K95693c91849A6528K60836e1050B44565p1558b01699D5542Q5615H373
12914B24472B5228J8028a06821F0632A8259e8514D1778a06679a2689A65973D0466
12902b8744m7852A25479g6930c5467j5286o6861A19374a95365B07358F7401J22262
$$ plain form
12891 189663 -168875 165743 428114 14361 207662 179430 -38692 -6449 -173833 219444
12880 186005 130041 227027 51237 130943 -134988 220422 164208 -44769 173860 361797 308264
12869 308264 240296 -143363 -458329 73885 18334 -19351 140585 241754 -19322 152159
12858 28395 52510 62542 76648 158942 -232032 132847 -77577 119770 239087 -89133 -54469
12847 -54469 174504 245570 78023 59722 -287009 -74011 -72595 38703 -145388 211734 14003
12835 187511 150128 -130621 93372 -72492 123427 209247 171264 -194089 81740 143658 -147994
12823 50080 267335 94088 316880 274095 -85103 -87982 61382 148669 -77076 367073 -140571
12811 -188422 -62267 144359 263088 -383432 501 -27088 4437 56184 42018 41395 -36418 -68618
$$ packed form
12891A89663a68875A65743K62371A4361J93301k8232c8692f449j67384B19444
12880A86005n5964R6986E1237P9706a34988B20422n6214d4769A73860J87937n3533
12869C08264o7968a43363l14966G3885A8334a9351A40585J01169a9322A52159
12858B8395K4115J0032J4106Q2294b32032A32847g7577A19770J19317h9133L4664
12847e4469A74504P1066G8023j8301b87009g4011J416C8703a45388B11734A4003
12835A87511l7383a30621I3372g2492A23427Q5820l7983a94089H1740O1918a47994
12823E0080K17255I4088K22792m2785h5103k879F1382Q7287g7076C67073a40571
12811a88422f2267A44359J18729c83432E01b7088D437N1747j4166o23c6418l2200
$$ plain form
12799 -68618 353229 121795 245533 -10646 10725 -105029 -189956 195508 -90424 -296763
12789 -296763 -98192 287412 110637 169400 -4161 372839 129395 20265 -35678 -286564 179309
12777 172936 -223618 -360808 17287 195276 -125332 364112 247977 -180384 140929 116767
12767 116767 127668 111898 18442 183650 -114355 -193872 -16090 378140 99599 -22359 -21228
12756 -21228 -143420 -174726 -39251 -33222 161349 -257270 -41238 533869 314910 -114624 -69765
12745 -69765 -195543 -95268 -250821 252697 187688 341380 133992 -95087 -98251 12025 -7972
12733 12721 -154478 61786 -95800 139283 -105001 141764 -133377 25701 433490 -257845
12722 273658 114614 251183 93049 168348 -179468 773396 -288546 -135282 47982 205538
$$ packed form
12799f8618C53229A21795J23738a0646A0725a05029q4927A95508i0424k06339
12789b96763i8192B87412A10637N8763d161C72839A29395B0265c5678k50886A79309
12777A72936b23618j37190A7287J77989a25332C64112j16135a80384A40929k4162
12767A16767J0901j5770A8442J65208a14355p9517a6090C78140I9599b2359J131
12756b1228j22192l1306c9251O029A61349b57270d1238E33869k18959a14624M4859
12745f9765j25778i5268j55553B52697o5009J53692A33992i5087l164A2025g972
12733A2721a54478F1786i5800A39283a05001A41764a33377B5701M07789b57845
12722B73658A14614J36569I3049P5299a79468G73396b88546a35282D7982J57556
$$ plain form
12712 205538 -156788 137463 504013 -146240 -190808 -215152 42719 -129928 105709 138413
12702 138413 -107823 197792 211321 60075 -123463 116480 -228095 -96184 241356 171903
12692 171903 -133369 347842 441548 78687 536474 253153 -148624 146785 118023 39072
12681 -42070 173001 315634 86806 -79971 -43855 -40080 237250 104145 -33194 -195217 217272
12669 -86450 -64786 -192800 7388 101684 -38274 26687 67728 151286 182240 -49715 -75746 -14429
12656 221345 40243 24529 -259772 -113091 86642 183383 44804 139341 199977 -166110 18627
12644 89284 263890 -50465 66967 55265 -115222 371722 -36999 52959 120234 -147396 135992
12632 51307 -224798 -120217 177096 156949 139561 -400868 73422 232086 237371 355373 125957
$$ packed form
12712B05538a56788A37463L66550a46240m4568k4344D2719a29928A05709L2704
12702A38413a07823A97792J3529F0075a23463A16480b28095i6184B41356o9453
12692A71903a33369C47842R3706G8687M57787B53153a48624A46785k8762C9072
12681d2070A73001J42633H6806g9971L6116L775B37250A04145c3194j62023B17272
12669h6450K1664j28014G388R4296c8274B6687M1041Q3558L0954d9715k6031a4429
12656B21345D0243j5714b59772a13091H6642R6741D4804R4537O0636a66110A8627
12644H9284J74606e0465F6967j1702a15222C71722c6999E2959O7275a47396A35992
12632E1307b24798J04581A77096k0147j7388d00868G3422J58664N285J18002A25957
$$ plain form
12620 222551 212329 400784 209862 231283 264167 84188 332528 176595 442132 -37650
12609 92502 45495 64710 17376 217932 173511 24209 -57342 222889 -113095 169679 11152
12597 87541 -54352 105991 -163923 -232073 82829 311210 1129 130389 453161 142796 263469
12586 263469 104581 129210 137174 289835 200012 35240 57710 237133 319857 30281 134908
12575 134908 -240517 84561 71518 -67318 170868 2416 -5314 118205 193286 86839 263226
12564 263226 -27050 -66124 -104009 107710 16583 321836 -81638 392532 27933 -146841 54718
12552 12313 45456 226089 -273178 -71513 175729 -404482 -78564 137982 -127847 -62853
12541 84699 -161119 177809 -273831 48158 -18700 -323165 -156725 -27592 -119041 270716
$$ packed form
12620B22551j0222J88455j90922K1421L2884H4188K48340j55933K65537c7650
12609I2502D5495J9215A7376K00556m4421B4209e7342B22889a13095A69679A1152
12597H7541e4352A05991a63923o8150H2829K28381A129J29260L22772A42796J20673
12586B63469A04581K4629P964J52661q9823C5240K2470J79423Q2724C0281J04627
12575A34908b40517H4561j3043f7318A70868B416e314A18205P5081H6839J76387
12564B63226b7050l9074l7885A07710A6583L05253h1638C92532B7933a46841E4718
12552A2313L3143J80633b73178g1513A75729d04482g8564A37982a27847f2853
12541H4699a61119A77809b73831D8158a8700l04465a56725b7592r1449B70716
$$ plain form
12530 3353 -355016 -200975 103399 -34584 159518 52434 259244 279 -125399 -259907 216585
12518 -178202 -30140 100838 59320 164886 192942 402672 38717 131410 25478 130970 102405
12507 102405 -260205 139691 278051 121434 -82343 -14693 -190604 273700 -239797 267026
12496 -212120 215797 -67689 165132 266448 66227 -15190 -93530 144387 -261956 -66775
12485 -1946 366098 -238468 104042 166655 189288 -68148 -131676 -173562 -203333 -83872 -380864
12474 -380864 -155910 352282 25524 -165928 27294 -259736 -82276 420019 -37604 -125694
12464 -125694 262148 -157659 -97508 271050 -218761 111314 -229622 53329 41370 -16079
12453 -338034 -262802 431612 23713 -70915 9645 -68832 -75406 -206847 47709 -57349 -144057
$$ packed form
12530C353c55016J54041A03399c4584A59518E2434K06810B79a25399j34508B16585
12518a78202c0140A00838m1518J05566K8056K09730C8717R2693B5478J05492k8565
12507A02405b60205A39691J38360A21434h2343a4693j75911B73700b39797B67026
12496b12120B15797f7689A65132J01316F6227a5190p8340A44387b61956f6775
12485a946C66098b38468A04042O2613K2633f8148o3528m1886k9771h3872k96992
12474c80864a55910C52282B5524a65928B7294b59736h2276D20019c7604q8090
12464a25694B62148a57659O0151B71050b18761A11314b29622E3329j1959a6079
12453c38034P5232D31612B3713g0915I645f8832o574j31441D7709e7349q6708
$$ plain form
12442 -144057 -48077 181518 76087 -274657 -151178 -239412 134573 -32436 62804 -187732
12431 -208868 -14426 -36940 313306 83307 -56608 175023 -6177 242244 73697 102937 237851
12420 237851 3497 -57327 -27879 -136415 -13024 -106288 -25260 212012 -41063 157420 265453
12409 265453 -28480 -141505 290499 150265 -100100 -217282 -291066 247989 103848 -99115
12398 160374 -198683 445654 -4666 253611 -190081 438983 -85889 -224142 158594 223990
12388 223990 -172022 182107 68107 269418 -90574 -153965 215378 44030 156661 -164532
12377 -326166 18647 -53301 160168 -216094 -84280 -136180 55606 -270109 -22425 -198851 166975
12365 65714 31089 172098 272536 -149592 -10913 357181 193237 -93417 -118759 -111485 -57742
$$ packed form
12442a44057d8077A81518G6087b74657J23479q8234A34573c2436F2804a87732
12431b08868a4426k2514C13306H3307e6608A75023f177B42244G3697K9240J34914
12420B37851C497e7327b7879j08536a3024r3264b5260B12012d1063A57420J08033
12409B65453b8480j13025B90499j40234a00100j17182p3784B47989A03848i9115
12398A60374a98683D45654d666B53611a90081D38983h5889j38253A58594O5396
12388B23990a72022A82107F8107K01311i0574o3391B15378D4030J12631a64532
12377c26166A8647e3301A60168b16094h4280n1900E5606b70109b2425j76426A66975
12365F5714C1089J41009J00438a49592a0913C57181j63944i3417k5342P274N3743
$$ plain form
12354 -57742 163776 -56253 -148819 -287684 -11351 127185 140378 -22317 -177340 -101056 -76100
12343 -76100 -330430 -58562 -11727 44660 248553 134582 2178 33736 49344 42007 75667
12332 75667 14379 -134130 103026 30476 43631 -56404 -46185 151303 56213 445480 12410
12320 98387 -46750 -191433 -38986 202669 -220316 -47851 92629 -124580 -36400 -155885 154112
12308 -120224 46667 -138758 -77090 208755 2153 -228164 110249 274587 18896 -463 -326418
12297 -326418 137267 -132689 241009 -155767 -244157 -177384 148893 445037 -118800 209623
12286 156095 -302382 -218183 103101 77842 93775 356357 -132517 31621 -152007 -50210
12275 -156551 134583 -59070 165508 29586 279031 -62630 -85616 127044 42700 -22992 -87294
$$ packed form
12354e7742A63776e6253r2566j38865a1351A27185J3193b2317j55023P6284K4956
12343g6100k54330e8562a1727D4660K03893j13971B178L1558J5608p337L3660
12332G5667A4379a34130A03026C0476J3155e6404J0219A51303E6213L89267A2410
12320I8387d6750j44683c8986B02669b20316d7851I2629a24580c6400j19485A54112
12308a20224D6667a38758O1668B08755B153b28164A10249J64338A8896d63l25955
12297c26418A37267a32689B41009a55767q8390O6773A48893K96144a18800B09623
12286A56095c02382Q4199A03101k5259J5933K62582a32517C1621a52007e0210
12275a56551A34583e9070A65508B9586K49445f2630k2986A27044D2700b2992o4302
$$ plain form
12264 -87294 -146769 62186 80888 256096 73817 42855 221914 4888 152139 111060 223271
12253 223271 184625 262036 -191795 -172960 -61556 312999 -99312 105787 117353 211920 211424
12242 211424 -174399 172044 17714 -39231 70109 18034 6152 -33154 177672 -39559 154267
12230 27727 -87341 67941 318519 112856 -39699 -35066 218444 245981 199707 -28011 208086
12218 252458 327239 -5119 290688 223455 511426 -136318 140870 -117011 397057 323953
12208 323953 425731 226816 419652 226130 697586 473710 8175 186360 -137251 143599
12197 506646 267917 89299 263938 -56258 61593 212874 146846 -40018 76603 97609 211898
12186 211898 192426 56405 253002 363389 396337 278142 63905 198390 658328 40598
$$ packed form
12264h7294n9475F2186J8702J75208G3817l0962J79059D888J47251m1079J12211
12253B23271l8646P7411a91795J8835f1556C12999i9312A05787J1566R4567m96
12242B11424a74399A72044A7714c9231G0109A8034F152c3154A77672c9559A54267
12230B7727h7341F7941K50578A12856c9699M633B18444K7537m6274b8011B08086
12218B52458P4781e119B90688o7233K87971a36318A40870a17011C97057p3104
12208C23953J01778j98915J92836j93522M71456k23876H175J78185a37251A43599
12197E06646k38729H9299J74639e6258F1593J51281o6028d0018G6603K1006J14289
12186B11898j9472E6405J96597J10387L2948j18195F3905J34485M59938D0598
$$ plain form
12175 322861 210917 485023 261026 314845 424315 -152516 295096 107786 146267 428748
12165 428748 -1263 15256 481480 -77580 42353 55287 -108652 -351054 265233 9187 97554
12154 97554 -89543 299747 313273 253827 237561 55455 -149677 -155743 -91972 -6780 -93846 300531
12141 -63928 226437 -291236 148903 -194830 84573 23115 130712 43116 112758 75605 211492
12130 211492 -5903 82299 60821 -11192 136106 170814 65386 -139968 -70703 29429 177641
12119 177641 271468 142436 75913 309045 80679 234493 258751 12818 -36490 55770 299550
12108 299550 78964 -129556 -47235 4847 20041 -202740 168364 -31389 97946 -1513 -279978
12097 -279978 138925 294474 227018 229234 -119402 -207844 -294726 12391 146602 -91934 -139746
$$ packed form
12175C22861j11944K74106k23997N3819J09470a52516B95096A07786L8481K82481
12165D28748a263A5256M66224g7580D2353J2934a08652k42402B65233I187Q8367
12154I7554h9543B99747J3526n9446j6266E5455a49677o066O3771f780q7066C00531
12141f3928B26437b91236A48903a94830H4573B3115J07597D3116O9642l7153J35887
12130B11492e903H2299k1478a1192A36106L4708F5386a39968O9265B9429J48212
12119A77641R3827j29032o6523K33132H0679J53814K4258A2818c6490E5770K43780
12108B99550G8964a29556d7235D847J5194b02740A68364c1389I7946a513k78465
12097b79978A38925J55549o7456K216a19402q8442q6882A2391J34211i1934m7812
$$ plain form
12086 -139746 432551 -45531 11963 40560 -246610 -153378 117939 -34367 -147763 -60795 -66491
12075 -66491 -171745 130890 244683 -184882 116978 54424 -200483 -221593 216341 168911
12065 168911 63760 -349444 99234 403978 137861 148343 731623 1287649 849407 675814
12055 675814 364662 172245 135291 47344 7917 57971 102378 -29558 -289952 -92499 86276
12043 -151861 180692 -20102 -39534 -153897 207931 -151335 110792 518734 -352219 -51360
12032 -236687 -54336 42808 189255 -147736 22439 41696 191214 116001 -144773 10743 -224253
12020 74838 -117757 123931 -227169 -158533 128884 -39505 29821 67461 -21566 76922 270223
12009 270223 -147540 -47290 -164153 106501 -43119 103976 -9416 110705 -343066 135753
$$ packed form
12086a39746D32551d5531A1963K8597b46610R3232A17939c4367j13396f0795n696
12075f6491j05254A30890J13793a84882A16978E4424b00483k1110B16341m7430
12065A68911F3760c49444I9234L04744A37861J0482N83280N56026m38242j73593
12055F75814l11152A72245l6954D7344G917N0054M4407b9558k60394i2499H6276
12043a51861A80692b0102j9432j14363B07931a51335A10792M07942c52219e1360
12032b36687e4336D2808J46447a47736B2439J9257J49518p5213a44773A0743b24253
12020G4838a17757A23931b27169O8636A28884c9505B9821L7640b1566G6922J93301
12009B70223a47540d7290j16863A06501d3119A03976i416A10705c43066A35753
$$ plain form
11998 40984 163053 -53696 -394106 101519 216396 -302254 -296759 -257786 25038 -85316 -112568
11987 -112568 -31524 -85583 -26328 -259435 -9464 -72153 2135 -60172 -131681 246533 146290
11976 146290 76146 -369502 154053 27682 -127572 139951 123087 -83470 -47346 203677
11965 -58321 -10048 15587 -27736 34942 51951 227733 -69976 -151278 139651 -130099 4947
11953 326763 -22276 -199343 60915 -89265 -367762 172196 -181334 -160561 129700 -293264
11942 -144180 -155224 -29090 -311913 127523 -106782 -226951 222022 130368 165307 104117
11932 104117 -45804 16849 62414 -155798 32220 -210193 -89583 85663 23366 202399 -61478
11920 -51304 -39651 184931 182216 82015 200868 -52166 -106333 57569 84014 -18461 -144943
$$ packed form
11998D0984J22069e3696l40410A01519J14877c02254N495L8973B5038h5316k7252
11987a12568c1524n4059b6328k33107i464o2689B135f0172p1509B46533j00243
11976A46290p0144c69502A54053B7682a27572A39951j6864h3470L6124B03677
11965e8321a0048A5587b7736C4942J7009J75782f9976q1302A39651a30099D947
11953C26763b2276j77067F0915h9265k78497A72196a81334K0773A29700b93264
11942a44180j1044b9090k82823A27523a06782j20169B22022r1654L4939o1190
11932A04117d5804A6849M5565a55798C2220b10193h9583H5663B3366J79033f1478
11920e1304J1653A84931k715H2015J18853e2166n4167E7569K6445a8461j26482
$$ plain form
11909 -144943 232715 -394 -100001 141666 38691 101154 -6523 77454 81594 -161986 6637 -287790
11896 -10635 382811 -271219 20988 167878 -111665 -48003 45822 181575 -286606 174364
11885 -239754 23499 -58138 -257275 120894 -139473 132497 -122653 -28646 -91852 188807
11874 63610 123982 -177556 -175906 -220683 29967 170656 -332007 -388281 91833 150780 -176299
11862 -46367 -13042 134770 205107 76585 274251 -6848 -31141 125603 -29674 -92241 -98573
11851 -98573 -385548 21309 174623 34632 -3152 -127395 -286673 -407247 51338 9817 -213457
11839 77184 -102664 179044 91019 37719 -19063 -53018 -91139 -299479 295078 -33811 -29166
11828 -29166 65230 -142953 -83127 -161603 -38405 -186354 -85675 135845 -33806 -200476 -191947
$$ packed form
11909a44943B32715c94r9607A41666C8691O2463f523G7454M140a61986F637b87790
11896a0635C82811b71219B0988J46890a11665d8003D5822J35753b86606A74364
11885b39754B3499e8138j99137A20894a39473A32497a22653b8646o3206A88807
11874F3610O0372a77556J650m4777B9967J40689c32007n6274I1833N8947a76299
11862d6367a3042A34770P0337G6585J97666f848k4293A25603b9674o2567o332
11851i8573k86975B1309J53314C4632c152j24243j59278j20574E1338I817b13457
11839G7184a02664A79044q8025C7719a9063l3955l8121k08340B95078c3811M645
11828b9166F5230a42953N9826p8476c8405j47949h5675A35845c3806j66670Q529
$$ plain form
11817 -191947 43995 -44842 -25730 -114110 -298958 -359682 -350924 -206731 272575 -164294 -98725
11806 -98725 -44218 130559 -69669 -277338 -103340 120700 -48508 -124606 -55237 -95683 -86820
11795 -86820 -362523 -212776 -1740 117740 245356 -142041 -136521 -70770 -225606 -265104 43488
11783 90613 -59929 297230 -81347 136669 29434 -124881 -107280 -84094 177017 -207893 187262
11771 -390 215790 -296426 36927 723 120232 290565 41910 -365529 5373 -20726 99915 -54058
11758 12013 -135074 -123791 79856 -252989 -127077 200735 410928 47456 97289 -242677
11747 -172309 -168668 -200317 -134104 -89323 -556 -149443 181266 -21914 168242 -88030 267473
11735 -185545 134102 90876 -93559 70758 445518 -112638 4297 66227 211818 -399974 -154611
$$ packed form
11817a91947D3995d4842J9112q8380j84848o0724Q758J44193B72575a64294O5569
11806i8725d4218A30559f9669k07669a03340A20700d8508p6098e5237m0446Q863
11795h6820k75703J49747a740A17740J27616a42041N520O5751j54836l9498D3488
11783I0613e9929B97230h1347A36669B9434a24881J7601K3186A77017b07893A87262
11771c90B15790b96426C6927G23J19509J70333D1910c65529E373b0726I9915e4058
11758A2013a35074J1283G9856b52989J25912B00735K10193D7456M9833b42677
11747a72309L641l1649O6213M4781e56j48887A81266b1914A68242h8030B67473
11735a85545A34102m3226i3559G0758L74760a12638D297O1930J45591c99974a54611
$$ plain form
11723 200530 157511 -225637 -95724 278560 29557 20782 248788 -60684 9805 -364273 12081
11711 -189267 -230262 -33266 23505 53841 -116350 -25959 -144386 112967 -138300 -349532
11701 -349532 -49686 -498631 2872 -186585 -240086 -174266 8169 -207020 303312 34278 -15742
11689 63687 258533 78490 66965 -177382 199489 237416 75086 116992 -78117 -77487 82551
11677 173192 -8968 102946 147400 -25289 39831 -63995 21516 -133273 93842 -54477 224179
11665 179181 181896 37387 165578 -2709 -11954 -139145 98276 -70057 -100322 -63353 76174 6458
11652 151247 -103098 61813 -15828 -82237 84458 160789 243653 -36102 92851 53359 201562
11641 201562 8703 -49124 -140626 239699 17972 -392803 -44246 -18529 -177670 211935 370875
$$ packed form
11723B00530m3019b25637i5724B78560B9557q775K28006f0684I805c64273A2081
11711a89267m0995c3266B3505L0336a16350b5959j18427A12967a38300k11232
11701c49532d9686m48945B872a86585n3501O5820H169b07020C03312C4278a5742
11689F3687J94846G8490j1525a77382A99489L7927G5086M1906g8117O30H2551
11677A73192h968A02946M4454b5289C9831f3995B1516a33273I3842e4477B24179
11665A79181K715C7387J28191b709r245j27191I8276g0057l0265L6969G6174F458
11652A51247a03098F1813a5828o6409H4458P6331Q2864c6102I2851l9492J48203
11641B01562H703d9124r1502B39699A7972c92803d4246a8529j59141B11935J58940
$$ plain form
11630 370875 133784 334166 -257447 216155 -53731 109973 24067 -47310 -172014 -170888
11620 -170888 -428218 101820 119277 -60507 76081 357258 -325073 139191 -92276 -52982
11610 -52982 24541 66466 -137922 21901 76275 -167232 -109172 49870 -49245 -216195 290917
11598 44912 256989 4572 189680 -55019 104534 54180 223442 160358 14370 -93270 52307
11586 83977 -96014 288097 315604 307216 -139522 -210442 -43644 -5340 -29507 -328924 -308906
11575 -308906 -125068 93508 -22462 -69192 -52845 189107 100266 -9991 216534 -36330 356464
11563 190167 177099 -234168 151058 -162063 -141001 162794 38628 -91000 102066 -17256
11552 97928 190528 -136246 57722 -218256 9667 157329 200813 151751 121325 17897 7708
$$ packed form
11630C70875A33784K00382b57447B16155e3731A09973B4067d7310j24704J126
11620a70888k57330A01820J7457f0507G6081K81177c25073A39191i2276L9294
11610e2982B4541M1925a37922B1901N4374a67232N8060D9870d9245j66950B90917
11598D4912K12077D572J85108e5019A04534n0354J69262o3084A4370i3270E2307
11586H3977i6014B88097K7507q388a39522p0920d3644e340k4167k99417K0018
11575c08906a25068I3508b2462m6730J6347A89107q8841i991B16534c6330C56464
11563A90167j3068b34168A51058a62063K1062A62794C8628i1000A02066a7256
11552I7928R2600a36246E7722b18256I667J47662M3484m9062l0426A7897G708
$$ plain form
11540 109600 32833 133145 39863 -56238 248436 243718 -162693 -315535 -127281 -131194 -87178
11529 -87178 -110283 274649 110854 37353 -140946 -405937 133502 24618 355477 415071
11519 415071 502366 64774 97025 -94558 63338 80851 -68891 3568 -75121 93802 296873
11508 296873 196531 30865 136365 -83981 -36892 60912 77506 260060 283409 -45502 477692
11496 -129053 397646 144387 170160 183106 222305 100423 27979 312960 63956 322210
11486 322210 184745 -53624 -36131 26510 -16355 -57657 201172 174263 -213902 140497 245348
11475 245348 110033 438071 -15067 -28292 -26254 181581 372535 383719 182524 398804
11465 398804 -78739 83546 6062 85467 48258 -298325 200129 169844 22084 11502 207886
$$ packed form
11540A09600C2833J00312C9863e6238B48436m718a62693j52842a27281l913M4016
11529h7178k3105B74649A10854C7353a40946k64991A33502B4618L30859N9594
11519D15071Q7295F4774L2251i4558F3338J7513f8891C568g5121I3802K03071
11508B96873j00342C0865J05500h3981c6892F0912J6594J82554K3349d5502D77692
11496a29053C97646A44387K5773J2946L9199A00423B7979K84981F3956K58254
11486C22210j37465e3624J7493B6510a6355m1302B01172k6909b13902A40497J04851
11475B45348A10033L28038a5067j3225K038A81581J90954J1184A82524K16280
11465C98804g8739H3546F062P9405l7209b98325B00129l0285B2084j0582J96384
$$ plain form
11454 207886 175675 80564 85043 485178 -50199 69565 -33054 156904 279474 -188986 75429
11442 -46983 -183595 287797 117003 -99248 439017 -294886 7476 52669 -307562 197575
11431 149758 -78828 -105724 195911 112672 112862 75545 -23713 -207188 273608 71418 155308
11420 155308 235024 -86713 24280 173790 -182469 346361 -87342 -19055 108749 -67114 132681
11408 -227334 51018 195178 -229661 5730 -157333 -116815 -73115 64679 -40572 12399 231928
11397 231928 146271 -172527 -123632 -49381 373088 158815 72699 -226910 -111176 134720
11386 -250664 348353 290843 156676 237099 -59687 55664 108417 16810 238769 255337 -68847
11374 -126618 -146836 3614 -51689 5487 -270655 200952 -34205 -190550 -138013 -61136 176138
$$ packed form
11454B07886l2211H0564M479M00135e0199F9565c3054A56904J22570a88986G5429
11442d6983j36612B87797A17003i9248D39017b94886G476M5193c07562A97575
11431A49758g8828k6896A95911q3239J90l7317b3713j83475B73608G1418Q3890
11420A55308P9716h6713B4280J49510a82469C46361h7342a9055A08749f7114A32681
11408b27334E1018J44160b29661E730a57333M0518M3700F4679d0572A2399K19529
11397B31928q5657a72527M8895d9381C73088A58815G2699b26910a11176A34720
11386b50664C48353n7510j34167Q0423e9687E5664N2753A6810K21959J6568f8847
11374a26618k0218C614e1689E487b70655B00952c4205j56345N2537f1136A76138
$$ plain form
11362 193193 -108213 -105327 -413436 -30182 -32077 81807 -234274 -2368 187291 259567 -186295
11350 -187491 -57313 204777 -36110 -130494 -7669 -105713 -57697 101483 -112637 260861 176483
11339 176483 -95536 -78389 -132197 101895 276350 43186 22251 -168417 304294 63613 147371
11328 147371 103784 -41910 -173439 -38685 -16410 63595 -63721 454721 75041 120856 -92319
11316 -16369 201429 157598 224084 -133092 205096 2918 -59703 -83954 -326398 117490 54451
11304 151537 -134249 194339 141066 174050 75106 23395 -42046 -339374 -388056 59153 27051
11292 -16686 2246 -140048 87832 -280690 -242946 51211 61536 74474 -188853 -182972 -121821
11281 -121821 -29001 -152209 24793 -141505 -128341 -43252 618 68077 -204998 -53453 -260607
$$ packed form
11362A93193a08213K886l08109c0182j895H1807b34274b368A87291P2276a86295
11350a87491e7313B04777c6110r4384g669r8044M8016A01483a12637B60861q4378
11339A76483i5536J7147n3808A01895J74455D3186k0935a68417C04294F3613Q3758
11328A47371m3587d1910j31529c8685a6410F3595f3721D54721G5041M5815i2319
11316a6369B01429m3831O6486a33092B05096B918e9703k4251k42444A17490E4451
11304A51537a34249A94339n3273L2984G5106B3395d2046k97328m8682E9153B7051
11292a6686B246a40048H7832b80690L7744E1211J0325J2938a88853N881O1151
11281a21821b9001j23208B4793a41505J3164d3252F18O7459b04998e3453k07154
$$ plain form
11270 -260607 -44908 78301 -234206 242388 57706 -300261 23522 58663 85723 39081 -99708
11258 -202577 -72922 54097 52980 -71298 230942 -27933 209950 -119428 -74797 -23411 17402
11246 12112 -329654 -121109 -84153 251687 5666 481949 154862 152842 -266162 -50528 -245952
11235 -245952 84150 -99738 94008 -306571 15619 -19008 -7505 -29236 48877 41823 -37160 -160735
11223 -160735 -318924 -122327 -39358 -125885 -191200 -885 -226562 126688 326631 162231 78106
11211 -19556 158419 -69632 -91358 -221404 -118344 269920 80273 -33769 33097 -337483 -86112
11199 -185767 12794 -98155 -66151 24463 -182815 -237845 -35757 74840 44573 -170645 35256
11187 -58142 -192480 -264228 -321157 183432 81059 102094 22863 -62184 -122570 185931 3851
$$ packed form
11270b60607d4908G8301b34206B42388E7706c00261B3522L5141K7060C9081i9708
11258b02577g2922E4097j117g1298B30942b7933B09950a19428M4631b3411A7402
11246A2112c29654a21109L6956B51687E666M76283A54862k020b66162e0528j95424
11235b45952H4150i9738I4008c06571A5619a9008g505k1731D8877p054c7160j23575
11223a60735j58189a22327c9358q6527o5315h85k25677A26688J99943A62231G8106
11211a9556A58419f9632k1726j30046J03060B69920H0273c3769C3097c37483h6112
11199a85767A2794i8155L2004B4463a82815n5030c5757G4840l0267a70645C5256
11187e8142j34338p1748n6929A83432H1059K1035B2863f2184o0386A85931C851
$$ plain form
11175 131 -215421 155524 -120159 -36961 -41300 228830 -270579 -611039 -140052 -91117 -25470
11163 264863 -218438 -265 233469 166380 -106167 142822 -11292 -323509 -433167 -103026
11152 -88616 -208346 107222 -238574 -40735 -127252 4125 -151058 151171 -67453 -391487 -250195
11141 -250195 -123165 -262758 156490 -357606 -16412 85038 8350 254638 75549 -82595 160447
11129 -16197 84371 -9935 77092 52424 53304 489672 -155968 240384 95582 337378 21458
11117 31331 117461 344610 155764 -232691 21970 -315733 137818 340793 108458 -25271
11106 172785 11595 -179968 95409 -40081 137033 264167 22975 5340 -124298 -19995 18849
11094 76471 156628 37778 -116465 92662 73249 202764 -34981 191787 -141632 -5956 -56087
$$ packed form
11175A31b15421A55524a20159c6961m339B28830b70579l40460a40052M8935b5470
11163B64863b18438b65B33469o7089a06167A42822a1292l12217j09658a03026
11152h8616j19730A07222b38574d0735q6517D125a51058A51171f7453l24034J41292
11141b50195a23165j39593A56490c57606a6412H5038H350K46288G5549h2595A60447
11129a6197H4371i935G7092k4668Q80M36368a55968B40384I5582K41796B1458
11117C1331Q6130K27149A55764b32691B1970c15733A37818K02975A08458b5271
11106A72785A1595a79968I5409d0081A37033J27134B2975E340a24298a9995A8849
11094G6471Q0157C7778a16465I2662j9413J29515c4981A91787a41632e956n0131
$$ plain form
11083 -56087 218273 281897 -4783 338894 487855 58684 -1506 284302 183856 159644 307757
11072 307757 179916 324659 162342 357713 218078 159824 47676 221234 167429 128858
11062 128858 -53280 235902 249825 380012 206467 139814 555567 428368 51001 432964
11052 432964 319445 284035 387469 478305 310089 460424 436364 700274 430074 456235
11042 456235 455451 432968 566152 508056 597548 721617 490931 993246 860561 864240 779588
11031 779588 876007 898198 643593 927873 839164 925623 1307028 819215 550732 638948
11021 638948 751233 1104362 1069967 463985 737007 738796 1037886 825958 642563 864446
11011 864446 871646 1017815 648581 980422 575405 779482 990944 652232 764021 666855
$$ packed form
11083e6087B18273O3624d783C38894J48961E8684a506B84302j00446k4212J48113
11072C07757j27841J44743j62317J95371j39635n8254D7676J73558n3805l8571
11062A28858e3280B35902J3923J30187j73545o6653M15753j27199E1001L81963
11052D32964j13519l5410J03434R0836j68216J50335k4060K63910k70200K6161
11042D56235p84k2483J33184n8096Q9492J24069k30686N02315j32685L679q4652
11031G79588R6419K2191k54605K84280q8709Q6459L81405m87813k68483Q8216
11021F38948J12285L53129l4395D63985K73022J789K99090k11928j83395K21883
11011H64446P200J46169l69234L31841m05017K04077K11462l38712J11789r7166
$$ plain form
11001 666855 534390 461593 616654 874120 1159299 607053 1025273 944448 778584 428696
10991 428696 506535 444886 507834 737628 538592 716216 740471 778147 665265 890661
10981 890661 538538 485827 852917 573585 757424 977622 693485 1051224 1373582 1047107
10971 1047107 875370 1394736 1204531 1476762 1265310 1186469 1683130 1361297 1486417 1842722
10961 1842722 2076160 2314004 2766315 2565826 2768465 2721291 2867272 3423912 2536507 2677953
10951 2677953 2416013 2213571 1849978 1951632 1592310 1736271 1752840 1455459 1699994 1603139
10941 1603139 1747680 1289355 1140108 1371054 941339 843393 911150 871584 694894 652534
10931 652534 344526 195272 538456 323286 80721 330098 314589 493013 109825 340416
$$ packed form
11001F66855j32465p2797J55061K57466K85179n52246M18220q0825j65864l49888
10991D28696P7839o1649O2948K29794j99036J77624K4255L7676j12882K25396
10981H90661l52123n2711L67090k79332J83839K20198k84137L57739L22358l26475
10971A047107j71737N19366j90205K72231k11452p8841M96661l21833J25120L56305
10961A842722K33438K37844M52311k00489K02639m7174J45981N56640q87405J41446
10951B677953k61940k02442l63593J01654l59322J43961J6569k97381K44535r6855
10941A603139J44541m58325j49247K30946m29715r7946O7757l9566j76690m2360
10931F52534l08008j49254L43184k15170H0721K49377j5509J78424A09825K30591
$$ plain form
10921 340416 72813 333642 448042 145657 -217692 120474 162880 -140950 -28850 352393
10910 -82205 38683 167758 265320 155087 155307 73961 -80098 90983 54529 101143 141259 -429622
10897 100895 -85833 -11572 -45840 -26648 178182 -98399 -45099 -162573 109898 -254858 -118965
10885 -41482 274590 -114986 -344350 -61465 103883 -99141 -31962 -208902 -397041 24574
10874 -96597 -128875 -198959 238324 -5274 79225 180424 82352 85804 -204593 -64642 164032
10862 -113419 140558 -299381 286795 -54964 -48184 69989 -104164 300361 -143865 38807
10851 43214 226366 -43698 -200365 -241436 16698 -29332 217787 -95457 66836 -31572 62168
10839 326467 -246873 147420 -180880 -239118 -329378 -53662 164279 -175166 -51429 287203
$$ packed form
10921C40416G2813K60829J14400A45657b17692A20474M2406a40950b8850C52393
10910h2205C8683J29075R7562j10233K20G3961h0098I0983l6454M6614M0116d29622
10897A00895h5833a1572l4268J9192A78182i8399d5099j17474A09898b54858a18965
10885d1482B74590a14986k29364f1465A03883i9141c1962j76940j88139B4574
10874i6597l2278p0084B38324e274G9225J01199H2352L452b04593f4642A64032
10862a13419A40558b99381B86795e4964O780F9989a04164C00361a43865C8807
10851D3214J83152d3698j56667m1071A6698b9332B17787i5457F6836c1572F2168
10839C26467b46873A47420a80880n8238r0260e3662A64279a75166e1429B87203
$$ plain form
10828 242405 -283418 25896 -92578 214177 -278258 354 -168515 249799 184808 -350812 14420
10816 -494538 -44791 -49342 -91698 58699 61522 -257075 -197598 -371284 -111057 76923 -62217
10804 -71018 -173013 215702 146780 15019 156602 -105698 -265192 124258 138352 88857
10794 88857 252121 91390 -50662 289410 -36519 171898 -118177 73976 62212 15284 -254222
10782 -159638 -22442 -87016 -139372 5213 -46947 199662 -305103 -48577 -494286 66574 -151817
10770 -32470 73421 -183837 -327838 -16752 -29436 -312188 -39403 -106485 -25064 -164474 -251897
10759 -251897 -15559 33549 -79458 -26063 44709 120068 -173487 117496 -64248 -23021 265482
10747 146983 -100416 10499 55827 -43934 141060 -62394 -147509 -30151 -93596 63136 -1089
$$ packed form
10828B42405b83418B5896i2578B14177b78258C54a68515B49799o4991c50812A4420
10816d94538d4791m551m2356E8699K823b57075N9477j73686a11057G6923f2217
10804g1018j01995B15702o8922A5019J41583a05698j59494A24258J4094m9495
10794H8857J63264I1390e0662B89410c6519A71898a18177G3976j1764A5284b54222
10782a59638b2442o4574n2356E213d6947A99662c05103d8577m45709F6574a51817
10770c2470G3421a83837j44001a6752j2684k82752c9403o7082b5064j39410q7423
10759b51897a5559C3549g9458b6063D4709P5359a73487A17496f4248b3021B65482
10747A46983a00416A0499M5328d3934A41060f2394q5115c0151o3445F3136a089
$$ plain form
10735 -203193 -21402 -113291 -121783 -213985 -35751 -50931 -227578 29578 -65654 -146946 211587
10723 12732 -236204 -65167 -22383 -213432 -317286 -109022 -35602 -465999 -204053 -128916
10713 -128916 -957 -56135 -205692 25282 85377 -438274 -104070 -191205 145945 -267326 -228582
10702 -228582 -25687 102657 186117 -150950 -62488 137105 -201916 106378 56951 51601 -200468
10690 -5466 -88210 -68141 -281151 -277736 -150762 154953 -93810 -70557 -254305 160996 -247185
10678 117857 -33168 298062 -160568 138063 107927 54901 -123246 -548796 20133 -313123
10667 8083 -62369 218238 -61723 -255564 -15541 20547 -122611 44402 34125 -80997 -364705
10656 -364705 -37258 109714 -206644 -46863 -57891 -172410 -27594 -200911 22677 452742
$$ packed form
10735b03193b1402r1889q492r2202c5751j5180j76647B9578f5654q1292B11587
10723A2732b36204f5167b2383j91049j03854a09022c5602m30397b04053P5137
10713a28916i57n5178j49557B5282O0095d38274a04070q7135A45945b67326L8744
10702b28582b5687A02657Q3460a50950f2488A37105b01916A06378m9427n350b00468
10690e466q2744K0069k13010L415J26974A54953i3810K3253j83748A60996b47185
10678A17857c3168B98062a60568A38063l0136n3026a23246m25550B0133c13123
10667H083f2369B18238f1723j93841a5541B0547a22611D4402j0277h0997k83708
10656c64705c7258A09714b06644d6863j1028j14519b7594j73317B2677M30065
$$ plain form
10646 452742 97091 -441646 -162975 -182146 -4158 59616 287715 61925 109554 -171115 -236662
10635 -236662 -201532 -320535 256334 -5328 -294131 -110049 -113252 -216874 32700 -70366 -106995
10624 -106995 -187339 -143329 -39185 -80541 74120 133912 -3660 -237864 112177 -20414 -101596
10613 -101596 -5568 300137 -245647 -401542 -171123 31135 53922 -260479 32543 -40436 205898
10601 -363762 2007 -179276 175129 -173376 -91036 -16002 -216219 50423 -209401 140776
10590 -1288 171152 -302046 -60536 -69056 -62827 283443 -383809 -187119 -277027 225481 198610
10579 198610 -119076 -209966 43778 -246242 -96325 -198168 -59206 16102 -129764 -128480 114378
10567 -57460 -32570 146060 -146145 41713 -111785 91307 79817 -52796 -256498 58741 -116481
$$ packed form
10646D52742I7091d41646a62975j9171d158E9616K28099F1925M7629a71115o5547
10635b36662L5130j19003B56334e328k88803a10049l203j03622C2700g0366l6629
10624a06995q0344M4010c9185m1356G4120N9792c660k34204A12177b0414q1182
10613a01596e568C00137b45647j55895a71123C1135K2787b60479C2543d0436B05898
10601c63762B007a79276A75129a73376Q2340a6002k00217E0423b09401A40776
10590a288A71152c02046f0536q520O229B83443c83809a87119q9908B25481k6871
10579A98610a19076r0890D3778b46242i6325j01843e9206A6102a29764J284A14378
10567e7460K4890A46060a46145D1713a11785I1307j1490e2796k03702E8741a16481
$$ plain form
10555 -52873 -165736 268474 -154933 -189610 -138013 201936 25334 112004 -63966 84295 -95841
10543 129363 468694 270644 33454 -28227 160151 55800 -255874 -407965 247956 159482
10533 159482 88498 -39004 -83548 64215 2901 28365 -130098 231676 -92684 -145066 244360
10521 -348626 131426 -213815 384131 84964 -1040 -257033 207974 -195501 -115052 -184242
10511 -184242 148272 -162333 -137180 303359 181662 202519 -296948 -117184 221667 -138142
10500 -341370 122737 -371388 -15622 -221307 -284090 30524 -105528 -299142 62164 106371
10490 106371 -321705 112374 15080 55328 -227960 105737 -302787 -120010 -38334 -135016
10480 -135016 -89007 -126709 183612 48515 107801 54575 -158408 -292281 104478 236648
$$ packed form
10555e2873j12863B68474a54933l4677N1597B01936B5334Q6670f3966H4295i5841
10543A29363L39331j98050C3454b8227A60151E5800b55874j52091B47956q8474
10533A59482p0984c9004m4544F4215B901K5464a30098B31676i2684n2382B44360
10521c48626A31426b13815C84131H4964a040k55993B07974a95501Q0449o9190
10511a84242A48272a62333K5153C03359j21697K0857b96948a17184B21667a38142
10500c41370A22737c71388a5622k05685o2783C0524a05528j93614F2164M4207
10490A06371c21705A12374A5080M0248b27960A05737c02787a20010c8334r6682
10480a35016M6009l7702A83612D8515N9286n3226a58408j33873A04478J32170
$$ plain form
10470 236648 -80281 122057 -313207 -106492 -222809 309927 230711 115061 97948 97791 114110
10459 114110 -214335 11785 49413 -9592 -199965 -3979 -226548 119474 -252594 -225735 128524
10447 15248 -222250 -196096 -438846 -238011 75986 219942 19069 -222610 -114657 -240873
10437 -240873 -359160 -26961 378239 334675 -288337 -85839 19953 138961 102719 250905
10427 250905 169163 -94295 244577 123373 -138531 132246 238362 -41399 -315797 232881
10416 -44233 -10936 -6067 111484 -368142 -182385 -123663 32883 272744 151066 110621 313321
10405 313321 137067 145562 -61199 -344493 -49133 -42335 757 -43605 -80468 -112438 -87213 -77662
10393 -77662 74194 -71025 -159694 -310346 239483 -62990 49466 -324179 -175829 -186863 -203787
$$ packed form
10470B36648h0281A22057c13207a06492j16317C09927p9216A15061j7113j57J6319
10459A14110b14335A1785L7628i592j90373c979k22569A19474b52594K6859A28524
10447A5248b22250K6154k42750K00835G5986J43956A9069b22610J07953j26216
10437b40873j18287b6961C78239m3564b88337h5839A9953J19008l6242J48186
10427B50905q1742i4295B44577j21204a38531A32246J06116d1399k74398B32881
10416d4233a0936M869A11484c68142a82385N8722C2883K39861j21678m0445K02700
10405C13321A37067Q495f1199k83294d9133O798G57d3605l6863l1970K5225R551
10393g7662G4194g1025q8669j50652B39483f2990D9466c24179J48350j1034j6924
$$ plain form
10382 -203787 -32455 -254010 277491 159377 71331 207503 119182 411545 202835 44673
10371 98274 10428 -300669 57017 -60013 198663 273173 162730 254318 93943 59376 -127028
10359 169403 -22121 488618 685592 236671 313888 143609 545253 406057 376039 270384
10349 270384 464704 80540 456967 344718 5432 180418 187039 165266 392157 -92792 579166
10337 548297 293686 608140 571960 370108 531111 186110 415789 550262 277251 313704
10327 313704 469457 302847 279782 261836 283099 84985 399020 -25481 98072 230944 182268
10316 182268 149198 192184 -99487 -107291 55722 339644 52456 262520 -54304 142628 -20879
10304 164199 231181 316834 -130765 -131161 142875 38457 -883 148037 -98700 172375 -14767
$$ packed form
10382b03787c2455k21555B77491j18114G1331J36172q8321K92363B02835D4673
10371I8274A0428c00669E7017f0013A98663P4510j10443R1588I3943l4567a27028
10359A69403b2121D88618J96974B36671P7217A43609M01644j39196l0018j05655
10349B70384J94320H0540L76427j12249E432J74986O621k1773K26891i2792E79166
10337E48297k54611L14454l6180k01852J61003A86110K29679J34473k73011L6453
10327C13704J55753j66610k3065j7946K1263H4985L14035b5481I8072J32872m8676
10316A82268l3070M2986i9487p804E5722K83922E2456K10064e4304A42628b0879
10304A64199O6982Q5653a30765l96A42875C8457h83A48037i8700A72375a4767
$$ plain form
10292 -82738 -13431 -132918 -240671 -94186 -67131 43477 -280908 15648 -218338 88343 66423
10281 66423 266371 74684 -59900 -160986 24506 -139742 65082 -71395 125463 87604 -314661
10269 -15470 -103987 -220400 81236 49090 -126441 -286616 131162 93667 -62534 -331480 -95928
10257 81740 23136 -163383 -54604 12479 -61967 -88739 -150536 -84085 111226 103492 106834 42762
10244 71939 -21403 410700 83272 251047 64631 477400 181035 43285 -16482 338381 -50293
10232 101530 108230 154303 242282 -192640 54972 -71930 -67413 -305891 -86641 96982 -203808
10220 16358 -229625 149851 -48764 -221591 -353095 71406 353491 -40781 116173 219448
10210 219448 -135476 -74989 -541667 15704 -62270 -85270 -223753 127866 22004 -228328
$$ packed form
10292h2738a3431j19487j07753i4186K7055D3477b80908A5648b18338H8343k1920
10281F6423J99948G4684e9900j01086B4506a39742F5082g1395A25463l7859c14661
10269a5470q8517j16413H1236l2146a26441j60175A31162l7495f2534k68946i5928
10257H1740B3136a63383e4604A2479f1967k6772o1797O6451A11226p734L342D2762
10244G1939b1403D10700H3272J67775F4631M12769A81035D3285a6482C38381e0293
10232A01530O700M6073Q7979a92640E4972g1930M517k38478h6641I6982b03808
10220A6358b29625A49851d8764j72827j31504G1406K82085d0781A16173J03275
10210B19448a35476O0487m66678A5704f2270k3000j38483A27866B2004b28328
$$ plain form
10199 -405750 129467 89213 -137992 181944 -231368 129086 -352802 -212653 106799 -9908
10188 -97732 36095 -151023 224803 -147538 -45277 -135844 -16094 -145213 106752 -14198 162074
10176 -123606 -418038 52695 -61222 -262635 -162147 -53839 -401464 -56311 -99649 -155705 -39042
10164 -48797 -439373 86053 -95308 -38714 -373394 -150448 63781 -435931 187606 -89201 -127966
10153 -127966 230194 -217800 -265499 -140936 -51160 -101369 116313 -250485 -133992 -112486
10143 -112486 128585 -186056 103408 -40963 -48098 -245598 -223373 -264927 -127904 82960 -60172
10131 -28328 -380092 50728 -78511 66085 212382 -216829 33569 314735 6300 -160477 -247864
10120 -247864 -188648 155162 -84993 328341 -157224 105896 -95078 125891 -115173 -50925
$$ packed form
10199d05750A29467m0254a37992A81944b31368A29086c52802J40149A06799i908
10188i7732C6095a51023B24803a47538d5277r0567a6094j29119A06752a4198A62074
10176a23606k94432E2695f1222k01413J00488e3839l47625e6311m3338n6056c9042
10164d8797l90576H6053i5308c8714l34680a50448F3781d35931A87606h9201l8765
10153a27966B30194b17800m7699J24563e1160n0209A16313b50485J16493K1506
10143a12486A28585a86056A03408d0963p135j97500K2225m1554a27904H2960f0172
10131b8328l51764E0728g8511F6085J46297b16829C3569K81166F300a60477q7387
10120b47864N9216A55162h4993C28341a57224A05896i5078A25891a15173e0925
$$ plain form
10109 -121587 -257694 37486 -250210 -118906 581729 -413480 360658 -75579 -65302 15060
10098 -34384 -10952 98212 -172993 10805 226392 257627 126637 -22383 -75247 -211371 60819
10086 201509 -160456 -217983 117405 15590 -121025 -114456 272848 -160043 -18477 27579 16932
10075 16932 -208481 52784 239536 251165 -316791 191745 10643 -13523 57265 -220018 202703
10063 -123419 201685 -83838 -47052 -24263 201582 -79761 -85483 -292841 261044 159699 110067
10052 110067 97229 168117 29211 15063 153492 80812 66546 180044 -79418 39213 -45026
10040 -75375 -125570 -356865 7460 184871 -39331 19694 -136690 -208111 318587 80437 -359034
10028 148559 -149931 -246158 -217660 -84826 -4570 135466 -30135 -58676 -195725 73760 190569
$$ packed form
10109a21587j36107C7486b50210a18906E81729d13480C60658g5579J0277A5060
10098c4384a0952I8212a72993A0805K15587L1235A26637b2383n2864j36124F0819
10086B01509a60456n7527A17405A5590a21025O569B72848a60043a8477B7579j0647
10075A6932b08481E2784J86752J1629c16791A91745A0643a3523E7265b20018B02703
10063a23419B01685h3838L6786K2789B01582g9761n722k07358B61044j01345m9632
10052A10067j2838P0888B9211j4148J38429p2680j4266J13498g9418C9213d5026
10040g5375n0195k31295G460J77411c9331A9694a36690p1421C18587H0437c59034
10028A48559a49931r6227K8498h4826d570A35466c0135k8541j37049G3760J16809
$$ plain form
10017 190569 18571 -32369 -295359 53579 259049 136899 -278990 -339299 -160895 -72897
10006 143243 -54441 176184 -240370 107025 184080 -219784 -138959 -564815 105304 172560
9996 172560 24768 -10587 -172270 -127370 143293 -197032 -70190 -353900 -175909 -134656 -248488
9985 -248488 -62983 -19945 449419 -215845 2386 -121574 184620 -187974 -56293 -118101 -328826
9974 -328826 -97910 -163234 5223 -60702 -334299 -55169 -43398 -448703 -101553 56076 10496
9962 -168859 165622 -166257 144103 -162227 -125914 -102643 -343434 -370339 271154 -279070
9951 -164228 71094 -88197 -179828 -63550 -53742 -111187 -153556 -66281 -15271 -212225 254580
9939 -89608 96947 124438 -418752 55364 -319717 -205251 37070 67617 -127485 239013 -223195
$$ packed form
10017A90569A8571c2369k62990E3579K05470j22150b78990o0309a60895g2897
10006A43243e4441A76184b40370A07025P7055b19784Q0825m25856A05304O7256
9996A72560B4768a0587j61683M4900A43293a97032g0190k83710a75909M1253j13832
9985b48488f2983a9945D49419b15845B386a21574A84620a87974e6293o1808k10725
9974c28826i7910o5324E223f0702k73597e5169J1771m05305a01553E6076A0496
9962a68859A65622a66257A44103a62227L6313K3271k40791k6905B71154b79070
9951a64228G1094h8197r1631f3550R808n7445m2369f6281a5271j96954B54580
9939h9608I6947K7491d18752E5364c19717J14466C7070L0547a27485B39013b23195
$$ plain form
9927 -256743 -40013 -209597 203884 -34735 -22566 -171743 163332 10626 -91978 34341 -149004
9915 -239868 66783 287254 -96379 146 -62033 -4012 -51259 -645241 -203524 79049 -26832 -36780
9903 -36780 52200 -373336 88880 110951 -341893 61612 -250946 -229249 -107974 83330 -115925
9891 -227743 -383900 18288 -260537 -186841 85647 51191 -21868 132548 73667 -84003 -32002
9879 -262258 -41502 45862 -217389 -60260 -61148 139154 -64183 -71668 190340 -18840 -268292
9868 -268292 -320714 43093 83064 -142879 5755 2485 -119926 84223 -47027 51466 43560 -143937
9855 -176617 89034 69756 31665 39522 -34481 -322238 146821 -225575 53660 7999 -231613
9843 -108714 -246692 -155567 -231966 -276336 -12962 72994 -43709 3154 -299564 118448 -80134
$$ packed form
9927b56743d0013j69584B03884c4735J2169j49177A63332A0626i1978C4341a49004
9915b39868F6783K20471i6379A46f2033d012m7247n93982b03524G9049b6832r948
9903c6780E2200c73336H8880K2071c41893F1612b50946K1697a07974H3330a15925
9891b27743j56157A8288b60537P3696H5647l4456b1868A32548n8881h4003c2002
9879b62258d1502D5862b17389f0260q88A39154f4183p485A90340a8840k49452
9868b68292n2422D3093L9971a42879E755B485a19926H4223d7027E1466p906a43937
9855a76617H9034j9278C1665P857c4481k87757A46821b25575E3660G999b31613
9843a08714j37978R1125p6399m4370a2962G2994d3709C154b99564A18448h0134
$$ plain form
9831 -234117 27779 123178 28255 36295 77840 -121521 141248 20697 -370954 -87978 -108261
9820 -108261 17662 18959 -151648 -450999 -144843 -248883 -97738 -70474 32312 14135 -72839
9808 -192705 -74785 -184156 161413 -135216 -207241 90284 -134218 -114118 -51258 -81491 131078
9796 65480 -239280 -180555 127218 -140430 42877 -13083 -150073 159091 -418516 26259 53192
9785 53192 -92052 -17125 -95605 72765 21431 140720 -128193 -228667 -161402 -204051 119991
9773 -364417 -244887 -299872 -229698 81943 -173656 -429806 -123561 29878 -443304 -133958
9762 1883 29485 -300850 -2357 172886 -69249 74733 36517 -92175 -188647 -147717 -158710 -223316
9750 -223316 -7008 53944 67734 124222 239722 -243982 -179540 -15845 358666 15571 -346906
$$ packed form
9831b34117B7779R5399B8255Q040M1545a21521A41248B0697c70954h7978k0283
9820a08261A7662J297a51648k99351a44843j04040i7738K7264C2312A4135g2839
9808a92705g4785j09371A61413a35216p2025I0284a34218K0100e1258l0233A31078
9796F5480b39280N8725A27218a40430D2877a3083j36990A59091d18516B6259K6933
9785E3192i2052a7125p8480G2765B1431J19289a28193j00474O7265m2649A19991
9773c64417J19530n4985P0174H1943a73656k56150a23561B9878d43304a33958
9762A883K7602c00850b357A72886f9249G4733C6517i2175r6472M0930j0993o4606
9750b23316g008E3944J3790N6488J15500b43982O4442a5845C58666A5571c46906
$$ plain form
9738 -259216 43119 -35781 -331093 -249639 203230 -241812 -358389 -207797 -94050 -56982 -203436
9727 -203436 -135050 -66034 -95844 106023 123337 159261 213111 -110922 -27462 -321405 -139912
9715 25154 -104688 18423 -166378 -288013 -61755 2331 -312967 -24706 -180141 456995 -22799
9703 -168132 310589 -302159 -64226 -204874 -141954 -79554 55415 -252398 51746 -273709 -26584
9691 47935 -174869 -252432 -106934 -373269 105884 -94220 82982 -306425 -531054 -311717
9681 -311717 -160079 -97497 -92582 -58573 32735 -169672 -50832 158771 -53448 -102619 -253933
9670 -253933 -31646 66962 -100100 174342 -52025 -25931 -97945 60832 -338330 10928 -280686
9658 -76358 5044 -132484 10085 -114350 -153612 203831 235182 8611 95062 -14425 260195
$$ packed form
9738b59216D3119c5781k95312Q1454B03230b41812j16577J50592i4050L7068j46454
9727b03436O8386f6034k9810A06023J7314L5924N3850a10922b7462k93943a39912
9715B5154a04688A8423a66378j21635f1755B331c12967b4706j55435D56995b2799
9703a68132C10589c02159f4226j40648O2920O2400E5415b52398E1746b73709b6584
9691D7935a74869p7563a06934k66335A05884i4220H2982c06425k24629K19337
9681c11717J51638O2582M915L4009C2735a69672e0832A58771e3448m9171j51314
9670b53933c1646F6962a00100A74342e2025b5931p2014F0832c38330A0928b80686
9658g6358E044a32484A0085a14350l9262B03831L1351H611Q6451a4425B60195
$$ plain form
9646 -66175 15596 -92 117166 -224881 180521 -283155 -227442 -246226 -414726 45960 -259054
9634 148139 111922 -176603 118927 -121421 351762 98661 109490 76122 -21639 101179 16783
9622 -14385 -295784 -87268 -217304 56482 -226398 -16377 -144599 576 198236 -95668 -274185
9611 -274185 97399 -21367 206394 16411 -252849 272603 -124062 7018 18354 237189 315040
9600 315040 -308633 87303 -150678 -16180 -297357 -111940 -98376 -215845 162816 132974
9590 132974 -309915 -183675 89386 155433 57640 24346 312168 -27913 -18797 -123756 -183360
9579 -183360 229979 16050 19751 -40810 471964 -10356 -67299 245518 -167756 -8769 -551608
9568 -551608 -217568 -90183 78653 -31971 58596 -102802 68445 -26295 -125560 -307146 -52760
$$ packed form
9646f6175A5596i2A17166b24881A80521b83155N5713j8784j68500D5960b59054
9634A48139l6217a76603A18927a21421C51762I8661J0829l3368b1639A01179A6783
9622a4385k81399h7268j30036E6482b26398a6377j28222E76J97660i5668j78517
9611b74185I7399b1367B06394A6411b52849B72603a24062G018J1336K18835P7851
9600C15040c08633H7303a50678a6180k81177a11940J3564j17469A62816k9842
9590A32974c09915J26240H9386O6047E7640B4346K87822b7913R116j04959n9604
9579a83360B29979A6050L701d0810D71964a0356n6943B45518a67756h769n42839
9568e51608b17568i0183G8653c1971E8596a02802F8445b6295r9265j81586e2760
$$ plain form
9556 -5585 -32812 -554724 -233944 -244809 -77859 77720 -84588 -39258 -177526 -93852 -267701
9545 -267701 331455 -12661 61883 85885 89337 -240935 -294989 -77276 -99537 -131295 -19117
9533 -33313 62751 -27859 -186651 10751 74642 139060 -189823 -118173 -437280 -55700 207521
9521 -102436 -93015 -121367 -134947 65362 -291944 44248 139365 15759 75868 78899 -110653 -240526
9509 -240526 11945 -86788 4882 -66869 162165 168378 157751 -197723 -93402 -58745 158387
9497 -290946 183984 -73594 118536 13029 28120 -210153 -386019 -17964 -243080 -235850 31815
9485 -140366 -48361 -203312 90976 -50142 294576 16149 -214715 -293457 -250791 -145250 146340
9473 64888 76709 42384 118634 -20761 -162002 -65418 93239 -3837 -44286 -140088 -73309 -193602
$$ packed form
9556e585k7227n21912b33944j0865g7859G7720h4588c9258j38268Q3674j73849
9545b67701C31455a2661F1883K4002L452b40935n4054g7276k2261l1758a9117
9533c3313F2751b7859j58792A0751O3891O4418a89823P1650l19107e5700B07521
9521a02436R421k8352j3580F5362b91944D4248R5117A5759O0109L031a10653j29873
9509b40526A1945h6788D882f6869A62165O213j0627a97723i3402L4657A58387
9497b90946A83984g3594A18536A3029J5091b10153j75866a7964k25116P230C1815
9485a40366d8361j54951I0976e0142B94576A6149b14715p8742M2666J05541A46340
9473F4888J1821l4325P6250b0761j41241f5418I3239c837m0449r5802O6779j20293
$$ plain form
9461 -193602 134907 -203319 -122322 -283839 102642 -142468 110841 -572679 73301 -203421
9450 -349779 35715 -116027 -168208 77802 27070 171153 -67407 48356 -277053 -38210 108670
9438 30942 -115523 -1833 -224632 -8781 74729 -159255 101775 -121309 86458 -220542 -84145
9426 94476 221415 -49505 -145765 -392508 -31554 -44360 -304757 -23653 -316183 -415814 11578
9414 99990 -512992 43722 -353072 -35477 -179352 26144 47601 69246 -4905 43080 6765 -248697
9401 -41412 -28942 68082 -82042 -53920 115064 -190124 -59176 -80476 -85811 107227 -129658
9389 -121014 -359482 -222556 121726 -145851 -177889 8244 247616 -383001 -229161 -481400
9379 -481400 -199936 -16245 32709 22197 -36974 29089 -357439 -310394 152651 -93265 -9535
$$ packed form
9461a93602A34907b03319Q0997j61517A02642a42468A10841e72679G3301b03421
9450c49779C5715a16027n2181G7802B7070J44083f7407D8356b77053c8210A08670
9438C0942a15523a833k22799h781G4729a59255A01775a21309H6458b20542h4145
9426I4476J26939d9505r6260k46743c1554j2806k60397b3653k92530r9631A1578
9414I9990e12992D3722c53072c5477j43875B6144K1457K1645d905D3080F765b48697
9401d1412J2470F8082h2042K8122A15064a90124e9176k1300n335A07227a29658
9389a21014k38468J36926A21726a45851l2038H244K39372c83001J53840k52239
9379d81400a99936a6245C2709j0512c6974B9089c57439M7045A52651i3265i535
$$ plain form
9367 243355 -73655 78499 -187916 51418 -181969 -70206 -120222 -277191 -173976 137474 -47195
9355 201063 -107373 -30695 81871 -12628 53202 46362 -279569 174918 68700 189019 -126237
9343 -310180 -37336 143150 61212 239383 179011 85504 192388 -118928 -415084 -323891 -51368
9331 -84960 -232528 146194 -29767 22350 235370 -73071 123480 -118104 -50437 235056 -8124
9319 93915 -121848 66839 -3128 -66534 249070 -25593 -522429 -10410 -129378 -10603 -202913
9308 -202913 91001 25065 -57703 187106 -134482 90707 -66921 -231095 -333925 16972 -135182
9296 -73549 83731 -318983 -124025 -97179 -70839 -16603 -13402 -86851 -72118 -141258 -2473 -144172
9284 -144172 -69313 -306592 179488 62890 -94253 -46020 -162269 -86994 -93692 -63813 147801
$$ packed form
9367B43355g3655G8499a87916E1418a81969g0206n0016j56969J03215A37474d7195
9355B01063a07373c0695H1871a2628E3202o840b79569A74918F8700J20319a26237
9343c10180c7336A43150F1212J78171o0372H5504J06884a18928k96156R1193e1368
9331h4960j47568A46194b9767B2350K13020g3071A23480a18104e0437B35056h124
9319I3915a21848F6839c128o3406B49070b5593m96836a0410j18968a0603j92310
9308b02913I1001B5065e7703A87106a34482I0707f6921j64174j02830A6972a35182
9296g3549H3731c18983a24025K6846K6340a6603L201p3449J4733o9140b473j41699
9284a44172f9313k37279A79488F2890i4253d6020j16249P5275o698K9879A47801
$$ plain form
9272 -295382 -160862 -131604 13545 167256 280605 -146900 323659 87423 -65774 -54785 -423781
9261 -423781 -396116 53961 -51443 -153037 -69017 -68912 -44905 128704 -146045 50987 -242516
9249 -212571 -169190 -13553 -276308 -400235 26086 -140902 -162358 -153116 45200 -51110 92055
9237 -64083 148054 -76797 -401882 -425 44952 -83182 -402181 1512 -45709 119397 196454 -268158
9224 202046 -141656 -4394 13987 -185219 268667 -11101 -133470 -229346 -72863 -341553 92796
9212 404336 43561 -299303 -50784 -84908 -469417 -36293 -551564 -143752 -49797 -134843 50995
9200 210316 66972 -48901 -289771 37988 32125 -390547 124557 78153 -54167 -77551 -145582
9189 -145582 181109 68317 -156129 -21471 -119970 -52052 28005 4049 -78369 -158118 55244
$$ packed form
9272b95382J34520K9258A3545J53711J13349a46900C23659H7423f5774J0989l68996
9261d23781K7665E3961e1443j01594f9017J05K4007A28704a46045E0987b42516
9249b12571M3381a3553k62755j23927B6086a40902k1456R242D5200e1110I2055
9237f4083A48054g6797l25085d25D4952h3182l18999A512d5709A19397P7057b68158
9224B02046a41656d394A3987a85219B68667a1101j22369r5876g2863k68690I2796
9212D04336D3561b99303e0784l4124l84509c6293n15271a43752d9797q5046E0995
9200B10316F6972d8901k40870C7988n863c90547A24557m6404e4167k3384o8031
9189a45582A81109F8317a56129b1471r8499e2052B8005D049g8369p9749E5244
$$ plain form
9177 99828 -33632 -454968 -240295 343514 37040 -114006 -32025 318386 -180803 -78714 147233
9165 -54224 -153486 -7984 184435 35260 107949 19581 44895 -262730 35974 -196996 -250432
9154 -250432 189094 -576648 128196 40692 100229 32639 -79151 35558 -468013 91138 -29560
9142 102771 125087 -326207 -53848 -7023 197794 -71213 -40307 130901 -122816 -298520 54848
9130 -52703 257657 -92014 22318 60160 223105 -142457 48784 245019 171005 -89085 -63488
9119 -63488 -63864 -334500 -129395 -325678 -126088 -204956 -146714 -25492 -169200 72481 -139279
9107 -26069 -41010 -211366 30236 -2622 109140 -313614 3134 -112302 -166395 -79902 -99473
9096 -99473 -44816 -17771 -5509 845 -120955 64977 -81197 -135042 192177 63536 -27348 -335696
$$ packed form
9177I9828c3632m21336K14673C43514C7040a14006c2025C18386a80803g8714A47233
9165e4224r9262g984A84435C5260P2689A9581K5314b62730C5974a96996n3436
9154b50432A89094e76648A28196D0692N9537C2639g9151C5558d68013I1138b9560
9142A02771K2316c26207e3848g023A97794g1213L0906A30901a22816j75704E4848
9130e2703B57657i2014B2318L7842J62945a42457D8784J96235p4014h9085K5597
9119f3488l76k70636a29395j96283a26088p8868N8242b5492j43708G2481a39279
9107b6069j4941j70356C0236b622A09140c13614C134a12302n4093g9902j9571
9096i9473d4816a7771e509H45a20955F4977h1197n3845A92177F3536b7348l08348
$$ plain form
9084 -335696 -33297 -143912 133605 -48609 -187831 -158736 -139435 -146382 -298513 -34935 17563
9072 -61905 60888 -67982 4248 -63833 62629 120800 13562 74355 -26336 -437522 111454 -150568
9059 88549 -142088 33035 -220617 -48864 -79107 -15211 -55181 -93342 -129804 -203849 123373
9047 -46341 -56582 185000 -174069 -381052 100814 97362 -231193 -39696 -218185 -199633 86255
9035 -31070 -146093 -311893 -22037 -277629 355873 74472 -136620 -142303 -131901 116871 -173543
9023 103450 -154830 56293 -276258 -397983 -371491 238197 212019 -539724 -52173 -62455 69061
9011 52622 -124599 172402 85527 -280672 192925 -131548 265353 -68269 101346 425265
9001 425265 -214185 -127779 -529886 -244140 -15073 30657 79274 53476 67442 -103511 28015
$$ packed form
9084c35696c3297j10615A33605d8609j39222K9095J9301o947j52131c4935A7563
9072f1905F0888f7982D248f3833F2629N8171A3562O0793b6336m11186A11454a50568
9059H8549a42088C3035b20617d8864l0243a5211l9970l8161l6462p4045A23373
9047d6341j0241A85000a74069k06983A00814l452b31193c9696j78489J8552H6255
9035c1070j15023j65800b2037k55592C55873G4472a36620n683J0402A16871a73543
9023A03450a54830E6293b76258j21725K6492B38197k6178e39724e2173j0282F9061
9011E2622a24599A72402H5527b80672A92925a31548B65353f8269A01346L23919
9001D25265b14185Q6406m02107b44140a5073C0657M8617k5798J3966a03511B8015
$$ plain form
8989 -105989 -55328 -61232 -180442 15767 -56403 21826 -116276 -166830 76372 -75177 1401 160404
8977 160404 -237535 -209902 -12392 45563 173764 -250264 10303 8513 -209474 -226750 -103867
8965 -255522 -10436 133896 -165689 18089 -309793 29942 -156592 -190717 83167 -55156 -44394
8954 -44394 -149023 -66219 -152107 158531 -227000 362030 20217 -74083 -58304 -79952 20063
8942 164042 -226895 7228 237215 -205848 -294290 -77060 -420914 -143962 -12652 227319 -51224
8930 -328884 -286123 -31526 -130030 51479 9353 259750 -255435 -6833 56540 -35713 -120700 201214
8917 392305 -94083 251297 261254 129198 -34865 252096 218719 462122 1178416 2136213 3580454
8906 3580454 7250115 7549245 4165762 2434362 1745276 1122266 926219 445290 511887
$$ packed form
8989a05989N0661n904j19210A5767e6403B1826a16276n0554G6372g5177A401J59003
8977A60404b37535K7633a2392D5563J28201b50264A0303j790b09474j7276a03867
8965b55522a0436A33896a65689A8089c09793B9942a56592l4125H3167e5156J0762
8954d4394j04629f6219q5888A58531b27000C62030B0217g4083J5779k1648B0063
8942A64042b26895G228K29987b05848q8442g7060l43854a43962a2652B27319e1224
8930c28884M2761c1526r8504E1479I353K50397b55435f833E6540c5713q4987B01214
8917C92305i4083B51297R957A29198c4865B52096l3377K43403P16294R57797J444241
8906C580454L669661K99130l383483j731400o89086o23010j96047D45290O6597
$$ plain form
8897 511887 231582 246626 280527 -265678 -37416 9135 22310 348329 338950 36736 -44405
8885 -129053 -23442 -31325 -40663 312190 -3826 55908 153558 -414710 -9941 52570 36168 -89987
8872 -98185 -190323 -179845 -124221 87249 39465 -236952 318296 164362 -131225 46488 -146059
8860 -80406 -166520 93271 -110819 -220015 105014 -352290 -104692 -338442 34 177053 -2805
$$ packed form
8897E11887B31582J5044L3901b65678c7416I135J3175L26019r379C6736d4405
8885a29053b3442p883r338C12190c826E5908R7650d14710i941E2570j6402h9987
8872i8185r2138J0478N5624H7249C9465b36952C18296j53934a31225D6488a46059
8860h0406q6114I3271a10819j09196A05014c52290a04692k33750C4J77019b805
$$ [...]
##END NTUPLES=NMR SPECTRUM
##END=
