
##TITLE=UV1135_M4-1010-1000_6275302_IIIKKVbreX
##JCAMPDX= 6.0         $$ Bruker NMR JCAMP-DX V2.0
##DATA TYPE= NMR SPECTRUM
##DATA CLASS= NTUPLES
##ORIGIN= BRUKER
##OWNER= Administrator
$$ 1.72 TOPSPIN		Version 2.1
$$ 2012-06-03 04:06:58.515 -0500  Administrator@TOPSPIN
$$ Compression mode = diff/dup
##.OBSERVE FREQUENCY= 400.13188235
##.OBSERVE NUCLEUS= ^1H
##.ACQUISITION MODE= SIMULTANEOUS (DQD)
##.ACQUISITION SCHEME= undefined
##.AVERAGES= 64
##.DIGITISER RES= 22
##SPECTROMETER/DATA SYSTEM= spect
##.PULSE SEQUENCE= noesygpps1d.comp
##.SOLVENT NAME= COFFEE_meoh
##.SHIFT REFERENCE= INTERNAL, COFFEE_meoh, 1, 14.96684
##AUDIT TRAIL= $$ (NUMBER, WHEN, WHO, WHERE, PROCESS, VERSION, WHAT)
$$ ##TITLE= Audit trail, TOPSPIN		Version 2.1
$$ ##JCAMPDX= 5.01
$$ ##ORIGIN= Bruker BioSpin GmbH
$$ ##OWNER= Administrator
$$ $$ C:\Bruker\TOPSPIN/data/COFFEE/nmr/UV1135_M4-1010-1000_6275302_IIIKKVbreX/12/pdata/1/auditp.txt
$$ ##AUDIT TRAIL=  $$ (NUMBER, WHEN, WHO, WHERE, PROCESS, VERSION, WHAT)
(   1,<2012-06-03 04:06:53.250 -0500>,<Administrator>,<TOPSPIN>,<go>,<TOPSPIN 2.1>,
      <created by zg
	started at 2012-06-03 03:55:23.000 -0500,
	POWCHK enabled, PULCHK disabled,
       configuration hash MD5:
       D5 CA 7A 23 FE 6B EE E2 50 67 74 61 24 F7 5E 3B
       data hash MD5: 64K
       C1 AD 29 FD 39 DC F6 11 BB DE 7B 91 F8 92 CE 84>)
(   2,<2012-06-03 04:06:56.218 -0500>,<Administrator>,<TOPSPIN>,<proc1d>,<TOPSPIN 2.1>,
      <Start of raw data processing
       efp LB = 0.3 FT_mod = 6 PKNL = 1 PHC0 = 0 PHC1 = 0 SI = 128K 
       data hash MD5: 128K
       E4 A5 EB 1F A6 6D 41 61 C0 6A D0 B1 E3 7D 38 4E>)
(   3,<2012-06-03 04:06:57.390 -0500>,<Administrator>,<TOPSPIN>,<proc1d>,<TOPSPIN 2.1>,
      <pk PHC0 = 34.37073 PHC1 = 0 
       data hash MD5: 128K
       6E C7 C1 C5 47 F6 1C 6D 4B 33 C0 8C FB 2E 32 6B>)
(   4,<2012-06-03 04:06:58.109 -0500>,<Administrator>,<TOPSPIN>,<proc1d>,<TOPSPIN 2.1>,
      <abs ABSG = 1 
       data hash MD5: 128K
       D6 03 45 C2 AB 57 CB 21 F5 45 A9 89 26 E4 82 3A>)
(   5,<2012-06-03 04:06:58.203 -0500>,<Administrator>,<TOPSPIN>,<proc1d>,<TOPSPIN 2.1>,
      <abs ABSG = 2 
       data hash MD5: 128K
       05 9A D7 08 57 10 24 7E 7D EE EC 17 5C B1 9C 01>)
(   6,<2012-06-03 04:06:58.281 -0500>,<Administrator>,<TOPSPIN>,<proc1d>,<TOPSPIN 2.1>,
      <abs ABSG = 3 
       data hash MD5: 128K
       BC FA 10 6B 62 C5 92 79 61 D5 B5 3F E3 55 59 B2>)
(   7,<2012-06-03 04:06:58.343 -0500>,<Administrator>,<TOPSPIN>,<proc1d>,<TOPSPIN 2.1>,
      <abs ABSG = 4 
       data hash MD5: 128K
       EC 01 6E 7B 2D EA 4C E3 0C 6C BA DE F4 74 21 24>)
(   8,<2012-06-03 04:06:58.421 -0500>,<Administrator>,<TOPSPIN>,<proc1d>,<TOPSPIN 2.1>,
      <abs ABSG = 5 
       data hash MD5: 128K
       7B D0 A0 62 D1 D7 B4 79 FB E1 A6 99 FD B5 F2 C3>)
$$ ##END=
$$ 
$$ $$ hash MD5
$$ $$ 46 E3 F8 C5 37 B5 F8 6E 5C 68 A4 B2 BF 81 60 F5
##$RELAX= 
##$RELAX= 
##$RELAX= 
##$RELAX= 
##$RELAX= 
##$RELAX= 
##$RELAX= 
##$RELAX= 
$$ Bruker specific parameters
$$ [...]
##$TP07= 0
##$TPNAME0= <>
##$TPNAME1= <>
##$TPNAME2= <>
##$TPNAME3= <>
##$TPNAME4= <>
##$TPNAME5= <>
##$TPNAME6= <>
##$TPNAME7= <>
##$TPOAL= (0..7)
0.5 0.5 0.5 0.5 0.5 0.5 0.5 0.5
##$TPOFFS= (0..7)
0 0 0 0 0 0 0 0
##$TUNHIN= 0
##$TUNHOUT= 0
##$TUNXOUT= 0
##$USERA1= <user>
##$USERA2= <user>
##$USERA3= <user>
##$USERA4= <user>
##$USERA5= <user>
##$V9= 5
##$VALIST= <valist>
##$VCLIST= <CCCCCCCCCCCCCCC>
##$VD= 0
##$VDLIST= <DDDDDDDDDDDDDDD>
##$VPLIST= <PPPPPPPPPPPPPPP>
##$VTLIST= <TTTTTTTTTTTTTTT>
##$WBST= 2048
##$WBSW= 25
##$XGAIN= (0..3)
0 0 0 0
##$XL= 0
##$YL= 0
##$YMAX_a= 10862671
##$YMIN_a= -6931335
##$ZGOPTNS= <>
##$ZL1= 120
##$ZL2= 120
##$ZL3= 120
##$ZL4= 120
##$ABSF1= 14.96684
##$ABSF2= -5.58569
##$ABSG= 5
##$ABSL= 3
##$ALPHA= 0
##$AQORDER= 0
##$ASSFAC= 0
##$ASSFACI= 0
##$ASSFACX= 0
##$ASSWID= 0
##$AUNMP= <proc_prof1d_extract.lims>
##$AXLEFT= 0
##$AXNAME= <>
##$AXNUC= <1H>
##$AXRIGHT= 0
##$AXTYPE= 0
##$AXUNIT= <>
##$AZFE= 0.1
##$AZFW= 0.1
##$BCFW= 0
##$BC_mod= 0
##$BYTORDP= 0
##$COROFFS= 0
##$CY= 15
##$DATMOD= 1
##$DC= 0
##$DFILT= <>
##$DTYPP= 0
##$F1P= 0
##$F2P= 0
##$FCOR= 0.5
##$FTSIZE= 131072
##$FT_mod= 6
##$GAMMA= 0
##$GB= 0
##$INTBC= 1
##$INTSCL= 1
##$ISEN= 128
##$LB= 0.3
##$LEV0= 0
##$LPBIN= 0
##$MAXI= 10000
##$MC2= 0
##$MEAN= 0
##$ME_mod= 0
##$MI= 0
##$NCOEF= 0
##$NC_proc= -3
##$NLEV= 6
##$NOISF1= 0
##$NOISF2= 0
##$NSP= 0
##$NTH_PI= 0
##$NZP= 0
##$OFFSET= 14.96684
##$PC= 1
##$PHC0= 34.37073
##$PHC1= 0
##$PH_mod= 1
##$PKNL= yes
##$PPARMOD= 0
##$PPDIAG= 0
##$PPIPTYP= 0
##$PPMPNUM= 2147483647
##$PPRESOL= 1
##$PSCAL= 4
##$PSIGN= 0
##$PYNMP= <proc.py>
##$REVERSE= no
##$SF= 400.130005509629
##$SI= 131072
##$SIGF1= 0
##$SIGF2= 0
##$SINO= 400
##$SIOLD= 131072
##$SPECTYP= <>
##$SREGLST= <1H.CDCl3>
##$SSB= 0
##$STSI= 131072
##$STSR= 0
##$SW_p= 8223.68421052632
##$SYMM= 0
##$S_DEV= 0
##$TDeff= 65536
##$TDoff= 0
##$TI= <>
##$TILT= no
##$TM1= 0
##$TM2= 0
##$TOPLEV= 0
##$USERP1= <user>
##$USERP2= <user>
##$USERP3= <user>
##$USERP4= <user>
##$USERP5= <user>
##$WDW= 1
##$XDIM= 131072
##$YMAX_p= 450801627
##$YMIN_p= -451621193
##$CURPLOT= <Network HP LaserJet P1505>
##$CURPRIN= <$Network HP LaserJet P1505>
##$DFORMAT= <normdp>
##$LAYOUT= <+/1D_H.xwp>
##$LFORMAT= <normlp>
##$PFORMAT= <normpl>
##$SURQMSG= 1
$$ End of Bruker specific parameters
$$ ---------------------------------
##NTUPLES= NMR SPECTRUM
##VAR_NAME=  FREQUENCY,     SPECTRUM/REAL,   SPECTRUM/IMAG
##SYMBOL=    X,             R,               I
##VAR_TYPE=  INDEPENDENT,   DEPENDENT,       DEPENDENT
##VAR_FORM=  AFFN,          ASDF,            ASDF
##VAR_DIM=   131072,        131072,          131072
##UNITS=     HZ,            ARBITRARY UNITS, ARBITRARY UNITS
##FACTOR=    0.0627417313425165, 1,          1
##FIRST=     8223.62146879498, -1209,        -105985
##LAST=      0,             1758,            -107414
##MIN=       0,             -451621193,      0
##MAX=       8223.62146879498, 450801627,    0
$$ Real data points
##PAGE= N=1
##DATA TABLE= (X++(R..R)), XYDATA
$$ [...]
$$ plain form
62406 2720562 2655199 2581593 2501984 2418974 2334258 2248364 2161623 2074939 1989762 1907884 1831158
62395 1831158 1760644 1695863 1635451 1578704 1526003 1477879 1434480 1396043 1362945 1334792 1310206
62384 1310206 1288022 1268084 1250442 1234590 1220276 1208453 1200366 1195829 1193095 1190288 1186332 1180825
62372 1180825 1174016 1167038 1161233 1156684 1151752 1144492 1134458 1123052 1112192 1102585 1093119 1082061 1068953
62359 1068953 1055115 1042148 1030436 1019570 1009648 1001204 993908 986397 977770 968586 959916 951885 943758
62346 943758 935306 927487 921567 917800 915281 913155 911571 911085 911452 911897 912671 915196 919922 925008 928391
62331 928391 930671 934508 941223 949419 957301 965040 974057 984938 997018 1009594 1022775 1037270 1053758
62318 1053758 1072183 1091388 1109832 1127087 1144495 1164086 1187023 1213098 1241356 1271085 1302537
$$ packed form
62406B720562o5363p3606p9609q3010q4716q5894q6741q6684q5177q1878p6726
62395A831158p0514o4781o0412n6747n2701m8124m3399l8437l3098k8153k4586
62384A310206k2184j9938j7642j5852j4314j1823q087m537k734k807l956n507
62372A180825o809o978n805m549m932p260j0034j1406j0860r607r466j1058j3108
62359A068953j3838j2967j1712j0866r922q444p296p511q627r184q670q031q127
62346I43758q452p819n920l767k519k126j584m86L67M45P74K525M726N086L383
62331I28391K280L837O715Q196P882P739R017J0881J2080J2576J3181J4495J6488
62318A053758J8425J9205J8444J7255J7408J9591K2937K6075K8258K9729L1452
$$ plain form
62307 1302537 1336714 1374144 1414131 1455847 1499905 1547876 1600366 1656764 1717053 1782542 1854284
62296 1854284 1931923 2014518 2101054 2189358 2276061 2358932 2438002 2512989 2580829 2637611 2682173
62285 2682173 2715991 2740179 2754587 2759441 2755500 2742410 2719063 2686196 2646850 2603551 2556651 2506095
62273 2506095 2453053 2398774 2343317 2286725 2230283 2175333 2121826 2069317 2018480 1970219 1923925
62262 1923925 1878105 1832410 1787776 1744812 1703315 1663179 1624441 1586352 1547667 1508346 1470078
62251 1470078 1434722 1402815 1373880 1347567 1324069 1303694 1286224 1270618 1255585 1240824 1227375
62240 1227375 1216143 1206372 1196472 1186237 1177206 1170623 1166058 1162491 1159887 1158948 1159870 1162112 1165165 1168986
62226 1168986 1173750 1179545 1186145 1192913 1199314 1205866 1214156 1225369 1239043 1253807 1269082 1285548 1304159
$$ packed form
62307A302537L4177L7430L9987M1716M4058M7971N2490N6398O0289O5489P1742
62296A854284P7639Q2595Q6536Q8304Q6703Q2871P9070P4987O7840N6782M4562
62285B682173L3818K4188J4408M854l941j3090k3347l2867l9346m3299m6900n0556
62273B506095n3042n4279n5457n6592n6442n4950n3507n2509n0837m8261m6294
62262A923925m5820m5695m4634m2964m1497m0136l8738l8089l8685l9321l8268
62251A470078l5356l1907k8935k6313k3498k0375j7470j5606j5033j4761j3449
62240A227375j1232r771r900j0235r031o583m565l567k604r39R22K242L053L821
62226A168986M764N795O600O768O401O552Q290J1213J3674J4764J5275J6466J8611
$$ plain form
62213 1304159 1325415 1349394 1375637 1402827 1429522 1455780 1483603 1515294 1551752 1592736 1638258
62202 1638258 1688858 1744764 1805647 1871511 1943136 2021173 2105041 2193125 2283924 2376714 2471020
62191 2471020 2565579 2657803 2744202 2821468 2887370 2940840 2981490 3009304 3024613 3027902 3019401 2999116
62179 2999116 2967454 2925646 2875284 2817517 2752838 2681611 2604759 2524151 2442421 2362147 2284946
62168 2284946 2211301 2141175 2074451 2010825 1949905 1891892 1837811 1788528 1743765 1702514 1664204
62157 1664204 1628905 1596550 1566701 1539166 1514246 1492129 1472415 1454439 1437760 1422370 1408878
62146 1408878 1398442 1391838 1388352 1386192 1384309 1383198 1383552 1384939 1386692 1389610 1395539 1405142 1417060 1429704
62132 1429704 1443037 1457834 1473811 1489593 1504605 1519986 1537100 1555824 1575067 1594609 1615382
$$ packed form
62213A304159K1256K3979K6243K7190K6695K6258K7823L1691L6458M0984M5522
62202A638258N0600N5906O0883O5864P1625P8037Q3868Q8084R0799R2790R4306
62191B471020R4559R2224Q6399P7266O5902N3470M0650K7814J5309L289q501k0285
62179B999116l1662m1808n0362n7767o4679p1227p6852q0608q1730q0274p7201
62168B284946p3645p0126o6724o3626o0920n8013n4081m9283m4763m1251l8310
62157A664204l5299l2355k9849k7535k4920k2117j9714j7976j6679j5390j3492
62146A408878j0436o604l486k160j883j111L54J387J753K918N929R603J1918J2644
62132A429704J3333J4797J5977J5782J5012J5381J7114J8724J9243J9542K0773
$$ plain form
62121 1615382 1637768 1660521 1681875 1701210 1719138 1736500 1753978 1772346 1792336 1814267 1838320
62110 1838320 1865108 1895451 1929716 1967964 2010618 2058251 2110615 2166488 2224487 2283350 2341363
62099 2341363 2396317 2446448 2490869 2528960 2560003 2583590 2599548 2607132 2605206 2593905 2575272 2551327
62087 2551327 2522077 2486438 2444752 2399263 2352140 2304113 2255405 2207082 2160748 2117200 2076025
62076 2076025 2036626 1999329 1965251 1935121 1908420 1883735 1859696 1835417 1810542 1785643 1762494
62065 1762494 1743041 1727657 1714921 1703475 1693548 1686287 1682207 1680917 1681904 1684825 1689142 1694030 1698729
62052 1698729 1702797 1706153 1708935 1710992 1711509 1709769 1706508 1703696 1702512 1702185 1701255 1699122 1695612 1689984 1681579
62037 1681579 1670954 1659300 1647092 1634427 1622303 1612238 1604658 1598828 1594505 1592578 1593817 1597950
$$ packed form
62121A615382K2386K2753K1354J9335J7928J7362J7478J8368J9990K1931K4053
62110A838320K6788L0343L4265L8248M2654M7633N2364N5873N7999N8863N8013
62099B341363N4954N0131M4421L8091L1043K3587J5958P584j926j1301j8633k3945
62087B551327k9250l5639m1686m5489m7123m8027m8708m8323m6334m3548m1175
62076B076025l9399l7297l4078l0130k6701k4685k4039k4279k4875k4899k3149
62065A762494j9453j5384j2736j1446r927p261m080j290R87K921M317M888M699
62052A698729M068L356K782K057N17j740l261k812j184l27r30k133l510n628q405
62037A681579j0625j1654j2208j2665j2124j0065p580n830m323j927J239M133
$$ plain form
62025 1597950 1604256 1612328 1622101 1633936 1648844 1667756 1690323 1715066 1740867 1767648 1795674 1825166
62013 1825166 1856701 1890887 1927225 1964234 2001178 2038867 2078277 2119225 2161002 2203575 2247379
62002 2247379 2292329 2337649 2382396 2425567 2465754 2500936 2528746 2547376 2556801 2558903 2555542 2546593
61990 2546593 2530659 2507509 2478477 2444311 2404172 2357519 2305745 2250970 2194170 2135531 2075874
61979 2075874 2016579 1958560 1902311 1848644 1798395 1751513 1707115 1664366 1622994 1583381 1546615
61968 1546615 1513818 1484725 1457421 1430185 1403182 1377637 1353924 1331353 1309347 1287729 1266047
61957 1266047 1243803 1221577 1201020 1183308 1167918 1153148 1137706 1121919 1107568 1096338 1088268
61946 1088268 1082111 1077256 1074545 1074749 1077092 1079971 1082514 1084659 1086425 1088093 1090615 1094718 1099826 1104700
$$ packed form
62025A597950O306Q072R773J1835J4908J8912K2567K4743K5801K6781K8026K9492
62013A825166L1535L4186L6338L7009L6944L7689L9410M0948M1777M2573M3804
62002B247379M4950M5320M4747M3171M0187L5182K7810J8630R425K102l361q949
61990B546593j5934k3150k9032l4166m0139m6653n1774n4775n6800n8639n9657
61979B075874n9295n8019n6249n3667n0249m6882m4398m2749m1372l9613l6766
61968A546615l2797k9093k7304k7236k7003k5545k3713k2571k2006k1618k1682
61957A266047k2244k2226k0557j7712j5390j4770j5442j5787j4351j1230q070
61946A088268o157m855k711K04K343K879K543K145J766J668K522M103N108M874
$$ plain form
61932 1104700 1108718 1111553 1112046 1108785 1101870 1093065 1083991 1074910 1065235 1054449 1042586 1030618 1020230
61919 1020230 1012371 1006053 999328 991274 982234 972606 962645 953380 946362 942164 939965 938610 937181 934837
61905 934837 931501 928774 928621 930767 932784 933314 933841 936570 941767 948176 955051 962704 971682 982353 994954
61890 994954 1009371 1025126 1042011 1060399 1080827 1103810 1129995 1159560 1191325 1223635 1256577
61879 1256577 1292278 1332477 1376839 1424009 1472914 1522186 1569765 1614453 1656953 1698195 1737472
61868 1737472 1773379 1805632 1834519 1859373 1879274 1894826 1907561 1917685 1923881 1925382 1922921 1917626
61856 1917626 1910414 1902745 1896723 1893873 1894620 1899093 1907552 1919788 1935015 1952728 1972924 1995254 2018558
61843 2018558 2041416 2062433 2079950 2092352 2099015 2100354 2096825 2088584 2076189 2060676 2042544 2021449
$$ packed form
61932A104700M018K835M93l261o915q805r074r081r675j0786j1863j1968j0388
61919A020230p859o318o725q054r040r628r961r265p018m198k199j355j429k344
61905I34837l336k727j53K146K017N30N27K729N197O409O875P653Q978J0671J2601
61890I94954J4417J5755J6885J8388K0428K2983K6185K9565L1765L2310L2942
61879A256577L5701M0199M4362M7170M8905M9272M7579M4688M2500M1242L9277
61868A737472L5907L2253K8887K4854J9901J5552J2735J0124O196J501k461n295
61856A917626p212p669o022k850P47M473Q459J2236J5227J7713K0196K2330K3304
61843B018558K2858K1017J7517J2402O663J339l529q241j2395j5513j8132k1095
$$ plain form
61831 2021449 1997398 1971615 1945762 1920677 1896031 1870647 1843023 1812309 1779371 1746494 1715619
61820 1715619 1687117 1660242 1634065 1607748 1580773 1553554 1527485 1503974 1483689 1466833 1453416
61809 1453416 1442879 1434165 1426835 1421728 1420001 1421915 1427034 1435174 1446584 1461543 1480424 1503892 1532498
61796 1532498 1566250 1605078 1649378 1699400 1754218 1812071 1871945 1934331 2000179 2069308 2139957
61785 2139957 2209693 2276602 2339670 2398055 2450230 2494233 2528929 2554735 2572933 2584585 2590317
61774 2590317 2590802 2587088 2580667 2573378 2566891 2562069 2559258 2559347 2563778 2572933 2585197 2598388 2611475 2623817
61760 2623817 2633243 2636441 2631447 2618557 2598577 2571505 2537507 2497963 2454457 2407480 2357067 2304073
61748 2304073 2249754 2194528 2138294 2081819 2026624 1973355 1921287 1869775 1819401 1771308 1726163
$$ packed form
61831B021449k4051k5783k5853k5085k4646k5384k7624l0714l2938l2877l0875
61820A715619k8502k6875k6177k6317k6975k7219k6069k3511k0285j6856j3417
61809A453416j0537q714p330n107j727J914N119Q140J1410J4959J8881K3468K8606
61796A532498L3752L8828M4300N0022N4818N7853N9874O2386O5848O9129P0649
61785B139957O9736O6909O3068N8385N2175M4003L4696K5806J8198J1652N732
61774B590317M85l714o421p289o487m822k811Q9M431R155J2264J3191J3087J2342
61760B623817R426L198m994j2890j9980k7072l3998l9544m3506m6977n0413n2994
61748B304073n4319n5226n6234n6475n5195n3269n2068n1512n0374m8093m5145
$$ plain form
61737 1726163 1684216 1645599 1609725 1574892 1539503 1503859 1470083 1439945 1413010 1387188 1360991
61726 1360991 1335084 1311542 1291682 1274838 1259338 1244302 1229989 1216579 1203577 1190763 1178933
61715 1178933 1168969 1160613 1152935 1145678 1139221 1133375 1127307 1120939 1115580 1112600 1112036 1112934 1114524 1116586
61701 1116586 1119062 1121930 1125307 1129277 1133781 1138926 1144950 1151455 1157042 1160387 1161510 1161379 1160412 1158083
61687 1158083 1154026 1148763 1143017 1136896 1130185 1123115 1116411 1110695 1106066 1102127 1098250 1094080 1089972 1086692
61673 1086692 1084372 1082054 1078799 1075199 1073137 1073773 1076268 1078905 1081024 1083208 1085868 1088657 1091492 1095091
61659 1095091 1099758 1104360 1107542 1109561 1111792 1114464 1115995 1114881 1111246 1106126 1100157 1093616 1086948 1080414
61645 1080414 1073687 1066516 1059323 1052500 1045541 1037710 1029248 1021084 1013456 1005500 996187 985271 973583
$$ packed form
61737A726163m1947l8617l5874l4833l5389l5644l3776l0138k6935k5822k6197
61726A360991k5907k3542j9860j6844j5500j5036j4313j3410j3002j2814j1830
61715A178933r964q356p678p257o457n846o068o368n359k980n64Q98J590K062
61701A116586K476K868L377L970M504N145O024O505N587L345J123j31r67k329
61687A158083m057n263n746o121o711p070o704n716m629l939l877m170m108l280
61673A086692k320k318l255l600k062O36K495K637K119K184K660K789K835L599
61659A095091M667M602L182K019K231K672J531j114l635n120n969o541o668o534
61645A080414o727p171p193o823o959p831q462q164p628p956r313j0916j1688
$$ plain form
61632 973583 962765 954232 947793 941826 935442 929678 925554 921840 916376 909259 902869 898568 895073 890581
61618 890581 884976 879244 874038 869704 866559 864189 861432 857987 855151 854054 854003 853571 852538 851588 850792
61603 850792 849688 848554 848358 849496 851597 854495 858455 863385 868644 873763 878830 884169 890086 896671
61589 896671 903417 909374 914307 919294 925510 932874 940661 948837 957521 965518 970872 973156 974049 975312
61575 975312 977072 978332 978202 976371 973242 969943 967351 964873 961056 955645 949853 944151 937225 928252
61561 928252 919140 912964 910407 909045 906235 901632 896647 892322 888396 884043 878939 873490 868158 862619
61547 862619 855702 846323 834527 821650 809483 799164 790538 782394 773400 763019 751665 740225
61535 740225 729571 720210 711989 704214 696505 689524 684458 681767 680800 680516 680036 678624 676021 673066 671284
$$ packed form
61632I73583j0818q533o439n967o384n764m124l714n464p117o390m301l495m492
61618H90581n605n732n206m334l145k370k757l445k836j097n1m32j033r50p96
61603H50792j104j134j96J138K101K898L960M930N259N119N067N339N917O585
61589H96671O746N957M933M987O216P364P787Q176Q684P997N354K284Q93J263
61575I75312J760J260j30j831l129l299k592k478l817n411n792n702o926q973
61561I28252r112o176k557j362k810m603m985m325l926m353n104n449n332n539
61547H62619o917r379j1796j2877j2167j0319q626q144q994j0381j1354j1440
61535G40225j0654r361q221p775p709o981n066k691r67k84m80j412k603k955j782
$$ plain form
61520 671284 671327 672227 672455 671325 669110 666349 663419 660423 657148 653552 650484 649295 650405 652806 655350
61505 655350 657838 660400 662634 664203 665569 667091 667858 666544 663368 660184 658624 658994 660984 664470 669209
61490 669209 674406 679106 682875 686073 689596 694003 698477 701091 700898 699423 699151 700712 702645 703877 705103
61475 705103 707321 710348 713567 717184 721750 727011 731986 735750 737597 737169 735196 733482 733102 733014 731491
61460 731491 728617 726208 725281 724908 723896 722474 721564 721178 720498 719215 717906 717052 716322 715059 713032 710400
61444 710400 707231 703559 699986 697784 697932 700127 703087 705893 708656 711791 715099 717949 720045 721622
61430 721622 723113 724987 727592 730628 732986 733766 733455 733477 734616 736563 739026 742232 745927 748817 750030
61415 750030 750613 752549 756368 760578 763514 764925 765545 765940 766233 766361 765981 764545 762171 760233 760369 762764
$$ packed form
61520F71284M3R00K28j130k215k761k930k996l275l596l068j189J110K401K544
61505F55350K488K562K234J569J366J522P67j314l176l184j560L70J990L486M739
61490F69209N197M700L769L198L523M407M474K614j93j475k72J561J933J232J226
61475G05103K218L027L219L617M566N261M975L764J847m28j973j714l80q8j523
61460G31491k874k409r27l73j012j422r10l86o80j283j309q54p30j263k027k632
61444G10400l169l672l573k202J48K195K960K806K763L135L308K850K096J577
61430G21622J491J874K605L036K358P80l11K2J139J947K463L206L695K890J213
61415G50030N83J936L819M210K936J411O20L95K93J28l80j436k374j938J36K395
$$ plain form
61399 762764 765919 768248 769401 769862 769858 769252 768264 767603 767801 768845 770619 773297 776972 781253 785590 789880
61383 789880 794388 799210 804204 809394 814916 820499 825568 830188 835376 841833 848618 853883 857065 859753
61369 859753 863960 869881 875753 879813 881993 883697 886241 889757 893536 897206 901205 905965 910931 914886
61355 914886 917217 918390 919016 919014 918047 916239 913877 910797 906827 902631 899246 896660 893727 889727 885232
61340 885232 881036 877174 873672 871401 870941 871039 869593 866290 863028 861341 860582 859378 857788 856818 856433 855538
61324 855538 853980 853186 854329 856868 859653 862693 866872 872333 878240 884100 890263 896794 902846 907798
61310 907798 912326 917422 922733 926849 929227 930821 932633 934582 936386 938679 942374 947452 953438 960823
61296 960823 970806 983329 996393 1007957 1017920 1027723 1038593 1050991 1065326 1082108 1101073 1120855
$$ packed form
61399G62764L155K329J153M61mo06r88o61J98J044J774K678L675M281M337M290
61383G89880M508M822M994N190N522N583N069M620N188O457O785N265L182K688
61369H59753M207N921N872M060K180J704K544L516L779L670L999M760M966L955
61355I14886K331J173O26kr67j808k362l080l970m196l385k586k933m000m495
61340H85232m196l862l502k271m60R8j446l303l262j687p59j204j590r70l85q95
61324H55538j558p94J143K539K785L040M179N461N907N860O163O531O052M952
61310I07798M528N096N311M116K378J594J812J949J804K293L695N078N986P385
61296I60823R983J2523J3064J1564R963R803J0870J2398J4335J6782J8965J9782
$$ plain form
61284 1120855 1140000 1158067 1175404 1192029 1207135 1219891 1230530 1240389 1250687 1261392 1271375 1279473
61272 1279473 1284980 1287335 1286172 1282085 1276675 1271249 1265898 1260479 1255854 1252998 1251073 1247799 1242224 1236161
61258 1236161 1232191 1230956 1231120 1231345 1231424 1231803 1232891 1234869 1237635 1241032 1245447 1251905 1260957 1271818 1283261
61243 1283261 1295027 1307485 1320143 1331569 1340867 1348053 1352761 1353833 1350960 1345734 1340098 1334273 1327068
61230 1327068 1317744 1306696 1294759 1282848 1272077 1263115 1255302 1247240 1238500 1230184 1223774 1220082 1219266
61217 1219266 1220984 1224213 1227757 1231424 1236256 1243282 1252518 1263360 1275281 1287745 1300072 1311917 1323406
61204 1323406 1334456 1344669 1354529 1365980 1380827 1398858 1418363 1438236 1458605 1479532 1500247
61193 1500247 1519855 1537921 1553925 1566950 1576482 1583050 1587587 1590456 1591423 1590053 1585693 1577516 1565423
$$ packed form
61284A120855J9145J8067J7337J6625J5106J2756J0639R859J0298J0705R983Q098
61272A279473N507K355j163m087n410n426n351n419m625k856j925l274n575o063
61258A236161l970j235J64K25P9L79J088J978K766L397M415O458R052J0861J1443
61243A283261J1766J2458J2658J1426R298P186M708J072k873n226n636n825p205
61230A327068r324j1048j1937j1911j0771q962p813q062q740q316o410l692q16
61217A219266J718L229L544L667M832P026R236J0842J1921J2464J2327J1845J1489
61204A323406J1050J0213R860J1451J4847J8031J9505J9873K0369K0927K0715
61193A500247J9608J8066J6004J3025R532O568M537K869R67j370m360q177j2093
$$ plain form
61180 1565423 1550922 1536513 1523939 1513209 1503329 1493598 1484007 1474645 1465228 1455413 1445457 1436387 1429536
61167 1429536 1426002 1426171 1429221 1433053 1435473 1435961 1435888 1436602 1437860 1438819 1439896 1442373 1446253 1449891 1452086
61152 1452086 1453327 1454326 1454498 1453038 1450786 1449797 1451242 1454685 1459155 1463989 1468746 1473454 1479102 1486928 1496774
61137 1496774 1507061 1516886 1527432 1540556 1556476 1573863 1592069 1612087 1634618 1657747 1677657
61126 1677657 1691974 1701773 1709755 1716999 1722466 1725497 1727387 1729813 1732714 1734879 1736032 1737053 1738178 1738220
61112 1738220 1735902 1731058 1724218 1715878 1706640 1697212 1687518 1676348 1662575 1646328 1628318 1608505 1586467
61099 1586467 1563121 1541078 1522635 1507657 1493848 1479099 1463384 1448353 1435344 1424144 1413778
61088 1413778 1404085 1395968 1390080 1385802 1381758 1376879 1370626 1362626 1352788 1341758 1330694 1320302 1310374
$$ packed form
61180A565423j4501j4409j2574j0730r880r731r591r362r417r815r956r070o851
61167A429536l534J69L050L832K420M88p3P14J258R59J077K477L880L638K195
61152A452086J241R99J72j460k252r89J445L443M470M834M757M708N648P826R846
61137A496774J0287R825J0546J3124J5920J7387J8206K0018K2531K3129J9910
61126A677657J4317R799P982P244N467L031J890K426K901K165J153J021J125M2
61112A738220k318m844o840q340r238r428r694j1170j3773j6247j8010j9813k2038
61099A586467k3346k2043j8443j4978j3809j4749j5715j5031j3009j1200j0366
61088A413778r693q117n888m278m044m879o253q000r838j1030j1064j0392r928
$$ plain form
61075 1310374 1300542 1291350 1284256 1280379 1279375 1279800 1280622 1282116 1285246 1290635 1298548 1309400 1323495 1340325
61061 1340325 1358882 1378809 1400618 1424645 1450524 1477955 1507132 1537915 1569307 1600487 1631818
61050 1631818 1663985 1696513 1727963 1757440 1785172 1811777 1837640 1862815 1886666 1907628 1924174
61039 1924174 1936267 1945160 1951565 1954628 1952990 1946303 1935433 1921615 1905649 1887538 1866774 1843388
61027 1843388 1818745 1794668 1771571 1748101 1722887 1696072 1668915 1642697 1618514 1597225 1578657
61016 1578657 1561370 1544206 1527788 1513650 1502118 1492132 1483153 1476079 1471905 1470441 1470905 1473113 1477458
61003 1477458 1484254 1493745 1506306 1521949 1539923 1559420 1580493 1603656 1628885 1655760 1684498 1715931
60991 1715931 1750377 1787438 1827082 1870051 1916682 1966175 2017782 2072125 2130623 2194032 2262310
$$ packed form
61075A310374r832r192p094l877j004M25Q22J494L130N389P913J0852J4095J6830
61061A340325J8557J9927K1809K4027K5879K7431K9177L0783L1392L1180L1331
61050A631818L2167L2528L1450K9477K7732K6605K5863K5175K3851K0962J6546
61039A924174J2093Q893O405L063j638o687j0870j3818j5966j8111k0764k3386
61027A843388k4643k4077k3097k3470k5214k6815k7157k6218k4183k1289j8568
61016A578657j7287j7164j6418j4138j1532r986q979p074m174j464M64K208M345
61003A477458O796R491J2561J5643J7974J9497K1073K3163K5229K6875K8738L1433
60991A715931L4446L7061L9644M2969M6631M9493N1607N4343N8498O3409O8278
$$ plain form
60980 2262310 2335399 2413076 2494204 2577241 2661715 2748555 2838853 2933096 3031584 3134704 3242507
60969 3242507 3354826 3472180 3595891 3727013 3865828 4012629 4168064 4332231 4504279
60960 4504279 4683581 4870728 5066970 5273636 5492926 5728492 5984299 6263346 6568033
60951 6568033 6900886 7263995 7658820 8088113 8557800 9076329 9653603 10302508 11040732
60942 11040732 11888786 12866414 13993256 15293194 16796100 18535593 20546624 22859672
60934 22859672 25481129 28362586 31384401 34376700 37167572 39623667 41664851 43267963
60926 43267963 44476848 45404140 46195011 46955843 47695410 48323780 48702643 48700271 48218834
60917 48218834 47203606 45655681 43644168 41295682 38757439 36158448 33592499 31121505
$$ packed form
60980B262310P3089P7677Q1128Q3037Q4474Q6840R0298R4243R8488J03120J07803
60969C242507J12319J17354J23711J31122J38815J46801J55435J64167J72048
60960D504279J79302J87147J96242K06666K19290K35566K55807K79047L04687
60951F568033L32853L63109L94825M29293M69687N18529N77274O48905P38224
60942A1040732Q48054R77628J126842J299938J502906J739493K011031K313048
60934B2859672K621457K881457L021815K992299K790872K456095K041184J603112
60926D3267963J208885R27292P90871P60832P39567O28370L78863k372m81437
60917D8218834j015228j547925k011513k348486k538243k598991k565949k470994
$$ plain form
60909 31121505 28783102 26594905 24559093 22669528 20917763 19295393 17794472 16407741
60901 16407741 15128476 13950346 12868125 11877994 10975873 10155567 9409804 8733082 8122116
60892 8122116 7573172 7080291 6636859 6237973 5880404 5560689 5274013 5014745 4777641
60883 4777641 4558656 4354982 4164477 3985299 3816202 3656679 3506209 3363633 3228040
60874 3228040 3099989 2980760 2870150 2766009 2666343 2571037 2481019 2396712 2318228 2246328
60864 2246328 2181812 2123841 2069884 2017786 1967436 1920155 1876926 1837655 1801767 1768851 1738534
60853 1738534 1710240 1683549 1658726 1636420 1616703 1598776 1581914 1566384 1552942 1541524 1531025
60842 1531025 1520520 1510178 1500567 1491387 1481604 1470781 1459577 1448503 1436750 1423078 1407712 1392430
$$ packed form
60909C1121505k338403k188197k035812j889565j751765j622370j500921j386731
60901A6407741j279265j178130j082221r90131r02121q20306p45763o76722o10966
60892H122116n48944m92881m43432l98886l57569l19715k86676k59268k37104
60883D777641k18985k03674j90505j79178j69097j59523j50470j42576j35593
60874C228040j28051j19229j10610j04141r9666r5306r0018q4307p8484p1900
60864B246328o4516n7971n3957n2098n0350m7281m3229l9271l5888l2916l0317
60853A738534k8294k6691k4823k2306j9717j7927j6862j5530j3442j1418j0499
60842A531025j0505j0342r611r180r783j0823j1204j1074j1753j3672j5366j5282
$$ plain form
60830 1392430 1378538 1365551 1352370 1338819 1325172 1310857 1294908 1277398 1259213 1240633 1221515
60819 1221515 1202795 1186014 1170875 1155067 1137543 1120403 1106159 1094383 1082679 1070047 1057489
60808 1057489 1045916 1035350 1026010 1018439 1012439 1007322 1003249 1000886 999672 998063 995759 994066 993568 993158
60794 993158 992155 991825 993528 996549 999120 1000834 1002755 1005621 1009170 1012939 1016565 1019305 1020236 1019139 1016593
60779 1016593 1013166 1009043 1004463 999960 995977 992547 989478 986651 984034 981551 979052 976436 973723 970847
60765 970847 967401 963021 958187 954029 950764 946909 941026 933977 928306 925298 923713 921566 918019 913210
60751 913210 907489 901520 896137 891250 885632 878546 870858 863835 857589 851482 845261 838795 831444 822918
60737 822918 814314 807035 800939 794863 788855 784495 782605 781873 780486 778282 776466 775539 774496 772280 769519
$$ packed form
60830A392430j3892j2987j3181j3551j3647j4315j5949j7510j8185j8580j9118
60819A221515j8720j6781j5139j5808j7524j7140j4244j1776j1704j2632j2558
60808A057489j1573j0566r340p571o000n117m073k363j214j609k304j693m98m10
60794I93158j003l30J703L021K571J714J921K866L549L769L626K740R31j097k546
60779A016593l427m123m580m503l983l430l069k827k617k483k499k616k713k876
60765I70847l446m380m834m158l265l855n883p049n671l008j585k147l547m809
60751I13210n721n969n383m887n618p086p688p023o246o107o221o466p351q526
60737H22918q604p279o096o076o008m360j890p32j387k204j816r27j043k216k761
$$ plain form
60722 769519 768139 769048 770644 770312 767466 764468 764219 767500 773094 779628 786248 791896 795388 796753 797701
60707 797701 800004 803609 806863 808620 809671 811755 815307 818812 820682 821180 821749 822772 823104 821937 820036
60692 820036 818636 818040 817940 818245 818783 818795 817700 815975 814476 813161 811202 808011 803553 797961 791641 785432
60676 785432 779856 774343 767946 760709 753767 748235 744426 741803 739171 735393 730632 726467 724171 723317
60662 723317 722806 722364 721895 720166 715895 710047 705379 703439 703307 703510 703686 703898 703759 703232 703285 704719 706984
60645 706984 709091 711270 714810 720242 726265 730810 733182 735079 739098 745950 753615 759788 764510 769435
60631 769435 775052 780140 783862 786776 789396 791300 792514 794430 798237 803254 807868 811414 814175 816127
60617 816127 816876 816630 816215 816068 815828 814985 813497 811737 810123 808707 806998 804410 800923 796963 792658 787841
$$ packed form
60722G69519j380R09J596l32k846k998k49L281N594O534O620N648L492J365R48
60707G97701K303L605L254J757J051K084L552L505J870M98N69J023L32j167j901
60692H20036j400n96j00L05N38J2j095j725j499j315j959l191m458n592o320o209
60676G85432n576n513o397p237o942n532l809k623k632l778m761m165k296q54
60662G23317n11m42m69j729m271n848m668j940j32K03J76K12j39n27N3J434K265
60645G06984K107K179L540N432O023M545K372J897M019O852P665O173M722M925
60631G69435N617N088L722K914K620J904J214J916L807N017M614L546K761J952
60617H16127P49k46m15j47k40q43j488j760j614j416j709k588l487l960m305m817
$$ plain form
60601 787841 782849 778531 775167 772216 769571 768176 768668 770155 771154 771246 770970 770530 769505 767695 765559 763930
60585 763930 763666 765089 767178 767804 765656 761768 758389 756513 755159 752881 749224 744761 740394 736729 733793
60570 733793 731444 730331 731828 736288 741796 745604 746789 746729 747112 748361 749986 751533 752830 753936 755131
60555 755131 756584 758076 759452 761132 763443 765687 766884 767438 768925 771941 775244 777560 779226 781327
60541 781327 784044 786826 789624 792901 796683 800485 804130 807885 811826 815711 819553 823738 828497 833675
60527 833675 839045 844404 849388 853710 857659 861864 866440 870847 874760 878638 883239 888980 895868 903570
60513 903570 911324 918500 925783 935276 948691 965692 984555 1004094 1024150 1044627 1065239 1086327
60501 1086327 1108577 1131245 1151538 1166745 1176598 1182906 1187368 1190471 1192069 1191984 1190131 1187046 1184522
$$ packed form
60601G87841m992m318l364k951k645j395M92J487R99R2k76m40j025j810k136j629
60585G63930k64J423K089O26k148l888l379j876j354k278l657m463m367l665k936
60570G33793k349j113J497M460N508L808J185o0L83J249J625J547J297J106J195
60555G55131J453J492J376J680K311K244J197N54J487L016L303K316J666K101
60541G81327K717K782K798L277L782L802L645L755L941L885L842M185M759N178
60527H33675N370N359M984M322L949M205M576M407L913L878M601N741O888P702
60513I03570P754P176P283R493J3415J7001J8863J9539K0056K0477K0612K1088
60501A086327K2250K2668K0293J5207R853O308M462L103J598q5j853l085k524
$$ plain form
60488 1184522 1184888 1189233 1196768 1206062 1216402 1227855 1240784 1255920 1274417 1297197 1324280 1355134
60476 1355134 1389573 1427945 1470405 1516291 1564263 1612814 1660373 1705011 1744436 1776771 1801349
60465 1801349 1818386 1827939 1829726 1824297 1813690 1800408 1786084 1771626 1757876 1745034 1731811 1716596
60453 1716596 1699897 1684611 1673420 1666642 1663062 1662070 1664246 1670299 1680267 1693797 1710988 1732937 1761431
60440 1761431 1797830 1842240 1894098 1953346 2020385 2094858 2175096 2258832 2343834 2427859 2508851
60429 2508851 2585430 2656638 2721343 2778842 2830030 2876657 2919026 2955468 2984360 3005137 3016659
60418 3016659 3016194 3001386 2972166 2929475 2873260 2803391 2721917 2632748 2539397 2444267 2349499 2256655
60406 2256655 2165725 2076194 1989334 1907901 1833193 1763807 1697814 1634904 1575799 1520752 1469546
$$ packed form
60488A184522L66M345P535R294J0340J1453J2929J5136J8497K2780K7083L0854
60476A355134L4439L8372M2460M5886M7972M8551M7559M4638L9425L2335K4578
60465A801349J7037R553J787n429j0607j3282j4324j4458j3750j2842j3223j5215
60453A716596j6699j5286j1191o778l580r92K176O053R968J3530J7191K1949K8494
60440A761431L6399M4410N1858N9248O7039P4473Q0238Q3736Q5002Q4025Q0992
60429B508851P6579P1208O4705N7499N1188M6627M2369L6442K8892K0777J1522
60418C016659m65j4808k9220m2691n6215o9869q1474q9169r3351r5130r4768r2844
60406B256655r0930q9531q6860q1433p4708o9386o5993o2910n9105n5047n1206
$$ plain form
60395 1469546 1422219 1378912 1339386 1303227 1270225 1240256 1213219 1189293 1168789 1151458 1136356
60384 1136356 1122524 1109308 1095977 1081793 1066876 1052505 1040104 1030181 1022347 1015943 1010433 1005499
60372 1005499 1000958 996464 991436 985622 979458 973360 966971 959860 952658 946479 941307 936071 930421 925242
60358 925242 921061 917208 913201 909882 908321 908307 908695 908702 908211 907554 907704 909994 914637 919906 923589 924992
60342 924992 924909 924287 923854 924639 927553 932340 937777 942993 947872 952235 955591 957962 960123 962593 964927
60327 964927 966395 966938 967077 967314 968069 969885 973064 977053 980633 982999 984497 986165 988623 991639 994680
60312 994680 997499 1000038 1002246 1004436 1007529 1012148 1017479 1021781 1024296 1025991 1028107 1030780 1033817 1038011
60298 1038011 1044504 1053017 1061932 1070429 1079543 1090522 1102873 1114933 1126090 1137566 1150762 1165341
$$ packed form
60395A469546m7327m3307l9526l6159l3002k9969k7037k3926k0504j7331j5102
60384A136356j3832j3216j3331j4184j4917j4371j2401r923p834o404n510m934
60372A005499m541m494n028n814o164o098o389p111p202o179n172n236n650n179
60358I25242m181l853m007l319j561j4L88Pm91o57J50K290M643N269L683J403
60342I24992q3o22m33P85K914M787N437N216M879M363L356K371K161K470K334
60327I64927J468N43J39K37P55J816L179L989L580K366J498J668K458L016L041
60312I94680K819K539K208K190L093M619N331M302K515J695K116K673L037M194
60298A038011O493Q513Q915Q497R114J0979J2351J2060J1157J1476J3196J4579
$$ plain form
60286 1165341 1179336 1190846 1199251 1204882 1208118 1209235 1208893 1208073 1207190 1205610 1202423 1197586 1191961 1186301
60272 1186301 1180686 1175006 1169485 1164243 1158614 1151596 1143295 1135555 1130553 1128644 1127805 1125413 1120499 1114296
60258 1114296 1108894 1105651 1104859 1106424 1110475 1117211 1126410 1137378 1149501 1162740 1177574 1194713 1215034
60245 1215034 1239439 1268147 1300003 1332879 1364835 1394480 1420209 1439897 1451950 1456296 1453790 1445062
60233 1445062 1430553 1411430 1389632 1366858 1343902 1320884 1297731 1274676 1252875 1234281 1219953
60222 1219953 1208414 1196636 1183035 1168773 1155758 1144263 1133193 1121966 1111025 1100751 1090964
60211 1090964 1081679 1073481 1066618 1060254 1053261 1045526 1037951 1031260 1025405 1020261 1016199 1013422 1011149 1008320
60197 1008320 1004990 1002265 1000722 999692 998377 996912 995859 995466 996032 998202 1001849 1005139 1005937 1004228 1002300
$$ packed form
60286A165341J3995J1510Q405N631L236J117l42q20q83j580l187m837n625n660
60272A186301n615n680n521n242n629p018q301p740n002j909q39k392m914o203
60258A114296n402l243p92J565M051O736R199J0968J2123J3239J4834J7139K0321
60245A215034K4405K8708L1856L2876L1956K9645K5729J9688J2053M346k506q728
60233A445062j4509j9123k1798k2774k2956k3018k3153k3055k1801j8594j4328
60222A219953j1539j1778j3601j4262j3015j1495j1070j1227j0941j0274r787
60211A090964r285q198o863o364o993p735p575o691n855n144m062k777k273k829
60197A008320l330k725j543j030j315j465j053l93N66K170L647L290P98j709j928
$$ plain form
60182 1002300 1002490 1005338 1009761 1014070 1016758 1017215 1016183 1015174 1015357 1017249 1021028 1026400 1032332 1037739 1042387
60167 1042387 1046502 1049856 1052202 1054274 1057123 1060549 1063490 1065934 1069074 1073524 1078963 1085793 1095274 1107241
60153 1107241 1119417 1130128 1140186 1150871 1161431 1170290 1177782 1185969 1196165 1208027 1220652 1233193
60141 1233193 1244677 1254506 1263021 1270626 1276808 1281133 1284714 1289229 1294572 1298831 1300635 1300307 1298656 1295980
60127 1295980 1292614 1289305 1286418 1283425 1279605 1274772 1269187 1263323 1257811 1253066 1248888 1244896 1241261 1238438
60113 1238438 1236416 1234927 1234233 1234832 1236404 1237846 1238339 1237716 1235952 1233168 1230004 1227009 1223720 1219363 1214435
60098 1214435 1210454 1207986 1206115 1204212 1203020 1203432 1205218 1207646 1210528 1213953 1217654 1221344 1225194 1229484
60084 1229484 1234224 1239461 1245401 1251850 1258181 1264335 1271245 1279785 1289809 1300584 1311563 1322290 1332209
$$ packed form
60182A002300J90K848M423M309K688M57j032j009J83J892L779N372N932N407M648
60167A042387M115L354K346K072K849L426K941K444L140M450N439O830R481J1967
60153A107241J2176J0711J0058J0685J0560Q859P492Q187J0196J1862J2625J2541
60141A233193J1484R829Q515P605O182M325L581M515N343M259J804l28j651k676
60127A295980l366l309k887k993l820m833n585n864n512m745m178l992l635k823
60113A238438k022j489o94N99J572J442M93o23j764k784l164k995l289m357m928
60098A214435l981k468j871j903j192M12J786K428K882L425L701L690L850M290
60084A229484M740N237N940O449O331O154O910Q540J0024J0775J0979J0727R919
$$ plain form
60071 1332209 1341206 1349904 1358847 1367713 1375729 1382601 1388779 1395278 1403233 1412970 1423332 1432803 1441454 1450723
60057 1450723 1460984 1470754 1479051 1487159 1496778 1507570 1517899 1527106 1535403 1542288 1546862 1549489 1551465
60044 1551465 1553134 1553789 1553283 1552143 1550141 1546480 1541598 1537007 1533042 1528545 1523222 1518348 1514379 1509930
60030 1509930 1504345 1499278 1495945 1492506 1486408 1478219 1470827 1465523 1461219 1457076 1453340 1449404 1443436 1434641
60016 1434641 1424002 1412250 1399013 1384651 1370861 1358278 1345316 1330695 1315488 1301106 1286942
60005 1286942 1271980 1257350 1244897 1233980 1222148 1208761 1195605 1183922 1173084 1162624 1153371
59994 1153371 1145814 1139237 1133371 1129114 1126587 1124167 1120790 1117837 1117224 1118868 1121585 1125344 1130681 1136557
59980 1136557 1141032 1144079 1147815 1153508 1159876 1165015 1168697 1171928 1175062 1177346 1177908 1176551 1173660 1169733
$$ packed form
60071A332209Q997Q698Q943Q866Q016O872O178O499P955R737J0362R471Q651R269
60057A450723J0261R770Q297Q108R619J0792J0329R207Q297O885M574K627J976
60044A551465J669O55n06j140k002l661m882m591l965m497n323m874l969m449
60030A509930n585n067l333l439o098q189p392n304m304m143l736l936n968q795
60016A434641j0639j1752j3237j4362j3790j2583j2962j4621j5207j4382j4164
60005A286942j4962j4630j2453j0917j1832j3387j3156j1683j0838j0460r253
59994A153371p557o577n866m257k527k420l377k953o13J644K717L759N337N876
59980A136557M475L047L736N693O368N139L682L231L134K284N62j357k891l927
$$ plain form
59966 1169733 1165006 1159482 1153393 1147462 1142232 1137197 1131121 1123378 1114622 1106002 1098028 1090278 1081868 1072179
59952 1072179 1061437 1050793 1041631 1034666 1029759 1026344 1023688 1020881 1017180 1012688 1008438 1005603 1004639 1005180
59938 1005180 1006590 1008512 1010903 1013526 1015535 1015941 1014678 1012933 1012203 1013144 1015362 1018019 1020442 1022510 1024642
59923 1024642 1027217 1029896 1031974 1033442 1035052 1037006 1038317 1037991 1036321 1034463 1033305 1033204 1034147 1035472 1036109
59908 1036109 1035978 1036464 1038513 1040897 1041555 1040279 1038738 1038106 1038066 1038166 1038676 1039666 1040424 1040422 1040026 1039795 1039727 1039553
59890 1039553 1039193 1038559 1037461 1035901 1034066 1031981 1029628 1027249 1025006 1022642 1020250 1019016 1020074 1022812
59876 1022812 1025510 1027589 1029939 1032922 1035578 1037296 1038936 1041598 1045395 1050110 1056057 1063574 1072468 1082556
59862 1082556 1093918 1106049 1117627 1127756 1136697 1144961 1152608 1159894 1167539 1175697 1183643 1191014 1198289
$$ packed form
59966A169733m727n524o089n931n230n035o076p743q756q620p974p750q410r689
59952A072179j0742j0644r162o965m907l415k656k807l701m492m250k835r64N41
59938A005180J410J922K391K623K009M06j263j745p30R41K218K657K423K068K132
59923A024642K575K679K078J468J610J954J311l26j670j858j158j01R43J325O37
59908A036109j31M86K049K384O58j276j541o32m0J00N10R90P58kl96k31o8j74
59890A039553l60o34j098j560j835k085k353k379k243k364k392j234J058K738
59876A022812K698K079K350K983K656J718J640K662L797M715N947P517Q894J0088
59862A082556J1362J2131J1578J0129Q941Q264P647P286P645Q158P946P371P275
$$ plain form
59849 1198289 1205463 1211644 1216750 1222125 1228359 1234025 1238049 1241859 1247172 1252722 1255521 1254986 1253600 1253482
59835 1253482 1254387 1255389 1256605 1258452 1260707 1263147 1266136 1269884 1274055 1278642 1284332 1291291 1298351 1304094
59821 1304094 1308383 1312298 1316854 1322205 1327845 1333264 1338420 1343462 1347870 1350310 1349965 1347753 1345478 1343909
59807 1343909 1342543 1341091 1340107 1339950 1340179 1340381 1340668 1340824 1339853 1337175 1333730 1331153 1330180 1330484 1331684 1333743
59791 1333743 1336605 1340223 1344948 1351220 1358735 1366478 1373832 1381116 1388728 1396198 1402685 1408042 1412686 1416474
59777 1416474 1418594 1418892 1418497 1418464 1418431 1417491 1415902 1414713 1413920 1412253 1408890 1404051 1397512 1388072 1375498 1361833
59761 1361833 1349506 1338880 1328827 1318945 1309723 1300952 1291674 1281933 1273222 1266706 1261927 1257694 1253425
59748 1253425 1249222 1245303 1241952 1239596 1238434 1238058 1237628 1236429 1234357 1231954 1229716 1227242 1223536 1218423
$$ packed form
59849A198289P174O181N106N375O234N666M024L810N313N550K799n35j386j18
59835A253482R05J002J216J847K255K440K989L748M171M587N690O959P060N743
59821A304094M289L915M556N351N640N419N156N042M408K440l45k212k275j569
59807A343909j366j452r84j57K29K02K87J56r71k678l445k577r73L04J200K059
59791A333743K862L618M725O272P515P743P354P284P612P470O487N357M644L788
59777A416474K120K98l95l3l3r40j589j189p93j667l363m839o539r440j2574j3665
59761A361833j2327j0626j0053r882r222q771r278r741q711o516m779m233m269
59748A253425m203l919l351k356j162l76m30j199k072k403k238k474l706n113
$$ plain form
59734 1218423 1212945 1207791 1202120 1194906 1186759 1179167 1172346 1165352 1158188 1152159 1147666 1143182 1137203 1130249
59720 1130249 1124047 1119464 1116044 1113058 1110261 1107813 1105939 1104604 1103403 1102092 1101226 1101719 1103727 1106514
59706 1106514 1109413 1112201 1114594 1116464 1118820 1123464 1131104 1140636 1150761 1161332 1172500 1183654 1194235
59693 1194235 1204823 1216324 1228646 1241149 1253817 1266784 1279027 1288868 1295793 1300813 1305029 1308831
59681 1308831 1312481 1316248 1319683 1321791 1322403 1322483 1322477 1321298 1317774 1312469 1307019 1302037 1296819 1291082 1285781
59666 1285781 1281661 1277963 1273456 1268299 1263886 1260976 1258856 1256475 1253553 1250253 1246629 1242945 1239807 1237255
59652 1237255 1234354 1230659 1227588 1227107 1229129 1231426 1232427 1233030 1235219 1239782 1245996 1252765 1259420 1265912
59638 1265912 1272909 1281256 1290827 1300365 1308961 1317062 1325297 1332958 1338683 1342339 1345087 1347599 1349280 1349517
$$ packed form
59734A218423n478n154n671p214q147p592o821o994p164o029m493m484n979o954
59720A130249o202m583l420k986k797k448j874j335j201j311q66M93K008K787
59706A106514K899K788K393J870K356M644P640R532J0125J0571J1168J1154J0581
59693A194235J0588J1501J2322J2503J2668J2967J2243R841O925N020M216L802
59681A308831L650L767L435K108O12Q0oj179l524n305n450m982n218n737n301
59666A285781m120l698m507n157m413k910k120k381k922l300l624l684l138k552
59652A237255k901l695l071m81K022K297J001O03K189M563O214O769O655O492
59638A265912O997Q347R571R538Q596Q101Q235P661N725L656K748K512J681K37
$$ plain form
59624 1349517 1348661 1347301 1345329 1342414 1338842 1335140 1331143 1326150 1319974 1313235 1306579 1300203 1294370 1289731
59610 1289731 1286479 1283438 1278796 1272003 1264481 1258206 1253957 1251336 1249940 1249671 1250023 1250023 1249404 1249211 1250685 1253905
59594 1253905 1258018 1262483 1267284 1272004 1275617 1277706 1279287 1281716 1284929 1287338 1287538 1285522 1281968 1276938
59580 1276938 1269950 1261147 1251696 1242784 1234598 1226544 1218244 1210153 1203278 1198240 1194349 1189752 1183086 1175036
59566 1175036 1167605 1161679 1156144 1149854 1143503 1138560 1134958 1131050 1125706 1119304 1112626 1105892 1099226 1093072
59552 1093072 1087586 1082184 1076275 1070027 1064073 1058860 1054620 1051604 1049923 1049376 1049623 1050318 1051063 1051638 1052337
59537 1052337 1053586 1055102 1055971 1055752 1054979 1054407 1054343 1054984 1056727 1059606 1062830 1065286 1066275 1065607 1063616 1061417
59521 1061417 1060441 1061088 1062208 1062360 1061087 1058530 1054546 1049169 1043487 1038934 1035708 1032774 1029553 1026753 1025252
$$ packed form
59624A349517q56j360j972k915l572l702l997m993o176o739o656o376n833m639
59610A289731l252l041m642o793p522o275m249k621j396k69L52%o19j93J474L220
59594A253905M113M465M801M720L613K089J581K429L213K409K00k016l554n030
59580A276938o988q803r451q912q186q054q300q091o875n038l891m597o666q050
59566A175036p431n926n535o290o351m943l602l908n344o402o678o734o666o154
59552A093072n486n402n909o248n954n213m240l016j681n47K47O95P45N75O99
59537A052337J249J516Q69k19p73n72o4O41J743K879L224K456R89o68j991k199
59521A061417r76O47J120J52j273k557l984n377n682m553l226k934l221k800j501
$$ plain form
59506 1025252 1024786 1024142 1022315 1019225 1015704 1012995 1011955 1012327 1012861 1012397 1010876 1009302 1008840 1010004 1012491
59491 1012491 1015641 1019006 1022624 1026848 1031985 1038105 1045137 1053076 1062045 1072161 1083481 1096322 1111526
59478 1111526 1129906 1151068 1173092 1193767 1211943 1227360 1239651 1248435 1254246 1258368 1261449 1263093
59466 1263093 1263243 1263194 1264530 1267441 1270662 1272890 1273797 1273938 1274114 1274649 1274961 1273961 1271091 1266675 1260993 1253451
59450 1253451 1243213 1230596 1217350 1205418 1195455 1186466 1176898 1166269 1155715 1146679 1139253 1132421
59438 1132421 1125801 1120169 1115952 1112190 1107766 1102948 1098858 1095899 1093584 1091693 1090659 1090927 1092624 1095812
59424 1095812 1100328 1105349 1109839 1113637 1117676 1123027 1130138 1138965 1149212 1160155 1170577 1179328 1186002
59411 1186002 1191064 1195281 1198968 1201782 1203454 1204638 1206598 1209927 1214001 1217845 1221064 1223745 1226252 1229570
$$ packed form
59506A025252m66o44j827l090l521k709j040L72N34m64j521j574m62J164K487
59491A012491L150L365L618M224N137O120P032P939Q969J0116J1320J2841J5204
59478A111526J8380K1162K2024K0675J8176J5417J2291Q784N811M122L081J644
59466A263093J50m9J336K911L221K228R07J41J76N35L12j000k870m416n682p542
59450A253451j0238j2617j3246j1932r963q989r568j0629j0554r036p426o832
59438A132421o620n632m217l762m424m818m090k959k315j891j034K68J697L188
59424A095812M516N021M490L798M039N351P111Q827J0247J0943J0422Q751O674
59411A186002N062M217L687K814J672J184J960L329M074L844L219K681K507L318
$$ plain form
59397 1229570 1235017 1242683 1250663 1256858 1261446 1266778 1274883 1285756 1297901 1309690 1320053 1328611 1335487
59384 1335487 1340774 1344216 1345682 1345560 1344113 1340787 1335045 1327742 1320767 1315253 1310941 1307326 1304512 1302627
59370 1302627 1301244 1299867 1298523 1297610 1297672 1299514 1303852 1310577 1318990 1329027 1341535 1356901 1374151 1392098
59356 1392098 1410968 1432284 1457466 1487037 1520604 1556660 1592360 1624300 1649886 1667931 1678284
59345 1678284 1681603 1679553 1674668 1669586 1666572 1667574 1673949 1685385 1699224 1711500 1719012 1720311 1714914
59332 1714914 1702347 1682688 1657838 1631439 1607033 1586368 1569397 1555406 1543750 1533886 1525285 1517481
59320 1517481 1510216 1503644 1498450 1495412 1494527 1494763 1494906 1494514 1493931 1493681 1494079 1495108 1496343 1497286 1498041 1499267
59304 1499267 1501064 1502373 1502145 1500868 1500283 1501691 1505117 1509956 1515748 1522246 1529329 1537101 1545772 1555494
$$ packed form
59397A229570N447P666P980O195M588N332Q105J0873J2145J1789J0363Q558O876
59384A335487N287L442J466j22j447l326n742p303o975n514m312l615k814j885
59370A302627j383j377j344r13O2J842M338O725Q413J0037J2508J5366J7250J7947
59356A392098J8870K1316K5182K9571L3567L6056L5700L1940K5586J8045J0353
59345A678284L319k050m885n082l014J002O375J1436J3839J2276P512J299n397
59332A714914j2567j9659k4850k6399k4406k0665j6971j3991j1656r864q601p804
59320A517481p265o572n194l038q85K36J43l92n83k50L98J029J235R43P55J226
59304A499267J797J309k28j277n85J408L426M839N792O498P083P772Q671R722
$$ plain form
59290 1555494 1566676 1580274 1597126 1616859 1637905 1658689 1678553 1697741 1717007 1737172 1758295
59279 1758295 1779105 1797699 1812984 1825084 1834395 1840895 1844554 1845824 1845313 1843145 1838747 1831038 1818966
59266 1818966 1802460 1783025 1762953 1743663 1724939 1705738 1685431 1664348 1643593 1624264 1606390
59255 1606390 1588669 1569796 1550028 1530876 1513294 1496901 1481062 1465938 1452111 1439748 1428421
59244 1428421 1417345 1405702 1393459 1382080 1373797 1369841 1369985 1373872 1381758 1393326 1406747 1419948
59232 1419948 1432313 1444171 1454959 1462958 1466854 1466630 1462724 1455223 1444395 1431483 1418226 1405582
59220 1405582 1393403 1381559 1371057 1363634 1360199 1360082 1362030 1365583 1371079 1378634 1387793 1398140 1409502
59207 1409502 1421341 1432556 1442359 1450980 1459130 1466981 1473933 1479182 1482268 1483196 1482286 1479846 1476031 1471147
$$ packed form
59290A555494J1182J3598J6852J9733K1046K0784J9864J9188J9266K0165K1123
59279A758295K0810J8594J5285J2100R311O500L659J270n11k168m398p709j2072
59266A818966j6506j9435k0072j9290j8724j9201k0307k1083k0755j9329j7874
59255A606390j7721j8873j9768j9152j7582j6393j5839j5124j3827j2363j1327
59244A428421j1076j1643j2243j1379q283l956J44L887P886J1568J3421J3201
59232A419948J2365J1858J0788P999L896k24l906p501j0828j2912j3257j2644
59220A405582j2179j1844j0502p423l435j17J948L553N496P555R159J0347J1362
59207A409502J1839J1215R803Q621Q150P851O952N249L086R28r10k440l815m884
$$ plain form
59193 1471147 1465900 1460919 1456042 1450621 1444682 1439297 1435576 1433624 1432686 1431991 1431331 1431196 1432509 1435873 1440986
59178 1440986 1447069 1453772 1461028 1468071 1473502 1476829 1479279 1482547 1487175 1492456 1497364 1501014 1502807 1502775
59164 1502775 1501481 1499073 1494884 1488484 1480580 1472100 1462881 1452323 1441106 1430978 1422495 1414035 1403801
59151 1403801 1392127 1380989 1371607 1363421 1355424 1347512 1340046 1332945 1326193 1320851 1318273 1317978 1317495 1315056
59137 1315056 1311605 1309228 1308424 1308291 1308780 1310945 1314912 1319438 1324098 1330204 1338421 1346818 1352812 1356448 1360343
59122 1360343 1366609 1374925 1383474 1390756 1396449 1401369 1406690 1412627 1417852 1420702 1420929 1419850 1419035 1419405 1421266
59107 1421266 1424315 1427493 1429524 1429868 1428866 1427070 1424815 1422258 1419225 1415063 1409231 1402072 1394459 1386638
59093 1386638 1377960 1367862 1356634 1344956 1333000 1320250 1306148 1290924 1275809 1262148 1250071
$$ packed form
59193A471147n247m981m877n421n939n385l721j952r38o95o60j35J313L364N113
59178A440986O083O703P256P043N431L327K450L268M628N281M908L650J793l2
59164A502775j294k408m189o400p904q480r219j0558j1217j0128q483q460j0234
59151A403801j1674j1138r382q186p997p912p466p101o752n342k578k95m83k439
59137A315056l451k377q04j33M89K165L967M526M660O106Q217Q397N994L636L895
59122A360343O266Q316Q549P282N693M920N321N937N225K850K27j079q15L70J861
59107A421266L049L178K031L44j002j796k255k557l033m162n832p159p613p821
59093A386638q678j0098j1228j1678j1956j2750j4102j5224j5115j3661j2077
$$ plain form
59082 1250071 1238283 1225602 1212440 1200314 1190024 1180903 1171821 1162460 1153452 1145739 1139972 1136328 1134732
59069 1134732 1135109 1137196 1140135 1142899 1145587 1149804 1157095 1167275 1178862 1190867 1203410 1216833 1231190
59056 1231190 1246604 1263232 1280597 1297775 1314490 1331319 1348459 1365145 1380879 1396508 1413152
59045 1413152 1430357 1446264 1459633 1470900 1480961 1489713 1496542 1501835 1506896 1511950 1515060 1513986 1508980
59032 1508980 1502922 1498524 1496148 1494624 1493269 1492189 1490997 1488230 1482273 1472507 1459641 1445279 1431029
59019 1431029 1417532 1404285 1390638 1376776 1363520 1351469 1340731 1331106 1321931 1312005 1300309 1286883
59007 1286883 1272647 1258638 1245788 1234958 1226454 1219838 1214865 1212039 1211155 1209844 1205256 1197354 1189051
58994 1189051 1182747 1178259 1174768 1172920 1173446 1174983 1175262 1174052 1173114 1173238 1173112 1171661 1170038 1170204 1172329
$$ packed form
59082A250071j1788j2681j3162j2126j0290r121r082r361r008p713n767l644j596
59069A134732L77K087K939K764K688M217P291J0180J1587J2005J2543J3423J4357
59056A231190J5414J6628J7365J7178J6715J6829J7140J6686J5734J5629J6644
59045A413152J7205J5907J3369J1267J0061Q752O829N293N061N054L110j074n006
59032A508980o058m398k376j524j355j080j192k767n957r766j2866j4362j4250
59019A431029j3497j3247j3647j3862j3256j2051j0738r625r175r926j1696j3426
59007A286883j4236j4009j2850j0830q504o616m973k826q84j311m588p902q303
58994A189051o304m488l491j848N26J537K79j210r38J24j26j451j623J66K125
$$ plain form
58979 1172329 1174676 1175834 1176273 1177681 1181282 1186836 1193000 1198636 1203993 1210538 1219474 1230629 1243072 1256574
58965 1256574 1271857 1289421 1308818 1329317 1350674 1372618 1394076 1413816 1431772 1448809 1464930
58954 1464930 1478575 1488306 1494580 1499066 1502628 1504810 1505237 1504651 1504318 1505032 1506926 1509757 1513025 1516179 1519112
58939 1519112 1522357 1526521 1531487 1536205 1539198 1539410 1536983 1533245 1529605 1526282 1522379 1517263 1511474 1506019
58925 1506019 1501172 1496336 1490804 1484228 1476534 1467958 1459377 1452213 1447739 1446530 1448534 1453320 1460127 1468074
58911 1468074 1476767 1486579 1497876 1509979 1521453 1531647 1541477 1552287 1564326 1576866 1589370 1601602
58899 1601602 1612614 1620711 1624923 1625794 1624122 1619617 1611618 1600664 1588250 1575035 1560289 1543450 1525538
58886 1525538 1508531 1493742 1481181 1470023 1459190 1447755 1435588 1423839 1414250 1407543 1402637 1397760
$$ packed form
58979A172329K347J158M39J408L601N554O164N636N357O545Q936J1155J2443J3502
58965A256574J5283J7564J9397K0499K1357K1944K1458J9740J7956J7037J6121
58954A464930J3645R731O274M486L562K182M27n86l33P14J894K831L268L154K933
58939A519112L245M164M966M718K993K12k427l738l640l323l903n116n789n455
58925A506019m847m836n532o576p694q576q581p164m474j209K004M786O807P947
58911A468074Q693R812J1297J2103J1474J0194R830J0810J2039J2540J2504J2232
58899A601602J1012Q097M212Q71j672m505p999j0954j2414j3215j4746j6839j7912
58886A525538j7007j4789j2561j1158j0833j1435j2167j1749r589o707m906m877
$$ plain form
58874 1397760 1392210 1386593 1381431 1376248 1370403 1364199 1358470 1353406 1348639 1344312 1341054 1338737 1336303 1333292
58860 1333292 1330646 1329379 1329167 1329037 1328757 1328635 1328454 1327638 1326253 1324970 1324248 1324506 1326834 1332447 1341263 1351916
58844 1351916 1363191 1374644 1386026 1397379 1409840 1424941 1442479 1460373 1477448 1495146 1515243
58833 1515243 1536824 1557255 1575840 1594860 1616683 1641180 1666640 1692080 1717609 1743023 1767183
58822 1767183 1788926 1807955 1824642 1839295 1851806 1861700 1868363 1871420 1871188 1868635 1864661 1859392 1852366
58809 1852366 1843373 1832913 1821821 1810639 1799407 1787799 1775246 1761113 1745133 1727793 1710153
58798 1710153 1693135 1676814 1660352 1642647 1623160 1602203 1580556 1559078 1538725 1520419 1504291
58787 1504291 1489200 1473615 1457076 1440385 1424394 1409189 1394491 1380108 1365688 1350742 1335397
$$ packed form
58874A397760n550n617n162n183n845o204n729n064m767m327l258k317k434l011
58860A333292k646j267k12j30k80j22j81q16j385j283p22K58K328N613Q816J0653
58844A351916J1275J1453J1382J1353J2461J5101J7538J7894J7075J7698K0097
58833A515243K1581K0431J8585J9020K1823K4497K5460K5440K5529K5414K4160
58822A767183K1743J9029J6687J4653J2511R894O663L057k32k553l974n269p026
58809A852366q993j0460j1092j1182j1232j1608j2553j4133j5980j7340j7640
58798A710153j7018j6321j6462j7705j9487k0957k1647k1478k0353j8306j6128
58787A504291j5091j5585j6539j6691j5991j5205j4698j4383j4420j4946j5345
$$ plain form
58776 1335397 1320631 1307268 1295175 1283822 1273121 1263254 1254303 1246657 1241167 1238044 1235997 1233368 1229965
58763 1229965 1226930 1224956 1223470 1221651 1219525 1217956 1218029 1220344 1224263 1227891 1229547 1229416 1229286 1230636 1233457
58748 1233457 1236745 1239333 1240147 1238505 1234643 1229555 1224101 1218557 1213107 1208133 1203800 1199736 1195464 1191005
58734 1191005 1186925 1183858 1181797 1179697 1176100 1170622 1164626 1159989 1157383 1156189 1155735 1155943 1157030 1159322
58720 1159322 1163259 1168812 1174956 1180419 1184851 1188554 1191240 1192088 1191051 1189128 1187139 1185108 1183002 1181092
58706 1181092 1179190 1176417 1172246 1167107 1161571 1155665 1149446 1143547 1138573 1134466 1131015 1128594 1127822 1128757
58692 1128757 1130754 1133013 1135076 1137066 1139487 1142524 1145679 1148515 1151565 1155829 1161515 1168112 1175568 1184369
58678 1184369 1194288 1204164 1213278 1221959 1230513 1238743 1247081 1256948 1268915 1281430 1292487 1302035 1311685
$$ packed form
58776A335397j4766j3363j2093j1353j0701r867q951p646n490l123k047k629l403
58763A229965l035j974j486j819k126j569P3K315L919L628J656j31j30J350K821
58748A233457L288K588Q14j642l862n088n454n544n450m974m333m064m272m459
58734A191005m080l067k061k100l597n478n996m637k606j194m54K08J087K292
58720A159322L937N553O144N463M432L703K686Q48j037j923j989k031k106j910
58706A181092j902k773m171n139n536n906o219n899m974m107l451k421p72R35
58692A128757J997K259K063J990K421L037L155K836L050M264N686O597P456Q801
58678A184369R919R876R114Q681Q554Q230Q338R867J1967J2515J1057R548R650
$$ plain form
58665 1311685 1322433 1333709 1344489 1354412 1363755 1373018 1382580 1392291 1401422 1409448 1416909 1425136 1434995
58652 1434995 1445915 1456055 1463532 1467789 1469677 1469809 1467187 1460379 1449916 1438168 1426291 1412507 1394380
58639 1394380 1371901 1347282 1322333 1297259 1271762 1246065 1220593 1195426 1170432 1145761 1122197
58628 1122197 1101139 1083726 1069545 1056590 1043102 1029229 1016378 1005268 995264 985436 975599 966291
58616 966291 958214 951794 947028 943821 942592 944193 948851 955481 962435 968726 974213 979010 983400 988269
58602 988269 994932 1004089 1014865 1024950 1031890 1034698 1034429 1033068 1031870 1030922 1029848 1028082 1024565 1018351
58588 1018351 1010071 1001941 995572 990378 984865 978918 973848 970384 967634 964297 960321 956977 955504 955949
58574 955949 957397 959114 961127 963578 966018 967809 968901 969598 969856 969504 968932 968713 968738 968625 968722 969628 970923
$$ packed form
58665A311685J0748J1276J0780R923R343R263R562R711R131Q026P461Q227R859
58652A434995J0920J0140P477M257J888J32k622o808j0463j1748j1877j3784j8127
58639A394380k2479k4619k4949k5074k5497k5697k5472k5167k4994k4671k3564
58628A122197k1058j7413j4181j2955j3488j3873j2851j1110j0004r828r837r308
58616I66291q077o420m766l207j229J601M658O630O954O291N487M797M390M869
58602I88269O663R157J0776J0085O940K808k69j361j198r48j074j766l517o214
58588A018351q280q130o369n194n513n947n070l464k750l337l976l344j473M45
58574I55949J448J717K013K451K440J791J092O97K58l52n72k19K5j13R7R06J295
$$ plain form
58557 970923 971827 973111 976740 983245 991000 998490 1005561 1011772 1015647 1017043 1018591 1022819 1028811 1033495
58543 1033495 1035564 1036369 1037434 1038930 1040610 1042694 1045456 1048778 1052272 1055257 1056943 1057306 1057511 1058862 1061880
58528 1061880 1066993 1075146 1086640 1100057 1113612 1127102 1141346 1156271 1170890 1184868 1198712 1212583
58516 1212583 1226198 1239866 1254374 1269728 1285127 1300363 1316455 1334826 1356399 1381262 1408576
58505 1408576 1437223 1467272 1500181 1536548 1574394 1611014 1646045 1681124 1716706 1750784 1780911
58494 1780911 1806076 1826333 1841830 1852691 1859092 1861183 1859489 1855190 1849217 1841355 1831069 1818803
58482 1818803 1805320 1790131 1771845 1749846 1724413 1695571 1663450 1629717 1596855 1565695 1535088
58471 1535088 1504377 1474807 1448059 1424618 1404023 1385618 1368734 1353197 1339903 1329726 1321698
$$ packed form
58557I70923R04J284L629O505P755P490P071O211L875J396J548M228N992M684
58543A033495K069Q05J065J496J680K084K762L322L494K985J686L63K05J351L018
58528A061880N113Q153J1494J3417J3555J3490J4244J4925J4619J3978J3844J3871
58516A212583J3615J3668J4508J5354J5399J5236J6092J8371K1573K4863K7314
58505A408576K8647L0049L2909L6367L7846L6620L5031L5079L5582L4078L0127
58494A780911K5165K0257J5497J0861O401K091j694m299n973p862j0286j2266
58482A818803j3483j5189j8286k1999k5433k8842l2121l3733l2862l1160l0607
58471A535088l0711k9570k6748k3441k0595j8405j6884j5537j3294j0177q028
$$ plain form
58460 1321698 1313565 1304444 1295463 1287391 1279180 1269679 1259398 1249617 1240804 1232898 1226190 1220874 1216321 1211671
58446 1211671 1206826 1202379 1199059 1197552 1198049 1199490 1199965 1198421 1195499 1192406 1189707 1187554 1186230 1185911 1186498
58431 1186498 1188088 1190999 1195176 1200390 1207247 1216879 1229105 1241992 1254004 1265781 1279102 1294975
58419 1294975 1313558 1335042 1359315 1384998 1409873 1432368 1452047 1468770 1481947 1490792 1495031 1495378
58407 1495378 1493268 1489919 1485632 1480242 1474169 1468531 1464247 1461503 1460044 1459468 1459322 1459609 1461108 1464517 1469338
58392 1469338 1474476 1479981 1487100 1496233 1505627 1512559 1515305 1513740 1508778 1501617 1493104 1483473 1472963 1462494
58378 1462494 1453181 1445280 1438231 1431624 1425515 1420149 1416236 1415087 1417284 1421418 1425532 1429778 1436215 1445862
58364 1445862 1457566 1470052 1483317 1497140 1509787 1519500 1526342 1531358 1534580 1534889 1531519 1524925 1516382
$$ packed form
58460A321698q133r121q981q072q211r501j0281r781q813p906o708n316m553m650
58446A211671m845m447l320j507M97J441M75j544k922l093k699k153j324l19N87
58431A186498J590K911M177N214O857R632J2226J2887J2012J1777J3321J5873
58419A294975J8583K1484K4273K5683K4875K2495J9679J6723J3177Q845M239L47
58407A495378k110l349m287n390o073n638m284k744j459n76j46K87J499L409M821
58392A469338N138N505P119R133R394O932K746j565m962p161q513r631j0510j0469
58378A462494r313p901p049o607o109n366l913j149K197M134M114M246O437R647
58364A445862J1704J2486J3265J3823J2647R713O842N016L222L09l370o594q543
$$ plain form
58351 1516382 1507251 1498334 1489587 1480610 1471408 1462272 1453168 1444034 1435529 1428458 1422494 1416683 1411337 1408143
58337 1408143 1407976 1409796 1412283 1415455 1419991 1425786 1431782 1436663 1439499 1440512 1441295 1443287 1445968 1447678
58323 1447678 1448277 1449407 1451775 1453886 1454325 1453903 1454518 1457021 1461146 1466448 1472236 1477464 1481816 1486403 1492717
58308 1492717 1501422 1512459 1525305 1538635 1551025 1562893 1576653 1593895 1613220 1631804 1648283
58297 1648283 1663156 1677156 1690480 1703221 1715463 1727007 1737661 1747651 1757352 1766858 1776164 1785479
58285 1785479 1795168 1805681 1817483 1830688 1844996 1860604 1878696 1899999 1923237 1946317 1968773
58274 1968773 1991581 2014774 2037040 2057867 2078305 2099194 2120251 2141254 2162431 2183123 2201783
58263 2201783 2217941 2232751 2247261 2261781 2277236 2294964 2314405 2332985 2349211 2364014 2378294
$$ packed form
58351A516382r131q917q747q977r202r136r104r134q505p071n964n811n346l194
58337A408143j67J820K487L172M536N795N996M881K836J013P83J992K681J710
58323A447678N99J130K368K111M39m22O15K503M125N302N788N228M352M587O314
58308A492717Q705J1037J2846J3330J2390J1868J3760J7242J9325J8584J6479
58297A648283J4873J4000J3324J2741J2242J1544J0654R990R701R506R306R315
58285A785479R689J0513J1802J3205J4308J5608J8092K1303K3238K3080K2456
58274A968773K2808K3193K2266K0827K0438K0889K1057K1003K1177K0692J8660
58263B201783J6158J4810J4510J4520J5455J7728J9441J8580J6226J4803J4280
$$ plain form
58252 2378294 2391429 2403512 2416839 2433390 2452542 2473024 2495568 2521662 2550814 2580875 2610468
58241 2610468 2639774 2669570 2700575 2733143 2766834 2800932 2835654 2871692 2908456 2944464 2979832
58230 2979832 3016495 3055418 3095696 3137156 3181505 3229723 3280503 3332740 3387577 3446496 3509083
58219 3509083 3574048 3640773 3708697 3777121 3846937 3920729 3999895 4083449 4170639 4262536 4359922
58208 4359922 4462107 4569257 4683417 4805658 4934663 5069752 5212753 5365075 5525433
58199 5525433 5692385 5866625 6048771 6237501 6432088 6634463 6846777 7069442 7303619
58190 7303619 7552931 7820373 8105916 8409099 8731066 9071963 9429503 9802730 10194258
58181 10194258 10606509 11039062 11492309 11970087 12475700 13008989 13570622 14165464 14798022
$$ packed form
58252B378294J3135J2083J3327J6551J9152K0482K2544K6094K9152L0061K9593
58241B610468K9306K9796L1005L2568L3691L4098L4722L6038L6764L6008L5368
58230B979832L6663L8923M0278M1460M4349M8218N0780N2237N4837N8919O2587
58219C509083O4965O6725O7924O8424O9816P3792P9166Q3554Q7190R1897R7386
58208D359922J02185J07150J14160J22241J29005J35089J43001J52322J60358
58199E525433J66952J74240J82146J88730J94587K02375K12314K22665K34177
58190G303619K49312K67442K85543L03183L21967L40897L57540L73227L91528
58181A0194258M12251M32553M53247M77778N05613N33289N61633N94842O32558
$$ plain form
58172 14798022 15468245 16175929 16925796 17724038 18573066 19473775 20429631 21444308 22518961
58163 22518961 23656613 24866173 26157738 27537225 29009735 30583999 32268462 34067059
58155 34067059 35984659 38033740 40231407 42594266 45141688 47900344 50901193 54177458
58147 54177458 57770642 61732416 66115023 70967673 76351253 82353357 89087418 96691443
58139 96691443 105340708 115256807 126700355 139970803 155424968 173474642 194527661
58132 194527661 218890673 246648869 277495871 310543504 344259492 376635738 405474565
58125 405474565 428616696 444153227 450801627 448377001 437974905 421617503 401590152
58118 401590152 379904123 358062244 337015153 317209636 298733877 281498725 265318359
$$ packed form
58172A4798022O70223P07684P49867P98242Q49028R00709R55856J014677J074653
58163B2518961J137652J209560J291565J379487J472510J574264J684463J798597
58155C4067059J917600K049081K197667K362859K547422K758656L000849L276265
58147E4177458L593184L961774M382607M852650N383580O002104O734061P604025
58139I6691443Q649265R916099J1443548J3270448J5454165J8049674K1053019
58132A94527661K4363012K7758196L0847002L3047633L3715988L2376246K8838827
58125D05474565K3142131J5536531O648400k424626j0402096j6357402k0027351
58118D01590152k1686029k1841879k1047091j9805517j8475759j7235152j6180366
$$ plain form
58111 265318359 249885919 234803947 219747449 204623700 189573728 174845897 160678996
58104 160678996 147253241 134677943 122997707 112223543 102364649 93425334 85379908
58097 85379908 78166424 71703957 65907175 60692204 55986755 51739239 47911200 44461561
58089 44461561 41344226 38517291 35945881 33597924 31445253 29468043 27651579 25979697
58081 25979697 24436883 23014660 21709314 20513997 19417721 18410136 17481917 16621922
58073 16621922 15819255 15067340 14361906 13696597 13064763 12463842 11893681 11352212 10837027
58064 10837027 10349343 9891742 9463021 9059178 8678126 8319474 7981033 7659679 7354744
58055 7354744 7066790 6793934 6532969 6283355 6046789 5823592 5612508 5412971 5224450
$$ packed form
58111B65318359j5432440j5081972j5056498j5123749j5049972j4727831j4166901
58104A60678996j3425755j2575298j1680236j0774164r858894q939315q045426
58097H5379908p213484o462467n796782n214971m705449m247516l828039l449639
58089D4461561l117335k826935k571410k347957k152671j977210j816464j671882
58081B5979697j542814j422223j305346j195317j096276j007585r28219q59995
58073A6621922q02667p51915p05434o65309o31834o00921n70161n41469n15185
58064A0837027m87684m57601m28721m03843l81052l58652l38441l21354l04935
58055G354744k87954k72856k60965k49614k36566k23197k11084j99537j88521
$$ plain form
58046 5224450 5044588 4870991 4703995 4544877 4392461 4244321 4100234 3961672 3828943
58037 3828943 3701544 3580164 3465667 3357174 3253533 3155189 3062007 2971124 2880049 2790368
58027 2790368 2705203 2624453 2545939 2469898 2398708 2332902 2270779 2211229 2153738 2096429 2037524
58016 2037524 1978372 1921933 1868738 1817263 1767585 1721329 1678403 1637129 1597455 1560871 1527225
58005 1527225 1494761 1463336 1434462 1408025 1382030 1355954 1331355 1308631 1286032 1262614 1239565
57994 1239565 1217801 1196645 1175677 1155787 1137635 1120915 1105623 1092102 1079408 1065682 1050645
57983 1050645 1035841 1022030 1008363 994641 982203 971608 961219 949230 935789 922280 909572
57972 909572 897630 885901 873573 860237 846502 833380 821264 810175 800277 791066 780987 769352
$$ packed form
58046E224450j79862j73597j66996j59118j52416j48140j44087j38562j32729
58037C828943j27399j21380j14497j08493j03641r8344r3182r0883r1075q9681
58027B790368q5165q0750p8514p6041p1190o5806o2123n9550n7491n7309n8905
58016B037524n9152n6439n3195n1475m9678m6256m2926m1274l9674l6584l3646
58005A527225l2464l1425k8874k6437k5995k6076k4599k2724k2599k3418k3049
57994A239565k1764k1156k0968j9890j8152j6720j5292j3521j2694j3726j5037
57983A050645j4804j3811j3667j3722j2438j0595j0389j1989j3441j3509j2708
57972I09572j1942j1729j2328j3336j3735j3122j2116j1089r898r211j0079j1635
$$ plain form
57960 769352 757765 747783 738098 726285 712712 700121 689659 680098 671020 663838 658908 654295 648526
57947 648526 642506 637716 634397 632352 631637 631502 630403 628046 625829 624481 622973 620559 617940 615423 611925
57932 611925 607234 603340 601635 600220 596103 589315 582963 579550 578730 578469 576946 573296 567685 561165 555109
57917 555109 550486 547542 545770 544152 542011 539715 538087 537255 536903 537422 539484 542384 544279 544562 544550 545022
57901 545022 544592 541791 537598 534273 532246 529747 525463 520219 515760 512888 511253 510246 509381 508046 505564
57886 505564 501968 498526 496933 497665 499526 501163 502566 504561 507315 510326 513734 518585 525564 534204
57872 534204 543553 552931 561824 569732 576433 582032 586649 590477 593970 597249 599316 598711 595175 590023
57858 590023 584716 579702 574784 569832 564787 559544 554161 548916 544079 540070 537725 537678 539413 541605 543458
$$ packed form
57960G69352j1587r982r685j1813j3573j2591j0462r561r078p182m930m613n769
57947F48526o020m790l319k045p15j35j099k357k217j348j508k414k619k517l498
57932F11925m691l894j705j415m117o788o352l413q20k61j523l650n611o520o056
57917E55109m623k944j772j618k141k296j628q32l52N19K062K900J895K83j2M72
57901E45022m30k801m193l325k027k499m284n244m459k872j635j007q65j335k482
57886E05564l596l442j593P32J861J637J403J995K754L011L408M851O979Q640
57872E34204R349R378Q893P908O701N599M617L828L493L279K067o05l536n152
57858E90023n307n014m918m952n045n243n383n245m837m009k345m7J735K192J853
$$ plain form
57843 543458 545061 546317 546349 544469 541275 538381 537116 537543 538636 539507 540458 542399 545111 547013 547194 546702
57827 546702 546846 547182 546603 545660 545910 547119 547021 544143 539289 533828 528135 522392 517535 514370 512527 510914
57811 510914 508578 504913 500066 495539 493284 493564 494473 493999 491757 488447 484863 482029 481204 482847 486225
57796 486225 490576 495908 502168 508599 514615 520561 526928 533467 539612 545161 550137 554735 559613 565154
57782 565154 569990 571597 569235 565235 562392 560973 559214 555757 550449 543603 535860 528351 521814 515795
57768 515795 509601 503458 497813 492139 485686 478988 473332 469018 465420 462489 460691 459420 457017 452955
57754 452955 448797 446213 444952 443577 441494 439176 436599 432533 425880 417168 408119 399831 392013 384247
57740 384247 377313 372389 369212 366055 361852 357490 354427 352716 351124 348874 346577 345513 346415 348959
$$ packed form
57843E43458J603J256L2j880l194k894j265M27J093Q71R51J941K712J902J81m92
57827E46702J44L36n79r43K50J209r8k878m854n461n693n743m857l165j843j613
57811E10914k336l665m847m527k255K80R09m74k242l310l584k834q25J643L378
57796D86225M351N332O260O431O016N946O367O539O145N549M976M598M878N541
57782E65154M836J607k362m000k843j419j759l457n308o846p743p509o537o019
57768E15795o194o143n645n674o453o698n656m314l598k931j798j271k403m062
57754D52955m158k584j261j375k083k318k577m066o653q712r049q288p818p766
57740C84247o934m924l177l157m203m362l063j711j592k250k297j064R02K544
$$ plain form
57726 348959 352226 355694 359709 364649 369824 373975 377006 380350 385310 391874 399639 408769 419124 429334
57712 429334 438022 445557 453466 462354 471308 479070 484781 487856 488346 487454 486572 485682 483760 480762 477836
57697 477836 475133 470930 464000 455828 449052 444179 439279 432928 426181 421129 418404 416733 414436 410763
57683 410763 406171 402023 399854 400165 401700 402369 401044 398247 395308 393476 393836 397013 402223 407287 410484
57668 410484 412208 414133 416988 419962 422169 423768 425375 427103 428601 429723 430883 432826 435926 439396
57654 439396 441422 440607 437225 432732 428287 424201 420318 416151 410995 404809 398690 393399 387818 380230
57640 380230 370893 361694 353301 344777 336547 331375 330839 332581 332962 331258 329212 327381 324457 320227 316895
57625 316895 316523 318560 320868 322406 324123 327697 333996 342513 351932 361401 371579 384371 401626 424096
$$ packed form
57726C48959L267L468M015M940N175M151L031L344M960O564P765R130J0355J0210
57712D29334Q688P535P909Q888Q954P762N711L075M90q92q82q90j922k998k926
57697D77836k703m203o930q172o776m873m900o351o747n052k725j671k297l673
57683D10763m592m148k169L11J535O69j325k797k939j832L60L177N210N064L197
57668D10484J724J925K855K974K207J599J607J728J498J122J160J943L100L470
57654D39396K026q15l382m493m445m086l883m167n156o186o119n291n581p588
57640C80230r337r199q393q524q230n172n36J742L81j704k046j831k924m230l332
57625C16895l72K037K308J538J717L574O299Q517R419R469J0178J2792J7255K2470
$$ plain form
57611 424096 451566 483796 521187 564187 611624 659704 703305 738418 763001 775921 776574 766154
57599 766154 747991 725421 699767 671081 640041 608088 576382 545887 518013 493870 472949
57588 472949 453641 435093 417673 401768 387169 373675 361383 350238 339972 330499 321819 313774
57576 313774 306525 300883 297318 295060 293118 291653 291095 290457 288207 284659 281617 279409 276122 270437 263577
57561 263577 257509 252667 248459 244663 241104 236953 231691 226008 220659 215223 209253 203859 200543 198807
57547 198807 196552 192912 189273 187206 186649 186593 186500 186229 185297 183159 180103 177224 175320 174083 172507 170063
57531 170063 167275 165044 163508 161940 159760 157130 154330 151102 147166 143072 139882 138051 137045 135976
57517 135976 134250 131737 128758 125900 123477 121223 118727 115899 112723 109015 105029 101859 100261 99150
$$ packed form
57611D24096K7470L2230L7391M3000M7437M8080M3601L5113K4583J2920O53j0420
57599G66154j8163k2570k5654k8686l1040l1953l1706l0495k7874k4143k0921
57588D72949j9308j8548j7420j5905j4599j3494j2292j1145j0266r473q680q045
57576C13774p249n642l565k258j942j465n58o38k250l548l042k208l287n685o860
57561B63577o068m842m208l796l559m151n262n683n349n436n970n394l316j736
57547A98807k255l640l639k067n57n6r3k71r32k138l056k879j904j237j576k444
57531A70063k788k231j536j568k180k630k800l228l936m094l190j831j006j069
57517A35976j726k513k979k858k423k254k496k828l176l708l986l170j598j111
$$ plain form
57503 99150 96361 91192 85376 81112 78891 77690 76588 75399 74264 73451 73336 73842 73928 72386 69261 66034
57487 66034 64213 64080 64841 65543 65600 64767 63066 60900 59120 58600 59385 60285 59851 58024 56301 55805 55627
57470 55627 53819 49842 45165 41436 38876 36724 34455 32041 29654 27798 27366 28897 31862 35106 37908
57455 37908 40276 42458 44678 47275 50592 54507 58280 61012 62278 62417 62192 62039 61749 61292 61706 64185
57439 64185 67921 69896 67817 62714 57621 54116 51400 48530 45916 44032 42014 38636 33965 29128
57425 29128 24794 20772 16789 12754 8274 2857 -3096 -8164 -11276 -12977 -14882 -18051 -22288 -26887
57411 -26887 -31442 -35678 -39041 -41086 -42110 -42830 -43470 -43857 -44377 -45899 -48282 -49871 -49342 -47532 -46519 -47227
57395 -47227 -48832 -50249 -51072 -51014 -49610 -47058 -44655 -43806 -44799 -46652 -47798 -47039 -44576 -42276 -42258 -44847
$$ packed form
57503I9150k789n169n816m264k221j201j102j189j135q13j15N06Q6j542l125l227
57487F6034j821j33P61P02N7q33j701k166j780n20P85R00m34j827j723m96j78
57470E5627j808l977m677l729k560k152k269k414k387j856m32J531K965L244K802
57455C7908K368K182K220K597L317L915L773K732J266J39k25j53k90m57M14K479
57439F4185L736J975k079n103n093l505k716k870k614j884k018l378m671m837
57425B9128m334m022l983m035m480B857c096n068l112j701j905l169m237m599
57411b6887m555m236l363k045j024p20o40l87n20j522k383j589N29J810J013p08
57395d7227j605j417q23N8J404K552K403Q49r93j853j146P59K463K300J8k589
$$ plain form
57379 -44847 -48259 -50408 -50594 -49534 -48497 -48590 -50105 -52265 -54032 -55263 -56454 -57438 -57360 -56166 -55010 -54564
57363 -54564 -53871 -51724 -48625 -46515 -46805 -49123 -51768 -53095 -52871 -52549 -53810 -56648 -59373 -60553 -60206 -58998
57347 -58998 -57372 -55826 -55018 -54967 -55081 -55510 -57310 -60495 -63085 -63287 -61726 -60466 -60637 -62188 -64952 -68319
57331 -68319 -70455 -69714 -66793 -64031 -62462 -60846 -57751 -53405 -49295 -46824 -46417 -47001 -46400 -43332 -39056
57316 -39056 -36170 -35787 -36844 -38011 -38922 -39527 -39683 -39836 -40873 -42695 -43928 -43606 -42277 -40988 -40066 -39309
57300 -39309 -38422 -36691 -33186 -27946 -22187 -16735 -11152 -5113 442 4650 8529 14142 22124 31143 39771
57285 39771 47855 55916 64107 72231 80181 87936 95414 102782 110615 119329 128379 136507 143119 149239
57271 149239 156607 165695 175065 182885 188692 193354 197882 202997 209434 217567 226579 234900 241870 248436
$$ packed form
57379d4847l412k149j86J060J037r3j515k160j767j231j191r84P8J194J156M46
57363e4564O93K147L099K110k90k318k645j327K24L22j261k838k725j180L47J208
57347e8998J626J546Q08N1j14m29j800l185k590k02J561J260j71j551k764l367
57331f8319k136P41K921K762J569J616L095M346M110K471M07n84O01L068M276
57316c9056K886L83j057j167r11o05j56j53j037j822j233L22J329J289R22P57
57300c9309Q87J731L505N240N759N452N583e113D42M208L879N613P982R019Q628
57285C9771Q084Q061Q191Q124P950P755P478P368P833Q714R050Q128O612O120
57271A49239P368R088R370P820N807M662M528N115O437Q133R012Q321O970O566
$$ plain form
57257 248436 255933 264701 274151 283562 292436 300630 308632 317279 326710 335959 344110 351557 359539 368575
57243 368575 377913 386455 393694 399618 404233 407546 409799 411412 412715 413851 414829 415393 414876 412575 408564
57228 408564 403996 400278 397959 396596 395518 394491 393952 395136 399715 408435 420085 432696 445883 460970
57214 460970 478496 497040 515515 535347 558738 585386 612664 638866 664580 690615 716359
57203 716359 740967 764929 789324 814250 838891 862732 885892 908535 930615 952199 973560
57192 973560 994911 1016204 1037133 1057369 1077117 1097368 1119015 1141487 1162795 1181377 1197611
57181 1197611 1213332 1230308 1249494 1271079 1294345 1317570 1339023 1358559 1377821 1398531 1420770
57170 1420770 1443237 1464796 1485049 1503599 1519851 1534068 1547665 1561511 1574633 1585958 1597038
$$ packed form
57257B48436P497Q768R450R411Q874Q194Q002Q647R431R249Q151P447P982R036
57243C68575R338Q542P239N924M615L313K253J613J303J136R78N64n17k301m011
57228D08564m568l718k319j363j078j027n39J184M579Q720J1650J2611J3187J5087
57214D60970J7526J8544J8475J9832K3391K6648K7278K6202K5714K6035K5744
57203G16359K4608K3962K4395K4926K4641K3841K3160K2643K2080K1584K1361
57192I73560K1351K1293K0929K0236J9748K0251K1647K2472K1308J8582J6234
57181A197611J5721J6976J9186K1585K3266K3225K1453J9536J9262K0710K2239
57170A420770K2467K1559K0253J8550J6252J4217J3597J3846J3122J1325J1080
$$ plain form
57159 1597038 1611448 1631307 1655923 1684299 1717145 1755251 1797434 1841853 1888485 1938619 1992332
57148 1992332 2048053 2104286 2160152 2214281 2264740 2310500 2351821 2388978 2421615 2449569 2473281
57137 2473281 2493124 2509221 2522194 2533218 2543216 2552931 2564001 2578962 2599587 2625760 2656135 2689218
57125 2689218 2723625 2758225 2792598 2826940 2861087 2893793 2922973 2946379 2962355 2970628 2972385 2969061
57113 2969061 2961151 2948601 2932036 2912874 2892531 2872173 2852849 2834871 2817320 2799061 2780031
57102 2780031 2760693 2740686 2719318 2697150 2675637 2654955 2633403 2609269 2582250 2552680 2520310
57091 2520310 2484448 2444849 2402213 2357963 2313278 2267918 2220350 2169344 2114586 2054879 1986567
57080 1986567 1905000 1807162 1691990 1558919 1407385 1237336 1049087 843084 620549 383278
$$ packed form
57159A597038J4410J9859K4616K8376L2846L8106M2183M4419M6632N0134N3713
57148A992332N5721N6233N5866N4129N0459M5760M1321L7157L2637K7954K3712
57137B473281J9843J6097J2973J1024R998R715J1070J4961K0625K6173L0375L3083
57125B689218L4407L4600L4373L4342L4147L2706K9180K3406J5976Q273J757l324
57113B969061p910j2550j6565j9162k0343k0358j9324j7978j7551j8259j9030
57102B780031j9338k0007k1368k2168k1513k0682k1552k4134k7019k9570l2370
57091B520310l5862l9599m2636m4250m4685m5360m7568n1006n4758n9707o8312
57080A986567q1567r7838j15172j33071j51534j70049j88249k06003k22535k37271
$$ plain form
57070 383278 131654 -136082 -421426 -723695 -1041888 -1376790 -1729849 -2102375 -2498739 -2928856
57060 -2928856 -3404525 -3934362 -4524653 -5182837 -5916218 -6728704 -7623398 -8608260 -9695670
57051 -9695670 -10897260 -12223219 -13686174 -15301680 -17085561 -19055353 -21234303 -23650276
57043 -23650276 -26332365 -29314103 -32639879 -36364716 -40552367 -45284419 -50675359 -56877994
57035 -56877994 -64081862 -72515752 -82439960 -94106225 -107709692 -123387232 -141257688
57028 -141257688 -161423168 -183882819 -208426952 -234625949 -261944974 -289903180 -318151578
57021 -318151578 -346370189 -373981821 -399848725 -422236025 -439198488 -449208112 -451621193
57014 -451621193 -446732798 -435510141 -419261843 -399389107 -377207659 -353812510 -330013397
$$ packed form
57070C83278A31654a36082k85344l02269l18193l34902l53059l72526l96364m30117
57060b928856m75669n29837n90291o58184p33381q12486q94694r84862j087410
57051i695670j201590j325959j462955j615506j783881j969792k178950k415973
57043b3650276k682089k981738l325776l724837m187651m732052n390940o202635
57035e6877994p203868q433890r924208j1666265j3603467j5677540j7870456
57028a41257688k0165480k2459651k4544133k6198997k7319025k7958206k8248398
57021c18151578k8218611k7611632k5866904k2387300j6962463j0009624k413081
57014d51621193M888395J1222657J6248298J9872736K2181448K3395149K3799113
$$ plain form
57007 -330013397 -306362177 -283233919 -260900632 -239568783 -219388732 -200455937 -182816477
57000 -182816477 -166473849 -151385734 -137453719 -124529823 -112455101 -101110554 -90445229
56993 -90445229 -80469766 -71230324 -62778645 -55145650 -48327015 -42287182 -36973798 -32327316
56985 -32327316 -28282527 -24770103 -21720715 -19067248 -16745797 -14700093 -12886641 -11273413
56977 -11273413 -9833888 -8544548 -7386247 -6343278 -5400170 -4541799 -3756135 -3034024 -2367124
56968 -2367124 -1749220 -1178522 -654346 -171389 278965 701506 1095112 1458299 1792671
56959 1792671 2099587 2377206 2623184 2838015 3023992 3182730 3315127 3422075 3504142 3562253
56949 3562253 3599690 3621949 3633767 3637413 3633888 3623824 3606821 3582131 3551030 3516851 3482024 3446740
$$ packed form
57007c30013397K3651220K3128258K2333287K1331849K0180051J8932795J7639460
57000a82816477J6342628J5088115J3932015J2923896J2074722J1344547J0665325
56993i0445229R975463R239442Q451679P632995O818635O039833N313384M646482
56985c2327316M044789L512424L049388K653467K321451K045704J813452J613228
56977a1273413J439525J289340J158301J042969R43108Q58371P85664P22111O66900
56968b367124O17904N70698N24176a71389B78965M22541L93606L63187L34372
56959A792671L06916K77619K45978K14831J85977J58738J32397J06948Q2067N8111
56949C562253L7437K2259J1818L646l525j0064j7003k4690l1101l4179l4827l5284
$$ plain form
56937 3446740 3411007 3375914 3341890 3307528 3271224 3232562 3191219 3146164 3096990 3044446 2988368
56926 2988368 2926321 2855527 2775241 2686305 2589536 2485930 2377879 2269069 2163188 2062842
56916 2062842 1968872 1880260 1795358 1713632 1635644 1561352 1489522 1419120 1350246 1283364 1218630
56905 1218630 1156380 1097373 1042211 991438 946355 908503 877815 852189 829202 807275 785096
56894 785096 761319 735524 708346 680131 650537 619960 590087 562181 535773 509827 484357
56883 484357 460280 438486 419747 404724 393406 385217 380141 378920 381707 387522 395599 406097 418528
56870 418528 430428 438825 442622 442618 439519 432852 421782 406436 388450 370422 354458 340902 328712
56857 328712 317069 306129 296243 287244 278826 270901 263277 255609 247886 240324 232684 224485 216063 208569
$$ packed form
56937C446740l5733l5093l4024l4362l6304l8662m1343m5055m9174n2544n6078
56926B988368o2047p0794q0286q8936r6769j03606j08051j08810j05881j00346
56916B062842r3970q8612q4902q1726p7988p4292p1830p0402o8874o6882o4734
56905A218630o2250n9007n5162n0773m5083l7852l0688k5626k2987k1927k2179
56894G85096k3777k5795k7178k8215k9594l0577k9873k7906k6408k5946k5470
56883D84357k4077k1794j8739j5023j1318q189n076j221K787N815Q077J0498J2431
56870D18528J1900Q397L797ml099o667j1070j5346j7986j8028j5964j3556j2190
56857C28712j1643j0940r886q999q418p925p624p668p723p562p640q199q422p494
$$ plain form
56843 208569 202743 198635 196578 197097 199444 201601 202514 203234 205131 208217 212130 217528 225339 235642 248542
56828 248542 265070 285535 307664 328215 346344 363722 381255 397269 409545 417867 423724 428229
56816 428229 431257 432449 432431 432810 435176 440295 448399 459857 474859 492437 510871 529787 551133
56803 551133 577054 607077 638255 667781 694387 717302 735250 747230 753468 754857 751879 744819
56791 744819 734719 723312 711909 700938 690731 682119 675836 671903 670407 672672 680749 695517 716129
56778 716129 741695 772605 809302 850293 892252 931687 965495 990339 1003142 1003035 992181 974285
56766 974285 952608 929260 905384 881504 858251 837026 819393 805641 794692 785763 779485 777085
56754 777085 779171 785743 796708 811936 831217 854360 880440 906497 927990 941434 946249 943511
$$ packed form
56843B08569n826m108k057N19K347K157R13P20J897L086L913N398P811J0303J2900
56828B48542J6528K0465K2129K0551J8129J7378J7533J6014J2276Q322N857M505
56816D28229L028J192j8L79K366N119Q104J1458J5002J7578J8434J8916K1346
56803E51133K5921L0023L1178K9526K6606K2915J7948J1980O238J389k978p060
56791G44819j0100j1407j1403j0971j0207q612o283l933j496K265Q077J4768K0612
56778G16129K5566L0910L6697M0991M1959L9435L3808K4844J2803j07j0854j7896
56766I74285k1677k3348k3876k3880k3253k1225j7633j3752j0949q929o278k400
56754G77085K086O572J0965J5228J9281K3143K6080K6057K1493J3444M815k738
$$ plain form
56742 943511 933714 916768 893738 867415 840949 816367 794195 773845 754407 735686 718619 704411
56730 704411 693391 685027 678900 675221 674371 676216 679956 684597 689601 694838 699609 701970 699789 692577
56716 692577 681611 668129 652205 633727 613604 593368 574123 556274 539640 523321 506323
56705 506323 489038 473458 461138 451598 443509 436600 431141 426136 419608 410743 400643 390892 382523
56692 382523 376354 372887 371254 369292 365479 360228 354760 349443 343993 338812 335139 333842 334582 336254
56678 336254 337871 338949 339409 339324 338751 337766 336583 335461 334372 332941 330957 328896 327670 327777 328933 330685
56662 330685 333094 336392 340125 343220 345158 346572 348337 350440 352217 353337 354005 354485 355095 356414 358634
56647 358634 360798 361566 360873 359941 359537 359262 358945 359474 361435 363834 365231 365529 365569 365465 364585 363079 362159
$$ packed form
56742I43511r797j6946k3030k6323k6466k4582k2172k0350j9438j8721j7067j4208
56730G04411j1020q364o127l679q50J845L740M641N004N237M771K361k181p212
56716F92577j0966j3482j5924j8478k0123k0236j9245j7849j6634j6319j6998
56705E06323j7285j5580j2320r540q089o909n459n005o528q865j0100r751q369
56692C82523o169l467j633j962l813n251n468n317n450n181l673j297P40J672
56678C36254J617J078M60q5n73r85j183j122j089j431j984k061j226J07J156J752
56662C30685K409L298L733L095J938J414J765K103J777J120O68M80O10J319K220
56647C58634K164P68o93r32m04k75l17N29J961K399J397K98M0j04q80j506r20
$$ plain form
56630 362159 362575 363830 365280 367114 369578 371863 372729 372157 371656 372572 374517 375838 375562 374423 373977 375016
56614 375016 377068 379086 380384 381173 382416 384785 387440 388429 386911 384485 383452 384200 385338 386012 386573
56599 386573 387061 386817 386267 387395 391301 396414 400258 402081 402527 401722 399294 395947 393406 392600 392802 392649
56583 392649 391317 388850 386066 383976 382551 380423 376575 371945 368309 365914 363518 360699 358665 358311
56569 358311 358688 358140 356255 354014 352512 352110 352506 353135 353630 354151 355221 357187 359929 362965 365515 366708
56553 366708 366261 364937 363829 363147 362218 360645 358976 358135 358615 360130 361571 361435 359131 355982 354158 354396
56537 354396 355452 355993 356086 356227 355821 353784 350391 347448 346422 347188 348850 351002 353566 355918 357114 357043
56521 357043 356619 356566 356632 356441 356615 358298 361706 365829 369544 372482 374832 377069 380074 384787 391352 398998
$$ packed form
56630C62159M16J255J450J834K464K285Q66n72n01R16J945J321k76j139m46J039
56614C75016K052K018J298P89J243K369K655R89j518k426j033P48J138O74N61
56599C86573M88k44n50J128L906N113L844J823M46q05k428l347k541q06K02j53
56583C92649j332k467k784k090j425k128l848m630l636k395k396k819k034l54
56569C58311L77n48j885k241j502m02L96O29M95N21J070J966K742L036K550J193
56553C66708m47j324j108o82r29j573j669q41M80J515J441j36k304l149j824K38
56537C54396J056N41R3J41m06k037l393k943j026P66J662K152K564K352J196p1
56521C57043m24n3O6j91J74J683L408M123L715K938K350K237L005M713O565P646
$$ plain form
56505 398998 407039 415484 424455 433618 442641 451767 461501 471996 483017 494105 504485 513228 519775
56492 519775 524038 526082 526426 526606 528309 531468 534173 535028 534680 534399 534174 533187 531223 528532 525117 521338
56476 521338 518518 517540 517241 515562 512001 507720 503573 499487 495610 492563 490255 487757 484688 481739 479535
56461 479535 477819 476004 473646 470281 465763 461003 457437 455439 453986 452164 450189 448663 447539 446237
56447 446237 444269 441498 438159 434770 431694 428875 426289 424295 423060 422126 421206 420791 421025 420704 418712
56432 418712 416016 414702 415242 416293 417063 418041 419142 419059 417192 414674 412682 411069 409512 408739 409554 411604
56416 411604 413997 416219 417748 417881 416974 416900 419051 422475 425058 426118 426812 428280 430265 431516 431034 429113
56400 429113 427397 427519 429399 431395 432275 432300 432076 431348 429538 426783 423827 421463 420345 420480 420582 419068
$$ packed form
56505C98998Q041Q445Q971R163R023R126R734J0495J1021J1088J0380Q743O547
56492E19775M263K044L44J80J703L159K705Q55l48k81k25r87j964k691l415l779
56476E21338k820r78k99j679l561m281m147m086l877l047k308k498l069k949k204
56461D79535j716j815k358l365m518m760l566j998j453j822j975j526j124j302
56447D46237j968k771l339l389l076k819k586j994j235r34r20m15K34l21j992
56432D18712k696j314N40J051P70R78J101q3j867k518j992j613j557p73Q15K050
56416D11604K393K222J529J33r07p4K151L424K583J060O94J468J985J251m82j921
56400D29113j716J22J880J996Q80K5k24p28j810k755k956k364j118J35J02j514
$$ plain form
56384 419068 416303 414756 416081 419105 421554 422712 423272 423705 424217 425429 427440 428753 427779 425275 423738
56369 423738 424365 425972 427040 427465 427920 428661 429576 430640 431829 433062 434475 436306 438376 440096 440976 440695
56353 440695 438913 435813 432799 431722 433033 435237 436543 436545 436104 436159 437125 438981 441313 443318 444375 444821
56337 444821 445845 448225 451258 453372 453897 453807 454337 455480 456542 457794 460404 464549 468635 470927 471221
56322 471221 470438 469310 468175 467470 467634 468706 470541 473099 476028 478342 479145 478494 477110 475532 474011
56307 474011 472948 472758 473312 473888 473777 472854 471779 471729 473595 477150 481177 484508 486770 488370 490242 493447
56291 493447 498131 502910 506161 508029 510096 512885 515002 515294 514558 514226 514530 515104 516443 519338 523408
56276 523408 527430 530906 534290 537925 541707 545545 549341 552718 555480 558047 560674 562693 563340 563045 563068
$$ packed form
56384D19068k765j547J325L024K449J158N60M33N12J212K011J313r74k504j537
56369D23738O27J607J068M25M55P41R15J064J189J233J413J831K070J720Q80k81
56353D40695j782l100l014j077J311K204J306Km41N5R66J856K332K005J057M46
56337D44821J024K380L033K114N25r0N30J143J062J252K610M145M086K292K94
56322D71221p83j128j135p05J64J072J835K558K929K314Q03o51j384j578j521
56307D74011j063j90N54N76j11r23j075n0J866L555M027L331K262J600J872L205
56291D93447M684M779L251J868K067K789K117K92p36l32L04N74J339K895M070
56276E23408M022L476L384L635L782L838L796L377K762K567K627K019O47k95K3
$$ plain form
56261 563068 564159 566329 569598 573991 578888 583155 586053 587713 588951 590866 593993 597503 599999 601588
56247 601588 604169 608907 614615 619803 625260 632977 643165 654016 664015 672854 680311 686059 690876 696490
56233 696490 703700 711700 719477 726915 734341 742008 750305 759646 770036 781450 794457 809412 825121
56220 825121 839580 852194 864299 877414 892187 909142 928957 951251 974121 995775 1016236
56209 1016236 1037076 1059978 1085899 1114999 1146788 1180403 1214913 1249600 1284619 1321858 1364388
56198 1364388 1414047 1469830 1529461 1592258 1659584 1733082 1813664 1901881 1997852 2100853 2210246
56187 2210246 2326813 2451936 2585392 2725114 2869123 3016380 3165595 3314501 3460572
56178 3460572 3601300 3733590 3854032 3960030 4049717 4121056 4172489 4204420 4218298 4213991 4189992
$$ packed form
56261E63068J091K170L269M393M897M267K898J660J238J915L127L510K496J589
56247F01588K581M738N708N188N457P717J0188J0851R999Q839P457N748M817N614
56233F96490P210Q000P777P438P426P667Q297R341J0390J1414J3007J4955J5709
56220H25121J4459J2614J2105J3115J4773J6955J9815K2294K2870K1654K0461
56209A016236K0840K2902K5921K9100L1789L3615L4510L4687L5019L7239M2530
56198A364388M9659N5783N9631O2797O7326P3498Q0582Q8217R5971J03001J09393
56187B210246J16567J25123J33456J39722J44009J47257J49215J48906J46071
56178C460572J40728J32290J20442J05998Q9687P1339N1433L1931J3878m307k3999
$$ plain form
56167 4189992 4146757 4088042 4018005 3938404 3849361 3751193 3644425 3529643 3408814 3285598
56157 3285598 3162998 3041632 2921479 2804123 2691701 2584477 2481191 2381408 2286035 2195656
56147 2195656 2109839 2028197 1951049 1878744 1811120 1747862 1688930 1634485 1584639 1539120 1497038
56136 1497038 1457432 1420338 1386767 1357167 1330493 1305375 1281715 1260381 1241736 1225255 1210445
56125 1210445 1197387 1186363 1177470 1170657 1165717 1162060 1158703 1154638 1149333 1142989 1136248 1129615 1123372
56112 1123372 1118287 1115794 1116759 1120309 1124575 1128469 1132087 1135749 1139753 1144990 1152602 1162764 1174667 1187802
56098 1187802 1202246 1217665 1233353 1249670 1268185 1289734 1313378 1337900 1363348 1390417 1419213
56087 1419213 1449533 1481805 1517096 1556646 1601744 1653346 1711309 1774645 1842946 1916963 1997533
$$ packed form
56167D189992m3235n8715p0037p9601q9043r8168j06768j14782j20829j23216
56157C285598j22600j21366j20153j17356j12422j07224j03286r9783r5373r0379
56147B195656q5817q1642p7148p2305o7624o3258n8932n4445m9846m5519m2082
56136A497038l9606l7094l3571k9600k6674k5118k3660k1334j8645j6481j4810
56125A210445j3058j1024q893o813m940l657l357m065n305o344o741o633o243
56112A123372n085k493R65L550M266L894L618L662M004N237P612J0162J1903J3135
56098A187802J4444J5419J5688J6317J8515K1549K3644K4522K5448K7069K8796
56087A419213L0320L2272L5291L9550M5098N1602N7963O3336O8301P4017Q0570
$$ plain form
56076 1997533 2084874 2179184 2280620 2387752 2496854 2603714 2705725 2801823 2891484 2974858
56066 2974858 3053097 3127141 3196083 3257514 3309539 3351863 3384836 3407970 3419856 3419748 3408988 3390180
56054 3390180 3364539 3330673 3286495 3231540 3166524 3091768 3007928 2917900 2826017 2735047 2645559
56043 2645559 2558187 2474579 2395624 2320738 2249761 2184052 2124844 2071990 2025084 1984355 1949619
56032 1949619 1919745 1894058 1872914 1855962 1841254 1827204 1814316 1804075 1797208 1793745 1793489 1795569
56020 1795569 1798819 1803425 1810922 1821783 1834404 1847167 1859833 1872026 1882453 1891145 1900866 1914515
56008 1914515 1932192 1952038 1972649 1993407 2014009 2035362 2059668 2087908 2118215 2148180 2177780
55997 2177780 2208619 2241367 2275286 2309295 2342256 2373439 2403894 2436070 2470850 2506463 2541539
$$ packed form
56076A997533Q7341R4310J01436J07132J09102J06860J02011R6098Q9661Q3374
56066B974858P8239P4044O8942O1431N2025M2324L2973K3134J1886j08j0760j8808
56054C390180k5641l3866m4178n4955o5016p4756q3840r0028r1883r0970q9488
56043B645559q7372q3608p8955p4886p0977o5709n9208n2854m6906m0729l4736
56032A949619k9874k5687k1144j6952j4708j4050j2888j0241o867l463k56K080
56020A795569L250M606P497J0861J2621J2763J2666J2193J0427Q692R721J3649
56008A914515J7677J9846K0611K0758K0602K1353K4306K8240L0307K9965K9600
55997B177780L0839L2748L3919L4009L2961L1183L0455L2176L4780L5613L5076
$$ plain form
55986 2541539 2577394 2615622 2655353 2695078 2735665 2779283 2826508 2876644 2929826 2986638 3046613
55975 3046613 3109183 3175166 3245335 3318446 3392750 3468618 3547779 3630884 3717699 3808722 3904653
55964 3904653 4005198 4110325 4221739 4341237 4468524 4602453 4743302 4892029 5048607
55955 5048607 5213138 5387374 5573137 5770467 5979378 6202032 6440914 6696126 6966593
55946 6966593 7252541 7554620 7872105 8204312 8552257 8916760 9296862 9692718 10108160
55937 10108160 10547617 11012224 11501593 12017306 12561636 13135026 13738282 14375407 15051005
55928 15051005 15766767 16523505 17324094 18171045 19064304 20005964 21004612 22070701 23210313
55919 23210313 24427884 25731551 27129899 28626348 30223395 31930809 33764128 35737788
$$ packed form
55986B541539L5855L8228L9731L9725M0587M3618M7225N0136N3182N6812N9975
55975C046613O2570O5983P0169P3111P4304P5868P9161Q3105Q6815R1023R5931
55964C904653J00545J05127J11414J19498J27287J33929J40849J48727J56578
55955E048607J64531J74236J85763J97330K08911K22654K38882K55212K70467
55946F966593K85948L02079L17485L32207L47945L64503L80102L95856M15442
55937A0108160M39457M64607M89369N15713N44330N73390O03256O37125O75598
55928A5051005P15762P56738Q00589Q46951Q93259R41660R98648J066089J139612
55919B3210313J217571J303667J398348J496449J597047J707414J833319J973660
$$ plain form
55911 35737788 37866492 40171626 42680367 45421209 48426972 51739014 55401294 59454815
55903 59454815 63948614 68956253 74576989 80930050 88163416 96467578 106071015 117230624
55895 117230624 130248935 145505015 163447980 184527204 209059162 237016387 267759383
55888 267759383 299854654 331161179 359192688 381559210 396325545 402309312 399353223
55881 399353223 388422980 371346477 350271455 327159874 303545999 280512461 258733142
55874 258733142 238531736 219977804 202998282 187452081 173165108 159959876 147685406
55867 147685406 136229093 125513366 115492510 106144762 97451466 89381794 81902656
55860 81902656 74996780 68659932 62882669 57643306 52914947 48668011 44865480 41464663
$$ packed form
55911C5737788K128704K305134K508741K740842L005763L312042L662280M053521
55903E9454815M493799N007639N620736O353061P233366Q304162R603437J1159609
55895A17230624J3018311J5256080J7942965K1079224K4531958K7957225L0742996
55888B67759383L2095271L1306525K8031509K2366522J4766335N983767k956089
55881C99353223j0930243j7076503k1075022k3111581k3613875k3033538k1779319
55874B58733142k0201406j8553932j6979522j5546201j4286973j3205232j2274470
55867A47685406j1456313j0715727j0020856r347748q693296q069672p479138
55860H1902656o905876o336848n777263n239363m728359m246936l802531l400817
$$ plain form
55852 41464663 38425724 35713334 33290537 31117377 29156605 27376683 25750031 24253386
55844 24253386 22870094 21588198 20396493 19285403 18249893 17287227 16392599 15560257
55836 15560257 14786978 14069932 13402479 12776691 12189262 11640490 11128020 10646102 10190928
55827 10190928 9762399 9360228 8982123 8626508 8293812 7984351 7697571 7433642 7193072
55818 7193072 6974264 6773522 6587443 6413183 6246745 6083501 5920512 5756527 5590234
55809 5590234 5420697 5248939 5076800 4904719 4732869 4563642 4400299 4243597 4092362
55800 4092362 3946788 3808202 3675748 3546438 3419015 3295141 3176406 3062601 2953395
55791 2953395 2849133 2749118 2651374 2555127 2461821 2372851 2287861 2206028 2127535 2053057 1983003
$$ packed form
55852D1464663l038939k712390k422797k173160j960772j779922j626652j496645
55844B4253386j383292j281896j191705j111090j035510r62666q94628q32342
55836A5560257p73279p17046o67453o25788n87429n48772n12470m81918m55174
55827A0190928m28529m02171l78105l55615l32696l09461k86780k63929k40570
55818G193072k18808k00742j86079j74260j66438j63244j62989j63985j66293
55809E590234j69537j71758j72139j72081j71850j69227j63343j56702j51235
55800D092362j45574j38586j32454j29310j27423j23874j18735j13805j09206
55791B953395j04262j00015r7744r6247r3306q8970q4990q1833p8493p4478p0054
$$ plain form
55780 1983003 1917865 1858109 1803118 1751178 1701073 1653074 1608280 1567656 1531539 1499187 1468939
55769 1468939 1439634 1411577 1385328 1360155 1334710 1308579 1281916 1254238 1225117 1195682 1167835
55758 1167835 1142123 1117701 1094156 1072040 1051886 1033984 1018834 1006483 995741 985377 975742
55747 975742 967960 962073 957484 954634 954391 956043 957674 958480 959156 960121 960976 961635 962420 963127 963448 964002 965140
55730 965140 965002 960802 952242 941871 931884 922319 912550 902451 891637 879469 866604 854978 845534
55717 845534 837356 829606 822798 817609 813999 812291 813526 817586 822210 825017 825702 825296 824096 821267 815882
55702 815882 807488 796122 782534 768090 753911 740234 726727 713012 698673 683239 666463 648493
55690 648493 629940 612034 596216 582943 571293 560437 550916 543486 537329 530786 523604 517083 512093
$$ packed form
55780A983003o5138n9756n4991n1940n0105m7999m4794m0624l6117l2352l0248
55769A468939k9305k8057k6249k5173k5445k6131k6663k7678k9121k9435k7847
55758A167835k5712k4422k3545k2116k0154j7902j5150j2351j0742j0364r635
55747I75742p782n887m589k850k43J652J631Q06O76R65Q55O59P85P07L21N54J138
55730I65140j38m200q560j0371r987r565r769j0099j0814j2168j2865j1626r444
55717H45534q178p750o808n189l610j708J235M060M624K807O85m06j200k829n385
55702H15882q394j1366j3588j4444j4179j3677j3507j3715j4339j5434j6776j7970
55690F48493j8553j7906j5818j3273j1650j0856r521p430o157o543p182o521m990
$$ plain form
55677 512093 508246 504943 501878 498506 494438 490423 487518 485130 481398 475842 470180 466116 463583 461531
55663 461531 458957 454729 447929 439267 430980 424609 419828 415975 413420 412633 413042 413874 415432 418720 424300
55648 424300 431839 440045 446707 449834 449335 446833 443454 438757 432203 424489 416825 409869 403992 399457
55634 399457 395589 390806 384400 377523 371615 366709 362156 358200 355739 355036 355606 357017 358971 360888 362067
55619 362067 362138 361053 359121 357318 356769 357390 357703 356629 354823 353537 352769 351428 349009 346248 344156 343003
55603 343003 342300 341431 340252 339125 338371 337928 337919 339165 342314 346573 350237 352665 354821 357689 361096 364456
55587 364456 367775 371382 375234 378844 381372 381776 379709 376363 373430 371038 367767 362922 357547 352665
55573 352665 347884 342529 336990 331942 327071 321658 315899 310811 307170 305035 303746 301955 298428 293343
$$ packed form
55677E12093l847l303l065l372m068m015k905k388l732n556n662m064k533k052
55663D61531k574m228o800q662q287o371m781l853k555p87M09Q32J558L288N580
55648D24300P539Q206O662L127m99k502l379m697o554p714p664o956n877m535
55634C99457l868m783o406o877n908m906m553l956k461p03N70J411J954J917J179
55619C62067P1j085j932j803n49O21L13j074j806j286p68j341k419k761k092j153
55603C43003p03q69j179j127p54m43rJ246L149M259L664K428K156K868L407L360
55587C64456L319L607L852L610K528M04k067l346k933k392l271m845n375m882
55573C52665m781n355n539n048m871n413n759n088l641k135j289j791l527n085
$$ plain form
55559 293343 288192 284084 281026 279122 279129 280963 282842 283047 281763 280293 279279 278630 278287 277872 276239 272609
55543 272609 267729 262920 258439 253732 248852 244549 241222 238688 236798 235564 234906 234839 235549 236812 237921
55528 237921 238672 239724 241427 243121 244287 245449 247052 248401 248776 248723 249085 249648 250051 251185 254062 257795
55512 257795 260391 261325 261772 262442 262877 263194 265037 269947 277402 284887 289729 291072 290476 290181 290307 288524
55496 288524 283232 276117 270357 267080 265044 263181 261602 260330 258794 256813 254624 251779 247492 242288
55482 242288 237906 235241 233627 232323 231342 230580 229649 229118 230391 233583 236718 237904 237260 235926 234280
55467 234280 232174 230092 228852 228442 228012 226884 225055 222941 220965 219135 216895 213841 210623 208437 207467
55452 207467 206625 205129 203488 202480 201987 201444 200755 200086 199298 198244 197242 196763 196929 197647 198760 199810
$$ packed form
55559B93343n151m108l058j904PJ834J879K05j284j470j014o49l43m15j633l630
55543B72609m880m809m481m707m880m303l327k534j890j234o58o7P10J263J109
55528B37921P51J052J703J694J166J162J603J349L75n3L62N63M03J134K877L733
55512B57795K596R34M47O70M35L17J843M910P455P485M842J343n96k95J26j783
55496B88524n292p115n760l277k036j863j579j272j536j981k189k845m287n204
55482B42288m382k665j614j304r81p62r31n31J273L192L135J186o44j334j646
55467B34280k106k082j240m10m30j128j829k114j976j830k240l054l218k186r70
55452B07467q42j496j641j008m93n43o89o69p88j054j002m79J66P18J113J050
$$ plain form
55436 199810 200232 200175 200534 201693 202906 203366 203268 203195 203118 202749 202283 201916 201039 198938 196166 194268 194035 194742
55418 194742 195226 195099 194743 194680 195217 196341 197682 198837 199818 200944 202184 202943 202743 201884 201125 200795 200617
55401 200617 200435 200655 201557 202464 202252 200760 199090 198307 198434 199110 200394 202083 202849 201351 198171 195502
55385 195502 194622 194667 194243 193222 192285 191564 190776 190202 190563 191993 193927 196095 198866 202388 205798 207691
55369 207691 207229 204685 201179 198103 196575 196927 198456 199900 200512 200622 200897 201289 201370 201739 204064 209029
55353 209029 214885 219091 221095 222510 224702 227297 229226 230116 230168 229538 228415 227054 225270 222609 219573
55338 219573 217874 218576 220517 221533 220997 220126 219841 219465 218001 215819 214219 213572 212710 210386 206864 203624
55322 203624 201669 200569 199290 197502 195799 194966 195445 197215 199633 201431 201502 199832 197335 194805 192498
$$ packed form
55436A99810M22n7L59J159J213M60r8p3p7l69m66l67q77k101k772j898k33P07
55418A94742M84j27l56o3N37J124J341J155R81J126J240P59k00q59p59l30j78
55401B00617j82K20R02R07k12j492j670p83J27O76J284J689P66j498l180k669
55385A95502q80M5m24j021r37p21p88n74L61J430J934K168K771L522L410J893
55369B07691m62k544l506l076j528L52J529J444O12J10K75L92Q1L69K325M965
55353B09029N856M206K004J415K192K595J929Q90N2o30j123j361j784k661l036
55338B19573j699P02J941J016n36q71k85l76j464k182j600o47q62k324l522l240
55322B03624j955j100j279j788j703q33M79J770K418J798P1j670k497k530k307
$$ plain form
55307 192498 190659 189672 189429 189241 188730 188231 187914 187198 185692 184157 183743 184591 186048 187956 190597 193213
55291 193213 193941 192089 189655 189401 191681 194231 195078 194460 193501 192365 190863 189969 191013 193452 195002 194480
55275 194480 193156 192689 193023 193409 194283 196514 199284 200485 199282 196932 194854 193176 191638 190749 191130 192407
55259 192407 193524 193949 194033 194340 194920 195117 194083 191688 188901 186961 186285 186558 187572 189310 191301 192706
55243 192706 193169 192981 192484 191959 191966 192893 194203 195109 195856 197161 198349 197681 195098 193054 193581 195784 197460
55226 197460 198126 198947 200410 201729 202370 202687 202869 202495 201514 200773 201115 202485 204154 205374 205624 204665 202714
55209 202714 200499 199041 199271 201456 204752 207610 209012 209118 208567 207645 206581 206110 206915 208547 209550 208864
55193 208864 206856 204936 204350 205256 206788 208000 208641 208819 208267 206660 204556 202949 201674 199392 195837
$$ packed form
55307A92498j839r87k43j88n11m99l17p16j506j535m14Q48J457J908K641K616
55291A93213P28j852k434k54K280K550Q47o18r59j136j502q94J044K439J550n22
55275A94480j324m67L34L86Q74K231K770J201j203k350k078j678j538q89L81J277
55259A92407J117M25Q4L07N80J97j034k395k787j940o76K73J014J738J991J405
55243A92706M63j88m97n25PR27J310R06P47J305J188o68k583k044N27K203J676
55226A97460O66Q21J463J319O41L17J82l74r81p41L42J370J669J220K50r59j951
55209B02714k215j458K30K185L296K858J402J06n51r22j064m71Q05J632J003o86
55193B08864k008j920n86R06J532J212O41J78n52j607k104j607j275k282l555
$$ plain form
55178 195837 192977 192825 194858 196787 197417 197479 197962 198986 200419 202398 204771 206861 208200 208985 209598 210144
55162 210144 210637 211138 211566 211622 210969 209297 206559 203621 202318 204047 208248 212825 215910 216781 215508 212803
55146 212803 210291 209799 211819 215133 218169 220206 221054 220228 217020 211356 204480 198737 196226 197107 199376
55131 199376 200858 201231 201573 202357 202949 203006 203203 204174 205586 206761 207618 208556 209769 210896 211012 209079 205115
55114 205115 200901 198761 199413 201717 204486 207452 210235 211789 211807 211639 212668 214381 215156 214486 213247 211960
55098 211960 210102 207490 205302 204981 206441 207981 208059 206938 206368 207681 210412 213023 214619 215338 215166 213414
55082 213414 209935 206206 204421 205626 209108 213222 216294 217137 215569 212575 209528 207186 205655 204944 205023
55067 205023 205476 205715 205571 205237 204787 204336 204618 206585 210174 214008 216755 218365 219621 220766 221067 219757
$$ packed form
55178A95837k860j52K033J929O30O2M83J024J433J979K373K090J339P85O13N46
55162B10144M93N01M28N6o53j672k738k938j303J729M201M577L085Q71j273k705
55146B12803k512m92K020L314L036K037Q48q26l208n664o876n743k511Q81K269
55131A99376J482L73L42P84N92N7J97R71J412J175Q57R38J213J127J16j933l964
55114B05115m214k140O52K304K769K966K783J554J8j68J029J713P75o70j239j287
55098B11960j858k612k188l21J460J540P8j121n70J313K731K611J596P19j72j752
55082B13414l479l729j785J205L482M114L072Q43j568k994l047k342j531p11P9
55067B05023M53K39j44l34m50m51K82J967L589L834K747J610J256J145L01j310
$$ plain form
55051 219757 217195 215010 214962 217467 221193 224336 226264 227691 229369 231250 233091 235124 237507 239541 240199
55036 240199 239371 237929 236546 235137 233636 232574 232388 232596 232281 231138 229614 228190 227135 226785 227343 228265
55020 228265 228478 227539 226125 225081 224506 224223 224635 226330 228950 231184 232161 232349 232790 233756 234605 234774 234459
55003 234459 234123 233669 232575 230885 229612 229737 230988 232106 232273 231748 230964 229662 227481 225037 223739 224478
54987 224478 226868 229785 232307 234054 234960 234994 234170 232817 231697 231553 232399 233399 233614 232739 231190 229707
54971 229707 228885 228709 228426 227297 225564 224196 223584 223157 222512 222074 222175 222385 222495 223218 224849 225938 224841
54954 224841 222240 220647 221302 222989 224243 225350 227409 230337 232607 232611 229951 225865 222540 221406 221996
54939 221996 223119 224864 228179 232405 235053 234905 233856 234255 235551 235297 232955 230841 231088 233139 234830
$$ packed form
55051B19757k562k185m8K505L726L143J928J427J678J881J841K033K383K034O58
55036B40199q28j442j383j409j501j062j86K08l15j143j524j424j055l50N58R22
55020B28265K13r39j414j044n75k83M12J695K620K234R77J88M41R66Q49J69l15
55003B34459l36m54j094j690j273J25J251J118J67n25p84j302k181k444j298P39
54987B24478K390K917K522J747R06L4q24j353j120j44Q46J000K15q75j549j483
54971B29707q22j76k83j129j733j368o12m27o45m38J01K10J10P23J631J089j097
54954B24841k601j593O55J687J254J107K059K928K270Mk660m086l325j134N90
54939B21996J123J745L315M226K648j48j049L99J296k54k342k114K47K051J691
$$ plain form
54924 234830 234918 233843 232612 231725 231165 230943 231268 232100 232752 232451 231367 230574 230809 231845 233383 235781 239279
54907 239279 243163 246526 249352 251877 253322 252513 249692 246581 244408 242917 241604 240844 241113 241928 242446
54892 242446 242738 243693 245728 248098 249491 249075 247141 244960 243852 244104 244947 245624 246116 246612 246906 246993 247884
54875 247884 250806 255289 258872 259292 256651 252958 249977 248253 247978 249668 253495 258635 263973 269160 274530
54860 274530 280424 287206 295463 305165 314775 322348 327723 332647 338281 343535 346453 346382 344012 340126 335385
54845 335385 330787 327073 323736 319588 314326 308717 303441 298776 295295 293494 292309 289381 283749 277496
54831 277496 273709 273312 274762 276326 277472 278134 277977 276962 275980 276274 278483 282509 287933 294149 300354
54816 300354 305916 310795 315398 320103 325137 330713 336833 342835 347472 349654 349123 346468 342684 338628
$$ packed form
54924B34830Q8j075j231q87n60k22L25Q32O52l01j084p93K35J036J538K398L498
54907B39279L884L363K826K525J445q09k821l111k173j491j313p60K69Q15N18
54892B42446K92R55K035K370J393m16j934k181j108K52Q43O77M92M96K94Q7Q91
54875B47884K922M483L583M20k641l693k981j724k75J690L827N140N338N187N370
54860B74530N894O782Q257R702R610P573N375M924N634N254K918p1k370l886m741
54845C35385m598l714l337m148n262n609n276m665l481j801j185k928n632o253
54831B77496l787l97J450J564J146O62j57j015r82K94K209M026N424O216O205
54816C00354N562M879M603M705N034N576O120O002M637K182n31k655l784m056
$$ plain form
54802 338628 334520 329940 324716 319827 316784 315765 315010 312698 308970 305293 302166 298514 293454 287653
54788 287653 282530 278838 276502 275202 274477 273613 272031 269648 266615 262998 259043 255398 252700 251119 250541
54773 250541 250775 251275 251202 250292 249325 249226 249964 250765 251001 250356 248581 245895 243388 242239 242512 243269 243746 243824
54755 243824 243620 243475 244296 246970 251165 255334 258123 259217 258819 257230 255367 254781 256272 258730 259982
54740 259982 258841 256052 253370 252043 252124 252991 254315 256403 259542 263238 266453 268506 269464 269721 269658 269717
54724 269717 270299 271332 272223 272455 272014 271198 270242 269294 268621 268762 270407 273831 278255 282254 285336 288754
54708 288754 294097 301277 308701 315235 321094 326811 332420 337912 343394 348293 351409 352529 353153 354741
54694 354741 356861 358032 357868 357224 356398 354355 350055 343754 336613 329692 323777 319717 318135 318603 319475
$$ packed form
54802C38628m108m580n224m889l043j019p55k312l728l677l127l652n060n801
54788B87653n123l692k336j300p25q64j582k383l033l617l955l645k698j581n78
54773B50541K34N00p3r10r67r9P38Q01K36o45j775k686k507j149K73P57M77P8
54755B43824k04j45Q21K674M195M169K789J094l98j589j863n86J491K458J252
54740B59982j141k789k682j327Q1Q67J324K088L139L696L215K053R58K57o3N9
54724B69717N82J033Q91K32m41q16r56r48o73J41J645L424M424L999L082L418
54708B88754N343P180P424O534N859N717N609N492N482M899L116J120O24J588
54694C54741K120J171j64o44q26k043m300o301p141o921n915m060j582M68Q72
$$ plain form
54679 319475 318962 316530 313080 309763 306930 304491 302755 302083 301921 301122 299515 298227 298106 298637 299045 299719
54663 299719 301818 305941 311875 319040 326431 332701 337263 340937 344577 347485 348302 347138 345506 344250
54649 344250 342902 341233 339912 339100 337735 335088 331964 329404 327005 323621 319184 314768 311160 308279
54635 308279 305827 303620 301404 299080 297042 295581 294152 292015 289470 287511 286256 284813 282884 281322
54621 281322 280448 278912 275268 270114 265517 262579 260645 258973 258003 258409 259638 260122 258753 255711 252065
54606 252065 248974 247151 246603 246772 247067 247239 247194 246816 246439 247242 250400 255520 260455 263145 263457 262834 262396
54589 262396 262024 261337 260806 261326 262937 264530 264997 264384 263796 264334 266109 268103 269025 268635 268262 269587 272684
54572 272684 275716 276997 276835 276612 276462 275037 271765 268064 265606 264339 263294 262624 263426 265680 267775
$$ packed form
54679C19475n13k432l450l317k833k439j736o72j62p99j607j288j21N31M08O74
54663B99719K099M123N934P165P391O270M562L674L640K908Q17j164j632j256
54649C44250j348j669j321q12j365k647l124k560k399l384m437m416l608k881
54635C08279k452k207k216k324k038j461j429k137k545j959j255j443j929j562
54621B81322q74j536l644n154m597k938j934j672r70M06J229M84j369l042l646
54606B52065l091j823n48J69K95J72m5l78l77Q03L158N120M935K690L12o23m38
54589B62396l72o87n31N20J611J593M67o13n88N38J775J994R22l90l73J325L097
54572B72684L032J281j62k23j50j425l272l701k458j267j045o70Q02K254K095
$$ plain form
54557 267775 268523 268468 268596 268669 267730 265688 263457 261759 260616 259981 260059 260826 261769 262416 262860 263561 264786 266285
54539 266285 267415 267616 267032 266574 267100 268527 270039 271109 271933 272823 273615 273977 274006 274144 274595 275163 275652 276134
54521 276134 276710 277211 277334 276981 276338 275700 275417 275919 277364 279126 280035 279630 278983 279762 282441 285980 289318
54504 289318 292499 295930 299173 301230 301766 301291 300089 297787 294342 290932 289277 290129 292660 295238 296580
54489 296580 296297 294830 293140 292276 292815 294420 296011 296641 296322 295853 295857 296167 296239 295891 295432 295270 295650 296631
54471 296631 298018 299400 300550 301717 303261 305055 306452 306781 305643 303015 299572 296816 296128 297430 299247
54456 299247 300337 300742 300985 300889 299995 298827 298785 300594 303483 306164 308069 309313 309959 309907 309289 308350 306995
54439 306995 304973 302657 301097 300998 301980 303160 304140 305071 306044 307018 308253 310169 312657 315114 317503 320840
$$ packed form
54557B67775P48n5J28P3r39k042k231j698j143o35P8P67R43O47M44P01J225J499
54539B66285J130K01n84m58N26J427J512J070Q24Q90P92L62K9J38M51N68M89M82
54521B76134N76N01J23l53o43o38k83N02J445J762R09m05o47P79K679L539L338
54504B89318L181L431L243K057N36m75j202k302l445l410j655Q52K531K578J342
54489B96580k83j467j690q64N39J605J591O30l19m69ML10P2l48m59j62L80R81
54471B96631J387J382J150J167J544J794J397L29j138k628l443k756o88J302J817
54456B99247J090M05K43r6q94j168m2J809K889K681J905J244O46n2o18r39j355
54439C06995k022k316j560r9R82J180R80R31R73R74J235J916K488K457K389L337
$$ plain form
54423 320840 325986 332132 336998 338685 337173 334142 331654 330926 331938 333897 336109 338458 341057 343672
54409 343672 345760 347026 347725 348384 349391 350918 353023 355716 358893 362239 365209 367290 368312 368400 367647
54394 367647 366167 364530 363593 363458 362998 361049 357910 355079 353564 353049 352661 351801 350155 347762 345417 344271
54378 344271 344470 344787 344161 343003 342199 341377 339256 335666 332100 329923 328842 327675 326012 324489 323730 323709
54362 323709 324138 324965 326360 328470 331324 334737 338236 341193 343245 344547 345559 346614 347670 348344 348099
54347 348099 346510 343655 340421 338214 338018 339564 341477 342387 341948 340918 340498 341574 344200 347411 349653
54332 349653 349900 348702 347947 349270 352611 356404 359159 360708 361874 363139 363922 363258 361047 358394 356655
54317 356655 356293 356732 357229 357604 358002 358193 357514 355691 353538 352500 353413 355806 358481 360673 362573 364798
$$ packed form
54423C20840N146O146M866J687j512l031k488p28J012J959K212K349K599K615
54409C43672K088J266O99O59J007J527K105K693L177L346K970K081J022Q8p53
54394C67647j480j637r37j35m60j949l139k831j515n15l88q60j646k393k345j146
54378C44271J99L17o26j158q04q22k121l590l566k177j081j167j663j523p59k1
54362C23709M29Q27J395K110K854L413L499K957K052J302J012J055J056O74k45
54347C48099j589k855l234k207j96J546J913R10m39j030m20J076K626L211K242
54332C49653K47j198p55J323L341L793K755J549J166J265P83o64k211k653j739
54317C56655l62M39M97L75L98J91o79j823k153j038R13K393K675K192J900K225
$$ plain form
54301 364798 367530 370214 372056 372802 372971 373340 374267 375596 377089 378665 380132 380970 380640 379007 376341 373057
54285 373057 369656 366751 364806 363815 363372 363011 362293 360680 357741 353598 349031 345049 342368 341017 340205
54270 340205 338759 336182 333317 331553 331301 331622 331437 330673 329975 329706 329549 328918 327502 325584 323956 323274
54254 323274 323375 323493 323220 322870 322783 322794 322764 323100 324233 325850 327148 327621 327243 326206 324958 324146 323891 323362
54236 323362 321776 319698 318645 319459 321663 324278 326484 327600 327408 326720 326691 327327 327535 327008 326959 328311 330144
54219 330144 330895 330381 329435 327997 325031 320501 316233 314175 314401 315306 315413 314586 313681 313318 313079 312041 310201
54202 310201 309110 310576 314677 319434 322564 323415 323235 323833 325938 328603 330228 330242 329534 329140 329112 329203 329915
54185 329915 331743 333693 333879 331787 328701 325545 321637 316451 311517 309212 310184 313064 316403 319669 322396
$$ packed form
54301C64798K732K684J842P46J69L69R27J329J493J576J467Q38l30j633k666l284
54285C73057l401k905j945r91m43l61p18j613k939m143m567l982k681j351q12
54270C40205j446k577k865j764k52L21j85p64o98k69j57o31j416j918j628o82
54254C23274J01J18k73l50q7J1l0L36J133J617J298M73l78j037j248q12k55n29
54236C23362j586k078j053Q14K204K615K206J116j92o88k9O36K08n27m9J352J833
54219C30144P51n14r46j438k966m530m268k058K26R05J07q27r05l63k39j038j840
54202C10201j091J466M101M757L130Q51j80N98K105K665J625J4p08l94k8R1P12
54185C29915J828J950J86k092l086l156l908n186m934k305R72K880L339L266K727
$$ plain form
54170 322396 323555 322375 319257 315614 313048 312553 313978 316127 317761 318496 318511 317786 316280 314573 313460
54155 313460 312944 312500 312325 313291 315395 317342 318198 318515 319079 319472 318938 318054 318246 319670 320699 319768 317044
54138 317044 314015 312038 311619 312577 314423 316645 318878 320863 322323 323068 323077 322338 320773 318581 316404 314721
54122 314721 313246 311486 309837 309563 311444 314788 317860 319107 318120 315987 314724 315721 318441 321055 322422
54107 322422 322921 323174 322864 321411 319228 317406 316371 315576 314405 312764 310804 308758 307166 306621 307042 307616
54091 307616 307688 307295 306743 306208 306099 307209 309861 313126 315515 316470 316642 316721 316597 315994 315409 315753 317119 318481
54073 318481 318940 318959 319972 322735 326319 328876 329336 328326 327522 328150 330039 331967 332886 332765 332259 331824 331426
54056 331426 331116 331361 332564 334491 336411 337654 337907 337435 337364 339166 343014 346924 348639 348509 349331 352714
$$ packed form
54170C22396J159j180l118l643k566m95J425K149J634P35J5p25j506j707j113
54155C13460n16m44j75R66K104J947Q56L17N64L93n34q84J92J424J029r31k724
54138C17044l029j977m19R58J846K222K233J985J460P45Rp39j565k192k177j683
54122C14721j475j760j649k74J881L344L072J247r87k133j263R97K720K614J367
54107C22422M99K53l10j453k183j822j035p95j171j641j960k046j592n45M21N74
54091C07616P2l93n52n35j09J110K652L265K389R55J72P9j24o03n85L44J366J362
54073C18481M59J9J013K763L584K557M60j010q04O28J889J928R19j21n06m35l98
54056C31426l10K45J203J927J920J243K53m72p1J802L848L910J715j30Q22L383
$$ plain form
54040 352714 356738 358246 356736 354549 353557 353326 352944 353048 354969 358777 363425 368318 373509 378447 381902
54025 381902 383643 385259 388538 393398 398036 400875 401778 401489 400590 399310 397879 396526 395151 393434 391461
54010 391461 389993 389804 390841 392358 393852 395448 397171 398408 398658 398545 399270 400899 401957 401185 399212
53995 399212 397850 398005 398948 399578 399686 399794 400493 402370 405999 411259 416884 421493 425143 429189 434395 439953
53979 439953 444952 450180 457474 467282 477850 487115 494749 501825 509149 516688 524239 531688 538519 543943
53965 543943 547900 551372 555246 559370 563174 566767 570693 574757 577928 579585 580224 580624 580834 580501 579758
53950 579758 579038 578023 575523 570770 564425 557924 552054 546584 541131 535835 531004 526412 521308 515179
53936 515179 508460 502417 498109 495313 492680 489176 485127 481421 477916 473372 467059 459686 452518 446338
$$ packed form
54040C52714M024J508j510k187r92k31l82J04J921L808M648M893N191M938L455
54025C81902J741J616L279M860M638K839R03k89q99j280j431j353j375j717j973
54010C91461j468j89J037J517J494J596J723J237K50j13P25J629J058p72j973
53995C99212j362J55R43O30J08J08O99J877L629N260N625M609L650M046N206N558
53979D39953M999N228P294R808J0568R265P634P076P324P539P551P449O831N424
53965E43943L957L472L874M124L804L593L926M064L171J657O39M00K10l33p43
53950E79758p20j015k500m753o345o501n870n470n453n296m831m592n104o129
53936E15179o719o043m308k796k633l504m049l706l505m544o313p373p168o180
$$ plain form
53922 446338 441748 439597 439997 441225 440742 437608 433342 430256 429300 429454 428660 425471 420476 416244 415278 417862
53906 417862 422264 426768 430690 433590 434860 434718 434564 435426 436638 436960 436648 437550 441169 447201 453987 459990
53890 459990 464895 469594 475162 481880 489491 498268 509077 522148 536503 551068 565693 580591 595411
53877 595411 609457 622215 633069 641211 646642 650579 654032 656544 657241 656324 654453 651567 647923 645611
53863 645611 646888 651023 654774 656442 657633 660551 665461 671731 679468 688612 697678 705131 711384 718188
53849 718188 726632 736781 748372 760352 770261 775864 777628 778356 780143 782619 784310 784652 784148 783257
53835 783257 781804 779397 776078 772279 767950 762084 753857 744292 735664 728722 721608 712461 702067 692626
53821 692626 684685 676878 668211 658863 648916 638228 627836 619596 613589 607402 598950 588864 579121
$$ packed form
53922D46338m590k151M00J228m83l134m266l086r56J54p94l189m995m232r66K584
53906D17862M402M504L922K900J270j42j54Q62J212L22l12R02L619O032O786O003
53890D59990M905M699N568O718P611Q777J0809J3071J4355J4565J4625J4898J4820
53877E95411J4046J2758J0854Q142N431L937L453K512O97r17j871k886l644k312
53863F45611J277M135L751J668J191K918M910O270P737R144R066P453O253O804
53849G18188Q444J0149J1591J1980R909N603J764P28J787K476J691L42n04q91
53835G83257j453k407l319l799m329n866q227r565q628o942p114r147j0394r441
53821F92626p941p807q667r348r947j0688j0392q240o007o187q452j0086r743
$$ plain form
53808 579121 570482 562430 554731 547695 541319 535333 529799 524697 519365 513347 507521 503151 499966 496356
53794 496356 491585 486693 482854 479897 476960 473726 470292 466554 462617 459344 457554 456747 455474 453055
53780 453055 450305 448336 447344 446880 446715 446775 446583 445497 443566 441561 440093 439242 439127 440168 442314 444502
53764 444502 445498 445062 443873 442613 441651 441367 442004 443260 444750 446928 450759 456182 461599 465403 467537
53749 467537 469100 470984 473509 476941 481486 486809 492334 498163 505047 513151 521381 528469 534399 540209
53735 540209 546491 552805 558808 565279 573179 581850 589111 593609 596445 599824 604519 609535 613982 618118
53721 618118 622224 625486 626742 625804 623244 619219 613306 605467 596580 587935 580532 574763 570296 566284
53707 566284 562107 557904 554004 549968 544809 538263 531266 524968 519703 515182 511129 507283 503212 498800
$$ packed form
53808E79121q639q052p699p036o376n986n534n102n332o018n826m370l185l610
53794D96356m771m892l839k957k937l234l434l738l937l273j790q07j273k419
53780D53055k750j969r92m64j65O0j92j086j931k005j468q51j15J041K146K188
53764D44502R96m36j189j260r62k84O37J256J490K178L831N423N417L804K134
53749D67537J563J884K525L432M545N323N525N829O884Q104Q230P088N930N810
53735E40209O282O314O003O471P900Q671P261M498K836L379M695N016M447M136
53721F18118M106L262J256r38k560m025n913p839q887q645p403n769m467m012
53707E66284m177m203l900m036n159o546o997o298n265m521m053l846m071m412
$$ plain form
53693 498800 494751 491902 489858 486908 481793 475373 470111 467709 467477 467144 465146 461915 459020 457409 456750
53678 456750 456285 455959 456539 458792 462598 466739 469535 469952 468355 466148 464515 463516 462512 461323 460645 461224
53662 461224 462995 465266 467570 469932 472447 475138 478428 483114 489258 495370 499481 501204 502187 504201
53648 504201 507249 509996 511704 513108 515408 518966 523165 527199 530683 533767 536928 540669 545182 550179
53634 550179 555033 559186 562596 565889 569852 574519 578913 582043 584105 586221 588865 591116 591932 591691 591784
53619 591784 592766 593709 593606 592748 592258 592692 593709 594847 595904 596523 596125 594656 592975 592064 591979 591816 590610
53602 590610 588093 584819 581774 579662 578319 577004 575531 574718 575240 576377 576719 576033 575544 576049 576715 576427
53586 576427 575627 575766 577155 578458 578642 578547 579838 582826 586052 588033 588805 589558 591286 594276 598620 604304
$$ packed form
53693D98800m049k849k044k950n115o420n262k402k32l33j998l231k895j611o59
53678D56750m65l26N80K253L806M141K796M17j597k207j633r99j004j189o78N79
53662D61224J771K271K304K362K515K691L290M686O144O112M111J723R83K014
53648E04201L048K747J708J404K300L558M199M034L484L084L161L741M513M997
53634E50179M854M153L410L293L963M667M394L130K062K116K644K251Q16k41R3
53619E91784R82R43j03q58m90M34J017J138J057O19l98j469j681r11q5j63j206
53602E90610k517l274l045k112j343j315j473q13N22J137L42o86m89N05O66k88
53586E76427q00J39J389J303J84r5J291K988L226J981P72P53J728K990M344N684
$$ plain form
53570 604304 610424 615023 616694 616377 616741 619396 623405 627071 630474 635260 642085 649469 655618 660583 665935
53555 665935 672752 680692 688897 697040 705200 713160 720294 726114 730788 735144 740314 747198 755917 765573
53541 765573 774631 781811 786734 789754 791293 791616 791142 790551 790295 790297 790377 790686 791314 791759 791469 790875 791069 792188
53523 792188 792828 791635 788951 786218 784158 782373 780552 778961 777387 774576 769595 763401 758215 755262
53509 755262 753754 752276 750528 749252 748820 748670 748245 747786 747714 747715 747177 746481 746911 749016 751738 753766 755145
53492 755145 756763 758674 760031 760709 761891 764634 768793 773956 780603 789357 799439 808888 816499 822994
53478 822994 830234 839602 850983 862835 873410 882480 891939 904213 920072 938367 957595 977059
53466 977059 996618 1016338 1036760 1058805 1082978 1109135 1137244 1167555 1199601 1231778 1262780
$$ packed form
53570F04304O120M599J671l17L64K655M009L666L403M786O825P384O149M965N352
53555F65935O817P940Q205Q143Q160P960P134N820M674M356N170O884Q719R656
53541G65573R058P180M923L020J539L23m74n91k56KQ0L09O28M45k90n94J94J119
53523G92188O40j193k684k733k060j785j821j591j574k811m981o194n186k953
53509G55262j508j478j748j276m32j50m25m59p2Jn38o96M30K105K722K028J379
53492G55145J618J911J357O78J182K743M159N163O647Q754J0082R449P611O495
53478H22994P240R368J1381J1852J0575R070R459J2274J5859J8295J9228J9464
53466I77059J9559J9720K0422K2045K4173K6157K8109L0311L2046L2177L1002
$$ plain form
53455 1262780 1293113 1324480 1357892 1392981 1429033 1466042 1504703 1545726 1589154 1634179 1679830
53444 1679830 1725945 1772911 1820145 1865665 1908189 1949237 1991971 2037750 2084653 2129506 2170593
53433 2170593 2208321 2244248 2280088 2316955 2354730 2392193 2428110 2462183 2494927 2526934 2558341
53422 2558341 2588667 2617159 2643677 2669235 2695060 2720999 2745448 2767024 2785606 2801425 2814050
53411 2814050 2823066 2829163 2833528 2836249 2836062 2831743 2823150 2810788 2794966 2775784 2753666 2729487 2704020
53398 2704020 2677383 2649249 2619757 2589896 2560483 2530755 2498683 2463085 2425036 2386779 2349661
53387 2349661 2313592 2278149 2243432 2209839 2177617 2146831 2117472 2089497 2063004 2038457 2016615
53376 2016615 1998256 1984006 1974029 1967536 1962945 1959184 1956871 1957659 1962337 1970091 1979790 1991396 2005589
$$ packed form
53455A262780L0333L1367L3412L5089L6052L7009L8661M1023M3428M5025M5651
53444A679830M6115M6966M7234M5520M2524M1048M2734M5779M6903M4853M1087
53433B170593L7728L5927L5840L6867L7775L7463L5917L4073L2744L2007L1407
53422B558341L0326K8492K6518K5558K5825K5939K4449K1576J8582J5819J2625
53411B814050R016O097M365K721j87m319q593j2362j5822j9182k2118k4179k5467
53398B704020k6637k8134k9492k9861k9413k9728l2072l5598l8049l8257l7118
53387B349661l6069l5443l4717l3593l2222l0786k9359k7975k6493k4547k1842
53376B016615j8359j4250r977o493m591l761k313P88M678P754R699J1606J4193
$$ plain form
53363 2005589 2022423 2041151 2061537 2084673 2112032 2143970 2179730 2218770 2261271 2307060 2354827
53352 2354827 2403245 2452536 2504171 2559296 2618296 2681605 2749590 2821343 2894937 2969609 3046720
53341 3046720 3127671 3211724 3296911 3382464 3469223 3558122 3649506 3743606 3840297 3938243 4035470
53330 4035470 4131164 4226065 4320882 4415200 4508177 4599343 4688233 4773989 4855880 4933671 5007133
53319 5007133 5075798 5139569 5198917 5253932 5303660 5346927 5383377 5413184 5436098 5451287 5457809
53308 5457809 5454685 5440809 5415426 5378735 5331757 5275702 5211697 5140879 5064294 4982758 4897037
53297 4897037 4807997 4716293 4622156 4525774 4427762 4328917 4229740 4130561 4032064 3935133 3840110
53286 3840110 3746582 3654166 3563185 3474236 3387297 3301855 3218150 3137788 3062431 2991973 2924721
$$ packed form
53363B005589J6834J8728K0386K3136K7359L1938L5760L9040M2501M5789M7767
53352B354827M8418M9291N1635N5125N9000O3309O7985P1753P3594P4672P7111
53341C046720Q0951Q4053Q5187Q5553Q6759Q8899R1384R4100R6691R7946R7227
53330D035470R5694R4901R4817R4318R2977R1166Q8890Q5756Q1891P7791P3462
53319E007133O8665O3771N9348N5015M9728M3267L6450K9807K2914J5189O522
53308E457809l124j3876k5383l6691m6978n6055o4005p0818p6585q1536q5721
53297D897037q9040r1704r4137r6382r8012r8845r9177r9179r8497r6931r5023
53286C840110r3528r2416r0981q8949q6939q5442q3705q0362p5357p0458o7252
$$ plain form
53275 2924721 2859547 2797028 2738110 2682589 2629882 2580576 2535834 2495443 2457873 2422435 2390081
53264 2390081 2361636 2336406 2313158 2291375 2270798 2250850 2231623 2214560 2200927 2190141 2180871
53253 2180871 2173364 2169278 2169310 2172445 2177753 2185553 2196127 2208394 2220955 2234006 2249354 2268530 2291422
53240 2291422 2316797 2343772 2372537 2403685 2437063 2471696 2507110 2544366 2585091 2629480 2675730
53229 2675730 2721547 2765620 2807453 2846594 2882851 2916977 2950212 2982863 3013894 3042222 3067891
53218 3067891 3091317 3111675 3127074 3136673 3141798 3144150 3143452 3137879 3126665 3111063 3092428 3070427
53206 3070427 3043849 3012316 2976362 2936383 2892445 2844928 2794562 2742027 2688172 2634275 2581177
53195 2581177 2528215 2473855 2417485 2359893 2302067 2244406 2187217 2130977 2075654 2020496 1965023
$$ packed form
53275B924721o5174o2519n8918n5521n2707m9306m4742m0391l7570l5438l2354
53264B390081k8445k5230k3248k1783k0577j9948j9227j7063j3633j0786r270
53253B180871p507m086L2L135N308P800J0574J2267J2561J3051J5348J9176K2892
53240B291422K5375K6975K8765L1148L3378L4633L5414L7256M0725M4389M6250
53229B675730M5817M4073M1833L9141L6257L4126L3235L2651L1031K8328K5669
53218C067891K3426K0358J5399R599N125K352o98n573j1214j5602j8635k2001
53206C070427k6578l1533l5954l9979m3938m7517n0366n2535n3855n3897n3098
53195B581177n2962n4360n6370n7592n7826n7661n7189n6240n5323n5158n5473
$$ plain form
53184 1965023 1909674 1855078 1801239 1748003 1695777 1645110 1595847 1547402 1499870 1454342 1411981
53173 1411981 1373013 1336675 1302022 1268885 1238116 1210672 1186260 1163186 1139852 1116235 1093495
53162 1093495 1072260 1051821 1031193 1010450 990544 971969 954086 935922 917213 898335 879600
53151 879600 861212 843870 828639 815805 804301 792672 780319 767450 754298 741092 728538
53140 728538 717511 708133 699628 691228 682845 674887 667791 661673 655898 649083 640252 630074 620379 612185
53126 612185 604759 596882 588511 580780 574760 570539 567205 563405 558258 552113 546353 542315 540481 540464 541243
53111 541243 541394 539878 536980 533948 531371 528443 524221 519069 514279 510711 508379 507029 506395 506016 505477
53096 505477 504906 504799 505312 506066 506673 507196 508045 509513 511298 512391 511697 508935 504747 499917 494997 490819
$$ packed form
53184A965023n5349n4596n3839n3236n2226n0667m9263m8445m7532m5528m2361
53173A411981l8968l6338l4653l3137l0769k7444k4412k3074k3334k3617k2740
53162A093495k1235k0439k0628k0743j9906j8575j7883j8164j8709j8878j8735
53151H79600j8388j7342j5231j2834j1504j1629j2353j2869j3152j3206j2554
53140G28538j1027r378q505q400q383p958p096o118n775o815q831j0178r695q194
53126F12185p426p877q371p731o020m221l334l800n147o145n760m038j834j7P79
53111E41243J51j516k898l032k577k928m222n152m790l568k332j350o34l79n39
53096E05477n71j07N13P54O07N23Q49J468J785J093o94k762m188m830m920m178
$$ plain form
53080 490819 488546 488466 489219 489138 488299 488484 490967 494930 498261 499587 499333 499004 499575 500553 500736 499857 499114 499838
53062 499838 502107 504989 507719 510100 512162 514074 516089 517977 518860 518366 517575 517794 518591 518287 516535 515151
53046 515151 515750 517566 518416 517146 514292 510862 507477 504558 502449 501078 499934 498602 497158 495979 495312
53031 495312 494978 494386 492977 490798 488530 486866 486064 486142 487110 488670 490033 490488 490093 489387 488462 486742 483800
53014 483800 480051 476402 473434 471216 469824 469581 470483 471634 471786 470566 468680 466688 464135 460476 456433
52999 456433 453571 452523 452452 452334 451927 451124 449367 446469 443426 441463 440595 439874 438922 438329 438528 439169 439854
52982 439854 440811 442389 444384 446253 447640 448378 448365 447923 447893 448787 449990 450415 449791 448676 447172 444622 440996
52965 440996 437702 436049 435424 434168 432256 431796 434330 438612 441971 443233 443351 443598 444354 445710 448018
$$ packed form
53080D90819k273q0P53q1q39J85K483L963L331J326k54l29N71R78J83q79p43P24
53062D99838K269K882K730K381K062J912K015J888Q83m94p91K19P97l04j752j384
53046E15151N99J816Q50j270k854l430l385k919k109j371j144j332j444j179o67
53031D95312l34n92j409k179k268j664q02P8R68J560J363M55l95p06r25j720k942
53014D83800l749l649k968k218j392k43R02J151J52j220j886j992k553l659m043
52999D56433k862j048p1j18m07q03j757k898l043j963q68p21r52n93J99O41O85
52982D39854R57J578J995J869J387P38j3m42l0Q94J203M25o24j115j504k550l626
52965D40996l294j653o25j256j912m60K534M282L359J262J18K47P56J356K308
$$ plain form
52950 448018 451202 454132 455391 454606 452785 451462 451461 452150 452022 450509 449094 449861 452859 455760 456478 455268
52934 455268 453708 452578 451701 451176 451501 452671 454202 456031 458440 461044 462857 463607 464123 465110 466394 467748
52918 467748 469612 472266 474928 476549 477146 477576 478151 478340 477892 477448 477644 478180 478284 477821 477349 477123 476728
52901 476728 476061 476180 478340 482094 485175 485794 484560 483429 483156 482791 481604 480235 479428 478760 477630 476752
52885 476752 477327 478931 479544 478001 475269 472738 470210 466569 461984 458298 457073 457963 459295 459726 458997
52870 458997 457485 455595 453659 452009 450876 450257 450032 450181 450692 451274 451437 451102 450819 450954 450910 449849 448234
52853 448234 447757 449197 451140 451648 450682 449750 449442 448718 446952 445350 445465 447142 448895 449755 449801 449274 448291
52836 448291 447372 447273 448115 449358 450704 452336 454242 456178 458441 461675 465432 467832 467468 465104 462694
$$ packed form
52950D48018L184K930J259p85j821j323jO89j28j513j415P67K998K901P18j210
52934D55268j560j130q77n25L25J170J531J829K409K604J813P50N16R87J284J354
52918D67748J864K654K662J621N97M30N75J89m48m44J96N36J04m63m72k26l95
52901D76728o67J19K160L754L081O19j234j131k73l65j187j369q07o68j130q78
52885D76752N75J604O13j543k732k531k528l641m585l686j225Q90J332M31p29
52870D58997j512j890j936j650j133o19k25J49N11N82J63l35k83J35m4j061j615
52853D48234m77J440J943N08r66r32l08p24j766j602J15J677J753Q60M6n27r83
52836D48291r19r9Q42J243J346J632J906J936K263L234L757K400l64k364k410
$$ plain form
52821 462694 461096 459581 457446 455174 453840 453989 455451 457913 461298 465570 470259 474308 476697 477443 477776
52806 477776 479015 481346 484020 486627 489657 493525 497395 499488 498822 496478 494782 495143 496914 498482 498951
52791 498951 498184 495685 490575 483058 475098 469009 465711 464528 464003 462512 458928 453655 448649 445596 444266
52776 444266 443275 441997 440887 440277 439957 439905 440295 440648 440008 438381 437124 437417 438970 440653 441796 442485 443132
52759 443132 444175 445648 446621 445647 442372 438346 435668 434977 435154 434790 433731 433384 435571 440619 446449 450173
52743 450173 450883 450207 449843 449522 448136 445909 444153 443198 441880 439207 435646 432563 431013 431153 432161 432651
52727 432651 431765 429944 428142 426533 424849 423803 424831 427957 431076 432242 431909 432030 433450 435094 435405
52712 435405 433609 429765 424586 419448 415773 413965 413380 413431 414185 415664 417274 418457 419417 420550 421441 421233
$$ packed form
52821D62694j598j515k135k272j334J49J462K462L385M272M689M049K389P46L33
52806D77776J239K331K674K607L030L868L870K093o66k344j696L61J771J568M69
52791D98951p67k499n110p517p960o089l298j183n25j491l584n273n006l053j330
52776D44266r91j278j110o10l20n2L90L53o40j627j257K93J553J683J143O89O47
52759D43132J043J473R73r74l275m026k678o91J77l64j059l47K187N048N830L724
52743D50173P10o76l64l21j386k227j756r55j318k673l561l083j550J40J008M90
52727D32651q86j821j802j609j684j046J028L126L119J166l33J21J420J644L11
52712D35405j796l844n179n138l675j808n85N1P54J479J610J183R60J133Q91k08
$$ plain form
52696 421233 420024 419136 419648 421120 422161 421897 420556 418966 418050 418679 421326 425606 430618 435908 441683
52681 441683 447705 452400 453802 451624 448034 446013 446881 449404 451217 451013 449379 447812 447315 448069 450027
52666 450027 453088 456578 459194 460022 459473 458772 458542 458231 457067 455226 453793 453536 453828 452932 449578 444401
52650 444401 439720 437676 438570 441008 443429 445207 446370 446791 446116 444415 442522 441459 441539 442223 442829 443248
52634 443248 443833 444817 445951 446598 446021 443898 440991 439080 439518 441662 443304 443004 441682 441534 443730 447518
52618 447518 451317 454259 456654 459232 461944 463567 462851 460131 457332 456096 456326 456886 457160 457364 457804 458654
52602 458654 460236 462709 465445 467398 468184 468216 467804 466859 465655 465190 466316 468876 472047 475225 478285 481157
52586 481157 483493 484857 485252 485417 486244 487769 489069 489418 489059 488336 486682 483434 479384 476405 475531 476364
$$ packed form
52696D21233j209q88N12J472J041k64j341j590r16O29K647M280N012N290N775
52681D41683O022M695J402k178l590k021Q68K523J813k04j634j567m97P54J958
52666D50027L061L490K616Q28n49p01k30l11j164j841j433k57K92q96l354n177
52650D44401m681k044Q94K438K421J778J163M21o75j701j893j063Q0O84O06M19
52634D43248N85R84J134O47n77k123k907j911M38K144J642l00j322j48K196L788
52618D47518L799K942K395K578K712J623p16k720k799j236K30N60K74K04M40Q50
52602D58654J582K473K736J953P86L2m12r45j204m65J126K560L171L178L060K872
52586D81157K336J364L95J65Q27J525J300L49l59p23j654l248m050k979q74Q33
$$ plain form
52570 476364 478397 481662 485713 489208 491359 492945 495053 497441 498919 498878 497666 495951 494471 493989 494586
52555 494586 495195 494580 492737 490844 489955 490205 490973 491288 490427 488737 487619 488121 489864 491877 493879 495801
52539 495801 496692 495440 492537 489811 488280 487525 487335 488435 490809 492731 492737 491789 492091 494151 496337 497300
52523 497300 497520 498077 499027 499840 500777 502780 506004 509220 511017 511100 510106 508653 507212 506626 507809 510617
52507 510617 513708 515912 517221 518004 518048 517187 516271 516283 516690 516005 514122 512771 513089 513944 513546 511755 509660
52490 509660 507511 504440 500183 495931 493203 492564 493602 495548 497687 499668 501535 503201 504016 503427 501909
52475 501909 500500 499400 497999 496521 496547 499086 502889 505701 506832 507522 508915 510700 511961 512524 513078
52460 513078 514485 517250 521084 524704 526647 526776 526560 527387 529081 530778 532793 536548 542481 548871 553321
$$ packed form
52570D76364K033L265M051L495K151J586K108K388J478m1j212j715j480m82N97
52555D94586O09o15j843j893q89K50P68L15q61j690j118N02J743K013K002J922
52539D95801Q91j252k903k726j531p55j90J100K374J922Or48L02K060K186R63
52523D97300K20N57R50Q13R37K003L224L216J797Q3r94j453j441n86J183K808
52507E10617L091K204J309P83M4q61r16J2M07o85j883j351L18Q55l98j791k095
52490E09660k149l071m257m252k728o39J038J946K139J981J867J666Q15n89j518
52475E01909j409j100j401j478K6K539L803K812J131O90J393J785J261N63N54
52460E13078J407K765L834L620J943J29k16Q27J694J697K015L755N933O390M450
$$ plain form
52445 553321 555090 555646 557124 560393 564293 566482 565190 560547 554376 548772 544874 542565 540813 538423
52431 538423 535036 531520 528894 526917 524443 521317 519049 519127 521296 524021 526005 526702 526114 524950 524416
52416 524416 524863 525161 524463 524009 525705 529160 531819 532298 531963 532650 534372 536200 538070 540414 542995 545473
52400 545473 548428 552460 556730 559806 561564 562807 563202 561345 557237 553050 550614 549286 547215 543807
52386 543807 539906 536238 532859 529860 527510 525637 523757 522061 521637 523249 526182 528617 529183 528149 527153
52371 527153 527545 528860 529167 527186 523811 521126 520162 520164 519941 519222 518559 518693 520314 523725 528059 531330 532192
52354 532192 531557 531700 533763 536956 540361 544460 550162 557096 564031 570758 578351 587311 596430 604170 610436
52339 610436 616141 621451 625442 627486 627955 627260 625176 621858 618834 617746 618115 617440 613999 608811 604216
$$ packed form
52445E53321J769N56J478L269L900K189j292m643o171n604l898k309j752k390
52431E38423l387l516k626j977k474l126k268P8K169K725J984O97n88j164n34
52416E24416M47K98o98m54J696L455K659M79l35O87J722J828J870K344K581K478
52400E45473K955M032M270L076J758J243L95j857m108m187k436j328k071l408
52386E43807l901l668l379k999k350j873j880j696m24J612K933K435N66j034r96
52371E27153L92J315L07j981l375k685r64Kk23p19o63J34J621L411M334L271Q62
52354E32192o35J43K063L193L405M099N702O934O935O727P593Q960R119P740O266
52339F10436N705N310L991K044M69o95k084l318l024j088L69o75l441n188m595
$$ plain form
52324 604216 601193 599074 597537 597508 599588 602646 604861 605630 605574 605050 603819 602292 601966 603980 607854 612227
52308 612227 616404 620526 624581 627985 630195 631190 631277 630869 630583 631276 633670 637885 643138 647846 650446 650631
52292 650631 649706 649332 649943 650788 651320 651885 652968 654479 656216 658547 662098 666867 671960 676258 679399 682317
52276 682317 686700 693399 701344 708575 714527 720640 728487 738086 748602 759844 772135 785297 798899
52263 798899 813321 829480 847482 866472 885822 905430 924808 943085 960420 978352 998020
52252 998020 1018774 1039123 1058322 1076378 1093346 1109570 1126032 1143465 1161519 1179583 1197970
52241 1197970 1217298 1237117 1256315 1274659 1292762 1310566 1327095 1341907 1355663 1368915 1381305
52230 1381305 1392263 1401493 1408391 1412174 1413313 1413880 1415486 1417500 1418178 1417072 1415410 1414374 1413883 1413032 1411142
$$ packed form
52324F04216l023k119j537k9K080L058K215P69n6n24j231j527l26K014L874M373
52308F12227M177M122M055L404K210R95Q7m08k86O93K394M215N253M708K600J85
52292F50631r25l74O11Q45N32N65J083J511J737K331L551M769N093M298L141K918
52276F82317M383O699P945P231N952O113P847R599J0516J1242J2291J3162J3602
52263G98899J4422J6159J8002J8990J9350J9608J9378J8277J7335J7932J9668
52252I98020K0754K0349J9199J8056J6968J6224J6462J7433J8054J8064J8387
52241A197970J9328J9819J9198J8344J8103J7804J6529J4812J3756J3252J2390
52230A381305J0958R230O898L783J139N67J606K014O78j106j662j036m91q51j890
$$ plain form
52215 1411142 1408424 1406016 1405259 1406717 1410126 1415276 1422136 1429813 1436509 1441482 1446357 1453334 1462577 1472491
52201 1472491 1482164 1492094 1502660 1513422 1524359 1536479 1550465 1565616 1580877 1596266 1612575 1629958
52189 1629958 1647322 1662979 1675811 1686226 1696094 1707078 1718760 1728823 1735290 1738110 1738605 1738245 1738207
52176 1738207 1739058 1740079 1739660 1737095 1733428 1729809 1725831 1720618 1714882 1710411 1707555 1704619 1700149 1694581
52162 1694581 1689058 1683682 1677928 1672088 1667181 1663652 1661164 1659713 1659999 1662410 1666383 1671138 1676265 1681111
52148 1681111 1684446 1685904 1687325 1691324 1698309 1706027 1712374 1717585 1723028 1729037 1734978 1740598 1746010 1750852
52134 1750852 1754876 1759148 1765243 1773115 1781003 1787628 1793331 1798801 1804011 1808964 1814257 1820057 1825338 1828924
52120 1828924 1830661 1830998 1830168 1828402 1826055 1822754 1817268 1809236 1800340 1792684 1786407 1779846 1771742 1762361
$$ packed form
52215A411142k718k408p57J458L409N150O860P677O696M973M875O977R243R914
52201A472491R673R930J0566J0762J0937J2120J3986J5151J5261J5389J6309J7383
52189A629958J7364J5657J2832J0415R868J0984J1682J0063O467K820M95l60l8
52176A738207Q51J021m19k565l667l619l978n213n736m471k856k936m470n568
52162A694581n523n376n754n840m907l529k488j451K86K411L973M755N127M846
52148A681111L335J458J421L999O985P718O347N211N443O009N941N620N412M842
52134A750852M024M272O095P872P888O625N703N470N210M953N293N800N281L586
52120A828924J737L37q30j766k347l301n486q032q896p656o277o561q104r381
$$ plain form
52106 1762361 1752789 1744119 1737218 1732421 1729446 1728044 1728316 1729805 1730898 1730200 1728203 1726653 1726529 1727524 1729096
52091 1729096 1730857 1732146 1732549 1732877 1734532 1737816 1741912 1746451 1751802 1757709 1763038 1767338 1771482 1776243
52077 1776243 1781269 1785894 1789869 1792777 1793992 1794036 1794982 1798535 1804452 1811629 1819889 1829712 1840992 1853350
52063 1853350 1867350 1884179 1904103 1926018 1948631 1971569 1995426 2021123 2048944 2077718 2105251
52052 2105251 2130080 2152524 2173633 2193737 2212668 2230792 2248644 2265663 2280360 2291976 2301404
52041 2301404 2310416 2320517 2332353 2345379 2357980 2368627 2377199 2384738 2391841 2397871 2401838 2403378 2402570
52028 2402570 2399347 2393522 2385120 2374346 2361488 2347115 2332159 2317457 2303209 2288993 2274374 2259600
52016 2259600 2245754 2234075 2224950 2217740 2211705 2206827 2203393 2201192 2199736 2199094 2199842 2202155 2205555 2209657
$$ packed form
52106A762361r572q670o901m797k975j402K72J489J093o98j997j550j24R95J572
52091A729096J761J289M03L28J655L284M096M539N351N907N329M300M144M761
52077A776243N026M625L975K908J215M4R46L553N917P177Q260R823J1280J2358
52063A853350J4000J6829J9924K1915K2613K2938K3857K5697K7821K8774K7533
52052B105251K4829K2444K1109K0104J8931J8124J7852J7019J4697J1616R428
52041B301404R012J0101J1836J3026J2601J0647Q572P539P103O030L967J540q08
52028B402570l223n825q402j0774j2858j4373j4956j4702j4248j4216j4619j4774
52016B259600j3846j1679r125p210o035m878l434k201j456o42P48K313L400M102
$$ plain form
52002 2209657 2214608 2220637 2227664 2235514 2243957 2252339 2259821 2266383 2273075 2280753 2288949 2296550 2303275 2309852
51988 2309852 2316785 2323512 2328837 2331798 2331945 2329054 2322802 2312908 2299830 2285314 2271710 2260167 2249640
51975 2249640 2238133 2224757 2210176 2195306 2180473 2165884 2152046 2139186 2126891 2114845 2103290
51964 2103290 2092152 2080346 2067090 2053510 2041626 2031522 2020930 2008269 1994912 1983276 1973465
51953 1973465 1963197 1950856 1937195 1923808 1911152 1898676 1885875 1872406 1857683 1841196 1822943
51942 1822943 1802974 1780864 1756416 1730663 1705293 1680935 1656679 1631531 1605778 1580562 1556609
51931 1556609 1533871 1512165 1491494 1471563 1451470 1430356 1408378 1386666 1366090 1346328 1326543
51920 1326543 1306900 1288712 1272680 1257356 1240062 1219458 1196908 1175269 1156661 1141383 1128406
$$ packed form
52002B209657M951O029P027P850Q443Q382P482O562O692P678Q196P601O725O577
51988B309852O933O727N325K961J47k891o252r894j3078j4516j3604j1543j0527
51975B249640j1507j3376j4581j4870j4833j4589j3838j2860j2295j2046j1555
51964B103290j1138j1806j3256j3580j1884j0104j0592j2661j3357j1636r811
51953A973465j0268j2341j3661j3387j2656j2476j2801j3469j4723j6487j8253
51942A822943j9969k2110k4448k5753k5370k4358k4256k5148k5753k5216k3953
51931A556609k2738k1706k0671j9931k0093k1114k1978k1712k0576j9762j9785
51920A326543j9643j8188j6032j5324j7294k0604k2550k1639j8608j5278j2977
$$ plain form
51909 1128406 1116465 1104932 1094204 1085358 1079204 1075581 1073717 1073294 1074868 1079064 1085548 1093028 1100170
51896 1100170 1106355 1111668 1116437 1120715 1123877 1124752 1122622 1118283 1113719 1110475 1108674 1107829 1108029 1109765 1113126
51881 1113126 1118088 1125401 1136145 1150091 1165355 1180189 1194593 1209718 1226186 1243604 1261423 1279493
51869 1279493 1297565 1314550 1328667 1338633 1344956 1349875 1355528 1362123 1368276 1372968 1376311 1378111 1376602
51856 1376602 1369440 1355671 1336174 1312599 1286521 1259317 1231993 1204915 1178052 1151616 1126398
51845 1126398 1103663 1084667 1069658 1057081 1044603 1031649 1020286 1012794 1008922 1006615 1004739 1003501
51833 1003501 1002269 998852 991734 981769 970722 959082 946314 932564 918962 906479 895403 885827
51821 885827 877819 871086 865228 860497 857814 857822 860224 864139 868761 873659 878815 884530 891050 898030 904460
$$ packed form
51909A128406j1941j1533j0728q846o154l623j864m23J574M196O484P480P142
51896A100170O185N313M769M278L162Q75k130m339m564l244j801q45K00J736L361
51881A113126M962P313J0744J3946J5264J4834J4404J5125J6468J7418J7819J8070
51869A279493J8072J6985J4117R966O323M919N653O595O153M692L343J800j509
51856A376602p162j3769j9497k3575k6078k7204k7324k7078k6863k6436k5218
51845A126398k2735j8996j5009j2577j2478j2954j1363p492l872k307j876j238
51833A003501j232l417p118r965j1047j1640j2768j3750j3602j2483j1076r576
51821H85827q008o733n858m731k683QK402L915M622M898N156N715O520O980O430
$$ plain form
51806 904460 909264 911966 912792 912233 910619 908171 905402 903193 902118 901610 900184 896857 892321 888504 886931
51791 886931 887590 889127 889816 888436 884748 879559 874206 869638 865800 861925 857372 851965 845590 837951 829265
51776 829265 821004 815142 812200 810443 807587 803134 798546 795282 793351 791845 790107 787917 785103 781661
51762 781661 778057 774795 771731 768339 764665 761535 759688 759139 759568 760763 762332 763548 764169 765098 767388
51747 767388 770651 773344 774814 776088 778113 780209 781175 781152 781023 780450 778229 774783 772580 773148 774918 775135
51731 775135 773101 770395 768609 768103 768492 768939 768057 764942 760602 757257 755898 755489 754858 754298 754651 755752
51715 755752 756709 757282 758120 759808 762341 765506 769288 773854 779492 786643 795763 806917 819435 832044
51701 832044 843586 853821 863323 872322 879929 884922 887085 887234 886119 883863 880267 874902 866961 855940
$$ packed form
51806I04460M804K702Q26n59j614k448k769k209j075n08j426l327m536l817j573
51791H86931O59J537O89j380l688n189n353m568l838l875m553n407o375p639q686
51776H29265q261n862k942j757k856m453m588l264j931j506j738k190k814l442
51762G81661l604l262l064l392l674l130j847n49M29J195J569J216O21R29K290
51747G67388L263K693J470J274K025K096R66k3j29n73k221l446k203N68J770K17
51731G75135k034k706j786n06L89M47q82l115m340l345j359m09o31n60L53J101
51715G55752R57N73Q38J688K533L165L782M566N638P151R120J1154J2518J2609
51701H32044J1542J0235R502Q999P607M993K163J49j115k256l596n365p941j1021
$$ plain form
51687 855940 842703 829203 817027 806804 798864 793295 789132 784816 780211 777141 777198 779977 784292 790032
51673 790032 797525 805848 813244 819040 823949 828675 833340 838108 843245 848585 853893 859528 865497 870049
51659 870049 870843 867948 864231 862162 861484 860660 859208 857453 855132 851811 848124 845112 842579 839403 835358
51644 835358 831362 827902 824647 821925 821098 822549 824418 824613 823462 823107 824485 826224 826718 826066 825298 824551
51628 824551 823003 820325 817287 814802 813012 811519 810010 808263 805846 802427 798527 795591 794875 796233
51614 796233 798260 799790 801039 803067 806403 810656 815338 820512 826528 833666 842254 852536 864043 875512
51600 875512 885839 894732 902122 907509 910450 911172 910096 907302 903261 899451 897038 895297 892682 889265
51586 889265 886647 885343 883827 880740 876528 872035 866754 859602 850492 840073 828687 816728 805346
$$ packed form
51687H55940j3237j3500j2176j0223p940n569m163m316m605l070N7K779M315N740
51673G90032P493Q323P396N796M909M726M665M768N137N340N308N635N969M552
51659H70049P94k895l717k069o78q24j452j755k321l321l687l012k533l176m045
51644H35358l996l460l255k722q27J451J869J95j151l55J378J739M94o52p68p47
51628H24551j548k678l038k485j790j493j509j747k417l419l900k936p16J358
51614G96233K027J530J249K028L336M253M682N174O016P138Q588J0282J1507J1469
51600H75512J0327Q893P390N387K941P22j076k794m041l810k413j741k615l417
51586H89265k618j304j516l087m212m493n281p152r110j0419j1386j1959j1382
$$ plain form
51573 805346 795704 787974 781977 778021 775810 773361 768811 763252 760033 760880 764046 766713 767925 768464 768985
51558 768985 769366 769371 768938 767839 765585 761834 756874 751730 747562 744575 741702 737834 733236 729203 726529
51543 726529 725030 724405 724562 724994 724928 724584 725491 728944 734731 741911 750227 760048 771232 782815 793809
51528 793809 803817 812718 819948 824372 825168 823021 820146 818700 819390 821997 826676 833676 842160 850742
51514 850742 859502 870139 883590 898773 914558 931707 951505 973292 994972 1015790 1037227 1060964
51502 1060964 1087075 1114502 1142425 1170851 1200535 1232691 1268226 1306908 1347534 1388904 1430035
51491 1430035 1469313 1504088 1531652 1550431 1560184 1561493 1555307 1542594 1524024 1500063 1471466 1439308
51479 1439308 1404368 1366937 1327683 1288391 1251210 1217139 1185688 1156079 1128299 1102718 1079203
$$ packed form
51573H05346r642p730n997l956k211k449m550n559l219Q47L166K667J212N39N21
51558G68985L81Nm33j099k254l751m960n144m168k987k873l868m598m033k674
51543G26529j499o25J57M32o6l44R07L453N787P180Q316R821J1184J1583J0994
51528G93809J0008Q901P230M424P96k147k875j446O90K607M679P000Q484Q582
51514H50742Q760J0637J3451J5183J5785J7149J9798K1787K1680K0818K1437K3737
51502A060964K6111K7427K7923K8426K9684L2156L5535L8682M0626M1370M1131
51491A430035L9278L4775K7564J8779R753J309o186j2713j8570k3961k8597l2158
51479A439308l4940l7431l9254l9292l7181l4071l1451k9609k7780k5581k3515
$$ plain form
51468 1079203 1057269 1037042 1019436 1005020 993091 982345 972274 963407 956140 949897 943717 937210
51456 937210 930388 922832 913813 903544 893668 885787 879550 872888 864463 855270 847255 840715 834032 825970
51442 825970 817219 809154 802025 795225 788759 783201 778385 773337 767730 762419 758171 754830 752228 750971
51428 750971 751497 752949 753879 753734 752855 751344 748995 746296 744348 743298 741690 738193 733571 730057 728753
51413 728753 728411 727132 724587 721802 719175 715888 711609 707653 705519 704809 703706 701329 698544 696420 695023
51398 695023 694064 693667 693760 693535 692383 690967 690598 691764 693895 696322 698903 701848 705438 709878 715070 720707
51382 720707 726877 734301 743673 755017 767974 782177 796791 810165 820723 828175 833319 836811 838656
51369 838656 838772 837466 835314 832915 830616 828165 824884 820580 816048 812313 809784 808550 808841 810312 811405
$$ packed form
51468A079203k1934k0227j7606j4416j1929j0746j0071q867p267o243o180o507
51456I37210o822p556r019j0269r876p881o237o662q425r193q015o540o683q062
51442H25970q751q065p129o800o466n558m816n048n607n311m248l341k602j257
51428G50971N26J452R30j45q79j511k349k699j948j050j608l497m622l514j304
51413G28753l42j279k545k785k627l287m279l956k134p10j103k377k785k124j397
51398F95023r59l97R3k25j152j416l69J166K131K427K581K945L590M440N192N637
51382G20707O170P424R372J1344J2957J4203J4614J3374J0558P452N144L492J845
51369H38656J16j306k152k399k299k451l281m304m532l735k529j234K91J471J093
$$ plain form
51354 811405 810638 808509 807056 807363 808444 808783 808038 806839 805746 805020 804948 805755 807342 809335 811316 813093
51338 813093 815050 818087 822777 828760 835442 842933 851457 860175 867767 874327 881593 891058 902923 917219
51324 917219 934718 955989 980629 1008339 1040029 1076974 1119463 1167017 1219259 1275622 1334675
51313 1334675 1394674 1454466 1513113 1568947 1619728 1663406 1698103 1721986 1734171 1735402 1726969 1709371
51301 1709371 1682998 1649603 1611671 1570411 1525681 1477867 1428470 1378697 1328973 1280302 1234578
51290 1234578 1192631 1153158 1114665 1077543 1043068 1011180 980726 951509 924683 900979 879724
51279 879724 859986 841855 826097 813062 802277 792758 783512 774125 765128 757522 751736 747174 742722
51266 742722 737503 731325 724907 719659 716612 715315 714318 713031 712494 713813 716367 718287 718512 717580 716425
$$ packed form
51354H11405p67k129j453L07J081L39p45j199j093p26p2Q07J587J993J981J777
51338H13093J957L037M690N983O682P491Q524Q718P592O560P266R465J1865J4296
51324I17219J7499K1271K4640K7710L1690L6945M2489M7554N2242N6363N9053
51313A334675N9999N9792N8647N5834N0781M3678L4697K3883J2185J231q433j7598
51301A709371k6373l3395l7932m1260m4730m7814m9397m9773m9724m8671m5724
51290A234578m1947l9473l8493l7122l4475l1888l0454k9217k6826k3704k1255
51279H79724j9738j8131j5758j3035j0785r519r246r387q997p606n786m562m452
51266G42722n219o178o418n248l047j297r97j287n37J319K554J920K25r32j155
$$ plain form
51251 716425 715248 713954 713021 713228 714659 716431 717430 717047 715281 712515 709342 706438 704376 703389 703113 702516
51235 702516 700471 696826 692827 690045 688797 687945 686393 684282 682381 680714 678513 675611 673200 672768 674643
51220 674643 678155 683062 690045 699386 709665 718518 724678 728762 731984 734712 736673 738002 739329 740946
51206 740946 742481 743581 744390 745224 746231 747663 750018 753501 757605 761556 764904 767251 767821 766060 762751
51191 762751 759714 758042 757017 755066 751319 745879 739225 732243 726587 723866 723909 724424 722980 719121 714289
51176 714289 710096 707263 705806 705401 705431 705300 704904 704327 703095 700495 696902 693973 693040 693943 695985 699110
51160 699110 703120 706504 707592 706817 706339 707090 707689 706919 705837 706234 708025 709677 710717 712274 715228 719186
$$ packed form
51251G16425j177j294r33K07J431J772R99l83j766k766l173k904k062r87k76n97
51235G02516k045l645l999k782j248q52j552k111j901j667k201k902k411m32J875
51220F74643L512M907O983R341J0279Q853O160M084L222K728J961J329J327J617
51206G40946J535J100Q09Q34J007J432K355L483M104L951L348K347N70j761l309
51191G62751l037j672j025j951l747n440o654o982n656k721M3N15j444l859m832
51176G14289m193k833j457m05L0j31l96n77j232k600l593k929r33R03K042L125
51160F99110M010L384J088p75m78P51N99p70j082L97J791J652J040J557K954L958
$$ [...]
##END NTUPLES=NMR SPECTRUM
##END=
