
##TITLE=UV1136_M4-1010-1000_6275356_ixds3EIxaF
##JCAMPDX= 6.0         $$ Bruker NMR JCAMP-DX V2.0
##DATA TYPE= NMR SPECTRUM
##DATA CLASS= NTUPLES
##ORIGIN= BRUKER
##OWNER= Administrator
$$ 1.72 TOPSPIN		Version 2.1
$$ 2012-06-03 01:29:50.687 -0500  Administrator@TOPSPIN
$$ Compression mode = diff/dup
##.OBSERVE FREQUENCY= 400.13188235
##.OBSERVE NUCLEUS= ^1H
##.ACQUISITION MODE= SIMULTANEOUS (DQD)
##.ACQUISITION SCHEME= undefined
##.AVERAGES= 8
##.DIGITISER RES= 22
##SPECTROMETER/DATA SYSTEM= spect
##.PULSE SEQUENCE= zg30
##.SOLVENT NAME= COFFEE_meoh
##.SHIFT REFERENCE= INTERNAL, COFFEE_meoh, 1, 14.98061
##AUDIT TRAIL= $$ (NUMBER, WHEN, WHO, WHERE, PROCESS, VERSION, WHAT)
$$ ##TITLE= Audit trail, TOPSPIN		Version 2.1
$$ ##JCAMPDX= 5.01
$$ ##ORIGIN= Bruker BioSpin GmbH
$$ ##OWNER= Administrator
$$ $$ C:\Bruker\TOPSPIN/data/COFFEE/nmr/UV1136_M4-1010-1000_6275356_ixds3EIxaF/10/pdata/1/auditp.txt
$$ ##AUDIT TRAIL=  $$ (NUMBER, WHEN, WHO, WHERE, PROCESS, VERSION, WHAT)
(   1,<2012-06-03 01:29:42.703 -0500>,<Administrator>,<TOPSPIN>,<go>,<TOPSPIN 2.1>,
      <created by zg
	started at 2012-06-03 01:28:36.062 -0500,
	POWCHK enabled, PULCHK disabled,
       configuration hash MD5:
       D5 CA 7A 23 FE 6B EE E2 50 67 74 61 24 F7 5E 3B
       data hash MD5: 64K
       2C 9D CC 74 B7 74 A7 CE 1C 8D A8 64 EB 2B 0F 68>)
(   2,<2012-06-03 01:29:46.593 -0500>,<Administrator>,<TOPSPIN>,<proc1d>,<TOPSPIN 2.1>,
      <Start of raw data processing
       efp LB = 0 FT_mod = 6 PKNL = 1 PHC0 = 0 PHC1 = 0 SI = 32K 
       data hash MD5: 32K
       CC 27 42 35 27 89 CF C2 CD 70 B3 C3 25 AE ED 58>)
(   3,<2012-06-03 01:29:46.875 -0500>,<Administrator>,<TOPSPIN>,<proc1d>,<TOPSPIN 2.1>,
      <pk PHC0 = 211.2341 PHC1 = 0 
       data hash MD5: 32K
       83 00 62 60 02 7F 43 F1 74 13 28 5C CE 71 43 B4>)
(   4,<2012-06-03 01:29:46.953 -0500>,<Administrator>,<TOPSPIN>,<proc1d>,<TOPSPIN 2.1>,
      <abs ABSG = 1 
       data hash MD5: 32K
       CC 03 39 5C 56 AD A7 FC D7 11 F3 25 84 C3 E4 07>)
(   5,<2012-06-03 01:29:46.984 -0500>,<Administrator>,<TOPSPIN>,<proc1d>,<TOPSPIN 2.1>,
      <abs ABSG = 2 
       data hash MD5: 32K
       B1 BB 6F DB D4 6A 61 89 39 94 87 47 5D 78 BC 71>)
(   6,<2012-06-03 01:29:47.015 -0500>,<Administrator>,<TOPSPIN>,<proc1d>,<TOPSPIN 2.1>,
      <abs ABSG = 3 
       data hash MD5: 32K
       87 C8 46 85 23 8D C1 03 3A 91 7B 09 99 78 55 E9>)
(   7,<2012-06-03 01:29:47.046 -0500>,<Administrator>,<TOPSPIN>,<proc1d>,<TOPSPIN 2.1>,
      <abs ABSG = 4 
       data hash MD5: 32K
       AA A2 C8 18 57 B7 15 73 C1 70 02 6C 28 6D 2A D8>)
(   8,<2012-06-03 01:29:47.062 -0500>,<Administrator>,<TOPSPIN>,<proc1d>,<TOPSPIN 2.1>,
      <abs ABSG = 5 
       data hash MD5: 32K
       A7 9D 4C 7B 02 7B A6 A0 28 7F 2F 9E 02 F5 06 CB>)
$$ ##END=
$$ 
$$ $$ hash MD5
$$ $$ A4 01 43 E7 88 77 94 1C 5E 2D 82 54 8F 5E 4D AA
##$RELAX= 
##$RELAX= 
##$RELAX= 
##$RELAX= 
##$RELAX= 
##$RELAX= 
##$RELAX= 
$$ Bruker specific parameters
$$ --------------------------
$$ [...]
150 150 150 150 150 150 150 150
##$TP07= 0
##$TPNAME0= <>
##$TPNAME1= <>
##$TPNAME2= <>
##$TPNAME3= <>
##$TPNAME4= <>
##$TPNAME5= <>
##$TPNAME6= <>
##$TPNAME7= <>
##$TPOAL= (0..7)
0.5 0.5 0.5 0.5 0.5 0.5 0.5 0.5
##$TPOFFS= (0..7)
0 0 0 0 0 0 0 0
##$TUNHIN= 0
##$TUNHOUT= 0
##$TUNXOUT= 0
##$USERA1= <user>
##$USERA2= <user>
##$USERA3= <user>
##$USERA4= <user>
##$USERA5= <user>
##$V9= 5
##$VALIST= <valist>
##$VCLIST= <CCCCCCCCCCCCCCC>
##$VD= 0
##$VDLIST= <DDDDDDDDDDDDDDD>
##$VPLIST= <PPPPPPPPPPPPPPP>
##$VTLIST= <TTTTTTTTTTTTTTT>
##$WBST= 2048
##$WBSW= 25
##$XGAIN= (0..3)
0 0 0 0
##$XL= 0
##$YL= 0
##$YMAX_a= 539808
##$YMIN_a= -651190
##$ZGOPTNS= <>
##$ZL1= 120
##$ZL2= 120
##$ZL3= 120
##$ZL4= 120
##$ABSF1= 14.98061
##$ABSF2= -5.57192
##$ABSG= 5
##$ABSL= 3
##$ALPHA= 0
##$AQORDER= 0
##$ASSFAC= 0
##$ASSFACI= 0
##$ASSFACX= 0
##$ASSWID= 0
##$AUNMP= <proc_prof1d_extract_pilot.lims>
##$AXLEFT= 0
##$AXNAME= <>
##$AXNUC= <1H>
##$AXRIGHT= 0
##$AXTYPE= 0
##$AXUNIT= <>
##$AZFE= 0.1
##$AZFW= 0.1
##$BCFW= 0
##$BC_mod= 0
##$BYTORDP= 0
##$COROFFS= 0
##$CY= 15
##$DATMOD= 1
##$DC= 0
##$DFILT= <>
##$DTYPP= 0
##$F1P= 0
##$F2P= 0
##$FCOR= 0.5
##$FTSIZE= 32768
##$FT_mod= 6
##$GAMMA= 0
##$GB= 0
##$INTBC= 1
##$INTSCL= 1
##$ISEN= 128
##$LB= 0
##$LEV0= 0
##$LPBIN= 0
##$MAXI= 10000
##$MC2= 0
##$MEAN= 0
##$ME_mod= 0
##$MI= 0
##$NCOEF= 0
##$NC_proc= -8
##$NLEV= 6
##$NOISF1= 0
##$NOISF2= 0
##$NSP= 0
##$NTH_PI= 0
##$NZP= 0
##$OFFSET= 14.98061
##$PC= 1
##$PHC0= 211.2341
##$PHC1= 0
##$PH_mod= 1
##$PKNL= yes
##$PPARMOD= 0
##$PPDIAG= 0
##$PPIPTYP= 0
##$PPMPNUM= 2147483647
##$PPRESOL= 1
##$PSCAL= 4
##$PSIGN= 0
##$PYNMP= <proc.py>
##$REVERSE= no
##$SF= 400.13
##$SI= 32768
##$SIGF1= 0
##$SIGF2= 0
##$SINO= 400
##$SIOLD= 32768
##$SPECTYP= <>
##$SREGLST= <1H.CDCl3>
##$SSB= 0
##$STSI= 32768
##$STSR= 0
##$SW_p= 8223.68421052632
##$SYMM= 0
##$S_DEV= 0
##$TDeff= 65536
##$TDoff= 0
##$TI= <>
##$TILT= no
##$TM1= 0
##$TM2= 0
##$TOPLEV= 0
##$USERP1= <user>
##$USERP2= <user>
##$USERP3= <user>
##$USERP4= <user>
##$USERP5= <user>
##$WDW= 1
##$XDIM= 32768
##$YMAX_p= 463828185
##$YMIN_p= -700715
##$CURPLOT= <Network HP LaserJet P1505>
##$CURPRIN= <$Network HP LaserJet P1505>
##$DFORMAT= <normdp>
##$LAYOUT= <+/1D_H.xwp>
##$LFORMAT= <normlp>
##$PFORMAT= <normpl>
##$SURQMSG= 1
$$ End of Bruker specific parameters
$$ ---------------------------------
##NTUPLES= NMR SPECTRUM
##VAR_NAME=  FREQUENCY,     SPECTRUM/REAL,   SPECTRUM/IMAG
##SYMBOL=    X,             R,               I
##VAR_TYPE=  INDEPENDENT,   DEPENDENT,       DEPENDENT
##VAR_FORM=  AFFN,          ASDF,            ASDF
##VAR_DIM=   32768,         32768,           32768
##UNITS=     HZ,            ARBITRARY UNITS, ARBITRARY UNITS
##FACTOR=    0.250966925370066, 1,           1
##FIRST=     8223.43324360095, -15311,       -237166
##LAST=      0,             -141043,         -55433
##MIN=       0,             -700715,         0
##MAX=       8223.43324360095, 463828185,    0
$$ Real data points
##PAGE= N=1
##DATA TABLE= (X++(R..R)), XYDATA
$$ [...]
19531B77527e8469l45784J4816a19277d0957j35083L8027a233k24022G0423c05727
19519B67835a08774D320P3660e9693l10304A63975b9603l13953f1481B89714a10684
19507a71400E8211a09530I5011M2949B7547a04j97591e5563b6232C51315a18235
19495i9260B55490B8870Q4699h7425B2085c46808c6959B4863c00168a43389j434
19484a44823B76979a40362I2459J15555e6B2623L02984A9444i0669L5748a0685
19472a23988q8204p5480J22422k8941e5022K6589q771l96547a12373j8888l93721
19461e24982b28847e9339A51626a11053B28891c06864Q7292f5115D38602d5647
19450C971c8467j69133C1867b08642G0249i6355I5473a12312A54517C307a63910
$$ plain form
19531 277527 -58469 -404253 -389437 -119277 -40957 -176040 -138013 -1233 -225255 70423 -305727
19519 267835 -108774 4320 77980 -59693 -369997 163975 -29603 -343556 -61481 289714 -110684
19507 -171400 58211 -109530 95011 137960 27547 -104 -197695 -55563 -26232 351315 -118235
19495 -99260 255490 28870 113569 -87425 22085 -346808 -36959 24863 -300168 -143389 -144823
19484 -144823 276979 -140362 92459 208014 -56 22623 325607 19444 -90669 -54921 -10685
19472 -123988 -212192 -287672 -165250 -194191 -55022 -28433 -37204 -433751 -112373 -131261 -524982
19461 -524982 -228847 -59339 151626 -111053 228891 -306864 -219572 -65115 438602 -45647
19450 3971 -38467 -207600 31867 -208642 70249 -96355 95473 -112312 154517 3307 -163910
19438b42326a2750p2865A22801a62312L5151d1431j28759b9991o6326n16024J80437
19427d31904a76071A71371i1681B83782I4118Q8027C3681e3586j89927A5687B019
19415A13110k2517f0681H0941b11462I7593a01930A03300b03995C691O41L9284
19404D3616a15485j80059F4360b32831P6708I1745b3797A60435e6846k5068n0067
19393a31981d888k82144J0730A06315D2891R5156j1696b61976A7702G695a17250
19381i9981j15410A74505E2927b45108C7486b68844a13901J0956g208A2812Q029
19370B0841a59015c600A51438N5190g8118r9901h2367A571h6678j55982B48058
19358e6854B55765b67941J5674b3737r765j94721J08242A79197a17117J2220M3479
$$ plain form
19438 -242326 -12750 -85615 122801 -162312 -127161 -41431 -170190 -29991 -96317 -612341 -431904
19427 -431904 -176071 171371 -91681 283782 94118 182145 33681 -53586 -243513 15687 2019
19415 113110 90593 -60681 80941 -211462 97593 -101930 103300 -203995 3691 4332 43616
19404 43616 -115485 -295544 64360 -232831 -156123 91745 -23797 160435 -56846 -81914 -131981
19393 -131981 -4888 -287032 -276302 106315 42891 138047 126351 -261976 17702 7695 -117250
19381 -99981 -215391 174505 52927 -245108 37486 -268844 -113901 -102945 -7208 12812 20841
19370 20841 -159015 -3600 151438 206628 -78118 -178019 -82367 1571 -86678 -242660 248058
19358 -56854 255765 -267941 -252267 -23737 -33502 -228223 -119981 179197 -117117 -104897 -61418
19347f1418k00116e7261k47426J2943k27766i9403J4053k80487h4796A51973a37351
19335b51044D1467a47403B28924b96341e470k01368j16849A30166a83148A20523
19324a46650B36755e8276k48513B6936a4853j36157K1265I0533l650i7058n4725
19313a51783E852L85185A3303a6266j72014j0329m6582a5953k24046a610j00012
19302a01622l4653N3084m8176j15952A03721c8026j99944A5900i1265l4653k8992
19291a54910M5417N755l9719f7748D7939J0139c3586k44186Q963J21542C7458
19279A77301l9605b46539g546m6297m43465i1495j0594D3858a98317O9297A00508
19267A44538b17677j3651d2254j81031m6948F2216b19694D8680b71073B11026
$$ plain form
19347 -61418 -261534 -57261 -304687 -291744 -519510 -99403 -85350 -365837 -84796 151973 -137351
19335 -251044 41467 -147403 228924 -296341 -5470 -206838 -323687 130166 -183148 120523
19324 -146650 236755 -58276 -306789 26936 -14853 -151010 -129745 90533 86883 -97058 -151783
19313 -151783 5852 391037 13303 -16266 -188280 -198609 -245191 -15953 -239999 -1610 -101622
19302 -101622 -136275 -83191 -131367 -247319 103721 -38026 -237970 15900 -91265 -125918 -154910
19291 -154910 -109493 -103738 -143457 -67748 47939 58078 -33586 -277772 -268809 -147267 37458
19279 177301 137696 -246539 -7546 -53843 -497308 -91495 -102089 43858 -198317 -129020 100508
19267 144538 -217677 -231328 -42254 -223285 -270233 62216 -219694 48680 -271073 211026
19256a79403l9771J06597L5958C678d4487k1734P888j64495J9394O7504d7947
19244i9883H4877c53116B02564j5807g7157B70650r2038b79230i3810E0805b795
19232a37628b8197n6538c3160j43631E2102b673j59896A5254P2365M5159C8616
19220i7159o8551B27578b20087k3290H6312a73058B60274a68898J8428l7967K7626
19209a60811C2624K18261I7582d39321J38018A12409L8304e1057F8054i0586A15784
19197H5253J35157e02752a37742A22738l4200k7092A0585J29880M7345g0723B2996
19185a79075A49211p396c9480j02485j73334J49166q9591B12353G1255b3528j72134
19174a95662l14613R0529J34648p0812d5714D5674b0729A42034J25704a7020j18234
$$ plain form
19256 -179403 -219174 -112577 -76619 3678 -44487 -66221 -58333 -222828 -203434 -135930 -47947
19244 -99883 84877 -353116 202564 186757 -77157 270650 178612 -279230 -93810 50805 -2795
19232 -137628 -28197 -84735 -33160 -176791 52102 -2673 -162569 15254 87619 132778 38616
19220 -97159 -165710 227578 -220087 -243377 86312 -173058 260274 -168898 -150470 -188437 -160811
19209 -160811 32624 250885 97582 -439321 -301303 112409 150713 -51057 68054 -90586 115784
19197 85253 220410 -502752 -137742 122738 88538 61446 10585 140465 187810 -70723 22996
19185 -179075 149211 141815 -39480 -141965 -315299 -166133 -255724 212353 71255 -23528 -195662
19174 -195662 -510275 -419746 -285098 -355910 -45714 45674 -20729 142034 267738 -17020 -135254
19163a35254B0948c309j39272b1542F4877c19774C1137L27542E7437e4061k42993
19152b97054I9877A9734K03321b62686A10625b77021A03510A3271c80401A3586
19141a03605A78288c11631B70979d682k81601A17249a47215j14391f27n7907B2730
19129b25242n8177H5515b35637J08355k60212J78526j53472a5891j97685j36734
19119c50310a16730B4198J24236b10219f6952B568h5459F6581a83405A35923E3620
19107a81029P7355j2994j03317B98272G1110J37864a63119N9210B67534f2712
19096B4790A013K6715J61246a9949o2912K3703K3054r2841k49319g4602E0471
19084c3827F8003J28127j7551b91963a03539j47291B60272b74876N9548d6231
$$ plain form
19163 -135254 20948 -3309 -142581 -21542 64877 -319774 31137 358679 57437 -54061 -297054
19152 -297054 99877 19734 223055 -262686 110625 -277021 103510 13271 -380401 13586
19141 -103605 178288 -311631 270979 -4682 -286283 117249 -147215 -261606 -627 -58534 22730
19129 -225242 -283419 85515 -235637 -127282 -387494 -208968 -362440 -15891 -213576 -350310
19119 -350310 -116730 24198 148434 -210219 -66952 2568 -85459 66581 -183405 135923 53620
19107 -181029 -103674 -116668 -219985 298272 71110 208974 -163119 -103909 267534 -62712
19096 24790 1013 27728 188974 -19949 -82861 -59158 -36104 -128945 -378264 -74602 50471
19084 -33827 68003 196130 178579 -291963 -103539 -250830 260272 -274876 -215328 -46231
19073a97038D0346G876a71196a5080A72100b1345A05326m4086a98189n6245B90654
19061b1807D4512L1411B8081b45540g4322g006o1751o6675A38227a03703b002
19049a36106A49917J9825a17765k95393J04711g7291A4797P1940a26738H4606
19038a62169N8759A72118a32388j19359c3334k42409e1156j33991c5685C4076
19027A19209a49026J1390F4063b29476c1762k51799G238Q3429i5915A1926d8228
19015A51346J7614M5035c3822k1689E8278J27783I0483l9637i6734A8788K17218
19004B36006b5674l30208J47205c7212j84424j42000e1410i256j75251B56213
18993I0730m3974f3384j33288C7629b01629E6830a41288A59272h5575B72032i6480
$$ plain form
19073 -197038 40346 7876 -171196 -15080 172100 -21345 105326 61240 -198189 -254434 290654
19061 -21807 44512 75923 28081 -245540 -74322 -7006 -68757 -135432 138227 -103703 -2002
19049 -136106 149917 169742 -117765 -413158 -308447 -77291 14797 86737 -126738 84606
19038 -162169 -103410 172118 -132388 -251747 -33334 -275743 -51156 -185147 -35685 34076
19027 119209 -149026 -137636 64063 -229476 -31762 -283561 7238 90667 -95915 11926 -48228
19015 151346 168960 213995 -33822 -55511 58278 186061 90483 50846 -96734 18788 236006
19004 236006 -25674 -355882 -208677 -37212 -221636 -363636 -51410 -9256 -184507 256213
18993 90730 46756 -63384 -196672 37629 -201629 56830 -141288 159272 -85575 272032 -96480
18981H0644b33545F1904K46164c20368Q9583b2918p0015d2595A73268a6340B59828
18969A51173m3678b2705q5871a4900C6008a91507A10246a66576G4550B0175K46918
18958B67093A28317l1574J4492j4931a71782K0590c3853o9646A20048b40997f1005
18946a34065p5235j8744o3840k18631J34520J37767P6144l9835A1348L3253K6877
18935G1478l4233K87713B8358a83359o784B26115B6010a66737J0176f42B39072
18923a4338E241a8301p7867A05016a53713k50073d6656p2469c1584l93505I429
18911A7261a82909Q9649D4306a70818F2349M4022c68396a16639r463f687q194
18900a4881H5431C9028a230j22714I4920g5211A73828a08195r3948o3145c2000
$$ plain form
18981 80644 -233545 61904 308068 -320368 -230785 -22918 -92933 -42595 173268 -16340 259828
18969 151173 107495 -22705 -108576 -14900 36008 -191507 110246 -166576 74550 20175 267093
18958 267093 128317 96743 111235 96304 -171782 -151192 -33853 -103499 120048 -240997 -61005
18946 -134065 -209300 -228044 -291884 -510515 -375995 -238228 -162084 -201919 11348 44601 71478
18935 71478 37245 324958 28358 -183359 -190143 226115 26010 -166737 -156561 -642 239072
18923 -14338 5241 -18301 -96168 105016 -153713 -403786 -46656 -119125 -31584 -425089 9429
18911 17261 -182909 -93260 44306 -170818 62349 106371 -368396 -116639 -126102 -6687 -14881
18900 -14881 85431 39028 -1230 -123944 94920 -75211 173828 -108195 -202143 -265288 -32000
18888i4190k3985j5962B068R0985f7805A59612E7699a55840B08122h3493L2441
18877e1052Q369j66566f5868H1757l9250a5975r0283l40293E2413Q5353D7285
18865B7181N7914a6081l4930k19408A11936a88558A76388d0279J456k81329B241
18853D21861A13286B7517C637b63326I5898a96818q1604A34839b90368J25443
18843a64925A01442a48399B54991h2865M716A30460C5529a30534D5073K43443
18833B88516C2099j4984J18624h0589O032E9591b31538e9291b1209B02752a57356
18821f542C7194a10578E5921J56553b91267a01419K30j64269c299j76001C3732
18809A2013a23827j20577o552D965K12607c78172D5054O2787a77749Q3938A18988
$$ plain form
18888 -94190 -118175 -134137 2068 93053 -67805 159612 57699 -155840 208122 -83493 -51052
18877 -51052 -42683 -209249 -65868 81757 42507 -15975 -106258 -446551 52413 137766 47285
18865 27181 85095 -16081 -51011 -270419 111936 -188558 176388 -40279 -38823 -320152 2241
18853 421861 113286 27517 3637 -263326 95898 -196818 -278422 134839 -290368 -164925
18843 -164925 101442 -148399 254991 -82865 -78149 130460 35529 -130534 45073 288516
18833 288516 32099 17115 135739 -80589 -74557 59591 -231538 -59291 -21209 202752 -157356
18821 -6542 37194 -110578 55921 212474 -291267 -101419 -101189 -265458 -3299 -179300 33732
18809 12013 -123827 -244404 -250956 4965 217572 -378172 45054 107841 -177749 -93811 118988
18797b06601N6977C8637J02171a17184E6168K1556k344a0890k79481J22377l18742
18786d86736b31197D4882N0233J0615b41507R5989D9967d7736m41487a25481K5312
18775a00169n71B7731Q9234a09991j07149l8325A04835a33821B41305D4975L1424
18764G6399a45933N5548G3057c49589d0505A12095d9601k25291a13097J1942B8592
18752a66371B2211O78a85190j31793b4284k38711g7573k53067A54110b00686Q8043
18741a12643b5880j06876q7605k1376F4656a76114B4614b96366C57479a33860
18730c25775C84014g8436D8959a80879A4400a09720l5115E2490c05550a51593
18719D1391d0308C8344B369K7400b82392p1812a8512n3824k43148E5943d1166
$$ plain form
18797 -206601 -149624 38637 140808 -117184 56168 77724 75380 -10890 -290371 -167994 -486736
18786 -486736 -231197 44882 95115 105730 -241507 -145518 49967 -47736 -489223 -125481 -100169
18775 -100169 -100740 27731 116965 -109991 -217140 -255465 104835 -133821 241305 44975 76399
18764 76399 -145933 -90385 73057 -349589 -40505 112095 -49601 -274892 -113097 -101155 28592
18752 -166371 22211 22889 -185190 -316983 -24284 -262995 -77573 -330640 154110 -200686 -112643
18741 -112643 -25880 -132756 -220361 -241737 64656 -176114 24614 -296366 357479 -133860
18730 -325775 384014 -78436 48959 -180879 14400 -109720 -144835 52490 -305550 -151593
18719 41391 -40308 38344 2369 29769 -282392 -354204 -18512 -72336 -315484 55943 -41166
18707B04765o2299f271k98451a50599O6987A9923g1906B27815k4824a69446I0550
18695F7135a50359j235m0444d2778j81504r5483a14126l8580g2893A1234b65032
18683b11240C9051b71089i1311m8491K975M4685C47556A58065a05342c2467j43573
18672a76040C450b4704l4298a3487A33259a74296A45219C9769f3077j42225j0062
18661b15364I0827c3559A66148F6810J93953b0351j61927j6464H0481c3896j43235
18650a77131g8632F2576a54688A41073A0079J52113c445E7712c35612L6262B28841
18638a33946f3898B08414c21849O4914C5764b18613B27258H3464b53098n80C8426
18626a77901d8366A26762a08207j27475R024j8687q464h1011A98678b9124h120
$$ plain form
18707 204765 142466 -6271 -304722 -150599 -83612 19923 -71906 227815 202991 -169446 90550
18695 67135 -150359 -151594 -192038 -42778 -224282 -319765 -114126 -152706 -72893 11234 -265032
18683 -211240 39051 -271089 -91311 -139802 -136827 -92142 347556 158065 -105342 -32467 -176040
18672 -176040 3450 -24704 -59002 -13487 133259 -174296 145219 39769 -63077 -205302 -215364
18661 -215364 90827 -33559 166148 66810 260763 -20351 -182278 -198742 80481 -33896 -177131
18650 -177131 -78632 62576 -154688 141073 10079 162192 -3445 57712 -335612 -299350 228841
18638 -133946 -63898 208414 -321849 -256935 35764 -218613 227258 83464 -253098 -253678 38426
18626 -177901 -48366 126762 -108207 -235682 -226658 -245345 -253809 -81011 198678 -29124 -8120
18614I888f567C62831d6358D2963J80619q6841E7929a31926e9612B19641e9753
18602b05451c5949A9163b3095m5625j78365D4081a79714l1275N2477k9809B11458
18590f4276K9075C7978b16553D2335g3182l29785D5269L0958A5198a12768n2382
18579a65150K8850j38033R9157a428A39328b76950j28706D11528f1220B4497c36169
18567a70807A46523A8874a01391K948h995j03438A5937n306a56775f5889m9311
18556a15200j50640A18069G553a01192A94025a80523r2958H1697N0810a39517
18545b86029E9993N6972A5871a74435K6369A5745J83110b88369k4129g3693m6232
18534a19925j77750A9503K4475g3374I7297a00360c4890a7158m0192A63031B4034
$$ plain form
18614 9888 -6567 362831 -46358 42963 223582 136741 57929 -131926 -59612 219641 -59753
18602 -205451 -35949 19163 -23095 -68720 -247085 44081 -179714 -210989 -158512 -188321 211458
18590 -64276 -35201 37978 -216553 42335 -73182 -402967 45269 76227 15198 -112768 -165150
18579 -165150 -136300 -274333 -175176 -1428 139328 -276950 -405656 411528 -61220 24497 -336169
18567 -170807 146523 18874 -101391 -98443 -8995 -112433 15937 10631 -156775 -65889 -115200
18556 -115200 -265840 118069 7553 -101192 194025 -180523 -273481 81697 132507 -139517
18545 -286029 59993 116965 15871 -174435 -148066 15745 198855 -288369 -312498 -73693 -119925
18534 -119925 -297675 19503 43978 -73374 97297 -100360 -34890 -17158 -57350 163031 24034
18522C8592M8584a60334C0940R4817d70002a32327k5570B2054c9378k00091Q4669
18511a54800e1503H1707f232A35337A9863i4141p3285L6977j72963O7189A3254
18499B0320a2919q8199c4744I1669a06188I0392g9311o4578C1588J06201Q8852
18488B26641b49023a3552p2531l6288A72553a14600C4432L12591a94790C3968
18477a2194D5442a16973l7324A06612g845j60332a0609E68P486a42489L1971e580
18464C8227b34186c8681A2391c36468J01429a00536B08474a59853L4110M7165
18454g8578C74928A79147b47885j8720O2213B68133p9477a95129b3602j87896
18444b11498j16031A41799a33630A4120h2305A6861K44668d07k33736C1853a19214
$$ plain form
18522 38592 87176 -160334 30940 125757 -470002 -132327 -157897 22054 -39378 -239469 -154800
18511 -154800 -51503 81707 -6232 135337 19863 -94141 -167426 -130449 -303412 -236223 13254
18499 20320 -12919 -101118 -34744 91669 -106188 90392 -79311 -143889 31588 137789 226641
18488 226641 -249023 -13552 -86083 -122371 172553 -114600 34432 347023 -194790 33968
18477 -12194 45442 -116973 -154297 106612 -7845 -168177 -10609 568 8054 -142489 -110518 -5580
18464 38227 -234186 -38681 12391 -336468 -235039 -100536 208474 -159853 -125743 -78578
18454 -78578 374928 179147 -247885 -266605 -204392 268133 188656 -195129 -23602 -211498
18444 -211498 -327529 141799 -133630 14120 -82305 16861 261529 -407 -234143 31853 -119214
18432f713E7971n100K9236a13308j30930R4495n5509B9518a03437R754D3816N2610
18420I6426b936j76397F2528A5988l868c22201M9513j5183H5528j8881a24682
18408A02518b23300O6415C68445i9922B12417e3219F1121a31962j82498a09878
18397A24978l3855a09194a1747j43490k33363a81823C4640a05820j34220f8112
18386D6396a71403b2504A71868a76565G9826c10102A3359g4866m27787D5133i3950
18374b7137j21831E3942g5417a8911k99943A62371C5388d47610E4610a10346b335
18362a01525A17429a89899K1569Q2542j03398r7766A88814b75323c964A4467d8411
18350b70788g6652A70186G7441A4423a62108f2813D4367Q6841e971C6046J24919
$$ plain form
18432 -6713 57971 52871 82107 -113308 -244238 -149743 -205252 29518 -103437 -93683 43816 96426
18420 96426 -2936 -179333 62528 15988 12120 -322201 -272688 -287871 85528 66647 -124682
18408 102518 -223300 -156885 368445 -99922 212417 -53219 61121 -131962 -314460 -109878
18397 124978 91123 -109194 -11747 -155237 -388600 -181823 34640 -105820 -240040 -68112
18386 46396 -171403 -22504 171868 -176565 79826 -310102 13359 -74866 -502653 45133 -93950
18374 -27137 -148968 53942 -75417 -18911 -318854 162371 35388 -447610 54610 -110346 -2335
18362 -101525 117429 -189899 -168330 -85788 -189186 -286952 188814 -275323 -3964 14467 -48411
18350 -270788 -76652 170186 77441 14423 -162108 -62813 44367 131208 -5971 36046 160965
18339A60965d1629I892M47f3985J432A7268b57545A66713i6646l29290G3131G809
18326a06110C32897e5958j60558B74651f0190a6384r511k48393d0330A16483a09752
18314A89042N3653A09067c39467A20193c79050I5888l9855B3348e2778H6571a30897
18302e2416F3823a5254C613e2040A22931m8795b29307O6029D4407P4544L6187
18291A55138a22935B7207a43531d8123K3360C51331B2445a11390I1444a95056
18280A47327d58540J48376M2440O5221B61002b43868J7375e6471a7553l37395
18270c54948R1756d571k43305O5922q4522c550m4355j46255b5548o4713H3894
18258A11642Q8881a37327j1237d831B3104a24890b7569H6617l1363J14503d6554
$$ plain form
18339 160965 -41629 9892 10339 -63985 -62553 17268 -257545 166713 -96646 -425936 73131 7809
18326 -106110 332897 -55958 -216516 274651 -60190 -16384 -25895 -274288 -40330 116483 -109752
18314 189042 242695 109067 -339467 120193 -379050 95888 56033 23348 -52778 86571 -130897
18302 -52416 63823 -15254 3613 -52040 122931 74136 -229307 -163278 44407 118951 155138
18291 155138 -122935 27207 -143531 -48123 -24763 351331 22445 -111390 91444 -195056
18280 147327 -458540 -310164 -267724 -202503 261002 -243868 -226493 -56471 -17553 -354948
18270 -354948 -263192 -4571 -247876 -181954 -266476 -3550 -47905 -194160 -25548 -90261 83894
18258 111642 200523 -137327 -148564 -4831 23104 -124890 -27569 86617 55254 169757 -46554
18246E7604g3044B1803b61610A36024N584b88746J20495P2748B43121A8950e7007
18234b87100F7440g066l1254j85676A34141a64770D4436h2441P413B010b08414
18222a82660P9189J142C88844b431E1876q744q648J18874a5495j66930A0257D968
18209a90504A75644E1275M0212c15741A50517b11676o1698B6857i7568b6281j47461
18198a73742A47391A7028a65120e872A36431b20979N2588I3278d90405f8473K3265
18187d5208j21681Q2399o362J8103l3601A52781k3341P0729r634a98885j38354
18176c37239g9414B50412d1479H0504A5713h4996H0949a6724l78560a3216A03021
18164h0628A71810a8006A13542e51565a82202c3152A37769d52749A30323a58990
$$ plain form
18246 57604 -73044 21803 -261610 136024 141608 -288746 -168251 -95503 243121 18950 -57007
18234 -287100 67440 -7066 -38320 -223996 134141 -164770 44436 -82441 -75028 2010 -208414
18222 -182660 -103471 -102329 388844 -2431 51876 43132 34484 153358 -15495 -182425 10257 4968
18209 -190504 175644 51275 91487 -315741 150517 -211676 -273374 26857 -97568 -26281 -173742
18198 -173742 147391 17028 -165120 -5872 136431 -220979 -168391 93278 -490405 -68473 -45208
18187 -45208 -166889 -84490 -90852 -72749 -106350 152781 129440 200169 190535 -198885 -337239
18176 -337239 -79414 250412 -41479 80504 15713 -84996 80949 -16724 -395284 -13216 103021
18164 -80628 171810 -18006 113542 -551565 -182202 -33152 137769 -452749 130323 -158990
18153d6208B8323b93983I1240a03447d5845j46474M6246L7151l323A24036O6442
18142A90478l0385b17477n5783D879J07010b63989E3913b41551A18515c78210
18131C19179r8082a12483A05477k4651K22338o4996C8146a68340B2758J96298
18121B19056D5139J22755c50715a50454A66608m3310k7580D7767a2435k0809k669
18110c5913r6724B32308b52159r1298J34832A73524e2219k3121c7474c381j0333
18099a3714k20066B27056E8232n95r415a65686C04484b76538F16250f6417m7753
18088a14170R04A2236J06791a20464e0072q659j27539m6840h2062G3056g2569
18076f3133p1748n162J6915A7434g9634b7800j69982e3584J6733A32078a79796
$$ plain form
18153 -46208 28323 -293983 91240 -103447 -45845 -192319 -146073 -108922 -112245 124036 190478
18142 190478 160093 -217477 -273260 4879 111889 -263989 53913 -241551 118515 -378210
18131 319179 221097 -112483 105477 80826 303164 238168 38146 -168340 22758 219056
18121 219056 45139 167894 -350715 -150454 166608 123298 95718 47767 -12435 -33244 -35913
18110 -35913 -132637 232308 -252159 -343457 -208625 173524 -52219 -75340 -37474 -3381 -13714
18099 -13714 -233780 227056 58232 57637 48222 -165686 304484 -276538 616250 -66417 -114170
18088 -114170 -113266 12236 119027 -120464 -50072 -58731 -186270 -233110 -82062 73056 -72569
18076 -63133 -134881 -140043 -123128 17434 -79634 -27800 -197782 -53584 -36851 132078 -179796
18064b82926J7019C05416A8959f7676j40889a04246j07820k99876e9964J8183
18054d1781j28520k46852J0538a32129H6049J10092d2595A10076f7960D9960M1707
18043I1667a72030j54258a21591A201a6080q8735k55099J42068d4919C1872a5955
18031d5881B37904a0082n3103J9154I5869K8626a19781e1129A60477a16813e6914
18019a42287G6188J68792C3803b4398A9841P7669J43022j17079A813J8716K70034
18008B90563m1863J87317a58045P2494B00190a47826A54176a22163M4071j45371
17998b23463c005k57460A84272D6170J8215b4128r1464C89500c53086A14372K73923
17987C88295C1932R1888c70312a6412k977E9667K18386r3122h8459C8726J21265
$$ plain form
18064 -282926 -265907 305416 18959 -67676 -208565 -104246 -212066 -511942 -59964 -41781
18054 -41781 -170301 -417153 -406615 -132129 86049 196141 -42595 110076 -67960 49960 91667
18043 91667 -172030 -326288 -121591 1201 -16080 -104815 -359914 -217846 -44919 31872 -15955
18031 -45881 237904 -10082 -63185 -44031 95869 124495 -119781 -51129 160477 -116813 -56914
18019 -142287 76188 244980 33803 -24398 19841 97510 240532 123453 1813 20529 290563
18008 290563 248700 436017 -158045 -85551 200190 -147826 154176 -122163 -78092 -223463
17998 -223463 -3005 -260465 184272 46170 64385 -24128 -115592 389500 -353086 114372 388295
17987 388295 31932 123820 -370312 -16412 -19389 59667 278053 184931 -88459 38726 159991
17976A59991J04125a26762D759P1846d35856A4683e35123b57243B537J96051d8378
17964c8981l14514C82478j69485Q4208G4388f252j30310e8130j40708B4862L79748
17953D04610f1082F9869c51286I6578M0448e01478f8421q392l1926j52774A14527
17941A16238a84026j58786J56894A72018a99890e1713j21583j64691C6066a37965
17930a26592L2302M1607B8828K3285f2515E879N7546A6992R3115N2761d19846
17918A45306p0516n238N0123R7004D4432b8413B42505j09592a69166c296j30210
17907a33506J3652F1520K19964b9380n3488K3013E779a65448K7826L1993L4335
17896g1294A51662F1732p421J01602a73197B958a05263A15630H559Q6769M0301
$$ plain form
17976 159991 264116 -126762 4759 76605 -435856 14683 -535123 -257243 2537 198588 -48378
17964 -38981 -353495 382478 212993 297201 74388 -6252 -136562 -58130 -198838 24862 404610
17953 404610 -61082 69869 -351286 96578 137026 -501478 -68421 -76813 -108739 -261513 114527
17941 116238 -184026 -342812 -185918 172018 -199890 -51713 -173296 -337987 36066 -137965
17930 -126592 -94290 -52683 28828 52113 -62515 5879 63425 16992 110107 162868 -419846
17918 145306 74790 69552 119675 216679 44432 -28413 242505 132913 -169166 -3296 -133506
17907 -133506 -119854 61520 281484 -29380 -82868 -59855 5779 -165448 -137622 -105629 -71294
17896 -71294 151662 61732 54311 155913 -173197 2958 -105263 115630 8559 95328 135629
17885A35629n6450J09618a79213A10650c56508J75893n1818A38837a51444C6397
17874a95348B45254F9636a26946C08288c6473J1113j9617A10717J16251J13240
17864C40208D7395J0630M1881c08042A45528b02088A96901H6556b65281a08460
17853i8226F1719h2753r7498C07868a15199c6500A71726a78869I0146a20066q9633
17842b09699k77316E3641b9612A00501P2570c31824E1389J04200a33706k9913
17832a63619k51035F586L32489j31212g3774o6116A3110J77860b03839A2514b00513
17820b46710m7559b6495H26i748l69279C48134B4210Q550O2051J50731a9953j51607
17808a71560A87903d457A16672P7902a44534a9938q0351K8509D2606P3891a56193
$$ plain form
17885 135629 79179 188797 -179213 110650 -356508 -180615 -232433 138837 -151444 36397
17874 -195348 245254 69636 -126946 308288 -36473 -25360 -44977 110717 226968 340208
17864 340208 47395 58025 99906 -308042 145528 -202088 196901 86556 -265281 -108460
17853 -98226 61719 -82753 -180251 307868 -115199 -36500 171726 -178869 90146 -120066 -209699
17842 -209699 -487015 53641 -29612 100501 173071 -331824 51389 155589 -133706 -163619
17832 -163619 -414654 6586 339075 207863 -73774 -139890 13110 190970 -203839 12514 -200513
17820 -246710 -294269 -26495 826 -9748 -379027 348134 24210 32760 94811 245542 -19953 -171560
17808 -171560 187903 -4457 116672 194574 -144534 -19938 -100289 -71780 42606 116497 -156193
17796I9723k6404i2713A44085a06982M4624n1593L4752d476C5950f7979B8720
17784c533G2774B6132a90818B23222B9913h9520A02028f856E0328R4185j9096
17773A25417Q9073k800D9721M3118J4407h8391J1277j07490J5412C56021c38211
17761a51212D5530N0531l8442J70341N0933b00307A35668J68754I6882Q0003b6456
17749A42922K66197a0042A76461g1991D854c95349A55076R6101C2107h4874C6035
17737F0316J09010C1201b7015B8190b06336d9943j00162a2355A3120f5476L1107
17726c4369p5267l82608K06821A60165F2251J00054i4994I3584J02267O8017B2682
17714A45775b13746B34083F4304Q2182c08637j21291A71431g6440D5069a38561
$$ plain form
17796 99723 73319 -92713 144085 -106982 -62358 -113951 -79199 -4476 35950 -67979 28720
17784 -3533 72774 26132 -190818 223222 29913 -89520 102028 -6856 50328 144513 125417
17773 125417 214490 211690 49721 92839 107246 -88391 -77114 -184604 -169192 356021 -338211
17761 -151212 45530 96061 57619 227960 278893 -200307 135668 304422 96882 176885 -26456
17749 142922 409119 -10042 176461 -71991 4854 -395349 155076 251177 32107 -84874 36035
17737 60316 169326 31201 -27015 28190 -206336 -49943 -150105 -12355 13120 -65476 -34369
17726 -34369 -109636 -492244 -285423 160165 62251 162305 -94994 93584 195851 263868 22682
17714 145775 -213746 234083 64304 146486 -308637 -429928 171431 -76440 45069 -138561
17703A6014a21352D971c99287c6313m0401I2429a92479I826K71392P511a90464
17691c10974E3176a78049J448A79260n2422A2833J23257k0543N0040c4366N661
17680b8705a3939k59301d1966j89848b6406g474B81586l7330i3790A86748a19746
17668A465c62121I2321h7896B44522D1586a25402E2410a89958C1155b24840A17061
17656a29995l0160A95725b9956G7909P0423e9570j35052A1030P9311C4853d4140
17644H3909g0120K4291A03856g4453B3785a27470B54231a09729C16412c02401
17633A28320P8297G5306K10121n6623A04404O7724f7917A99631a45190L7561c7520
17621H2297J4609m7073K6071d6472o0241a6117l70910P5401j3044B18096g3792
$$ plain form
17703 16014 -121352 4971 -399287 -36313 -76714 92429 -192479 9826 281218 288729 -190464
17691 -310974 53176 -178049 -176601 179260 126838 12833 136090 115547 165587 -34366 -28705
17680 -28705 -13939 -273240 -41966 -231814 -26406 -7474 281586 244256 -93790 186748 -119746
17668 1465 -362121 92321 -87896 244522 41586 -125402 52410 -189958 31155 -224840 117061
17656 -129995 -160155 195725 -29956 77909 148332 -59570 -194622 11030 90341 34853 -44140
17644 83909 -70120 -45829 103856 -74453 23785 -127470 254231 -109729 316412 -302401
17633 128320 206617 75306 285427 228804 104404 172128 -67917 199631 -145190 -107629 -37520
17621 82297 96906 49833 75904 -46472 -106713 -16117 -387027 -311626 -324670 218096 -73792
17609F2105r567d038r0879I2164m1289A8809K33330H1780e2237j09026n0135B74760
17596B18498A7367R3771e1061p7105q4619A97542a88583A8294N8252a09135k33965
17585c43100A8565b60870c4739B61945j18752g8865f596B52513o4557b67228J11649
17574a55579A07333e9192C3701f1559q8702f4188B09160n7836C5480J03440L430
17563A42350o683j2476b9899A9429b74063a03412B27483J62229b7579o0655k42883
17552c31117B45373a02241I7871J73946a13622J0880H9832h7396A27823J26557
17542B54380d0745J8318o7333b7530C87089j82965a24023B03769C1004L85078
17532D16082c6027D0301L22377A08966a05452H2979b64713n3014A96741A080a44640
$$ plain form
17609 62105 52538 -4038 -94917 92164 50875 18809 252139 81780 -52237 -161263 -211398 274760
17596 218498 17367 111138 -51061 -128166 -212785 197542 -188583 18294 76546 -109135 -343100
17585 -343100 18565 -260870 -34739 261945 143193 -78865 -6596 252513 187956 -267228 -155579
17574 -155579 107333 -59192 33701 -61559 -150261 -64188 209160 151324 35480 138920 142350
17563 142350 135667 123191 -29899 19429 -274063 -103412 227483 389712 -27579 -88234 -331117
17552 -331117 245373 -102241 97871 271817 -113622 -102742 89832 -87396 127823 254380
17542 254380 -40745 -22427 -89760 -27530 387089 204124 -124023 203769 31004 416082
17532 416082 -36027 40301 362678 108966 -105452 82979 -264713 -317727 196741 1080 -144640
17520B67410C0796J12190I074J26178K54713E1222J48925l8215b22744A61693
17509c9235A76126K4922B2512b4054A59845n2730i449B61518C0931a05572D5424
17497e2132H450d9839D64351a08800K2751H3885l0575P7877J47778B9132R8484
17486A27616C7724L9771E735K44234f3270C9618J80179r4758K82839o7818K8619
17475C68679F0040J82481H1187l3004J51422N4708i633C17458G298K70986J2243
17464B90527C1353K18790A16633C7020K23085o421D6580M69496A1385K36616K75132
17453E23133k47809f2071G3711d7879A37205E0050K32677G7880P9573M9513B431
17441A50188H831b1544A85109K18386m7535o8879m3865M6254K705j38122J668
$$ plain form
17520 267410 30796 142986 9074 135252 389965 51222 200147 161932 -222744 161693
17509 -39235 176126 201048 22512 -24054 159845 107115 -9449 261518 30931 -105572 45424
17497 -52132 8450 -49839 464351 -108800 -86049 83885 53310 131187 278965 29132 127616
17486 127616 37724 77495 5735 249969 -63270 39618 219797 125039 407878 340060 368679
17475 368679 60040 242521 81187 48183 199605 254313 -9633 317458 7298 278284 290527
17464 290527 31353 250143 116633 37020 260105 253684 46580 516076 11385 248001 523133
17453 523133 275324 -62071 73711 -47879 137205 50050 282727 77880 157453 206966 2431
17441 150188 8831 -21544 185109 403495 355960 287081 243216 289470 292175 154053 155721
17430A55721L32740b9561B85300j2747j4223j24333K91241k12202J75269j46698
17420B41607i2613B56936q2182j8408L9318a04125B60853D8876K48238A27842
17409C33003j27213J11607k9512K00783A09667M70639D493J87702J40596p2427
17399B60364q6805l3999P4372B2675K01451J79219A58051J82573o7443j01545
17389A71636J66678J9494E1107J11186i2660C1506J20360J04258n6843O958M6008
17378B52247p2388m2278c87893a88082D84272A96735K53741R5942A40734j0839
17368A29895a11331F291f315A03937J71638L5071n8302R4082A9344b9153B03672
17356B27691M9134J81194j81838J13929j888C2474d5834A91816b08775c5095A8284
$$ plain form
17430 155721 488461 -29561 285300 272553 258330 133997 425238 213036 388305 241607
17420 241607 -92613 256936 174754 156346 195664 -104125 260853 48876 297114 127842
17409 333003 205790 317397 287885 488668 109667 580306 4493 192195 332791 260364
17399 260364 173559 139560 213932 22675 224126 403345 158051 340624 273181 171636
17389 171636 338314 357808 51107 162293 -92660 31506 151866 256124 199281 206239 252247
17378 252247 179859 137581 -387893 -188082 484272 196735 450476 546418 140734 129895
17368 129895 -111331 6291 -6315 103937 275575 310646 252344 346426 19344 -29153 203672
17356 227691 276825 458019 276181 390110 388222 32474 -45834 191816 -208775 -35095 18284
17344B49877H3293J76755r4088F1615J6701J57240a47347C71394j35171R27l7234
17333A99916k4136g0099C76165b15846a6299C81238A18191M986n2391h794A3875
17321I2222B9914J79825n259p7366M12102a3589B06943C1060J33553c351A82216
17309A05855b4983j80555A97670K18582j67638j15096l9694L5601L059O0438J23091
17298C16013A21242R6456D6385Q3643J19204j7749l2151j8855h3091A88918b293
17286B20842j2994P1397A18116O9730b9587G6704Q6909k2910J1262K37940D6084
17274A11571J56058J29982j83896J27343d9794B02574o0306J28057J4170M6740
17264C31235a72063A55787J59170G0818c3663H7864J27708p975a89690C17836
$$ plain form
17344 249877 83293 260048 165960 61615 78316 235556 -147347 371394 236223 237150 199916
17333 199916 175780 -70099 376165 -215846 -16299 381238 118191 123177 70786 -8794 13875
17321 92222 29914 209739 204480 127114 539216 -13589 206943 31060 164613 -3351 182216
17309 105855 -24983 -205538 197670 416252 248614 133518 93824 129425 132484 192922 316013
17298 316013 121242 217698 46385 130028 249232 231483 199332 180477 -83091 188918 -2293
17286 220842 207848 279245 118116 187846 -29587 76704 163613 140703 151965 389905 46084
17274 111571 267629 397611 213715 341058 -49794 202574 142268 270325 284495 331235
17264 331235 -172063 155787 314957 70818 -33663 87864 215572 207597 -189690 317836
17253B64331l4953C4720O3520J68630K16569A76094J51194A45459r828J49770
17243B85401C9462L80246j82874q6009e4859A68568J53902j22721a10789c5352
17232D27831b7944B30626K32437A3854c6901B99882B568M04446A15743J62954
17222B78697i528A261N6319L10853j00467G9902J89531g69D3165j288J38463p2276
17210A08064L68111Q5198A33413L06885j69487h8327C13071a41171D01771p6053
17200C25718j35227o6920K52099A64556J29194o2103j4617Q3765o6114a51945
17189B73366m3874J83590M0848q5762j60319o371R8774J99947B09349E8652L04308
17178C62960b6106B50982l6536K52423A73722p0076J24962J62060A78157M4153
$$ plain form
17253 264331 229378 34720 98240 266870 483439 176094 327288 145459 135631 285401
17243 285401 39462 419708 236834 150825 -54859 168568 322470 199749 -110789 -35352
17232 427831 -27944 230626 463063 13854 -36901 299882 2568 407014 115743 278697
17222 278697 -9528 1261 57580 368433 267966 79902 269433 -769 43165 41877 180340 108064
17210 108064 476175 561373 133413 440298 270811 -88327 313071 -141171 401771 325718
17200 325718 190491 123571 375670 164556 293750 231647 217030 300795 234681 -151945
17189 273366 229492 413082 453930 368168 207849 201478 300252 500199 209349 58652 362960
17178 362960 -26106 250982 214446 466869 173722 103646 228608 390668 178157 222310
17168B22310l4878H0345A4604J72123k9278J55146a14775B93434K9668l4115C817
17156b8150F81611C04451j22866L06978K0426B34027R7540Q2171A93938r5992
17146I7946J17170K40805A74946J00814A32566J45011j18606K17701j44807j11085
17136A20780L01231j57292p2805J36855A57765M37264q7118j58614L06389A27751
17125C97157I7767R1518L43906B11276p2205m375Q9942K07639P5709B05281q9822
17114A15459J42676j14700E6378M30533B10510R6993j42958G2990Q112L12493
17104C93595N9605J25100k5792j36346k6306p6107m2440Q2405D6385L40014j8701
17093C67698L49578A56412J17806K79752B45632J87937J22760j36844K71535A37217
$$ plain form
17168 222310 187432 80345 14604 186727 157449 312595 -114775 293434 323102 288987 3817
17156 -28150 681611 304451 181585 488563 508989 234027 331567 413738 193938 97946
17146 97946 215116 455921 174946 275760 132566 277577 158971 376672 231865 120780
17136 120780 422011 264719 191914 328769 157765 595029 507911 349297 655686 127751
17125 397157 97767 189285 533191 211276 139071 134696 224638 432277 507986 205281 115459
17114 115459 258135 143435 56378 486911 210510 307503 164545 72990 81102 393595
17104 393595 453200 578300 552508 416162 389856 313749 271309 353714 46385 386399 367698
17093 367698 717276 156412 274218 553970 245632 433569 556329 419485 691020 137217
17082B88306J86380j15063K71019k01988r1829A67278J30425L0755N8154J10837
17072D97449j0008j9043j74570K01744B06091J78219A51089M05029K6899r4364
17062D88653j60917M0335L32577L2483k38536k14727K19492j88250N4521n1293
17052C14338P1349L78270l32940q5103r2228M00742B10338K50262L7044M8929
17042E46573A94982O17753B17874M98917j91615P1581j2064A89655J37811K20952
17032E48418P0675k66773m9040q9269N74011k32774J22104P8822k14379j04583
17022D37212J51660j06479K37536r8544J87734j0239k16709L8178L978K2334n7999
17011E88662R5322k77243N1031K99365J40273l42766M06330l04095k20552K97701
$$ plain form
17082 288306 474686 359623 630642 428654 336825 167278 297703 328458 386612 497449
17072 497449 487441 468398 293828 495572 206091 384310 151089 556118 583017 488653
17062 488653 327736 368071 700648 733131 494595 279868 499360 311110 365631 314338
17052 314338 385687 763957 431017 345914 253686 654428 210338 460600 497644 546573
17042 546573 194982 812735 217874 716791 525176 596757 584693 189655 327466 548418
17032 548418 619093 352320 303280 214011 788022 555248 677352 756174 541795 437212
17022 437212 588872 482393 719929 621385 809119 798880 582171 620349 624327 646661 588662
17011 588662 683984 406741 457772 757137 897410 554644 960974 656879 436327 734028
17001G34028l16806N33417k01867J2594C45125N82707m29879K5037R9535K56542
16991H79067j33751J3858k20764N03290m82677N01881j02722k20538j77511r0165
16981D69968M1209K80802N9272J53945m03521J28109N1135P3400k80545K24613
16971G98387P6397K8342r3938j00097Q9909n0758K29536l15949J20556j83842
16961E98543J60541K39085l39377J56566Q9427L81894l25306j84216J96808l2667
16951I41298J7147m3257L3494L7459K12371l67505K88899J39117k57086j84161
16941H17776L05508l69098M53059n4825j68893j89945M11073J67668k38333j74614
16931I59376O0665k56609K78071j48196M95968m46701J68741l6482R0898k0735
$$ plain form
17001 734028 417222 950639 748772 761366 345125 927832 497953 522990 622525 879067
16991 879067 745316 759174 538410 1041700 559023 1060904 958182 737644 560133 469968
16981 469968 511177 791979 851251 1005196 601675 729784 780919 854319 573774 798387
16971 798387 874784 903126 809188 709091 799000 748242 977778 661829 782385 598543
16961 598543 759084 998169 658792 815358 904785 1286679 961373 777157 973965 941298
16951 941298 958445 915188 948682 986141 1198512 831007 1119906 1259023 1001937 817776
16941 817776 1123284 754186 1207245 1152420 983527 793582 1204655 1372323 1133990 959376
16931 959376 1020041 763432 1041503 893307 1389275 942574 1111315 1074833 1165731 1144996
16921A144996j32364J49012J26573j96178L77703j74189L26239j89122m1997k3600
16911A367073J98736j77331J21735r880l71419J83198J33281K65737K8980o71060
16901A069050K93433R4952N99835n81585m1845J06336k3528M2492q0828K57850
16891A736162l18378L55959l2974K94311l71284R6514K9548k6809O6935n9710
16881A770274J94234r3250J43357l65769L71451K76500l56577J46123J98859j47960
16871B137242L9807k47085l5390N09112o00328K44517L89054n6795j51451j16716
16861B111967L33086l4048k8841J46218j17442p5218K92099M2116j61368K0882
16851B529451J44061R9460j63124K54472j66624L02789l2893J78648k02476L7239
$$ plain form
16921 1144996 1012632 1161644 1288217 1092039 1469742 1295553 1621792 1432670 1390673 1367073
16911 1367073 1565809 1388478 1510213 1500333 1128914 1312112 1445393 1711130 1740110 1069050
16901 1069050 1362483 1457435 2057270 1475685 1433840 1540176 1516648 1559140 1478312 1736162
16891 1736162 1417784 1773743 1740769 2035080 1663796 1760310 1789858 1763049 1829984 1770274
16881 1770274 1964508 1871258 2014615 1648846 2020297 2296797 1940220 2086343 2285202 2137242
16871 2137242 2177049 1929964 1894574 2403686 1803358 2047875 2436929 2380134 2228683 2111967
16861 2111967 2445053 2411005 2382164 2528382 2410940 2335722 2627821 2669937 2508569 2529451
16851 2529451 2673512 2772972 2609848 2864320 2697696 3000485 2967592 3146240 2943764 2981003
16841B981003o208J1261L42549R7788J2583o2810l59974K77778J79828R7945L13365
16830C885108k12302J42595m71L9787K37213K8751j42730P6552K00662r2020K21964
16819D385109N9677K33349m37949J51508Q9658K25902J37746L8349J88689L34476
16809E406514k12176K34338Q4632o9317M60516k19102R897M13013L22348k16378
16799F214285P2611J70155L12171L37857l60482M86808j95996L03323L10814l6521
16789G615025N26086r579L38207J17591J70356J80680M65902J07612L36011J16379
16779I964270J98434L67086K31435M29984L79144K93040O0004P93471j19594M04286
16769A3001560N83011M19669K93959N23356K02824O40027N73328K57057J042716
$$ plain form
16841 2981003 2974795 2986056 3328605 3426393 3438976 3376166 3016192 3293970 3473798 3571743 3885108
16830 3885108 3672806 3815401 3814930 3854717 4091930 4120681 3977951 4054503 4255165 4163145 4385109
16819 4385109 4444786 4678135 4240186 4391694 4481352 4707254 4845000 4883349 5072038 5406514
16809 5406514 5194338 5428676 5513308 5443991 5904507 5685405 5695302 6108315 6430663 6214285
16799 6214285 6286896 6457051 6769222 7107079 6746597 7233405 7037409 7340732 7651546 7615025
16789 7615025 8141111 8131532 8469739 8587330 8757686 8938366 9404268 9511880 9847891 9964270
16779 9964270 10162704 10529790 10761225 11191209 11570353 11863393 11923397 12716868 12597274 13001560
16769 13001560 13584571 14004240 14298199 14821555 15024379 15664406 16237734 16494791 17537507
16760A7537507P16460O22787L91445N38397P59157Q80892M86223Q84055R25540
16751B3742463J122933Q89391J123390J388195J224021J182927J291703J489879
16743C3454902J556947J458778J914896J477252K211743J943089K332603K505645
16735D8855855K842746K607480L013286L097584L688248L249473M403692M177153
16727G5935517M297201N038694N259309N271134O187778O185389O647818O828633
16719A21651473P459301P042226P808814P556012Q355413P147611P185660O591742
16711A80798252O451867N241530M674117L449731J802819O33745p08825j887157
16703B00456079k999957m494284n423458o024948o797251p536882p512562p672275
$$ plain form
16760 17537507 18253967 18876754 19268199 19806596 20565753 21446645 21932868 22816923 23742463
16751 23742463 24865396 25754787 26878177 28266372 29490393 30673320 31965023 33454902
16743 33454902 35011849 36470627 38385523 39862775 42074518 44017607 46350210 48855855
16735 48855855 51698601 54306081 57319367 60416951 64105199 67354672 71758364 75935517
16727 75935517 80232718 85271412 90530721 95801855 101989633 108175022 114822840 121651473
16719 121651473 129110774 136153000 143961814 151517826 159873239 167020850 174206510 180798252
16711 180798252 187250119 192491649 197165766 200615497 202418316 203052061 202343236 200456079
16703 200456079 197456122 192961838 187538380 181513432 174716181 167179299 159666737 151994462
16695A51994462p743300q060322p162274p242616p207530o617762o155609o154772
16687I5650277n159673o008338m716863m546856m298600m154037m125982l314965
16679E9324963l273594l364175k676786k614204k751312k180753k338319j903150
16671C8222670j883385j684897j625904j607937j433780j251097j211586j049263
16663B6474821j323253p60085j135101r37979q10487q87906r44966m57557r06057
16654A8311430n66589r23162k91791p66186m84141m51857l59238k44145p50375
16645A3473946n45672l25024l89403n63065j63130m68400k58836j69938m05380
16636A0185098o69646J16094l51502n92202K38336M8754n88255l43445K9932o61233
$$ plain form
16695 151994462 144251162 136190840 129028566 121785950 114578420 107960658 101805049 95650277
16687 95650277 90490604 84482266 79765403 75218547 70919947 66765910 62639928 59324963
16679 59324963 56051369 52687194 50010408 47396204 44644892 42464139 40125820 38222670
16671 38222670 36339285 34654388 33028484 31420547 29986767 28735670 27524084 26474821
16663 26474821 25151568 24391483 23256382 22318403 21507916 20620010 19675044 19217487 18311430
16654 18311430 17744841 16821679 16529888 15763702 15279561 14827704 14468466 14224321 13473946
16645 13473946 12928274 12603250 12213847 11650782 11487652 11019252 10760416 10590478 10185098
16636 10185098 9515452 9631546 9280044 8687842 8926178 8974932 8386677 8043232 8073164 7411931
16626G411931K18404k95389J81179n65703l12234J69674o00949l0042q3618j42477
16616E950776K82530o34809o7638j4457l12796P3398l30646L30987j05815p29925
16606D441605l200K81974k12562l7471k49001k26335O07883n38447l83536K09654
16596C890564K0789j22541j93569K91370l29596n1512q7181L55939q12065M22820
16586C385018k02255k2765m0819K39821m36186j03845L15902m03262N9183M22764
16576C213556j087321O27988j90827n2877l06366L05165k92242N50155o98083
16567B069148L09719m2463j45763K83643k48586K75569p15991K79254j8950j04143
16557A941437K44317m58502L79354P5055p0549k43163j46093K81035j50821K76212
$$ plain form
16626 7411931 7630335 7334946 7516125 6950422 6638188 6807862 6206913 6176871 6093253 5950776
16616 5950776 6233306 5598497 5530859 5516402 5203606 5277004 4946358 5277345 5171530 4441605
16606 4441605 4438405 4720379 4507817 4470346 4221345 3995010 4602893 4064446 3680910 3890564
16596 3890564 3911353 3788812 3595243 3886613 3557017 3505505 3418324 3774263 2962198 3385018
16586 3385018 3182763 3159998 3119179 3359000 2922814 2818969 3134871 2731609 2790792 3213556
16576 3213556 2126235 2754223 2563396 2510519 2204153 2509318 2217076 2767231 2069148
16567 2069148 2378867 2336404 2190641 2474284 2225698 2501267 1785276 2064530 2045580 1941437
16557 1941437 2185754 1727252 2106606 2181661 2111112 1867949 1721856 2002891 1852070 2128282
16547B128282l91028K35184n21363L67990k79497k7539K42701m5256l21938L0446
16537A417982K31570k42847L01674l79112j24275M77389k81748K34296j50754
16528A484175j93149K66829o5549k84631m7800J14844j50276J64065n3161m06
16518A234941K01609m29876M5013J0559K34473m28724K62818O3712J77983m52436
16508I20072L70490k7288P1087l40898J52826m6001k05634N35382p04642M37307
16498A162701k99139l7845J21069L45449l80603p9461J10698K9782J18259j13527
16488I77383k53177K18641m9425l34513L9910J89818N4029j02238K3096J51113
16478I14637J79853j82689j15120r5270K21674M78485m28355m1546j28036J18351
$$ plain form
16547 2128282 1737254 1972438 1451075 1819065 1539568 1512029 1754730 1709474 1387536 1417982
16537 1417982 1649552 1406705 1708379 1329267 1204992 1682381 1400633 1634929 1484175
16528 1484175 1291026 1557855 1492306 1207675 1159875 1274719 1124443 1288508 1235347 1234941
16518 1234941 1436550 1006674 1051687 1062246 1296719 867995 1130813 1194525 1372508 920072
16508 920072 1290562 1263274 1334361 993463 1146289 1100288 894654 1430036 725394 1162701
16498 1162701 863562 825717 946786 1292235 911632 832171 942869 972651 1090910 977383
16488 977383 724206 942847 893422 558909 598819 788637 842666 740428 763524 914637
16478 914637 1094490 911801 796681 701411 923085 1401570 973215 931669 803633 921984
16468I21984j41296q1219k29920L23880M1497o6608k05877J3819J59392J35749
16458H71401k13481L3291B47550Q5038J65620j5778J27059J62855k0060k72087
16448D80197l2223j21282K25980P6722B61723Q649J58863O1522K24336k65707
16438D49386n0924K87986l32170L3478K67528k01188K09388B31534n8570M7928
16428B20892P3860J09077M1248j30101J1603K18761j09060A43568L74759G9149
16417C63746P0900q5675j32586L2687a3530F74593j27469O6324a60027D36463
16406B46895G2698M95736J11254j99950L3670j98042J04936J67603j61400o5328
16396C61177P7377r3720A03202M25040B02235K7059K32205A99416K68386A28268
$$ plain form
16468 921984 780688 699469 469549 793429 834926 768318 562441 576260 735652 871401
16458 871401 657920 691211 247550 332588 498208 482430 609489 772344 752284 480197
16448 480197 447974 326692 552672 629394 261723 270372 429235 490757 715093 449386
16438 449386 398462 686448 354278 387756 655284 454096 663484 231534 172964 220892
16428 220892 294752 403829 445077 314976 326579 545340 436280 143568 518327 79149
16417 363746 434646 348971 216385 249072 -13530 674593 547124 613448 -160027 436463
16406 246895 72698 568434 679688 479738 513408 315366 420302 587905 426505 361177
16396 361177 438554 344834 103202 528242 202235 229294 461499 199416 467802 128268
16385C14305K72424P4547C21459L1983Q0384A94671J52285j41643M04503j83451
16375D26365a90240C65484e3112B79882R9568r776h837C92927j54375G607K08121
16364B15728K7875K42674d7010A06639K52806j05673f5077E70436j48707A56122
16353I0874K77149l0054K2211A16611J60510A26965L28323m4617j12823o3458
16343B34390L06261N5810k41898A34948J54204j12175J25259d0304D15470f9341
16332A56373M8600m3907E5390M33682A0498J4867R4823J00816D4590r228J60251
16321A95613C1162K30810H8187K01070A29058l7653J46047E6307J45536R6292
16311B98135a87896A19317K87598G124L9112J15985N7504K0375f0910A32492O3913
$$ plain form
16385 314305 586729 661276 321459 353442 433826 194671 346956 205313 609816 426365
16375 426365 -190240 365484 -53112 279882 379450 369674 -8837 392927 238552 7607 215728
16364 215728 243603 486277 -47010 106639 359445 253772 -65077 570436 421729 156122
16353 90874 368023 337969 360180 116611 277121 126965 455288 410671 297848 234390
16343 234390 540651 596461 354563 134948 289152 176977 302236 -40304 415470 -69341
16332 156373 204973 161066 55390 489072 10498 25365 120188 221004 44590 35362 195613
16321 195613 31162 261972 88187 289257 129058 91405 237452 56307 201843 298135
16311 298135 -187896 119317 406915 7124 46236 162221 219725 240100 -60910 132492 196405
16300A96405K4132p7924n8718J54480h3077B98677j03002I4746J37687o4722p0755
16289I6956Q2267a74625b5791B58922i483H3645d3357C69872B1010I300K52280
16278B61580p2605R2715I0470c35013a45179C65623j23442K8090J74008i4134
16267d5917C68310a60237b2595B31010d739A12397M26989h3460F3675L46396b27537
16255C26566A9532a41800E3816c7471D6105J90188c1532B16712m9219g5977G3414
16243D09558B2358i4698A8234J35949c2089A19885a36112A21385J41420e1978
16232a19217L5352I8876k2859M3862J99331q3296o1490J32163C9021a27652F3034
16220c0239m8247L3742B2135a16331B76694l5128c8120j3684A56642f6180j37532
$$ plain form
16300 196405 220537 142613 83895 238375 -83077 298677 195675 94746 232433 167711 96956
16289 96956 179223 -174625 -25791 258922 -9483 83645 -43357 369872 21010 9300 261580
16278 261580 188975 281690 90470 -335013 -145179 365623 242181 270271 444279 -94134
16267 -45917 368310 -160237 -22595 231010 -4739 112397 539386 -83460 63675 410071 -227537
16255 326566 19532 -141800 53816 -37471 46105 236293 -31532 216712 167493 -75977 73414
16243 409558 22358 -94698 18234 154183 -32089 119885 -136112 121385 262805 -51978
16232 -119217 -83865 98876 76017 119879 319210 235914 174424 306587 39021 -127652 63034
16220 -30239 -78486 -44744 22135 -116331 276694 241566 -38120 -51804 156642 -66180 -203712
16209b03712d8699B76081n2295b25250H1097K18831j38464m5868d9290A25810
16198A04140m6275a68724I3731L80079g8031r8661M6043A27238q755J46835d4785
16186e7486k05107B5523p052K07271B8428K36703A16965b1006B94974l3440j09415
16175A52119g6100I7950Q9534j7322e5275j28187B93836C5876h1938A73762L6534
16164B10296M0730c884C59118B3999g6072A63365A2069K65499A16031M0464b66069
16152A07650c32883B07984J19888c8675A39554c1079I9870a97175E2594F623J56506
16141A63129l3606l5936l5513g0150o9856K478B28423I821O4022b4265j745j08825
16129a34835A94455b0601F8733b17559A02231J28018b04324Q9657k9387E7708
$$ plain form
16209 -203712 -48699 276081 223786 -225250 81097 299928 161464 115596 -49290 125810
16198 104140 57865 -168724 93731 473810 -78031 -176692 -130649 127238 118483 265318 -44785
16186 -57486 -262593 25523 18471 225742 28428 265131 116965 -21006 294974 261534 152119
16175 152119 -76100 97950 187484 170162 -55275 -183462 293836 35876 -81938 173762 210296
16164 210296 251026 -3884 359118 23999 -76072 163365 12069 277568 116031 156495 -266069
16152 107650 -332883 207984 327872 -38675 139554 -31079 99870 -197175 52594 6623 163129
16141 163129 129523 93587 58074 -70150 -140006 -137528 228423 9821 73843 -24265 -26010 -134835
16129 -134835 194455 -20601 68733 -217559 102231 230249 -204324 -114667 -144054 57708
16118a73134j26716C75772b06673G2179Q4469J58638F5964g3022H9564a65837
16107B8287b60937p4119A13005M2748G2463h7895j1501j83801B92903I7799e1437
16095G0019d439C46760E8962J04404e2375F4105K18364j20595F1020a53652H7863
16083F4917N7620L30587b86419b8937k674k96005a8241j63376B25272a59812d2094
16071E0879M0443a19477d9886l11969a34919l5886A04206a21563l639m7761b0017
16059B92922e7835j82245B35006a13721m136m596A40077P9175i9986m6030C78493
16047C28061j16066i4146p3828M8539l5866j54477F9989a74280j32225A28435
16036A00725m5361i596A16462a10672C5944b04658J00426d9450j50096C07008
$$ plain form
16118 -173134 -299850 375772 -206673 72179 156648 315286 65964 -73022 89564 -165837
16107 28287 -260937 -335056 113005 155753 72463 -87895 -99396 -283197 292903 97799 -51437
16095 70019 -4439 346760 58962 163366 -52375 64105 282469 161874 61020 -153652 87863
16083 64917 122537 453124 -286419 -28937 -31611 -327616 -18241 -181617 225272 -159812 -42094
16071 50879 91322 -119477 -49886 -361855 -134919 -170805 104206 -121563 -125202 -172963 -20017
16059 292922 -57835 -240080 235006 -113721 -117857 -122453 140077 219252 -99986 -146016 378493
16047 328061 211995 -94146 -167974 -119435 -155301 -309778 69989 -174280 -306505 128435
16036 100725 55364 -9596 116462 -110672 35944 -204658 -104232 -49450 -199546 307008
16025A39176h437n8341C6170a40955B70567a86649E7443a78632j82970a55310
16014E5329c289E0888O3151a68580C30173a68402B49252i6937E9010B5657c80090
16002d8613D2555c5749r2829l1020j80383J63605C4214C618c4974A7188a65570
15990C8925g6081D5767J27555K6325c71225B2044b02057m9334d4603C51054b36653
15978d32602A42876d911k6030l52807J69407A67915b9994j69514C86156b2783
15967A80727F7199J62634G8287J85035O5498i6529A36212J48830b3305j89573
15957b12878B25165a71789D3866b19509B77052b15685o1617L6142A50900P6115
15947B27015l3518f9999A70540d0264A07904m0285c28585H0764b80416O7327M4183
$$ plain form
16025 139176 -8437 -66778 36170 -140955 270567 -186649 57443 -178632 -361602 -155310
16014 55329 -3289 50888 114039 -168580 330173 -168402 249252 -96937 59010 25657 -380090
16002 -48613 42555 -35749 -128578 -159598 -339981 -176376 34214 3618 -34974 17188 -165570
15990 38925 -76081 45767 173322 199647 -371225 22044 -202057 -251391 -44603 351054 -236653
15978 -432602 142876 -4911 -30941 -383748 -214341 167915 -29994 -199508 386156 -22783
15967 180727 67199 229833 78287 263322 328820 -96529 136212 285042 -23305 -212878
15957 -212878 225165 -171789 43866 -219509 277052 -215685 -277302 -241160 150900 227015
15947 227015 193497 -69999 170540 -40264 107904 67619 -328585 80764 -280416 -213089 -168906
15936a68906D4716d44786b07203E6637a93446f3554a0854j96368N0447A76956
15925b44509A29372J4844b19164A46455b79212J0676D4696P578e30026a12465
15914G6894b81340a7880M030j02336N5066j42145j15698A32370c56340b6664d016
15902g6333B26270A03282a56708N7543A03748d47415A74293k0385e3219j91734
15892b44953A91288C8158a43106C12427d1090B6692J36902A2042b50547i4590
15881d3487A56810o4718M0869b86801b2508C2123a01979j6026m8553A9087J86532
15870B05619a71206q8717A03466D6304A4204a83291B73293D8489N1110L7544a28170
15858i9092E38502d4219l3433A9394q587b32043L3323b7289p5269I9368j0093
$$ plain form
15936 -168906 44716 -444786 -207203 56637 -193446 -63554 -10854 -207222 -156775 176956
15925 -244509 129372 144216 -219164 146455 -279212 -268536 44696 52274 -530026 -112465
15914 76894 -281340 -17880 -13850 -116186 -61120 -203265 -318963 132370 -356340 -26664 -4016
15902 -76333 226270 103282 -156708 -99165 103748 -447415 174293 153908 -53219 -244953
15892 -244953 191288 38158 -143106 312427 -41090 26692 163594 12042 -250547 -94590
15881 -43487 156810 92092 132961 -286801 -22508 32123 -101979 -118005 -166558 19087 205619
15870 205619 -171206 -259923 103466 46304 14204 -183291 273293 48489 99599 137143 -128170
15858 -99092 538502 -44219 -77652 19394 10807 -232043 -198720 -27289 -102558 99368 89275
15847H9275K34500D2867b70506I0919k8211l022a94665g7389A30846E7842b7904
15835A3397a00146B16610F2903g9285j41891c9267B31413b2909j27972A1732a40219
15823E0347M48K40064b26387C52928l1757c6838l07962J23669I155R1155a82431
15811a09939A31625P0815E7591J24077a7199p8216j56381B11572k437i9263P402
15800i1861L8085k09146l67057b72015P3400A01353f2833q193f791B05692b6395
15788a59568j06923M7991p0352k28071A7291a6029j29281r8708E8901c24661B22099
15776a20205r8497M3944b7929j64863A07387a1130j08987G5523B6926d32589i7556
15764F7813b25923F3920l315O3421c94504A15670b59232C3737e399l924B6293
$$ plain form
15847 89275 323775 42867 -270506 90919 62708 59686 -194665 -77389 130846 57842 -27904
15835 13397 -100146 216610 62903 -79285 -221176 -39267 231413 -22909 -150881 11732 -140219
15823 50347 50795 290859 -226387 352928 321171 -36838 -344800 -221131 9155 100310 -182431
15811 -109939 131625 202440 57591 181668 -17199 -95415 -251796 211572 209135 -99263 -91861
15800 -91861 -53776 -262922 -629979 -272015 -198615 101353 -62833 -71026 -6791 205692 -26395
15788 -159568 -266491 -218500 -288852 -516923 17291 -16029 -145310 -244018 58901 -324661 222099
15776 -120205 -218702 -174758 -27929 -192792 107387 -11130 -120117 75523 26926 -432589 -97556
15764 67813 -225923 63920 60605 124026 -394504 115670 -259232 33737 -5399 -9323 26293
15752A55680D225b64648B8113J06237A6919J46989p9769J10069i6830j11455A56578
15740A99763A3697c56489A00347j4668j6849i2814A5336Q7954a63613B75097b53809
15728g9395j46955l0574D6695h0579E9440a02606D9199A3390a0020r4502G5570
15716B29260b17876A09327J8174h1714j95968b726k06102B7126d9706n7390L8529
15705f8567B19386o0274b63510a4171E8357A9009L47569A53147G6185b23945Q8202
15694a35743q426A35998L2614a85093h8475l28983B84364a16673B34423d7653
15683i5469E5739a62867B05547b22776h2261B10977i1462F6758J09992a61360
15672F727R4104b20822D7024a5849G7906b42623R9282j21300A0611P3351b38731
$$ plain form
15752 155680 4225 -264648 28113 134350 16919 163908 84139 194208 -96830 -208285 156578
15740 199763 13697 -356489 100347 85679 68830 -92814 15336 103290 -163613 275097 -253809
15728 -79395 -226350 -256924 46695 -80579 59440 -102606 49199 13390 -10020 -104522 75570
15716 229260 -217876 109327 127501 -81714 -277682 -2726 -208828 27126 -49706 -107096 -68567
15705 -68567 219386 159112 -263510 -14171 58357 19009 366578 153147 76185 -223945 -135743
15694 -135743 -144169 135998 168612 -185093 -88475 -417458 284364 -116673 234423 -47653
15683 -95469 55739 -162867 205547 -222776 -82261 210977 -91462 66758 176750 -161360
15672 6727 100831 -220822 47024 -15849 77906 -242623 -143341 -264641 10611 83962 -238731
15660g8331j9718j35500A26637a36892D9075b18724d6773C09921b86739A30298
15649B60591b54006Q9239j1988N1424F4989a26569b7657F2642a70175e3252j01158
15638a54410B6358b21752c2683D2587L9675a33351b6146J0686E7934b02533b1244
15626G0553g6761O52k3287L1320J1787k10799h813G2846b65663F5837K8777N2203
15614A46817i873k28571i789C7116b16065B40909c9492I5570f221F9394J23396
15603A92790D3998J8735i0334B73712a74129d6800A22464Q4312d8167A09900a27389
15591B62577A9149K83218b71989A211P8288A3036a02960A56283R4311b9616j3057
15580d2673p1839G4678f8311k01695n6801i0121m554A04791g7808q8757L4639
$$ plain form
15660 -78331 -98049 -233549 126637 -136892 49075 -218724 -46773 309921 -286739 130298
15649 260591 -254006 -164767 -176755 -125331 64989 -126569 -27657 62642 -170175 -53252 -154410
15638 -154410 26358 -221752 -32683 42587 82262 -133351 -26146 -15460 57934 -202533 -21244
15626 70553 -76761 -76109 -99396 -68076 -56289 -267088 -8813 72846 -265663 65837 94614 146817
15614 146817 -9873 -238444 -9789 37116 -216065 240909 -39492 95570 -6221 69394 192790
15603 192790 43998 62733 -90334 273712 -174129 -46800 122464 206776 -48167 109900 -127389
15591 262577 19149 302367 -271989 1211 79499 13036 -102960 156283 250594 -29616 -42673
15580 -42673 -114512 74678 -68311 -270006 -326807 -90121 -94675 104791 -77808 -166565 -131926
15569a31926O2462J9872a2395q0409j8872h264k57999b4951E987L81943A61508
15557C79691c30258h7820D5775a62995A11504c8234k4622A08273L6481i1076j26811
15546b17887B32669B865b99978C5038M6023d35291B52862f2484A83602A5730e1157
15534B6891K40762p6667b34335i4397A97225a86520B5926P0209b02352C1472a68511
15522A0310a41337A35502A9049a22271B12554c1692j01508j6776l2255c3101k16617
15511b49718A66669m9720b46810A65985i9915A89945e7234B00655r8708b6894
15500a71744l613A61633B9501J82518a39122H0678d35905D0794a65065O6134j13132
15489b12063C34163A58134E6512R2465a99444P2359i082n0691a8375j647q6208
$$ plain form
15569 -131926 -69464 -49592 -12395 -92804 -111676 -8264 -266263 -24951 5987 387930 161508
15557 379691 -330258 -87820 45775 -162995 111504 -38234 -62856 108273 144754 -91076 -217887
15546 -217887 232669 2865 -299978 35038 81061 -435291 252862 -62484 183602 15730 -51157
15534 26891 267653 190986 -234335 -94397 197225 -186520 25926 96135 -202352 31472 -168511
15522 10310 -141337 135502 19049 -122271 212554 -31692 -133200 -149976 -182231 -33101 -249718
15511 -249718 166669 116949 -246810 165985 -99915 189945 -57234 200655 101947 -26894
15500 -171744 -175357 161633 29501 212019 -139122 80678 -435905 40794 -165065 -98931 -212063
15489 -212063 334163 158134 56512 148977 -199444 -127085 -9082 -59773 -18375 -20022 -106230
15478a06230B03813a58517D526K1955b40317I2187a333j30953o2374d7419I2802
15466d6061r8088A59923q96n5804A5774c292D2586Q7806J73006A18503C943K0577
15454B4520a7107I8352c4459L621n7017b5863E8651J56212o7332A8102c97469
15442C37208b04803c7640E8517a38253j8576C91410b21405I2615K33357b30284
15431a52510A67322O1433F1741a09800A36415b753o0877A00323g1131E6848k6408
15420C0440a43553m0052k00916E8937a45547j13438a22469k6719B33807G1277
15409B08026H2671A0135J27822c02672R6592c6929k0879B19905a19974A65623
15398A52932d9045A70284a09949b4198A52712J40381A06662a49790N1825d1698
$$ plain form
15478 -106230 203813 -158517 4526 26481 -240317 92187 -1333 -132286 -194660 -47419 92802
15466 -46061 -144149 159923 159027 103223 15774 -3292 42586 130392 303398 118503 3943 24520
15454 24520 -17107 98352 -34459 -30838 -87855 -25863 58651 214863 147531 18102 -397469
15442 337208 -204803 -37640 58517 -138253 -156829 391410 -221405 92615 325972 -230284
15431 -152510 167322 228755 61741 -109800 136415 -2753 -63630 100323 -71131 56848 30440
15420 30440 -143553 -183605 -384521 58937 -145547 -258985 -122469 -149188 233807 71277
15409 208026 82671 10135 137957 -302672 -206080 -36929 -57808 219905 -119974 165623
15398 152932 -49045 170284 -109949 -24198 152712 293093 106662 -149790 -97965 -41698
15387h4360l62296D9387f9192m1673A86977a44690G1828B2504J26598c3652B1283
15375c40168g9501I3415b52093a11698j0219M9480A43g2494H4815l0669a22193
15363b94672a7928j1668E5500d7949K2670j98361g3427B59738i3617B16919Q8868
15352C05787b4873k48697J21507G1436e394A54211a77363J1932G3528c5352E5381
15340a03435L7480A27657m4824b42870r173m8107G3399R6094b66222A71637k9440
15329A42197a25748B85213b94818c8603C31860a88001I7474m3495a48369A41231
15318F6637a32613a189p4032r8987D420L02266F6121d7887A3434J04263M7542
15307A65239b85930J25088A46733O683c8318j98452a06182p4394j9837N0872A97925
$$ plain form
15387 -84360 -446656 49387 -69192 -110865 186977 -144690 71828 22504 149102 -33652 21283
15375 -340168 -79501 93415 -252093 -111698 -121917 -72437 143 -72494 84815 54146 -122193
15363 -294672 -17928 -29596 55500 -47949 -25279 -223640 -73427 259738 -93617 216919 305787
15352 305787 -24873 -273570 -152063 71436 -5394 154211 -177363 -165431 73528 -35352 55381
15340 -103435 -65955 127657 82833 -242870 -252043 -300150 73399 169493 -266222 171637 142197
15329 142197 -125748 285213 -294818 -38603 331860 -188001 97474 53979 -148369 141231
15318 66637 -132613 -1189 -75221 -174208 4420 306686 66121 -47887 13434 117697 165239
15307 165239 -285930 -160842 146733 153416 -38318 -236770 -106182 -180576 -200413 -149541 197925
15295A52579g6808E0217J7203a0364A98756P722k1563M23543k21124j87974a97922
15283C81445A59267m9639N2462a5415A48891B5073L4293R6528k477K26111e8408
15271I1098P5007f8712j791H5282K28446r0152r7022c2727l56845P2345I2541
15259B62711j9564p0616J77640A26529A5851J95J50616N067e04020I6134m7571
15248D8563a11125o286H7874J14428n4619d1649B00006O678b69048B74131r030
15237B65101Q4077j12860L7591J58652p9884P21900N55831j85714p9185k8553
15227A336956E42241j19131q3251A15749M30393B37731C8436b58690P3807P9589
15217a05294B80993A16761G697J66253c9731E2059K53554J40996I1045M2421J38805
$$ plain form
15295 152579 -76808 50217 67420 -10364 198756 206478 184915 608458 387334 199360 -197922
15283 381445 159267 109628 162090 -15415 148891 25073 59366 155894 153417 379528 -58408
15271 91098 166105 -68712 -70503 85282 313728 223576 126554 -32727 -389572 -317227 92541
15259 262711 243147 172531 350171 126529 15851 16046 166662 171729 -504020 96134 48563
15248 48563 -111125 -117411 87874 202302 147683 -41649 200006 206684 -269048 274131 265101
15237 265101 349178 236318 273909 432561 352677 1074577 1630408 1444694 1365509 1336956
15227 1336956 542241 423110 339859 115749 546142 237731 38436 -258690 -184883 -105294
15217 -105294 280993 116761 7697 173950 -39731 52059 305613 446609 91045 133466 272271
15206B72271c1756D1125k12f6736k93967B4769c1217a92l43179B98669C1091O1934
15194I3025f7333m4885B2224K43646A21165C9530J11954m9455a31119p054B74406
15182d1057B09561m1693o3698O5722b5636n8418A70317J69679j8729q4461A10322
15170C04638G2269C3416a07722B4097O6471N436b95188C2311a982B57824d62314
15158F1838M0930P6233n3679D4167L73202j90463p2292c30798b7545A61897h1785
15146A62971F7568g2481A41057c6809A42501b4317C67847A13484f9472I5722c97552
15134f644A69934q0464K71028H8224h3642B23280I4007c04407C98985j85002a11720
15122I1957k9145N3173J01559A6295f0666b0534k3229A46405k8406B4520k703
$$ plain form
15206 272271 -31756 41125 40913 -66736 -360703 24769 -31217 -192 -343371 298669 31091 93025
15194 93025 -67333 -112218 22224 265870 121165 39530 151484 102029 -131119 -138173 274406
15182 -41057 209561 167868 104170 169892 -25636 -84054 170317 339996 321267 236806 110322
15170 304638 72269 33416 -107722 24097 90568 96004 -295188 32311 -1982 257824 -462314
15158 61838 102768 179001 125322 44167 417369 226906 154614 -330798 -27545 161897 -81785
15146 162971 67568 -72481 141057 -36809 142501 -24317 367847 113484 -69472 95722 -397552
15134 -6644 169934 89470 360498 88224 -83642 223280 94007 -304407 398985 213983 -111720
15122 91957 62812 115985 217544 16295 -60666 -20534 -43763 146405 117999 24520 21817
15111B1817a9328M869B84444F4939J07902d4837B43450D2442a05517B93362A41614
15099I4672K66445i3666J291I3721a70706A78873K96954E7900B4692Q5145J12818
15088B22655h2867L0383C85536q5910j34808C9405L15742g3751A38614M05176
15078E43790G2541a37706A06314L431e8105C33954O3925q0627f1394b0715C52665
15066b1732q4895B68875Q5646d123A05346m826D6061K07499b20065B0805J63248
15055A84053p8330K50526A69317l4923E3068k99M4951K2754l408a48877c6054
15043B50830m9280G2253J57235a44812B21724I3419P3778L663J90457R6915K5286
15032D83518b82037C45666d0927B69937Q602A09492L28056r8411j66225K32335
$$ plain form
15111 21817 -19328 -14459 284444 64939 172841 -44837 243450 42442 -105517 293362 141614
15099 94672 361117 -93666 -92375 93721 -170706 178873 475827 57900 24692 109837 222655
15088 222655 -82867 -52484 385536 299626 164818 39405 355147 -73751 138614 543790
15078 543790 72541 -137706 106314 109745 -58105 333954 397879 317252 -61394 -20715 352665
15066 -21732 -106627 268875 354521 -4123 105346 100520 46061 253560 -220065 20805 184053
15055 184053 105723 356249 169317 134394 53068 52769 97720 120474 117066 -148877 -36054
15043 250830 201550 72253 229488 -144812 221724 93419 167197 170860 361317 458232 483518
15032 483518 -282037 345666 -40927 269937 278539 109492 437548 339137 172912 405247
15022D05247a03771B98914j27636J1656b85193L9134C93679d8874H5824B1821
15011A42808J29541r9096Q566j4999n4545d968D54862k06095p6701J8387J68873
15000C59326j07576K62785H5355k8586K08489P3434G0792J14244L35326k22435
14990B97927K4400j37003K53339j70430A2830c052C40231a45705L2505B29606
14979B79979r4370p3610l404P920l5447b9031A4289J6411L26741o1926n5035J5040
14967B55520q4895E9409P4519J329n9510B6817K53140E3046J19816C064K70369
14956B73433A03655j9172J62353K72864j02775j68418L9944J81451j23470j392
14946C45040j6088j07737K22934A2175J96637O5850J73591j06591J48110B30706
$$ plain form
15022 405247 -103771 298914 171278 182934 -285193 -246059 393679 -48874 85824 21821
15011 142808 272349 173253 181819 166820 112275 -4968 454862 248767 172066 190453 359326
15000 359326 251750 514535 85355 56769 265258 338692 70792 185036 520362 297927
14990 297927 322327 185324 438663 268233 12830 -3052 340231 -145705 -113200 229606
14979 279979 185609 111999 108595 116515 81068 -29031 14289 30700 357441 295515 240480 255520
14967 255520 170625 59409 133928 135257 75747 26817 279957 53046 172862 3064 273433
14956 273433 103655 84483 246836 519700 416925 248507 288451 469902 346432 345040
14946 345040 328952 221215 444149 12175 208812 274662 448253 341662 489772 230706
14935D48555A71479J4226K93682D6293O8160g6705G1028b2834D27170f4391B17724
14923E90502k41793j42622e4702K3271E66811B58298J72022j01405h740A46090
14912C82992j35127a28052B10922A5891M46722p9579P6330A75820J06371J88241
14902D70432A10912K09658l9598f7367B03327L376r0617M64061k72186l8742I8213
14890D6373K88107J1116J87225n7455A69297J90836A13620K05765j25382J76775
14880C70778m3790M0948A30370L84635j03871L20020l23811n1297j40105L56280
14870E72221F5842L34762J93938j93079K61358A88515K02114A2852K81001Q294
14860C02147J7993M17276k41057R663E6978M5038L77111A07411n646l8521N14346
$$ plain form
14935 448555 171479 185705 479387 46293 114453 -76705 71028 -22834 427170 -64391 217724
14923 590502 348709 206087 -54702 -31431 566811 258298 430320 328915 -8740 146090
14912 382992 247865 -128052 210922 15891 462613 383034 459364 175820 282191 470432
14902 470432 110912 320570 280972 -67367 203327 206703 116086 580147 307961 269219 98213
14890 46373 334480 345596 532821 475366 169297 360133 113620 319385 194003 370778
14880 370778 326988 367936 130370 515005 411134 731154 407343 356046 215941 572221
14870 572221 65842 400604 594542 401463 662821 188515 390629 12852 293853 302147
14860 302147 320140 737416 496359 506022 56978 102016 479127 107411 101765 63244 577590
14849E77590r104A60237J57556M02132l09728j252j41676L28956k59600L03269
14839F39894C19849K41496B72677J31934I0946N29830B09515l8482J58477j24834
14829B04676k4367J43940A19024M16112j72322L55436k2134l34401P2555L7165
14819D71435j0308J11006j17745p6987L11182L8674k39229L05322k85840j68472
14809C39038O1518R3346J57348J05384l67642J6759K12497k01518j54982J867
14799B63615J36754M70056l91349J37608k48700J63706j44950J31439J40853j61689
14789D97343j07053L21805j15834M5978j13424m2915L02240k60538j03407K7713
14779D51908J54322K90800k65810K40366l57826l186J06514J36546l46123J9156
$$ plain form
14849 577590 568486 160237 317793 719925 410197 408945 267269 596225 336625 639894
14839 639894 319849 561345 272677 404611 90946 620776 209515 171033 329510 204676
14829 204676 180309 324249 119024 535136 362814 718250 696116 361715 434270 471435
14819 471435 461127 572133 454388 377401 688583 727257 488028 793350 507510 339038
14809 339038 400556 493902 651250 756634 388992 405751 618248 416730 261748 263615
14799 263615 400369 870425 479076 616684 367984 531690 386740 518179 659032 497343
14789 497343 390290 712095 596261 642239 528815 485900 788140 527602 424195 451908
14779 451908 606230 897030 631220 871586 513760 510574 617088 753634 407511 426667
14769D26667R6207j43327J34627J04241j6203j04171K64994k81931K05612r1216
14759E95500l927j20369L32430k9637k57668j2588j18812M94470m8308k44431
14749E86660k69338L87078J18106J45697D54597R3081q205J43024j30152J20271
14739F72616p0308J46861J66144l80840J13606j81802K18050J44747n7153q1119
14729F90802j81813K11888m1909j6945M1264p748J44345Q3791k98372R8895o1701
14718F62497L77082k85965R545m169O9813Q6160D47546M40497r9053K59646E08683
14706G26315K89224j55550o3164l09522L75803j14911J04944j5286J5468L64718
14696A218039l84793J21123l37749K42370j87796Q9608j5754j79089K29768J87051
$$ plain form
14769 426667 522874 379547 514174 618415 602212 498041 763035 481104 686716 595500
14759 595500 591573 471204 803634 773997 516329 503741 384929 879399 831091 586660
14749 586660 317322 704400 822506 968203 454597 547678 539473 682497 552345 672616
14739 672616 602308 749169 915313 534473 648079 466277 684327 829074 771921 690802
14729 690802 508989 720877 678968 662023 703287 695539 839884 923675 625303 724198 662497
14718 662497 1039579 753614 763159 758990 828803 914963 447546 888043 788990 1048636 508683
14706 726315 1015539 859989 796825 487303 863106 748195 853139 837853 853321 1218039
14696 1218039 833246 954369 616620 858990 671194 760802 745048 565959 795727 982778
14686I82778k13651K37905l58654K49335J3696J05206K39097l60189j24666k1880
14676G48977Q5388J62610k04090J64987J78152j28019K49913l72377L17393r0288
14666A112646j34772R8919n9232L7351N5191k4747K7360j53617J20234N8360k15971
14655I21722k04146K84523J68654j40352P0258j37372M011K38600j74330j08073
14645I23495M55021l62967R5170K01221k5667L1518k58628j93813L32460J57450
14635A355260k98055O0594K5726K17614J04166l56616j06027J21244P1239J43753
14625A338898l30365J22222K33635k8592K9589K4429M9186Q8095k36852J75557
14615A465802j53116K92749N078l42286L62079l34190k5742k8859O863m6729K26473
$$ plain form
14686 982778 769127 1007032 648378 897713 911409 1016615 1255712 895523 770857 748977
14676 748977 834365 996975 792885 957872 1136024 1008005 1257918 885541 1202934 1112646
14666 1112646 977874 1076793 1017561 1054912 1110103 1085356 1112716 959099 1079333 1137693 921722
14655 921722 717576 1002099 1170753 1030401 1100659 963287 967298 1205898 1031568 923495
14645 923495 1378516 1015549 1110719 1311940 1286273 1317791 1059163 865350 1197810 1355260
14635 1355260 1057205 1117799 1143525 1361139 1465305 1108689 1002662 1123906 1195145 1338898
14625 1338898 1008533 1130755 1364390 1335798 1365387 1389816 1439002 1527097 1290245 1465802
14615 1465802 1312686 1605435 1610513 1268227 1630306 1296116 1270374 1241515 1248378 1201649 1428122
14604A428122J62875k74327J54854j10307k03353K42995O5768K26740j05601K00328
14594A788094J11814j89723p331q6916p0080K09014k44990o0224j48011K40609
14584A542256L64610l03572k62677J19430K36475J17595J7994o7764L20482R3521
14574B178350m47323P1872p4010j9006r5542J91071J09093q1842J26233k3425
14564A935471L49990j43464L4311l61260O19366n64669J95227K03314j38066K05184
14554B335404K47763j53956K62450J5546k67819k11431K47043L13238J06405m3368
14544B851275j80740O12972J69706O7561O36391J09846M84008O06311Q04835J102219
14534G264384K425090L388107O738970R976508N740549j4624238q535121k603261
$$ plain form
14604 1428122 1590997 1316670 1471524 1361217 1157864 1400859 1466627 1693367 1587766 1788094
14594 1788094 1899908 1710185 1702854 1615938 1545858 1754872 1509882 1449658 1301647 1542256
14584 1542256 1906866 1603294 1340617 1460047 1696522 1814117 1832111 1764347 2084829 2178350
14574 2178350 1731027 1802899 1728889 1709883 1614341 1805412 1914505 1832663 1958896 1935471
14564 1935471 2285461 2141997 2176308 1815048 2434414 1869745 2064972 2268286 2130220 2335404
14554 2335404 2583167 2429211 2691661 2707207 2439388 2227957 2475000 2788238 2894643 2851275
14544 2851275 2670535 3283507 3453213 3520774 4157165 4267011 4751019 5357330 6162165 7264384
14534 7264384 9689474 13077581 19816551 29793059 35533608 20909370 12374249 9770988
14526I770988l002433k068412q86588m68047l79227k8316o48639K31972k63710
14517B257588J06576J50551j73052J24059j79604K42637k7641k54281L40522l45030
14507B242325N90354j99675j75105J36739K1838J39369k21308K4360K03593J3131
14497B775621k46037K23930J79166P7090K9415l02202K66136K11350j93399q5364
14487B935706k99925M41873J17581j94226N75600m62106O48596j37464l17037
14478C308598L26114l72765K15257J97849J8078R5445P4855L5358l38121J95459
14468C756127l34362M12364J24744J34810N1130J52490j49578k52523J27399L66804
14458D389405k33792K3327J68665J13020J74759m7145k00300J10541J75267K53172
$$ plain form
14526 9770988 6768555 4700143 3813555 3345508 2966281 2937965 2289326 2521298 2257588
14517 2257588 2364164 2514715 2341663 2465722 2286118 2528755 2501114 2246833 2587355 2242325
14507 2242325 2832679 2633004 2457899 2594638 2616476 2755845 2534537 2558897 2762490 2775621
14497 2775621 2529584 2753514 2932680 3009770 3039185 2736983 3003119 3214469 3021070 2935706
14487 2935706 2635781 3077654 3195235 3001009 3576609 3114503 3763099 3625635 3308598
14478 3308598 3634712 3261947 3477204 3675053 3693131 3788576 3863431 3898789 3560668 3756127
14468 3756127 3421765 3834129 3958873 4093683 4144813 4297303 4147725 3895202 4022601 4389405
14458 4389405 4155613 4178940 4347605 4460625 4635384 4588239 4387939 4498480 4673747 4926919
14448D926919p2973k9813K38677m46526M33737j3419J59986k9068J10477j15909
14438E162088N05346l62657J48087o7570J95633L43706j77984M64283q8951O7943
14428F189924k16716J72767J85578J58156L6305J44782j3289k62483K36492N09365
14418G140881m32306M90557k53490l9284M22367L4144M51440l70610J96696K45238
14408G885633K20466j63847K53443o3991J41932M1995N69241k0830k9094M42504
14398I277452J67709j39606J44342n6945J64126M04668j52879J60299P05483k51401
14388A0423248K3247J14203J93417J49776K80809L23242J58811N20981Q8919j74442
14378A2102211J13725N25084n4206m94M56460J60000K17028M86078L54438J95016
$$ plain form
14448 4926919 4853946 4824133 5062810 4616284 5050021 5036602 5196588 5167520 5277997 5162088
14438 5162088 5667434 5304777 5452864 5385294 5580927 5924633 5746649 6210932 6121981 6189924
14428 6189924 5973208 6145975 6331553 6489709 6526014 6670796 6657507 6395024 6631516 7140881
14418 7140881 6708575 7199132 6945642 6906358 7328725 7362869 7814309 7443699 7640395 7885633
14408 7885633 8106099 7942252 8195695 8131704 8273636 8315631 8884872 8864042 8834948 9277452
14398 9277452 9445161 9305555 9449897 9392952 9557078 9961746 9808867 9969166 10674649 10423248
14388 10423248 10446495 10560698 10754115 10903891 11184700 11507942 11666753 12187734 12276653 12102211
14378 12102211 12215936 12741020 12686814 12686320 13142780 13302780 13519808 14005886 14360324 14555340
14368A4555340K31740J93572M86470Q8487L01380L03004l0150M28842L69435P00875
14358A7628995r4725N04017K40225N20527K83615L03947N00727O20395J30588
14349B0638311N52444M33719O57107J48782M57084R48729L57969N52369M23582
14340B5170096O71160Q40680M66404N89443Q57572O91520Q77202M27850P78123
14331C1370050O34763J024377J131025O76644J007114J007469K12036J843749
14323C8907227O67734J211839J480344J077847J532519J083308J409643J620521
14315D8990982J417742J747428J727157J565698J694229K206997J734509K093501
14307F3178243K275614K408742K882338J927867K789763L065677K871418L301748
$$ plain form
14368 14555340 14787080 14980652 15467122 15555609 15856989 16159993 16129843 16558685 16928120 17628995
14358 17628995 17534270 18038287 18278512 18799039 19082654 19386601 19887328 20507723 20638311
14349 20638311 21190755 21624474 22281581 22430363 22887447 23836176 24194145 24746514 25170096
14340 25170096 25841256 26681936 27148340 27737783 28595355 29286875 30164077 30591927 31370050
14331 31370050 32004813 33029190 34160215 34836859 35843973 36851442 37063478 38907227
14323 38907227 39574961 40786800 42267144 43344991 44877510 45960818 47370461 48990982
14315 48990982 50408724 52156152 53883309 55449007 57143236 59350233 61084742 63178243
14307 63178243 65453857 67862599 70744937 72672804 75462567 78528244 81399662 84701410
14299H4701410L311176L339077L753421M012028M408238L794558M812043M825403
14291A16957354N429897M620153O050192O562385N846658O747958P408620P798518
14283A67421735P834198Q449056Q946527J0046347J0033997J0334713J1283712
14276B34350285J1810611J2505129J3202407J3751759J3887692J4184820J4683286
14269C28375989J4565301J4508457J4145424J4008822J2307387J1775306J0875980
14262D20562666R518231Q453645Q005301O825711N246438K355476N48563J348978
14254D62865009R63176p188730o706681r206876j0498587j1769217j1342563j0905103
14246C96210428j2763990j3143616j3507192j3034198j3552895j3611331j3553182
$$ plain form
14299 84701410 88012586 91351663 95105084 99117112 103525350 107319908 112131951 116957354
14291 116957354 122387251 127007404 133057596 139619981 145466639 152214597 159623217 167421735
14283 167421735 175255933 183704989 192651516 202697863 212731860 223066573 234350285
14276 234350285 246160896 258666025 271868432 285620191 299507883 313692703 328375989
14269 328375989 342941290 357449747 371595171 385603993 397911380 409686686 420562666
14262 420562666 430080897 438534542 446539843 453365554 458611992 460967468 461516031 462865009
14254 462865009 463828185 456639455 449932774 440725898 430227311 418458094 407115531 396210428
14246 396210428 383446438 370302822 356795630 343761432 330208537 316597206 303044024
14239C03044024j2927761j2622646j2011767j1627387j1755307j0916097j0770973
14232B20412086j0617770r910774j0637450r277735r013144q377360p733746p400021
14224A47444086o884413o213330n782180n869436n213864n201122m746541l942208
14216A03590992m326317l727778m043175l562607l187427l427690k977493k970919
14208G5367586k382375k799247k537423j963424k160606k258981k271130j535570
14200E7458830j890316j766656j290356k020120j213652j560602j641860r82468
14192D5092800j252584j114028j501899n97860j647973r76444r23506k03311j667937
14183C5207258r87004o29649r56300q60857p84301o65856o78738j056947m36696
$$ plain form
14239 303044024 290116263 277493617 265481850 253854463 242099156 231183059 220412086
14232 220412086 209794316 199883542 189246092 179968357 170955213 162577853 154844107 147444086
14224 147444086 140559673 134346343 128564163 122694727 117480863 112279741 107533200 103590992
14216 103590992 99264675 95536897 91493722 87931115 84743688 81315998 78338505 75367586
14208 75367586 72985211 70185964 67648541 65685117 63524511 61265530 58994400 57458830
14200 57458830 55568514 53801858 52511502 50491382 49277730 47717128 46075268 45092800
14192 45092800 43840216 42726188 41224289 40626429 38978456 38002012 37078506 36875195 35207258
14183 35207258 34220254 33590605 32634305 31773448 30989147 30323291 29644553 28587606 28150910
14174B8150910r24353l27531q10777q26481l72048m98689n97160m69526n46758
14165B2777587l58332l01556r00074j94967n85811l87288k47033l62364l11047
14156A9129115o94616k17817m31150J49049n11548n54588l34869k77021k34433
14147A6022122m11878j01703p9500l45661o06276J06962l95803j87704m23601
14138A3576958Q8721k77940l21404j20516j93726l51924p1601j97214m07112l50158
14128A1374084K49314m90987j84175M978l0490k27939P7164k46677p41648M15542
14118A0199166j49471r2538l85117P6094r3937l14931k55400R2804k91997j45997
14108H638676j06390k5979r4455n2261k25024k84007K55676m22130k25680J63336
$$ plain form
14174 28150910 27226557 26899026 26088249 25261768 24889720 24391031 23793871 23324345 22777587
14165 22777587 22419255 22117699 21217625 21022658 20436847 20049559 19802526 19440162 19129115
14156 19129115 18434499 18216682 17785532 17934581 17423033 16868445 16533576 16256555 16022122
14147 16022122 15610244 15508541 15429041 15083380 14477104 14584066 14188263 14000559 13576958
14138 13576958 13665679 13387739 13066335 12945819 12752093 12400169 12328568 12131354 11724242 11374084
14128 11374084 11623398 11132411 10948236 10953214 10922724 10694785 10771949 10525272 9783624 10199166
14118 10199166 10049695 9957157 9572040 9648134 9554197 9239266 8983866 9076670 8784673 8638676
14108 8638676 8532286 8506307 8411852 8359591 8134567 7850560 8106236 7684106 7458426 7621762
14098G621762K50637m56707j57093J65162J01771m10775j56899j94630J74324
14089F937552j37436j46859m6081J2475k01223J92706k57166j29457J20693l61802
14079E983402M14585n22193j43177j29179p1657J9179L06113l24640J75727j98457
14069E509703M7148m20308J19443J27R0914k21502J98873q2394k67955J64330
14059E138379k67487n60363L85673j54720O6302k48588K40006R3094k10428J68655
14049D650523j69119n4071m06219L40053J35407l33691J75242q6777m68486M22510
14039D205372J30549n16276l5846O2414r5742r361O009m299j83r3905j27564O6585
14027C587753K10567l16278K84006k89515j35512k31361K95808j50322L07194
$$ plain form
14098 7621762 7872399 7415692 7258599 7423761 7525532 7114757 6957858 6763228 6937552
14089 6937552 6800116 6653257 6607176 6619651 6418428 6611134 6353968 6224511 6345204 5983402
14079 5983402 6397987 5875794 5732617 5603438 5531781 5550960 5857073 5532433 5708160 5509703
14069 5509703 5556851 5136543 5255986 5256113 5347027 5125525 5324398 5242004 4974049 5138379
14059 5138379 4870892 4310529 4696202 4541482 4607784 4359196 4599202 4692296 4481868 4650523
14049 4650523 4481404 4427333 4021114 4361167 4496574 4162883 4338125 4251348 3782862 4205372
14039 4205372 4335921 3819645 3783799 3846213 3750471 3741110 3747119 3742820 3742637 3648732 3521168 3587753
14027 3587753 3798320 3482042 3766048 3476533 3341021 3109660 3405468 3255146 3562340
14018C562340r0860j93843K73459l08865K42170l50509N19847m86601L14235o43587
14008B837786K63262j88826P7262j92037J17588L8622J86147j57546k85796K04803
13998B901265k4758n10019L48679l93410L64590q7838m98292O44753j23867k10162
13988B410941K24528J61555j53161k42808K12395r9327M6687K70863r1369L6545
13978B776849m0874N98182P05359O19411J083624K957098O008998J0056352J0954977
13969C5719976j1321498r198669m714785k429266j428119j355535q55173K15842
13961D632773k19685m49928n38113j42701j79618o7261m01165M13527k18178j02672
13951B726979j92807L14275l55107n1723j03664M1901l10473K83998J15766j74689
$$ plain form
14018 3562340 3471480 3277637 3551096 3242231 3484401 3133892 3653739 3167138 3481373 2837786
14008 2837786 3101048 2912222 2989484 2797447 2915035 2953657 3139804 2982258 2696462 2901265
13998 2901265 2876507 2366488 2715167 2321757 2686347 2598509 2100217 2744970 2621103 2410941
13988 2410941 2635469 2797024 2643863 2401055 2613450 2514123 2560810 2831673 2740304 2776849
13978 2776849 2735975 3334157 4039516 4658927 5742551 8699649 14708647 24764999 35719976
13969 35719976 24398478 15199809 10485024 8055758 6627639 5272104 4416931 4632773
13961 4632773 4413088 3963160 3425047 3282346 3102728 3035467 2634302 3047829 2829651 2726979
13951 2726979 2534172 2848447 2493340 2441617 2337953 2379854 2069381 2353379 2469145 2294456
13941B294456J34506r4879J00146j61577k9534n8327l67714K26805J66207K2809
13931B232898m15789K43007k28578J37253k97092k8001N14541l67128L55497j35861
13921B010747l80823Q0307j6544j01658K89343j71398P0227n9010K96767m04854
13911A613104n8557M41062m75897K43444P0668j83660k1386J5303k057j88348
13901A453676J07403J32689r5026N9686j7923j75978m1982L93523J8952k19495
13891A615525r2146J01015k37322J94754l1253j77636M38454m53015n909P4969
13881A427436j10118j54197J70778n1857q0436K82945l63126K3590R0983J13276
13871A349274J16237m25109J44705j79423K60004o9760K55229k45514K26013l22974
$$ plain form
13941 2294456 2428962 2334083 2434229 2272652 2243118 2184791 1817077 2043882 2210089 2232898
13931 2232898 1817109 2060116 1831538 1968791 1671699 1643698 2158239 1791111 2146608 2010747
13921 2010747 1629924 1710231 1693687 1592029 1881372 1709974 1780201 1721191 2017958 1613104
13911 1613104 1554547 1995609 1519712 1763156 1833824 1650164 1628778 1644081 1642024 1453676
13901 1453676 1561079 1693768 1598742 1658428 1640505 1464527 1422545 1816068 1835020 1615525
13891 1615525 1523379 1624394 1387072 1581826 1550573 1372937 1811391 1358376 1352467 1427436
13881 1427436 1317318 1163121 1333899 1282042 1201606 1484551 1121425 1145015 1235998 1349274
13871 1349274 1465511 1040402 1185107 1005684 1265688 1195928 1451157 1205643 1431656 1108682
13861A108682K30507l5239K61114m54158j90263J46116L8540L09228n7590l45110
13851A011827J20629K12684n4675O1619K5735l00571p6540J54812J45898P711
13841A309129l20002K90709j55004J47562k95298J77738K7896j30896O4611j65480
13831I50965J68809j28466Q0922k05385q6978K96459n5822q445l6784O9154K05086
13820A249515k97695j44704P1899J96648k25239M15746j55752m02397M0494J77981
13810I26496j3512L5471j23088j66945K82655j67323K64549J22503r5244k63180
13800H02382R1937j55016K38951o3557K27679q8766j64953K31694j56043j31706
13790H32602K84340j72855J41425k17455l51734M22155q3703j60782L65110l10796
$$ plain form
13861 1108682 1339189 1303950 1565064 1110906 920643 1066759 1105299 1414527 1356937 1011827
13851 1011827 1132456 1345140 1290465 1352084 1377819 1077248 1000708 1155520 1301418 1309129
13841 1309129 989127 1279836 1124832 1272394 977096 1154834 1182730 1051834 1116445 950965
13831 950965 1119774 991308 1072230 866845 779867 1076326 1020504 1012059 975275 1044429 1249515
13820 1249515 951820 807116 879015 1075663 850424 1266170 1110418 708021 748515 926496
13810 926496 912984 948455 825367 658422 941077 773754 1038303 1160806 1065562 802382
13800 802382 894319 739303 978254 914697 1142376 1053610 888657 1120351 964308 832602
13790 832602 1116942 944087 1085512 868057 516323 938478 854775 693993 1059103 748307
13780G48307k34896M06553L73915m38601L0116k70416L35962k98546K50950k46590
13770F56754M01071m8302k46431K35716j24618j52998J04197L65772E27429J59283
13760F86712P9018L183J19550m36392M30111j36314j33234L03276J08600k83264
13750G41246J6776j68894p6149L03284Q9142k69135K773J52634l95332N76335
13740I72680C72251K20247L08765j90915l18217L54570j78919K13302O7769l34588
13730E14265J82282L00934D93536K94116k40495K51297o0386k8672r6688L54133
13720I66841k36657q8072L5479M3103j13146j5642N9519k40415J50937K0941J73362
13709G56250l04245M91442D24459J63692K37691j68742q2013k02916A44043N01911
$$ plain form
13780 748307 513411 919964 1293879 855278 885394 614978 950940 652394 903344 656754
13770 656754 1057825 1009523 763092 998808 874190 721192 825389 1191161 527429 686712
13760 686712 765730 768913 888463 452071 882182 745868 612634 915910 1024510 741246
13750 741246 758022 589128 512979 816263 905405 636270 639043 791677 396345 972680
13740 972680 372251 592498 901263 710348 392131 746701 567782 781084 848853 514265
13730 514265 696547 997481 493536 787652 547157 798454 738068 709396 612708 966841
13720 966841 730184 642112 677591 720694 607548 591906 651425 411010 561947 582888 756250
13709 756250 452005 943447 424459 588151 825842 657100 575087 372171 144043 645954
13699F45954j66743j92617H5460O10273j52309R6313M40788l45428J00060C30468
13688E31893J9294K54438k88537L0377L91934l66871l6707M4548k6686J15366
13678F69049k21349R1278K68658j79983L3835j79342N7003n9833K40709P7211
13668G97236q6137j87965J04680j73014J93070j42321B37495L73775j29622l8835
13658D42813J6598J22438k41998j17125M49975j39594M723r4967K31026j74981
13648D98908n3387Q0393O7254k25377G1869h7395D28507L66303q8788k00489j20941
13637C84592N1279p800J98362j85980J41838P6367k53373j2905O92003D29395
13626C30454M3713K58971J083j71874K18373j67999J24297k44309j9963j09215
$$ plain form
13699 645954 479211 286594 85460 695733 543424 639737 1080525 735097 835157 330468
13688 531893 551187 805625 517088 547465 939399 572528 535821 580369 553683 669049
13678 669049 447700 538978 807636 627653 661488 482146 539149 479316 720025 797236
13668 797236 711099 523134 627814 454800 647870 505549 237495 611270 481648 442813
13658 442813 459411 581849 339851 222726 672701 533107 537830 442863 673889 498908
13648 498908 445521 525914 593168 367791 71869 -87395 428507 794810 706022 505533 384592
13637 384592 435871 428071 626433 440453 582291 658658 405285 392380 1084383 429395
13626 330454 374167 633138 634221 462347 680720 512721 637018 392709 372746 263531
13616B63531L26993B89799n1757J98762j44195L29301k72130N6468J89521j77102
13606D18667l0288J91081k41302K18990e2009F26017A97842J93925K08396p9740
13596E20423j56275L7191l9912j57292J25109J16555N8569p3871A02995J47931
13586B50926K0294J7330l2078L20137j59197B6658L90346q0594J7361L50562j04571
13575E99762j38117m0486K18575B28357J72794A16956L56688A67847K88586J06090
13565E62523B45095P9469p2809K42728J60645D5596L67589j07954K29351K5113
13555E59695B11670K40785B08075J84945K01249k44796I0531M04019J7946l6663
13545D75833o1190o182j80645J90229j64071K81449k5883o8258B13317j02309
$$ plain form
13616 263531 590524 289799 238042 436804 292609 621910 349780 406248 595769 418667
13606 418667 388379 579460 338158 557148 -52009 626017 197842 391767 600163 520423
13596 520423 364148 401339 361427 204135 329244 445799 504368 430497 102995 250926
13586 250926 271220 288550 256472 576609 417412 26658 417004 336410 353771 704333 599762
13575 599762 461645 421159 639734 228357 401151 116956 473644 167847 456433 562523
13565 562523 245095 324564 251755 494483 655128 45596 413185 305231 534582 559695
13555 559695 211670 452455 208075 393020 594269 349473 90531 494550 512496 475833
13545 475833 414643 408461 227816 418045 253974 535423 509540 441282 213317 111008
13535A11008O6010J98092j82099J71452b7489B62967p2722B2224M51205p4338
13525C99091r0216L35843B10356p8150K85550A91664n1983L25253A72939r418
13515A63521J24671K45840Q8363i0412E7072g7186G47509B70061J55793a21767
13504C55215J0019n5778J60959q9173K19227j50815A83003J54396R772o2588j15920
13493A68663J07280J48460H5645N77408C7356a58792D69490j90129p6203o0683
13483A42475J04089J29943j64613Q3508K20306A37274K06254p6667M068j5528
13473B55401L05685j59364R0808j10762r5673K59613j57619m5381J92117A10898
13462C20713K36030k17189J4233A39453J69706J11620j81682J30198j27594Q4274
$$ plain form
13535 111008 177018 375110 193011 364463 -27489 262967 190245 22224 473429 399091
13525 399091 308875 644718 210356 132206 417756 191664 139681 464934 172939 163521
13515 163521 288192 534032 622395 -90412 57072 -77186 747509 270061 425854 -121767
13504 355215 365234 309456 470415 381242 600469 449654 183003 337399 347171 284583 168663
13493 168663 275943 424403 85645 663053 37356 -158792 469490 279361 203158 142475
13483 142475 246564 376507 211894 295402 515708 137274 343528 266861 270929 255401
13473 255401 561086 401722 492530 381768 286095 545708 388089 342708 534825 110898
13462 320713 556743 339554 353787 139453 309159 420779 239097 369295 241701 325975
13452C25975A04847a15306C37656J11598J56765A46281C7422R2890P4502J60540
13442C65354C7732J9181Q0853L37641g7567C25935a2899B12727a08464C24497
13431D22602K2495K33680A60988K07415g8318B00723J24888o4458j16192L9733
13421A84694j4198O6243M0984D7851L07313o2226F8330K53275R6073B02126J83963
13410C86089A18348J01212C649N16391A11665f1768j17823H8330k0726L45818
13400D13422q2011G7019B3086K13265e266k5591A37621m2966K06583J088Q8877
13389C91203J2225a81158C1906L16520j00821K45038b6224A34409F829J11746
13379A18575B7573J71542K02385A6981J07792K25840o5518k0484P345j35723K33470
$$ plain form
13452 325975 104847 -115306 337656 449254 606019 146281 37422 130312 204814 365354
13442 365354 37732 56913 137766 475407 -77567 325935 -12899 212727 -108464 324497
13431 422602 445097 678777 160988 368403 -78318 200723 325611 261153 144961 184694
13421 184694 170496 236739 277723 47851 355164 292938 68330 321605 417678 202126 386089
13410 386089 118348 219560 3649 520040 111665 -61768 -179591 88330 67604 413422
13400 413422 331411 77019 23086 236351 -5266 -30857 137621 94655 301238 302326 391203
13389 391203 403428 -181158 31906 348426 247605 492643 -26224 134409 6829 118575
13379 118575 27573 199115 401500 16981 124773 350613 285095 264611 271956 136233 369703
13368C69703A75042J76593a7244C25017P3162E82a19076M0070E70458k19110A35790
13356B44269j8621O8757K720j3600J6707o2704K7107J9042r4351A1817K70069
13345B81886r5321K43817B86K52434J5114L01122r1689G8343Q6003K37346J05918
13334E07610j49447e0897C67085k272j56817L30382B58358j20411K54077k4222
13324C67802m2605J8283k8532j32213L58637A73009R5840R9924j3047j18371a8084
13312C88481c1959A03435K21390P5474N3377C2768J10509R7122K93892A59559
13301D13582H1833O32781H6318K33353j21877M0045P414J24343n0613o5882a57279
13289B61113e7724E76877I2776O0437N09381j73511k7116A7561K87820j48019
$$ plain form
13368 369703 175042 351635 -17244 325017 398179 582 -119076 -79006 570458 351348 135790
13356 244269 225648 294405 297125 283525 300232 237528 264635 283677 189326 11817 281886
13345 281886 186565 430382 286 252720 267834 568956 477267 78343 164346 401692 507610
13334 507610 358163 -50897 367085 364813 207996 538378 258358 137947 392024 367802
13324 367802 325197 343480 314948 182735 541372 173009 268849 368773 355726 237355 -18084
13312 388481 -31959 103435 324825 400299 453676 32768 143277 240399 534291 159559
13301 413582 81833 714614 86318 319671 197794 237839 245253 369596 318983 253101 -157279
13289 261113 -57724 576877 92776 153213 662594 489083 461967 17561 305381 157362
13279A57362A7227L3665J41103a83306B27432J57264b42084A52168l6278J4346
13269A30236K15504L77699B61203I6103G776J72142j5306l9645K18166E8031J62341
13258B20372a05790H1291D651K94914F207J41745c1624A19139a36228B58644a7782
13246B26761L373J58013g5282a7081B66938b3720B15407G2278Q0837P5201L7100
13235B65416o5110p5031A1162b4008C61897A12251L17606B06884a44027B28788
13224H7342I209J8121L2476P5463J02556a30735F1771R7008C4489L10793a204
13212b3266j13470D6078J90479p7970J27975i5978j76863A35047P0585m9635P8362
13201B34359g4324m1294D4894J67467o8013d5510b0520A36978a41563P0255O036
$$ plain form
13279 157362 17227 50892 191995 -183306 227432 384696 -242084 152168 115890 130236
13269 130236 345740 723439 261203 96103 7776 179918 164612 124967 343133 58031 220372
13258 220372 -105790 81291 4651 299565 6207 147952 -31624 119139 -136228 258644 -17782
13246 226761 230134 388147 -75282 -17081 266938 -23720 215407 72278 153115 228316 265416
13235 265416 200306 125275 11162 -24008 361897 112251 429857 206884 -144027 228788
13224 87342 9209 27330 59806 135269 237825 -130735 61771 158779 34489 345282 -1204
13212 -23266 -136736 46078 236557 158587 286562 -95978 -272841 135047 205632 155997 234359
13201 234359 -74324 -115618 44894 212361 144348 -45510 -20520 136978 -141563 -71308 -65272
13190f5272a9351B75621n8131J51166A52891L3667m4063J68091p1234R2337A13201
13178H1945a40215A06575Q3592f566k08935G5509K67951A9927J13691J96107f608
13166B31525G6786l714J59003a31717A07466f1515D25845c2494A75818K93306
13156D69124f5002A36974K90020A24436E5306K19686a35081H0941d4156a7596
13145F6620Q6505O1969I71a09152F7016M5340l9661R1077J26309h6155A24179
13133a7220I150a62144B73213M3457j38471q6878m0901K56640A32889d9716p3997
13122a23713A30662j6299l4254A2920J89641p1645P7598K57567I8055B8877J6870
13111D5747f7703F3437c14836B28276a58059A01958a36801M8904A37784a1814
$$ plain form
13190 -65272 -19351 275621 217490 368656 152891 186558 142495 310586 239352 331689 113201
13178 81945 -140215 106575 190167 -6566 -215501 75509 343460 19927 133618 329725 -6608
13166 231525 76786 73072 232075 -131717 107466 -61515 425845 -32494 175818 469124
13156 469124 -65002 136974 426994 124436 55306 274992 -135081 80941 -44156 -17596
13145 66620 153125 215094 971 -109152 67016 112356 72695 163772 290081 -86155 124179
13133 -17220 9150 -162144 273213 316670 178199 91321 50420 307060 132889 -49716 -123713
13122 -123713 130662 114363 80109 12920 202561 130916 208514 466081 98055 28877 45747
13111 45747 -67703 63437 -314836 228276 -158059 101958 -136801 -87897 137784 -11814
13100B5617o681J5058L19607r3483J9611j26747L21933j36633g7088B06321n9463
13089A46858J3975m6159h2646E9968J02451J80192J71218c0186H7467a27908R067
13078a18841r488D8053N24502A70055g7128D4485P9331i2226C71665k2209I2844
13066B50902J59712A75861D8008a08832B64855a9115A89702A5038J73468D7106
13055b15657h2553A03320J9100J82714j34579n0766L8959l3530M1818a50538A33420
13043b4058j12832A928J02315G9f8206B41959j13509K29334n8939q4257A03552
13031D66740A06116J08042e7765B35737J43793A36770Q4224B9439a18778K9342
13021h9436D0244A9349N2995e6339I1074K46400m9442j05439n4327c48193b2070
$$ plain form
13100 25617 18936 33994 353601 260118 279729 152982 474915 338282 -77088 206321 146858
13089 146858 160833 114674 -82646 59968 162419 342611 513829 -30186 87467 -127908 -118841
13078 -118841 -128329 48053 572555 170055 -77128 44485 123816 -92226 371665 349456 92844
13066 250902 410614 175861 48008 -108832 264855 -19115 189702 15038 188506 47106
13055 -215657 -82553 103320 122420 305134 170555 119789 158748 125218 167036 -150538 133420
13043 -24058 -136890 1928 104243 79 -68206 241959 128450 357784 298845 214588 103552
13031 466740 106116 214158 -57765 235737 379530 136770 220994 29439 -118778 -89436
13021 -89436 40244 19349 72344 -56339 91074 337474 288032 182593 128266 -348193 -22070
13009A0971K5811n773J08084J61143j14252J332a64199A7976K31969A08136e737
12997A26743J61508a6561j39374B56554f7073A3650J93430q4128J5458c5710D8044
12985b86667I320O1027O2314j9147c8376A29501a89733A25960a07731j1792K8438
12974i1085m0845C24466d03478a13875A47180J13945Q28e4896B49039a06005A88722
12962A63513J27418j41149a755m8280A93717J33661a97637A34090b6209B10233
12951a36256B04481C8634J59011a31438G9584J8695i8378A97142E4830M35100
12941D89930I8383O3814R0470A24712B4140J17002d04502J92166B16607e3310
12930C1705J16084b2612l8332G3979A8585L2218k0488K32493J82131k11383K0631
$$ plain form
13009 10971 36782 31009 139093 300236 185984 187316 -164199 17976 249945 108136 -5737
12997 126743 288251 -16561 -155935 256554 -67073 13650 207080 122952 138410 -35710 48044
12985 -286667 9320 70347 132661 113514 -38376 129501 -189733 125960 -107731 -119523 -91085
12974 -91085 -131930 324466 -403478 -113875 147180 261125 261953 -54896 249039 -106005 188722
12962 163513 290931 149782 -1755 -50035 193717 327378 -197637 134090 -26209 210233
12951 -136256 204481 38634 197645 -131438 79584 98279 -98378 197142 54830 489930
12941 489930 98383 162197 252667 124712 24140 141142 -404502 -212336 216607 -53310
12930 31705 147789 -22612 -60944 73979 18585 50803 30315 262808 444939 233556 254187
12919B54187j5019n408E7614a08765B30892c67860a08125e0321K4832A50613b29520
12907c73018B92820d1370j27339B8940a16666A6026J87333A1804J10475K0293
12897A42572C8438f1123E9551J88239L11686i759j61805C336a73784A68030a08195
12885B48119a36841n5903B3821Q6452B1684K20659a22129F0817a23517A15752
12874d7700P30B17780G5312j9740B1645a11958I7401a2995B02217I2544J98467
12863B91011C9814a17955m0013C08166G4914K45429D7783g103F3108J1144A9483
12851C94893A78884d8118A07215d1966B14564A06896B049a39232D69070a05041
12840d7117n3529j77762b8037A41332b6139A88680J4799n8740A855J34558a63502
$$ plain form
12919 254187 239168 233760 57614 -108765 230892 -367860 -108125 -50321 -25489 150613 -229520
12907 -373018 292820 -41370 -168709 28940 -116666 16026 203359 11804 122279 142572
12897 142572 38438 -61123 59551 247790 559476 -9759 -171564 3336 -173784 168030 -108195
12885 248119 -136841 -192744 23821 110273 21684 242343 -122129 60817 -123517 115752
12874 -47700 -46970 217780 75312 55572 21645 -111958 97401 -12995 202217 92544 291011
12863 291011 39814 -117955 -157968 308166 74914 320343 47783 -7103 63108 74252 19483
12851 394893 178884 -48118 107215 -41966 214564 106896 2049 -139232 469070 -105041
12840 -47117 -100646 -278408 -28037 141332 -26139 188680 203479 144739 1855 136413 -163502
12828a36380m2964A2587a67684I7066l5366o772O140a82596g5829j46542A43060
12816A27106h6889G7998K3663b04899O431g7770j01039B7391K25431a13144K4158
12805h8986A81782F4542K66623B9695N34876a62197C61288E0339d6283k88531
12795c34814d3808C4148d20244A36223K1624B1084L00796G2179a14399D08758
12784G4389O2221Q6658C7998N6906N459J5963E7725K630a14017G5098g5481l2060
12772a07541A6337c41502A86262A08J98140r6795K41462A14275L2987E6386a09648
12760b39482d0225E1367a37318B60612B2268h8143a4777H3011a18329A82339I612
12748C1330a82600H8626J83968j29071D2497a29653L9170H4774J67028a54872
$$ plain form
12828 -136380 -179344 12587 -167684 97066 61700 54928 61068 -182596 -75829 -222371 143060
12816 127106 -86889 77998 101661 -204899 -198468 -77770 -178809 27391 252822 -113144 -88986
12805 -88986 181782 64542 331165 29695 564571 -162197 361288 50339 -46283 -334814
12795 -334814 -43808 34148 -420244 136223 157847 21084 321880 72179 -114399 408758
12784 74389 136610 223268 37998 94904 100363 116326 57725 60355 -114017 75098 -75481 -107541
12772 -107541 16337 -341502 186262 108 198248 101453 342915 114275 147262 56386 -109648
12760 -239482 -40225 51367 -137318 260612 22268 -88143 -14777 83011 -118329 182339 9612
12748 31330 -182600 88626 272594 143523 42497 -129653 -90483 84774 251802 -154872
12737a07266C52058A60295i2775J2005B8399C568J21077d6507A0043O7763e986
12725E2609P9278m8251J552C6167L6236R2135a20095B95328A1778K29093J12594
12714C53465J3760a08850L8522j00627A12342K77966G3656J10747b4697D7889
12703i5430J718A60694p2617J2636K8029d5844D20974f4126K5280F9738R758J73739
12691B53235J9004b31814g9432a9929B32431H6450a19073K1942j64794C31007
12680c5007A08699D3952f5366B32277c314B78188p6091b01441d1770j14757H3726
12668B74979j09030Q2537a40222A53888i3154A311L5409K47358g7202l04303E0483
12656E9562M831M08494k10854Q8971b8673B09141K018j1674J91036a06420B45042
$$ plain form
12737 -107266 352058 160295 -92775 -80770 28399 3568 124645 -46507 10043 77806 -5986
12725 52609 131887 83636 85188 36167 72403 164538 -120095 295328 11778 240871 353465
12714 353465 367225 -108850 -70328 -170955 112342 390308 73656 184403 -24697 47889
12703 -95430 -93712 160694 88077 100713 128742 -45844 420974 -64126 -38846 69738 79496 253235
12691 253235 272239 -231814 -79432 -19929 232431 86450 -119073 -97131 -261925 331007
12680 -35007 108699 43952 -65366 232277 -3314 278188 202097 -201441 -41770 -156527 83726
12668 274979 165949 248486 -140222 153888 -93154 1311 36720 284078 -77202 -381505 50483
12656 59562 64393 472887 262033 351004 -28673 209141 211159 199485 390521 -106420 245042
12644a27000B74425d9268A60473g1049A79396g5191B27861b63582B10150h3730
12633B45621b298D5130M3865f406j2739G668g0343C42314b3070A87429O5451H1019
12620a45858K6261A51227J20372I8342J43664K0179H681K81129q8103K51056Q0022
12609E32785B9258a21170p469B08127F5552N2036C149J32309L3142J12903H4372
12597A64980b23883c0223j24693B64783c73132H371J34964o7092b12553B15109
12586a22042B02109a53764B94445D8185a098I7768b95313J07734b2114B4804R9720
12575A24524J73127A02572N664i4489Q186A88252a56484A69280H058J92291a63921
12563g2922A71520K3690k3133h1843E7017R7530i3754c6877A21876J39063F4641
$$ plain form
12644 -127000 274425 -49268 160473 -71049 179396 -75191 227861 -263582 210150 -83730
12633 245621 -2298 45130 88995 -6406 -19145 7668 -70343 342314 -23070 187429 252880 81019
12620 -145858 -119597 151227 271599 98342 242006 262185 8681 289810 201707 452763 532785
12609 532785 29258 -121170 -128639 208127 65552 117588 3149 135458 168600 281503 84372
12597 164980 -223883 -30223 -154916 264783 -373132 8371 143335 76243 -212553 215109
12586 -122042 202109 -153764 294445 48185 -1098 97768 -295313 -187579 -22114 24804 124524
12575 124524 297651 102572 108236 -94489 -86303 188252 -156484 169280 8058 200349 -163921
12563 -72922 171520 195210 172077 -81843 57017 154547 -93754 -36877 121876 260939 64641
12551A26557c6303C3800J42730b12101E658M91Q3260b0711B02085r7713a17605
12539A42078m557J1988d37507A62718m9222b7275l781G6717a55981A77822c7801
12527a66318b0572B02380n4052a5582M208A92210d944o0386A3324N4093r056Q2651
12515A41012h9195J0284A90877m0612F5620f2768B8214J29042k4176j4920Q3689
12504B01849B0587g5565B85819C8164l290O3948b91825A50523n7084J9393J34488
12493B47320A10170J14135C8422a1355L918I9772J44102d06187B44407b86534
12482a41497B76510o1942j8135J00185a78368d5455p7241N7720g273l2215p9436
12471a18924A98687a91110b3853D8883a07966H0332h022k07850A23676p858c14347
$$ plain form
12551 126557 -36303 33800 176530 -212101 5658 6149 89409 -20711 202085 104372 -117605
12539 142078 137521 149509 -437507 162718 113496 -27275 -31056 76717 -155981 177822 -37801
12527 -166318 -20572 202380 148328 -15582 -11374 192210 -4944 -65330 13324 67417 58361 141012
12515 141012 -89195 -78911 190877 150265 65620 -62768 28214 157256 133080 118160 201849
12504 201849 20587 -75565 285819 38164 34874 98822 -291825 150523 93439 112832 247320
12493 247320 110170 224305 38422 -11355 -7437 99772 243874 -406187 244407 -286534
12482 -141497 276510 214568 196433 296618 -178368 -45455 -122696 -64976 -7273 -39488 -118924
12471 -118924 198687 -191110 -23853 48883 -107966 80332 -8022 -215872 123676 115818 -314347
12459h757j24730C04728b44662A68433b36622A41824b9250A74001b91771C5421
12448B30838a04420B43605p1697a56814L4407C25994C6174b08463A23716B441
12437d396r8592L2659G2449J8412b76410M1936G975K33340B2888b22564c2187
12425E90724A77706a73840A6600N2346j7182O4014D1940j4776J18338a6988n0254
12414f7242k27858A3420c89881a68701A2353K72524B2253J86865R3845E0578M17299
12403D67877a19809B10470K4190a04055C0347J64376m0191a67148J7357C68531
12392C01316a67760G4973L52518j93781a98017a028C27126b49715A9641h4424
12381d6802J7294j7664K2299H6866b02060d4089C223h0124F2174N7835L3248J49814
$$ plain form
12459 -8757 -133487 304728 -244662 168433 -236622 141824 -29250 174001 -291771 35421
12448 230838 -104420 243605 171908 -156814 -122407 325994 36174 -208463 123716 2441
12437 -4396 -102988 -70329 72449 90861 -276410 -234474 7975 241315 22888 -222564 -32187
12425 590724 177706 -173840 16600 68946 51764 115778 41940 27164 145502 -16988 -67242
12414 -67242 -295100 13420 -389881 -168701 12353 284877 22253 209118 302963 50578 467877
12403 467877 -119809 210470 234660 -104055 30347 194723 154532 -167148 -149791 368531
12392 301316 -167760 74973 427491 233710 -198017 -1028 327126 -249715 19641 -84424
12381 -46802 -29508 -47172 -24873 86866 -202060 -44089 3223 -80124 62174 120009 153257 303071
12369C03071F4153k1N1345b497j57369g4424A73030K63622j30554A30348l3827
12358I6521a88235A78665c78547B4335J52212p7700e9384B40981b6045A55009
12347G7650a9722j58740B32291r1554c1376n6989k62688G8979L59370c235j89679
12336a92914m803B22566a25516A81226b77157F3573b7530n3050g048A97975e22
12324d6529B72171G9927c26298A63497d5113B19594q7757a80343I0782b23802
12313c53221B15753E9011g4243C4948K50512h1176B1704N3430A988N8923J1803
12302G2714J2006j3033b55068b7916F1206K42993B6485a66244o646J4344A98515
12290b97052a26345B60805H5449d3056R456r7588j88060A02610i2356j68568B0285
$$ plain form
12369 303071 64153 64132 115477 -2497 -159866 -74424 173030 436652 306098 130348 96521
12358 96521 -188235 178665 -378547 24335 176547 98847 -59384 240981 -26045 155009
12347 77650 -19722 -178462 232291 140737 -31376 -88365 -351053 78979 438349 -3235 -192914
12336 -192914 -197717 222566 -125516 181226 -277157 63573 -27530 -80580 -7048 197975 -522
12324 -46529 272171 79927 -326298 163497 -45113 219594 131837 -180343 90782 -223802
12313 -353221 215753 59011 -74243 34948 285460 -81176 21704 75134 1988 60911 72714
12302 72714 84720 71687 -255068 -27916 61206 304199 26485 -166244 -172890 -158546 198515
12290 -297052 -126345 260805 85449 -43056 -33600 -131188 -319248 102610 -92356 -260924 20285
12278E50450b04347C76732a48896D0206b53243f195I2708l0513B5155a72610P5925
12267i6685j10393B80052E5758c22536H8454b6933m8374I8873m2521j3557L00186
12256C42981A48190a9201k98461f2610J6057G2317J92715a17474A98464H103J10975
12245A19078f6862A59257A0627J4203K7984JQ8409J43531J3256C8476L22192N6714
12233D17382b36160E02546N9628A63773J22241n6161a64621A69228M9878a15535
12222d4076A37709C9445i2982A52142O3984K69996GJ69989j0796l2030L14336
12211D41506a81541B16281J45148p5975e4239B54194j21724J37358j34472l1628
12201A03728J97789J70199H928g9009D84899a5691n2661C99923A51095E4740K47182
$$ plain form
12278 550450 -204347 376732 -148896 40206 -253243 -6195 92708 62195 25155 -172610 -96685
12267 -96685 -207078 280052 55758 -322536 88454 -26933 -75307 98873 56352 42795 342981
12256 342981 148190 -19201 -317662 -62610 -46553 72317 265032 -117474 198464 8103 119078
12245 119078 -66862 159257 10627 24830 52814 52815 141224 284755 298011 38476 360668 417382
12233 417382 -236160 502546 562174 163773 286014 229853 -164621 169228 219106 -115535
12222 -44076 137709 39445 -92982 152142 216126 486122 7 169996 159200 127170 441506
12211 441506 -181541 216281 361429 285454 -54239 254194 132470 269828 135356 103728
12201 103728 301517 471716 8928 -79009 484899 -15691 -68352 399923 151095 54740 301922
12190C01922j45735h8167A55945K42519A39932J92860r6140b61197A99034l3030
12180A66004L32724m6857j84033r3519p0823J32809B5244K90162r5915J13412
12170C32903A0024J03546h1036C23920A40580E2278a65856A79996o7115i7429
12159A68113i047B63941J81812B09646f6303A70236a93507F0805j9525O3032L0891
12148A35203f714p3620C1691K79363b77400A14581M20128j91476a57895C8632
12137A83551E9208i4021B71273F8731f4162r1056j99864a20071A76173K63369
12127D39542A29933m5932k1121k3449F233K46476J09498i1729I84c9104B04617
12115a42319M2068E2194f4517C3564J25997N2388a26835j4748l7487A0091b5727
$$ plain form
12190 301922 156187 -88167 155945 398464 139932 332792 236652 -261197 199034 166004
12180 166004 498728 451871 267838 174319 103496 236305 25244 315406 219491 332903
12170 332903 10024 113570 -81036 323920 140580 52278 -165856 179996 112881 -97429
12159 168113 -9047 263941 445753 209646 -66303 170236 -193507 60805 41280 104312 135203
12148 135203 -6714 -80334 31691 311054 -277400 114581 534709 343233 -157895 38632
12137 183551 59208 -94021 271273 68731 -64162 -155218 -355082 -120071 176173 439542
12127 439542 129933 84001 62880 39431 6233 252709 362207 -91729 984 -39104 204617
12115 -142319 -100251 52194 -64517 33564 159561 211949 -126835 -141583 -179070 10091 -25727
12103A93403G5638h5743D1967a7812B03706C7826d79793A82902q9381c5773A2528
12091A51535i4074c0165D1578a45730A24156f9372A16K03894b2871B82437c6800
12079A87268n7299a17700M1702a2131j00757M0345L2139J7551B7721J43051b84011
12067a73977l0330a7053r1080A55795M7436j3472b9125H5483A0554M15916Q6629
12056E13099M81046o0207m05150H4634N6687K54807j95677h0336L3860l150a671
12044a10304j00693a6677A0909J87162R5934j34574a20644D12802g8825m31878
12034e10703A85446a67719A0867Q7667c72813B80152e9818C5426M2390J24302
12024B02118c6115j94632A84695B3319K67052a64625a1629B28715b46674c9526
$$ plain form
12103 193403 75638 -85743 41967 -17812 203706 37826 -479793 182902 93521 -35773 12528
12091 151535 -94074 -30165 41578 -145730 124156 -69372 116 204010 -22871 282437 -36800
12079 187268 129969 -117700 -75998 -12131 -112888 -72543 -40404 -22853 27721 170772 -284011
12067 -173977 -204307 -17053 -108133 155795 203231 189759 -29125 85483 10554 426470 513099
12056 513099 994145 933938 528788 84634 141321 396128 200451 -80336 -46476 -49626 -1671
12044 -110304 -210997 -16677 10909 198071 294005 159431 -120644 412802 -78825 -510703
12034 -510703 185446 -167719 10867 98534 -372813 280152 -59818 35426 77816 202118
12024 202118 -36115 -230747 184695 23319 290371 -164625 -11629 228715 -246674 -39526
12013C08810a19101H6110f1315E8573g1046R238b524j5793F5047r603J59019a5772
12000b13284O1767n9465B95917a9863j43402a9643A32629c69I4080m1340b01430
11988a1186E0420q735J01732h5545c6722D3417f2126m0921L360l7179j19656C03042
11975a85248A18591a14195A57423a39846L435p2550M4694G4945a22971H587c8501
11963a59734B18789a58731g8025c5186J7516j94974B37079j00634i778k70221
11953b79999A95122a26979A6284a16821b9202k9339j32485A1635h9090a2765E756
11941B754c10076A6932a35690b3601k69227k42158B77060p4233e5464j68a9474
11929F7337P597k2957a59722A3491N0350J06281C2013J02996m4089a90907a7335
$$ plain form
12013 308810 -119101 86110 -61315 58573 -71046 -61808 -2524 -18317 65047 55444 214463 -15772
12000 -213284 -151517 -210982 295917 -19863 -163265 -19643 132629 -369 94080 52740 -201430
11988 -11186 50420 41685 143417 -85545 -36722 43417 -62126 -103047 -99687 -136866 -256522 303042
11975 -185248 118591 -114195 157423 -139846 -136411 -208961 -164267 74945 -122971 8587 -38501
11963 -159734 218789 -158731 -78025 -35186 -17670 -212644 237079 136445 -9778 -279999
11953 -279999 195122 -126979 16284 -116821 -29202 -58541 -191026 11635 -89090 -12765 5756
11941 2754 -310076 16932 -135690 -23601 -292828 -534986 277060 202827 -55464 -55632 -19474
11929 67337 74934 51977 -159722 13491 63841 170122 32013 135009 90920 -190907 -17335
11917D6621a51879F6133N2277J20407j15932f3729C27134a55719M0288A33433
11906B4537c81431G8813K92283b54871B20595O171a43993C3189J37601J4399a75593
11894a8792o3430q4439D13901A81026B9903K68261a05785D00315a63303b7889
11883c5400m0915A6435d24036G906K99826H1783d6978j63613f1907B68055c54054
11871a80948h0888I4359g4752k44026b8469B74195a91433k530N9921B682b61787
11859f4536B35664f7691j19721A92304C1718a5448B8309J93481g5254M431l8490
11848a09313G5712b25049N1050g2141n3350K0719p2655m8172A77145j6004p5549
11837H5592A9088J3198d0372L880k05807f4769A4653g3142B35675d2780B4289
$$ plain form
11917 46621 -151879 66133 118410 238817 122885 -63729 327134 -155719 -115431 133433
11906 24537 -381431 78813 371096 -254871 220595 226766 -143993 33189 170790 185189 -175593
11894 -18792 -82222 -166661 413901 181026 29903 298164 -105785 400315 -163303 -27889
11883 -35400 -76315 16435 -424036 7906 307732 81783 -46978 -210591 -61907 268055 -354054
11871 -180948 -80888 94359 -74752 -318778 -28469 274195 -191433 -193963 -134042 2682 -261787
11859 -64536 235664 -67691 -187412 192304 31718 -15448 28309 221790 -75254 -70823 -109313
11848 -109313 75712 -225049 -173999 -72141 -125491 -104772 -177427 -225599 177145 161141 85592
11837 85592 19088 32286 -40372 -36492 -242299 -64769 14653 -73142 235675 -42780 24289
11825B53513c06972h6614k43021I5835J2024O880b14714R5063A921K8039b51536
11813d6208k8141B7856a92111q2792i3718c3681j37994B0856J26968j0265m0506
11802I7053J2031I975a36350B9616o709J35364f4014C6699b96399B06560c2515
11790b11860c5683I4211N1679D4285a08100k50072J66723B5259K08684m3906a51732
11778h2751j34594B90493F2616J2443J08661B8106a35514E4417a41124j78949
11768c20073B42697b85322a28635I7972h0193m1089p0021b7764J1063k15529H9746
11756a90354B2291a36602B10831j02711h9732r847k24732a07411G7433C3963a02929
11744f6006l6509F6125J4485o61c38088b2591l0801B24930n6980c06055e4226
$$ plain form
11825 253513 -306972 -86614 -329635 95835 107859 114739 -214714 -119651 1921 29960 -251536
11813 -46208 -74349 27856 -192111 -274903 -93718 -33681 -171675 20856 147824 137559 97053
11802 97053 109084 9975 -136350 29616 22907 158271 -64014 36699 -296399 206560 -32515
11790 -211860 -35683 94211 145890 44285 -108100 -358172 -191449 25259 233943 190037 -151732
11778 -82751 -217345 290493 62616 75059 183720 28106 -135514 54417 -141124 -320073
11768 -320073 242697 -285322 -128635 97972 -80193 -121282 -191303 -27764 -16701 -232230 89746
11756 -190354 22291 -136602 210831 108120 -89732 -99579 -324311 -107411 77433 33963 -102929
11744 -66006 -102515 66125 80610 79949 -338088 -22591 -53392 224930 167950 -306055 -54226
11732C70569f0401A6598g9167c4084B53483a63931l9776k5398k63959e4679j859
11721e6538D31869A02495g5789B11016I3973a73513c198C3468K82131b66759A534
11709B19681p9391J51753D6128q720R2836g283C1522a45339K3645A70876B8287
11697f3867C7750b35007B43581A16907J04481f3156I5042a27068N4347A77154
11686g6443A40854a31306A98867b7908r4130L9630A93287H2790c6985A70224D2581
11674i1667A13131J55475D6431a63070d4252B84940a29295A42094b94226Q3038
11664b11188b0399j17891E3723J2181M6459b44367g4779j47231Q9575O2716B3954
11652g4482A90124b4430k06596A48414n7703b93198A10449a8700B63344a98144
$$ plain form
11732 370569 -60401 16598 -79167 -34084 253483 -163931 -203707 -229105 -493064 -54679 -56538
11721 -56538 431869 102495 -75789 211016 93973 -173513 -3198 33468 315599 -266759 1534
11709 219681 140290 292043 46128 37408 130244 -7283 31522 -145339 -121694 170876 28287
11697 -63867 37750 -235007 243581 116907 221388 -63156 95042 -127068 -72721 177154
11686 -76443 140854 -131306 198867 -27908 -122038 -82408 193287 82790 -36985 170224 42581
11674 -91667 113131 268606 46431 -163070 -44252 284940 -129295 142094 -294226 -211188
11664 -211188 -20399 -138290 53723 65904 112363 -244367 -74779 -222010 -132435 -69719 23954
11652 -74482 190124 -24430 -231026 148414 90711 -293198 110449 -18700 263344 -198144
11641a44020o2244j37857c3875j05971E9150f7148G1604c4386J1926A73619A5907
11629i6040j21397O2618a4172k28577A29831g2997C00856a08891B15020p0563
11619A44457E3342B5937b43123F5490b2374m9118F0775Q7470J74537A20889h2343
11607b29643k478m0045a05736p9929A59442G3461e7763l1327E8139i194j07556
11596a16750A83818F4512J48816b0599l5422A97464G9097f0473j7476D6318a5235
11584i9854B37820q7667J39769g9790A2544c5364q7960D9406g9747C8486A2188
11572b0580A09392A6808a10006E08582B8545j667b15994e9076j90260A2435D199
11560d3564B9457Q4989P2957C5422K06310a95283H1984a7424C9357h3291c5055
$$ plain form
11641 -144020 -206264 -344121 -33875 -139846 59150 -67148 71604 -34386 -22460 173619 15907
11629 -96040 -217437 -154819 -14172 -242749 129831 -72997 300856 -108891 215020 144457
11619 144457 53342 25937 -243123 65490 -22374 -71492 60775 148245 322782 120889 -82343
11607 -229643 -232121 -272166 -105736 -185665 159442 73461 -57763 -89090 58139 -9194 -116750
11596 -116750 183818 64512 213328 -20599 -56021 197464 79097 -60473 -77949 46318 -15235
11584 -99854 237820 150153 289922 -79790 12544 -35364 -123324 49406 -79747 38486 12188
11572 -20580 109392 16808 -110006 508582 28545 26878 -215994 -59076 -249336 12435 4199
11560 -43564 29457 114446 187403 35422 241732 -195283 81984 -17424 39357 -83291 -35055
11548c502D3388f6579B49788O4296i7268B89054a93661B60791a24231N2991A68317
11536A9957J21867C425h8789B95113A20617a1333A63681J59518b57477I2184K2171
11525A14355Q9418a77824H8965K23435a7749k22539c6350k87968J47690C02176
11514a6116A0669J67248J15040A39002b49117B3805f2024C5876b33298m7232A35844
11502C9529a3043l933C8075d7347C72818G6694J14136p3009J69216j42845F9532
11490A08416f4292D06872A17971K22064j44107a1561A55953Q7166C4211A0681
11479c4413C50622B7316Q9014M6989J62532I6461e0329H9577c17569f7143E44014
11467B87960O961A12101f3043A28315J76336j34040G0824J21894i2320A64413
$$ plain form
11548 -3502 43388 -66579 249788 314084 -97268 289054 -193661 260791 -124231 -71240 168317
11536 19957 141824 3425 -88789 295113 120617 -11333 163681 323199 -257477 92184 114355
11525 114355 203773 -177824 88965 312400 -17749 -240288 -36350 -324318 -176628 302176
11514 -16116 10669 177917 292957 139002 -249117 23805 -62024 35876 -233298 -280530 135844
11502 39529 -13043 -16976 38075 -47347 372818 76694 190830 117821 287037 144192 69532
11490 108416 -64292 406872 117971 340035 195928 -11561 155953 243119 34211 10681
11479 -34413 350622 27316 116330 163319 325851 96461 -50329 89577 -317569 -67143 544014
11467 287960 294921 112101 -63043 128315 304651 170611 70824 192718 -92320 164413
11456C52207j69757q8671J75301r1621n3011K14209D7199K5813K36145A16202
11445B94067R6196n1955J40507a51631I7997a64431A96796k5213B5415J27816
11435A53231E6855a24405A70326a9657A63556J84625a93928D7749J3353N3009
11425A14111i9221d7462A41353l8077k6489M3805J62611J77846k0967C4013i9283
11413B44679Q8423a61797f0555j07966k9329h2922j25009f1766C5279J34450F428
11401A69684d43159i2565C09431D4225a34514a1322p5665B65330j03695a89488
11390A21985k0630l4649k6835a09029j21852g6642A03786c41166C84588a61924
11379a40741B1942a11397j42792b348j64898A73084d9035F1576K47951b73484
$$ plain form
11456 352207 182450 93779 269080 177459 124448 338657 47199 73012 309157 116202
11445 294067 390263 338308 478815 -151631 97997 -164431 196796 171583 25415 153231
11435 153231 56855 -124405 170326 -19657 163556 348181 -193928 47749 61102 114111
11425 114111 -99221 -47462 141353 103276 76787 120592 283203 461049 440082 34013 -99283
11413 244679 333102 -161797 -60555 -168521 -197850 -82922 -207931 -61766 35279 169729 6428
11401 169684 -443159 -92565 309431 44225 -134514 -11322 -86987 265330 161635 -189488
11390 121985 101355 66706 39871 -109029 -230881 -76642 103786 -341166 384588 -161924
11379 -140741 21942 -111397 -254189 -2348 -167246 173084 -49035 61576 309527 -273484
11368a61385B38337E0555a32554J1163a0757C76842b06315k40961a4882m2448
11358e7330H6129j2475d5273A93624b38145b9623j37236C99653A56575e0076p1999
11347a22075j0255l7924b4958q7097J234d3399k23697B84222a71845D639L43784
11336C48423a27123a2130B89914A26513b5532D16542G6404O9466m5429B0391Q8851
11325A09242a71004A14034a13497d2796q4404k35968A585L76708a36165l07971
11315d44136a41288C0256J11355a96472Q3907j47890D1416K50081A09643a04242
11304F2308a79079Q5407p1519N9066e2084b5102j91822A80370H0369b31618c9566
11292A67810b38986C9171d6563I2412f5311Q325n855k14060b3378l3543I8466
$$ plain form
11368 -161385 238337 50555 -132554 -121391 -10757 376842 -206315 -447276 -14882 -57330
11358 -57330 86129 73654 -45273 193624 -238145 -29623 -166859 399653 156575 -50076 -122075
11347 -122075 -132330 -170254 -24958 -112055 -110821 -43399 -267096 284222 -171845 4639 348423
11336 348423 -127123 -12130 289914 126513 -25532 416542 76404 145870 100441 20391 109242
11325 109242 -171004 114034 -113497 -42796 -127200 -363168 1585 378293 -136165 -444136
11315 -444136 -141288 30256 141611 -196472 -112565 -260455 41416 291497 109643 -104242
11304 62308 -179079 -93672 -165191 -106125 -52084 -25102 -216924 180370 80369 -231618 -39566
11292 167810 -238986 39171 -46563 92412 -65311 -56986 -62841 -276901 -23378 -56921 98466
11280h8928B50577E9896R5555A5061b1592k34439i7429j85333A7655b07019B15437
11268A8745a14354G4427M0914m8698g1242a2836A34251c6764A9061J05868J7675
11257A42604a16162e6169J8362D3881J7404f010A2202M4170K68597c1139B11635
11245c98337i903j14297B82300G1590j3149B4742A302a77599D5067a81825A6873
11233G9978a16607j29553J09520o7374A26254b67629H8257J11581I4051l701l5673
11222E4677j3646d7464K3166k81244H7870R6738a18977g510B10534E7686f9137
11210a99002G688d3739A57048a18466D2799P6734D4906l890a52019L8162m8003
11199a61860k25903G1419f5939B03236d4997D4633b0214k6857B84964b03237N1096
$$ plain form
11280 -88928 250577 59896 155451 15061 -21592 -256031 -97429 -282762 17655 -207019 215437
11268 18745 -114354 74427 115341 66643 -71242 -12836 134251 -36764 19061 124929 142604
11257 142604 -116162 -56169 -37807 43881 61285 -6010 12202 56372 324969 -31139 211635
11245 -398337 -9903 -124200 282300 71590 58441 24742 1302 -177599 45067 -181825 16873
11233 79978 -116607 -246160 -136640 -204014 126254 -267629 88257 199838 94051 90350 54677
11222 54677 41031 -47464 -24298 -305542 87870 184608 -118977 -7510 210534 57686 -69137
11210 -199002 7688 -43739 157048 -118466 42799 119533 44906 41016 -152019 -113857 -161860
11199 -161860 -387763 71419 -65939 203236 -44997 44633 -20214 -47071 284964 -203237 -152141
11188a52141J6049k9819P8403B00859a75660a1444A00593l6382b89115a44080
11177B6670g9926j11275j30239J40455g203j09719r296I8029b06526M7481A73049
11165A51067a79511g6455k17746A73708O4102l1315b13635J0717q3534a40337
11154A75982n2664J05700h412G0712f7483k5427a850j28534H1739J82816a3544
11142e2076A83430a97356A55853J8214E2161c2675l1462C36721E0582c2111m609
11131c6720I5375d9798B10682O141E7570Q3612E3412J23047i1765A23882b08288
11119A28000q497e3653l96958C24890b29594i4176B06013l6173G6208G26P727
11108H453a96513B77737K61855F4640i1667C79767g8432B43047o4064l4255f6857
$$ plain form
11188 -152141 -136092 -165911 -87508 200859 -175660 -11444 100593 64211 -289115 -144080
11177 26670 -79926 -191201 -321440 -180985 -7203 -116922 -126218 98029 -206526 -159045 173049
11165 151067 -179511 -76455 -294201 173708 237810 206495 -213635 -202918 -286452 -140337
11154 175982 123318 229018 -8412 70712 -67483 -92910 -1850 -130384 81739 264555 -13544
11142 -52076 183430 -197356 155853 174067 52161 -32675 -64137 336721 50582 -32111 -36720
11131 -36720 95375 -49798 210682 216823 57570 141182 53412 176459 -91765 123882 -208288
11119 128000 119503 -53653 -450611 324890 -229594 -94176 206013 169840 76208 726 8453
11108 8453 -196513 277737 539592 64640 -91667 379767 -78432 243047 178983 144728 -66857
11096A65973b9705E0431J44426E8652K9788C625L34249j27017K1996e3814A05549
11084c5338A13125o414L5331j5998J55121A17932P2250N4921A10598J83034C2090
11072C67164K22216B21647f724B54588N6933e693A72336K15665A34114M32624
11062E66738j54476A39165L07941J19257O773B32820R5360J63438A52004K34022
11052C86026K05643m2916n8061J79791j32669J23426A53993K51719L6450M1457
11042D83619M07153j96350l26437L47277o1993J9622K67679D40993N55598k90902
11032G05689P7027o1248j9338J57273M19064C81918P44075l68303o9104j31832
11022E56754L11516j36193J5015K64555j48575J6366j59902P799J51835k5262
$$ plain form
11096 165973 -29705 50431 194857 58652 88440 3625 337874 210857 232853 -53814 105549
11084 -35338 113125 106711 142042 126044 281165 117932 190182 245103 110598 293632 32090
11072 367164 589380 221647 -6724 254588 311521 -5693 172336 388001 134114 566738
11062 566738 412262 139165 447106 566363 573136 232820 328180 491618 152004 386026
11052 386026 591669 548753 490692 670483 537814 661240 153993 405712 442162 483619
11042 483619 890772 694422 367985 715262 653269 672891 940570 440993 996591 705689
11032 705689 782716 721468 702130 859403 1278467 381918 1125993 757690 688586 556754
11022 556754 868270 732077 747092 1011647 863072 879438 719536 727335 879170 853908
11012H53908J08613k79916q6420J22156j73118J78802k16589M92763k49891k46845
11002E03463J1609J24120O5042M8902k22371K90642j09375K54334l83121K99254
10992H82499j37586j09537J98502k02891j63597K15108j54437M08118l08258L51355
10982I79276l47424k5015k25916J97107J57845R0607j72574J16524L01826k40660
10972H31596P926J89480L4823P9011L85491k32039k27357K90623R7488K85121
10962A742163M70381m36087K40518L54065J32718M68813J73799j570N895K85268
10952C435963p62718m5300k62745k65537j90994k28783r6165j48123R4594q6308
10942A443884o1333P0533k26595n1575p8190r3461j17066j95121j65875O1312
$$ plain form
11012 853908 962521 682605 596185 718341 545223 724025 507436 1000199 750308 503463
11002 503463 515072 639192 704234 753136 530765 821407 712032 966366 583245 882499
10992 882499 744913 635376 833878 630987 467390 682498 528061 936179 627921 979276
10982 979276 631852 606837 380921 578028 735873 826480 653906 770430 1072256 831596
10972 831596 839522 1029002 1063825 1142836 1528327 1296288 1068931 1359554 1457042 1742163
10962 1742163 2212544 1776457 2016975 2371040 2503758 2972571 3146370 3144800 3150695 3435963
10952 3435963 2673245 2627945 2365200 2099663 1908669 1679886 1583721 1435598 1530192 1443884
10942 1443884 1382551 1453084 1226489 1174914 1096724 1003263 886197 691076 525201 586513
10932E86513j54760M08297A48562K72335j03130A17318K77840j92114J1120O4235
10922B78399F3457k8686K06416J02870p0729K2529J04653j53127J31194H4029
10911G7795B7337J73295a5532A61589b46917N0784C2172J28459m6950b2354B61577
10899b94896E3416b80353A874a52120B6590b71027G6368a13150o8296b3101A74843
10887e3042j34280G6114j864j6582e864m210l11750E3554J75384d9720k90339
10876c40059A70252h0676A165J97734a23264A35712a45405E3231j9066i2452p2677
10865a65129A03987a25893q7657C03001f6542k71408C5453R2314d7016I4625c0594
10853D3768J94278b74478h5608B5738J63253i566A85782l3369n0069a73149e4348
$$ plain form
10932 586513 431753 840050 148562 420897 317767 117318 395158 203044 214164 278399
10922 278399 63457 34771 241187 344057 273328 295857 400510 247383 378577 84029
10911 77795 27337 200632 -15532 161589 -246917 -196133 32172 160631 113681 -22354 261577
10899 -294896 53416 -280353 1874 -152120 26590 -271027 76368 -113150 -181446 -23101 174843
10887 -53042 -187322 76114 74250 57668 -5864 -10074 -321824 53554 228938 -49720 -340059
10876 -340059 170252 -80676 1165 198899 -123264 135712 -145405 53231 34165 -92452 -165129
10865 -165129 103987 -125893 -213550 303001 -66542 -337950 35453 127767 -47016 94625 -30594
10853 43768 238046 -274478 -85608 25738 188991 -9566 185782 152413 102344 -173149 -54348
10841A4614a03409j90155A94259a44104A50115b2310C61648J03309a34956a3241
10830G1889R5075p3618b1429k77438B10893a22305r3461A46778J06019b92871
10819d56953H7456e9698g676j11070A54551a31663B94056p8805l9408F653J19639
10808A26292D8239b06106c3570p9946c0428B5450b8251A61166F2031N5771O5533
10797A83335J04262a00568G3285b43833J20294j2851k4394A19427a2364k29993
10787b42357A07764K04142i6037B4051a8520B00888H3996a54621M4111J8089C10457
10775a80781A57209d1599k5924m319j0580j28463A28318a70861B28530L7651a08211
10763b70177j54730b5773d953m49391f6740p1304r8093E1384a98221d4892C06421
$$ plain form
10841 14614 -103409 -293564 194259 -144104 150115 -22310 361648 464957 -134956 -13241
10830 71889 166964 93346 -21429 -298867 210893 -122305 -215766 146778 252797 -292871
10819 -456953 87456 -59698 -7676 -118746 154551 -131663 294056 215251 175843 6653 126292
10808 126292 48239 -206106 -33570 -113516 -30428 25450 -28251 161166 62031 117802 183335
10797 183335 287597 -100568 73285 -243833 -123539 -136390 -160784 119427 -12364 -242357
10787 -242357 107764 311906 -96037 24051 -18520 200888 83996 -154621 -110510 -92421 310457
10775 -180781 157209 -41599 -67523 -71842 -82422 -210885 128318 -170861 228530 266181 -108211
10763 -270177 -424907 -25773 -4953 -454344 -66740 -138044 -236137 51384 -198221 -44892 306421
10751F9172E343a55823l3179B52105c43097b0137j1700k1282r8245J7137I2867
10739I2521J19059q3573g2157j48530J7669c3095A85953J8367D4372J9787d6538
10727E0800b99868k4364R9888B245a38041o6686K8565c7794e53j2447j30902L6424
10715a07478k84383a15361M4081A85148E3971g5532I0211a8561k31186d6209F3254
10703A96596f7806o6712B0108i3930I7438E244a40158b7440l0136A3658a61192
10691B45548C1000d4944D7298a02385F7405L226i9417j43761i0677j8941C6990
10679b6879E4578a21138b6354j8042q476l6219o123A02953d3927B2254a88285
10667b1728B7106e7098j53906F563M2689A5195d34415A45720I721b197j37800
$$ plain form
10751 69172 5343 -155823 -189002 252105 -343097 -20137 -31837 -53119 -151364 -134227 92867
10739 92521 211580 128007 -72157 -220687 -203018 -33095 185953 204320 44372 64159 -46538
10727 50800 -299868 -324232 -224344 2245 -138041 -204727 -176162 -37794 -553 -13000 -143902 -107478
10715 -107478 -391861 -115361 -71280 185148 53971 -75532 90211 -18561 -249747 -46209 63254
10703 196596 -67806 -134518 20108 -93930 97438 5244 -140158 -27440 -57576 13658 -161192
10691 245548 31000 -44944 47298 -102385 67405 70631 -99417 -243178 -90677 -109618 36990
10679 -26879 54578 -121138 -26354 -44396 -52872 -89091 -95214 102953 -43927 22254 -188285
10667 -21728 27106 -57098 -211004 6563 49252 15195 -434415 145720 9721 -2197 -139997
10656a39997G6350e546k40600g0368G3320a19904c8240B09928a85585p267N562
10645a87290e3223F7855a23947C39112d0787A01291a30670G464b07222a1218m29410
10634d40628a76161i145n3724A45203a13669l7261k26394I390f4521K9459q6863
10623a21925H1148b38099c5925k5618A78788o5760c70364A12225b4056C04841
10612a53165d850B51995h0450p0906e8257K8500F6051L6200d55484a10519F9586
10600f9737m0637A94142b99702A94763h7156C2827d0227j16134g5317A1330a23197
10588f6803p7294B49705c28787B05485b44407a06979c4378k67152N0073A68378
10577C07907j40910B9192d7889B4040b24419D77J06113l3455K94392a03939B00311
$$ plain form
10656 -139997 76350 -5546 -246146 -70368 73320 -119904 -38240 209928 -185585 -192852 -187290
10645 -187290 -53223 67855 -123947 339112 -40787 101291 -130670 7464 -207222 -11218 -440628
10634 -440628 -176161 -9145 -62869 145203 -113669 -150930 -377324 9390 -64521 -35062 -121925
10623 -121925 81148 -238099 -35925 -61543 178788 113028 -370364 112225 -24056 304841
10612 -153165 -4850 251995 -80450 -151356 -58257 -29757 66051 102251 -455484 -110519 69586
10600 -69737 -110374 194142 -299702 194763 -87156 32827 -40227 -156361 -75317 11330 -123197
10588 -66803 -144097 249705 -328787 205485 -244407 -106979 -34378 -301530 -251457 168378
10577 307907 166997 29192 -47889 24040 -224419 477 106590 73135 367527 -103939 200311
10565A37185J61488g5466o568G0498b68189B1645K62813A16718h9000C65135a80181
10553c431A03641l7919b43923j1511a27490A43288L1569d94678A0763b028C0015
10541A50319j1219f8631A67256P7290e9283C01318b92301D1686J42276A4257b6588
10529i0344j82905A2746N7226b5607D822P5171k1546a43459A83753h248I4863
10517G8917Q0069c15023B0621a11093n463q208E9036j5633i2574I1515e2177i845
10504C44705a4905k48312a00120A90896a69657b0289n7720A15149c9790j08339
10494a48129M9348j68784J6409K3672C2305Q6981c7047j97637j48123B24605F334
10482C09203a8191r0741L8355n7705j24905A03889C1877a0034I2245d2368A39772
$$ plain form
10565 137185 298673 -75466 -82034 70498 -268189 21645 284458 116718 -89000 365135 -180181
10553 -3431 103641 65722 -243923 -255434 -127490 143288 174857 -494678 10763 -2028 30015
10541 150319 139100 -68631 167256 244546 -59283 301318 -292301 41686 183962 14257 -26588
10529 -90344 -273249 12746 69972 -25607 4822 79993 58447 -143459 183753 -8248 94863
10517 78917 158986 -315023 20621 -111093 -116556 -124764 59036 43403 -92574 91515 -52177 -9845
10504 344705 -14905 -263217 -100120 190896 -169657 -20289 -78009 115149 -39790 -148129
10494 -148129 -98781 -267565 -251156 -227484 32305 119286 -37047 -234684 -382807 224605 6334
10482 309203 -18191 -108932 -70577 -128282 -253187 103889 31877 -10034 92245 -42368 139772
10470A52120j1491M6201E8032a40057H5116R6011k5171O7135j4689F5222k6931
10459C8291a3869D03003A03790b505B41383j07037l0236J27691M6875h236B9485
10447A53194e9629m9958A09695c230p356H7604B8657K90713d626F9389e9310H8078
10434B14650a64853O6852J5511a4578A38541H045L0832a57253r7811D895f1989
10422a92977F4881e4740K4852A76779c5831j75466B08659I1182e0986A1033q90
10411A0143b55344P289C7868a60877A16636B3423e5671b35D7456a01964j394C12291
10398D34250c9016j7506A41613g3419C9205j2123g0522A14292l3166a64023n1789
10387b15812B6127d5125l62162c751r4138k87901a80603A22381b39918a8341p5896
$$ plain form
10470 152120 140629 186830 58032 -140057 85116 181127 155956 223091 208402 65222 38291
10459 38291 -13869 403003 103790 -2505 241383 134346 104110 231801 278676 -8236 29485
10447 153194 -59629 -109587 109695 -3230 -10586 87604 28657 319370 -4626 69389 -59310 88078
10434 214650 -164853 -98001 -82490 -14578 138541 8045 38877 -157253 -255064 4895 -61989
10422 -192977 64881 -54740 -29888 176779 -35831 -211297 208659 91182 -50986 11033 10143
10411 10143 -255344 -248055 37868 -160877 116636 23423 -55671 -235 47456 -101964 -103358 312291
10398 434250 -39016 -56522 141613 -73419 39205 27082 -70522 114292 81126 -164023 -215812
10387 -215812 26127 -45125 -407287 -3751 -97889 -385790 -180603 122381 -239918 -18341 -94237
10376i4237j59690C05299K66831A41743b88758D1329a44697A45860O5958L8239
10366B50057o7797J83151A12114R8732E8598K36798A00464N3477l8794M77948
10356E93095j73610A30477L7122m864K9919L6893L84979k21603j41836L51972
10346F03059A93648K13530F6405L98380B10277j213c74130A51062R8508L7504
10336B87074O2179K24299J2041j74738l0080o4797n0492A13615P3897r1933K71866
10325C67445j10875J2264o6766L59617k68880a03034E8328K31149j280B054a51706
10313A4698K84041o7541K29488A76698L0881H9209K17990M4326E7439J54026K03688
10302D15153F8063B0146d3287A01972l32h0756B06619Q4527D1679M6191L603P1193
$$ plain form
10376 -94237 -253927 305299 572130 141743 -288758 41329 -144697 145860 211818 250057
10366 250057 182260 365411 112114 210846 58598 295396 100464 153941 115147 593095
10356 593095 419485 130477 167599 162735 192654 229547 614526 392923 251087 603059
10346 603059 193648 407178 66405 464785 210277 209064 -374130 151062 249570 287074
10336 287074 349253 573552 585593 410855 380775 315978 265486 113615 187512 95579 367445
10325 367445 256570 268834 202068 561685 292805 -103034 58328 289477 288197 2054 -151706
10313 14698 298739 231198 460686 176698 207579 89209 307199 351525 57439 211465 415153
10302 415153 68063 20146 -43287 101972 101640 -80756 206619 291146 41679 87870 91473 162666
10290A62666b39884c824o62B0369a02628A68721e3081C9587b44350P6340b9362
10278H2812a41109h956B45550G5914i5648m3359p396a22k7351n5510j83786Q0844
10266a85925j55294O7855a19761A15779j4588c26974C0249a13170A42214a9293
10255a38221n0804Q9921f562j35524I408K10672P3098j35331B0611K4125M24686
10244D69422j27586G5596b58634D05005i5327B95209a19262A91801B8703K60427
10234B89130a23654F0218a74381B3579R0197b48532Q4479c8372m6207H7326A1876
10222F4225l393K7994J27001j03285Q218e3935o9570j88307B2301b86672j02219
10211c88891J57920a14325F5024a05531K6800A00430a92725A12111b82861A12284
$$ plain form
10290 162666 -239884 -3824 -4486 20369 -102628 168721 -53081 39587 -244350 -168010 -29362
10278 82812 -141109 -8956 245550 75914 -95648 -139007 -146403 -122 -27473 -82983 -266769 -185925
10266 -185925 -341219 -273364 -119761 115779 101191 -326974 30249 -113170 142214 -19293
10255 -138221 -189025 -99104 -6562 -142086 9408 220080 293178 157847 20611 44736 469422
10244 469422 341836 75596 -258634 405005 -95327 295209 -119262 191801 28703 289130
10234 289130 -123654 60218 -174381 23579 113776 -248532 -164053 -38372 -84579 87326 11876
10222 64225 60832 88826 215827 112542 120760 -53935 -123505 -311812 22301 -286672 -388891
10211 -388891 -230971 -114325 65024 -105531 -78731 100430 -192725 112111 -282861 112284
10200C2820K89193d3010r8184J8704M6213B71888b87325C57329d11121C53530
10189a54251L7685r280n5802B23312a34857j17911C5690L04405I1238O3285d6519
10177A46879b29654A7717b32171e7039l3423B6981J7307d46093e6978A51352J25057
10166B76409c08202A34579a67056b0990J0431r6427G9704a35226e2294l93072
10156d45366a81305B29559Q821l5774E3396a80520B16145B9990R8b5139l4192
10145e9331H4720b47921I2910a08229G0651O20a08103A8872K10247p7318c30643
10133a43264B8995J46556p6214j6573b15902k60336b01550h9354C7278q982c3106
10121B78108d40894J51108a38091I619b69855N9912j46574a39473C3237c2520
$$ plain form
10200 32820 322013 -43010 -141194 -122490 -76277 271888 -287325 357329 -411121 353530
10189 -154251 -116566 -125846 -181648 223312 -134857 -252768 35690 340095 91238 154523 -46519
10177 146879 -229654 17717 -232171 -57039 -90462 26981 44288 -446093 -56978 151352 276409
10166 276409 -308202 134579 -167056 -20990 -10559 -106986 79704 -135226 -52294 -445366
10156 -445366 -181305 229559 238380 202606 53396 -180520 216145 29990 30088 -25139 -59331
10145 -59331 84720 -247921 92910 -108229 70651 71271 -108103 18872 229119 151801 -330643
10133 -143264 28995 175551 99337 82764 -215902 -476238 -201550 -89354 37278 28296 -33106
10121 278108 -440894 -289786 -138091 9619 -269855 -209943 -356517 -139473 33237 -32520
10110A38188F6903l0594N4921a31823F7799O4572d05429B345L4353a77019A15965
10098e3604m95172a66341A4406c20599C7148a53588k46851A71457D2701a03802
10087B20138d1089n2924A95177q4495M9913b10981o8512J29210a6388E0617L212
10076E3829J51367c22404h1148r4449Q4073A58030p4654b7973B585c05176K7332
10065b77844C1597k704J67513a84185O9106a6329l38062i2040k45524J8295b1217
10053d6231j20795G8341J1300a38259A040c53477h3704n9124I5984f3515l989
10042f7504k65988H4503a45035A07281c55996A90277G8630J4557b87668J12564
10032a75104A71238a59814B44645a65995e3323C78092d64046A50268b49334J0495
$$ plain form
10110 138188 66903 36309 91230 -131823 67799 132371 -405429 2345 36698 -177019 115965
10098 -53604 -548776 -166341 14406 -320599 37148 -153588 -400439 171457 42701 -103802
10087 220138 -41089 -94013 195177 110682 160595 -210981 -279493 -150283 -16388 50617 53829
10076 53829 205196 -322404 -81148 -175597 -91524 158030 83376 -27973 2585 -305176 -277844
10065 -277844 31597 28893 196406 -184185 -115079 -16329 -354391 -92040 -337564 -319269 -21217
10053 -46231 -167026 78341 89641 -138259 1040 -353477 -83704 -142828 95984 -63515 -67504
10042 -67504 -333492 84503 -145035 107281 -355996 190277 78630 93187 -287668 -175104
10032 -175104 171238 -159814 244645 -165995 -53323 378092 -464046 150268 -249334 -238839
10022b38839B04117F4063A2897b81969B37899a484D7618Q9182d17122b02432R1263
10011a11169A64316a54485M9770a6958D7584e4901D839d3617A5412J43324a47438
9999a04820L495M6153l1168m8706A26556b73698A4469a38795O7727D2242b46027
9987B6910J9276d3093J2801k1611A46169a75714j2097I2718a7221A2397f8150
9975B0123a60615p1715K6649n4784O6131j51111C3665a25506C9524b79445a8575
9963c77798k9416a1361j32091K3522H7447o65p384b1415k69990n2978F8216B5102
9950f8970A897P4883a66352b9380F1953E725a89508O3488H8249c95105A04430
9938E8331J95624a1668A22419A1777J43414a45259j18830C35080a55449L9963
$$ plain form
10022 -238839 204117 64063 12897 -281969 237899 -1484 47618 136800 -417122 -202432 -111169
10011 -111169 164316 -154485 -104715 -16958 47584 -54901 4839 -43617 15412 158736 -147438
9999 -104820 -101325 -55172 -86340 -135046 126556 -273698 14469 -138795 -71068 42242 -246027
9987 26910 46186 -43093 -30292 -51903 146169 -175714 -187811 92718 -17221 12397 -68150
9975 20123 -160615 -232330 -205681 -260465 -194334 -345445 33665 -125506 39524 -279445 -18575
9963 -377798 -407214 -11361 -143452 -119930 87447 86782 79398 -21415 -291405 -344383 68216 25102
9950 -68970 1897 76780 -166352 -29380 61953 5725 -189508 -126020 88249 -395105 104430
9938 58331 253955 -11668 122419 11777 155191 -145259 -264089 335080 -155449 -115486
9928a15486j59904d5740A99172b14680f6270j73873m8170J22429j35412P2575
9918b28721a05506k07136M1153c9894l43993i1516M3037A86922a07523n34104
9908f41627b21759A30516K3225c241C25b09649d9166q8610k03932d7349j6995
9897f4344B32883a32724d0879l37756A95570a23957H3797a77682B8187a10252
9886e1351q5827F1642h6719m4919A90863G6607B411c0379P171B31090a23308j16541
9874b39849B39866c36627I4786b80713B26860a17521n5739A80919a36876A02308
9863a53416J25j20891J5115a5562H653c95267a17927k53763J84634P9014b7277
9851H2816J37773C1781b36640a10501j12662j42370C6491L72900h2456l3432A26780
$$ plain form
9928 -115486 -275390 -45740 199172 -214680 -66270 -240143 -288313 -165884 -301296 -228721
9918 -228721 -105506 -312642 -271489 -39894 -383887 -91516 -48479 186922 -107523 -641627
9908 -641627 -221759 130516 153741 -3241 325 -209649 -49166 -137776 -341708 -47349 -64344
9897 -64344 232883 -132724 -40879 -378635 195570 -123957 83797 -177682 28187 -110252
9886 -51351 -137178 61642 -86719 -131638 190863 76607 2411 -30379 -23208 231090 -123308 -239849
9874 -239849 239866 -336627 94786 -280713 226860 -117521 -173260 180919 -136876 102308
9863 -153416 -153291 -274182 -259067 -15562 8653 -395267 -117927 -371690 -187056 -108042 -27277
9851 82816 220589 31781 -236640 -110501 -223163 -365533 36491 409391 -82456 -115888 126780
9839b00716L2464E2790e20087b52240J16047b0595l4105j65060A92556q0369L08359
9828D20546a24300l5789b2358A82857i2546n728j37956k80557H079a84082B4855
9816B7276J3548b13081J04469C3730i6711k90494A29088a27372B04726a15671
9805c00616B74922A19941C6598g8368B59863P3779i4510j50358I1458d46502B18281
9793D55722a79501g9604q7608j64402g1321E68848c45185G5923j9481a83253A25722
9781B60948G09J18120b60182a15240I6117l5004b12088j19312a45238A86291c41416
9769B44694g3372p845A69669a38164M3156j47214B9163d8950A9745b58343h8754
9757C3970C012b71132A04883b7043p4450k6737N9137j72997O8658B8930e2066
$$ plain form
9839 -200716 -168252 52790 -520087 -252240 -136193 -20595 -54700 -219760 192556 112187 420546
9828 420546 -124300 -160089 -22358 182857 -92546 -98274 -236230 -516787 8079 -184082 24855
9816 27276 40824 -213081 -108612 33730 -96711 -387205 129088 -127372 204726 -115671
9805 -300616 274922 119941 36598 -78368 259863 333642 -94510 -244868 91458 -446502 218281
9793 455722 -179501 -79604 -167212 -331614 -71321 568848 -345185 75923 56442 -183253 125722
9781 260948 709 118829 -260182 -115240 96117 61113 -212088 -331400 -145238 186291 -341416
9769 244694 -73372 -81217 169669 -138164 -95008 -242222 29163 -48950 19745 -258343 -88754
9757 33970 3012 -271132 104883 -27043 -101493 -128230 -69093 -242090 -173432 28930 -52066
9745b6755j0374M656j62022f1379K8411j33567D56K6529d67974J88010R9104O2548
9733a18312J1984D5999i288k25423f5624j41058M6949D6481L3055b44593A98958
9721a20758k4300G7510P2415f5610K3492j9093R981m2834a3273j85943A34638
9709a18970C1795P7817f0564J5131k1601c076j56519M8190J6427M3779A48326
9697b60363i5602b812j40803G8011h3970E2388b45040A89289e7788n3833k74635
9686c86256A66623G8009b55148B57411b01576m1903J11361A32997a40559o2794
9676b03353e433I6234e2481l63529J10523C3141a61095a2669b422B3670n934e6139
9663A4015a98325C3870K82622A14062a35700A8257J06145e3859l04948D8967a92110
$$ plain form
9745 -26755 -37129 -32473 -194495 -61379 -32968 -166535 456 26985 -467974 -279964 -180860 -118312
9733 -118312 -106328 45999 -9288 -234711 -65624 -206682 -159733 46481 79536 -244593 198958
9721 -120758 -145058 77510 149925 -65610 -42118 -61211 -51230 -94064 -13273 -199216 134638
9709 -118970 31795 109612 -60564 -45433 -67034 -3076 -159595 -111405 -94978 -51199 148326
9697 -260363 -95602 -2812 -143615 78011 -83970 52388 -245040 189289 -57788 -111621 -386256
9686 -386256 166623 78009 -255148 257411 -201576 -243479 -132118 132997 -140559 -203353
9676 -203353 -5433 96234 -52481 -416010 -305487 33141 -161095 -12669 -2422 23670 17736 -56139
9663 14015 -198325 33870 316492 114062 -135700 18257 124402 -53859 -358807 48967 -192110
9651a48558E450K800c5731A52026a8115j17812k91373J85235C6633f2920j16910
9640a79830L3782o5391Q1937l4375F4382b68878j18818a91021j0558f748j45781
9629a52529j47855i5696D6067b16249A77350a29236e138j16375L5549j22285m3607
9618b51856j2331C0231h2021A12782b4144l3729F9595a261k19685i5981B2839
9606b54130A67394b54668L7270B95266r8313D7062J04778a13376j14600L6351
9596a91625n0926p655A98200A7140b93273G7400g0661B12285d4511D3101J0372
9585E3473I838a38813C4362i3163B4034a52485J302I3766c5556B65046a3222j58355
9573a71577I3753d3312m056J4926j89484P3829j09791D16442a97191F4083C627
$$ plain form
9651 -148558 5450 8250 -35731 152026 -18115 -135927 -427300 -242065 36633 -62920 -179830
9640 -179830 -146048 -211439 -129502 -163877 64382 -268878 -387696 -191021 -201579 -6748 -152529
9629 -152529 -300384 -95696 46067 -216249 177350 -129236 -5138 -121513 -85964 -208249 -251856
9618 -251856 -264187 30231 -82021 112782 -24144 -57873 69595 -1261 -220946 -95981 22839
9606 -254130 167394 -254668 -217398 295266 196953 47062 151840 -113376 -227976 -191625
9596 -191625 -242551 -250206 198200 17140 -293273 77400 -70661 212285 -44511 43101 53473
9585 53473 9838 -138813 34362 -93163 24034 -152485 -151183 93766 -35556 265046 -13222 -171577
9573 -171577 93753 -43312 -47368 -32442 -221926 -148097 -257888 416442 -197191 64083 3627
9561a98673K6435c6718H6048k7007a13910J5721c1043j89752D3503e26012a43523
9549b72340J22084m18849a65971A11561a04701B33462c0087m06487b04618b2259
9538A57065h8518j10033A38437b15304c0320l41454f4955L1886B38705C1708a60227
9526E6843j927J13558a08640B31736c2742l4555j1599e978j16186P271d2852A15847
9513b57249h5722H3990J96894a48614j16040d7309B9074b81168A11091c43304
9502c9760o7996j49189o1308a23495h525o6783A0231K05684a89900R3367K9277
9491f7256A49191d1257E7181k8476a8230C9229b91380F4113B8758J35696J549
9480A66003b9703B11452D1705b67887E1662O6969g8984A3640l808d46475D3625
$$ plain form
9561 -198673 -172238 -36718 86048 59041 -113910 -98189 -31043 -220795 43503 -526012 -143523
9549 -272340 -150256 -569105 -165971 111561 -104701 233462 -30087 -436574 -204618 -22259
9538 157065 -88518 -198551 138437 -215304 -30320 -371774 -64955 -33069 238705 31708 -160227
9526 56843 54916 168474 -108640 231736 -32742 -67297 -78896 -5978 -122164 -114893 -42852 115847
9513 -257249 -85722 83990 280884 -148614 -264654 -47309 29074 -281168 111091 -343304
9502 -39760 -107756 -256945 -318253 -123495 -8525 -75308 10231 215915 -189900 -96533 -67256
9491 -67256 149191 -41257 57181 28705 -18230 39229 -291380 64113 28758 164454 166003
9480 166003 -29703 211452 41705 -267887 51662 118631 -78984 13640 9832 -446475 43625
9468a86129A50124c53513d2984A32170a7307A38538b47714H4645B4898a07968
9457a83393C860f4900I7813c51673Q593C1238a14134L6772r3464g735B6397b64753
9444h6580p5506I4972m7262d37776e9223r5681q1060L2921B69064a70897A09785
9432C30105c23510f0036p9133l2371K7435d9944B09552a0116k61754j84736B26719
9420b57119J16724B15058a80188A58391a5023A42241J29050a09670j47986J23604
9410a34052A45900a50306K8504c0444k52469j03669d9064j38607J7566N6511p3183
9399a86777c3086a126I1516J20768B735c286j53097l03283e1191A91430a63711
9387a57986p8029C6375d6155A59060c06535g3335a0521m2775k22465i6785H9503
$$ plain form
9468 -186129 150124 -353513 -42984 132170 -17307 138538 -247714 84645 24898 -107968
9457 -183393 3860 -64900 97813 -351673 -343080 31238 -114134 -77362 -170826 -7735 26397 -264753
9444 -86580 -162086 94972 47710 -437776 -59223 -154904 -235964 -203043 269064 -170897 109785
9432 330105 -323510 -60036 -139169 -171540 -144105 -49944 209552 -10116 -271870 -456606 226719
9420 -257119 -140395 215058 -180188 158391 -15023 142241 271291 -109670 -257656 -134052
9410 -134052 145900 -150306 -121802 -30444 -282913 -386582 -49064 -187671 -170105 -113594 -186777
9399 -186777 -33086 -1126 91516 212284 2735 -3286 -156383 -459666 -51191 191430 -163711
9387 -157986 -236015 36375 -46155 159060 -306535 -73335 -10521 -53296 -275761 -96785 89503
9375b46164G8273l5186g7734j82542F9817g4618j71871h0388a0164l01645B82706
9363e1691A4952b58866n8075A56584a21999o425k08092G1976B5925i0565j33307
9352b23872J03552A36463J18965i1827n853A72870G7880L2564a57204D0607a53996
9340b40382R2699C99607A61218f4329l07003C2046e8172k76415a15991A5382O2013
9329G7395d60329f3541K6353j91158j59113G3722b9725I6311L0654h0615k75673
9318c56288d2443P701m59749A75045o6666N590b51499C562J41293a03968B104
9306g3310A28265A7714a81210j075K4184e0285G4698b32852K2415R9710J0868
9295i9859l1745p0681E9046a68381f5990r2521n0318d6403j59774F7775b7631
$$ plain form
9375 -246164 78273 43087 -77734 -260276 69817 -74618 -246489 -80388 -10164 -311809 282706
9363 -51691 14952 -258866 -316941 156584 -121999 -128424 -336516 71976 25925 -90565 -223872
9352 -223872 -120320 136463 255428 -91827 -97680 172870 77880 110444 -157204 40607 -153996
9340 -240382 -147683 399607 161218 -64329 -371332 32046 -58172 -334587 -115991 15382 77395
9329 77395 -460329 -63541 -37188 -228346 -387459 73722 -29725 96311 126965 -80615 -356288
9318 -356288 -42443 -34742 -494491 175045 108379 113969 -251499 3562 144855 -103968 2104
9306 -73310 128265 17714 -181210 -182285 -158101 -50285 74698 -232852 -210437 -110727 -99859
9295 -99859 -131604 -202285 59046 -168381 -65990 -158511 -208829 -46403 -206177 67775 -27631
9283c56795a10165D1383b4999r9735k3919j61628A48446D3588c3304j55786k2696
9272b11786F8053h726B66369h4278j77933A13403b68915C4165A5000M8614N2095
9261A15709k793j2044j5551b30890f5856J2034E0005d9344C5312g0883A11884
9249a89138k699j10267f2695j29407q6970O6982J317D3295c129k84710Q5073r0228
9237b92994A43341a30038H7270a45597k3308m6146o6538i9959H2230a66942o5461
9226b32403H741K48549a76792o637N5580A83909b8025B2982f0296j75189J13287
9215a22198A46863O0234b12033j9695f1347n8347A99634K9972b35636b0625K867
9204a7758j30265d5641F2911f7534C33009b5010F8671j3962a26601A13778a73771
$$ plain form
9283 -356795 -110165 41383 -24999 -124734 -148653 -310281 148446 43588 -33304 -189090 -211786
9272 -211786 68053 -8726 266369 -84278 -262211 113403 -268915 34165 15000 63614 115709
9261 115709 112916 100872 85321 -230890 -65856 -53822 50005 -49344 35312 -70883 111884
9249 -189138 -191837 -302104 -62695 -192102 -279072 -212090 -210773 43295 -3129 -287839 -202766 -292994
9237 -292994 143341 -130038 87270 -145597 -168905 -215051 -281589 -99959 82230 -166942 -232403
9226 -232403 8741 257290 -176792 -183429 -127849 183909 -28025 22982 -60296 -235485 -122198
9215 -122198 146863 207097 -212033 -231728 -61347 -119694 199634 229606 -235636 -20625 -17758
9204 -17758 -148023 -45641 62911 -67534 333009 -25010 68671 54709 -126601 113778 -173771
9192A20471K06501a35371G9494h285q1317B08383I8646c54190j09102a86182B49841
9180i7641n5819p2796A05488D2768b68836h0768A41337b40818N7838j69800J07491
9169b45289E8211f6329B14294a45849L0555K4271k3081i947A62203b2732C3138
9157a51187m4138k6245H6590b45456J09401b033D8189b31791D54700b3305p8318
9146a01623j05598e9773B38420f6585A4876c38062B98225D3960K7645b9716j95529
9135b25245G6708h2059j97552g0726n8082C0928b8134j78131p5125B10546c4011
9123c35457a22835B35011b39967h6414B6483b69210A28957a73276B71835A0922
9112a47182a9972E2937N9104b65510J13856O9345q9488k897G1648e96499K27162
$$ plain form
9192 120471 326972 -135371 79494 -8285 -89602 208383 98646 -354190 -463292 -186182 249841
9180 -97641 -153460 -226256 105488 42768 -268836 -80768 141337 -240818 -182980 -352780 -245289
9169 -245289 58211 -66329 214294 -145849 -115294 -91023 -114104 -9947 162203 -22732 33138
9157 -151187 -195325 -221570 86590 -245456 -136055 -2033 48189 -231791 454700 -23305 -101623
9146 -101623 -207221 -59773 238420 -66585 14876 -338062 298225 43960 71605 -29716 -225245
9135 -225245 76708 -82059 -279611 -70726 -128808 30928 -28134 -206265 -281390 210546 -34011
9123 -335457 -122835 235011 -239967 -86414 26483 -269210 128957 -173276 271835 10922
9112 -147182 -19972 52937 112041 -265510 -151654 -82309 -171797 -174694 71648 -596499 -369337
9101c69337K7285J08453d481p0522B10821A2927P8837a4780q4874j55834G0903
9089a78539B68925a96934e0737A57220d14815A65288c31511a20796j70425O3064
9079b28157A80416a02494F3102R7485M9371F6518J8393J33265a22085M3650n9140
9068a37575A42235a42218A09000Q480a81239f8954p3408b4554j61089B67162i1836
9056a68872F4601a43536l39748B26555G6829O7511b78452N0417a1752l24509A5950
9044F5243l0745a98163B64309B4918i870k75688d8446A07767N5612A4819d7636
9032B71850A34668b87804a26019g625A15880c00033A44009A6118J40833i5454
9021a11715o8475f7658K8044m19294a4482l21435J53629O1020j2517H1130C0974
$$ plain form
9101 -369337 -342052 -233599 -4481 -75003 210821 12927 91764 -14780 -99654 -255488 70903
9089 -178539 268925 -196934 -50737 157220 -414815 165288 -331511 -120796 -291221 -228157
9079 -228157 180416 -102494 63102 160587 209958 66518 84911 218176 -122085 -78435 -137575
9068 -137575 142235 -142218 109000 117480 -181239 -68954 -142362 -24554 -185643 267162 -91836
9056 -168872 64601 -143536 -483284 226555 76829 144340 -278452 -228035 -11752 -336261 15950
9044 65243 34498 -198163 264309 24918 -9870 -285558 -48446 107767 163379 14819 -47636
9032 271850 134668 -287804 -126019 -7625 115880 -300033 144009 16118 156951 -95454
9021 -111715 -180190 -67658 -39614 -458908 -14482 -335917 -182288 -121268 -133785 81130 30974
9009B12942f9481k725K0597K1624j81214i1742k40980H7586J47418G667b09658
8997h2909J2261B42961b87201J32646j1642o3918j13838J13720J14934e5058o6005
8986a21063M1672A71837i2069c5777l96813H8239K1779J72936d56270a51939j189
8975a53128l5067A78658c1319j79489j00233B52965p177d8405j59910f7108F5545
8963b06872C6985c40939e8014A91390a08868A54788i5736B9837d46819E9306f1438
8951c3715j05159c9008j85653n8327A7219e7023o4461A50627c88445F7706e576
8939i5130d521j87541A07883a23194q9428f1913K3687K055J6535b525B75977b5250
8926a4341k3467q5449A37163g9328G6436c94998H4320i453E07809A79829Q9593
$$ plain form
9009 212942 -69481 -72206 -51609 -29985 -211199 -91742 -332722 87586 235004 7667 -209658
8997 -82909 -70648 242961 -287201 -154555 -166197 -230115 -343953 -230233 -115299 -55058 -121063
8986 -121063 -79391 171837 -92069 -35777 -432590 88239 110018 282954 -456270 -151939 -153128
8975 -153128 -188195 178658 -31319 -210808 -311041 252965 245788 -48405 -208315 -67108 65545
8963 -206872 36985 -340939 -58014 191390 -108868 154788 -95736 29837 -446819 59306 -61438
8951 -33715 -138874 -39008 -224661 -282988 17219 -57023 -121484 150627 -388445 67706 -5576
8939 -95130 -4521 -192062 107883 -123194 -212622 -61913 -38226 -36171 -19636 -2525 275977 -25250
8926 -14341 -37808 -123257 137163 -79328 76436 -394998 84320 -9453 507809 179829 269422
8915B69422J57733I9397D2926L72364j70387N45315K42093M25490J429868K613274
8905E500943O227192E243856k583483A299861m82687m5818B10961m7920k65K37292
8895D00068n9348D2557J59756J00497j00053O7829J8865E9129a35024A56348a45193
8883A78354a39151A7987L9035K29165a64923d7673p534j9048G966K64760I9128
8871b4508o6472K5373B00220d1817l0029n7934m2360c8913j63524A05702q172
8860I7530a60031e5189I2159K96858A0703P8081l7549a54729A29932a48638O8023
$$ plain form
8915 269422 427155 99397 42926 415290 244903 790218 1032311 1457801 2887669 5500943
8905 5500943 11728135 5243856 2660373 1299861 817174 771356 210961 163041 162776 400068
8895 400068 340720 42557 202313 302810 202757 270586 289451 59129 -135024 156348 -145193
8883 178354 -139151 17987 57022 286187 -164923 -47673 -55207 -74255 7966 272726 99128
8871 -24508 -90980 -65607 200220 -41817 -71846 -129780 -172140 -38913 -202437 105702 97530
8860 97530 -160031 -55189 92159 389017 10703 88784 51235 -154729 129932 -148638 -80615
$$ [...]
##END NTUPLES=NMR SPECTRUM
##END=
