
##TITLE=UV1136_M4-1010-1000_6275356_ixds3EIxaF
##JCAMPDX= 6.0         $$ Bruker NMR JCAMP-DX V2.0
##DATA TYPE= NMR SPECTRUM
##DATA CLASS= NTUPLES
##ORIGIN= BRUKER
##OWNER= Administrator
$$ 1.72 TOPSPIN		Version 2.1
$$ 2012-06-03 01:43:10.640 -0500  Administrator@TOPSPIN
$$ Compression mode = diff/dup
##.OBSERVE FREQUENCY= 400.13188235
##.OBSERVE NUCLEUS= ^1H
##.ACQUISITION MODE= SIMULTANEOUS (DQD)
##.ACQUISITION SCHEME= undefined
##.AVERAGES= 64
##.DIGITISER RES= 22
##SPECTROMETER/DATA SYSTEM= spect
##.PULSE SEQUENCE= noesygpps1d.comp
##.SOLVENT NAME= COFFEE_meoh
##.SHIFT REFERENCE= INTERNAL, COFFEE_meoh, 1, 14.96718
##AUDIT TRAIL= $$ (NUMBER, WHEN, WHO, WHERE, PROCESS, VERSION, WHAT)
$$ ##TITLE= Audit trail, TOPSPIN		Version 2.1
$$ ##JCAMPDX= 5.01
$$ ##ORIGIN= Bruker BioSpin GmbH
$$ ##OWNER= Administrator
$$ $$ C:\Bruker\TOPSPIN/data/COFFEE/nmr/UV1136_M4-1010-1000_6275356_ixds3EIxaF/12/pdata/1/auditp.txt
$$ ##AUDIT TRAIL=  $$ (NUMBER, WHEN, WHO, WHERE, PROCESS, VERSION, WHAT)
(   1,<2012-06-03 01:43:05.562 -0500>,<Administrator>,<TOPSPIN>,<go>,<TOPSPIN 2.1>,
      <created by zg
	started at 2012-06-03 01:31:35.265 -0500,
	POWCHK enabled, PULCHK disabled,
       configuration hash MD5:
       D5 CA 7A 23 FE 6B EE E2 50 67 74 61 24 F7 5E 3B
       data hash MD5: 64K
       70 A8 CA CE 2E 5B C4 F0 BD D5 25 0C 61 FA 87 43>)
(   2,<2012-06-03 01:43:08.234 -0500>,<Administrator>,<TOPSPIN>,<proc1d>,<TOPSPIN 2.1>,
      <Start of raw data processing
       efp LB = 0.3 FT_mod = 6 PKNL = 1 PHC0 = 0 PHC1 = 0 SI = 128K 
       data hash MD5: 128K
       07 83 78 52 B4 F3 65 40 34 41 02 85 C7 9E 67 59>)
(   3,<2012-06-03 01:43:09.515 -0500>,<Administrator>,<TOPSPIN>,<proc1d>,<TOPSPIN 2.1>,
      <pk PHC0 = 33.70605 PHC1 = 0 
       data hash MD5: 128K
       72 A5 A4 E5 4B D3 37 09 3E 84 AB FF EC E3 C8 E8>)
(   4,<2012-06-03 01:43:10.296 -0500>,<Administrator>,<TOPSPIN>,<proc1d>,<TOPSPIN 2.1>,
      <abs ABSG = 1 
       data hash MD5: 128K
       32 42 9D 86 D2 13 FF AB 4D 95 81 B5 62 37 2C 82>)
(   5,<2012-06-03 01:43:10.375 -0500>,<Administrator>,<TOPSPIN>,<proc1d>,<TOPSPIN 2.1>,
      <abs ABSG = 2 
       data hash MD5: 128K
       D0 13 5B D1 64 05 99 5D 8D E0 B2 03 E9 6D 4A 1A>)
(   6,<2012-06-03 01:43:10.453 -0500>,<Administrator>,<TOPSPIN>,<proc1d>,<TOPSPIN 2.1>,
      <abs ABSG = 3 
       data hash MD5: 128K
       D5 0A 4D 7B 51 CA 71 C8 F4 57 84 13 E5 F7 4E D4>)
(   7,<2012-06-03 01:43:10.500 -0500>,<Administrator>,<TOPSPIN>,<proc1d>,<TOPSPIN 2.1>,
      <abs ABSG = 4 
       data hash MD5: 128K
       79 17 35 13 07 A3 16 48 D6 9D A2 02 38 22 8B 8A>)
(   8,<2012-06-03 01:43:10.562 -0500>,<Administrator>,<TOPSPIN>,<proc1d>,<TOPSPIN 2.1>,
      <abs ABSG = 5 
       data hash MD5: 128K
       53 E0 D7 4E C5 83 E7 9A 84 B3 08 BB B2 32 97 9E>)
$$ ##END=
$$ 
$$ $$ hash MD5
$$ $$ 3D A2 DB 28 B5 58 57 0A AD F4 28 92 BF 10 4F 3F
##$RELAX= 
##$RELAX= 
##$RELAX= 
##$RELAX= 
##$RELAX= 
##$RELAX= 
##$RELAX= 
##$RELAX= 
$$ Bruker specific parameters
$$ [...]
##$TP07= 0
##$TPNAME0= <>
##$TPNAME1= <>
##$TPNAME2= <>
##$TPNAME3= <>
##$TPNAME4= <>
##$TPNAME5= <>
##$TPNAME6= <>
##$TPNAME7= <>
##$TPOAL= (0..7)
0.5 0.5 0.5 0.5 0.5 0.5 0.5 0.5
##$TPOFFS= (0..7)
0 0 0 0 0 0 0 0
##$TUNHIN= 0
##$TUNHOUT= 0
##$TUNXOUT= 0
##$USERA1= <user>
##$USERA2= <user>
##$USERA3= <user>
##$USERA4= <user>
##$USERA5= <user>
##$V9= 5
##$VALIST= <valist>
##$VCLIST= <CCCCCCCCCCCCCCC>
##$VD= 0
##$VDLIST= <DDDDDDDDDDDDDDD>
##$VPLIST= <PPPPPPPPPPPPPPP>
##$VTLIST= <TTTTTTTTTTTTTTT>
##$WBST= 2048
##$WBSW= 25
##$XGAIN= (0..3)
0 0 0 0
##$XL= 0
##$YL= 0
##$YMAX_a= 11262387
##$YMIN_a= -6740158
##$ZGOPTNS= <>
##$ZL1= 120
##$ZL2= 120
##$ZL3= 120
##$ZL4= 120
##$ABSF1= 14.96718
##$ABSF2= -5.58535
##$ABSG= 5
##$ABSL= 3
##$ALPHA= 0
##$AQORDER= 0
##$ASSFAC= 0
##$ASSFACI= 0
##$ASSFACX= 0
##$ASSWID= 0
##$AUNMP= <proc_prof1d_extract.lims>
##$AXLEFT= 0
##$AXNAME= <>
##$AXNUC= <1H>
##$AXRIGHT= 0
##$AXTYPE= 0
##$AXUNIT= <>
##$AZFE= 0.1
##$AZFW= 0.1
##$BCFW= 0
##$BC_mod= 0
##$BYTORDP= 0
##$COROFFS= 0
##$CY= 15
##$DATMOD= 1
##$DC= 0
##$DFILT= <>
##$DTYPP= 0
##$F1P= 0
##$F2P= 0
##$FCOR= 0.5
##$FTSIZE= 131072
##$FT_mod= 6
##$GAMMA= 0
##$GB= 0
##$INTBC= 1
##$INTSCL= 1
##$ISEN= 128
##$LB= 0.3
##$LEV0= 0
##$LPBIN= 0
##$MAXI= 10000
##$MC2= 0
##$MEAN= 0
##$ME_mod= 0
##$MI= 0
##$NCOEF= 0
##$NC_proc= -3
##$NLEV= 6
##$NOISF1= 0
##$NOISF2= 0
##$NSP= 0
##$NTH_PI= 0
##$NZP= 0
##$OFFSET= 14.96718
##$PC= 1
##$PHC0= 33.70605
##$PHC1= 0
##$PH_mod= 1
##$PKNL= yes
##$PPARMOD= 0
##$PPDIAG= 0
##$PPIPTYP= 0
##$PPMPNUM= 2147483647
##$PPRESOL= 1
##$PSCAL= 4
##$PSIGN= 0
##$PYNMP= <proc.py>
##$REVERSE= no
##$SF= 400.130005373852
##$SI= 131072
##$SIGF1= 0
##$SIGF2= 0
##$SINO= 400
##$SIOLD= 131072
##$SPECTYP= <>
##$SREGLST= <1H.CDCl3>
##$SSB= 0
##$STSI= 131072
##$STSR= 0
##$SW_p= 8223.68421052632
##$SYMM= 0
##$S_DEV= 0
##$TDeff= 65536
##$TDoff= 0
##$TI= <>
##$TILT= no
##$TM1= 0
##$TM2= 0
##$TOPLEV= 0
##$USERP1= <user>
##$USERP2= <user>
##$USERP3= <user>
##$USERP4= <user>
##$USERP5= <user>
##$WDW= 1
##$XDIM= 131072
##$YMAX_p= 514758173
##$YMIN_p= -364656962
##$CURPLOT= <Network HP LaserJet P1505>
##$CURPRIN= <$Network HP LaserJet P1505>
##$DFORMAT= <normdp>
##$LAYOUT= <+/1D_H.xwp>
##$LFORMAT= <normlp>
##$PFORMAT= <normpl>
##$SURQMSG= 1
$$ End of Bruker specific parameters
$$ ---------------------------------
##NTUPLES= NMR SPECTRUM
##VAR_NAME=  FREQUENCY,     SPECTRUM/REAL,   SPECTRUM/IMAG
##SYMBOL=    X,             R,               I
##VAR_TYPE=  INDEPENDENT,   DEPENDENT,       DEPENDENT
##VAR_FORM=  AFFN,          ASDF,            ASDF
##VAR_DIM=   131072,        131072,          131072
##UNITS=     HZ,            ARBITRARY UNITS, ARBITRARY UNITS
##FACTOR=    0.0627417313425165, 1,          1
##FIRST=     8223.62146879498, -4928,        -107787
##LAST=      0,             -1218,           -109856
##MIN=       0,             -364656962,      0
##MAX=       8223.62146879498, 514758173,    0
$$ Real data points
##PAGE= N=1
##DATA TABLE= (X++(R..R)), XYDATA
$$ [...]
63496A224298J7247J8576K0328K2463K4492K6762L0082L4082L7377L9589M1981
$$ 1224298 1241545 1260121 1280449 1302912 1327404 1354166 1384248 1418330 1455707 1495296 1537277
63485A537277M5690N0344N4686N7427N7156N2577M3624L1715J8592N638n542j3217
$$ 1537277 1582967 1633311 1687997 1745424 1802580 1855157 1898781 1930496 1949088 1954726 1949184 1935967
63473A935967j6979j8261j8669j8544j7856j7587j9084k2467k6662l0814l4872
$$ 1935967 1918988 1900727 1882058 1863514 1845658 1828071 1808987 1786520 1759858 1729044 1694172
63462A694172l9006m3043m6481m8633m8995m7822m5939m3779m1108l8034l5429
$$ 1694172 1655166 1612123 1565642 1517009 1468014 1420192 1374253 1330474 1289366 1251332 1215903
63451A215903l3685l1866k8976k5500k2710k0915j9317j7276j4854j2443j0742
$$ 1215903 1182218 1150352 1121376 1095876 1073166 1052251 1032934 1015658 1000804 988361 977619
63440I77619j0582j1732j2317j0785q100o585o689o539m909l010k522l225l626
$$ 977619 967037 955305 942988 932203 924103 917518 910829 904290 899381 896371 893849 890624 886998
63427H86998l028j945r45l7R43J924K612K728K392K215K685L522M185M706N227
$$ 886998 883970 882025 881080 881043 881986 883910 886522 889250 891642 893857 896542 900064 904249 908955 914182
63412I14182N050L336P89q47j296k305m968p892r112q712q322q845r827j0416
$$ 914182 919232 922568 923357 922510 921214 918909 913941 906049 896937 888225 879903 871058 861231 850815
63398H50815r819p497m098j528q33o89O15K476L084K707L578O334Q916R885J0740
$$ 850815 840996 833499 829401 827873 827040 826351 826966 829442 832526 835233 838811 845145 854061 863946 874686
63383H74686J3471J7376K0035K0588K0333K0631K1801K3906K6997L0315L2592
$$ 874686 888157 905533 925568 946156 966489 987120 1008921 1032827 1059824 1090139 1122731
63372A122731L3636L4732L6913L9536M1078M0637L8207L4190K9487K5658K4006
$$ 1122731 1156367 1191099 1228012 1267548 1308626 1349263 1387470 1421660 1451147 1476805 1500811
63361A500811K4437K5860K7759L0628L4713L9143M2864M5868M8711N0959N0875
$$ 1500811 1525248 1551108 1578867 1609495 1644208 1683351 1726215 1772083 1820794 1871753 1922628
63350A922628M6850L8859K8475J7818Q414O20o067j2048j6961k0206k1885k2833
$$ 1922628 1969478 2008337 2036812 2054630 2063044 2063664 2057597 2045549 2028588 2008382 1986497 1963664
63338A963664k3859k5443k7924l1333l5002l8166m0933m3837m6242m6422m3817
$$ 1963664 1939805 1914362 1886438 1855105 1820103 1781937 1741004 1697167 1650925 1604503 1560686
63327A560686m0197l7649l6199l4469l1882k8857k5261k0404j4772j0213p672
$$ 1560686 1520489 1482840 1446641 1412172 1380290 1351433 1326172 1305768 1290996 1280783 1273111
63316A273111n745k381K562P297J0248J1498J2214J3335J5096J7414K0264K3407
$$ 1273111 1267366 1264985 1267547 1274844 1285092 1296590 1308804 1322139 1337235 1354649 1374913 1398320
63304A398320K6029K7278K7528K8643L2208L7511M2048M4221M4910M6010M7970
$$ 1398320 1424349 1451627 1479155 1507798 1540006 1577517 1619565 1663786 1708696 1754706 1802676
63293A802676M9516M9473M7940M5341M1116L4348K5507J6467Q262j60r739j8578
$$ 1802676 1852192 1901665 1949605 1994946 2036062 2070410 2095917 2112384 2120646 2120486 2110747 2092169
63281B092169k3289k3325k2149k3204k6208k8880l0829l3644l7736m1517m3878
$$ 2092169 2068880 2045555 2023406 2000202 1973994 1945114 1914285 1880641 1842905 1801388 1757510
63270A757510m5451m6741m6751m4529m0882l7487l5041l3090l0931k7948k3763
$$ 1757510 1712059 1665318 1618567 1574038 1533156 1495669 1460628 1427538 1396607 1368659 1344896
63259A344896j8904j4773j2244j0881j0115j0526j2999j7135k1410k4683k6661
$$ 1344896 1325992 1311219 1298975 1288094 1277979 1267453 1254454 1237319 1215909 1191226 1164565
63248A164565k7237k6293k4322k2308k0765j9334j7528j5501j3798j2648j1715
$$ 1164565 1137328 1111035 1086713 1064405 1043640 1024306 1006778 991277 977479 964831 953116
63237I53116j0590r356q549q525r149j0166j1454j2530j2488j1112r607r175r321
$$ 953116 942526 933170 924621 916096 906947 896781 885327 872797 860309 849197 839590 830415 821094
63224H21094q813p985q288r454r173o435l379k439l232l836l873m283m991m846
$$ 821094 812281 804296 796008 786554 777381 770946 767567 765128 761896 758060 754187 749904 744913 740067
63210G40067l784l095l390l817l557k889k437k313k177j460L41K786M217L460
$$ 740067 736283 733188 729798 725981 722424 719535 717098 714785 712608 711148 711489 714275 718492 721952
63196G21952J495L41N22R03Q65J073K004L080L785M305M771M932M982N620O886
$$ 721952 723447 723788 724310 725213 726078 727151 729155 732235 736020 740325 745096 750028 755010 760630 767516
63181G67516P960Q440Q859R650J0624J1772J3367J4997J5708J5570J5915J7459
$$ 767516 775476 783916 792775 802425 813049 824821 838188 853185 868893 884463 900378 917837
63169I17837J9307K0366K0485J9724J7947J5939J5462J7029J8880J9340J9071
$$ 917837 937144 957510 977995 997719 1015666 1031605 1047067 1064096 1082976 1102316 1121387
63158A121387J9611K0791K1185K0445J9556J9080J8578J7607J6036J3545R880
$$ 1121387 1140998 1161789 1182974 1203419 1222975 1242055 1260633 1278240 1294276 1307821 1317701
63147A317701N489J061l216p089r486r668q800q979j0708j2431j2694j1703j0561
$$ 1317701 1323190 1324251 1321035 1313946 1304460 1294792 1285992 1277013 1266305 1253874 1241180 1229477 1218916
63134A218916r872r299p889m887p93K761M790O169Q099J0097J0980J1332J3157
$$ 1218916 1209044 1199745 1191856 1186969 1186176 1188937 1193727 1199896 1207995 1218092 1229072 1240404 1253561
63121A253561J6874K0512K2365K2924K3410K3922K4012K3877K3756K3093K1446
$$ 1253561 1270435 1290947 1313312 1336236 1359646 1383568 1407580 1431457 1455213 1478306 1499752
63110A499752J9480J7928J6145J3099R431P019O332N476K483k460p770j2735j7896
$$ 1499752 1519232 1537160 1553305 1566404 1575835 1582854 1589186 1594662 1597145 1594685 1586915 1574180 1556284
63097A556284k3278k7557k9667l0557l2159l4780l6618l6279l4592l3112l1707
$$ 1556284 1533006 1505449 1475782 1445225 1413066 1378286 1341668 1305389 1270797 1237685 1205978
63086A205978k8986k4773k0673j7994j6373j4921j3589j2645j1609r727p214n143
$$ 1205978 1176992 1152219 1131546 1113552 1097179 1082258 1068669 1056024 1044415 1034688 1027474 1022331
63074A022331m101l503k442r60n7l82j026k60K337N097O287O381P275R495J1478
$$ 1022331 1018230 1014727 1012285 1011325 1011268 1010886 1009860 1009600 1011937 1017034 1023321 1029702 1036977 1046472 1057950
63059A057950J1866J1175J0487R711Q269O700O202O842P417P213O802O706O344
$$ 1057950 1069816 1080991 1091478 1101189 1109458 1116158 1122360 1129202 1136619 1143832 1150634 1157340 1163684
63046A163684N070L656L560M748N306L812J402M36J432K512K136J132J247K588
$$ 1163684 1168754 1172410 1175970 1180718 1186024 1189836 1191238 1191674 1193106 1195618 1197754 1198886 1200133 1202721
63032A202721L724L780L261K871K690K602K650K806K923K852K139J71k445l462
$$ 1202721 1206445 1210225 1213486 1216357 1219047 1221649 1224299 1227105 1230028 1232880 1235019 1235190 1232745 1229283
63018A229283j564J182J477n59j312J053L802L638J427P04K778N707P563Q409
$$ 1229283 1227719 1228901 1230378 1229819 1228507 1229560 1233362 1237000 1238427 1239131 1241909 1247616 1255179 1263588
63004A263588R151J0369J2576J5982J9600K1856K2559K3262K5386K8900L2898
$$ 1263588 1272739 1283108 1295684 1311666 1331266 1353122 1375681 1398943 1424329 1453229 1486127
62993A486127L6483L8828L9610L9817M1164M4100M7133M8574M8368M7744M7714
$$ 1486127 1522610 1561438 1601048 1640865 1682029 1726129 1773262 1821836 1870204 1917948 1965662
62982A965662M8428M9450N0057M9579M7981M5991M4436M3549M3037M2467M1403
$$ 1965662 2014090 2063540 2113597 2163176 2211157 2257148 2301584 2345133 2388170 2430637 2472040
62971B472040L9389L6141L1744K6656K1386J5875R177L39r919j9152k5556k9951
$$ 2472040 2511429 2547570 2579314 2605970 2627356 2643231 2652408 2652747 2642828 2623676 2598120 2568169
62959B568169l4427l9386m3217m4908m5453m6060m6088m3842l8890l2680k7016
$$ 2568169 2533742 2494356 2451139 2406231 2360778 2314718 2268630 2224788 2185898 2153218 2126202
62948B126202k2450j8128j2886o491J39N987J1031J5972K1108K6094L0576L4272
$$ 2126202 2103752 2085624 2072738 2066247 2066386 2072373 2083404 2099376 2120484 2146578 2177154 2211426
62936B211426L6491L6547L4995L3582L3615L4890L6384L7144L6439L4159L1529
$$ 2211426 2247917 2284464 2319459 2353041 2386656 2421546 2457930 2495074 2531513 2565672 2597201
62925B597201L0122K9475K6878K0533J1949L917k976j0324j8990k7923l5873m2729
$$ 2597201 2627323 2656798 2683676 2704209 2716158 2720075 2717099 2706775 2687785 2659862 2623989 2581260
62913B581260m8795n3993n8247o1704o4242o5499o5674o5469o4873o2926n9182
$$ 2581260 2532465 2478472 2420225 2358521 2294279 2228780 2163106 2097637 2032764 1969838 1910656
62902A910656n4727n1014m8237m5387m1722l7767l4969l4383l5359l5632l3529
$$ 1910656 1855929 1804915 1756678 1711291 1669569 1631802 1596833 1562450 1527091 1491459 1457930
62891A457930l0130k8292k9141l0662l0448k8671k7058k5944k4221k1984k0966
$$ 1457930 1427800 1399508 1370367 1339705 1309257 1280586 1253528 1227584 1203363 1181379 1160413
62880A160413k1692k2011j9861j6236j3794j3186j2663j1143r730r543r693q710
$$ 1160413 1138721 1116710 1096849 1080613 1066819 1053633 1040970 1029827 1020097 1010554 1000861 992151
62868I92151o885n692n501n349m870m898n799o591o374n558m913m370l673l366
$$ 992151 985266 979574 974073 968724 963854 958956 953157 946566 940192 934634 929721 925351 921678 918312
62854I18312l945m633m272l166k738l391m054m002l786l979m223m084l766l281
$$ 918312 914367 909734 905462 902296 899558 896167 892113 888111 884325 880346 876123 872039 868273 864992
62840H64992k013J2J541J840K093L620N507N782M575M073N150N972M773K391Q81
$$ 864992 862979 862991 864532 866372 868465 872085 877592 883374 887949 892022 897172 903144 907917 910308 911189
62825I11189Q08J226J491J675J606Q09n10j537j868j796j584j298j246j791k672
$$ 911189 911997 913223 914714 916389 917995 918804 918294 916757 914889 913093 911509 910211 908965 907174 904502
62810I04502l326l859m821o010o568o499o885q043q616p384n070l267k283j360
$$ 904502 901176 897317 892496 886486 879918 873419 866534 858491 849875 842491 837421 834154 831871 830511
62796H30511n45q30k316l695l970l541l086k437j377o00p64j218q87r1k56j686
$$ 830511 829966 829136 826820 823125 819155 815614 812528 810091 808714 808114 807350 806132 805245 805154 804898 803212
62780H03212k894k597j347n05m08m17k20o8P3N64J206J175K44o87o73J26Q23R20
$$ 803212 800318 797721 796374 795869 795461 795044 794824 794756 794829 795393 796599 797774 798018 797331 796658 796784 797607 798527
62762G98527O25L99O70J698L228M428M685M337M165M317M368M252M519N395O234
$$ 798527 799152 799551 800221 801919 805147 809575 814260 818597 822762 827079 831447 835699 840218 845613 851847
62747H51847O275N616N094N416O590Q051R139R554R544R574R850J0264J0797J1628
$$ 851847 858122 863738 868832 874248 880838 888889 898028 907582 917126 926700 936550 946814 957611 969239
62733I69239J2774J3921J4792J5510J6447J7885J9891K2349K5123K8326L2295
$$ 969239 982013 995934 1010726 1026236 1042683 1060568 1080459 1102808 1127931 1156257 1188552
62722A188552L6936M1258M4139M5743M7538N0648N4602N8045O0325O1820O3004
$$ 1188552 1225488 1266746 1310885 1356628 1404166 1454814 1509416 1567461 1627786 1689606 1752610
62711A752610O3653O3050O0595N6169N0084M2700L4151K4504J4203M046n397j4145
$$ 1752610 1816263 1879313 1939908 1996077 2046161 2088861 2123012 2147516 2161719 2165765 2160368 2146223
62699B146223k2513l0668l8498m5633n1543n5832n8449n9483n9045n7740n6764
$$ 2146223 2123710 2093042 2054544 2008911 1957368 1901536 1843087 1783604 1724559 1666819 1610055
62688A610055n6692n6367n4190n0507m7459m6031m4649m1478l6845l2304k8324
$$ 1610055 1553363 1496996 1442806 1392299 1344840 1298809 1254160 1212682 1175837 1143533 1115209
62677A115209k4443k0946j8704j7495j6008j3695j1392r787q473o891n355m515
$$ 1115209 1090766 1069820 1051116 1033621 1017613 1003918 992526 982739 974266 967375 962020 957505
62665I57505m304l922k614l27K225M163N377O572Q137R521J0321J1327J3494J6308
$$ 957505 953201 949279 946665 946338 948563 952726 958103 964675 972812 982333 992654 1003981 1017475 1033783
62651A033783J8414J9637K1148K3601K6444K9229L2310L5821L9075M1685M4295
$$ 1033783 1052197 1071834 1092982 1116583 1143027 1172256 1204566 1240387 1279462 1321147 1365442
62640A365442M7652N1676N5932O0272O4506O8171P1096P3574P5575P6494P6079
$$ 1365442 1413094 1464770 1520702 1580974 1645480 1713651 1784747 1858321 1933896 2010390 2086469
62629B086469P4841P3051O9985O4676N6799M6541L4333K1100P978m719j7530l0482
$$ 2086469 2161310 2234361 2304346 2369022 2425821 2472362 2506695 2527795 2535773 2531054 2513524 2483042
62617B483042m2565n2912o1590o8733p3975p7293p9369q0401p9642p7003p3866
$$ 2483042 2440477 2387565 2325975 2257242 2183267 2105974 2026605 1946204 1866562 1789559 1715693
62606A715693p1245o8370o4313n9871n6162n2415m7132m0984l6466l4611l3773
$$ 1715693 1644448 1576078 1511765 1451894 1395732 1343317 1296185 1255201 1218735 1184124 1150351
62595A150351l1951k8827k5191k1717j8851j6959j6025j5691j5627j5384j4239
$$ 1150351 1118400 1089573 1064382 1042665 1023814 1006855 990830 975139 959512 944128 929889
62584I29889j2127j0273r733r613q225n799m387m852n645n024l045p07J345K480
$$ 929889 917762 907489 897756 888143 879918 874119 869732 864880 859235 854211 851166 850459 851804 854284
62570H54284J797o57l302m638m775m602m354l784l021k292j468n93k55n26l62
$$ 854284 856081 855424 852122 847484 842709 838107 833753 829969 826948 824656 823188 822595 822340 821814 821452
62555H21452J006K638K997K074J350J947L681N816P661Q630Q573Q144Q157Q675
$$ 821452 822458 825096 828093 830167 831517 833464 837145 842961 850622 859252 867825 875969 884126 892801
62541H92801R320J0205J1709J3440J4479J4741J5274J6939J9473K2178K4769K7134
$$ 892801 902121 912326 924035 937475 951954 966695 981969 998908 1018381 1040559 1065328 1092462
62529A092462K8798K9182K8322K6932K5747K4830K3560K1219J7628J3030P522
$$ 1092462 1121260 1150442 1178764 1205696 1231443 1256273 1279833 1301052 1318680 1331710 1339232
62518A339232J063n783j1794j6338k0106k3869k6908k7827k6825k5953k6617k7747
$$ 1339232 1340295 1334512 1322718 1306380 1286274 1262405 1235497 1207670 1180845 1154892 1128275 1100528
62506A100528k7196k4477k1288j9479j9156j9012j8008j6336j4752j3455j2107
$$ 1100528 1073332 1048855 1027567 1008088 988932 969920 951912 935576 920824 907369 895262
62495H95262j0781j0099j0048r387p033l789j741j924l328m277l987k618o40J335
$$ 895262 884481 874382 864334 854947 847914 844125 842384 840460 837132 832855 828868 826250 825610 826945
62481H26945K744L609M445N378N887N767N570N627N339M250L121K978L624M231
$$ 826945 829689 833298 837743 843121 849008 854775 860345 865972 871311 875561 878682 881660 885284 889515
62467H89515N089P379J1044J4323J5931J6646J7865J9523K0534K0895K2172K5708
$$ 889515 894604 901983 913027 927350 943281 959927 977792 997315 1017849 1038744 1060916 1086624
62455A086624L1010L6238L9967M2328M4615M7757N1232N3621N4259N3886N3508
$$ 1086624 1117634 1153872 1193839 1236167 1280782 1328539 1379771 1433392 1487651 1541537 1595045
62444A595045N3115N2040M9999M7011M2749L6965L0430K4399J9024J3461P844
$$ 1595045 1648160 1700200 1750199 1797210 1839959 1876924 1907354 1931753 1950777 1964238 1972082
62433A972082L996L298M902P043R380J2825J7572K2794K8166L4191M0744M6588
$$ 1972082 1976078 1979376 1984278 1991321 2000701 2013526 2031098 2053892 2082058 2116249 2156993 2203581
62421B203581N1004N4680N8297O1079O1588N9123N3557M4732L3217K1068J0205
$$ 2203581 2254585 2309265 2367562 2428641 2490229 2549352 2602909 2647641 2680858 2701926 2712131
62410B712131J39j1441k5692m1332n6355o9616q0403q7893r1995r3848r4636r4434
$$ 2712131 2712270 2700829 2675137 2633805 2577450 2507834 2427431 2339538 2247543 2153695 2059059 1964625
62398A964625r2777q9520q4492p7333o8685o0546n4237m8823m2978l7542l4222
$$ 1964625 1871848 1782328 1697836 1620503 1551818 1491272 1437035 1388212 1345234 1307692 1273470
62387A273470l2264k8808k3007j7431j4364j2727j0210o871m573l815l252k075
$$ 1273470 1241206 1212398 1189391 1171960 1157596 1144869 1134659 1127788 1123215 1119400 1116148 1114073
62375A114073r94n70j76Q12J849J802J16k906o417r380j1204j2166j2831j3189
$$ 1114073 1113079 1112509 1112333 1113145 1114994 1116796 1116912 1114006 1107589 1098209 1087005 1074839 1062008 1048819
62361A048819j2919j2269j1871j1668j1018r966r502j0175j1187j1287j0020p880
$$ 1048819 1035900 1023631 1011760 1000092 989074 979108 969606 959431 948244 936957 926937 919057
62349I19057n795m662m779n475n793n547n124m391k893j186n82j112r87R47L448
$$ 919057 913262 908600 903821 898346 892553 887006 881882 877491 874598 873412 872830 871718 870731 871678 875126
62334H75126M591M410M427N229N940N932N752O193P389R052J0870J2543J3850
$$ 875126 879717 884127 888554 893783 899723 905655 911407 917600 924989 934041 944911 957454 971304
62321I71304J4751J5143J4790J4045J4130J5918J8692K0973K2399K3890K6016
$$ 971304 986055 1001198 1015988 1030033 1044163 1060081 1078773 1099746 1122145 1146035 1172051
62310A172051K8157K9433K9717K9624L0115L2177L6082M0853M5167M8837N2734
$$ 1172051 1200208 1229641 1259358 1288982 1319097 1351274 1387356 1428209 1473376 1522213 1574947
62299A574947N7162O1290O4609O8019P2849P9168Q5577R0379R2576R2024Q9044
$$ 1574947 1632109 1693399 1758008 1826027 1898876 1978044 2063621 2154000 2246576 2338600 2427644
62288B427644Q3825P6110O5504N2169L7063K1677P568m248j3999k2973l2102m0982
$$ 2427644 2511469 2587579 2653083 2705252 2742315 2763992 2771560 2767312 2753313 2730340 2698238 2657256
62276B657256m8703n5125o0465o4162o5495o5073o4311o3294o0685n6145n1319
$$ 2657256 2608553 2553428 2492963 2428801 2363306 2298233 2233922 2170628 2109943 2053798 2002479
62265B002479m7779m5342m3307m1975m1658m1351l9880l7779l6511l6286l6000
$$ 2002479 1954700 1909358 1866051 1824076 1782418 1741067 1701187 1663408 1626897 1590611 1554611
62254A554611l5067l3882l2523l0503k8052k6372k6028k5973k4722k1936j8477
$$ 1554611 1519544 1485662 1453139 1422636 1394584 1368212 1342184 1316211 1291489 1269553 1251076
62243A251076j5383j3167j1642j0212q673p649p760q350p855n678k985j261o53
$$ 1251076 1235693 1222526 1210884 1200672 1191999 1184350 1176590 1168240 1160385 1154707 1151722 1150461 1149808
62230A149808j47J154L312N644P085O930N758N180O128P673Q154P251O264O502
$$ 1149808 1149661 1150815 1154127 1159771 1166856 1173786 1179544 1184724 1190852 1198525 1206679 1213930 1220194 1226696
62216A226696Q073J0307J2659J4924J7051J9174K1485K3834K5722K6932K7855
$$ 1226696 1234769 1245076 1257735 1272659 1289710 1308884 1330369 1354203 1379925 1406857 1434712
62205A434712K8982L0436L2420L5651M0656M6778N2727N8174O4027P0763P7306
$$ 1434712 1463694 1494130 1526550 1562201 1602857 1649635 1702362 1760536 1824563 1895326 1972632
62194A972632Q2364Q6335R0770R5862R9485R9184R4493Q6671P6648O4297M9735
$$ 1972632 2054996 2141331 2232101 2327963 2427448 2526632 2621125 2707796 2784444 2848741 2898476
62183B898476L4388J9946O691o304j9204l0572l9186m6136n3918o3275p1838p6613
$$ 2898476 2932864 2952810 2959501 2953197 2933993 2903421 2864235 2818099 2764181 2700906 2629068 2552455
62171B552455p7246p6020p4975p3953p1617o7423o2056n6491n1393m7314m4726
$$ 2552455 2475209 2399189 2324214 2250261 2178644 2111221 2049165 1992674 1941281 1893967 1849241
62160A849241m3487m2504m0448l7017l3377l0983k9922k8728k6096k2498j9730
$$ 1849241 1805754 1763250 1722802 1685785 1652408 1621425 1591503 1562775 1536679 1514181 1494451
62149A494451j8836j8928j8134j5577j2126r281p472n722l120j57J946L010M098
$$ 1494451 1475615 1456687 1438553 1422976 1410850 1401569 1394097 1388375 1385255 1385098 1387044 1390054 1394152
62136A394152N703O852O747O456P762J0782J3901J5961J7330J8666J9816K0466
$$ 1394152 1399855 1406707 1413454 1419910 1427672 1438454 1452355 1468316 1485646 1504312 1524128 1544594
62124A544594K0896K1493K2124K2530K2829K3231K3543K3375K2467K0746J8533
$$ 1544594 1565490 1586983 1609107 1631637 1654466 1677697 1701240 1724615 1747082 1767828 1786361
62113A786361J6805J6531J7566J8952K0553K3504K8434L4111L8787M2382M6398
$$ 1786361 1803166 1819697 1837263 1856215 1876768 1900272 1928706 1962817 2001604 2043986 2090384
62102B090384N1821N7840O2606O4631O3477N9552N3498M5699L6399K6102J5442
$$ 2090384 2142205 2200045 2262651 2327282 2390759 2450311 2503809 2549508 2585907 2612009 2627451
62091B627451M756n707j5225k3058k9574l5967m2579m8465n3022n6802n9895o0746
$$ 2627451 2632207 2626500 2611275 2588217 2558643 2522676 2480097 2431632 2378610 2321808 2261913 2201167
62079B201167n8049n2982m8136m4610m1658l8746l6213l3798l0376k5811k1736
$$ 2201167 2143118 2090136 2042000 1997390 1955732 1916986 1880773 1846975 1816599 1790788 1769052
62068A769052j9554j8687j7719j6416j5528j5088j4020j1653q715o455n177l982
$$ 1769052 1749498 1730811 1713092 1696676 1681148 1666060 1652040 1640387 1631672 1625217 1620040 1616058
62056A616058j930Q98L594N554P122R049J1602J4267J6018J5743J2926Q380L906
$$ 1616058 1614128 1615026 1618620 1624174 1631296 1640345 1651947 1666214 1682232 1697975 1710901 1719281 1723187
62043A723187Q06j020k080k003j35K744M317K667k079p979j2568j4034j2052q053
$$ 1723187 1723993 1722973 1720893 1718890 1718755 1721499 1725816 1728483 1726404 1718425 1705857 1691823 1679771 1671718
62029A671718m271k104j304o00J160M306Q172J1601J4042J6098J8669K1709K4390
$$ 1671718 1667447 1665343 1664039 1663439 1664599 1668905 1677077 1688678 1702720 1718818 1737487 1759196 1783586
62016A783586K6308K7832K9303L0755L2488L4978L7892L9935M0206L9193L8053
$$ 1783586 1809894 1837726 1867029 1897784 1930272 1965250 2003142 2043077 2083283 2122476 2160529
62005B160529L7516L7801L8931M0485M1577M1619M0764L9138L6200L1497K5557
$$ 2160529 2198045 2235846 2274777 2315262 2356839 2398458 2439222 2478360 2514560 2546057 2571614
61994B571614J9095J1728K585p764j7161k4215k9935l6261m3541n0394n5700n9683
$$ 2571614 2590709 2602437 2605022 2597258 2580097 2555882 2525947 2489686 2446145 2395751 2340051 2280368
61982B280368o2824o4917o5834o6326o7004o7038o5052o1197n7027n3216m8890
$$ 2280368 2217544 2152627 2086793 2020467 1953463 1886425 1821373 1760176 1703149 1649933 1601043
61971A601043m3737l9232l6459l4015k9795k4210j9731j7506j6312j4999j3935
$$ 1601043 1557306 1518074 1481615 1447600 1417805 1393595 1373864 1356358 1340046 1325047 1311112
61960A311112j3437j2683j1409j0977j2264j3694j3260j1562j0857j1415j1123
$$ 1311112 1297675 1284992 1273583 1262606 1250342 1236648 1223388 1211826 1200969 1189554 1178431
61949A178431r015o966o758p229o079l472j861k282k617k38M681R359J1329J0363
$$ 1178431 1169416 1162450 1155692 1148463 1142384 1138912 1137051 1134769 1132152 1131914 1136595 1145954 1157283 1167646
61935A167646P854N145K788P86r47k472l908n403o961q408r727j1286j3374j5563
$$ 1167646 1175500 1180645 1183433 1184219 1183272 1180800 1176892 1171489 1164528 1156120 1146393 1135107 1121733 1106170
61921A106170j6954j7278j7222j7333j7085j5641j3198j0916r558q805p822o107
$$ 1106170 1089216 1071938 1054716 1037383 1020298 1004657 991459 980543 970985 962180 954358 948251
61909I48251l858k031j613k266k166j25K574L827L850M871P531R691R588Q376
$$ 948251 944393 942362 940749 938483 936317 936192 938766 942593 946443 951314 958845 968536 978124 986500
61895I86500Q136R034J0016J1000J2451J3717J3972J4244J6481K0576K4294K6244
$$ 986500 994636 1003670 1013686 1024686 1037137 1050854 1064826 1079070 1095551 1116127 1140421 1166665
61883A166665K7334K9065L1949L5857M0441M4808M8030N0339N2589N4501N4877
$$ 1166665 1193999 1223064 1255013 1290870 1331311 1376119 1424149 1474488 1527077 1581578 1636455
61872A636455N3723N2521N1956N0993M8763M5689M2048L7179L1151K5514K1027
$$ 1636455 1690178 1742699 1794655 1845648 1894411 1940100 1982148 2019327 2050478 2075992 2097019
61861B097019J6188R559K325l307p315j1385j5689j8056j6585j1679n300O94N434
$$ 2097019 2113207 2122766 2125091 2121784 2114469 2103084 2087395 2069339 2052754 2041075 2035775 2036469 2041903
61848B041903R321J3669J9204K4865K8787L0381L0550K9947K8035K3994J7671
$$ 2041903 2051224 2064893 2084097 2108962 2137749 2168130 2198680 2228627 2256662 2280656 2298327
61837B298327R391k88j0224j8835k5240k9951l4002l7587l9908m0350l9475l8588
$$ 2298327 2307718 2307430 2297206 2278371 2253131 2223180 2189178 2151591 2111683 2071333 2031858 1993270
61825A993270l8308l7827l5976l2931l0298k9413k9977l0544k9917k7852k5031
$$ 1993270 1954962 1917135 1881159 1848228 1817930 1788517 1758540 1727996 1698079 1670227 1645196
61814A645196k2707k1711k1364j9957j6824j3296j0896r190o328j425M439R482
$$ 1645196 1622489 1600778 1579414 1559457 1542633 1529337 1518441 1509251 1502923 1501498 1505937 1515419
61802A515419J2769J4714J6732K0299K5696L1641L6655M0614M4496M8892N3566
$$ 1515419 1528188 1542902 1559634 1579933 1605629 1637270 1673925 1714539 1759035 1807927 1861493
61791A861493N8335O3456O8984P4325P8757Q1917Q3576Q3364Q1030P6854P1456
$$ 1861493 1919828 1983284 2052268 2126593 2205350 2287267 2370843 2454207 2535237 2612091 2683547
61780B683547O5137N7424M7503L5349K2309J0160l81r682j7800k3837k6972k7339
$$ 2683547 2748684 2806108 2853611 2888960 2911269 2921429 2921048 2911366 2893566 2869729 2842757 2815418
61768B815418k5471k1586j5950r276k224M984J1913J7539K0944K1657J8861J1460
$$ 2815418 2789947 2768361 2752411 2743135 2740911 2745895 2757808 2775347 2796291 2817948 2836809 2848269
61756B848269q8j2966k4379l4125m3662n3294o1767o8262p3106p6524p8004p7249
$$ 2848269 2848181 2835215 2810836 2776711 2733049 2679755 2617988 2549726 2476620 2400096 2322092 2244843
61744B244843p4679p0920o6621o2669n9653n7164n4522n1916m9731m7216m3271
$$ 2244843 2170164 2099244 2032623 1969954 1910301 1853137 1798615 1746699 1696968 1649752 1606481
61733A606481l8552l5167l4022l3715l2403k9555k5732k1930j9381j8675j8692
$$ 1606481 1567929 1532762 1498740 1465025 1432622 1403067 1377335 1355405 1336024 1317349 1298657
61722A298657j7661j5562j4066j3866j3682j2514j1148j0453r804q441p004o389
$$ 1298657 1280996 1265434 1251368 1237502 1223820 1211306 1200158 1189705 1179901 1171460 1164456 1158067
61710A158067o177n543m773m429l867k095M80K423L016K491J161l32n93J266M137
$$ 1158067 1151890 1146347 1141574 1137145 1133278 1131183 1131663 1134086 1137102 1139593 1140754 1140422 1139829 1141095 1145232
61695A145232O134O902P424P752O704L910N81k201m588o809q138p838o374m988
$$ 1145232 1151366 1158268 1165692 1173444 1180148 1184058 1184639 1182438 1177850 1171041 1162903 1155065 1148691 1143703
61681A143703m592n404o943q039p611n922m411l815l318k049o00r7l85k53P18
$$ 1143703 1139111 1133707 1126764 1118725 1111114 1105192 1100781 1096966 1093648 1091599 1090999 1090902 1090517 1090264 1090982
61666A090982J610J592R61M74L63N30J176K582M439N884O250N500M041K478J474
$$ 1090982 1092592 1094184 1095145 1095619 1095982 1096512 1097688 1100270 1104709 1110593 1116843 1122343 1126384 1128862 1130336
61651A130336J282J212O9k466n208o715o932p162q436j0388j1793j1806j0598
$$ 1130336 1131618 1132830 1132899 1130433 1125225 1118510 1111578 1104416 1095980 1085592 1073799 1061993 1051395
61638A051395r120q284q227q431q683r439j0736j1381j0236q056o858p298p958
$$ 1051395 1042275 1033991 1025764 1017333 1008650 999211 988475 977094 966858 958802 951944 944646 936688
61625I36688p571o682o413o751o999o981o679n570l623k244k714m105m322l077
$$ 936688 929117 922435 916022 909271 902272 895291 888612 883042 879419 877175 874461 870356 866034 862957
61611H62957k162k529k828j616M18J465R83k4n05j85P86K127L323L936M039L972
$$ 862957 860795 858266 855438 853822 854240 855705 856688 856664 856159 855974 856760 858887 862210 866146 870185 874157
61595H74157L833L672L964N239P166Q575Q699Q063P771Q164Q568Q335P611O844
$$ 874157 877990 881662 885626 890865 898031 906606 915305 923368 931139 939303 947871 956206 963817 970661
61581I70661N965M653L214K452K581K927K998L065L211K643Q57j105j791j410
$$ 970661 976626 981279 984493 986945 989526 992453 995451 998516 1001727 1004370 1005227 1004122 1002331 1000921
61567A000921j616l181n069o129o501o882p481q307r542j0705j0347p746m434
$$ 1000921 999305 996124 991055 984926 978425 971543 964062 955755 946213 935508 925161 917415 912981
61554I12981k875l692n163n539m943m737n803p839r919j1304j1879j2044j2157
$$ 912981 910106 906414 901251 895712 890769 886032 880229 872390 862471 851167 839288 827244 815087
61541H15087j2123j1669j0941j0482j0563j0713j0148q622o773n542n245n329
$$ 815087 802964 791295 780354 769872 759309 748596 738448 729826 723053 717511 712266 706937
61529G06937n154m710m252l650k734k120k624l786m037k826j521j407j894j812
$$ 706937 701783 697073 692821 689171 686437 684317 681693 677907 673870 671044 669523 668116 666222 664410
61515F64410j532k207l430l433j737N0N67L86O95J453J721J114O6p71r28l59L83
$$ 664410 662878 660671 657241 653808 652071 652121 652688 653074 653769 655222 656943 658057 658123 657352 656424 656065 656448
61498F56448P74J190K268L314K728O52m83Q07K656K365K91q50M3J374J756J753
$$ 656448 657222 658412 660680 663994 666722 667374 666891 667698 670354 672719 673010 672160 672203 673577 675333 677086
61482F77086K131K341J839J454K146L380M032M235M981O252O799N905M392L550
$$ 677086 679217 681558 683397 684851 686997 690377 694409 698644 703625 709877 716676 722581 726973 730523
61468G30523L536L249J670q24k686k917k221k023k498k574j819j218j576k221
$$ 730523 734059 737308 738978 738154 735468 732551 730330 728307 725809 723235 721416 720198 718622 716401
61454G16401k233j936k078k162j130N92J204o0j874k562j838m42R53J727J232
$$ 716401 714168 712232 710154 707992 706862 707454 708658 708598 706724 704162 702324 701882 702835 704562 705794
61439G05794l09j395p50J039K296K409K245K461K499J692N31J20Q18J989K843
$$ 705794 705485 704090 703340 704379 706675 709084 711329 713790 716289 717981 718512 718632 719450 721439 724282
61424G24282L020K557J790J249J203J386J536J870K548L040K829K575L411M937
$$ 724282 727302 729859 731649 732898 734101 735487 737023 738893 741441 744481 747310 749885 753296 758233
61410G58233N165L130L68j160j620k499l925m451l442j998j123l91Q18J836J489
$$ 758233 763398 766528 766896 765736 764116 761617 757692 753241 749799 747801 746678 746287 747105 748941 750430
61395G50430j24j535j462m6J381J558N64j49O83K617M079M334M118M258M632M884
$$ 750430 750306 748771 747309 747263 748644 750202 750766 750617 751300 753917 757996 762330 766448 770706 775338 780222
61379G80222N260O192P639R243J0519J0686R220O876N361N460O355P055P356P013
$$ 780222 785482 791674 799313 808556 819075 829761 838981 845857 851218 856678 863033 870088 877444 884457
61365H84457N499L418K621L681M783M479M118N425P110O416L421J136J341K780
$$ 884457 889956 893374 895995 899676 904459 908938 913056 918481 925591 932007 935428 936564 937905 940685
61351I40685L671L502J914j628o020q500p837n887m792m379l592k875l256m359
$$ 940685 944356 947858 949772 948144 942124 933624 925787 919900 915108 910729 907137 904262 901006 896647
61337H96647n104n536o187o344m821k122j73Q7n75j284j925k361k218j756j718
$$ 896647 891543 886007 879820 873476 868655 866533 866360 866447 865872 864588 862663 860302 858084 856328 854610
61322H54610j901j097J024K944L120K097J864L291N114N608M619L463L108L230
$$ 854610 852709 851612 852636 855580 858700 860797 862661 865952 871066 876674 881293 884756 887864 891094
61308H91094L221L427M552O220P124O730N931N660N772N804O048P012Q446R685
$$ 891094 894315 897742 902294 908514 915638 922368 928299 933959 939731 945535 951583 958595 967041 976726
61294I76726J0539J1182J1528J1494J1514J2154J3525J5544J8152K0697K1825
$$ 976726 987265 998447 1009975 1021469 1032983 1045137 1058662 1074206 1092358 1113055 1134880
61283A134880K1034J9559J8714J8002J6325J4276J3343J3092J1387P825M849M451
$$ 1134880 1155914 1175473 1194187 1212189 1228514 1242790 1256133 1269225 1280612 1288437 1293286 1297737
61271A297737N432N249L162K53k501m659n625n251m654m980n563m791k713j211
$$ 1297737 1303169 1308418 1311580 1311833 1309332 1304673 1299048 1293797 1289143 1284163 1278600 1273809 1271096 1269885
61257A269885j446k471k868k392j442r9J371K003J301M22J128L638O427Q120Q797
$$ 1269885 1268439 1265968 1263100 1260708 1259266 1259167 1260538 1262541 1263842 1264264 1265392 1269030 1275457 1283577 1292374
61242A292374R269R939J0667J1220J1253J0214P742M176K67l562p290j0644j2921
$$ 1292374 1301643 1311582 1322249 1333469 1344722 1354936 1362678 1366854 1367121 1363559 1356269 1345625 1332704
61229A332704j3721j3582j3450j3638j3700j3193j2104j0437q022n128k735j591
$$ 1332704 1318983 1305401 1291951 1278313 1264613 1251420 1239316 1228879 1220857 1215729 1212994 1211403
61217A211403j184k14K001M997P846R792J0400R883R391J0135J1908J3245J3340
$$ 1211403 1210219 1210005 1212006 1217003 1224849 1234641 1245041 1254924 1264315 1274450 1286358 1299603 1312943
61204A312943J3066J3538J4513J5069J5292J6215J8352K1169K3921K6199K7630
$$ 1312943 1326009 1339547 1354060 1369129 1384421 1400636 1418988 1440157 1464078 1490277 1517907
61193A517907K7877K7071K5615K3531K0555J6787J2635Q134L035k451p614j1815
$$ 1517907 1545784 1572855 1598470 1622001 1642556 1659343 1671978 1680112 1683147 1680696 1673082 1661267
61181A661267j4575j5477j5008j5046j7072j9881k0634j8425j5281j3235j2127
$$ 1661267 1646692 1631215 1616207 1601161 1584089 1564208 1543574 1525149 1509868 1496633 1484506
61170A484506j1078j0258r880r047p196n552n244m985k565J825N667P278P053
$$ 1484506 1473428 1463170 1453290 1444243 1437047 1431495 1426251 1421266 1418701 1420526 1426193 1433471 1440524
61157A440524N832M010K401J980K227J441o22j946j003J070K064J395J68o20p90
$$ 1440524 1446356 1450366 1452767 1454747 1456974 1458415 1457793 1455847 1454844 1455914 1457978 1459373 1459541 1458921 1458131
61142A458131m65N9K80J88P25K752N752Q357J0161J2206J5446J9290K2114K2979
$$ 1458131 1457666 1457725 1458005 1458193 1458918 1461670 1467422 1475779 1485940 1498146 1513592 1532882 1554996 1577975
61128A577975K2372K1291K0084J8471J6336J3864J1024P699M462K382J666J326
$$ 1577975 1600347 1621638 1641722 1660193 1676529 1690393 1701417 1709116 1713578 1715960 1717626 1718952
61116A718952O98L30N60K02j986n165p160p188o509o513p463r142j1368j3516
$$ 1718952 1719650 1719980 1720540 1720742 1718756 1713591 1706431 1699243 1692734 1686221 1678758 1669616 1658248 1644732
61102A644732j4685j4822j4898j5688j7085j8560j9524j9357j8034j6689j6410
$$ 1644732 1630047 1615225 1600327 1584639 1567554 1548994 1529470 1510113 1492079 1475390 1458980
61091A458980j6586j5569j2996j0095p702n492l387k156k091k485k990m201o265
$$ 1458980 1442394 1426825 1413829 1403734 1396032 1390540 1387153 1384997 1382906 1380421 1377431 1373230 1366965
61078A366965q285r706j1068j2587j3373j2860j1728j0411p963l687J149M418
$$ 1366965 1358680 1348974 1337906 1325319 1311946 1299086 1287358 1276947 1268984 1265297 1266446 1270864
61066A270864N527N718O547Q794J2178J5421J7236J7822J8679K0561K2636K4202
$$ 1270864 1276391 1282109 1288656 1297450 1309628 1325049 1342285 1360107 1378786 1399347 1421983 1446185
61054A446185K5916K8422L0856L1903L1536L0767L0370L0641L1531L2225L1388
$$ 1446185 1472101 1500523 1531379 1563282 1594818 1625585 1655955 1686596 1718127 1750352 1781740
61043A781740K8728K5486K2750K0297J7736J5314J2712Q485K206m253r029j2771
$$ 1781740 1810468 1835954 1858704 1879001 1896737 1912051 1924763 1933248 1935454 1931201 1922172 1909401
61031A909401j7133k1897k5511k7651k9268l0494l0487k9253k7825k6623k5121
$$ 1909401 1892268 1870371 1844860 1817209 1787941 1757447 1726960 1697707 1669882 1643259 1618138
61020A618138k3234k1648k0657j9824j8864j7854j6605j4832j2852j1192r664
$$ 1618138 1594904 1573256 1552599 1532775 1513911 1496057 1479452 1464620 1451768 1440576 1430912
61009A430912p692n375l278j381P71L077M910O066O978Q085R598J1569J3664J5269
$$ 1430912 1423220 1417845 1414567 1413186 1413957 1417034 1421944 1428010 1434988 1443073 1452671 1464240 1477904 1493173
60995A493173J6340J7707K0066K3257K6826L0457L3550L5541L7155L9969M4076
$$ 1493173 1509513 1527220 1547286 1570543 1597369 1627826 1661376 1696917 1734072 1774041 1818117
60984A818117M7795N0477N3749N8592O3224O5801O7641P1460P7441Q3287Q7516
$$ 1818117 1865912 1916389 1970138 2028730 2091954 2157755 2225396 2296856 2374297 2457584 2545100
60973B545100R0750R4210R8595J03948J09319J13405J16619J21254J28358J36189
$$ 2545100 2635850 2730060 2828655 2932603 3041922 3155327 3271946 3393200 3521558 3657747
60963C657747J43474J51995J63521J76055J86153J93645K01162K10219K20839
$$ 3657747 3801221 3953216 4116737 4292792 4478945 4672590 4873752 5083971 5304810
60954E304810K33948K50896K71292K94291L21082L53118L88911M25773M63803
$$ 5304810 5538758 5789654 6060946 6355237 6676319 7029437 7418348 7844121 8307924
60945H307924N05234N51830O06742O76848P68347Q81490J014323J168803J346853
$$ 8307924 8813158 9364988 9971730 10648578 11416925 12298415 13312738 14481541 15828394
60936A5828394J543671J754457J985705K248352K541736K860491L213418L596373
$$ 15828394 17372065 19126522 21112227 23360579 25902315 28762806 31976224 35572597
60928C5572597L914744L959585L530337K626503J506289N24808r4590l35034k82462
$$ 35572597 39487341 43446926 46977263 49603766 51110055 51634863 51540273 51205239 50922777
60919E0922777k4272L19480N25803L32972l67085j410446k461454l236408l638808
$$ 50922777 50898505 51217985 51743788 52076760 51709675 50299229 47837775 44601367 40962559
60910D0962559l724258l594538l337606l022258k698333k390170k103065j839694
$$ 40962559 37238301 33643763 30306157 27283899 24585566 22195396 20092331 18252637
60902A8252637j604713j397727j213330j049481r08933p92255o95633o15706n50888
$$ 18252637 16647924 15250197 14036867 12987386 12078453 11286198 10590565 9974859 9423971
60893I423971m97969m52756m14258l83347l57495l31766l05145k80973k60813
$$ 9423971 8926002 8473246 8058988 7675641 7318146 6986380 6681235 6400262 6139449
60884F139449k42760k26296k13867k06337k01113j96001j91152j86187j79354
$$ 6139449 5896689 5670393 5456526 5250189 5049076 4853075 4661923 4475736 4296382
60875D296382j70852j63333j57746j51996j44837j37671j31255j24093j15638
$$ 4296382 4125530 3962197 3804451 3652455 3507618 3369947 3238692 3114599 2998961
60866B998961j07798j01562r5287q8065q1720p7465p3434o7761o1667n7237n4267
$$ 2998961 2891163 2789601 2694314 2606249 2524529 2447064 2373630 2305869 2244202 2186965 2132698
60855B132698n1412m8486m5677m2249l8002l4418l2541l1233k9191k6973k5453
$$ 2132698 2081286 2032800 1987123 1944874 1906872 1872454 1839913 1808680 1779489 1752516 1727063
60844A727063k3912k1474j8896j7125j5591j3754j2742j3504j4630j4144j2471
$$ 1727063 1703151 1681677 1662781 1645656 1630065 1616311 1603569 1590065 1575435 1561291 1548820
60833A548820j1675j2568j4303j6038j7306j7631j7276j7496j8530j8549j6381
$$ 1548820 1537145 1524577 1510274 1494236 1476930 1459299 1442023 1424527 1405997 1387448 1371067
60822A371067j4025j4268j6828j9141k0098k0452k0149j8318j5913j5355j6759
$$ 1371067 1357042 1342774 1325946 1306805 1286707 1266255 1246106 1227788 1211875 1196520 1179761
60811A179761j7248j5149j2473j1648j1982j1330r710q846q930q342o499m862
$$ 1179761 1162513 1147364 1134891 1123243 1111261 1099931 1090221 1081375 1072445 1064103 1057604 1052742
60799A052742m553m746m200l030j994j067j4N05k20j448j706q84k86n10o98j63
$$ 1052742 1048189 1043443 1039243 1036213 1034219 1033152 1033138 1033643 1033423 1031975 1030269 1029385 1029099 1028589 1027891 1027728
60783A027728O69J388K143K328L88l764p525q434p223o345o374n926m593l680
$$ 1027728 1028397 1029785 1031928 1034256 1034644 1030880 1023355 1014921 1007698 1001353 994979 989053 984460 980780
60769I80780l925m478m464l942k918j154O83J303P59N91J379J818J025J29L75
$$ 980780 976855 972377 967913 963971 961053 959899 960582 961885 962644 963235 964614 966432 967457 967586 967961
60754I67961R59J62k238m831o280o192m969l698l542m440n019m576m387o058r139
$$ 967961 968920 969082 966844 962013 955733 949541 944572 940874 937332 932892 927873 923297 918910 912852 903713
60739I03713j1451j1417r296o475m430m026m888n599n208m358m289n065n573n137
$$ 903713 892262 880845 871549 865074 860644 856618 851730 846131 840923 836565 832276 827211 821638 816501
60725H16501m262l736l647l493k814j585k70M49K78l69q89j182j553k012k072
$$ 816501 812239 808503 804856 801363 798549 796964 796694 797143 797421 797052 796163 794981 793428 791416 789344
60710G89344j413l58N76J466K836M617N742N330M068L634M611N765N751M750L914
$$ 789344 787931 787573 788149 789615 792451 797068 802810 808140 812208 815842 820453 826218 831969 836719 840633
60695H40633L838M351N085N497M841L046J140k5r13k125k851j950j64M31q99l004
$$ 840633 844471 848822 853907 859404 864245 867291 868431 868406 867493 865368 862517 860567 860403 860834 859935 856931
60679H56931n062p460j0076j1429j0625q872p960q061q043p274o129n122m260
$$ 856931 851869 844409 834333 822904 812279 803407 795447 787386 779343 772069 765940 760818 756558
60666G56558l262k051j184j617l523n518n857m555l300l151l311k617j241k67
$$ 756558 753296 751245 750061 748444 744921 739403 733546 728991 725691 722540 719229 716612 715371 715104
60652G15104k05n74o54j80M02L46m41r94l20J343K993M192N093N498N105M528
$$ 715104 714899 714325 713671 713491 713893 714239 713798 712804 712484 713827 716820 721012 726105 731603 736708 741236
60636G41236M797N698N917M911L456K238J308J087K372M792O578O595N553M671
$$ 741236 746033 751731 757648 762559 766015 768253 769561 770648 773020 777812 784390 790985 796538 801209
60622H01209M254M105M284M828N557O452P379P503O153M271L508L711L029Q46
$$ 801209 805463 809568 813852 818680 824237 830689 838068 845571 851724 855995 859503 863214 866243 867089
60608H67089j217j838j760k244l439n053p015q642q890q214q288r002p915m125
$$ 867089 865872 864034 862274 860030 856591 851538 844523 835881 826991 818777 810489 801487 793572 789447
60594G89447m28K44j260k085j425n44k7O09J307J679K232L437M077K462r87m103
$$ 789447 789019 789263 788003 785918 784493 783949 783922 784531 785838 787517 789749 793186 797263 799725 798738 794635
60578G94635n516n449m490l264k790l495m158l357j558k90K07P67J218M45j384
$$ 794635 789119 783670 779180 775916 773126 769631 765473 762116 760558 760268 760475 761242 762460 762905 761521
60563G61521k565k034m36J174K472L484M125M309L821K376N25j70J048K686K701
$$ 761521 758956 756922 756486 757660 760132 763616 767741 772050 775871 778247 778772 778602 779650 782336 785037
60548G85037J121k32j50J165L155N223O389O071N005M130L098J292k41K98K807
$$ 785037 786158 785926 785776 786941 790096 795319 801708 807779 812784 816914 820012 821304 821063 821361 824168
60533H24168N205N879M886L091J623J828L938O026N923M069K792L064L792M113
$$ 824168 829373 835252 840138 843229 844852 846680 850618 856644 862567 866636 869428 872492 876284 880397
60519H80397M282M343L952L706M768O933Q898J0428J2273J3975J4154J3256J3570
$$ 880397 884679 889022 892974 896680 901448 908381 917279 927707 939980 953955 968109 981365 994935
60506I94935J5835J8312J9902K1799K4867K7760K9056K9088K8205K5294J9763
$$ 994935 1010770 1029082 1048984 1070783 1095650 1123410 1152466 1181554 1209759 1235053 1254816
60495A254816J3269P609K483k798o954q273p381o331n532l619N1M449Q220J0698
$$ 1254816 1268085 1275694 1278177 1275379 1268425 1260152 1252771 1246440 1240908 1237289 1237340 1241789 1250009 1260707
60481A260707J2002J3381J6714K2436K8519L2920L6245M0504M6057N1596N6471
$$ 1260707 1272709 1286090 1302804 1325240 1353759 1386679 1422924 1463428 1509485 1561081 1617552
60470A617552O0804O3355O1694N5156M5916L6314K6540J5747M224o615j5629k2489
$$ 1617552 1678356 1741711 1803405 1858561 1904477 1940791 1967331 1983078 1987302 1980687 1965058 1942569
60458A942569k7223k9968l0889l0013k7399k3658j9842j6609j3835j1177q381
$$ 1942569 1915346 1885378 1854489 1824476 1797077 1773419 1753577 1736968 1723133 1711956 1703575
60447A703575m954j83N976J2516J8334K3309K8089L3255L9149M6184N4551O3591
$$ 1703575 1698621 1698438 1704414 1716930 1735264 1758573 1786662 1819917 1859066 1905250 1959801 2023392
60435B023392P2102P9534Q6534R3852J00863J05511J05789J01184R2785Q2311
$$ 2023392 2095494 2175028 2261562 2355414 2456277 2561788 2667577 2768761 2861546 2943857
60425B943857P1093N9703M8252L7076K7148J9589J4643J1262P687K199o631j9668
$$ 2943857 3014950 3074653 3122905 3159981 3187129 3206718 3221361 3232623 3240310 3242509 3235878 3216210
60413C216210l6617n5986p5972r5046j11481j23095j28537j28586j25215j19595
$$ 3216210 3179593 3123607 3047635 2952589 2841108 2718013 2589476 2460890 2335675 2216080
60403B216080j11894j02870r4202q6741p9604p1774o3741n6752n1011m5714m0589
$$ 2216080 2104186 2001316 1907114 1820373 1740769 1668995 1605254 1548502 1497491 1451777 1411188
60392A411188l6330l3298l0690k7443k3573k0176j8150j7286j6703j5938j5268
$$ 1411188 1374858 1341560 1310870 1283427 1259854 1239678 1221528 1204242 1187539 1171601 1156333
60381A156333j4989j4804j4219j3293j2507j1954j1087r398p063m857l618l748
$$ 1156333 1141344 1126540 1112321 1099028 1086521 1074567 1063480 1054082 1047019 1042162 1038544 1034796
60369A034796m943o357p248p508p473p396p365p432p485p169o316n324m673m337
$$ 1034796 1029853 1023496 1016248 1008740 1001267 993871 986506 979074 971589 964420 958104 952780 948107 943770
60355I43770m032l771l562k927j523l1N11K03J35O51Q35J47n05J7J562L128M106
$$ 943770 939738 935967 932405 929478 927955 927924 928435 928638 928773 929424 930259 930406 929901 929918 931480 934608 938714
60338I38714M392L875K809K227K861L759L125Q33r16r2K709M991N259M351L951
$$ 938714 943106 946981 949790 952017 954878 958637 961762 962595 961679 961587 964296 969287 974546 978897 982848
60323I82848M544N185M868L548K063J350J746K745L469L515L271L202L240L109
$$ 982848 987392 992577 997445 1000993 1003056 1004406 1006152 1008897 1012366 1015881 1019152 1022354 1025594 1028703
60309A028703K915K882K797K422K157K492K931K530J517J293K589M626O500Q236
$$ 1028703 1031618 1034500 1037297 1039719 1041876 1044368 1047299 1049829 1051346 1052639 1055228 1059854 1066354 1074590
60295A074590R890J0741J0283R261Q906R670J1281J3254J4884J5558J5701J6258
$$ 1074590 1084480 1095221 1105504 1114765 1123671 1133341 1144622 1157876 1172760 1188318 1204019 1220277
60283A220277J6704J4983J0514N713L005J623p96m518p735r534j0624j1374j1333
$$ 1220277 1236981 1251964 1262478 1268191 1271196 1272819 1272023 1267505 1259770 1250236 1239612 1228238 1216905
60270A216905j0654j0057r346p818o150n817o533o424n069m150m343l919j660
$$ 1216905 1206251 1196194 1186848 1179030 1172880 1167063 1160530 1154106 1149037 1144887 1140544 1136625 1134965
60257A134965Q06J234r9r88j65J909M439P247J0560J4588J9007K2673K4550K5220
$$ 1134965 1135771 1137005 1136906 1135918 1135753 1137662 1142101 1149348 1159908 1174496 1193503 1216176 1240726 1265946
60243A265946K6506K9325L2942L6507L9724M1398L9159L2099K2361J2638L003
$$ 1265946 1292452 1321777 1354719 1391226 1430950 1472348 1511507 1543606 1565967 1578605 1581608
60232A581608q101k0502l1708l9510m3576m4470m2483l8102l2588k7358k3034
$$ 1581608 1573507 1553005 1521297 1481787 1438211 1393741 1351258 1313156 1280568 1253210 1230176
60221A230176j9508j6694j4869j4189j4127j3707j2473j0946r853r269q837q377
$$ 1230176 1210668 1193974 1179105 1164916 1150789 1137082 1124609 1113663 1103810 1094541 1085704 1077327
60209A077327p727o551n147m820o261p952p609n096k528j496j692k283k962l198
$$ 1077327 1069600 1063049 1057902 1053082 1046821 1038869 1031260 1026164 1023636 1022140 1020448 1018165 1015203 1012005
60195A012005k244n78J63n26j223p85J03M64N80R60J137P22M06P22J009Q52J309
$$ 1012005 1009761 1009183 1009346 1008820 1007597 1006812 1006915 1007379 1007959 1008919 1010056 1010778 1011184 1011906 1012915 1013767 1015076
60178A015076L199N319N983N403M907M576L528K073J620K506L551L876L804L849
$$ 1015076 1018275 1023594 1029577 1034980 1039887 1044463 1047991 1050064 1051684 1054190 1057741 1061617 1065421 1069270
60164A069270M002M160M148L330J377m80k45K462N704P491P893Q352R526J0519
$$ 1069270 1073272 1077432 1081580 1084910 1086287 1085807 1085562 1088024 1093728 1101219 1109112 1117464 1126990 1137509
60150A137509J0227Q888P954Q421R642J0265J0081J0164J1039J1738J1186R839
$$ 1137509 1147736 1156624 1164578 1172999 1182641 1192906 1202987 1213151 1224190 1235928 1247114 1256953
60138A256953R105R481R873Q709N462J322j604k178j401j120j673j842j180j022
$$ 1256953 1266058 1275539 1285412 1294121 1299583 1300905 1299301 1297123 1295722 1294602 1292929 1291087 1289907 1288885
60124A288885k594n258p428q327q026o728m902l430k692k135j403j075j558k055
$$ 1288885 1286291 1281033 1273605 1265278 1257252 1250524 1245622 1242192 1239500 1237365 1235962 1234887 1233329 1231274
60110A231274j622m81N70J436K476L510L926L382J876k70k058k414j688j502k409
$$ 1231274 1229652 1229171 1229741 1231177 1233653 1237163 1241089 1244471 1246347 1246077 1244019 1241605 1239917 1238415 1236006
60095A236006l003k225j094q21o70O27K365K852K282K602M674P285R090J0010
$$ 1236006 1233003 1230778 1229684 1228863 1228193 1228820 1231185 1234037 1236319 1238921 1243595 1250880 1259970 1269980
60081A269980J0476J0497R866Q582O978N869O197P914R761J0698J0994J1269J1463
$$ 1269980 1280456 1290953 1300819 1309401 1316379 1322248 1328445 1336359 1346120 1356818 1367812 1379081 1390544
60068A390544J1462J1678J1910J0836Q046N477N142O349O863N992M671L266J535
$$ 1390544 1402006 1413684 1425594 1436430 1444476 1449953 1455095 1461444 1468307 1474299 1478970 1482236 1483771
60055A483771L68J344M319P253Q644Q641P801O463N348N187N474N133M379M371
$$ 1483771 1484139 1485483 1489802 1497055 1505699 1514340 1522141 1528604 1533952 1539139 1544613 1549746 1554125 1558496
60041A558496N024M883L357J397l28k282m605o355o841o523o098n835o039o922
$$ 1558496 1563520 1568403 1571760 1573157 1572829 1570547 1565942 1559587 1552746 1546223 1540125 1534290 1528251 1521329
60027A521329p751p356n808m394l781l538l540m177m878m298k670k319m807q908
$$ 1521329 1513578 1506222 1500414 1496020 1492239 1488701 1485161 1480984 1476106 1471808 1469138 1466819 1462012 1453104
60013A453104j2429j4695j6171j6896j6792j6684j7534j8873j9285j8321j7000
$$ 1453104 1440675 1425980 1409809 1392913 1376121 1359437 1341903 1323030 1303745 1285424 1268424
60002A268424j6281j5883j4885j2983j0795r105q189p975q335q843q543o827m512
$$ 1268424 1252143 1236260 1221375 1208392 1197597 1188492 1180303 1172328 1163993 1155150 1146607 1139780 1135268
59989A135268l057k539j621R1J116M83l79M26K574M364N346O190O701N917M088
$$ 1135268 1132211 1129672 1128051 1128142 1129258 1129741 1129362 1129788 1132362 1136726 1142072 1148262 1154963 1160880 1164968
59974A164968K696K408K549K482K099J101p38k632l574l905m712n954o806p443
$$ 1164968 1167664 1170072 1172621 1175103 1177202 1178303 1177565 1174933 1171359 1167454 1162742 1156788 1149982 1142539
59960A142539q675r990r945q476p041o395o052n907o405p023o659n655n490o214
$$ 1142539 1133864 1123874 1113929 1105453 1098412 1092017 1085965 1080058 1073653 1066630 1059971 1054316 1048826 1042612
59946A042612o239m898l072j196J074K953K858J262N52J297J300n52k230j821
$$ 1042612 1036373 1031475 1028403 1027207 1028281 1031234 1034092 1035354 1035906 1037203 1038503 1037951 1035721 1033900
59932A033900l94Q5m29j039j672k061r62J742L820L536K222K120L129L612L154
$$ 1033900 1033506 1033591 1033162 1032123 1030451 1028390 1027428 1029170 1032990 1036526 1038748 1040868 1043997 1047609 1050763
59917A050763K525J897J032L42J76j02r56j639j712k179l539m179k605OJ557K162
$$ 1050763 1053288 1055185 1056217 1056559 1056735 1056633 1055677 1054038 1052326 1050147 1046608 1042429 1039824 1039830 1041387 1043549
59901A043549L204M397M313L337L405M825N634M503K373Q10K44J51k10j383l084
$$ 1043549 1046753 1051150 1055463 1058800 1062205 1067030 1072664 1077167 1079540 1080350 1080594 1080745 1080535 1079152 1076068
59886A076068m070l583k485j918j512l03J157J332J36q42o16J46N02M33M84J272
$$ 1076068 1071998 1068415 1065930 1064012 1062500 1062197 1063354 1064686 1064822 1063980 1063364 1063510 1064012 1064445 1064929 1066201
59870A066201L314O324Q789R378Q644Q237Q676R113R181R625J0901J2413J3499
$$ 1066201 1069515 1075839 1084628 1094006 1102650 1110887 1119563 1128676 1137857 1147482 1158383 1170796 1184295
59857A184295J4205J4697J4648J3591J1405Q390N239K855J660J311J399J991K880
$$ 1184295 1198500 1213197 1227845 1241436 1252841 1261231 1266470 1269325 1270985 1272296 1273695 1275686 1278566
59844A278566L021J627o66k586l811m786n453n210m020k590j488q38o17n61k9
$$ 1278566 1281587 1283214 1282548 1279962 1276151 1271365 1265912 1260702 1256682 1254092 1252604 1251766 1251149 1250588 1250559
59829A250559J352L102M478N210N316M893M597N422P185Q297P908P242P687Q723
$$ 1250559 1251911 1255013 1259491 1264701 1270017 1274910 1279507 1284929 1292114 1300411 1308319 1315561 1323248 1331971
59815A331971R069Q733Q359P587N891M128L280K482M40j874k466j860k567m985
$$ 1331971 1341040 1349773 1358132 1365719 1371610 1375738 1379018 1381500 1381940 1380066 1377600 1375740 1373173 1368188
59801A368188o658o264n560o121o612n085k141M5N55j11j606l606m746l558m39
$$ 1368188 1361530 1355266 1349706 1343585 1336973 1331888 1329747 1329792 1330347 1330236 1328630 1325024 1320278 1316720 1316281
59786A316281K610M177M462M283M261N104P473J0857J3317J3089J0325O743L813
$$ 1316281 1318891 1323068 1327530 1331813 1336074 1341178 1348651 1359508 1372825 1385914 1396239 1402982 1406795
59773A406795J936J212J889L510M667M542L914L354J313l936j0758j5058j5366
$$ 1406795 1408731 1409943 1411832 1415342 1420009 1424551 1428465 1431819 1433132 1429196 1418438 1403380 1388014
59760A388014j4492j4963j5315j3076r261p075p279p717o922n555m388l367k858
$$ 1388014 1373522 1358559 1343244 1330168 1320907 1313832 1306553 1298836 1291914 1286359 1281971 1278604 1275746
59747A275746l693n549p031p560p566o995n541m296m860o648p302o252n539o433
$$ 1275746 1272053 1266504 1259473 1251913 1244347 1237352 1231811 1227515 1222655 1216007 1208705 1202453 1196914 1190481
59733A190481p578p609p304p732q102p070m872k784j634j898l851o388p063m848
$$ 1190481 1182903 1175294 1167990 1160258 1152156 1145086 1140214 1137430 1135796 1133898 1130047 1123659 1116596 1111748
59719A111748j712j45j70j63M38R03Q75P38P27Q78J355J919J851J290J642L484
$$ 1111748 1110036 1109891 1109721 1109558 1109996 1110899 1111774 1112512 1113239 1114117 1115472 1117391 1119242 1120532 1122174 1125658
59703A125658N273N548N131N396N557M083J975J883M042N790N608N069N850P113
$$ 1125658 1130931 1136479 1141610 1147006 1152563 1156646 1158621 1160504 1164546 1170336 1175944 1181013 1186863 1193976
59689A193976P295O610O141N821N036M192L974L800K706J199N94P89M76n68j160
$$ 1193976 1201271 1207881 1214022 1219843 1224879 1229071 1233045 1236845 1239551 1240750 1241344 1242133 1242609 1242041 1240881
59674A240881r61j176k369l349l308l508n214p125o749l933j121j09l12n65r70
$$ 1240881 1239920 1238744 1236375 1233026 1229718 1226210 1220996 1213871 1207122 1203189 1202068 1201959 1201647 1201082 1200112
59659A200112k062l421m168m184l915l515k948k368j783p68Q11K358L358M089
$$ 1200112 1198050 1194629 1190461 1186277 1182362 1178847 1175899 1173531 1171748 1170980 1171791 1174149 1177507 1181596
59645A181596M899N362N034M465M608N593O938Q470J0055J0814R932Q198P485
$$ 1181596 1186495 1191857 1196891 1201356 1205964 1211557 1218495 1226965 1237020 1247834 1257766 1265964 1273449
59632A273449Q447R726R682Q127N974L986K453J544J362J683J990J781R60j20
$$ 1273449 1281896 1291622 1301304 1309431 1315405 1319391 1321844 1323388 1324750 1326433 1328423 1330204 1331164 1331044
59618A331044j130k286l994n954p225p479p413p550p423o700o201o783p774p688
$$ 1331044 1329914 1327628 1323634 1317680 1310455 1302976 1295563 1288013 1280590 1273890 1267689 1260906 1253132 1245444
59604A245444o140l990j972k62Q29J020Q58J317K495L610M214M506M613M569M853
$$ 1245444 1239304 1235314 1233342 1233080 1233909 1234929 1235787 1237104 1239599 1243209 1247423 1251929 1256542 1261111 1265964
59589A265964N834O730O193M090J648j97j653l245n203p575j0004j1433j1204
$$ 1265964 1271798 1278528 1284721 1288811 1290459 1290262 1288609 1285364 1280161 1272586 1262582 1251149 1239945
59576A239945j0325j0352j1082j0838r160p513o864o237m520k391j376j988l661
$$ 1239945 1229620 1219268 1208186 1197348 1188188 1180675 1173811 1167574 1163054 1160663 1159287 1157299 1153638
59563A153638n716p482q178p596o518n936o139o821p539p798p334o541o049n796
$$ 1153638 1147922 1140440 1132262 1124666 1118148 1112212 1106073 1099252 1091713 1083915 1076581 1070040 1063991 1058195
59549A058195n264m493l937l351k053l76N53P20J405K964L978L372J949Q84P2
$$ 1058195 1052931 1048438 1044501 1041150 1039097 1038721 1039274 1039994 1041399 1044363 1048341 1051713 1053662 1054546 1054618
59534A054618q88j411r39k19j87m46k52k43j534l459l894k002N41J344m08l505
$$ 1054618 1053730 1052319 1051380 1051161 1050974 1050528 1050276 1050033 1048499 1045040 1041146 1039144 1039685 1041029 1040621 1037116
59518A037116n860o065m463k794k420k927k777j210R12K015J274p30k616l510
$$ 1037116 1031256 1025191 1020728 1017934 1015514 1012587 1009810 1008600 1009512 1011527 1012801 1012071 1009455 1005945
59504A005945l605l198j792Q83L290L176N79j694j400O43K286K894L097K862J747
$$ 1005945 1002340 999142 997350 998233 1001523 1004699 1005278 1003584 1002184 1002827 1005113 1008007 1011104 1013966 1015713
59489A015713O23J216L715O262P391P685Q378R297R311Q491Q622J1120J5044J8035
$$ 1015713 1016336 1017552 1021267 1027529 1034920 1042605 1050983 1060280 1069591 1078082 1086704 1097824 1112868 1130903
59475A130903J9263K0441K3275K6577K6973K2406J4013M737k838p256q297o981
$$ 1130903 1150166 1170607 1193882 1220459 1247432 1269838 1283851 1288588 1285750 1278494 1270197 1263216
59463A263216m742k161Q07L395M170L013J635J366J498O74j198l333n284o773
$$ 1263216 1258474 1256313 1257120 1260515 1264685 1267698 1269333 1270699 1272197 1272871 1271673 1268340 1263056 1256283
59449A256283p269o953p350r683j3057j5345j5513j4255j2824j2138j2437j2876
$$ 1256283 1249014 1242061 1234711 1225028 1211971 1196626 1181113 1166858 1154034 1141896 1129459 1116583
59437A116583j1966r286o207m088k641j106m2l69j357j377k74P11J274K375M130
$$ 1116583 1104617 1095331 1089124 1085036 1082395 1081289 1081247 1080878 1079521 1078144 1077870 1078581 1079855 1082230 1086360
59422A086360N223N121N220O881R417J0905J0277P905M946K847K729M344N948
$$ 1086360 1091583 1096704 1101924 1108805 1118222 1129127 1139404 1147309 1152255 1155102 1157831 1162175 1168123
59409A168123O000M694L379K756K395J790J126Q21R16J249J870K821L716M123
$$ 1168123 1174123 1178817 1182196 1184952 1187347 1189137 1190263 1191084 1192000 1193249 1195119 1197940 1201656 1205779
59395A205779M461N781Q154R956R661Q110P801R751J2189J2935J2031J1072J0652
$$ 1205779 1210240 1216021 1224175 1234131 1243792 1251902 1259703 1269454 1281643 1294578 1306609 1317681 1328333
59382A328333R608O710K146k717o550q900j0188j0820j0401q293n132k936l030
$$ 1328333 1337941 1344651 1346797 1344080 1337530 1328630 1318442 1307622 1297221 1288928 1283796 1280860 1277830
59369A277830m481n310m784l552k011K45L303O339Q614J0344J2286J4774J7412
$$ 1277830 1273349 1268039 1263255 1259703 1257692 1257937 1261240 1267579 1276193 1286537 1298823 1313597 1331009
59356A331009J9516K0753K1633K3187K5876K9091L2212L5674L9838M2674L9964
$$ 1331009 1350525 1371278 1392911 1416098 1441974 1471065 1503277 1538951 1578789 1621463 1661427
59345A661427K9098J2477l706j4222j8043j7304j4309j0030m517K259R607J5091
$$ 1661427 1690525 1703002 1699296 1685074 1667031 1649727 1635418 1625388 1620871 1623130 1632737 1647828
59333A647828J4842O605o946j9465k6378k8209k7980k6964k4546k0802j6919j3396
$$ 1647828 1662670 1669275 1662329 1642864 1616486 1588277 1560297 1533333 1508787 1487985 1471066 1457670
59321A457670r872o703m826l900k404R8K410L771M753N705N988N391M782M676
$$ 1457670 1447798 1441095 1436269 1432369 1429965 1430063 1432473 1436244 1440997 1446702 1452690 1458081 1462863 1467539
59307A467539M648M598N025N542M975L558L032L726L745K228J085J844L008K728
$$ 1467539 1472187 1476785 1481810 1487352 1492327 1495885 1498917 1502643 1506388 1508616 1509701 1511545 1514553 1517281
59293A517281K175L702O979R604J0713J1559J3045J4894J6804J8526J9237J8729
$$ 1517281 1519456 1523158 1530137 1539741 1550454 1562013 1575058 1589952 1606756 1625282 1644519 1663248
59281A663248J8526J9934K1705K1790K0608J9993J9515J6750J1310N741J845j263
$$ 1663248 1681774 1701708 1723413 1745203 1765811 1785804 1805319 1822069 1833379 1839120 1840965 1839702
59269A839702m654p584r244j0490j2456j4914j7137j9105k0738k1154j9767j7348
$$ 1839702 1835048 1827464 1818220 1807730 1795274 1780360 1763223 1744118 1723380 1702226 1682459 1665111
59257A665111j5117j3597j2912j3281j4537j5890j6710j6960j6578j5407j3898
$$ 1665111 1649994 1636397 1623485 1610204 1595667 1579777 1563067 1546107 1529529 1514122 1500224
59246A500224j2953j2675j2291j1532j0966j0644r777q151o512m955k318J845
$$ 1500224 1487271 1474596 1462305 1450773 1439807 1429163 1419386 1411235 1404723 1399768 1397450 1399295
59234A399295N926Q102Q598R087J0589J3068J6226J9215J9870J5778O648m960
$$ 1399295 1405221 1413323 1421921 1431008 1441597 1454665 1470891 1490106 1509976 1525754 1532402 1527442
59222A527442j5518k2784k6367k6739k4362j9834j4508j0212p730n922l028J277
$$ 1527442 1511924 1489140 1462773 1436034 1411672 1391838 1377330 1367118 1359388 1353466 1350438 1351715
59210A351715N764R403J2208J4357J5625J6038J6044J5507J3557J0174O912N057
$$ 1351715 1357479 1366882 1379090 1393447 1409072 1425110 1441154 1456661 1470218 1480392 1487304 1492361
59198A492361L712J065k866o066p263p550q639j0440j1403j0821r596q627p566
$$ 1492361 1496073 1497138 1494272 1488206 1480943 1473393 1464754 1454314 1442911 1432090 1422494 1413867 1406301
59185A406301n836l994k972k387r22J549L456L607K751K433L181M565O173P689
$$ 1406301 1400465 1396471 1393499 1391112 1390190 1391739 1395195 1398802 1401553 1403986 1407167 1411732 1417905 1425594
59171A425594Q575Q602Q313Q208P987P191O027M844L464J784L12p34k102m231
$$ 1425594 1434169 1442771 1451084 1459292 1467279 1474470 1480497 1485341 1488805 1490589 1490901 1490167 1488065 1483834
59157A483834o158o892p092p891q765q393p187p024q385r680r789r555j0017j0608
$$ 1483834 1477676 1470784 1463692 1455801 1447036 1438643 1431456 1424432 1416047 1406367 1396578 1387023 1377006 1366398
59143A366398j0082q338o383n013m134l161j779l87L21M22Q44J866K279J067o91
$$ 1366398 1356316 1347978 1341595 1336582 1332448 1329287 1327508 1327121 1327442 1327864 1328708 1330574 1332853 1333920 1333229
59128A333229p94J493M847P557Q635P873O175N369O163O782N460L768N016R139
$$ 1333229 1332435 1333928 1338775 1346332 1354967 1362840 1369015 1374384 1380547 1387329 1392789 1396557 1401573 1410712
59114A410712J1865R996N406K338K426L918M699M258L224K351K040K103K050J772
$$ 1410712 1422577 1432573 1437979 1440317 1442743 1446661 1451360 1455618 1458842 1461193 1463233 1465336 1467386 1469158
59100A469158J538J269N35o20j760l094n386q463j0880j1736j1925j2865j4785
$$ 1469158 1470696 1471965 1472500 1471880 1470120 1467026 1461640 1453177 1442297 1430561 1418636 1405771 1390986
59087A390986j6820j8165j8489j7793j6568j5681j5543j5466j4288j1674q761
$$ 1390986 1374166 1356001 1337512 1319719 1303151 1287470 1271927 1256461 1242173 1230499 1221738
59076A221738p407q310r802r321o506l768k918k629q04J745K492J526J883N167
$$ 1221738 1214331 1206021 1196219 1186898 1180392 1176624 1173706 1171077 1170273 1172018 1174510 1176036 1177919 1183086
59062A183086R281J1524J1858J1975J2759J4045J5607J7088J7826J7763J7817
$$ 1183086 1192367 1203891 1215749 1227724 1240483 1254528 1270135 1287223 1305049 1322812 1340629
59051A340629J8640J9827K0817K1552K1698K0386J7672J5240J4651J5471J5873
$$ 1340629 1359269 1379096 1399913 1421465 1443163 1463549 1481221 1496461 1511112 1526583 1542456
59040A542456J4574J1705Q296N437L457J730l55k446l906m940n948o238m984l227
$$ 1542456 1557030 1568735 1577031 1582468 1585925 1587655 1587300 1584854 1580948 1576008 1570060 1563822 1558838 1555611
59026A555611l084m814o598p467q487j0474j2497j3473j3633j3625j3781j4855
$$ 1555611 1552527 1547713 1541115 1533648 1525161 1514687 1502190 1488717 1475084 1461459 1447678 1432823
59014A432823j7618k0927k2089k0162j7194j5232j3935j2253j0497r288q250p193
$$ 1432823 1415205 1394278 1372189 1352027 1334833 1319601 1305666 1293413 1282916 1273628 1265378 1258185
59002A258185o972p792q209p371o470o480o208m515k740k756l986m477l796k721
$$ 1258185 1251213 1243421 1235212 1227841 1221371 1214891 1208683 1204168 1201428 1198672 1194686 1190209 1186413 1183692
58988A183692j252P82K195J933J254J994L337K890N37j329j344m04O96K396M516
$$ 1183692 1182440 1183222 1185417 1187350 1188604 1190598 1193935 1196825 1197362 1196033 1194689 1194285 1194981 1197377 1201893
58973A201893N684N486N444O843R037J0823J2253J4138J6612J8987K0500K0765
$$ 1201893 1207577 1213063 1218507 1225350 1234387 1245210 1257463 1271601 1288213 1307200 1327700 1348465
58961A348465K0075J9542K0288K2204K3997K4585K3849K2035J9141J5244J0885
$$ 1348465 1368540 1388082 1408370 1430574 1454571 1479156 1503005 1525040 1544181 1559425 1570310
58950A570310O816L507Q96j436l603m909m539k965j826j851j734j0K674M332M246
$$ 1570310 1577126 1580633 1581529 1580093 1576490 1571581 1567042 1564077 1562251 1560400 1558666 1558656 1561330 1565662 1569908
58935A569908L597L435L257J902p99l796n973p191q134r207r983j0102j0244j1235
$$ 1569908 1573505 1576940 1580197 1582099 1581300 1577504 1571531 1564340 1556206 1546999 1537016 1526914 1516670 1505435
58921A505435j2422j2159j0188q122p008n755k992N71K947L484L573M876P542
$$ 1505435 1493013 1480854 1470666 1462544 1455536 1449781 1446789 1447360 1450307 1453791 1457364 1462240 1469782
58908A469782J0116J0919R767Q445Q924J1127J3121J3398J2043R831P523N977
$$ 1469782 1479898 1490817 1500584 1509029 1517953 1529080 1542201 1555599 1567642 1577473 1584996 1590973
58896A590973N421M494J614k466n426o928r153j3059j6604j8010j8453j9769k1399
$$ 1590973 1596394 1600888 1602502 1600036 1594610 1587682 1578529 1565470 1548866 1530856 1512403 1492634 1471235
58883A471235k1534j9733j6563j2276p678m763m407m736l779k448k734m191m631
$$ 1471235 1449701 1429968 1413405 1401129 1393451 1388688 1384281 1379545 1375766 1373318 1370584 1366393 1361762
58870A361762l513k295j969k271k920l813m431m534m832n597n710m616l907m964
$$ 1361762 1358249 1355954 1353985 1351714 1348794 1344981 1340550 1336016 1331184 1325587 1319877 1315261 1311354 1306390
58856A306390o381n934l988k509j778p36L07K26j12J425M814P791R217J0036J1013
$$ 1306390 1300009 1294075 1290087 1287578 1285800 1285064 1285371 1285597 1285485 1286910 1291724 1299515 1308732 1318768 1329781
58841A329781J2030J3723J7042K0856K2571K1750K0737K1061K1547K0878J9808
$$ 1329781 1341811 1355534 1372576 1393432 1416003 1437753 1458490 1479551 1501098 1521976 1541784
58830A541784J9607J9984J9891J9274J8977J9700K1455K3450K4396K3725K2304
$$ 1541784 1561391 1581375 1601266 1620540 1639517 1659217 1680672 1704122 1728518 1752243 1774547
58819A774547K1042J9355J6265J2329Q815N480J075m188q616j1428j3283j4489
$$ 1774547 1795589 1814944 1831209 1843538 1852353 1857833 1858908 1854720 1846104 1834676 1821393 1806904
58807A806904j4596j3773j2887j2130j1202j0713j1583j3254j4366j5034j6465
$$ 1806904 1792308 1778535 1765648 1753518 1742316 1731603 1720020 1706766 1692400 1677366 1660901
58796A660901j8504j9743j9959k0244k0707k0443j9798k0076k0661j9140j5142
$$ 1660901 1642397 1622654 1602695 1582451 1561744 1541301 1521503 1501427 1480766 1461626 1446484
58785A446484j1524j0682j1834j2966j3381j3129j1945j0224r566j0939j3277
$$ 1446484 1434960 1424278 1412444 1399478 1386097 1372968 1361023 1350799 1341233 1330294 1317017
58774A317017j4796j4784j3570j1826j0468r937r301p188l983j678j330k040k672
$$ 1317017 1302221 1287437 1273867 1262041 1251573 1241636 1232335 1225147 1221164 1219486 1218156 1216116 1213444
58761A213444k982k765j531M52K136L022L298K801J325p9KJ232J957J682J221
$$ 1213444 1210462 1207697 1206166 1206618 1208754 1211776 1215074 1217875 1219200 1219121 1219123 1220355 1222312 1223994 1225215
58746A225215O96m57j608j522q88j692l974n776o495p375q331p508m902l218l878
$$ 1225215 1225911 1225454 1223846 1222324 1221436 1219744 1215770 1209994 1203499 1196124 1187793 1180285 1175383 1172165 1168287
58731A168287n140n496n952p222p599n755l198j753p15J305L785N580P073Q890
$$ 1168287 1163147 1157651 1151699 1144477 1136878 1131123 1127925 1126172 1125457 1126762 1130547 1136127 1143200 1152090
58717A152090J0118R860Q998Q451P231M304J017n38n31q11k218m150n956p139
$$ 1152090 1162208 1172068 1181066 1189517 1196748 1201052 1202069 1201531 1201000 1200189 1197971 1193821 1187865 1180726
58703A180726p157o318n961o524o676n563m487m808n644n251l479j322P82K559
$$ 1180726 1173569 1167251 1161290 1154766 1148090 1142527 1138040 1133232 1127588 1122337 1118858 1117536 1118318 1120877
58689A120877L138K347J648K189L017K855K368K985M564O048P391R066J0628J1542
$$ 1120877 1124015 1126362 1128010 1130199 1133216 1136071 1138439 1141424 1145988 1152036 1159427 1168493 1179121 1190663
58675A190663J2470J4000J5053J4461J3298J3605J5286J6254J5405J3733J2528
$$ 1190663 1203133 1217133 1232186 1246647 1259945 1273550 1288836 1305090 1320495 1334228 1346756
58664A346756J1956J1385J0138Q048N919M917N023N027M710N526Q089J0581J1114
$$ 1346756 1358712 1370097 1380235 1388283 1394202 1399119 1404142 1409169 1413879 1419405 1427494 1438075 1449189
58651A449189J0281R616Q837O687L536Q30j449m642q836j2521j4942j7124k0122
$$ 1449189 1459470 1469086 1477923 1484610 1488146 1488976 1487527 1482885 1474049 1461528 1446586 1429462 1409340
58638A409340k3566k6331k7914k8700k9320k9835k9580k8100k6109k4619k3293
$$ 1409340 1385774 1359443 1331529 1302829 1273509 1243674 1214094 1185994 1159885 1135266 1111973
58627A111973k0879j7493j4827j3695j2994j1729j0284q932p077m933l963m361
$$ 1111973 1091094 1073601 1058774 1045079 1032085 1020356 1010072 1001140 994063 989130 985167 980806
58615I80806m188k492j185j858k785j353K095N195O963P957Q273P855P874R424
$$ 980806 976618 974126 972941 971083 968298 966945 969040 974235 981198 989155 997428 1005283 1013157 1022581
58601A022581J1455J2106J1358J0322Q832N938K139j116l592n890p516p473o319
$$ 1022581 1034036 1046142 1057500 1067822 1076654 1082592 1084731 1083615 1080023 1074133 1066617 1059144 1052825
58588A052825n532n327m980m742n302n984n705n207n959p265p010n097l601l394
$$ 1052825 1047293 1041966 1036986 1032244 1026942 1020958 1015253 1010046 1004087 996822 989812 984715 981114 977720
58574I77720l090j689L5J249K077K392J616K94l6Q37J360P62J87N42J061J023
$$ 977720 974630 972941 972976 974225 976302 978694 980310 980604 980568 981405 982765 983527 983714 984256 985317 986340
58558I86340J260K584L977L936K893K818M530O586P019N543L684L053L809M844
$$ 986340 987600 990184 994161 998097 1000990 1003808 1008338 1014924 1021943 1027486 1031170 1034223 1038032 1042876
58544A042876N129M552L603K731K118J672J164O75P30J447J913J287J36l68j58
$$ 1042876 1048005 1052557 1056160 1058891 1061009 1062681 1063845 1064520 1065250 1066697 1068610 1069897 1070033 1069665 1069507
58529A069507K53J500M492P997R530R116R677J2734J6225J7721J7450J6658J5499
$$ 1069507 1069760 1071260 1075752 1083749 1093279 1102395 1112072 1124806 1141031 1158752 1176202 1192860 1208359
58516A208359J4290J4552J6541J7738J6204J3697J3162J4728J6710J8924K2169
$$ 1208359 1222649 1237201 1253742 1271480 1287684 1301381 1314543 1329271 1345981 1364905 1387074
58505A387074K5672K7972K9683L2524L6133L8446L9000L9322M0036L9866L7688
$$ 1387074 1412746 1440718 1470401 1502925 1539058 1577504 1616504 1655826 1695862 1735728 1773416
58494A773416L3829K9207K4472J9914J4997Q597Q36o189j0763j3580j6004j7701
$$ 1773416 1807245 1836452 1860924 1880838 1895835 1904432 1905268 1899079 1888316 1874736 1858732 1841031
58482A841031j7935j7870j9311k1970k4156k5583k7469l0350l3498l5926l6648
$$ 1841031 1823096 1805226 1785915 1763945 1739789 1714206 1686737 1656387 1622889 1586963 1550315
58471A550315l4922l1683k9374k8693k7206k3051j8127j5153j3527j1121q515
$$ 1550315 1515393 1483710 1454336 1425643 1398437 1375386 1357259 1342106 1328579 1317458 1308943
58460A308943p837q494p831n628m363n052o014o043n844o004o079o011o132n684
$$ 1308943 1301106 1292612 1284781 1279153 1274790 1269738 1263724 1257681 1251837 1245833 1239754 1233743 1227611 1221927
58446A221927l626q82M65J08n23r08j680k461j946k15J238J700J475M64j231j922
$$ 1221927 1218301 1217419 1217884 1217992 1217469 1216561 1214881 1212420 1210474 1210259 1211497 1213197 1214672 1215136 1213905 1211983
58430A211983j46K514L211K202K565N508Q832J0531J1269J2580J4657J6792J8420
$$ 1211983 1211837 1214351 1217562 1219764 1222329 1227837 1236669 1247200 1258469 1271049 1285706 1302498 1320918
58417A320918J9339K0017K1507K3878K5337K4267K1206J7392J2758P138J945j678
$$ 1320918 1340257 1360274 1381781 1405659 1430996 1455263 1476469 1493861 1506619 1513757 1515702 1514024
58405A514024m852q756j2014j2964j2637j2473j0997o549j681l93j937j706K069
$$ 1514024 1509172 1500416 1488402 1475438 1462801 1450328 1439331 1432782 1431101 1430708 1428771 1427065 1429134
58392A429134O695R850J1851J2942J2376J0733R531Q075M031k422q169j1205j2235
$$ 1429134 1435829 1445679 1457530 1470472 1482848 1493581 1503112 1511187 1515218 1512796 1504627 1493422 1481187
58379A481187j2350j2033j2193j3018j2387q636m110k229j978L64M690P110O464
$$ 1481187 1468837 1456804 1444611 1431593 1419206 1410570 1406460 1404231 1402253 1402617 1407307 1414417 1420881
58366A420881N858P258R182J0529J2236J4242J4989J4722J5189J5487J2631O894
$$ 1420881 1426739 1433997 1443179 1453708 1465944 1480186 1495175 1509897 1525086 1540573 1553204 1560098
58354A560098K140j72k624o498r458j0192j0890j3157j5302j5564j4567j3198
$$ 1560098 1562238 1562066 1559442 1552944 1543486 1533294 1522404 1509247 1493945 1478381 1463814 1450616
58342A450616j1342r762r735j0049q081m436k403k369j286J611L486L342L664
$$ 1450616 1439274 1429512 1419777 1409728 1401647 1397211 1394808 1392439 1391153 1392764 1396250 1399592 1403256
58329A403256N187N166K733J010J726K430J400O92J935L426L826M694O944Q736
$$ 1403256 1408443 1413609 1416342 1417352 1419078 1421508 1422908 1423600 1425535 1428961 1432787 1437481 1444425 1453161
58315A453161R074R666J1186J1702J0690J0516J2073J3092J2609J2727J4199J4798
$$ 1453161 1462235 1471901 1483087 1494789 1505479 1515995 1528068 1541160 1553769 1566496 1580695 1595493
58303A595493J3987J4411J6842J8451J8198J8743K0820K1081J8188J5672J5730
$$ 1595493 1609480 1623891 1640733 1659184 1677382 1696125 1716945 1738026 1756214 1771886 1787616
58292A787616J5570J3132J1145J1771J2373J0545Q685R499J1285J1621J1682J3120
$$ 1787616 1803186 1816318 1827463 1839234 1851607 1862152 1870837 1880336 1891621 1903242 1914924 1928044
58280A928044J4551J4735J5386J7659J9651K0399K2026K5059K6309K4500K3146
$$ 1928044 1942595 1957330 1972716 1990375 2010026 2030425 2052451 2077510 2103819 2128319 2151465
58269B151465K4441K5327K3253K0781K0513K0387J8208J6089J6147J6159J3872
$$ 2151465 2175906 2201233 2224486 2245267 2265780 2286167 2304375 2320464 2336611 2352770 2366642
58258B366642J1371J1166J2082J2652J4153J6833J7839J6473J6556K0021K3485
$$ 2366642 2378013 2389179 2401261 2413913 2428066 2444899 2462738 2479211 2495767 2515788 2539273
58247B539273K4681K6507L0772L3958L3715L3488L6046L8350L7781L7334L9522
$$ 2539273 2563954 2590461 2621233 2655191 2688906 2722394 2758440 2796790 2834571 2871905 2911427
58236B911427M1119L9389L7570L8715M0088L9077L8587M0995M3089M2733M3954
$$ 2911427 2952546 2991935 3029505 3068220 3108308 3147385 3185972 3226967 3270056 3312789 3356743
58225C356743M9376N4418N5392N6319O0907O4998O4549O4020O8606P4736P6813
$$ 3356743 3406119 3460537 3515929 3572248 3633155 3698153 3762702 3826722 3895328 3970064 4046877
58214D046877P7170Q0751Q5807Q8470R0942R6675J02995J06763J11466J20260
$$ 4046877 4124047 4204798 4290605 4379075 4470017 4566692 4669687 4776450 4887916 5008176
58204E008176J28188J30142J30551J36117J44832J51216J56395J63787J70893
$$ 5008176 5136364 5266506 5397057 5533174 5678006 5829222 5985617 6149404 6320297
58195F320297J74630J78862J87636J97234K03788K11683K25395K40656K53080
$$ 6320297 6494927 6673789 6861425 7058659 7262447 7474130 7699525 7940181 8193261
58186H193261K67047K86249L04687L18064L34379L61085L91444M16624M41468
$$ 8193261 8460308 8746557 9051244 9369308 9703687 10064772 10456216 10872840 11314308
58177A1314308M74350N11061N43591N75579O13927O54309O90519P28693P76443
$$ 11314308 11788658 12299719 12843310 13418889 14032816 14687125 15377644 16106337 16882780
58168A6882780Q27901Q75725R26902R89173J053558J109674J166992J240890J329199
$$ 16882780 17710681 18586406 19513308 20502481 21556039 22665713 23832705 25073595 26402794
58159B6402794J422927J527155J648882J777903J904087K039940K200324K374596
$$ 26402794 27825721 29352876 31001758 32779661 34683748 36723688 38924012 41298608
58151D1298608K546555K726543K934008L165239L411595L692204M031754M422933
$$ 41298608 43845163 46571706 49505714 52670953 56082548 59774752 63806506 68229439
58143F8229439M850106N332766N905322O576029P353160Q288987R445553J0838931
$$ 68229439 73079545 78412311 84317633 90893662 98246822 106535809 115981362 126820293
58135A26820293J2466576J4350393J6486500J8799359K1230962K3829712K6673385
$$ 126820293 139286869 153637262 170123762 188923121 210154083 233983795 260657180
58128B60657180K9804093L3334789L7310498M0919787M1821543L7024147K5260034
$$ 260657180 290461273 323796062 361106560 402026347 443847890 480872037 506132071
58121E06132071Q626102q448810k2015775l0494353l4367414l4874697l3233607
$$ 506132071 514758173 506309363 484293588 453799235 419431821 384557124 351323517
58114C51323517l0462475k7209931k3672021j9974100j6649983j4486292j3826044
$$ 351323517 320861042 293651111 269979090 250004990 233355007 218868715 205042671
58107B05042671j4206762j4760802j4858196j4347266j3379190j2178770j0936264
$$ 205042671 190835909 176075107 161216911 146869645 133490455 121311685 110375421
58100A10375421r767828q710743p762188o919051o177021n520466m936590m425537
$$ 110375421 100607593 91896850 84134662 77215611 71038590 65518124 60581534 56155997
58092E6155997l983957l594771l243727k930823k657582k418238k209382k032909
$$ 56155997 52172040 48577269 45333542 42402719 39745137 37326899 35117517 33084608
58084C3084608j884091j751012j629412j523863j432188j343854j255938j175389
$$ 33084608 31200517 29449505 27820093 26296230 24864042 23520188 22264250 21088861
58076B1088861j103188j031301r57654q89286q27982p67344p07197o56889o20569
$$ 21088861 19985673 18954372 17996718 17107432 16279450 15512106 14804909 14148020 13527451
58067A3527451n91642n64903n42037n22162m98990m71074m44268m21092l97477
$$ 13527451 12935809 12370906 11828869 11306707 10807717 10336643 9892375 9471283 9073806
58058I073806l72221l49811l31816l14903k98886k87208k78277k66153k51121
$$ 9073806 8701585 8351774 8019958 7705055 7406169 7118961 6840684 6574531 6323410
58049F323410k39759k33015k24244k11021j99106j92070j86171j78313j70645
$$ 6323410 6083651 5850636 5626392 5415371 5216265 5024195 4838024 4659711 4489066
58040D489066j64453j57302j48977j43022j40073j36357j30568j25574j21921
$$ 4489066 4324613 4167311 4018334 3875312 3735239 3598882 3468314 3342740 3220819
58031C220819j16520j09098j03098r8930r3010q4835p8302p4741p1044o5942o1857
$$ 3220819 3104299 2995201 2892103 2793173 2700163 2615328 2537026 2462285 2391241 2325299 2263442
58020B263442n9404n6289n2548n0737n0231m7639m3487m2011m3506m3513m0436
$$ 2263442 2204038 2147749 2095201 2044464 1994233 1946594 1903107 1861096 1817590 1774077 1733641
58009A733641l7533l6336l4571l1663k9964k9345k6793k2520k0272k0575j9931
$$ 1733641 1696108 1659772 1625201 1593538 1563574 1534229 1507436 1484916 1464644 1444069 1424138
57998A424138j7701j7207j8782j8466j5332j3537j4969j6167j4956j4170j6052
$$ 1424138 1406437 1389230 1370448 1351982 1336650 1323113 1308144 1291977 1277021 1262851 1246799
57987A246799j8375j8727j7922j6871j4693j1862j0715j1244j0817r302r659j2244
$$ 1246799 1228424 1209697 1191775 1174904 1160211 1148349 1137634 1126390 1115573 1106271 1096612 1084368
57975A084368j3642j2530j1598j2202j2339j1495j2221j5060j7037j6946j7106
$$ 1084368 1070726 1058196 1046598 1034396 1022057 1010562 998341 983281 966244 949298 932192
57964I32192j8161j7396j4243j2149j2654j2712j0276p635o740o078m737m744
$$ 932192 914031 896635 882392 870243 857589 844877 834601 826966 820226 814148 809411 804667
57952H04667o639p411n657m314n353o139m177j363k86j48M83M50j259k745k223
$$ 804667 798028 790617 784960 780646 775293 769154 764977 763614 763328 763180 763663 764113 762854 760109 757886
57937G57886q83k15N54K002K674K159K787N728Q415Q321O381M399K140o67k415
$$ 757886 757003 756788 757342 759344 762018 764177 766964 772692 781107 789428 795809 800208 802348 801681 799266
57922G99266k311k172l342m475m441m484n434n768m643l865m672n408m703m038
$$ 799266 796955 794783 791441 786966 782525 778041 772607 766839 762196 758331 753659 748251 743548 739510
57908G39510m842n840n596n043n218n112l845k554k193k040j923l025m936n151
$$ 739510 734668 728828 723232 718189 712971 707859 704014 701460 699267 697227 695304 692279 687343 682192
57894F82192l287k306l587m472k985j322j891l460m119m622n729n579l028m32
$$ 682192 678905 676599 673012 668540 665555 664233 662342 658882 654763 650141 644412 638833 635805 635373
57880F35373K91J207M388P440P186N230N563Q476J0974J1733J1760J1324R977
$$ 635373 635664 636871 641259 648699 655885 661115 666678 675154 686128 697861 709621 720945 730922
57867G30922Q723Q794R008P265L929J069p06k091k888k573k164l077m870o056
$$ 730922 739645 748439 757447 764712 768641 769710 769004 766913 764025 761452 759288 756211 751341 745285
57853G45285o115n082k671K84J396j14j640q16J005J298L03l21q99k710n053o257
$$ 745285 739170 734088 731417 731701 733097 732983 731343 730527 731532 732830 733133 732812 731913 729203 724150 717893
57837G17893o455o740o850o189n660n909n405l009p45r46k260j935n76j003l266
$$ 717893 711438 704698 697848 691659 685999 680090 674685 671676 670931 669985 667725 665790 665214 664211 660945
57822F60945m542l657k302j781j555j076m92M53J947K782J679n18j997k637l393
$$ 660945 656403 652746 650444 648663 647108 646032 645540 645993 647940 650722 652401 651883 649886 647249 643856
57807F43856l872l012j445q03j230j704j864j408R06M986P608O203L161K863N328
$$ 643856 639984 636972 635527 634724 633494 631790 629926 628518 629424 634410 642018 648221 651382 654245 659573
57792F59573O794N998N476O311O103L491Q28N02J598K090J782J122o36l998p390
$$ 659573 666367 672365 677841 684152 690255 693746 694574 695076 696674 698764 700546 701668 701032 697034 689644
57777F89644q704p848o440n718n771o135o284o008n768o215p178p694p133n633
$$ 689644 680940 673092 666652 660934 655163 649028 642744 636736 630968 624753 617575 609881 602748 597115
57763E97115l597j557l43n12j557k353k220j171L69J583J736J216J116J338M54
$$ 597115 593518 591961 591618 591106 589549 587196 584976 583805 584174 585757 587493 588709 589825 591163 591617
57748E91617j703l125k575j597j909k698k745l309n962q836q543n285k748k793
$$ 591617 589914 586789 584214 582617 580708 578010 575265 571956 565994 557158 548615 543330 540582 537789
57734E37789l426k514p37J64l6l39R1J549L662N386O220P127Q948J0489R987Q088
$$ 537789 534363 531849 531112 531276 531240 530901 530992 532541 536203 541589 547809 554936 563884 574373 584360 592448
57718E92448P096P403O966M749K482K195L719N450O306O185N437M401L022R55
$$ 592448 599544 606947 613913 618662 621144 623339 627058 632508 638814 644999 650436 654837 657859 658814
57704F58814j432k886k969k959l909m909m885m821o069p475o704l877j370l70
$$ 658814 657382 654496 651527 648568 644659 639750 634865 630044 623975 616500 609796 605919 604549 604179
57690F04179k14p63k606m731m913k980j235r75r60l4J030J214P28k3j156k171
$$ 604179 603965 603202 600596 595865 590952 587972 586737 585762 584802 584768 585798 587012 587740 587717 586561 584390
57674E84390j899l53J010J533K049K759K347J93k207l076k256n15J529K997K619
$$ 584390 582491 582138 583148 584681 586730 589489 591836 592029 589822 586746 584490 583975 585504 588501 591120
57659E91120K17k654m265m218l145k003j865l178m837n118l808k391k089k920
$$ 591120 591337 588683 584418 580200 577055 575052 573187 570009 565172 560054 556246 553855 551766 548846
57645E48846m501o295p125o146m394l740m246m220k954j492n02N16J533J517M22
$$ 548846 544345 538050 530925 524779 520385 516645 512399 508179 505225 503733 503231 503747 505280 506797 507219
57630E07219k59K85R80O87k35q93j063q35k36M55J119K478N063P734R045R777
$$ 507219 506960 507245 508225 508912 508677 507784 506721 505886 505650 506105 507224 509702 514765 522499 531544 541321
57614E41321J2111J6301K0494K3852K7365L1377L5039L8679M3742M9514N2763
$$ 541321 553432 569733 590227 614079 641444 672821 707860 746539 790281 839795 892558
57603H92558N1671M7248L9549K5962N732j6390l3883m4297m9299n0709m9254m6079
$$ 892558 944229 991477 1031026 1056988 1062720 1046330 1012447 968150 918851 868142 818888 772809
57591G72809m2511l8462l3038k6667k1132j7461j4948j2225q754n505m346n980
$$ 772809 730298 691836 658798 632131 610999 593538 578590 566365 557611 552106 547760 541780
57579E41780q428q743o387l539j966j361j105j414j919j258O75K019J685R90J238
$$ 541780 533352 524609 518222 514683 512717 511356 510251 508837 506918 505660 506335 508354 510039 511029 512267
57564E12267J554O60q99j929k451k923l004k559k508l324m134m542n498o990o981
$$ 512267 513821 514481 513582 511653 509202 506279 503275 500716 498208 494884 490750 486208 480710 473720 466739
57549D66739m492j827j545k891l529l165k968k694j224Q58J837J422O05l65j662
$$ 466739 462247 460420 458875 455984 452455 449290 446322 443628 442404 443262 445099 446521 447126 446761 445099
57534D45099k307j281K16N3j608k659k409k165k526k516j862j836k923l623k552
$$ 445099 442792 441511 441727 441780 440172 437513 435104 432939 430413 427897 426035 424199 421276 417653 415101
57519D15101n51M26l07j664k165j351n2N37P3p60j328j728k188k549k721k951
$$ 415101 414550 414976 414669 413005 410840 409489 409437 409974 410047 409287 407959 406231 404043 401494 398773 395822
57503C95822l240l317l385l867m176l181j280l20p41p67N77J776J628J559L051
$$ 395822 392582 389265 385880 382013 377837 374656 373376 373056 372315 371548 372125 373901 375529 377088 380139
57488C80139M541L557Q48l59J295L940N277M825L488K400K163K213J408l7m02
$$ 380139 384680 388237 389085 388726 390021 393961 399238 404063 407551 409951 412114 414327 415735 415698 415296
57473D15296P36J282l14k402k596j262k70K68J250J892Q72o58k90J748L036L025
$$ 415296 416032 417314 417000 414598 412002 410740 410470 410738 411988 413880 414752 414094 413804 415552 418588 421613
57457D21613L544N106N884N087M405N092O008N709M467L203K210J783K432L543
$$ 421613 425157 430263 436147 441234 445639 450731 456739 462448 466915 470118 472328 474111 476543 480086
57443D80086L379J308j191k484k495j951j150j89N82Q97O82j90j490k278j981
$$ 480086 483465 484773 483582 481098 478603 476652 475502 475313 475895 476792 477474 477284 475794 473516 471535
57428D71535j417j538j781j167l72p19j578j120M72J049m5r81n70J0l99r51m30
$$ 471535 470118 468580 466799 465632 465260 464541 462963 461843 462315 463364 463319 462338 461768 461778 461379 460428 459998
57411D59998P20J350J317J222J422K186L761N543O112M887K991K080K866M997
$$ 459998 460718 462068 463385 464607 466029 468215 471976 477519 483631 488518 491509 493589 496455 501452
57397E01452P411Q695Q086O374N011M389L915L450L374L369K630J360P97J573
$$ 501452 508863 517558 525644 532018 537029 541418 545333 548783 552157 555526 558156 559516 560313 561886
57383E61886L173M801N735N291L859L354M930O806O412M235L163M150N164M654
$$ 561886 565059 569860 575595 580886 584745 588099 593029 599835 606247 610482 613645 617795 622959 627613
57369F27613L468K712K103J417J507K807M494N899P090P658O763M988M194M923
$$ 627613 631081 633793 635896 637313 638820 641627 646121 652020 659110 666768 673531 678519 682713 687636
57355F87636N787N999O394P278P460O415N400N388N784O101O799P432O243L012
$$ 687636 693423 699422 705816 713094 720554 726969 732369 737757 743541 749642 756441 763873 770116 773128
57341G73128L68N61K650M321M904N063N007M662M498M787N099N524P005R421J0860
$$ 773128 773496 774057 776707 781028 785932 790995 796002 800664 805162 809949 815048 820572 827577 836998 847858
57326H47858J0115Q507P958Q574R372J0065J0763J1009J0464R521Q467P214O540
$$ 847858 857973 866480 874438 883012 892384 902449 913212 924221 934685 944206 952673 959887 966427
57313I66427P814J0434J1497R565P013O856Q768J0050R416P870O742O663P898
$$ 966427 974241 984675 996172 1005737 1012750 1019606 1028374 1038424 1047840 1055710 1062452 1069115 1077013
57300A077013J0154J2391J3765J4327J4265J3475J2422J2127J2563J2427J1173
$$ 1077013 1087167 1099558 1113323 1127650 1141915 1155390 1167812 1179939 1192502 1204929 1216102
57289A216102R800Q996Q412Q413J0226J3165J4199J2008R290R052J0786J2283
$$ 1216102 1225902 1234898 1243310 1251723 1261949 1275114 1289313 1301321 1310611 1319663 1330449 1342732
57277A342732J3110J3736J3280J1103R294J0469J3848J6282J6510J5930J5692
$$ 1342732 1355842 1369578 1382858 1393961 1403255 1413724 1427572 1443854 1460364 1476294 1491986
57266A491986J5583J5554J5967J6359J5894J4988J4791J5398J6137J7122J8819
$$ 1491986 1507569 1523123 1539090 1555449 1571343 1586331 1601122 1616520 1632657 1649779 1668598
57255A668598K0490K0935K0392K0067K0132J9749J8830J8197J8326J9088K0326
$$ 1668598 1689088 1710023 1730415 1750482 1770614 1790363 1809193 1827390 1845716 1864804 1885130
57244A885130K1526K1736K0979K0858K2366K4134K4309K3123K2082K1708K1749
$$ 1885130 1906656 1928392 1949371 1970229 1992595 2016729 2041038 2064161 2086243 2107951 2129700
57233B129700K2433K3680K4174K3182K2199K2861K4355K5058K5479K7171K9712
$$ 2129700 2152133 2175813 2199987 2223169 2245368 2268229 2292584 2317642 2343121 2370292 2400004
57222B400004L1438L2426L4027L5971L6588L5811L5419L6316L7712L8967M0133
$$ 2400004 2431442 2463868 2497895 2533866 2570454 2606265 2641684 2678000 2715712 2754679 2794812
57211B794812M0847M0584L9794L9032L7500L4517L1633L0848L1350L0614K8433
$$ 2794812 2835659 2876243 2916037 2955069 2992569 3027086 3058719 3089567 3120917 3151531 3179964
57200C179964K7048K7339K7679K6948K6200K6565K7581K8278K8379K8073K7890
$$ 3179964 3207012 3234351 3262030 3288978 3315178 3341743 3369324 3397602 3425981 3454054 3481944
57189C481944K8743L0692L2126L1701L0415K9920K9684K8008K5144K3006K2286
$$ 3481944 3510687 3541379 3573505 3605206 3635621 3665541 3695225 3723233 3748377 3771383 3793669
57178C793669K2295K3080K5114K7347K8360K9087L1706L6022L9893M2941M6791
$$ 3793669 3815964 3839044 3864158 3891505 3919865 3948952 3980658 4016680 4056573 4099514 4146305
57167D146305N1598N5540N8090O0669O3637O5609O6287O6995O7847O7390O5686
$$ 4146305 4197903 4253443 4311533 4372202 4435839 4501448 4567735 4634730 4702577 4769967 4835653
57156D835653O4677O4582O3056N9071N4597N1124M7370M2062L6357L1658K7355
$$ 4835653 4900330 4964912 5027968 5087039 5141636 5192760 5240130 5282192 5318549 5350207 5377562
57145E377562K2676J8842J7291J7108J6079J3493J0560Q649Q076Q231Q412Q693
$$ 5377562 5400238 5419080 5436371 5453479 5469558 5483051 5493611 5502260 5510336 5518567 5526979 5535672
57133E535672R645J0903J1093J0088R817J1325J2615J1439Q365M605j027r542
$$ 5535672 5545317 5556220 5567313 5577401 5587218 5598543 5611158 5622597 5630962 5635567 5634540 5624998
57121E624998j8116k3224k6149l0865l7389m2190m4593m7447n1317n3534n3817
$$ 5624998 5606882 5583658 5557509 5526644 5489255 5447065 5402472 5355025 5303708 5250174 5196357
57110E196357n5296n8638o0394n8933n6968n6163n4199m9733m5636m4429m4653
$$ 5196357 5141061 5082423 5022029 4963096 4906128 4849965 4795766 4746033 4700397 4655968 4611315
57099D611315m4472m4999m7109m8565m7337m4772m2831m1113l8785l6606l5164
$$ 4611315 4566843 4521844 4474735 4426170 4378833 4334061 4291230 4250117 4211332 4174726 4139562
57088D139562l4033l4019l6670m0370m1153l8981l8821m3690n1296n9514o9987
$$ 4139562 4105529 4071510 4034840 3994470 3953317 3914336 3875515 3831825 3780529 3721015 3651028
57077C651028q3499r6707j06753j14936j23172j31257j39992j51998j66801j80358
$$ 3651028 3567529 3470822 3364069 3249133 3125961 2994704 2854712 2702714 2535913 2355555
57067B355555j92119k06904k27002k48893k71248k99171l35916A97038b22231
$$ 2355555 2163436 1956532 1729530 1480637 1209389 910218 574302 197038 -222231
57057f87415n19010n78654o41336p10115p89341q79714r83433j107412j255092
$$ -687415 -1206425 -1785079 -2426415 -3136530 -3925871 -4805585 -5789018 -6896430 -8151522
57048h151522j421734j604089j807468k036874k289801k565795k874793l227680
$$ -8151522 -9573256 -11177345 -12984813 -15021687 -17311488 -19877283 -22752076 -25979756
57040b5979756l627438m078627m595747n191954n869947o636205p514440q532339
$$ -25979756 -29607194 -33685821 -38281568 -43473522 -49343469 -55979674 -63494114 -72026453
57032g2026453r703416j1029060j2498802j4070515j5665389j7199694j8608030
$$ -72026453 -81729869 -92758929 -105257731 -119328246 -134993635 -152193329 -170801359
57025a70801359j9836628k0870914k1799649k2749823k3601141k3751115k2327028
$$ -170801359 -190637987 -211508901 -233308550 -256058373 -279659514 -303410629 -325737657
57018c25737657j8787730j3344113o787462J5908O415496J1920170J6119778J8801243
$$ -325737657 -344525387 -357869500 -364656962 -364641054 -358225558 -346305388 -330185610 -311384367
57010c11384367K0086594K0363819K0064995J9503950J8852297J8179158J7491225
$$ -311384367 -291297773 -270933954 -250868959 -231365009 -212512712 -194333554 -176842329
57003a76842329J6769400J5994530J5148533J4210787J3174364J2063188J0920968
$$ -176842329 -160072929 -144078399 -128929866 -114719079 -101544715 -89481527 -78560559
56996g8560559R787020Q691246P662383O724310N885219N140968M487112L919404
$$ -78560559 -68773539 -60082293 -52419910 -45695600 -39810381 -34669413 -30182301 -26262897
56988b6262897L426993K996164K619982K296735K021058J784120J580426J407195
$$ -26262897 -22835904 -19839740 -17219758 -14923023 -12901965 -11117845 -9537419 -8130224
56980h130224J258853J128883J015331R18185Q33191P54579O82045O18716c56877
$$ -8130224 -6871371 -5742488 -4727157 -3808972 -2975781 -2221202 -1539157 -920441 -356877
56970A55135M62911M18747L79856L44146L12174K86786K67511K50228K32648K15656
$$ 155135 618046 1036793 1416649 1760795 2072969 2359755 2627266 2877494 3110142 3325798
56960C325798J99448J83320J69988J65237J70817J79853J80427J62956J25729
$$ 3325798 3525246 3708566 3878554 4043791 4214608 4394461 4574888 4737844 4863573
56951D863573P6595K8959p080l0644m6673n8714o7364p3606p9360q5070r0007
$$ 4863573 4940168 4969127 4962047 4931403 4884730 4826016 4758652 4685046 4605686 4520616 4430609
56940D430609r4802j00968j08348j15753j23398j31901j39736j44922j48605j53772
$$ 4430609 4335807 4234839 4126491 4010738 3887340 3755439 3615703 3470781 3322176 3168404
56930C168404j60893j68041j74829j82589j90772j96870k00160k01942k01452
$$ 3168404 3007511 2839470 2664641 2482052 2291280 2094410 1894250 1692308 1490856
56921A490856j95435j83178j68791j56580j46545j36052j23908j11045r8632H3568
$$ 1490856 1295421 1112243 943452 786872 640327 504275 380367 269322 170690 83568
56910G136e9156n7076n0058m5815m2591l8053l2393k7563k3603j8293j0984m124
$$ 7136 -59156 -116232 -166290 -212105 -254696 -292749 -325142 -352705 -376308 -394601 -405585 -409709
56898d09709J90L023O571J0800J3611J3257R607M001j352m587n571n517n124m043
$$ -409709 -409519 -406496 -399925 -389125 -375514 -362257 -352650 -348649 -350001 -354588 -360159 -365676 -370800 -374843
56884c74843k169j93J517L362N515P404Q543R075R582J1055J4553J9705K4178
$$ -374843 -377012 -377205 -375688 -372326 -366811 -359407 -350864 -341789 -332207 -321152 -306599 -286894 -262716
56871b62716K6217K7025K8630K9866K7048J8816P889k488j1384j8784k3684k5165
$$ -262716 -236499 -209474 -180844 -150978 -123930 -105114 -97225 -99713 -111097 -129881 -153565 -178730
56859a78730k3872k1258j8405j6159j5035j4327j2640r679o313k871P49L361L378
$$ -178730 -202602 -223860 -242265 -258424 -273459 -287786 -300426 -310105 -316418 -319289 -318540 -315179 -311801
56846c11801J832J887M346O367N912M810N612P842R575J0628J1752J2443J2084
$$ -311801 -309969 -308082 -303736 -297369 -291457 -286647 -281035 -273193 -263618 -252990 -241238 -228795 -216711
56833b16711J1956J3569J5983J7145J7106J7570J8817J9486J9111J8674J8525
$$ -216711 -204755 -191186 -175203 -158058 -140952 -123382 -104565 -85079 -65968 -47294 -28769
56822b8769a1188C605J0131M185j862o192B280d366m911l118j352P7J170L046
$$ -28769 -11188 3605 13736 17921 16059 9867 2280 -4366 -9277 -12395 -13747 -13670 -12500 -9454
56808i454b748H654J5592J8891K1900K4716K7212L0200L4590L9595M3178M3866
$$ -9454 -2748 8654 24246 43137 65037 89753 116965 147165 181755 221350 264528 308394
56796C08394M0954L3695K2204Q806l212j2111j7749j9919j8641j5601j3135j1576
$$ 308394 349348 383043 405247 414053 410841 398730 380981 361062 342421 326820 313685 302109
56784C02109r259n192k0N421J0832J5811K0237K5128L1370L7839M2745M6462N0447
$$ 302109 292850 287658 287638 293059 303891 319702 339939 365067 396437 434276 477021 523483 573930
56771E73930N3375N1153M1602K6772R886p433k3724l6089m2201m2668l9985l6170
$$ 573930 627305 678458 720060 746832 756718 749285 725561 689472 647271 604603 564618 528448
56759E28448l2362k9134k5927k1284j4890q218k371L335R600J5537K0198K4268
$$ 528448 496086 466952 441025 419741 404851 396633 394262 397597 407197 422734 442932 467200
56747D67200K8680L2671L4671L4016L0239K1894Q272q152k2849l2790l7801l9018
$$ 467200 495880 528551 563222 597238 627477 649371 657643 649491 626642 593852 556051 517033
56735E17033l7673l5158l2652l0151k6843k2493j7754j3155q678m259J6M142Q018
$$ 517033 479360 444202 411550 381399 354556 332063 314309 301154 292476 288217 288233 292375 300393
56722C00393J1200J3432J5140J6695J7419J5897J1233L681n484j4197k0302k2871
$$ 300393 311593 325025 340165 356860 374279 390176 401409 405090 399606 385409 365107 342236
56710C42236k2809k1781k0817k0172j9818j9521j8946j8132j7309j6035j3469
$$ 342236 319427 297646 276829 256657 236839 217318 198372 180240 162931 146896 133427
56699A33427j0007p512p011p312o947o331o520o865n815l607k184k432l267l680
$$ 133427 123420 115908 108897 101585 94638 88307 81787 74922 69107 65500 63316 60884 57617 53937
56685E3937m001m472m149k223M37K054J775J60j664k799k867k151j382j034r63
$$ 53937 49936 45464 41315 39092 39529 41583 43358 43518 41854 39055 36188 34037 32655 31621 30658
56670C0658q36o49n53l44M64J955L390L733K722J274O01R98J730K080K107K350
$$ 30658 29822 29173 28620 28276 28740 30695 34085 37818 40540 41814 42415 43413 45143 47223 49330 51680
56654E1680L068L974M534M489M173M165M450M288L252J867P57j62q13j50K320
$$ 51680 54748 58722 63256 67745 71918 76083 80533 84821 88073 89940 90697 90535 89722 89572 91892
56639I1892M716M380J325j639k485j891j204n21K68N09R6J73J182J738Q47k14
$$ 91892 96608 100988 102313 100674 98189 96298 95094 94573 94841 95350 95446 95619 96801 98539 99386 99172
56623I9172j0N57j31j365j053R44K653L027L000L342L421K610J467Q75J003J491
$$ 99172 99162 99719 99588 98223 97170 98114 100767 103794 106794 110136 113557 116167 117634 118509 119512 121003
56607A21003J848J614Q71N54J425K908L803L810L444K801J687P29Q84J766J761
$$ 121003 122851 124465 125336 125890 127315 130223 134026 137836 141280 144081 145768 146497 147381 149147 150908
56592A50908K12j593j986o89J273K680K890K145J402J370J631J132l34j601j202
$$ 150908 151120 149527 147541 146852 148125 150805 153695 155840 157242 158612 160243 161375 161041 159440 158238
56577A58238J079L662M328K325p34k656l105l201l067j663O10J393l28k375k425
$$ 158238 159317 162979 167307 169632 168898 166242 163137 159936 156869 155206 155816 157209 156881 154506 152081
56562A52081j212p49r59l71Q50J116O8j157j901k263j884n38O00K81p00p81l45
$$ 152081 150869 150120 149161 148790 149640 150756 150824 149667 147766 145503 143619 143081 143681 143962 143262 142481 142136
56545A42136p64j399l80J868K895K176J772K542K773J495L23O67J644K152K674
$$ 142136 141372 139973 139593 141461 144356 146532 148304 150846 153619 155114 155437 156104 157748 159900 162574
56530A62574L592L860K996K414K993L237J749k15n92M01J140J476K524M259N253
$$ 162574 166166 170026 173022 175436 178429 181666 183415 183200 182608 183009 184149 185625 188149 192408 197661
56515A97661M657K996J188J0J33J529L054L594L308L001K935L148M198O295Q226
$$ 197661 202318 205314 206502 206512 206645 208174 211228 214822 218130 221131 224066 227214 231412 237707 245933
56500B45933Q500P443O968Q175J0222J1604J1721J0971J0000R215Q620P776O126
$$ 245933 254433 261876 268844 277019 287241 298845 310566 321537 331537 340752 349372 357148 363274
56487C63274L505L89k377m091m501l706j944K79K005K447J924J446J140K7k075
$$ 363274 366779 367168 364791 360700 356199 352493 350549 350828 352833 355280 357204 358650 359790 359817 357742
56472C57742l642l446k436k307l070l571l745m435n357n192l689k017r13j05L54
$$ 357742 354100 350654 348218 345911 342841 339270 335525 331090 325733 320541 316852 314835 313922 313817 314171
56457C14171j57j521k826l777m685n194m711m018m494n606n263l029q45n7J18
$$ 314171 314014 312493 309667 305890 301205 296011 291300 287282 282788 277182 271919 268890 268045 267988 268106
56442B68106M16Q1j231k135j562m89k80o64p04n45p68j027n65M83J281J268M25
$$ 268106 268522 268603 267372 265237 263675 263186 262906 262242 261538 260993 260225 259198 258633 259116 260397 261665 262090
56425B62090p24j168l86O31L89j002k143k566k873k680p20K448M179L170J181
$$ 262090 261366 260198 259812 260443 260832 259830 257687 255121 252248 249568 248848 251296 255475 258645 259826
56410B59826K31O7l31o21k1J029J631J799K040K453K932L175K204n66l541m145
$$ 259826 260057 260124 259793 259172 259151 260180 261811 263610 265650 268103 271035 274210 276414 275848 272307 268162
56394B68162k222j31Q61J747K790K488P19j11J123K187J267P1O74J836J307l10
$$ 268162 265940 265809 266670 268417 271207 273695 274414 274303 275426 277613 278880 278951 279625 281461 282768 282458
56378B82458q82k65L17Q83J862K133P39o31K02K320L129K442K234L048L607L558
$$ 282458 281576 281311 281628 282511 284373 286506 287245 286614 286816 289136 292265 294707 296941 299989 303596 307154
56362C07154L788M154L569K308J768J933J490M69M17J636K543K152J286P91L70
$$ 307154 310942 315096 318665 320973 322741 324674 326164 326633 327050 328686 331229 333381 334667 335458 335828
56347C35828k49n79m00l18p55j325j539j344q22r9M23L84j05p40j335j524r44
$$ 335828 335579 335000 334600 334282 333527 332202 330663 329319 328497 328398 328821 329205 329100 328360 327025 325501 324557
56330C24557j56m14j764k474j231J103K781L228K869K070J212Q39Q33N64L31J150
$$ 324557 324401 323987 322223 319749 318518 319621 322402 325630 328499 330569 331781 332620 333453 334017 334348 335498
56314C35498K558K600R06l85J9O26J78j5J147J929O02j109m69J945L252K552J363
$$ 335498 338056 340656 341562 341177 341196 341822 342000 341985 343132 345061 345663 344554 344085 346030 349282 351834 353197
56297C53197Q01R26K007L880M870L792K135J938K549J976M09l73j73k27m75K19
$$ 353197 353998 354924 356931 360811 365681 369473 371608 373546 376095 378071 378480 378107 377934 377707 377232 377451
56281C77451J651K549K837L248L368K437J419J860L268M012M032M286M421L638
$$ 377451 379102 381651 384488 387736 391104 393541 394960 396820 400088 404100 408132 412418 416839 420477
56267D20477K967L870N347N326M205M050M870M720L200J809J118M65K17J402L236
$$ 420477 423444 427314 432661 437987 442192 446242 451112 455832 459032 460841 461959 462424 462641 464043 467279
56252D67279L859L391L475M143L955L017K779L082K486J507K261M758O665P151
$$ 467279 471138 474529 478004 482147 486102 489119 491898 494980 497466 498973 501234 505992 512657 519808
56238E19808P872R600J0762J0117Q400O748N632N566O655P389O295M657N068P444
$$ 519808 527680 537280 548042 558159 566559 573307 578939 584505 591160 598549 604844 609501 614569 622013
56224F22013R214R419R597J0507J0977J0575J0621J1774J2926J3211J3137J3447
$$ 622013 631227 640646 650243 660750 671727 682302 692923 704697 717623 730834 743971 757418
56212G57418J4516J6747J9808K2069K2723K3468K5852K8329K8787K8548L0292
$$ 757418 771934 788681 808489 830558 853281 876749 902601 930930 959717 988265 1018557
56201A018557L3317L4782L4830L6233L9431M2335M4887M9275N5394O0547O4300
$$ 1018557 1051874 1086656 1121486 1157719 1197150 1239485 1284372 1333647 1389041 1449588 1513888
56190A513888O9254P6250Q3127Q9207R6704J06228J14992J21119J26080J31184
$$ 1513888 1583142 1659392 1742519 1831726 1928430 2034658 2149650 2270769 2396849 2528033
56180B528033J34976J35783J33805J29315J21722J11616J00775Q9093P4376N6074
$$ 2528033 2663009 2798792 2932597 3061912 3183634 3295250 3396025 3485118 3559494 3615568
56170C615568L6220J6023n138k6632m6009o2404p7041q9718r8437j03530j08128
$$ 3615568 3651788 3667811 3662673 3636041 3590032 3527628 3450587 3360869 3262432 3158902 3050774
56159C050774j13228j16152j15363j12983j10893j08001j03218r7693r2290q6164
$$ 3050774 2937546 2821394 2706031 2593048 2482155 2374154 2270936 2173243 2080953 1994789
56149A994789p9528p4615p2043o9363o4947o0265n6723n3347m9261m5480m2566
$$ 1994789 1915261 1840646 1768603 1699240 1634293 1574028 1517305 1463958 1414697 1369217 1326651
56138A326651l9368l5467l2111k9501k6125k1923j8984j8028j7299j5943j5169
$$ 1326651 1287283 1251816 1219705 1190204 1164079 1142156 1123172 1105144 1087845 1071902 1056733
56127A056733j5072j3854j1236r167q209o799m938m616n682n327k844p61k26L98
$$ 1056733 1041661 1027807 1016571 1007404 999195 992396 987458 982842 977160 971833 968989 968228 968002 968400
56113I68400J373P75r19l85K856N219N220N643P637Q171N944M447O172Q707R669
$$ 968400 969773 970548 969629 969244 972100 977319 982539 988182 995819 1003990 1009934 1014381 1020553 1029260 1038929
56098A038929J0677J3122J4735J3936J3215J4770J6923J8122K0264K4586K8418
$$ 1038929 1049606 1062728 1077463 1091399 1104614 1119384 1136307 1154429 1174693 1199279 1227697
56087A227697K9599L0264L2855L6247L9071M2980M9228N5839O1369O7619P5738
$$ 1227697 1257296 1287560 1320415 1356662 1395733 1438713 1487941 1543780 1605149 1672768 1748506
56076A748506Q3777R0971R9912J11195J20672J25591J28630J31878J31686J24262
$$ 1748506 1832283 1923254 2023166 2134361 2255033 2380624 2509254 2641132 2772818 2897080
56066B897080J12179J00610R0686Q1111P2793O7060O1926N4115M2528K7025P310
$$ 2897080 3009259 3109869 3200555 3281666 3354459 3421519 3483445 3537560 3580088 3607113 3614423
56055C614423j4031l1249m1459m7658n3328n8488o3571p1812q4067r6033j04210
$$ 3614423 3600392 3569143 3527684 3480026 3426698 3368210 3304639 3232827 3148760 3052727 2948517
56044B948517j09839j13689j12538j05018r5531q7902q0240p0350o0917n4519
$$ 2948517 2838678 2724989 2612451 2507433 2411902 2324000 2243760 2173410 2112493 2057974
56034B057974m8769m1164l3799k8730k3831j7737j3339j1836r266l849l37j719
$$ 2057974 2009205 1968041 1934242 1905512 1881681 1863944 1850605 1838769 1829503 1825654 1825317 1823598
56022A823598l111O1M247M660L780O022R843J2140J4856J9928K3284K1332J8272
$$ 1823598 1820487 1820548 1824795 1829455 1833235 1839257 1849100 1861240 1876096 1896024 1919308 1940640 1958912
56009A958912J9539K3105K4455K4834K7103K8844K7352K6258K9343L3071L2995
$$ 1958912 1978451 2001556 2026011 2050845 2077948 2106792 2134144 2160402 2189745 2222816 2255811
55998B255811L2131L4812L8029L7317L5647L7561M0001L8235L5486L7084M0191
$$ 2255811 2287942 2322754 2360783 2398100 2433747 2471308 2511309 2549544 2585030 2622114 2662305
55987B662305L9252L6792L8779M3639M5842M6183M8678N1583N1290N1070N5990
$$ 2662305 2701557 2738349 2777128 2820767 2866609 2912792 2961470 3013053 3064343 3115413 3171403
55976C171403O3159O6592O7571P0698P4427P5144P5872Q1009Q7314Q9854R1538
$$ 3171403 3234562 3301154 3368725 3439423 3513850 3588994 3664866 3745875 3833189 3923043 4014581
55965D014581R6847J02148J02727J03048J08915J15993J17757J18217J24610J34298
$$ 4014581 4111428 4213576 4316303 4419351 4528266 4644259 4762016 4880233 5004843 5139141
55955E139141J41377J49121J62468J75734J82167J88369K04068K24593K39220
$$ 5139141 5280518 5429639 5592107 5767841 5950008 6138377 6342445 6567038 6806258
55946F806258K49861K64996K82073K93561L04178L23963L49683L70972L89531
$$ 6806258 7056119 7321115 7603188 7896749 8200927 8524890 8874573 9245545 9635076
55937I635076M14237M43047M68198M93467N27442N65693N98794O31270O72875
$$ 9635076 10049313 10492360 10960558 11454025 11981467 12547160 13145954 13777224 14450099
55928A4450099P18613P58333P97819Q47912R01539R46029R89776J050894J127546
$$ 14450099 15168712 15927045 16724864 17572776 18474315 19420344 20410120 21461014 22588560
55919B2588560J206137J289954J391049J502901J611959J727413J867075K022777
$$ 22588560 23794697 25084651 26475700 27978601 29590560 31317973 33185048 35207825
55911C5207825K174188K327639K505004K704911K915139L152424L445719L790265
$$ 35207825 37382013 39709652 42214656 44919567 47834706 50987130 54432849 58223114
55903E8223114M165629M588894N099536N704566O396581P213748Q217599R422775
$$ 58223114 62388743 66977637 72077173 77781739 84178320 91392068 99609667 109032442
55895A09032442J0816864J2431745J4315366J6457727J8844038K1549261K4650185
$$ 109032442 119849306 132281051 146596417 163054144 181898182 203447443 228097628
55888B28097628K8076814L1696950L5402360L8645996L9734450L6140207K6296356
$$ 228097628 256174442 287871392 323273752 361919748 401654198 437794405 464090761
55881D64090761J1338617n165472j9392121k9246894l4623204l6440679l5792934
$$ 464090761 475429378 470263906 450871785 421624891 387001687 350561008 314768074
55874C14768074l3657001l0797668k7677544k4517981k1473298j8686284j6217273
$$ 314768074 281111073 250313405 222635861 198117880 176644582 157958298 141741025
55867A41741025j4042527j2142926j0527308r175248q031508p063285o266302
$$ 141741025 127698498 115555572 105028264 95853016 87821508 80758223 74491921
55860G4491921n614872n059756m575957m165184l812486l485981l178863k908916
$$ 74491921 68877049 63817293 59241336 55076152 51263666 47777685 44598822 41689906
55852D1689906k675767k457229k247565k061950j902138j752230j609548j487342
$$ 41689906 39014139 36556910 34309345 32247395 30345257 28593027 26983479 25496137
55844B5496137j385564j289197j196358j119365j057359r95378r31141q76280
$$ 25496137 24110573 22821376 21625018 20505653 19448294 18452916 17521775 16645495
55836A6645495q30636p81285p27555o81596o43279n99581n50425n10562m83280
$$ 16645495 15814859 15033574 14306019 13624423 12981144 12381563 11831138 11320576 10837296
55827A0837296m55677m23078l95463l75748l53310l24075k97219k76962k56097
$$ 10837296 10381619 9958541 9563078 9187330 8834020 8509945 8212726 7935764 7679667
55818G679667k32262k13202k01023j87542j69919j55897j49603j46612j46318
$$ 7679667 7447405 7234203 7033180 6845638 6675719 6519822 6370219 6223607 6077289
55809F077289j54802j71673j87543j97804k06364k13616k13948k07499k01518
$$ 6077289 5922487 5750814 5563271 5365467 5159103 4945487 4731539 4524040 4322522
55800D322522j97451j89100j75708j64446j57764j50367j40812j34079j30599
$$ 4322522 4125071 3935971 3760263 3595817 3438053 3287686 3146874 3012795 2882196
55791B882196j24582j15375j08824j05583r9651r0442q4503q3073p9574p1804
$$ 2882196 2757614 2642239 2533415 2427832 2328181 2237739 2153236 2070163 1990589 1918785
55781A918785o5309o2124n7429n0098m5596m5333m3633l8235l3844l2536l0432
$$ 1918785 1853476 1791352 1733923 1683825 1638229 1592896 1549263 1511028 1477184 1444648 1414216
55770A414216k6449k4671k5541k4439k1102k0717k3478k3254j9035j7448k1022
$$ 1414216 1387767 1363096 1337555 1313116 1292014 1271297 1247819 1224565 1205530 1188082 1167060
55759A167060k4055k3281k2688k4251k3744j9633j6774j7272j6551j2500r708
$$ 1167060 1143005 1119724 1097036 1072785 1049041 1029408 1012634 995362 978811 966311 956603
55748I56603j0557j0623p197m250m471m256r73K147K535K705M181M025J165n29
$$ 956603 946046 935423 928226 923976 919505 915249 914276 916423 918958 921663 925844 929869 931034 930505
55734I30505P64J454n02j999j522k487o347r156q765q736j1309j3066j1474r495
$$ 930505 931269 932723 932221 930222 928700 926213 919866 910710 901945 893209 881900 868834 857360 847865
55720H47865r774j0308r632j0192j2823j3874j1673r975j1147j1721q739m831
$$ 847865 838091 827783 818151 807959 795136 781262 769589 759614 748467 736746 728007 723176
55708G23176k953j316K378O446Q540Q745O495l55j0241j7121j8271j7658j8597
$$ 723176 720223 718907 721285 727731 736271 745016 751511 751156 740915 723794 705523 687865 669268
55695F69268j8806j6069j2883j1525j0012o947n059n946o589n086m563p149r410
$$ 669268 650462 634393 621510 609985 599973 593026 587967 582021 575432 570346 565783 558634 549224
55682E49224q330o667p602q858p245m582m006m364l302k212l111m212l495l310
$$ 549224 540894 534227 526625 517767 510522 505940 501934 497570 494268 492056 488945 484733 481238 477928
55668D77928o344j0053j0269p915p174q928j0548j0570r534p654n225l840m162
$$ 477928 471584 461531 451262 443347 436173 427245 416697 406127 396593 388939 383714 379874 375712
55655C75712m119k045L84J037Q18J477K301J975J619K890M901N711N116L628P24
$$ 375712 371593 369548 369932 370969 371787 373264 375565 377540 379159 382049 386950 392661 397777 401405 402129
55640D02129l468o736p366o558o326o891p668q693r489q795o960o120o748o642
$$ 402129 398661 391925 384559 378001 371675 364784 357116 348423 338934 330139 323179 317059 310311 303669
55626C03669m578k135p45j07m22k615n019m010M19L731L432K205K461K327%k329
$$ 303669 299091 296956 296211 296104 295682 293067 288048 284038 284457 288188 291620 293825 296286 298613 298613 296284
55610B96284k363j698k400k993j430R33J703J113L39r68k657k503M01L429M288
$$ 296284 293921 292223 289823 286830 285400 286333 288036 289149 289488 288520 285863 283360 283761 287190 291478
55595B91478M178M599M338K497J202K074L148K439J468K035K618J439O9M74J257
$$ 291478 295656 300255 304593 307090 308292 310366 313514 315953 317421 319456 322074 323513 323582 324056 325313
55580C25313L80j058j249j223k613m414n330o580q957j0019p914n259n246o470
$$ 325313 325693 324635 323386 322163 319550 315136 309806 303226 294269 284250 276336 271077 265831 259361
55566B59361n669l391k561l370l709l243l061k602p31J321J375k19j501j996k331
$$ 259361 253692 250301 247740 244370 240661 237418 234357 231755 231024 232345 233720 233501 232000 230004 227673
55551B27673k310j882k186l262k978p26N76r03k338q24J482Q76j837l195k766
$$ 227673 225363 223481 221295 218033 215055 214329 214905 214002 211664 210840 212322 213198 211361 208166 205400
55536B05400k529k419j120J94n95k386k497j216p07o71N01J481l48l711m595k365
$$ 205400 202871 200452 199332 199526 198931 196545 194048 192832 192125 191454 191955 193436 193088 189377 184782 182417
55520A82417k72M3K30J204J734J720K897N347O616N516L852L418L686L493K865
$$ 182417 182145 182188 182418 183622 185356 187076 189973 195320 201936 207452 211304 214722 218408 221901 224766
55505B24766K414K450L014L492K620K78j379m88J650K213N83j695l762n831p358
$$ 224766 227180 229630 232644 236136 238756 239034 237655 237167 238817 241030 241613 239918 236156 230325 222967
55490B22967p315o035m802l887k804j811j476j442j285j683l051m142l751k612
$$ 222967 215652 209617 204815 200928 198124 196313 194837 193395 192110 190427 187376 183234 179483 176871
55476A76871j870j094K75J152N80k17J95R55O52m2Q7K09r62k524k876k475k494
$$ 176871 175001 173907 174182 175334 175914 175697 175892 176847 177499 177457 177544 177753 176791 174267 171391 168916 166422
55459A66422k266p95O97N18n63q38o92j250j595l29J373J323k40j562k361l076
$$ 166422 164156 163361 164058 164576 164013 163175 162483 161233 159638 159309 160682 162005 161765 160203 157842 154766
55443A54766k721n53J522J314k48j001j145j817j968k92J374M69j947k996k673
$$ 154766 152045 151492 153014 154328 154080 153079 151934 150117 148149 147857 149231 149700 147753 144757 142084
55428A42084k704k395j29K308J687j049j912j92R58J12q67r47j151j342K2K443
$$ 142084 139380 136985 136856 139164 140851 139802 137890 137698 138656 138768 137901 136954 135803 134461 134483 136926
55412A36926L558L100K920L036J659p44j644j018j464l260l609j694j71n42j022
$$ 136926 140484 143584 146504 149540 151199 150455 148811 147793 146329 143069 139460 137766 137595 137053 136031
55397A36031k57O45J097K241L848L533O18k395l522l345k426j24K765L688K212
$$ 136031 135774 136419 137516 139757 143605 147138 147756 145361 141839 138494 136068 135944 138709 142397 144609
55382A44609J018J514J754K48j382j513j310k192l074k322m22J182K165K700K501
$$ 144609 145627 147141 148895 149143 147761 146248 144938 142746 139672 137350 136928 138110 140275 142975 145476
55367A45476J777J524J925K028J563J244R59j29j372j063O15J645J619K238L867
$$ 145476 147253 148777 150702 152730 154293 155537 156496 156367 154995 153932 154547 156192 157811 160049 163916
55352A63916M683M015L401L364K425N46J31J911K981J031k250m069m405m696m858
$$ 163916 168599 172614 176015 179379 181804 182350 182481 184392 187373 188404 186154 182085 177680 172984 168126
55337A68126l989k512j499r90m96j71k85o05j023j589j609l68R52J79k564m549
$$ 168126 164137 161625 160126 159136 158640 158469 158184 157579 156556 154967 153358 152990 153942 154121 151557 147008
55321A47008m016j984j45P56J99j910l777l156q20J46r16j378o1O27j250l968
$$ 147008 142992 141008 140863 141619 141818 139908 136131 132975 132155 132301 131385 130007 129946 130573 129323 125355
55305A25355m883l737j627Q54K820K942J635J113J978K253J034J84Q76J394L31
$$ 125355 120472 116735 115108 115962 118782 121724 123359 124472 126450 128703 129737 129921 130797 132191 132522
55290A32522q34m35O68J139J442K056J833L62m75N54J709J116l47j085j370j656
$$ 132522 131688 131253 131921 133060 134502 136558 138391 138753 138278 138832 140541 141657 141310 140225 138855 137199
55274A37199q09J490K875J615l49m74L73j04j421j430k30K56l73r40j277k079
$$ 137199 136390 137880 140755 142370 142021 141547 141920 141816 140395 138965 138735 138991 138618 137678 136401 134322
55258A34322k698j759M33K176K747K632K034R82K76N83J239J393J466J963J980
$$ 134322 131624 129865 130298 132474 135221 137853 139887 140869 141145 141728 142967 144360 145826 147789 149769
55243A49769O32j116j725j218m31O62K171L001K191N56o59j631k853l497k793
$$ 149769 150401 149285 147560 146342 145911 146573 148744 151745 153936 154492 153833 152202 149349 145852 143059
55228A43059j813j919k459k012q12lM80J250J757J233M49N33J000Q44N51R80J261
$$ 143059 141246 139327 136868 134856 134044 134041 134521 135771 137528 138761 139210 139743 140743 141587 142138 143118 144379
55211A44379J83j287j248p8K3j534l046l092j935l99R04J395J001N86P06N70m89
$$ 144379 144562 143275 142027 141949 141972 140438 137392 134300 132365 131966 132870 134265 135266 135852 136558 137128 136639
55194A36639j473j195l51k60m77M02K115K983K327R24n18j630j681l32J317K002
$$ 136639 135166 133971 133620 133360 132883 133285 135400 138383 140710 141634 141116 139486 137805 137473 138790 140792
55178A40792J925J685P14j382l061k820k010k991m988m766j467J951K726J335
$$ 140792 142717 144402 145116 143734 140673 137853 135843 132852 127864 123098 121631 123582 126308 127643
55164A27643j27n36J92J806L481M079L481K713K399K058J257L76n2P0O18J260
$$ 127643 127516 126980 127172 128978 132459 136538 140019 142732 145131 147189 148446 148822 148770 148840 149458 150718
55148A50718J293L88n90n50J45J37q05j336n46O79Q28l27j559j646o29M32Q01
$$ 150718 152011 152399 151809 151259 151404 151541 150736 149400 148854 149533 150361 150034 148475 146829 146200 146632 147433
55131A47433P58O33j76k159m073l933j752M09J367K030L073L550K854K094K115
$$ 147433 148191 148824 148648 146489 142416 138483 136731 137140 138507 140537 143610 147160 150014 152108 154223
55116A54223J924O51o38q57q73j673k147r80O22O28m60m71Q61J764J472R79Q16
$$ 154223 156147 156798 156160 155303 154430 152757 150610 149630 150252 150880 150420 149949 150810 152574 154046 155025 155841
55099A55841K57r80j990k008j169PQ69P00l78j116p31n4N0K37J235K146J888J187
$$ 155841 156098 155118 153128 151120 149951 149958 150827 151527 151149 150033 149302 149248 149298 149535 150770 152916 154804 155991
55081A55991J153J025m39k219k162l14J220J309N76m37j640k252j572n96p17j138
$$ 155991 157144 158169 157730 155511 153349 153035 154255 155564 156140 155703 154063 151811 150239 149643 148926 147788
55065A47788J17K842M614M173K607J199K65J32J086K119J853P70N11R96O01p64
$$ 147788 147905 150747 155361 159534 162141 163340 163605 163737 164823 166942 168795 169565 170076 171072 171673 170909
55049A70909j227j02R19M92n35q14k21Q00J980K639J993N95l9L46M37l42q69k08
$$ 170909 169682 169580 170499 170991 170456 169642 169421 170221 172201 174840 176833 177428 177389 177735 178172 177830 176961 176753
55031A76753J073J934J861N72j753l627l244p91J522K106J350K68o61j064o80
$$ 176753 177826 179760 181621 182193 180440 176813 173569 172778 174300 176406 177756 178024 177363 176299 175619
55016A75619j5K23L72J097J694Q87q02j467o87P6L7L9N45Q09N26L10J01r94k723
$$ 175619 175604 175827 176199 177296 178990 179877 179075 177608 176921 176997 177034 177073 177618 178427 178953 179263 179364 178370 175647
54997A75647l493k710j488n59M04J068L01j490k155r53L01K74J16J098K202J774
$$ 175647 172154 169444 167956 167397 167801 168869 169170 167680 165525 164572 164873 165147 165263 166361 168563 170337
54981A70337N9j392j746j195m03l81j656k898j989R16L212L422K878K843K360
$$ 170337 170396 169004 167258 166063 165660 165279 163623 160725 158736 159652 162864 166286 169164 172007 174367
54966A74367N19j249j212mO99Q24J230J627J175L03m8k32j129k193k099r56j74
$$ 174367 174886 173637 172425 172421 173120 173944 175174 176801 177976 178279 178231 177999 176870 174677 172578 171622 171448
54949A71448k82m43j19K11J97L99J535L413M759M168J573j136j745j38J714K239
$$ 171448 171166 170723 170604 170815 171012 171411 172946 176359 181118 185286 186859 185723 183978 183840 185554 187793
54933A87793J656P35k80r36m27Q94J276J5j208o09J194K342K236J547P08j26m10
$$ 187793 189449 190184 189904 188968 188541 189435 190711 190726 189518 188909 190103 192445 194681 196228 196936 196810 196400
54916A96400LM3j090k227j548P11K339J883P8j454j824j082K49J531K341K546
$$ 196400 196403 196446 195356 193129 191581 192292 194631 196514 196592 195138 193314 192232 192481 194012 196353 198899
54900A98899K060R47j27l44N3q8j034j549p69M17P91N74O46Q91O48J51K48R92
$$ 198899 200959 201906 201779 201435 201488 201400 200366 198817 198048 198465 199256 199830 200476 201367 202015 202166 202414 203406
54882B03406J728K203K545K434J426o0j149j665k000j989j000Q51K469K997K631
$$ 203406 205134 207337 209882 212316 213742 213682 212533 210868 208868 206879 205879 206730 209199 212196 214827
54867B14827K088J833J976K430L055L701M174M118L439K819L335N177P337Q799
$$ 214827 216915 218748 220724 223154 226209 229910 234084 238202 241641 244460 247795 252972 260309 269108
54853B69108R496R761R522Q589P113N232K741l20l220n227o408p203p577p145
$$ 269108 278604 288365 297887 306476 313589 318821 321562 321242 318022 312795 306387 299184 291607 284462
54839B84462n924m618m136m875o241p055o787o146n809n137l172o17P09M31R8
$$ 284462 278538 273920 269784 264909 258668 251613 244826 238680 232871 227734 224562 223945 224654 225085 225183
54824B25183P50J558J495Q77M57L43P07K188M596O450O898O953P663Q322P862
$$ 225183 225933 227491 228986 229863 230320 230663 231370 233558 238154 244604 251502 258455 266118 274440 282302
54809B82302O961O957P439O654M030Q24j694l299m262m926n947p762r704j0383
$$ 282302 289263 296220 303659 310313 314343 315167 313473 310174 305912 300986 295039 287277 277573 267190
54795B67190r155o689m216k722k594l365l945l784l541m102n194n599m617k665
$$ 267190 258035 251346 247130 244408 241814 238449 234504 230720 227179 223077 217883 212284 207667 205002
54781B05002n77J079J945J625r4k648m415l705p10K037K179K78j052o03L55M33
$$ 205002 204425 205504 207449 209074 208980 206332 201917 198212 197502 199539 201718 201996 200944 200341 200696 201129
54765B01129j57p91j560k307k042m49J215J785J654J633J620J493J996L410M469
$$ 201129 200972 200181 198621 196314 194272 193823 195038 196823 198477 200110 201730 203223 205219 208629 213098
54750B13098L965K427R34o43k677m234m240l369k957k745j603J35R81P47P03J409
$$ 213098 217063 219490 220424 219781 217104 212870 208630 205261 202304 199559 197956 198091 199072 199819 200522 201931
54734B01931K136K491K833K885J638q11k814l069j953n14Q04J933K625K770K739
$$ 201931 204067 206558 209391 212276 213914 213103 210289 207220 205267 204753 205557 207490 210115 212885 215624
54719B15624K911L177L062K234R81K83R65K579L744M023M550O142P740P745O197
$$ 215624 218535 221712 224774 227008 227989 228272 229237 231816 235560 239583 244133 250275 258015 265760 271957
54704B71957M537L891M544O377Q527R379Q235O510N865N798M565J934p38k762
$$ 271957 276494 280385 284929 291306 299833 309212 317447 323957 329822 335620 340185 342119 341381 338619
54690C38619m564n995o182n350m984n666o323o161n842o011o032n065l436k053
$$ 338619 334055 328060 321878 316528 311544 305878 299555 293394 287552 281541 275509 270444 267008 264955
54676B64955j193o56n44j231k680m121m319k429R28L688M159K713J094M30O99
$$ 264955 263762 263106 262562 261331 258651 254530 250211 247782 248710 252398 256557 259270 260364 260794 261493
54661B61493J736L532N594P120P854P935P158N516M197M596O147O497M192J28
$$ 261493 263229 266761 272355 279475 287329 295264 302422 307938 312135 316731 322878 329375 333567 333695
54647C33695l857o739q275q552q119p724p484o965o182n537m727l011r09k39j768
$$ 333695 329838 323099 314824 306272 298153 290429 282945 275980 269798 264261 259534 256523 255614 255375 253607
54632B53607l934m756m096l154k611k241j841j531j265q42l62j56k64k82J52Q52
$$ 253607 249673 244917 240821 237667 235056 232815 230974 229443 228178 227336 226974 226818 226554 226272 226424 227276
54616B27276J105M08p46j174l53R60J776J891J372p7k172l336k403n87j36j285
$$ 227276 228381 228789 228043 226869 226516 227476 229252 231143 232515 232438 230266 226930 224527 223940 223804 222519
54600B22519k256k153j855j743p63J357K917K675J863K194L051K490K96j682k082
$$ 222519 220263 218110 216255 214512 213749 215106 218023 220698 222561 224755 227806 230296 230592 228910 226828
54585B26828j469j216j938l059l283j722P63J903N96j340j265P70K035Q20j353
$$ 226828 225359 224143 222205 219146 215863 214141 214904 216807 217403 216063 214798 215568 217603 218423 217070
54570B17070j851j12K188L399L172J948L44q39r23k05J13o75j764j799n60R24
$$ 217070 215219 215107 217295 220694 223866 225814 226158 225319 224396 224191 224304 223629 221865 220066 219506 220430
54554B20430J774K097K314K417K240J820J128o3j539k340j811o12jk47m10L55
$$ 220430 222204 224301 226615 229032 231272 233092 234220 234157 232618 230278 228467 227855 227854 227607 227197 227552
54538B27552J817L010L081J850k3j363j358k20J224K388L154L409K894J599k2
$$ 227552 229369 232379 235460 237310 237287 235924 234566 234346 235570 237958 241112 244521 247415 249014 248992
54523B48992j328j912j791j263m99M77J305J127l36j897k071j073m34n87l30R66
$$ 248992 247664 245752 243961 242698 242199 242676 243981 245108 244772 242875 240804 239731 239297 238710 238380 239346
54507B39346K251K678K851L044K013p19k973k525m99K29p00r97M88K470L766M638
$$ 239346 241597 244275 247126 250170 252183 251464 248491 245966 245467 245696 244996 243999 244487 246957 250723 255361
54491B55361N038L976J553l33l97M26P15L75p6o12j120r86j42O30J125K106L502
$$ 255361 260399 264375 265928 265595 265198 265624 266339 266714 266638 266026 264906 263920 263778 264408 265533 267639 271141
54474B71141L833K470J006J016J719J420J68o56o38m86l67K26J003Q43n60k150
$$ 271141 274974 277444 278450 279466 281185 282605 282773 282117 281479 280993 280626 280852 281855 282698 282138 279988
54458B79988k809k448j656r72o92q22j093j252j254j016l80L93O28K05k5O35J694
$$ 279988 277179 274731 273075 272103 271411 270589 269496 268244 266990 265974 265594 265987 266615 266820 266795 267430 269124
54441B69124K242K168J840J061n65k437l202k382r36kL00M99P89Q54M33k50o19
$$ 269124 271366 273534 275374 276435 275870 273433 270231 267849 266913 266911 267211 267710 268499 269353 269786 269536 268917
54424B68917k41Q25K162L413M361M665M005K750J962K272K972K828J750R98J579
$$ 268917 268676 269501 271663 275076 279437 284102 288107 290857 292819 295091 298063 300891 302641 303639 305218
54409C05218K867L300K232O80R5P75J784K179J887J429J291J619K094K008R72
$$ 305218 308085 311385 313617 314297 314392 315167 316951 319130 321017 322446 323737 325356 327450 329458 330430
54394C30430l62q80m43o3m14j078j659k513l581l648j911M99J777J582P08o11
$$ 330430 330068 329188 328745 328682 328268 327190 325531 323018 319437 315789 313878 314377 316154 317736 318444 317833
54378C17833k518m176m384l333k207j274pJ197J308O37M93P75N1j578k058n52
$$ 317833 315315 311139 306755 303422 301215 299941 299934 301131 302439 303076 303569 304344 304395 302817 300759 300207
54362C00207J153J501J259J513J614Q38K00P01J284N74n49l59O26L71j294k366
$$ 300207 301360 302861 304120 305633 307247 308085 308285 308986 310270 310844 310295 309936 310562 310933 309639 307273
54346C07273j757o20j82p9M03Q93O36j30l86M01J704K567K608K331K358K481K082
$$ 307273 305516 304896 304714 304635 305038 305931 306567 306437 306051 306452 308156 310723 313331 315662 318020 320501 322583
54329C22583J421J496K343K590J344m83j548j765j622r85J30O35j47r17j25J290
$$ 322583 324004 325500 327843 330433 331777 331294 329746 327981 326359 325374 325504 326139 325992 325075 324950 326240
54313C26240J026r72k235j445j96k24q25m06P57R75l24j928k415j327J054L978
$$ 326240 327266 326294 324059 322614 322418 322194 321369 320963 321720 322695 322371 320443 318028 316701 317755 321733
54297C21733O230O718N434L363J336n22k034k500j568j46M27M7k01K1m32k315
$$ 321733 327963 334681 340115 343478 344814 344292 342258 339758 338190 338044 338471 338518 338317 338338 337906 335591
54281C35591m337m632l391k523k861l309l006k781l528m513m355k865r17P23J508
$$ 335591 331254 326622 323231 320708 317847 314538 311532 308751 305223 300710 296355 293490 292573 293296 294804
54266B94804Q35j169l093l510k479r59N75J975K529J649J70l94R2K78o39j877
$$ 294804 295639 294470 291377 287867 285388 284429 285004 286979 289508 291157 291327 290933 291025 291303 290664 288787
54250B88787k249j555m94R4k34j150j728j553j317j708k114j518k93J97k68m97
$$ 288787 286538 284983 284489 284583 284349 283199 281471 279918 278601 276893 274779 273261 272968 273165 272897 272400
54234B72400J04P32Q26J004J578J538J94j196r32O03J301Q5j928l117k988j866
$$ 272400 272504 273236 274062 275066 276644 278182 278376 277180 276248 276851 278152 278237 276309 273192 270204 268338
54218B68338r4J705K387J375k31n19J036K872L139J748J99l28r6j18q27j645j588
$$ 268338 268244 269949 272336 273711 273480 272961 273997 276869 280008 281756 281955 281627 281531 281413 280586 278941 277353
54201B77353k40J706K823K266O94l44n8R07J438J188P02O24J052J499J379O77
$$ 277353 277113 278819 281642 283908 284602 284258 284200 285107 286545 287733 288435 289059 290111 291610 292989 293666
54185B93666k8l05m56r13j407j367q92n43l93j63j44q61j803j875j329j663k985
$$ 293666 293638 293333 292877 291964 290557 289190 288298 287755 287362 287199 287055 286194 284391 282516 281187 279524 276539
54168B76539l187r55J795K126j16k369k767j826r44p61j197j849j993j088M06
$$ 276539 273352 272397 274192 276318 276202 273833 271066 269240 268296 267535 266338 264489 262496 261408 261814
54153B61814J456J810K148K827L262K845J741M97n77j294j301l71J083K029J598
$$ 261814 263270 265080 267228 270055 273317 276162 277903 278400 277823 276529 275228 274857 275940 277969 279567
54138B79567pj482j715j073q13j282j619j410j397j886j700Q8K318L173K699K349
$$ 279567 279560 278078 276363 275290 274477 273195 271576 270166 268769 266883 265183 265271 267589 270762 273461 275810
54122B75810K401J615l32j841j471J51J271J030j6p98o33K99J050Q42J6l95k7
$$ 275810 278211 279826 279494 277653 276182 276333 277604 278634 278618 277820 277187 277486 278536 279378 279394 278999 278972
54105B78972M88O52P38J071J300R36J88j44M00J282J298k54k633m159l953k730
$$ 278972 279460 280112 280850 281921 283221 284157 284345 284201 284601 285883 287181 286927 284294 280135 276182 273452
54089B73452j562m68J039K511K719J219j046k746l125k131l99Q80R05L05N84K309
$$ 273452 271890 271422 272461 274972 277691 278910 277864 275118 271993 269862 269463 270343 271248 271553 272137 274446
54073B74446M254M601K747l2j602r34O50P09j411l579l394j065J195K033K025
$$ 274446 278700 283301 286048 286016 284414 283480 284130 284839 283428 279849 276455 275390 276585 278618 280643
54058B80643K173K689L273L545L101K009J097R30P66l30j676j706l30R92J542
$$ 280643 282816 285505 288778 292323 295424 297433 298530 299460 300226 299896 298220 296514 296184 297176 298718
54043B98718J972K309J307j274l397l160j295J18N72J236K593L562L073J512J73
$$ 298718 300690 302999 304306 303032 299635 296475 295180 295298 295870 297106 299699 303261 306334 307846 308019
54028C08019l8Q19K007K700K541J870J366J403J678J564J005R49K381M803O471
$$ 308019 307981 308800 310807 313507 316048 317918 319284 320687 322365 323929 324934 325883 328264 333067 339538
54013C39538O571O388P407Q899Q759O414L561J929J496J214L26j295l170m263
$$ 339538 346109 352497 359904 368803 377562 383976 387537 389466 390962 392176 392502 391207 388037 383774
53999C83774l881k821k615l448l910l139j986j467j318q61l85o54j645k539k539
$$ 383774 379893 377072 374457 371009 367099 363960 361974 360507 359189 358328 357943 357289 355644 353105 350566
53984C50566j231J263L968N623O060O444P628R033R622R176P982O218M455M034
$$ 350566 349335 350598 354566 360189 366249 372693 380321 389354 398976 408152 416134 422352 426807 430841
53970D30841N761Q648J0815J1464J1203J0783J0282R447Q238O967O129N863N551
$$ 430841 436602 445250 456065 467529 478732 489515 499797 509244 517482 524449 530578 536441 541992
53957E41992M460K844J709J388J310J426K479M218M617K111k227n916p788q415
$$ 541992 546452 549296 551005 552393 553703 555129 557608 561826 566443 568554 566327 560411 552623 544208
53943E44208q601q721r076r551r338q146p225p782q843q369o302m729m779n246
$$ 544208 535607 526886 517810 508259 498921 490775 483550 475768 466925 458556 452254 447525 442746 437500
53929D37500m891m279m213l912k298k21M08o26j546j220o70j331k927m032m240
$$ 437500 432609 428330 424117 420205 417907 417686 418094 417468 415922 414702 414032 412701 409774 405742 401502
53914D01502m514n437o136n532l947k667k165j658m44J157K483L359L710L069
$$ 401502 396988 391551 385415 379883 375936 373269 371104 369446 369002 370159 372642 376001 379711 382780
53900C82780J259o84j181K31K408L876M145L697L238L218L722M496N108N240M963
$$ 382780 384039 383355 382174 382405 384813 388689 392834 396531 399769 402987 406709 411205 416313 421553 426516
53885D26516M677M742N066N211N085N333O610Q371R223Q704Q128Q938J0741J1849
$$ 426516 431193 435935 441001 446212 451297 456630 463240 471611 480834 489538 497666 506604 517345 529194
53871E29194J1565J0923J0969J1339J1096J0358J0249J1371J3019J3957J3480
$$ 529194 540759 551682 562651 573990 585086 595444 605693 617064 630083 644040 657520
53860F57520J1564Q529N023K130Q96J526L121M405M668M098L450L427M277N781
$$ 657520 669084 677613 682636 684766 685662 687188 690309 694714 699382 703480 706930 710357 714634 720415
53846G20415P544R090R754Q886O646M218K599J329p11l267m726m439l841m399
$$ 720415 727959 737049 746803 755689 762335 766553 769152 770481 769770 766503 761777 757338 753497 749098
53832G49098n569n993n826o275p427q215q420r020j0299j1268j1354j1236j1377
$$ 749098 743529 737536 731710 725435 718008 709793 701373 692353 682054 670786 659432 648196 636819
53819F36819j1128j0100r253r532j0351j0477r688q678p956p685p897p964o684
$$ 636819 625691 615591 606338 596806 586455 575978 566290 557612 549656 541971 534074 526110 519426
53806E19426l981j840k203m358n902n965o011p271q872r114p447m636j783J04
$$ 519426 515445 513605 511402 507044 501142 495177 489166 481895 473023 463909 456462 451826 450043 450147
53792D50147L76n61j273q17p1p97l298n735o105m496k836k485k721k059n99o0
$$ 450147 450523 449962 448689 447872 447801 447004 443706 437971 431866 427370 424534 422049 419328 417269 416670 416610
53776D16610j397l255l593k196o90k45l89k64rk24p53r58q78j251k275l161l204
$$ 416610 415213 411958 408365 406169 405479 405234 404845 404581 404572 404348 403595 402637 401759 400508 398233 395072 391868
53759C91868k564j583L9K615N281O398N327L219J751J617K375L264L795L941M126
$$ 391868 389304 387721 387760 390375 395656 402054 407381 410600 412351 413968 416343 419607 423402 427343 431469
53744D31469M799N795O520O834P171P526P131N743M565N033P079R223J0137R410
$$ 431469 436268 442063 448583 455417 462588 470114 477245 482988 487553 492586 499665 508888 519025 528435
53730E28435P369N065L976M663N851N842M654L752L816L988L339J927J29j906
$$ 528435 535804 540869 544845 549508 555359 561201 565855 569607 573423 577411 580750 582677 582806 580900
53716E80900l782m809m950m987n380n746n758n766o078o420o574o852p481q092
$$ 580900 577118 572309 567359 562372 556992 551246 545488 539722 533644 527224 520650 513798 506317 498225
53702D98225q196p719o783n599m646m388m654m934n226n738n872m709k681j401
$$ 498225 490029 482310 475527 469928 465282 460894 456240 451306 446080 440342 434470 429761 427080 425679
53688D25679j486j791j314n88l76l02K75J022J208Q13J79n72j054n00R68J831
$$ 425679 424193 422402 421088 420500 420124 419822 420097 421119 422327 423140 423319 422747 421693 421193 422161 423992
53672D23992J029n04j158p34j46J44J40m37j483j641L51L528N297M286J565q49
$$ 423992 425021 424517 423359 422625 422479 422623 422763 422326 420843 419202 419553 423081 428378 432664 434229 433380
53656D33380j679p20J337L083L434K720K202K443K971L433M108N037N550N179
$$ 433380 431701 430981 432318 435401 438835 441555 443757 446200 449171 452604 456712 461749 467299 472478
53642D72478M390L894L585K768J386M80J095K823M069M000L739M807O736P380
$$ 472478 476868 480762 484347 487115 488501 488981 490076 492899 496968 500968 504707 509514 516250 523630
53628E23630N749L305J977J884J904J580J423J750K266K663K937L139L129K515
$$ 523630 529379 532684 534661 536545 538449 540029 541452 543202 545468 548131 551068 554207 557336 559851
53614E59851Q49j677l765m137l256k863l532l902k967j740j681k676l711m498
$$ 559851 560700 559023 555258 551121 547865 545002 541470 537568 534601 532861 531180 528504 524793 520295
53600E20295n128n002l615j738m76K96J256J988J570L75k29J23O46J004J690K687
$$ 520295 515167 510165 506550 504812 504336 504632 505888 507876 509446 509821 509592 509715 510361 511365 513055 515742
53584E15742L154K740K050J588J156N82N7k92m64q7J224L010M145M031L077K161
$$ 515742 518896 521636 523686 525274 526430 527012 527069 526777 526313 526226 527450 530460 534605 538636 541713 543874
53568E43874K143L562N893P427O799M628K772K207K443K791L217L943M949N881
$$ 543874 546017 549579 555472 562899 569698 574326 577098 579305 581748 584539 587756 591699 596648 602529
53554F02529O009M707K657J863L501O310Q201Q846R373J0024R832Q591P519P596
$$ 602529 608538 613245 615902 617765 621266 627576 635777 644623 653996 664020 673852 682443 689962 697558
53540F97558Q263Q172O514L623R71K37J517K878K676J716J744K545K296N71j015
$$ 697558 705821 713993 720507 724130 725101 725338 726855 729733 732409 734125 735869 738414 740710 741281 740266
53525G40266j286q65o13l79N1J27n72j627k438k872l002l040l527m655n593n561
$$ 740266 738980 738115 737502 737123 737174 737301 736729 735102 732664 729792 726790 723750 720223 715568 709975 704414
53509G04414n217n531n685l909m51K277K863K340K011J776J349J290J764J870
$$ 704414 699197 693666 687981 684072 683621 685898 688761 691101 693112 694888 696237 697527 699291 701161
53495G01161J204O81Q60R17L42K67J800M192N874O360O085N393M770N080O379
$$ 701161 702365 703046 703906 704823 705165 705432 707232 711424 717298 723658 729743 735136 739906 744986 751365
53480G51365P411P398P306Q217R433R743R653J0681J2845J4577J5141J5635J7269
$$ 751365 758776 766174 773480 781697 791130 800873 810526 821207 834052 848629 863770 879405 896674
53467H96674J9740K1751K2480K2189K1762K1843K2414K3195K4307K6061K8170
$$ 896674 916414 938165 960645 982834 1004596 1026439 1048853 1072048 1096355 1122416 1150586
53456A150586K9900L1193L2744L4754L6531L7685L8755M0071M1036M1313M1736
$$ 1150586 1180486 1211679 1244423 1279177 1315708 1353393 1392148 1432219 1473255 1514568 1556304
53445A556304M3087M4754M5569M5386M4825M4172M3560M3687M5046M6656M6759
$$ 1556304 1599391 1644145 1689714 1735100 1779925 1824097 1867657 1911344 1956390 2003046 2049805
53434B049805M4906M2446M0822M0074L9258L7798L6117L5049L4716L4225L2774
$$ 2049805 2094711 2137157 2177979 2218053 2257311 2295109 2331226 2366275 2400991 2435216 2467990
53423B467990L0844K9586K9139K8492K7222K6200K6057K6089K5480K4489K3376
$$ 2467990 2498834 2528420 2557559 2586051 2613273 2639473 2665530 2691619 2717099 2741588 2764964
53412B764964K1114J6703J1227O964M508K171j465n666q924j1300j4412j9290
$$ 2764964 2786078 2802781 2814008 2820972 2825480 2827651 2826186 2820520 2811596 2800296 2785884 2766594
53400B766594k4923k9237l1209l1720l2336l3660l5132l6137l6734l7363l8277
$$ 2766594 2741671 2712434 2681225 2649505 2617169 2583509 2548377 2512240 2475506 2438143 2399866
53389B399866l9333l9938l9385l7749l6257l6079l6794l6822l5341l2981l0516
$$ 2399866 2360533 2320595 2281210 2243461 2207204 2171125 2134331 2097509 2062168 2029187 1998671
53378A998671k7861k4655k1040j7488j4443j2149j0233p527l328J322M656O594
$$ 1998671 1970810 1946155 1925115 1907627 1893184 1881035 1870802 1863275 1859947 1861269 1865925 1872519
53366A872519Q712J1710J4521J6414J8367K1395K4960K8143L1159L4524L7744
$$ 1872519 1881231 1892941 1907462 1923876 1942243 1963638 1988598 2016741 2047900 2082424 2120168
53355B120168M0149M2139M4386M6574M8214N0037N3192N7421O1349O4292O6772
$$ 2120168 2160317 2202456 2246842 2293416 2341630 2391667 2444859 2502280 2563629 2627921 2694693
53344B694693O9345P2052P4866P7896Q1028Q4025Q6872Q9695R2467R5158R7711
$$ 2694693 2764038 2836090 2910956 2988852 3069880 3153905 3240777 3330472 3422939 3518097 3615808
53333C615808R9662J00374J00003R9538R9571R9761R9814R9882R9495R7367R3144
$$ 3615808 3715470 3815844 3915847 4015385 4114956 4214717 4314531 4414413 4513908 4611275 4704419
53322D704419Q8215Q3842P9605P4707O9594O4919N9973N3832M7226M1543L6558
$$ 4704419 4792634 4876476 4956081 5030788 5100382 5165301 5225274 5279106 5326332 5367875 5404433
53311E404433L0842K4088J7202J0175J546r716k3050l7110n0584o2254p1514p9051
$$ 5404433 5435275 5459363 5476565 5486740 5488286 5478570 5455520 5418410 5367826 5305572 5234058 5155007
53299E155007q6040r2542r7667j01211j03944j06239j07630j07996j07957j07707
$$ 5155007 5068967 4976425 4878758 4777547 4673603 4567364 4459734 4351738 4243781 4136074
53289D136074j06495j03929j00990r9045r8272r7698r6505r4820r3208r1637q9260
$$ 4136074 4029579 3925650 3824660 3725615 3627343 3529645 3433140 3338320 3245112 3153475 3064215
53278C064215q5352q0338p5398p1173o7415o3964o1059n8275n4200m7990m0628
$$ 3064215 2978863 2898525 2823127 2751954 2684539 2620575 2559516 2501241 2447041 2399051 2358423
53267B358423l3975k9203k6706k6504k7637k7972k5945k2157j8317j5050j1838
$$ 2358423 2324448 2295245 2268539 2242035 2214398 2186426 2160481 2138324 2120007 2104957 2093119
53256B093119q634o263n244n079m601k545J608O559R732R934Q968R579J2464J6359
$$ 2093119 2084485 2078222 2072978 2067899 2063298 2060753 2062361 2068920 2078652 2088586 2097554 2107133 2119597 2135956
53242B135956K0226K3781K6509K7950K8920L0775L3404L5384L6211L6986L8714
$$ 2135956 2156182 2179963 2206472 2234422 2263342 2294117 2327521 2362905 2399116 2436102 2474816
53231B474816M1138M3631M5989M7993M9069M8705M6752M3453L9803L7318L6451
$$ 2474816 2515954 2559585 2605574 2653567 2702636 2751341 2798093 2841546 2881349 2918667 2955118
53220B955118L5635L3124K9267K5724K2809J9219J4179Q297K325l326p963j1221
$$ 2955118 2990753 3023877 3053144 3078868 3101677 3120896 3135075 3143372 3145697 3142371 3134408 3123187
53208C123187j4317j8992k4936l0097l3737l7298m1693m5881m9070n2327n6545
$$ 3123187 3108870 3089878 3064942 3034845 3001108 2963810 2922117 2876236 2827166 2774839 2718294
53197B718294o0320o1661o0941o0577o2073o4516o5716o4185o0345n6335n4233
$$ 2718294 2657974 2596313 2535372 2474795 2412722 2348206 2282490 2218305 2157960 2101625 2047392
53186B047392n4072n4197n3654n3275n3915n4872n4930n4015n2874n1793n0612
$$ 2047392 1993320 1939123 1885469 1832194 1778279 1723407 1668477 1614462 1561588 1509795 1459183
53175A459183m9412m8163m6108m2521l7944l3859l1100k9184k7221k4949k2862
$$ 1459183 1409771 1361608 1315500 1272979 1235035 1201176 1170076 1140892 1113671 1088722 1065860
53164A065860k1657k1602k2190k2390k1367j9110j6519j4919j5060j6310j7142
$$ 1065860 1044203 1022601 1000411 978021 956654 937544 921025 906106 891046 874736 857594
53153H57594j6791j6006j5747j5794j5511j5262j5699j6036j4670j1715r332r014
$$ 857594 840803 824797 809050 793256 777745 762483 746784 730748 716078 704363 695031 686017
53141F86017r895j0416j0461j0827j1535j1758j1064r822q568p563o779n970m991
$$ 686017 676122 665706 655245 644418 632883 621125 610061 600239 591671 584108 577329 571359 566368
53128E66368m222m230m919n513n568n388n235m854m188l833m202m746m549l510
$$ 566368 562146 557916 552997 547484 541916 536528 531293 526439 522251 518418 514216 509470 504921 501411
53114E01411k511k503l582m815n032l985k569j642j095n60l61p82r85k3J276R54
$$ 501411 498900 496397 492815 488000 482968 478983 476414 474772 473677 473117 472756 471974 470989 470966 472242 473196
53098D73196j302l520m012l251k587k341k062j670j357r60k84L89O78N89K83k10
$$ 473196 471894 468374 464362 461111 458524 456183 454121 452451 451094 450134 449850 450239 450917 451506 451789 451579
53082D51579o87p93n91n31o09l55J69K88o5l9P90J634J688J162N74j04q69j155
$$ 451579 450892 450099 449508 448977 448368 448013 448182 448470 448405 448366 449156 450790 452478 453640 454214 454110 453241 452086
53064D52086p12l62q93j662j243Q48L665N816O366N149K918J009L83R33J834K288
$$ 452086 451374 451012 450119 448457 447214 448062 451727 457543 463909 469058 471976 472985 473368 474301 476135 478423
53048D78423J881P70k99o63o05r49j667j724o12P36J060Q5j668l674n368n964
$$ 478423 480304 481074 480775 480112 479507 478558 476891 475167 474555 475291 476351 476436 474768 471094 465726 459762
53032D59762n040l141j383o17r94j877k142j177K41P43M6q87j349j558j712j461
$$ 459762 454722 451581 450198 449581 448587 446710 444568 443391 443632 444375 444421 443534 442185 440627 438915 437454
53016D37454p39j29K2Nj13p64j853k497k293j878j713j276j27J160J795J675J011
$$ 437454 436715 436586 436608 436613 436500 435736 433883 431386 429093 427215 425502 424226 424099 425259 427054 428729 429740
52999D29740l9r02q17j17j36j158j755r83O6J5p75j220j504k364l204k622o22
$$ 429740 429701 428799 427982 427865 427729 426571 424816 423833 423899 423914 423139 421919 420415 418051 414847 412225 411603
52982D11603J178J503N65o92j540j724j541j595j933j834r43nK95N14J504K737
$$ 411603 412781 414284 414849 414157 412617 410893 409352 407757 405824 403990 403047 403042 403337 403851 405355 408092
52966D08092K681P96j694l030k490q53L42K22o82j427k097l211l906k506P07L124
$$ 408092 410773 411569 409875 406845 404355 403502 403844 404066 403384 401957 399860 396649 392743 390237 390944 394068
52950C94068L189K388K574L066K215M62m41l02l95j039j428j549k138k759k046
$$ 394068 397257 399645 402219 405285 407500 407962 407521 407219 406824 405785 404357 402808 400670 397911 395865
52935C95865k3J657K159K363K873K841J547k09j178j060k48Q40J628J477O55L98
$$ 395865 395842 397499 399658 402021 404894 407735 409282 409073 407895 406835 406587 407427 409055 410532 411187 411585
52919D11585J379K720L103K293J072J89p5K96J095J845K057J587P51J39J59N58
$$ 411585 412964 415684 418787 421080 422152 422341 422266 422562 423657 425502 427559 429146 429897 430036 430195 430753
52903D30753N85j15r85j282j011o75m30m2N36J007J100P37N8m53k61L83M03p49
$$ 430753 431338 431223 430238 428956 427945 427270 426840 426798 427334 428341 429441 430178 430236 429783 429522 429905 430308 429559
52885D29559k133k278q64J039K004J157j280l809m596l415k035k032k784k596
$$ 429559 427426 425148 424284 425323 427327 428484 427204 423395 418799 415384 413349 411317 408533 405937
52871D05937j139L46R42R68J036J210J206P45k68j467k192k295k361k628k434
$$ 405937 404798 405144 406086 407054 408090 409300 410506 411251 410983 409516 407324 405029 402668 400040 397606
52856C97606j390k95L9P7O45J362J323P55N66O30m6j483k461k160j002K63J285
$$ 397606 396216 395921 395960 396037 396682 398044 399367 400122 400688 401318 401272 399789 397328 395168 394166 394429 395714
52839C95714J833J765J378J044N80l13j131r43L13J596J875J054P2K08J771L237
$$ 395714 397547 399312 400690 401734 402314 402001 400870 399927 400240 401836 403711 404765 404837 405045 406816 410053
52823D10053K777R09J25J137J505n89l170l351j651p32j064r66j89n2k15J099
$$ 410053 412830 413739 413864 415001 416506 415917 412747 409396 407745 407013 405949 404983 404794 404742 404527 405626
52807D05626L259L220N36r78J609O218Q886Q672P280N689L800K175J675J691P49
$$ 405626 408885 412105 412641 411663 413272 419490 428376 437048 444328 450017 453817 455992 457667 459358 460107
52792D60107j332l380m713n681o474o684o124n154m050k651q12J023J800O67j839
$$ 460107 458775 455395 450682 445001 438527 431843 425719 420565 416515 413864 413052 414075 415875 416542 414703
52777D14703l718l580k513k730m364n199l922j969j313j806j926j088K8P35R34
$$ 414703 410985 407405 404892 402162 397798 392599 388677 386708 385395 383589 381663 380575 380603 381338 382272
52762C82272Q67J071J891K593J820m04k173k063r68n97j010q80M47K249L382L042
$$ 382272 383139 384210 386101 388694 390514 390110 387937 385874 384906 384309 383299 382419 382866 385115 388497 391539
52746C91539J258n89n26J663L611L159J247M57J260J565R0j800k354j967k207
$$ 391539 392797 392208 391682 393345 396956 400115 401362 401819 403079 404644 404734 402934 400580 398613 396406
52731C96406l255l767l112k387k723l535l396k289j807k741l558k260P95L149
$$ 396406 393151 389384 386272 383885 381162 377627 374231 371942 370135 367394 363836 361576 362371 365520
52717C65520L206J836Q69J041J847K470K245Q98j032k342k254j127J21Q84J059
$$ 365520 368726 370562 371431 372472 374319 376789 379034 379932 378900 376558 374304 373177 373298 374182 375241
52702C75241Q79P54R13J077Q59L83M4r9n8N62J851K756K213R41O35J419J715R02
$$ 375241 376120 376874 377787 378864 379723 380106 380150 380051 379993 380555 382406 385162 387375 388316 388951 390370 392085 392987
52684C92987K88P25J108L57o93p48j55L3J55J299L095L751K389J58j169r20J70
$$ 392987 393275 394000 395108 395465 394772 394024 393869 393902 394057 395356 398451 402202 404591 404749 403580 402660 402830
52667D02830Q62N71j16k65J64N27Q62J862L186L279J665P4J10R58Q48k44r74j033
$$ 402830 403692 404263 404147 403882 404046 404573 405435 407297 410483 413762 415427 415501 415611 416569 417417 417173 416199 415166
52649D15166j377k351l168l281k822j675L90K369K349j41l059l973k620p41O9
$$ 415166 413789 411438 408270 404989 402167 400492 400882 403251 405600 405459 402400 398427 395807 395066 395135
52634C95135l64j244j768j560o90L92J162J520J934K741L306K422m3k479l111
$$ 395135 394771 393527 391759 390199 389509 389901 391063 392583 394517 397258 400564 402986 402943 400464 397353
52619C97353j891j65J106J869K116J769J316J364J462P12m09k87J288K503K123
$$ 397353 395462 395297 396403 398272 400388 402157 403473 404837 406299 407011 406602 406315 407603 410106 412229
52604D12229J227J334K114K206J317L22p4K17R00J245O27k90J50K229M038M004
$$ 412229 413456 414790 416904 419110 420427 420749 420675 420892 421792 423037 423664 423374 423524 425753 429791 433795
52588D33795L056K966L650L594K263N33p45j253q33J36M37o84k304k993k631j972
$$ 433795 436851 439817 443467 447061 449324 449857 449112 447859 447026 447162 447599 446915 444611 441618 438987 437015
52572D37015j150J14J416K102K234J988Q71j113k320j154J628L873M625M152K274
$$ 437015 435865 435979 437395 439497 441731 443719 444590 443477 441157 440003 441631 445504 450129 454281 456555
52557D56555j141m455n399m061k620j955p58J508L073K359L30r27p74k21l75j478
$$ 456555 455414 450959 445560 441499 438879 436924 436166 437674 440747 443106 443436 442509 441735 441514 441139 439661
52541D39661k773k902j224J099K149J538O53N41Q43J013J253J745K109K075J742
$$ 439661 436888 433986 432762 433861 436010 437548 438201 438742 439585 440598 441851 443596 445705 447780 449522
52526D49522R45m31j345l24K188L791L197J948K020L038L138J704j34j275j676
$$ 449522 450467 450036 448691 448367 450555 454346 457543 459491 461511 464549 467687 469391 469257 467982 466306
52511D66306j759j665j267m95L80P63L35m26p92p51p88r20q89j080j998k865k214
$$ 466306 464547 462882 461615 461120 461500 462263 462598 462172 461380 460629 459841 458921 458032 456952 454954 452089 449875
52494D49875k08J117N23r27j720j770j520p16O03J136p3j761j845k94Q88L45j186
$$ 449875 449667 450784 451307 450380 448660 446890 445370 444654 445257 446393 446320 444559 442714 442420 443308 443653 442467
52477D42467k166j950j037l10j21J95J508L304L813K462J217K084M039M253K141
$$ 442467 440301 438351 437314 437004 436883 437078 438586 441890 445703 448165 449382 451466 455505 459758 461899
52462D61899K26N42K019K446J643J228K024L132L393K566J077m32j072k61J315
$$ 461899 462125 462667 464686 467132 468775 470003 472027 475159 478552 481118 482195 481763 480691 480430 481745
52447D81745K092J506Q43J496L046M031M166M419M878M000P89l386o134o530n475
$$ 481745 483837 485343 486186 487682 490728 494759 498925 503344 508222 512222 513011 509625 503491 496961 491486
52432D91486m183l386l359l596k791m41J740J502q77k652k079l55N39M85O16J128
$$ 491486 487303 483917 480558 476962 474171 473730 475470 476972 476095 473443 471364 471009 471548 472033 472649 473777
52416D73777J135L49l05J16J483K793L075K122O11m68o22K2J232K760L933L922
$$ 473777 474912 475261 474956 475072 476555 479348 482423 484545 485156 484688 484066 484088 485320 488080 492013 495935
52400D95935K860K077K676M172N102M666L305J841N53q46k509l915m201l307k536
$$ 495935 498795 500872 503548 507720 512822 517488 520793 522634 523187 522341 519832 515917 511716 508409 505873
52385E05873l313n388o979o852n465l821k178m50Q90J192N10o13j826k783k759
$$ 505873 502560 497172 490193 483341 477876 474055 471877 471427 472317 473509 474019 473406 471580 468797 466038
52370D66038j375N67J793K105K363K931L079K213R26K72M84R66J283J520J754
$$ 466038 464663 465230 467023 469128 471491 474422 477501 479714 480640 480912 481396 482362 483645 485165 486919
$$ [...]
##END NTUPLES=NMR SPECTRUM
##END=
