
##TITLE=UV1137_M5-1005-1002_6275509_Clq61s99YJ
##JCAMPDX= 6.0         $$ Bruker NMR JCAMP-DX V2.0
##DATA TYPE= NMR SPECTRUM
##DATA CLASS= NTUPLES
##ORIGIN= BRUKER
##OWNER= Administrator
$$ 1.72 TOPSPIN		Version 2.1
$$ 2012-06-03 02:42:15.250 -0500  Administrator@TOPSPIN
$$ Compression mode = diff/dup
##.OBSERVE FREQUENCY= 400.13188235
##.OBSERVE NUCLEUS= ^1H
##.ACQUISITION MODE= SIMULTANEOUS (DQD)
##.ACQUISITION SCHEME= undefined
##.AVERAGES= 8
##.DIGITISER RES= 22
##SPECTROMETER/DATA SYSTEM= spect
##.PULSE SEQUENCE= zg30
##.SOLVENT NAME= COFFEE_meoh
##.SHIFT REFERENCE= INTERNAL, COFFEE_meoh, 1, 14.98061
##AUDIT TRAIL= $$ (NUMBER, WHEN, WHO, WHERE, PROCESS, VERSION, WHAT)
$$ ##TITLE= Audit trail, TOPSPIN		Version 2.1
$$ ##JCAMPDX= 5.01
$$ ##ORIGIN= Bruker BioSpin GmbH
$$ ##OWNER= Administrator
$$ $$ C:\Bruker\TOPSPIN/data/COFFEE/nmr/UV1137_M5-1005-1002_6275509_Clq61s99YJ/10/pdata/1/auditp.txt
$$ ##AUDIT TRAIL=  $$ (NUMBER, WHEN, WHO, WHERE, PROCESS, VERSION, WHAT)
(   1,<2012-06-03 02:42:07.140 -0500>,<Administrator>,<TOPSPIN>,<go>,<TOPSPIN 2.1>,
      <created by zg
	started at 2012-06-03 02:41:00.578 -0500,
	POWCHK enabled, PULCHK disabled,
       configuration hash MD5:
       D5 CA 7A 23 FE 6B EE E2 50 67 74 61 24 F7 5E 3B
       data hash MD5: 64K
       54 DC 5B 38 F1 2F F3 C9 39 9F BF DF 26 4E DE 65>)
(   2,<2012-06-03 02:42:11.031 -0500>,<Administrator>,<TOPSPIN>,<proc1d>,<TOPSPIN 2.1>,
      <Start of raw data processing
       efp LB = 0 FT_mod = 6 PKNL = 1 PHC0 = 0 PHC1 = 0 SI = 32K 
       data hash MD5: 32K
       E5 3E 89 2F 3E 00 EF B3 7B 58 3C 52 22 42 04 74>)
(   3,<2012-06-03 02:42:11.406 -0500>,<Administrator>,<TOPSPIN>,<proc1d>,<TOPSPIN 2.1>,
      <pk PHC0 = 212.0032 PHC1 = 0 
       data hash MD5: 32K
       96 34 CD 80 76 40 37 3B B6 BA 8F 8E AF 96 D1 91>)
(   4,<2012-06-03 02:42:11.468 -0500>,<Administrator>,<TOPSPIN>,<proc1d>,<TOPSPIN 2.1>,
      <abs ABSG = 1 
       data hash MD5: 32K
       DC 95 4E 8B DD 11 08 2F 6D 4C CF 7D EF 1D F1 CC>)
(   5,<2012-06-03 02:42:11.500 -0500>,<Administrator>,<TOPSPIN>,<proc1d>,<TOPSPIN 2.1>,
      <abs ABSG = 2 
       data hash MD5: 32K
       C7 01 EB 65 1A E9 F2 79 20 4C B7 7A 12 CE F7 9B>)
(   6,<2012-06-03 02:42:11.546 -0500>,<Administrator>,<TOPSPIN>,<proc1d>,<TOPSPIN 2.1>,
      <abs ABSG = 3 
       data hash MD5: 32K
       48 39 9B ED 1A DC 02 B1 A5 27 0F 95 D4 64 BA C2>)
(   7,<2012-06-03 02:42:11.578 -0500>,<Administrator>,<TOPSPIN>,<proc1d>,<TOPSPIN 2.1>,
      <abs ABSG = 4 
       data hash MD5: 32K
       E8 92 75 87 7E 3B C2 F7 8D FD FB 4B 6B 1E F2 CE>)
(   8,<2012-06-03 02:42:11.609 -0500>,<Administrator>,<TOPSPIN>,<proc1d>,<TOPSPIN 2.1>,
      <abs ABSG = 5 
       data hash MD5: 32K
       37 28 31 E8 24 07 F4 29 6C 6A 18 F1 57 39 EC E3>)
$$ ##END=
$$ 
$$ $$ hash MD5
$$ $$ CE 2A A9 79 82 E9 4C A6 79 20 E3 29 6B 93 DC 5C
##$RELAX= 
##$RELAX= 
##$RELAX= 
##$RELAX= 
##$RELAX= 
##$RELAX= 
##$RELAX= 
$$ Bruker specific parameters
$$ --------------------------
$$ [...]
150 150 150 150 150 150 150 150
##$TP07= 0
##$TPNAME0= <>
##$TPNAME1= <>
##$TPNAME2= <>
##$TPNAME3= <>
##$TPNAME4= <>
##$TPNAME5= <>
##$TPNAME6= <>
##$TPNAME7= <>
##$TPOAL= (0..7)
0.5 0.5 0.5 0.5 0.5 0.5 0.5 0.5
##$TPOFFS= (0..7)
0 0 0 0 0 0 0 0
##$TUNHIN= 0
##$TUNHOUT= 0
##$TUNXOUT= 0
##$USERA1= <user>
##$USERA2= <user>
##$USERA3= <user>
##$USERA4= <user>
##$USERA5= <user>
##$V9= 5
##$VALIST= <valist>
##$VCLIST= <CCCCCCCCCCCCCCC>
##$VD= 0
##$VDLIST= <DDDDDDDDDDDDDDD>
##$VPLIST= <PPPPPPPPPPPPPPP>
##$VTLIST= <TTTTTTTTTTTTTTT>
##$WBST= 2048
##$WBSW= 25
##$XGAIN= (0..3)
0 0 0 0
##$XL= 0
##$YL= 0
##$YMAX_a= 549076
##$YMIN_a= -662182
##$ZGOPTNS= <>
##$ZL1= 120
##$ZL2= 120
##$ZL3= 120
##$ZL4= 120
##$ABSF1= 14.98061
##$ABSF2= -5.57192
##$ABSG= 5
##$ABSL= 3
##$ALPHA= 0
##$AQORDER= 0
##$ASSFAC= 0
##$ASSFACI= 0
##$ASSFACX= 0
##$ASSWID= 0
##$AUNMP= <proc_prof1d_extract_pilot.lims>
##$AXLEFT= 0
##$AXNAME= <>
##$AXNUC= <1H>
##$AXRIGHT= 0
##$AXTYPE= 0
##$AXUNIT= <>
##$AZFE= 0.1
##$AZFW= 0.1
##$BCFW= 0
##$BC_mod= 0
##$BYTORDP= 0
##$COROFFS= 0
##$CY= 15
##$DATMOD= 1
##$DC= 0
##$DFILT= <>
##$DTYPP= 0
##$F1P= 0
##$F2P= 0
##$FCOR= 0.5
##$FTSIZE= 32768
##$FT_mod= 6
##$GAMMA= 0
##$GB= 0
##$INTBC= 1
##$INTSCL= 1
##$ISEN= 128
##$LB= 0
##$LEV0= 0
##$LPBIN= 0
##$MAXI= 10000
##$MC2= 0
##$MEAN= 0
##$ME_mod= 0
##$MI= 0
##$NCOEF= 0
##$NC_proc= -8
##$NLEV= 6
##$NOISF1= 0
##$NOISF2= 0
##$NSP= 0
##$NTH_PI= 0
##$NZP= 0
##$OFFSET= 14.98061
##$PC= 1
##$PHC0= 212.0032
##$PHC1= 0
##$PH_mod= 1
##$PKNL= yes
##$PPARMOD= 0
##$PPDIAG= 0
##$PPIPTYP= 0
##$PPMPNUM= 2147483647
##$PPRESOL= 1
##$PSCAL= 4
##$PSIGN= 0
##$PYNMP= <proc.py>
##$REVERSE= no
##$SF= 400.13
##$SI= 32768
##$SIGF1= 0
##$SIGF2= 0
##$SINO= 400
##$SIOLD= 32768
##$SPECTYP= <>
##$SREGLST= <1H.CDCl3>
##$SSB= 0
##$STSI= 32768
##$STSR= 0
##$SW_p= 8223.68421052632
##$SYMM= 0
##$S_DEV= 0
##$TDeff= 65536
##$TDoff= 0
##$TI= <>
##$TILT= no
##$TM1= 0
##$TM2= 0
##$TOPLEV= 0
##$USERP1= <user>
##$USERP2= <user>
##$USERP3= <user>
##$USERP4= <user>
##$USERP5= <user>
##$WDW= 1
##$XDIM= 32768
##$YMAX_p= 463349232
##$YMIN_p= -688280
##$CURPLOT= <Network HP LaserJet P1505>
##$CURPRIN= <$Network HP LaserJet P1505>
##$DFORMAT= <normdp>
##$LAYOUT= <+/1D_H.xwp>
##$LFORMAT= <normlp>
##$PFORMAT= <normpl>
##$SURQMSG= 1
$$ End of Bruker specific parameters
$$ ---------------------------------
##NTUPLES= NMR SPECTRUM
##VAR_NAME=  FREQUENCY,     SPECTRUM/REAL,   SPECTRUM/IMAG
##SYMBOL=    X,             R,               I
##VAR_TYPE=  INDEPENDENT,   DEPENDENT,       DEPENDENT
##VAR_FORM=  AFFN,          ASDF,            ASDF
##VAR_DIM=   32768,         32768,           32768
##UNITS=     HZ,            ARBITRARY UNITS, ARBITRARY UNITS
##FACTOR=    0.250966925370066, 1,           1
##FIRST=     8223.43324360095, -121003,      -142377
##LAST=      0,             38206,           121525
##MIN=       0,             -688280,         0
##MAX=       8223.43324360095, 463349232,    0
$$ Real data points
##PAGE= N=1
##DATA TABLE= (X++(R..R)), XYDATA
$$ [...]
19519g4427p3773r6654G5428L96195b642j92659A09432a66267A58911d9266o5085
19508a14351A13279i448A58288b51914G4540d1102j07884k30994c933A56351i3206
19496I9157A388g8605H884c23512F9014N5204b72042a33231j36904M7743f0454
19484g0184F4079R7503L9711a23233p3079b5196B15178p124b04296R6010j45460
19473b53746d2348l98348A69606F1625B5005f6501J4437q521B99614a30760A4367
19461a14845K9718m9476j09190A67467a55937E2596b79508a4154l35752k1211
19451c71117a45481l3764j37662c6967p6092B98573D1712b9237F5517L47749j17717
19440B95549B198M79089a42651m8273O7306G4196O7451a90784g0024l0146n2870
$$ y = [-74427, -148200, -244854, 75428, 471623, -2642, -195301, 109432, -166267, 158911, -49266, -114351, 113279, -9448, 158288, -251914, 74540, -41102, -148986, -379980, -3933, 156351, -93206, 99157, 1388, -78605, 8884, -323512, 69014, 124218, -272042, -133231, -270135, -222392, -60454, -70184, 64079, 161582, 201293, -123233, -196312, -25196, 215178, 208054, -204296, -108286, -253746, -42348, -440696, 169606, 61625, 25005, -66501, -52064, -60585, 299614, -130760, 14367, -114845, -85127, -134603, -243793, 167467, -155937, 52596, -279508, -14154, -349906, -371117, -145481, -179245, -316907, -36967, -113059, 298573, 41712, -29237, 65517, 413266, 295549, 2198, 481287, -142651, -190924, -123618, 74196, 141647, -190784, -70024, -100170, -153040]
19429a53040j14482G007c51242J43759F5110d01257A12178a32394e8899b1653
19418E8639a950n3716k3900o350E237O3758a86375d6563O425A68648b79439f0571
19405g6356A43473g185D2537j1792b38866B66246G794a05744o1178f9645n7092
19394a26737N9503D3572J0697e3477A35464i5896L3595C13527j45973L7562j043
19383B04073a76813l1900A39177f6259l889k57140B09667a13039q7325Q9631B84460
19371C1774f3039r810L989k02365i9036i382F549Q1250b5391j19633A33502b22365
19358a84626a7722o1521I439J5610a85119A3063b10457B0954q625a36764d4229
19346A20147b38208i793m7748k74173J59563k4735r2064e9557A55183b51743B9874
$$ y = [-153040, -267522, 7007, -351242, -207483, 65110, -401257, 112178, -132394, -58899, -21653, 58639, -1950, -55666, -79566, -85916, 5237, 68995, -186375, -46563, -40138, 168648, -279439, -60571, -76356, 143473, -7185, 42537, 30745, -238866, 266246, 7794, -105744, -166922, -69645, -126737, -67234, 43572, 54269, -53477, 135464, -95896, -62301, 313527, 167554, 205116, 204073, -176813, -208713, 139177, -66259, -70148, -327288, 209667, -113039, -200364, -110733, 284460, 31774, -63039, -72849, -68860, -271225, -99036, -9382, 6549, 87799, -25391, -145024, 133502, -222365, -184626, -17722, -79243, 9439, 25049, -185119, 13063, -210457, 20954, 12329, -136764, -44229, 120147, -238208, -9793, -57541, -331714, -172151, -196886, -288950, -59557, 155183, -251743, 29874]
19334a65864b8942A10251b25648N6738P3414j6472l3124B38298b47645A00203
19323B01641D7311c14978B85564d25755A1553a27671m69866b31203P8771E1283
19312A25100a33616o281d0667k58200k47939C1827O966J13454E545a23729j26166
19301b49895n7372a1052m1999j05081j2403A42365l9246K77369b50516f8477n9917
19290a28394A41940n4960C5210i7727j31731E4451e0591l9142J2789G042JJ88259
19278A95302a40783j40774H9830b83196A94990M5850B7644c08953A00923b16639
19267b5168m4705A04731a64933C10824H8249g4308K9096j96320J15963j12037
19257b37606m7204b7830k5917j7812l412j81881L753D2955J64957D7671f0430
$$ y = [-165864, -28942, 110251, -225648, -168910, -95496, -111968, -145092, 238298, -247645, 100203, 201641, 47311, -314978, 285564, -425755, 11553, -127671, -597537, -231203, -152432, 51283, 125100, -133616, -139897, -40667, -298867, -546806, 31827, 38793, 152247, 5545, -123729, -249895, -307267, -11052, -53051, -158132, -170535, 142365, 103119, 380488, -250516, -68477, -128394, 141940, 86980, 35210, -97727, -229458, 54451, -50591, -89733, -76944, 7042, 7043, 195302, -140783, -281557, 89830, -283196, 194990, 240840, 27644, -308953, 100923, -216639, -25168, -69873, 104731, -164933, 310824, 88249, -74308, -45212, -241532, -125569, -237606, -284810, -27830, -53747, -71559, -74971, -256852, -253099, 42955, 207912, 47671, -60430]
19245b16756A01084i0459I5994a01245B42951a39746C72307A9509b31947P2829
19235a59118A72365n3490c73333A67612A7181b73346B0691a68577A4958c4121
19224c30076C1556M7277b42886g9781B26812a17337K1477A5055a64913A3190a89060
19212B52019a65216K2399A20136d76498f8266A46330b75995B02078e3897C02114
19201a18022j23275j28746R3477A33574D8711c7833o0788j60977R1177A21891
19190B33134i0973j16065C40033g7306q9855A24856a077j13165B8494L00374b52818
19178A27257c31079b320A83127h1829E5114C271M3060R2572g8205j13201h7392
19166a85807b0258j07742N6715A9128R1989a21631q093A25847J16333a18030l7223
$$ y = [-216756, 101084, -90459, 95994, -101245, 242951, -139746, 372307, 19509, -231947, -159118, 172365, 118875, -373333, 167612, 17181, -273346, 20691, -168577, 14958, -34121, -330076, 31556, 78833, -242886, -79781, 226812, -117337, -95860, 15055, -164913, 13190, -189060, 252019, -165216, -142817, 120136, -476498, -68266, 146330, -275995, 202078, -53897, 302114, -118022, -241297, -370043, -276566, 133574, 48711, -37833, -98621, -259598, -168421, 121891, 233134, -90973, -207038, 340033, -77306, -167161, 124856, -1077, -114242, 28494, 328868, -252818, 127257, -331079, -2320, 183127, -81829, 55114, 3271, 46331, 138903, -78205, -191406, -87392, -185807, -20258, -128000, -71285, 19128, 111117, -121631, -129724, 125847, 242180, -118030, -155253]
19155a55253A79092e94022B90681B7808K08581a39468A1761a93747L1919L5856
19145a25972B9526b4959m6733p7289p4635M8079q3389E4916b85367N1236A13667
19133a41218q4978A88662D2345K18198A03069a64994c1748l9372n9358d9532k02078
19122b51610b4221A79062a76216r0867F2257A7337a00810j32598A97504b06727
19111H863a34354N1319k9560j26668e1016A59889g5293J5989A0317a86555o243
19100a92798O2293k39721a22226A79904p0822A3030a85583B19144a18199A49176
19089b90867J17342P3342r6286J2302f9912r7563a8891H5385j4424a6740f940
19077a17395a9169j38261A54795c203B91453a49687B58547c78653B23398b70381
$$ y = [-155253, 179092, -594022, 290681, 27808, 236389, -139468, 11761, -193747, -161828, -125972, 29526, -24959, -71692, -148981, -223616, -175537, -258926, 54916, -285367, -234131, 113667, -141218, -226196, 188662, 42345, 260543, 103069, -164994, -31748, -71120, -130478, -49532, -251610, -24221, 179062, -176216, -267083, 62257, 17337, -100810, -233408, 197504, -206727, 8863, -134354, -83035, -112595, -239263, -51016, 159889, -75293, -59304, 10317, -186555, -192798, -130505, -370226, -122226, 179904, 109082, 13030, -185583, 219144, -118199, 149176, -290867, -173525, -100183, -196469, -184167, -69912, -167475, -18891, 85385, 70961, -16740, -6940, -117395, -19169, -157430, 154795, -3203, 291453, -149687, 258547, -378653, 223398, -270381]
19066b35331B94987C8254M5232c3884l0360I3696m2901B3325a9525q9602A82990
19054B1743e8551c776j62063N0360l13014c4630l30988A67409a72640j74140J46509
19043b00271I9392a49548A1412i7182M1179j03430E6199P7503a17701b3096A46843
19031A70843a22247A16724m075b10202A15160J35734j22260b55963L286L1416
19021b21261B91712f641k76200A1428K62595g4648C6280b59147A70199o1316L8250
19010A47133b96037A86638i7090o3336A51850P4621n9258a50329Q459e7187F8695
18998G6843a17702F230e6846A10015a91454A49428a57551d1611q7547E2759h633
18986i8528B09453j6002a3342a152k19919H1073J18658A9019a27294J7117j02160
$$ y = [-235331, 294987, 38254, 83486, -33884, -64244, 93696, 50795, 23325, -19525, -109127, 182990, 21743, -58551, -3776, -165839, -115479, -428493, -34630, -365618, 167409, -172640, -346780, -200271, 99392, -149548, 11412, -97182, -56003, -159433, 56199, 133702, -117701, -23096, 146843, 170843, -122247, 116724, 112649, -210202, 115160, 250894, 128634, -255963, -252677, -221261, 291712, -6641, -282841, 11428, 274023, -74648, 36280, -259147, 170199, 108883, 147133, -296037, 186638, -97090, -160426, 151850, 226471, 167213, -150329, -141870, -57187, 68695, 76843, -117702, 6230, -56846, 110015, -191454, 149428, -157551, -41611, -129158, 52759, -8633, -98528, 209453, 193451, -13342, -1152, -221071, 81073, 199731, 19019, -127294, -110177, -212337]
18975b12337C803a09875A07735i3394D2734L1619g4403c4665E3798J01034g9630
18963D4913f6546K7769o6038L3022r8809P499C4402c4068q8784o8479G9280k2491
18951E6789i5597f937j82665j5411f7262l17928O2016D8658j8410K94618g5184
18939f4956I9294A0768d12723A96081a90264c8589D22616a94420p746J3858K6326
18928a61982A22692Q8563b18378I9021e1974D4135c33866G8237a22161A6397N2765
18917F9162J35488a56302p789B38232b45069J11185h308B77481f4324G9864K4554
18906A04418b33642D5875a47421k72004D0169c50290J16887a2129k97240H3851
18895c01542h0557F9752G98R3937R1377I96K52784B3884J31694o2491L0301a51345
$$ y = [-212337, 3803, -109875, 107735, -93394, 42734, 74353, -74403, -34665, 53798, 154832, -79630, 44913, -66546, -38777, -104815, -71793, -170602, -163103, 34402, -34068, -122852, -191331, 79280, 56789, -95597, -6937, -189602, -205013, -67262, -385190, -323174, 48658, 30248, 324866, -75184, -64956, 99294, 10768, -412723, 196081, -190264, -38589, 422616, -194420, -202166, -188308, -161982, 122692, 211255, -218378, 99021, -51974, 44135, -333866, 78237, -122161, 16397, 69162, 204650, -156302, -164091, 238232, -245069, -133884, -8308, 277481, -64324, 79864, 104418, -233642, 45875, -147421, -419425, 40169, -350290, -233403, -12129, -309369, 83851, -301542, -80557, 69752, 798, 94735, 186112, 996, 253780, 23884, 155578, 93087, 123388, -151345]
18882c825B4185c6169A56776J91592B9392b46188H3898d76405A04442Q4865C8970
18870a26767a2314A21495a87895r9485G1444c7406j59996k52530a54211e7096
18859a75432A47525g9745K889n0766A32013c5098a407k01837j78415a8147p5425
18848i3572k79661B27167D7410J97910b32395L9517c325A4116O8576j0714f3724
18836a2793A91295j9704a46882A38263g9694p309L1968F1893c06001h3615F7302
18824b44238k782k9956a06204F068K45933b79547B2963b02908k19914b05981R6101
18813a09880E9049f200B0162b7769A7450J70026J30096a37653F8647k402K34595
18802C00840p2473L7279j09393m8558a90443G0868K03332b43595B59380d3512
$$ y = [-3825, 24185, -36169, 156776, 348368, 29392, -246188, 83898, -476405, 104442, 189307, 38970, -126767, -12314, 121495, -187895, -287380, 71444, -37406, -197402, -449932, -154211, -57096, -175432, 147525, -79745, -76856, -127622, 132013, -35098, -1407, -203244, -381659, -18147, -93572, -373233, 227167, 47410, 245320, -232395, -192878, -3325, 14116, 82692, 71978, -63724, -12793, 191295, 171591, -146882, 138263, -79694, -87003, -55035, 61893, -306001, -83615, 67302, -244238, -247020, -276976, -106204, 6068, 252001, -279547, 22963, -202908, -422822, -205981, -109880, 59049, -6200, 20162, -27769, 17450, 187476, 317572, -137653, 68647, 66245, 300840, 228367, 265646, 156253, 107695, -190443, 70868, 274200, -243595, 259380, -43512]
18791i3078k166C39953D7764f9436m1515h520A02019b36509c8392k28988I072
18779a855j59049M1030j04244C4833a94676c2711j56917C7585c688l09106e7414
18767b72085B57510C6386b42530M8020O8640I2531b57750J26677j7636B34766
18756C7161N9446K0624a25480A45442d89192a55950j38926G8091M6039R9428b26176
18744A29389a59537J4338c021r074F8415f7647J3904o6454C623g7794j51690P1671
18732a57813F8524K7940R2822O1570c17578B20072a24858j37091B15512d1790
18721g5892A18229K98630F7962a810A10717a07346L7968I7679a16859A53906c40224
18709c4963k2081A78205n4478a57563c2830B5716J50772C1672i6603o0936B31107
$$ y = [-93078, -95244, 339953, 47764, -69436, -110951, -8520, 102019, -236509, -38392, -267380, 9072, -1855, -160904, -119874, -224118, 34833, -194676, -32711, -189628, 37585, -3688, -312794, -57414, -272085, 257510, 36386, -242530, -194510, -125870, 92531, -257750, -131073, -148709, 234766, 37161, 96607, 117231, -125480, 145442, -489192, -155950, -294876, 78091, 124130, 223558, -226176, 129389, -159537, -145199, -3021, -12095, 68415, -67647, -53743, -120197, 3623, -77794, -229484, -157813, 68524, 96464, 189286, 250856, -317578, 220072, -124858, -261949, 215512, -41790, -75892, 118229, 416859, 67962, -1810, 110717, -107346, -69378, 97679, -116859, 153906, -340224, -34963, -57044, 178205, 123727, -157563, -32830, 25716, 176488, 31672, -96603, -157539, 231107]
18697a93755Q3975K0281j40975P4685P1956E3091j6478c1138A21301b31880A65043
18685c40929A48118c24153A49849b90519A89982b8173k31385j50130A24582b31766
18674I4857B4142M9690a07784j22023g9387n3928A96676a88700A53634b10004
18663c69025e6530n3723B67432c33141a54830B5263f6816o5955A23630a79972
18652c02158a04448k17427O776C33866a09196j70074b5615l24451A11208L09209
18642D20417i1081E4898J12265a84718N2798r6515b9314k11730i2156j2559I4984
18630A22677f6584B33631A12247a22550o2401I987L03580B7183a06593k72235
18620c78828a31804j31679m962I958K55710A1122a66968g5920k87406A75443K6352
$$ y = [-193755, -109780, -89499, -230474, -155789, -83833, 53091, 36613, -31138, 121301, -231880, 165043, -340929, 148118, -324153, 149849, -290519, 189982, -28173, -259558, -409688, 124582, -231766, 94857, 24142, 73832, -107784, -229807, -79387, -133315, 196676, -188700, 153634, -210004, -369025, -56530, -110253, 267432, -333141, -154830, 25263, -66816, -132771, 123630, -179972, -302158, -104448, -321875, -315099, 333866, -109196, -279270, -25615, -350066, 111208, 420417, -91081, 54898, 167163, -184718, -131920, -228435, -29314, -241044, -92156, -104715, 94984, 122677, -66584, 233631, 112247, -122550, -184951, 9987, 313567, 27183, -106593, -378828, -131804, -263483, -268445, 9958, 265668, 11122, -166968, -75920, -363326, 175443, 201795]
18609B01795r7534b65529d8741k1313A36971e6164r9568B51433q7909D9856J03563
18598A53419c71468a67822A27875a88106b2456F4781a27267M1585c3415A72114
18587e1324m236A81712c40862i3295M4139j74483B3330J38598K81614b82013Q0957
18576b01056e5033k87665C8970a6756j94431a6870j44770b7029F5691K6638K82911
18565C75240H2376h1655j35063f0658k9868b6633C16304b18112Q1270J5671a0163
18553a74326E4661f7790A27814E5390J04821K31722b06942A42101a49299A13752
18542A94040a09623k9288B38884c57622a55521l49810a65191K7920c1158B73284
18531A2389d5097n3546j14847A69662i9227A65738d4411A78790b8835B85556c35453
$$ y = [201795, 104261, -265529, -48741, -70054, 136971, -56164, -155732, 251433, 163524, 49856, 153419, -371468, -167822, 127875, -188106, -22456, 64781, -127267, -85682, -33415, 172114, -51324, -55560, 181712, -340862, -93295, -49156, -223639, 23330, 161928, 443542, -282013, -201056, -55033, -342698, 38970, -16756, -211187, -16870, -161640, -27029, 65691, 92329, 375240, 82376, -81655, -216718, -60658, -90526, -26633, 316304, -218112, -136842, -121171, -10163, -174326, 54661, -67790, 127814, 55390, 160211, 391933, -206942, 142101, -149299, 113752, 194040, -109623, -138911, 238884, -357622, -155521, -505331, -165191, -137271, -31158, 273284, 12389, -45097, -98643, -213490, 169662, -99227, 165738, -44411, 178790, -28835, 285556, -335453]
18519h5112j92470P1687l0413a07706A86410i0317F3953A5235b66662F0599a81096
18507b822C358i1689k15792a50734G0722J48166B70a89104A2853h0318b6771r258
18495c6029k30418L9619g0031j64022l940e8967A02138d510E2027K93510A68520
18483b24130i2298B5588a57736j75530A65262J0148b44997A19822h8236k6091
18473a14327p3701A7558b9585k37715b1411r9217c8268q1692c9094C8452O3362
18462A01814J3404N0734a54385C547J27793e6753B19405i4216D7002J00498b37209
18450a40321L0348a3228l12964J35192A20750b33372d1150m31964f8243j62842
18440b31085j57809A23101J08998r4655E9051Q1597G988b25116Q0782B50335F3149
$$ y = [-85112, -277582, -205895, -236308, -107706, 186410, -90317, 63953, 15235, -266662, 60599, -181096, -2822, 3358, -91689, -307481, -150734, 70722, 218888, 270, -189104, 12853, -80318, -26771, -36029, -266447, -226828, -70031, -234053, -237993, -58967, 102138, -4510, 52027, 345537, 168520, -224130, -92298, 25588, -157736, -333266, 165262, 175410, -244997, 119822, -88236, -114327, -188028, 17558, -29585, -267300, -21411, -120628, -38268, -119960, -39094, 38452, 101814, 115218, 165952, -154385, 3547, 131340, -56753, 219405, -94216, 47002, 147500, -237209, -140321, -109973, -13228, -326192, -191000, 120750, -233372, -41150, -473114, -68243, -231085, -388894, 123101, 232099, 137444, 59051, 140648, 7988, -225116, -144334, 250335, 63149]
18428A50101b00572E7626K1501c26528a02703A12590b74755k65844a54830j26617
18418b81447b5476K519C572J34217P263a09260d7855j65601C9746J2030j6606
18407C5170a2445k17992m3242J7770G4966B6897J00928L61661C1418J2834L94300
18396D38552j65662a1639j13920A41612f8200B54239F7398c47001a11088K1868
18386h9220D00823d2707j40857Q0246J9486J7179b8381A75356p1207a68067A76308
18374A43870l9046A868b40612C2038N3572J90294N962j2557a9230r294J497j73245
18362b00272E3740e2162B66332c15607C45417c83456A18888a66837B57323a00710
18351E6292i2991B48824e8257A22535a37028G8327A3038m435R3503b71250j8096
$$ y = [150101, -200572, 57626, 79127, -326528, -102703, 112590, -274755, -540599, -154830, -281447, -25476, -22957, 3572, 137789, 145052, -109260, -47855, -213456, 39746, 51776, 35170, -12445, -230437, -273679, -255909, 74966, 26897, 127825, 489486, 31418, 44252, 438552, 272890, -11639, -125559, 141612, -68200, 254239, 67398, -347001, -111088, -89220, 400823, -42707, -183564, -103318, -83832, -66653, -28381, 175356, 104149, -168067, 176308, 143870, 104824, 1868, -240612, 32038, 85610, 275904, 281866, 269309, -19230, -28524, -27027, -200272, 53740, -52162, 266332, -315607, 345417, -383456, 118888, -166837, 257323, -100710, 56292, -92991, 248824, -58257, 122535, -137028, 78327, 13038, 8603, 102106, -271250, -289346]
18340b89346A27829M0747c32130J37869A78297p3342h966j01727B3378a53184
18329I4351c92114G9617L1205A0124i7620J7522b9186C8528b05410r884A12423
18317B62976d86480G9747i2797A78022b56204C3340a98948A03777l4057M4578
18307A14298J5111d4204A83485b09262k41979A65861Q0557a35712p0078p3541
18297b79331G5328J13652b98258a10903B5668a55435D2400h4228J685j5475L298
18286i4720F4617K50690d31375P2558c6245B0943a6724B00525I6483J18417a37937
18274D2746c9304B5365b93400C25178b43997f647j19048C8442J07323K87436f5970
18262b37308o7920J11119K1784D9383g1226k50636i9883q3234H5490J16224b9852
$$ y = [-289346, 127829, 168576, -332130, -194261, 178297, 104955, -8966, -110693, 23378, -153184, 94351, -392114, 79617, 110822, 10124, -97620, -80098, -29186, 38528, -205410, -215294, 112423, 262976, -486480, 79747, -92797, 178022, -256204, 33340, -198948, 103777, 69720, 114298, 129409, -44204, 183485, -209262, -451241, 165861, 246418, -135712, -205790, -279331, 75328, 188980, -298258, -110903, 25668, -155435, 42400, -84228, -82543, -98018, -94720, 64617, 315307, -431375, -358817, -36245, 20943, -16724, 200525, 96483, 214900, -137937, 42746, -39304, 25365, -293400, 325178, -243997, -6647, -125695, 38442, 145765, 433201, -65970, -237308, -305228, -194109, -172325, 49383, -71226, -321862, -99883, -183117, 85490, 201714, -29852]
18250f3962C83298j29947e656r7644b676j39633A50187p4387b02232n9011A72336
18238A48540R8895A08465b1429l12389a3318A81227d41332a7419j732l34851A48856
18226A50621F340M0091f5248k4727p8508b8914m9611j64676h991B2423J7503a28721
18213A48132a30417A67640G3867B9996a18275E8248g1285j57860f2051K4255A47243
18201B8914K0705J02228b66823d0263l69555J36076B31079A1630J1205g3926M427
18190f9499k5325B3195a17312d747B21203r5391e6551l24584A14545d6684D3414
18178A73067a1142k29645D3289M637a46876M3404G9753a40401E6003J71353g4674
18166B12002m4874C3203M715c0446n0468p2715C40494C4188L4989J27697f7834
$$ y = [-63962, 383298, 253351, -5656, -103300, -2676, -142309, 150187, 75800, -202232, -261243, 172336, 148540, 247435, 108465, -21429, -333818, -13318, 181227, -441332, -17419, -19151, -354002, 148856, 150621, 6340, 46431, -65248, -89975, -168483, -28914, -78525, -243201, -8991, 22423, 39926, -128721, 148132, -130417, 167640, 73867, 29996, -118275, 58248, -71285, -229145, -62051, -37796, 147243, 28914, 49619, 151847, -266823, -40263, -409818, -273742, 231079, 11630, 22835, -73926, -69499, -94824, 23195, -117312, -4747, 221203, 125812, -56551, -381135, 114545, -46684, 43414, 173067, -11142, -240787, 43289, 47926, -146876, -103472, 79753, -140401, 56003, 227356, -74674, 212002, 167128, 33203, 37918, -30446, -80914, -153629, 340494, 34188, 69177, 196874, -67834]
18154E8765B1726J95038N7172b14515D5810R1873F7757a62791k11321f2858j6685
18143g9543A9493O672a60772j43713i5527A53866l4660L9765e6234B06951a84459
18131B73132A35028C1486j3779a52937j21984H451N0413c30050B7376a33230l2620
18120a65850j02060i2262l2291A13429b76725E3125b53385g980j71018A5615a45950
18108a64295O4317n0674a5843r1322j00186L9336N3320D07285A05707g9938j03128
18097a83066o4284C03576c56883J36430c7427j95550a14249B54351Q7505j64831
18087A77025j3146C4363a77927k4814C8471b13126j24610h322A0696J31737n8947
18076H3486Q1110A735L5599b16323h9521r4099j31855f5031j14319h0555D1821
$$ y = [58765, 21726, 216764, 273936, -214515, 45810, 137683, 67757, -162791, -374112, -62858, -79543, 19493, 26165, -160772, -304485, -95527, 153866, 119206, 158971, -56234, 206951, -184459, 273132, 135028, 31486, 17707, -152937, -274921, 8451, 58864, -330050, 27376, -133230, -165850, -267910, -92262, -124553, 113429, -276725, 53125, -253385, -7980, -178998, 15615, -145950, -164295, -99978, -150652, -15843, -107165, -207351, -168015, -114695, 407285, 105707, -79938, -183066, -247350, 303576, -356883, -220453, -37427, -232977, -114249, 254351, 341856, 177025, 163879, 34363, -177927, -202741, 38471, -213126, -337736, -8322, 10696, 142433, 83486, 164596, 1735, 37334, -216323, -89521, -183620, -315475, -65031, -179350, -80555, 41821]
18064A54464J52675q4022b5971H2423a23729A66848b5395l52116g3511A18396
18053b3461k16677a0227k69782i9206A74201A0833J4001L105n103b27503K0051
18042b07452Q0729M2606I3639k190c6447k2507j63375R8565F9141J75128f4381
18030A99246d6249r3860L2241c8881F5149J53428a1684j7450q3758B97614H0167
18018C749b71994F0937M083a33145n6765A07673b17215O6366L8771G7016c9309
18006a92473L8693j02217C91993a88026f7540G1784Q2543a10181A31283a51677
17995C8403c1935a4358I8225c00060B90963b18140c5047r4852C21746f5303k2676
17984h7979G1336J23147f1790B15198H9104r709B3389K44863a38251m9308n3498
$$ y = [154464, 307139, 223117, -25971, 82423, -123729, 166848, -25395, -377511, -73511, 118396, -23461, -240138, -10227, -280009, -99206, 174201, 10833, 24834, 27939, 22836, -227503, -207452, -126723, -84117, 93639, 91449, -36447, -58954, -222329, -123764, 69141, 244269, -64381, 199246, -46249, -140109, -107868, -38881, 65149, 218577, -11684, -29134, -112892, 297614, 80167, 3749, -271994, 60937, 65020, -133145, -189910, 107673, -217215, -150849, -112078, 77016, -39309, -192473, -153780, -255997, 391993, -188026, -67540, 71784, 154327, -110181, 131283, -151677, 38403, -31935, -14358, 98225, -300060, 290963, -218140, -35047, -129899, 321746, -65303, -87979, 71336, 194483, -61790, 215198, 89104, 79395, 23389, 268252, -138251, -187559, -241057]
17973b41057p3676a20410L6051B17127a99131G7734d69898a22232q2887M6028
17963a59091B5816a23504L1770B5752c7083A3989c1631k72302J31306A15089B6106
17951A59220R927e5820K4581E6514a04424A30774K20733H810M51394b25947A72706
17939A15872D5736c43858A37688i8746F0526J03601a07871o0850G8905f0264A14949
17927a87467d9844m0743A44895K7795a13811M6511B80935c03224F6726a02698
17916c305A56715j7343b25838j3494B49721a84128J8694b0086p9085H026M2586
17905E0612j3556K2448L1422C7669J0000K95344i2320j74953A19228K50826g6280
17893E2264M9901J94598b61632g2504m45459a04779A56277d33137A07610B0894
$$ y = [-241057, -314733, -120410, -84359, 217127, -199131, 77734, -469898, -122232, -205119, -159091, 25816, -123504, -91734, 25752, -37083, 13989, -31631, -303933, -172627, 115089, 26106, 159220, 169147, -55820, -31239, 56514, -104424, 130774, 351507, 8810, 460204, -225947, 172706, 115872, 45736, -343858, 137688, -98746, 60526, 164127, -107871, -168721, 78905, -60264, 114949, -187467, -49844, -90587, 144895, 172690, -113811, -67300, 280935, -303224, 66726, -102698, -3305, 156715, 139372, -225838, -239332, 249721, -184128, -165434, -20086, -99171, 8026, 50612, 37056, 59504, 90926, 37669, 47669, 343013, -92320, -267273, 119228, 370054, -76280, 52264, 102165, 296763, -261632, -72504, -517963, -104779, 156277, -433137, 107610, 20894]
17882b01158A98884a28254M9615B33022d48166A02970l3683b80262A37401e5576
17871F8085h7158K3579k29582B45350o6533M7013a72377A2195a42089a3664B41370
17859a33272D2829J31044a04213G6292a54648l0927A77009p8218f5787D0711a00172
17847F5279C755N0047L7027N5880a48747j91722i8464q9331g6006J9264j81093
17836b37835k3222j17811g266A25395g9620b9166A87804c7300C6664M02421a42066
17824h3898r42F7230N5990b86187J1814B28979a59624g0137D5673i8444A40874
17812e3640m6365B58449D9037b32240j29463J76868c3135j43288j91508A6191
17801b833C16471d748B8811P9985N9398a17048C23365A03674J11245m2546C2775
$$ y = [-201158, 198884, -128254, -78639, 233022, -448166, 102970, 69287, -280262, 137401, -55576, 68085, -87158, -63579, -293161, 245350, 178817, 225830, -172377, 12195, -142089, -13664, 241370, -133272, 42829, 173873, -104213, 76292, -154648, -185575, 177009, 98791, -65787, 40711, -100172, 65279, 3755, 53802, 90829, 146709, -148747, -340469, -98464, -187795, -76006, -56742, -237835, -261057, -378868, -7266, 125395, -79620, -29166, 187804, -37300, 36664, 439085, -142066, -83898, -84840, 67230, 123220, -286187, -274373, 228979, -159624, -70137, 45673, -98444, 140874, -53640, -100005, 258449, 49037, -232240, -361703, -184835, -33135, -176423, -367931, 16191, -2833, 316471, -4748, 28811, 108796, 168194, -117048, 323365, 103674, 214919, 172373, 32775]
17789F8252f0722B3576K331c351p1796A41764m6037j5722a29563D4594j4207b8997
17776E2511K3310J3448J84487a66474O2614c8080m4605b7901D9273R0419B5589
17764B17547E7375b94960B45559j16721a7737j54021C9823i6594k10158M1307
17754b65445B46357b55488d0879J9855n2469m06421G8614a27188B18681a91550
17743H022M0429d789D9154a39731B3952M2146B3976J2131e1200A06810l1122J53193
17731B28881p8471b94122e5097q6228C75628m8657j56014h3956C5233J30895A2113
17719H8123J08633G3905J83000g8207H879P40b27916R4761F5338a33875A60235
17707a54613b7980A91615b29909B1945L24418I9310a88511A32483J19623a85097
$$ y = [68252, -60722, 23576, 25907, -3351, -75147, 141764, 95727, 80005, -129563, 44594, 30387, -28997, 52511, 75821, 89269, 273756, -166474, -103860, -38080, -82685, -27901, 49273, 139692, 25589, 217547, 57375, -294960, 245559, 128838, -17737, -171758, 39823, -96594, -306752, -265445, 246357, -255488, -40879, -21024, -73493, -479914, 78614, -127188, 218681, -191550, 8022, 48451, -4789, 49154, -139731, 23952, 66098, 23976, 36107, -51200, 106810, 75688, 228881, 150410, -294122, -55097, -141325, 375628, 326971, 170957, -83956, 35233, 166128, 12113, 88123, 196756, 73905, 256905, -78207, 8879, 9619, -227916, -133155, 65338, -133875, 160235, -154613, -27980, 191615, -229909, 21945, 346363, 99310, -188511, 132483, 252106, -185097]
17696a27647C5275O5168c63561a47135A1443Q6243a48431K5783l5094A24549M5815
17685A70364n6051a6219D40792a0466A73789G5607b15349D4786K50614j31855
17675A63545K18515j82008M1399b42448d9408n8462G6252A9543i492o2391B22953
17663C50905A12529a2775n9645F7901a44069I5908N7274A8783b58718B60654E9718
17651a77050C92324A42743J20500a36398F4143J56192A5946d3361B66678E808
17640A51950c9644B48602B5009P3624b80292B68158b1319k07689B61033a78096
17629B01855C6670b27395E0015J06110G7725Q151J23051F2396i5125j78033H9848
17617G9570M9245a69820j38874D141K58753a54907p7844C40968A27566f6240J3934
$$ y = [-127647, 35275, 100443, -363561, -147135, 11443, 97686, -148431, -122648, -157742, 124549, 170364, 114313, -16219, 440792, -10466, 173789, 75607, -215349, 44786, 295400, 163545, 382060, 200052, 241451, -242448, -49408, -107870, 76252, 19543, -9492, -71883, 222953, 350905, 112529, -12775, -72420, 67901, -144069, 95908, 153182, 18783, -258718, 260654, 59718, -177050, 392324, 142743, 263243, -136398, 64143, 220335, 15946, -43361, 266678, 5808, 151950, -39644, 248602, 25009, 98633, -280292, 268158, -21319, -229008, 261033, -178096, 201855, 36670, -227395, 50015, 156125, 77725, 85876, 208927, 62396, -95125, -273158, 89848, 79570, 128815, -169820, -308694, 4141, 262894, -154907, -232751, 340968, 127566, -66240, -52306]
17606e2306A4919a77985f9701A44495a45660M5665A25501J4799b6995P477G2020
17594A87937L459a49582K2572R443A202O7577i6113C03088J50542B08576b58323
17582A34314i0547J6720p0704B22505a19667H5755O6797M177j7239a38419H5574
17570F248f4050a3965j16525B6385A0359b29846E8256M2367J1224D3397M6341
17559H9738l3277b20640B556c06147b5556j00976A37521m8114J0012l7541k1092
17548D0786J13394c85612A39865b48934b5027B94261A03962n156K5510J41430
17538B65746j11376p1918i840F9419a09048C0854O3954a02509B31158K46458H0093
17526H9859C3792J29701C9649D434b8733A93729N636D06Q0390e7246B62349a6707
$$ y = [-52306, 14919, -177985, -69701, 144495, -145660, -99995, 125501, 140300, -26995, -19518, 72020, 187937, 191396, -149582, -127010, -117567, 1202, 68779, -96113, 303088, 453630, 208576, -258323, 134314, -90547, -73827, -144531, 222505, -119667, 85755, 152552, 156729, 139490, -138419, 85574, 6248, -64050, -13965, -130490, 26385, 10359, -229846, 58256, 100623, 111847, 43397, 89738, 56461, -220640, 2556, -306147, -25556, -126532, 137521, 89407, 99419, 61878, 40786, 154180, -385612, 139865, -248934, -25027, 294261, 103962, 98806, 124316, 265746, 154370, 82452, -9840, 69419, -109048, 30854, 94808, -102509, 231158, 477616, 80093, 89859, 33792, 163493, 39649, 4434, -28733, 193729, 199365, 406, 80796, -57246, 262349, -16707]
17513B31150D9669A8478K1776q373J66854K74423A71613B9119i40m4863A82098
17501D12438a95150h0992D7656J54713a37237r4538P0037A14378k186J46779b66907
17489f8328A45553i9919B2724e3186A45744D3711K01152B565g4004o58B60298
17477a02454D4946d1063B61956P3965J34350B05367j9378O3720o3334H2310K95100
17466C77410I2524I033f0930E42759D8776j6349a12338A35181A3979b2268C8323
17454c3617B04606a51260B27013P7501h8304d1705j48252g1934A8328J77147q9007
17443A06468l8150A4730J07102J34918n3954c30610a03880C30985P1839E2203
17432A06082R4159L31247A95446J57492j51910c4164E50491A87227K98566m8584
$$ y = [231150, 49669, 18478, 40254, 31881, 198735, 473158, 171613, 29119, -940, -45803, 182098, 412438, -195150, -80992, 47656, 202369, -137237, -231775, -161738, 114378, 112192, 258971, -266907, -68328, 145553, -99919, 22724, -53186, 145744, 43711, 244863, 2565, -74004, -74662, 260298, -102454, 44946, -41063, 261956, 335921, 470271, 205367, 185989, 249709, 186375, 82310, 377410, 92524, 9033, -60930, 542759, 48776, 32427, -112338, 135181, 13979, -22268, 38323, -33617, 204606, -151260, 227013, 304514, -88304, -41705, -189957, -71934, 18328, 195475, 106468, 68318, 14730, 121832, 256750, 202796, -330610, -103880, 330985, 402824, 52203, 106082, 200241, 531488, 195446, 352938, 201028, -34164, 550491, 187227, 485793, 437209]
17422D37209g5116F98980B9764J27399p3995K54653D4167K44013J01841j10812
17412B79209L7457A21138K42711j48216N3182H5282L13706A54040L06902l2124
17402D28818K0884o9932j58052I3886N0768J9383M02859A76042m0546J0265J73948
17391C19709l2574O7905A38426h6632H6350J03562C5689d8652A26014L8855h5236
17379B44890G4087A6184J69113r0785J31952d1257B29385K26540I6576J22470
17369B19046J33671n0586A7134R2849J13057N3242j19670O1753b5210B48082o6318
17358A81764J14106N7595A36624L4393O216J34646Q1742j57750j11346i2634B61306
17346A77803c1845G4977J89365j31875g0747B9469a87512D31150H3255a27707
$$ y = [437209, -75116, 698980, 29764, 157163, 83168, 337821, 44167, 288180, 390021, 279209, 316666, 121138, 363849, 215633, 268815, 85282, 398988, 154040, 460942, 428818, 449702, 379770, 221718, 93886, 144654, 164037, 566896, 176042, 135496, 145761, 319709, 287135, 355040, 138426, -86632, 86350, 189912, 35689, -48652, 126014, 164869, -85236, 244890, 74087, 16184, 185297, 94512, 226464, -41257, 229385, 455925, 96576, 219046, 352717, 302131, 17134, 109983, 223040, 276282, 156612, 218365, -25210, 248082, 181764, 295870, 353465, 136624, 171017, 177233, 311879, 393621, 235871, 124525, -92634, 261306, 177803, -31845, 74977, 264342, 132467, -70747, 29469, -187512, 431150, 83255, -127707]
17335a097A22154m5432l1569K31339F7393O5196D1973M7949J22177q0873J94884
17324C26110D7472g9158C01149f0976B14377r702o8985A424K58753I7977K65133
17313C63110n9703o9749R251j8208j6490p8903K05386M2416A17472a00238A77782
17301B57096D0544K89892M324j19557j8598N1123r7551A2219L44532q7797J88483
17290D57437B02305K53428j19125G1199J14445J62534e89A65157K03862P0737
17280D39756J30782m5616A25655L06942h5824D8652L02796A48199O7943Q6191
17270C02333m5778N9228j07643o9213K18319I0804l1881K32271j26259A8700K20285
17259B38985a6219G5213L5804C2484J95278b207C9412L16731M9931A15928J88567
$$ y = [-1097, 122154, 76722, 45153, 276492, 67393, 132589, 41973, 89922, 212099, 131226, 326110, 47472, -79158, 301149, -60976, 214377, 204675, 135690, 1424, 260177, 97977, 363110, 303407, 233658, 242909, 224701, 208211, 129308, 334694, 377110, 117472, -100238, 177782, 257096, 40544, 330436, 334760, 215203, 196605, 247728, 150177, 12219, 356751, 268954, 457437, 202305, 455733, 336608, 71199, 185644, 348178, -589, 165157, 369019, 439756, 570538, 524922, 125655, 432597, -85824, 48652, 351448, 148199, 216142, 302333, 256555, 315783, 208140, 138927, 357246, 90804, 58923, 291194, 164935, 18700, 238985, -16219, 75213, 111017, 32484, 227762, -2207, 39412, 356143, 406074, 115928, 304495]
17248C04495j45369E9250K34595r9049J00108Q885k6375l0260f1447B57995j28552
17237A29443L4317e3817B43965i9196d0300j38567A52059E7189J74679E7252J55594
17226B12846F5073J38473J22785J54815C9038J11017m1592J12062J77550A35122
17215E2383M48743j82747H8308K8268M01660k41979K1387G2697J05094E5184K58616
17204C13800j07801J92268j42103n8424K83931A98411J42940L0454Q9033K22442
17194F83280j48391A76486n2175L24147r6481n4936Q2721A76443J28549K4925
17184C29917o3334J977g0791B85826J97052A36709n2018J61325J68512a07224
17173f7593A39788J25595j1909J16784n1681J45590I6216J77146a35534D70944
$$ y = [304495, 159126, 59250, 293845, 194796, 294904, 303789, 277414, 247154, -61447, 257995, 129443, 163760, -53817, 243965, -99196, -40300, -178867, 152059, 57189, 231868, 57252, 212846, 65073, 203546, 326331, 481146, 39038, 150055, 108463, 220525, 398075, 135122, 52383, 501126, 318379, 88308, 116576, 518236, 276257, 297644, 72697, 177791, 55184, 313800, 205999, 398267, 256164, 197740, 481671, 198411, 341351, 371805, 460838, 683280, 534889, 176486, 124311, 448458, 351977, 297041, 379762, 176443, 304992, 329917, 266583, 268560, -70791, 285826, 482878, 136709, 84691, 246016, 414528, -107224, -67593, 139788, 265383, 253474, 370258, 318577, 464167, 96216, 273362, -135534, 470944]
17162C06709j52129K14595J28312a61434A11052L99931k33425J94207r0759a5066
17151B22764A01878R7459C7519K75204j53376E7282K0732o312J18300K86378N8589
17140E34969j24198A61631J69199Q3035j51234o2366N7016Q4147M9790n0363l0002
17129C10853j5021j03942J33279o3107M7888j5967A35137K5869J27444K01097
17119D89547j63964Q5479A66169K0324m8773K66551j33236J52113j49276j10774
17109A63098J01237K54362j36992K198R3152A69162J37578N9367J88357j25750
17099D28714A9951J92702K28886m7632K7007J10319P8547k54812K14994r385j14902
17088D45675j13842q3786M29528q0898k62485K92705j29937c040E22334n1244
$$ y = [306709, 154580, 369175, 497487, -161434, 111052, 510983, 277558, 471765, 381006, -15066, 222764, 101878, 199337, 37519, 312723, 159347, 57282, 78014, 71702, 190002, 476380, 534969, 410771, 161631, 330830, 413865, 262631, 200265, 257281, 341428, 391218, 340855, 310853, 295832, 191890, 325169, 262062, 309950, 293983, 135137, 161006, 288450, 489547, 325583, 411062, 166169, 186493, 137720, 404271, 271035, 423148, 273872, 163098, 264335, 518697, 381705, 383903, 477055, 169162, 306740, 366107, 554464, 428714, 19951, 212653, 441539, 393907, 420914, 531233, 609780, 354968, 569962, 560577, 445675, 331833, 248047, 677575, 596677, 334192, 626897, 496960, -3040, 522334, 471090]
17078D71090E1076P20864k50213M343k14876J69059Q4680j02084J78199k36259
17068D04789Q8001R9845J03374l07324P2351J53766J21903L7687l04736J10151
17058E79807k84782M18770K9897l14850L56117C10416K97151B19123K01588K96493
17048G17204k11969J91643C02160L97743k04382J24643j01726j81138K9182M08928
17038G75410R369j58808m2513K05662k75927J99713L3694K4360B38004J10092
17028C48096K58409m6367R6864J2407m4857k8422K2126n0673L84136k79845J36700
17017H08574k44475J58981l26238O4876K01529C22923L20064M2092l9971j20318
17007E24790P5684K26542k92064K77661k63651M90755p2465l54801J41526k38486
$$ y = [471090, 51076, 771940, 521727, 526070, 311194, 480253, 564933, 462849, 641048, 404789, 492790, 592635, 696009, 388685, 461036, 614802, 736705, 774392, 469656, 579807, 295025, 713795, 743692, 428842, 784959, 310416, 607567, 219123, 420711, 717204, 505235, 696878, 302160, 699903, 495521, 620164, 518438, 337300, 366482, 775410, 784779, 625971, 583458, 789120, 513193, 712906, 746600, 770960, 238004, 348096, 606505, 560138, 657002, 669409, 624552, 596130, 618256, 567583, 951719, 671874, 808574, 564099, 723080, 396842, 461718, 663247, 322923, 642987, 685079, 645108, 524790, 600474, 827016, 534952, 812613, 548962, 1039717, 967252, 612451, 753977, 515491]
16997E15491L91593l20732Q0453j15016J83819r751L61033l73678Q2065Q4209
16987H79486j61306L46826k75969j48315L95968j05687J59646n01058K98096o7902
16977H19785o7744K77810l68781K17603L08622l19089k75066L37365P2929m39535
16967E63899L70165j4446J34263j90047K47126k61447M4295k76944K56178K39516
16957A112558m41745J40788Q8317j70093M03033k79171J46998K3942K89677q4479
16947A229825j36799k15899L82174n07975M38635k82674M29676k90873M33087
16938A479177n90021L10349N3482p1775j00808J50869l63081M72618l28392K85870
16928A298288L72778k31675l30975N27742l13836j3488k48139K67846K2281p0604
$$ y = [515491, 907084, 586352, 666805, 551789, 735608, 725857, 1086890, 713212, 795277, 879486, 718180, 1065006, 789037, 640722, 1036690, 931003, 1090649, 589591, 887687, 819785, 752041, 1029851, 661070, 878673, 1187295, 868206, 593140, 930505, 1003434, 563899, 934064, 919618, 1053881, 863834, 1110960, 849513, 893808, 616864, 873042, 1112558, 670813, 811601, 899918, 729825, 1132858, 853687, 1000685, 1024627, 1314304, 1229825, 1093026, 877127, 1259301, 751326, 1189961, 907287, 1336963, 1046090, 1479177, 889156, 1199505, 1252987, 1181212, 1080404, 1231273, 868192, 1340810, 1012418, 1298288, 1671066, 1439391, 1108416, 1636158, 1322322, 1308834, 1060695, 1328541, 1350822, 1280218]
16918A280218m7819L73129l92802L67063j02513O3287J52786j54907K34513l59264
16908A413691K15132l07555O1309k61985M88244n3719K14370L4435k29530R3313
16898A667705N9179k87498J33059L80592O5149l03328j01570n4283K01084j6786
16888A743303K67166k41201j96851K89161j56852M70738r1420r2336j5561K11084
16878B187231j85586k13633M01103K57099m62532R1735O010N08597m22300J84260
16868B351984K83386m28356K2393K61504j18020J68187K15961q4542l25988L43955
16858B690464k11904J19865j38361J88869K01259M9890r9523K91141j7724K7993
16848C101969k42881N2741J67943J36686J45851k37561J51203M00132j75947q3822
$$ y = [1280218, 1232399, 1605528, 1212726, 1579789, 1477276, 1540563, 1693349, 1538442, 1772955, 1413691, 1628823, 1321268, 1382577, 1120592, 1608836, 1555117, 1769487, 1803922, 1574392, 1667705, 1726884, 1439386, 1572445, 1953037, 2018186, 1714858, 1613288, 1559005, 1760089, 1743303, 2010469, 1769268, 1572417, 1861578, 1704726, 2175464, 2084044, 1991708, 1976147, 2187231, 2001645, 1788012, 2189115, 2446214, 1983682, 2075417, 2081427, 2590024, 2167724, 2351984, 2635370, 2207014, 2229407, 2490911, 2372891, 2541078, 2757039, 2672497, 2346509, 2690464, 2478560, 2598425, 2460064, 2648933, 2850192, 2900082, 2800559, 3091700, 3073976, 3101969, 2859088, 2911829, 3079772, 3216458, 3362309, 3124748, 3275951, 3676083, 3500136, 3416314]
16838C416314L10748j35849l39672L21500K4367O1262M47201k22670R6538j45862
16828C833877J33299L11104p8190n2024j72627K18157M88282m98802O08932k75209
16818D516799M9046L54262K74789j12002j07469K65766l9210Q3621K93957Q9637
16808E669196J49227k95643N97845j26209K59092J03583k6187Q9952L30681j2940
16798F738597K94851j80629L45531N5908L35217K11498J43924K51045K07033J46183
16788H549158J97342K04826j80339O31241M15105l05983N38728R4701M27204K55227
16778A0827210M44971j28282M88349K30775P05773J39745L39264K80595J74046
16769A3502446R72982M23289Q6365L80363P04591L38617O60928L70307Q00409
$$ y = [3416314, 3727062, 3591213, 3251541, 3573041, 3597408, 3658670, 4105871, 3883201, 3979739, 3833877, 3967176, 4278280, 4200090, 4148066, 3975439, 4193596, 4681878, 4183076, 4792008, 4516799, 4565845, 4920107, 5194896, 5082894, 4975425, 5241191, 5201981, 5285602, 5579559, 5669196, 5818423, 5522780, 6120625, 5994416, 6253508, 6357091, 6330904, 6420856, 6751537, 6738597, 7033448, 6852819, 7198350, 7254258, 7589475, 7800973, 7944897, 8195942, 8402975, 8549158, 8746500, 8951326, 8770987, 9402228, 9817333, 9511350, 10050078, 10144779, 10571983, 10827210, 11272181, 11143899, 11632248, 11863023, 12568796, 12708541, 13047805, 13328400, 13502446, 14475428, 14898717, 14985082, 15365445, 16070036, 16408653, 17069581, 17439888, 18240297]
16760A8240297O12709O01753P75195O26864P37483O17167O93874J285719O89174
16751B4880235R06813J125724J125571J133221R65735J251766J704353J837809
16743C4931227J348823J382346J725133J985093K303209J935270K603300K661262
16735E0875663K390112L098720L266860L666916L544848M077886M106591M699329
16727G9726925M887699N741411N872187O196815O659597P468988P396611P769064
16719A31719297Q947898Q570484R355128Q824272R420469R011959Q407072Q023927
16711B02280506O819085N838565M176365K797688R94121j050619k317253m522379
16703B15016079n810353o920321p672204q946093q829666r221467r255389r323411
$$ y = [18240297, 18853006, 19454759, 20229954, 20856818, 21594301, 22211468, 22905342, 24191061, 24880235, 25787048, 26912772, 28038343, 29171564, 30137299, 31389065, 33093418, 34931227, 36280050, 37662396, 39387529, 41372622, 43675831, 45611101, 48214401, 50875663, 53265775, 56364495, 59631355, 63298271, 66843119, 70921005, 75027596, 79726925, 84614624, 90356035, 96228222, 102425037, 109084634, 116553622, 123950233, 131719297, 140667195, 149237679, 158592807, 167417079, 176837548, 185849507, 194256579, 202280506, 209099591, 214938156, 219114521, 221912209, 222906330, 221855711, 219538458, 215016079, 209205726, 202285405, 194613201, 185667108, 176837442, 167615975, 158360586, 149037175]
16695A49037175q729151q799666q222388p974166p195386p016229o547665o067870
16687H8484654n671795n548031m230771m848462m166127m129824l450748l480996
16679E2957900k921168l122028k272950k739482k348499j813719k185528j750638
16671C3803888j581700j764897j408255j114132j623486j015328j098679r96278
16663B3201133j342459p58535q52429o43383j043725j006587n65235m33549o45538
16654A5909693n75867q40114l67131l25815o19980l4645o65838m71000l00455
16645A1708848o90457n1725l94136n02780m43665o5899l48478j58058l51590k27373
16635H474687K3290l56631l66058j97137M8285m95641q0210k76662j60704l09817
$$ y = [149037175, 140308024, 131508358, 123285970, 115311804, 108116418, 101100189, 94552524, 88484654, 82812859, 77264828, 73034057, 68185595, 64019468, 59889644, 56438896, 52957900, 50036732, 46914704, 44641754, 41902272, 39553773, 37740054, 35554526, 33803888, 32222188, 30457291, 29049036, 27934904, 26311418, 25296090, 24197411, 23201133, 21858674, 21100139, 20247710, 19604327, 18560602, 17554015, 16988780, 16555231, 15909693, 15333826, 14493712, 14126581, 13800766, 13180786, 13146141, 12480303, 12009303, 11708848, 11018391, 10966666, 10572530, 10069750, 9626085, 9560186, 9211708, 9053650, 8702060, 8474687, 8497977, 8141346, 7775288, 7578151, 7626436, 7130795, 7050585, 6773923, 6613219, 6303402]
16625F303402K32223l68421k79192r9021n3182J82424m09169j97950m22778O3864
16615D952200J08939k29396l21364j30051m812M08054l50061k43336k36976j03965
16605C849232M62252m76582j85579N20551m45484q6315m68663L53629j35868L3411
16595C420584k55294j01835L17234j06286k67139j19117P4916o2881j35215m760
16585B760207J14780p13218N83364o2818r5280l78512L07598N3626k67527L4329
16575B336549k4488j57293L54760j64674k68128K46490j39462m687K5033j32729
16565B071371p3696o7518m3854J27077n20840N62243m46696K56972n8068k35764
16555A571227J10932l25664J81340O2030O1711l99704J65887N3532M0344j51336
$$ y = [6303402, 6535625, 6167204, 5888012, 5788991, 5735809, 5918233, 5509064, 5311114, 4888336, 4952200, 5061139, 4831743, 4510379, 4380328, 4375516, 4783570, 4433509, 4190173, 3953197, 3849232, 4311484, 3834902, 3649323, 4169874, 3724390, 3638075, 3169412, 3523041, 3387173, 3420584, 3165290, 3063455, 3380689, 3274403, 3007264, 2888147, 2963063, 2900182, 2764967, 2760207, 2874987, 2161769, 2745133, 2682315, 2587035, 2208523, 2516121, 2569747, 2302220, 2336549, 2312061, 2154768, 2509528, 2344854, 2076726, 2323216, 2183754, 2179067, 2204100, 2071371, 1997675, 1930157, 1886303, 2013380, 1492540, 2054783, 1608087, 1865059, 1806991, 1571227, 1682159, 1356495, 1537835, 1599865, 1661576, 1261872, 1427759, 1481291, 1521635, 1370299]
16545A370299K60112l29650R1488j65130K53200o4539R7439k1790m5196j62767
16535A283466J67127l32375M54052l01636o9543R138K33102n41188R962J47414
16525A059519L32316k12431p1045o640j57178L25349l61803K449J6057J13366
16515A039959j676k45549J32749J71032C26532O33858L28598l37523j13785J73887
16505A011567l58828J39529j79100R9708J7366P1688k08342K01024l20314J7074
16495D91372K10336l35342L3309M53270j93360j5238p2820m9913K46269O6275
16485H34158l6248p8895K66931l73138L5936J20485j37326J5131J34553l02463
16475D79124j5911J08343B14685K80970K19764k33626n7596M91065m50698B22091
$$ y = [1370299, 1630411, 1300761, 1392249, 1227119, 1480319, 1415780, 1513219, 1491429, 1446233, 1283466, 1450593, 1118218, 1572270, 1270634, 1201091, 1210229, 1443331, 902143, 912105, 1059519, 1391835, 1179404, 1108359, 1101719, 944541, 1269890, 908087, 910536, 926593, 1039959, 1038283, 792734, 925483, 1096515, 326532, 960390, 1288988, 951465, 837680, 1011567, 652739, 792268, 613168, 712876, 730242, 801930, 593588, 794612, 474298, 491372, 701708, 366366, 399675, 852945, 659585, 644347, 571527, 521614, 767883, 834158, 797910, 719015, 985946, 612808, 648744, 769229, 631903, 647034, 781587, 479124, 463213, 571556, 214685, 495655, 715419, 481793, 424197, 915262, 464564, 222091]
16464F50125B85695M57406j79494B08509P50627m10277K62467l25184J77509l00408
16454C63243Q2177K32919k14126j0900j1137O0645C0902O01650j2616A45778K08753
16443C54531J41776I1813N04971k43861K66689B98922J22839j85229M59066p1780
16433F23818B12555L26190B53260K75738m0187o6132J12058B63023M9243k2961
16423B89305M7282J26668l6891E2643K58502F5344J36313N0906k0573J81687O8154
16412D81831H4091K93584J72483N3830k78794j11487J65659M7548j7325K01929
16402F11518B60555J83159r8880R9357j93914K54308j21370M495M24092C59562
16391C09844m793n663n0445A9209K02781K04914A2150P8196J10705L6392J31871
$$ y = [650125, 285695, 743101, 563607, 208509, 959136, 548859, 811326, 486142, 663651, 363243, 445420, 678339, 464213, 453313, 442176, 502821, 30902, 632552, 619936, 145778, 354531, 496307, 91813, 596784, 352923, 619612, 298922, 421761, 236532, 695598, 623818, 212555, 538745, 253260, 528998, 488811, 422679, 534737, 263023, 312266, 289305, 336587, 463255, 426364, 52643, 311145, 65344, 201657, 252563, 231990, 413677, 481831, 84091, 377675, 550158, 603988, 325194, 213707, 379366, 426914, 409589, 611518, 260555, 443714, 344834, 444191, 250277, 504585, 383215, 387710, 811802, 359562, 309844, 305051, 299388, 248943, 19209, 221990, 426904, 12150, 90346, 201051, 237443, 369314]
16380C69314a22174B04923J50239m1089R4259A57742J80095H9519M9667M36159
16370E75345B35091J9991A1720a70993A79720P5045a60256B95362P1712A00885
16359B10762P9138k3456O9778a77170D42775A87518E3566L07083H4380f293B71595
16347G1499O6232J8643J7636q0350N1118O4048D3424N4279a09538B90650g2890
16335a90832B9374L26003J8794j77218b0578A55922J1687h3264C9971g1334A96903
16323B76072r214I0052J93678H0953i1028A05508J15305A7105B810M4877L39135
16312C86822P2184A68867A8057L96420D9260b70322G0891J1889N4831d0464A64652
16300B2428d0320G8148J3470J90369c261H3975K30450a92990C81213A86219K26239
$$ y = [369314, -122174, 204923, 355162, 314073, 408332, 157742, 337837, 89519, 139186, 575345, 235091, 255082, 11720, -170993, 179720, 254765, -160256, 295362, 367074, 100885, 210762, 289900, 266444, 336222, -177170, 442775, 187518, 53566, 360649, 84380, -6293, 271595, 71499, 137731, 156374, 174010, 93660, 144778, 208826, 43424, 97703, -109538, 290650, -72890, -190832, 29374, 355377, 374171, 196953, -20578, 155922, 167609, -83264, 39971, -71334, 196903, 276072, 266858, 90052, 283730, 80953, -91028, 105508, 220813, 17105, 2810, 47687, 386822, 459006, 168867, 18057, 414477, 49260, -270322, 70891, 82780, 137611, -40464, 164652, 22428, -40320, 78148, 91618, 281987, -3261, 83975, 314425, -192990, 381213, 186219, 412458]
16289D12458F9018F812J29875b53777I1369J85934j05042a46940p2351J0401b2599
16277g20j06943B07828r1659E846N5774L168L0584J80627j01981J14806a1354
16265a6465A06387a17977A16476b6179B52327J4628n5177Q0044c9842q6323j32163
16254b58328b851B08123a43086M2741A27268B0919K13613H5413d8265A55170j2299
16243A42871A4568L78186C4376L8873b43550D16595H5577Q2382f3813A37896b74386
16231A4403c1926A56950K23592a4723r6210L1885j86692J14894C4431j3424M50452
16220D71459b29620A12687b08287J3331B60193E0559g0969a3250A15282a89373
16209A0090J78483J24975O7303j9225a45071c6297j98953P9930A03529Q8312J88544
$$ y = [412458, 69018, 6812, 136687, -253777, 91369, 277303, 172261, -146940, -219291, -208890, -22599, -720, -107663, 207828, 116169, 5846, 61620, 64788, 95372, 275999, 174018, 288824, -11354, -16465, 106387, -117977, 116476, -26179, 252327, 266955, 211778, 291822, -39842, -126165, -258328, -2851, 208123, -143086, -100345, 127268, 20919, 234532, 85413, -48265, 155170, 142871, 14568, 392754, 34376, 73249, -243550, 416595, 85577, 167959, -63813, 137896, -274386, 14403, -31926, 156950, 380542, -14723, -110933, -79048, -265740, -150846, 34431, 21007, 471459, -229620, 112687, -208287, -194956, 260193, 50559, -70969, -13250, 115282, -189373, 10090, 188573, 313548, 380851, 361626, -145071, -36297, -235250, -155320, 103529, 191841, 380385]
16198C80385A65798c64338i0220j73614A82009G2981A6780a37324C4466P7685
16188A12151a92592g5088j46873d8363A0862i3316p5014D34803A02199L3873J06991
16177B43063G8683l7047K5778K34289e3152b0558q6152B35530a20576D6042a12062
16165B7093M0287a63351c2848p8301A18066l8287b00084d5683j2491n4375A12479
16153b044D8686i6257A4584K6757d6000A98287c6930l48423A61940g9302I788
16141c1221c664F838J0835L55558a00264k1740N4371j5k43978L2620A51112F9853
16128c9202r6329j75664J39530A44300c551H856J38775D9843a0112k15099Q1999
16117a43212q6573A39562b02856j00906a19598N3143l27282g0252k08624h2510
$$ y = [380385, 165798, -364338, -90220, -263834, 182009, 72981, 16780, -137324, 34466, 112151, -192592, -75088, -221961, -48363, 10862, -93316, -168330, 434803, 102199, 136072, 243063, 78683, 41636, 67414, 301703, -53152, -20558, -106710, 235530, -120576, 46042, -112062, 27093, 67380, -163351, -32848, -111149, 118066, 79779, -200084, -45683, -58174, -112549, 112479, -2044, 48686, -96257, 14584, 41341, -46000, 198287, -36930, -385353, 161940, -79302, 9788, -31221, -3664, 6838, 17673, 373231, -100264, -122004, -67633, -67648, -311626, -279006, 151112, 69853, -39202, -135531, -311195, -171665, 144300, -3551, 8856, 147631, 49843, -10112, -225211, -143212, -229785, 139562, -202856, -303762, -119598, -66455, -393737, -70252, -278876, -82510]
16106H4824e5845D95307c9790I264h4041A98107f9801A78373a29210C407d7699
16094B43540j01915j83m3742A5598g371C01072d3385D8409J55748a11530A93098
16082I4783Q4301F2414I78J3585g6287A47961N0041b39453a17255C6128K39635
16071B75763b5872E792a50605k8391E3908a66446H3566b18259o8895B71178a46720
16059A73957b6982d657j29180r2661e6460p2635B91105c83416a49243C2718K3804
16048E6522d6201B48306f1969l5062j635B37796b80273l804g7242k34321j6594
16037c28157E9129k5238b18987P2177q2151E855a65358E6123O5407a08888j78516
16026b87404B2389a01343j3982A37462a16034b7268A10022C6171N8710a069j76208
$$ y = [84824, -55845, 495307, -39790, 9264, -84041, 198107, -69801, 178373, -129210, 3407, -47699, 243540, 141625, 141442, 97700, 15598, -7371, 301072, -43385, 48409, 204157, -111530, 193098, 94783, 179084, 62414, 978, 14563, -76287, 147961, 198002, -239453, -117255, 36128, 275763, -25872, 5792, -150605, -178996, 53908, -166446, 83566, -218259, -287154, 271178, -146720, 173957, -26982, -4657, -133837, -226498, -56460, -129095, 291105, -383416, -149243, 32718, 56522, -46201, 248306, -61969, -97031, -98666, 237796, -280273, -284077, -77242, -311563, -328157, 59129, 33891, -218987, -146810, -228961, 5855, -165358, 56123, 121530, -108888, -287404, 22389, -101343, -115325, 137462, -116034, -27268, 110022, 36171, 94881, -1069, -177277]
16015a77277K4348k8473c3687A82110H9500a04019c5372A27179A5005K19J55139
16004A70363a20687F989e6050j23790B03121b41183H9313a81140A79976p9996
15994I9980m0366J9125g4435m0590d8279l38087a52204a9439P358k20565A30998
15982B15904g3981G633a18103j0773k3098p625p0648J430e8637B26907a20498
15970h3275B13270J66769N6066m7737l976G7138K39882G8394K60847j52545k98
15959A86398g9421L4176F3407J3115a2551k6238r3594A8346f0034q148j373E3960
15946a58889O8071A70721b23762d8238A16707J50699c3075r3219K0786l69307
15936d74815b17476E0972i3412B9950b68784C3261J49023c39973J55687e9037
$$ y = [-177277, -152929, -181402, -33687, 182110, 89500, -104019, -35372, 127179, 15005, 15224, 170363, -120687, 6989, -56050, -179840, 203121, -241183, 89313, -181140, 179976, 99980, 59614, 78739, -74435, -115025, -48279, -386366, -152204, -19439, -12081, -232646, 130998, 215904, -73981, 7633, -118103, -128876, -151974, -159599, -230247, -228817, -58637, 226907, -120498, -83275, 213270, 380039, 436105, 388368, 384392, 77138, 317020, 78394, 339241, 186696, 186398, -79421, -45245, 63407, 76522, -12551, -38789, -132383, 18346, -60034, -68182, -69555, 53960, -158889, -90818, 170721, -223762, -48238, 116707, 267406, -33075, -126294, -105508, -474815, -217476, 50972, -93412, 29950, -268784, 33261, 182284, -339973, -184286, -59037]
15925A4123J11669a53050l5932M1337H2525J47994d2919E7606b03176a00449B76829
15913a72816b3474j47268j91834B25692c4231o5249j30764a2951G6380P9133b53
15901a41344d8324k22937G8662c11952a5835p225j95628i630j31448A02705a7920
15889D7043a56553g3425j67929a00987A51315G2331e680G2536a5935A89394h809
15877E08147k43845b2179B14346A03585D9855J03791k1637R6698Q688k533a01169
15865a98323j59650f9238k05186b7752j66498n4637D4558g7805j6366b0491A31151
15853A1974N9585g4925A3701a07586j20777O8381p1790A76542i0749l03004I8827
15841I3367d1780a5434E5981B5059K39001i9572j44484d0208j67877P9321r6172
$$ y = [14123, 125792, -153050, -188982, -147645, 82525, 230519, -42919, 57606, -203176, -100449, 276829, -172816, -23474, -170742, -362576, 225692, -34231, -99480, -230244, -12951, 76380, 155513, -253, -141344, -48324, -271261, 78662, -311952, -15835, -23060, -218688, -9630, -141078, 102705, -17920, 47043, -156553, -73425, -241354, -100987, 151315, 72331, -5680, 72536, -15935, 189394, -8809, 508147, 264302, -22179, 214346, 103585, 49855, 153646, 132009, 228707, 237395, 234862, -101169, -198323, -357973, -69238, -274424, -27752, -194250, -248887, 44558, -77805, -94171, -20491, 131151, 11974, 71559, -74925, 13701, -107586, -228363, -159982, -231772, 176542, -90749, -393753, 98827, 93367, -41780, -15434, 55981, 25059, 264060, -99572, -244056, -40208, -208085, -128764, -224936]
15830b24936a07085A09064a16874M4108o9999c2818n4220B02609a96774K8950
15820a67824D1559b16547A96411e3990j46642e7570k4908G4180a35002q6608d2186
15808A15363b4061j35527l2594h998B34228q9820k5598B4020K79600j43454B8548
15796a15751k63522b1933m24026l6729K39875h3065l5675E5999Q4816e07449a8506
15784b64209F5090a41616k03136B1287e4817K6068J1881C210b83522a38992D6116
15772A54646f2080J3000j9379B7996c95572A88541A7224L9439g7211j87556i0493
15760g1347p7151K8376A11467b55018Q2409k308B43757j19978J11718a31927B33324
15748C07807j09162I432K6690o931J59536q4338i095j76894F8676C2028L947K23539
$$ y = [-224936, -107085, 109064, -116874, -72766, -142765, -32818, -87038, 202609, -196774, -167824, 41559, -216547, 196411, -53990, -200632, -57570, -82478, 74180, -135002, -221610, -42186, 115363, -24061, -159588, -192182, -8998, 234228, 144408, 118810, 24020, 303620, 160166, 28548, -115751, -379273, -21933, -445959, -482688, -242813, -83065, -118740, 55999, 140815, -507449, -18506, -264209, 65090, -141616, -344752, 21287, -54817, -28749, -16868, 3210, -283522, -138992, 46116, 154646, -62080, -49080, -68459, 27996, -395572, 188541, 17224, 56663, -77211, -264767, -90493, -71347, -148498, -120122, 111467, -255018, -172609, -174917, 243757, 123779, 235497, -131927, 233324, 307807, 198645, 9432, 36122, 29191, 188727, 104389, -9095, -185989, 68676, 32028, 35975, 259514]
15736B59514p6003n4726P4667a37266B22983A6513J11575e6303k2894A43377b13310
15724B98357G9618i2607F9500b07676j17012D6272a86142g1040n4573H3627a04406
15712c83242J86516H5147a45934j70129c003A43923a29497E8803i6787o8511j4872
15701a80170B1743K5029b84023c3253D7792b19334B7400a3803E8966J09792b29234
15689a56712c0637j67867l07221C72409j40227j10217a7420G93c37060d7479B664
15677c7467l357A83171d1148D8750E253c56532C1815K5629Q1761E8231a88975
15665d0105m9250R396j17444A10901f3466G6086J38928N6714n6653j04997h2775
15653H1153P4999m0239N770c51440c9399F3773J07898c32057d8806A411c08772
$$ y = [259514, 183511, 128785, 203452, -137266, 222983, 16513, 128088, -56303, -79197, 143377, -213310, 298357, 79618, -92607, 69500, -207676, -324688, 46272, -186142, -71040, -125613, 83627, -104406, -383242, -196726, 85147, -145934, -316063, -3003, 143923, -129497, 58803, -96787, -165298, -180170, 21743, 46772, -284023, -33253, 47792, -219334, 27400, -13803, 58966, 168758, -229234, -156712, -30637, -198504, -505725, 372409, 232182, 121965, -17420, 793, -337060, -47479, 2664, -37467, -40824, 183171, -41148, 48750, 5253, -356532, 31815, 57444, 139205, 58231, -188975, -40105, -89355, -79959, -197403, 110901, -63466, 76086, 215014, 271728, 215075, 110078, -82775, 81153, 156152, 115913, 121683, -351440, -39399, 63773, 171671, -332057, -48806, 1411, -308772]
15641a45196B83139b44j07279A41815n3242b64611D1297b25246D3652Q3351a41514
15629b22588e7245r4124C79505A5314a0041j51051D927R1474m3572e3432B31499
15617a38301a0492k2488k36909B3092N5135a92168f7192k348B4903a05434j36339
15606b41773C38141g8423K5865A19093n455E6607j3195J91499a24877o3246G3340
15594f1611A83108D6857J34593i9268c1717j7866B5304a45048f4084E5845J734
15583E7579b96543B50358b62253A65159b26070A88639c13285A61305b54667A02908
15572a02537B4782J86569O0884g7869B1574D75M28610h8614j21943B3701c51407
15560D38677a9651r7219k3377j21018B01988b9149j26628A14803J87353h6299
$$ y = [-145196, 283139, -244, -107523, 141815, 88573, -264611, 41297, -225246, 43652, 127003, -141514, -222588, -57245, -151369, 379505, 15314, -10041, -161092, 4927, 96401, 52829, -53432, 231499, -138301, -10492, -32980, -269889, 23092, 78227, -192168, -67192, -69540, 24903, -105434, -241773, 338141, -78423, -52558, 119093, 113638, 56607, 43412, 234911, -124877, -188123, 73340, -61611, 183108, 46857, 181450, -99268, -31717, -49583, 25304, -145048, -64084, 55845, 57579, -296543, 250358, -262253, 165159, -226070, 188639, -313285, 161305, -254667, 102908, -102537, 24782, 211351, 272235, -77869, 21574, 475, 429085, -88614, -210557, 23701, -351407, 438677, -19651, -116870, -140247, -261265, 201988, -29149, -155777, 114803, 302156, -86299]
15549A48969b23340A69774N506J60441B0325J55825J144a60114H0839d6337r8488
15538a44825F2757R1595d45910B13594a69270O3884J6597G3423a28626D0752K5622
15527F6374a82741A13140i6827j49361M7913B02440C7907c51015A62921J32246
15517B95167g5015A6926P5827a07791I9823N2584j4305A9782K01266b43741a1368
15505B3764a10500L3259b1563A37436n2444a44152C3381a99452H9545i6501R365
15494h7136D2782L91366a53132B01045A1764c7020j45019m066C0080a8C17512
15482a12659L2589A11516a23057B88397b22344G8014b56470Q8725j12769F904
15471A23792d9405C36425A63669B5076a89214N480E4762e4345c518B96929I0018
$$ y = [148969, -223340, 169774, 175280, 335721, 20325, 176150, 177294, -160114, 80839, -46337, -144825, 62757, 154352, -445910, 213594, -169270, -105386, -88789, 73423, -128626, 40752, 66374, -182741, 113140, -96827, -246188, -198275, 202440, 37907, -351015, 162921, 295167, -75015, 16926, 92753, -107791, 99823, 152407, 138102, 19782, 221048, -243741, -11368, 23764, -110500, -77241, -21563, 137436, 84992, -144152, 33381, -199452, 89545, -96501, -87136, 42782, 434148, -153132, 201045, 11764, -37020, -182039, -186105, 30080, -18, 317512, -112659, -80070, 111516, -123057, 288397, -222344, 78014, -256470, -167745, -280514, 6904, 123792, -49405, 336425, 163669, 25076, -189214, -183734, 54762, -54345, -3518, 296929, 90018]
15459A11591K05717q7704B8801b43332C14379c55412a8793l0041J9197j95939
15449b25576K0086C36087f2093j68962A70169H3121k4857K09988J4198e0620B86790
15437A2862J31807D3306N5488P1207a74312E6918J14731q1600L1173b52292B89990
15425a93763C08355E0841A0118a0083j9659A67697g1986l6637F8150D595J07841
15414A12436F893a53787q5721A31352i340I7644c65859B1439e168p6956q3660
15403a65784j0804q8796b5086l33257J23871B62165b77472a37411M8208B50933
15392e1555l60509a32133d7113m8571G0149j1517a22154J2674b5631l8170j06015
15381a69816P2032A63843N7964E6289K7253J47454d852j60271A46643b60987B07114
$$ y = [111591, 317308, 229604, 28801, -243332, 314379, -355412, -18793, -48834, -29637, -225576, -205490, 336087, -62093, -231055, 170169, 83121, 58264, 268252, 282450, -50620, 286790, 12862, 144669, 43306, 98794, 170001, -174312, 56918, 171649, 90049, 121222, -252292, 289990, -193763, 308355, 50841, 10118, -10083, -29742, 167697, -71986, -108623, 68150, 4595, 112436, 6893, -153787, -239508, 131352, -9340, 97644, -365859, 21439, -5168, -82124, -165784, -176588, -265384, -25086, -358343, -234472, 262165, -277472, -137411, -89203, 250933, -51555, -412064, -132133, -47113, -95684, 70149, 58632, -122154, -109480, -25631, -63801, -169816, -97784, 163843, 221807, 56289, 83542, 230996, -4852, -165123, 146643, -260987, 207114]
15369C09581a23018Q70j8044J2845o6663C8398d6393k22833J638A63333k5936
15358A37397a42072M424A22432b59639A50560b36642j2808e5541j70013k8405
15348b53959a24621j48451A38403J16694a04504H310a57509A95976a44072j7005
15338a61077L6362k02799Q8988B87455a15586A01831N551m7276A9191a5038j89553
15327b04591n105P1189J7835B18450g6864A34987E0766b94144b3585k5483D9619
15315h0425D4040k0580M4218l1576g001A06008m9491a17231A75470a38827A32127
15303b26400O0091A96824p1689b65162J10555H9420f8713J8873h784C75448I5603
15291B60003E2679P6616K40641B3568g7549k5882A49888j2968J34083k6683m3639
$$ y = [309581, -123018, -122148, -140192, -127347, -194010, 38398, -46393, -269226, -267588, 163333, 137397, -142072, -137648, 122432, -259639, 150560, -236642, -249450, -55541, -225554, -253959, -124621, -273072, 138403, 255097, -104504, 8310, -157509, 195976, -144072, -161077, -124715, -327514, -238526, 287455, -115586, 101831, 107382, 60106, 19191, -15038, -204591, -209696, -138507, -120672, 218450, -76864, 134987, 50766, -294144, -23585, -49068, 49619, -80425, 44040, 23460, 67678, 36102, -7001, 106008, 56517, -117231, 175470, -138827, 132127, -226400, -166309, 196824, 125135, -265162, -154607, 89420, -68713, -49840, -8784, 375448, 95603, 260003, 52679, 129295, 369936, 23568, -77549, -103431, 149888, 136920, 271003, 244320, 200681]
15280B00681g1007p8812o693H8972L97536A90530a51942C9695L3627J36310N2752
15269B62384j09955D2f4122q8448C22406j32893R7355H4988c1233B3165J56942
15258A80107K79723A58327e6973k12927N6811C34830b78236A04189m1986a37840
15247b2773D7375a1682A7080K33405a66948A97464O0684K28313A64691a50719
15236F9724J45310A1563J89400N31805N12450k38199J7580L22925F19436k94820
15226C24616A24308K14231A39620n9054a75903b9056O384D10738f0085A94392
15215B2390b6706A48322b11767c914F8580a45424I2382d943B9933L83310f5816
15203a8088B65756J83000A6608L8676a18606A50985J16823m8219M7019J65985
$$ y = [200681, -71007, -149819, -156512, 88972, 486508, 190530, -151942, 39695, 73322, 209632, 262384, 152429, 42, -64122, -152570, 322406, 189513, 286868, 84988, -31233, 23165, 180107, 459830, 158327, -56973, -269900, -213089, 334830, -278236, 104189, 62203, -137840, -22773, 47375, -11682, 17080, 250485, -166948, 197464, 258148, 486461, 164691, -150719, 69724, 215034, 11563, 200963, 732768, 1245218, 1007019, 1024599, 1347524, 619436, 324616, 124308, 338539, 139620, 80566, -175903, -29056, -22672, 410738, -60085, 194392, 22390, -26706, 148322, -211767, -3914, 68580, -145424, 92382, -4943, 29933, 413243, -65816, -18088, 265756, 448756, 16608, 55284, -118606, 150985, 267808, 219589, 266608, 432593]
15193D32593a99107b1418q3423H8824a35520N4547A44406A6680K65075m1647K6309
15182B66417F2003K27932b9911m4333A95156J49568h7513G1049J62287J32749
15172C66085j65329A6198a76945J9815B08300c0767B62997A22130J08212J4931
15162B45273P673q2541J65168n5416j09206K5733A0148L71036H0279d6070J4974
15151c1096A48630k448f1239A71884m8094e0524k9333H434b62104A19187c1638
15139A65228o5258J99368r6217J98166F3398a96571B29975K01973i6541I2135
15128f1000D09825j89617G8899J60728O4633I800Q86M08244j45046P535d5319
15116B08172d1480n657B97416A45296n9929b7762J3554k463a32A10336m8661K48545
$$ y = [432593, -199107, -21418, -104841, 88824, -135520, -80973, 144406, 16680, 281755, 240108, 266417, 62003, 289935, -29911, -74244, 195156, 344724, -87513, 71049, 233336, 366085, 200756, 16198, -176945, -157130, 208300, -30767, 262997, 122130, 230342, 245273, 252946, 170405, 335573, 280157, 170951, 196684, 10148, 381184, 80279, -46070, -31096, 148630, 146182, -61239, 171884, 123790, -50524, -79857, 8434, -262104, 119187, -31638, 165228, 99970, 299338, 203121, 401287, 63398, -196571, 229975, 431948, -96541, 92135, -61000, 409825, 220208, 78899, 239627, 304260, 9800, 10686, 418930, 273884, 281419, -45319, 208172, -41480, -47137, 297416, 145296, 85367, -27762, -14208, -16671, -132, 110336, 61675, 310220]
15104C10220j43481h7369B30888c5106C32594j40226a77099C39407F8892K89274
15094C58166a3870C03202K7541f0874A4811L43856A45818i561o7753K5598H4588
15082b4324G7185b9029k1611A82508O2661g5981c1838A99469J6671J6274J9536
15071B51950d0923A88211n6366J51080a2974r3842C53155a8842A72497K44745
15061D17242E8684K48300j5048j1351q5965j3817q3596K98272j42912F3681Q0332
15050A44013K64492A32291J08064J12306Q063q3192a1436A9719P4180M08650A81054
15038E467K42959L06287d2518D1834K61598p446d89C23467L7868A27940n0481
15027G7459a53396B46389G6196J5226K02378j44089K20501A52957D0399K76931
$$ y = [310220, 166739, -87369, 230888, -35106, 332594, 192368, -177099, 339407, 68892, 358166, -13870, 303202, 330743, -60874, 14811, 358667, 145818, -9561, -77314, -51716, 84588, -24324, 77185, -29029, -50640, 182508, 245169, -75981, -31838, 199469, 216140, 232414, 251950, -40923, 188211, 131845, 282925, -12974, -106816, 353155, -18842, 172497, 417242, 58684, 306984, 291936, 280585, 194620, 180803, 97207, 395479, 252567, 63681, 144013, 408505, 132291, 240355, 352661, 360724, 277532, -11436, 19719, 93899, 502549, 181054, 5467, 248426, 554713, -42518, 41834, 303432, 295986, -489, 323467, 361335, 127940, 77459, -153396, 246389, 76196, 91422, 293800, 149711, 370212, 152957, 40399, 317330]
15017C17330B0463K30600F1286K45420j45210P7054J15601J1710A76823J20639
15007B97462A19664K47746A40047E4054J94525c7942C01054A40054l3864J07119
14997B13309p5174E2835K23663b1544A23337K4160J32690q9263a6579A44441K15871
14986C60312D5356M3508L31569j72298Q4402A17095J15650l809j6975K79306j28405
14975C62862j53729m2977J46658A41790J07260L64373j79158A72360k8961a7532
14964f9293B81007A31473J02379P4602m1005K46219A23172a51921B22220p5872
14954A46348J22179j04915M6435d2242D89471q5694H1947a469B42422I5895L80912
14943D76807j03319A13417L03769A17273K46008I1976L17132j23506Q1698j8803
$$ y = [317330, 20463, 251063, 61286, 306706, 161496, 238550, 354151, 365861, 176823, 297462, 119664, 367410, 140047, 54054, 248579, -37942, 301054, 140054, 106190, 213309, 138135, 52835, 276498, -21544, 123337, 147497, 280187, 190924, -16579, 144441, 360312, 45356, 88864, 420433, 248135, 332537, 117095, 232745, 228936, 211961, 491267, 362862, 209133, 166156, 312814, 141790, 249050, 613423, 434265, 172360, 143399, -17532, -69293, 281007, 131473, 233852, 308454, 267449, 513668, 123172, -151921, 222220, 146348, 268527, 163612, 210047, -42242, 489471, 403777, 81947, -1469, 242422, 95895, 476807, 373488, 113417, 417186, 117273, 363281, 91976, 409108, 285602, 367300, 348497]
14933C48497j115j0925J86111j26727A76289O8581J47154p2928H9528J81153j11479
14922A59202J9018M27885k60015K28599k68467M4358K35519j63172O6179K8952
14912E18058l404j06523k00055M76847o4470B26200l4695p0201K54300L0712j10070
14901B96246c3977C96685o9882R7179A54472J32709P675P894J21549j48260L17922
14890E93961n2553A96403P4888K11640B15575L50582r9393k18735J18634J15114
14880D81777o2291k3034j20482R6315m2702J68234m0606l1393j48988j15471J66809
14869C28168L88484A34346K30311k594j59455N23933l19647j80004L13224B21351
14858C24516K17271M4485k12516J29733Q6983K4481A47383K13044l188j1109a74
$$ y = [348497, 347382, 336457, 522568, 395841, 176289, 244870, 392024, 319096, 89528, 270681, 159202, 178220, 606105, 346090, 574689, 306222, 350580, 586099, 422927, 489106, 518058, 514654, 408131, 208076, 684923, 620453, 226200, 191505, 121304, 375604, 406316, 296246, -33977, 396685, 326803, 423982, 154472, 287181, 294856, 302750, 424299, 276039, 593961, 541408, 196403, 271291, 482931, 215575, 566157, 466764, 248029, 366663, 481777, 419486, 396452, 275970, 372285, 329583, 497817, 457211, 425818, 276830, 161359, 328168, 716652, 134346, 364657, 362063, 202608, 726541, 406894, 226890, 540114, 221351, 324516, 541787, 586272, 373756, 503489, 590472, 614953, 147383, 360427, 357239, 346130, -174]
14846E38111r3085j31209L30659l15066J11898O2455j93639q6404L87685j26949
14836D84456N2373j98649L1980j9743J73353p555K54184j63358j78456J34493
14826E63078P9629p7813B32200O15967D10355P6409j19942P0105j12704j00395
14816B23828L25232B16152L58291B10386K90272P4721B84756L22657A99872L86042
14806E85914j07785K60991C08430L43646K46251l08313K45439C20410J19951k8534
14796D11827J27870J47744Q963l09861J9415J55271K1576L25248r0398q0311l42447
14785C94897J94959N2410K0728Q257l4285K09605J6924o4514k29579j95265o490
14774C67647J66511J31134K48486j02520k95740M00131L3702l40641J55391j35300
$$ y = [538111, 445026, 313817, 644476, 329410, 441308, 503763, 310124, 223720, 611405, 484456, 536829, 338180, 370160, 350417, 523770, 516215, 770399, 607041, 428585, 563078, 642707, 564894, 232200, 848167, 410355, 486764, 366822, 436927, 324223, 223828, 549060, 216152, 574443, 210386, 500658, 575379, 284756, 607413, 199872, 585914, 478129, 739120, 308430, 652076, 898327, 590014, 835453, 320410, 440361, 411827, 539697, 687441, 696404, 386543, 405958, 561229, 582805, 908053, 817655, 737344, 394897, 589856, 642266, 662994, 671251, 636966, 846571, 863495, 798981, 569402, 374137, 367647, 534158, 665292, 913778, 811258, 515518, 915649, 949351, 608710, 764101, 628801]
14764F28801M51188l74130O5483l03569N32506l46618k06651M59936l44151P3910
14754F36705j27229K07514k78334J85456J39694M1245o0844K9137j13731L32857
14744I92470m45279L7933k8910K81378B32977L77127M0884K36826l1166m7517
14734H09131K4066j30743L39894j88270k09415J32533r383J11932r1771N9760
14724H47734J96652o7222J09554m97166J50256J66261K4721j1581j30602l9704
14714G48903R2236l26989M46396j39243l0524n8748J20345L120R9708j75090K08845
14703I88959J02489k77579J93520M1831l1960L1085j96139L08187k53750k09690
14693F96953o2594L30885n2423J51896k36982Q8440k19674O40336k41850n4251
$$ y = [628801, 1079989, 705859, 771342, 467773, 1000279, 653661, 447010, 906946, 562795, 636705, 509476, 716990, 438656, 624112, 763806, 805051, 744207, 773344, 659613, 992470, 547191, 585124, 556214, 837592, 232977, 610104, 650988, 887814, 856648, 809131, 833197, 702454, 1042348, 854078, 644663, 777196, 767813, 879745, 787974, 847734, 1044386, 977164, 1086718, 589552, 739808, 906069, 930790, 919209, 788607, 748903, 841139, 514150, 960546, 821303, 790779, 732031, 852376, 855496, 955204, 780114, 988959, 1091448, 813869, 1007389, 1049220, 1017260, 1048345, 852206, 1160393, 906643, 696953, 634359, 965244, 912821, 1064717, 827735, 916175, 696501, 1336837, 1094987, 1040736]
14683A040736l6470j50518j81521N7540j16278M11199K36735K9670n84226M04217
14673A111084j13732M43530m70907Q1767K4786J19099k6254j39682J17889J02212
14663A249792k39081J18686L23730m33873J65878k75100M48860l52220M21135
14654A427807k84666q9441O3311j63579P7465K79568J70046j89602j48410O2030
14644A204529o3375K82762J28803q1370N0843R5838m96867K46002K2438j39664
14634A249939L47548j41487m01380M98926p8678k65566K32245l67542M56155p770
14624A522390M3189K65248m71863K06620j02483L4528N885r8384M37940l78365
14614A464705J61735J8653j72400Q5738m62491L71253K14903L733J76572l63493
$$ y = [1040736, 1004266, 853748, 672227, 729767, 613489, 1024688, 1261423, 1291093, 706867, 1111084, 997352, 1440882, 969975, 1051742, 1076528, 1195627, 1169373, 1029691, 1147580, 1249792, 1010711, 1129397, 1453127, 1019254, 1185132, 910032, 1358892, 1006672, 1427807, 1143141, 1053700, 1117011, 953432, 1030897, 1310465, 1480511, 1290909, 1142499, 1204529, 1141154, 1423916, 1552719, 1471349, 1522192, 1618030, 1121163, 1367165, 1389603, 1249939, 1597487, 1456000, 1054620, 1553546, 1474868, 1209302, 1441547, 1074005, 1530160, 1522390, 1565579, 1830827, 1358964, 1565584, 1463101, 1497629, 1503514, 1405130, 1843070, 1464705, 1626440, 1645093, 1472693, 1558431, 1095940, 1467193, 1682096, 1685829, 1862401, 1498908]
14604A498908r4759L59112q7101o06796Q91331j74373j75314J10527J4310N2366
14594A788211J11041j79107K66739p7339j78959N9981Q9026j01677K84598r4738
14584A967776k57404L61481k27266K20995k8177j94798N15616l54007K21171k39077
14574A986310r2983N53069m9832j54686K39563p5976j14552N0146j19802m0710
14564B180547K53942l64329L68565l68105N16741j41269L34238k12977L0148l8503
14554B558998Q8299n1289j73875K39616J72231J35604k23394P1673M49161r0985
14544C176039K76588L10135q5475L86203N3173N31886K53187P68418Q16528J702562
14534H189244K822000L987755O837315J0735111j197575j2140284o539925m864721
$$ y = [1498908, 1404149, 1763261, 1676160, 1069364, 1960695, 1786322, 1611008, 1721535, 1735845, 1788211, 1899252, 1720145, 1986884, 1909545, 1730586, 1790567, 1879593, 1777916, 2062514, 1967776, 1710372, 2071853, 1844587, 2065582, 2037405, 1842607, 2358223, 2004216, 2225387, 1986310, 1893327, 2446396, 2396564, 2241878, 2481441, 2405465, 2290913, 2341059, 2221257, 2180547, 2434489, 2070160, 2438725, 2070620, 2587361, 2446092, 2780330, 2567353, 2597501, 2558998, 2647297, 2596008, 2422133, 2661749, 2833980, 2969584, 2746190, 2817863, 3267024, 3176039, 3452627, 3762762, 3677287, 4063490, 4116663, 4648549, 4901736, 5670154, 6486682, 8189244, 11011244, 14998999, 21836314, 32571425, 31373850, 19233566, 12693641, 7828920]
14526G828920j818859j800539k67244o65711k5131n07972K34978p8169l27183
14517B573090J47016m3315J67325j93271r1097L45180O7245J44751j77422k45200
14507B694302r3808L84855J54260l1493q9520K45654p7848P8316j76642J25516
14497C213592m03121K45712K56637j75661K05614L93452k43273J25953j86945
14488C431960L66194k71024K96698l31852L52089n6221n1598q6487J69985K90496
14478D110240k40972L36541j93297R1797p4582L33793l32377L21552l1033Q4808
14468D406470j7754m4413R0397K23803k3911j23643L83248J79069o2009j7112
14458D994145j57783J61948k3656M23092m2277k95297L92822j64350M76806j30517
$$ y = [7828920, 6010061, 4209522, 3942278, 3276567, 3251436, 2743464, 2978442, 2900273, 2573090, 2720106, 2676791, 2844116, 2650845, 2559748, 2904928, 2972173, 3116924, 2939502, 2694302, 2600494, 2985349, 3139609, 3108116, 3018596, 3264250, 3186402, 3264718, 3088076, 3213592, 2810471, 3056183, 3312820, 3137159, 3342773, 3736225, 3492952, 3618905, 3431960, 3798154, 3527130, 3823828, 3491976, 3844065, 3787844, 3736246, 3649759, 3819744, 4110240, 3869268, 4205809, 4012512, 4104309, 4029727, 4363520, 4031143, 4352695, 4321662, 4406470, 4388716, 4344303, 4434700, 4658503, 4634592, 4510949, 4894197, 5073266, 5011257, 4994145, 4836362, 4998310, 4974654, 5397746, 5355469, 5060172, 5452994, 5288644, 5765450, 5634933]
14448E634933k45212j2221N76526m17679L56206j50137L58287l38443J00213L00917
14438F163390k73170L68489J00215R9421L2250M3314M54185n05584K82638J04368
14428F869516K90356p8711l8290l9010J7404M82883k02815J49970K81028K90783
14418H023114k46691r8820K95877J19440L39109j09528R3616L17271R1008K41278
14408I065674j72798J95149J84605K31898m8207K88719K33562n8912j01110N50572
14398A0369152J31863N90K56142J30213J77503k844J57888K29516L57402o9574
14388A1737851J39531K53340L05718m1964L46322N46046m33128N48573Q4490L53542
14378A3840321K93094J49039L04613L95513O6911J29378K71165L16367L60125
$$ y = [5634933, 5389721, 5377500, 5954026, 5536347, 5892553, 5742416, 6100703, 5762260, 5862473, 6163390, 5890220, 6258709, 6358924, 6458345, 6490595, 6533909, 6988094, 6482510, 6765148, 6869516, 7159872, 7081161, 7042871, 7003861, 7021265, 7504148, 7301333, 7451303, 7732331, 8023114, 7776423, 7677603, 7973480, 8092920, 8432029, 8322501, 8416117, 8733388, 8824396, 9065674, 8892876, 9088025, 9272630, 9504528, 9456321, 9745040, 9978602, 9919690, 9818580, 10369152, 10501015, 10501605, 10757747, 10887960, 11065463, 11062619, 11220507, 11450023, 11807425, 11737851, 11877382, 12130722, 12436440, 12394476, 12740798, 13286844, 12853716, 13402289, 13486779, 13840321, 14133415, 14282454, 14587067, 14982580, 15049491, 15178869, 15450034, 15766401, 16126526]
14369A6126526J61938K04503J97802L61995M49334M51227k1061O58694J67709
14360A8758667J81689N97989L64964K34548N89473Q1315R62744L95601K35638
14351B2402628K59166O65661P41806N42438j02110R20158O38645M61549N17840
14342B7047781M62674J027570J04155Q99620Q54353K42358M49570J220850P70541
14333C3079472J109277O79818R86190J222640M72393J061798J130512P60540J401675
14324D1904315N62042J831935J245370Q82814J091161J521378J447066J319435
14316E1805516J922163J501094J849541J698313J471814K179820J784434K523174
14308F6735869J910061J967253K451575K794430K481525K495741L226783K936472
$$ y = [16126526, 16288464, 16492967, 16690769, 17052764, 17502098, 17953325, 17932264, 18590958, 18758667, 18940356, 19538345, 19903309, 20137857, 20727330, 20808645, 21771389, 22166990, 22402628, 22661794, 23327455, 24069261, 24611699, 24509589, 25429747, 26068392, 26529941, 27047781, 27510455, 28538025, 28642180, 29541800, 30396153, 30638511, 31088081, 32308931, 33079472, 34188749, 34868567, 35854757, 37077397, 37549790, 38611588, 39742100, 40502640, 41904315, 42466357, 44298292, 45543662, 46426476, 47517637, 49039015, 50486081, 51805516, 53727679, 55228773, 57078314, 58776627, 60248441, 62428261, 64212695, 66735869, 68645930, 70613183, 73064758, 75859188, 78340713, 80836454, 84063237, 86999709]
14300H6999709L276295L019687L637496L848807L885114L869970M203756M898438
14292A17639272M767551M824782N521881N575967N996966O322128O719654P251955
14284A64620156P640535P605790Q672416Q560715R381397R841906J0344359J0676574
14276B37343848J1360207J2318176J2345564J2995313J3359896J3894170J4556556
14269C28173730J4699462J5150452J4217970J3590778J2842355J1578482J0826695
14262D21079924R941921Q872816P944022O826801M411750J917936J555524P98538
14254D63349232k128960o408908n729768q509869j0437891j0986966j1419259
14247D07727611j2778639j2450552j2791488j3304933j3312894j3352810j3479781
$$ y = [86999709, 90276004, 93295691, 96933187, 100781994, 104667108, 108537078, 112740834, 117639272, 122406823, 127231605, 132753486, 138329453, 144326419, 150648547, 157368201, 164620156, 172260691, 179866481, 188538897, 197099612, 206481009, 216322915, 226667274, 237343848, 248704055, 261022231, 273367795, 286363108, 299723004, 313617174, 328173730, 342873192, 358023644, 372241614, 385832392, 398674747, 410253229, 421079924, 431021845, 439894661, 447838683, 454665484, 459077234, 460995170, 462550694, 463349232, 461220272, 454811364, 449081596, 440571727, 430133836, 419146870, 407727611, 394948972, 382498420, 369706932, 356401999, 343089105, 329736295, 316256514]
14240C16256514j3310226j2933470j2227521j2175526j2102457j1887428j1235050
14233B30384836j1089811j0746934j0061787r474935q753705q452271q311220
14226A63494173p385739p354450o922841n679390o286321n472495n460303n047022
14218A13885612m905973l983161m026748m354316l991466l545253l579475k928338
14210H2570882l197391l021172k481124k884948k411225k040817k388884k203650
14202F1941671j767448k193629j861148j463911j721909j417429j661665j387598
14194D8466934j508055j206431j011619j335833j254749j411405j191616r24782
14186C8622444j079010q17283j009030p82311r10429p25754j095382o66087o89699
$$ y = [316256514, 302946288, 290012818, 277785297, 265609771, 253507314, 241619886, 230384836, 219295025, 208548091, 198486304, 189011369, 180257664, 171805393, 163494173, 156108434, 148753984, 141831143, 136151753, 129865432, 124392937, 118932634, 113885612, 108979639, 104996478, 100969730, 96615414, 92623948, 89078695, 85499220, 82570882, 79373491, 76352319, 73871195, 70986247, 68575022, 66534205, 64145321, 61941671, 60174223, 57980594, 56119446, 54655535, 52933626, 51516197, 49854532, 48466934, 46958879, 45752448, 44740829, 43404996, 42150247, 40738842, 39547226, 38622444, 37543434, 36726151, 35717121, 34934810, 34024381, 33298627, 32203245, 31537158, 30847459]
14177C0847459j003785l57370p97061r92557k88059r57573m37566n84224p92860
14168B4636404l80501m31451l96039o84818k32761p63810k12245o28551m21621
14159B0484607k42334m13038j32661n59858n54530j24816m83492k5472p20715
14150A7227691k19646k88167l06092o2651q20082j7889j03014j72349m98787k68011
14140A4471003k58411P7809n92351j71824k94736J48292o19169p7604J26751n96795
14130A2212965P3708n39943M2680M7396m73920j29298l56675L69706m91413n7556
14120A0697650o22576K04604q1273j24110J12605m66972j94582J8691n04971j005
14110I038061M4139k04751K6649J09032k66450k30783j71556j76881r862J73312
$$ y = [30847459, 29843674, 29486304, 28689243, 27696686, 27408627, 26451054, 26013488, 25429264, 24636404, 24255903, 23824452, 23428413, 22743595, 22510834, 21747024, 21534779, 20906228, 20484607, 20242273, 19829235, 19696574, 19136716, 18582186, 18457370, 17973878, 17948406, 17227691, 17008045, 16719878, 16413786, 16351135, 15531053, 15513164, 15410150, 15237801, 14739014, 14471003, 14212592, 14290401, 13698050, 13526226, 13231490, 13379782, 12760613, 12683009, 12809760, 12212965, 12286673, 11746730, 11789410, 11836806, 11362886, 11233588, 10876913, 11246619, 10755206, 10697650, 10075074, 10279678, 10198405, 10074295, 10186900, 9719928, 9525346, 9544037, 9039066, 9038061, 9082200, 8877449, 8904098, 9013130, 8746680, 8515897, 8344341, 8167460, 8157598, 8330910]
14100H330910o43655K25003j49337l40351j00331n0639M1596k3944k76446r9018
14090F913788J27357j71907J26790j19527j40814r8662j46971l21183K33326j43801
14080F258396J12203O6665l09493l03663K67308k81363J46139j82524M534j03290
14070E674912q9569n3721j38304K76664o20931J44653L1307l58821k2144J07512
14060D951558K19399k20475Q6598l73364J52090o6870M3541j39766k15766R3876
14050D530821J74322m4528m27082J15715k27491K24003m6219j14121P7561j98175
14040D064806K70340k76638K62450l73071K54088j74385k75271R692k30608N15985
14030D047388m25264L1277k36342K70298j63576N728o206M6921J10680n55789
$$ y = [8330910, 7687255, 7912258, 7762921, 7422570, 7322239, 7271600, 7313196, 7289252, 7012806, 6913788, 7041145, 6869238, 6996028, 6876501, 6735687, 6637025, 6490054, 6168871, 6402197, 6258396, 6370599, 6437264, 6127771, 5824108, 6091416, 5810053, 5956192, 5773668, 5778202, 5674912, 5585343, 5531622, 5393318, 5669982, 5049051, 5193704, 5225011, 4866190, 4844046, 4951558, 5170957, 4950482, 5037080, 4663716, 4815806, 4748936, 4792477, 4652711, 4436945, 4530821, 4705143, 4660615, 4233533, 4349248, 4121757, 4345760, 4299541, 4185420, 4262981, 4064806, 4335146, 4058508, 4320958, 3947887, 4201975, 4027590, 3752319, 3762011, 3531403, 4047388, 3622124, 3653401, 3417059, 3687357, 3523781, 3529509, 3523303, 3570224, 3680904, 3125115]
14020C125115M15846J02789l85820K07661J35692o56868J68464J77201K36796
14011C526876m36649m7728Q8951J4685j38591J34506o2791j66109K34313j84240
14001B963223m42632J61761J02482o2320l6234j3922K51992k66510L41282q1259
13991B917863l71585N985J25656P5720j15810o9070O1303q3982l7532J34019j16526
13980B526041L92877J74385p4002N54878N35629J051782J671744L551110O395999
13971A6780443J1541217M290449j1070060p133878m602769k230396j811260k70933
13963E492813p76322j9089o28771j73807l50313m13866J25724q3033k18511o00551
13953B354274O66109o4188n12762L49220k16278q9640Q4002l21266K88880J51940
$$ y = [3125115, 3540961, 3643750, 3257930, 3465591, 3601283, 2944415, 3112879, 3290080, 3526876, 3090227, 3042499, 3131450, 3146135, 3007544, 3142050, 3079259, 2913150, 3147463, 2963223, 2520591, 2682352, 2784834, 2722514, 2686280, 2672358, 2924350, 2657840, 2999122, 2917863, 2546278, 2552263, 2677919, 2753639, 2637829, 2568759, 2630062, 2546080, 2508548, 2642567, 2526041, 2918918, 3093303, 3019301, 3574179, 4109808, 5161590, 6833334, 10384444, 16780443, 28321660, 32612109, 21542049, 14408171, 9805402, 7575006, 5763746, 5492813, 4716491, 4697402, 4068631, 3894824, 3544511, 3130645, 3256369, 3173336, 2954825, 2354274, 3020383, 2956195, 2443433, 2792653, 2576375, 2486735, 2570737, 2249471, 2538351, 2690291]
13943B690291m27829J19113o78263K25057J49431K97697k83706J09318j59561
13934B041548J95453k22699J21434n9465J13248l09918L68670j22303j22643l8529
13924A964796Q0219l81211J93808j90787p3805K96868R4385r2253j60743j2807
13914A718470M09543k28606j9706p504j08005p7458J24014j66579o2677L15903
13904A897395r5760k2133Q5329j01745m7968l03452L72159K47460k97372L275
13894A737188j88665K38673j60845J2801k77112L33212j84190m9662M9636j98457
13884A312579K93433j23132l36310K59741j40383K39501k95803J21356K438Q7940
13874A421360K2120k93346P25335p39872j9750L75171m05918K18529j81057L28837
$$ y = [2690291, 2262462, 2381575, 1703312, 1928369, 2077800, 2375497, 2091791, 2201109, 2041548, 2237001, 2014302, 2135736, 2076271, 2189519, 1879601, 2248271, 2125968, 2003325, 1964796, 2045015, 1663804, 1857612, 1666825, 1593020, 1889888, 1984273, 1892020, 1731277, 1718470, 2128013, 1899407, 1879701, 1872197, 1764192, 1686734, 1810748, 1644169, 1581492, 1897395, 1801635, 1779502, 1864831, 1763086, 1715118, 1411666, 1783825, 2031285, 1733913, 1737188, 1548523, 1787196, 1626351, 1639152, 1362040, 1695252, 1511062, 1461400, 1511036, 1312579, 1606012, 1482880, 1146570, 1406311, 1265928, 1505429, 1209626, 1330982, 1333420, 1421360, 1443480, 1150134, 1875469, 1135597, 1115847, 1491018, 1085100, 1303629, 1122572, 1451409]
13864A451409m3029r447L3783J43126l76674j57778M57468l00212o1861k7748
13854A109037K71159M42486n71571j1216K51401j88561M1593M3640j31285j51440
13844A105243K26412n2548J23785j64799k06701J37002j24683K7884L60296m64228
13834I67663q0255J39714l0057J90313k61694L79670l49248J21472r2836j46745
13824H37997O58327l58204k83946L30908j98465K4787k5598R6233r5335j29489
13814H57215N39977n42365L38255J5936m09562M19709l81234J53395m6180m6735
13804H98411k22687K99927j6039K20164l36198J43721k09089L22181l73048R8734
13794H26077M23206l44291K5052j82391J98010M8675o7795J3076m61606M67366
$$ y = [1451409, 1408380, 1398933, 1432716, 1575842, 1199168, 1041390, 1498858, 1198646, 1136785, 1109037, 1380196, 1822682, 1251111, 1239895, 1491296, 1302735, 1344328, 1387968, 1256683, 1105243, 1331655, 1279107, 1402892, 1238093, 1031392, 1168394, 1043711, 1071595, 1431891, 967663, 887408, 1027122, 997065, 1187378, 925684, 1305354, 956106, 1077578, 984742, 837997, 1496324, 1138120, 854174, 1185082, 986617, 1011404, 985806, 1082039, 986704, 857215, 1397192, 854827, 1193082, 1209018, 799456, 1219165, 837931, 991326, 945146, 898411, 675724, 975651, 959612, 1179776, 843578, 987299, 778210, 1100391, 727343, 826077, 1249283, 904992, 930044, 747653, 945663, 994338, 926543, 939619, 478013, 945379]
13784I45379K00078m71873j47050L85791k75750K86287M8696K00208p520r5621
13774A068625D55858L60231j39625M24984l67960j41152M07583k3050j81122J38614
13764I34361p8570k3356J34755j08121k35024L29786j26985L1220J77277m00895
13754F34448K21590N3153J45454o8870l11810k2057K78928j43665p999j49052
13744F30120M04983j02528l75135J49799M3593n6288K26752j68035J50283l97621
13734E05923O8251O2496L59469D25503R8184k10182N07026l86188J13967J59667
13724G07977k09270K03501I3193O45013p7194J70300j95837k60851J43693K19175
13714G37492l0289m1597k61873L42445J19773k53651o7968J11081P633l7014j02890
$$ y = [945379, 1145457, 673584, 526534, 912325, 636575, 922862, 971558, 1171766, 1164246, 1068625, 455858, 816089, 676464, 1101448, 733488, 592336, 999919, 976869, 795747, 934361, 855791, 832435, 967190, 859069, 624045, 953831, 826846, 858066, 1035343, 634448, 856038, 909191, 1054645, 985775, 673965, 651908, 930836, 787171, 779172, 630120, 1035103, 932575, 557440, 707239, 750832, 694544, 921296, 753261, 903544, 505923, 574174, 636670, 996139, 425503, 523687, 313505, 820531, 434343, 548310, 707977, 498707, 702208, 93193, 738206, 661012, 831312, 635475, 374624, 518317, 737492, 707203, 665606, 403733, 746178, 865951, 612300, 544332, 655413, 663046, 626032, 523142]
13703E23142N27920l53701K3488k61982J0391k6955L39013B76070J13418K62806
13693F52294k79911K01929J07665M6603K2509k00616j0818j61477J39876K00747
13683G18801J70207l13254j43150J62803O9368j15050L00109k76675K24356C78864
13672C44233M3426K89695l33451L20976j02917B00570M5606K44363j36969L92429
13662G45999M3509B75344L03382j01667r9080L29039k50417L8387k28455M16010
13652F82543j10163k27980M9648j6645J25294K21306j56362j09060m8934k3850
13642C85797k7715L4801J4674J19676k48047J65256j1393L89016l93013k5979
13632D03073K87424j71249B04764j9569K18132j77278O26328j18841p5924A02392
$$ y = [523142, 1051062, 697361, 720849, 458867, 469258, 442303, 781316, 276070, 389488, 652294, 372383, 574312, 681977, 728580, 751089, 550473, 539655, 378178, 518054, 718801, 889008, 575754, 432604, 595407, 664775, 549725, 849834, 573159, 797515, 378864, 344233, 387659, 677354, 343903, 664879, 561962, 200570, 246176, 490539, 353570, 745999, 789508, 275344, 578726, 477059, 377979, 707018, 456601, 494988, 266533, 682543, 572380, 344400, 394048, 377403, 502697, 724003, 567641, 458581, 409647, 385797, 358082, 392883, 407557, 527233, 279186, 444442, 433049, 822065, 429052, 403073, 690497, 519248, 204764, 185195, 403327, 226049, 852377, 733536, 657612, 102392]
13621A32257J54144R1334J43237q2303B6659M23687j65700J71966n7384J66250
13611E65478Q3983j91135J4474J8371J14341j35983J193q3523J3456j67805K21091
13600D53941Q8737Q2330j69773n8001o941m4015K25670j74343j21197K20341L1403
13589E28152j62089J7455K16069k12986m02M5134M0995I4012L64476J2963B30801
13577B97534J59361p6068A48751J59546l3985L23874j86023A86614L4125L76584
13567E97323k38463M5483J37440j63352M1416A05705Q1717R1584J99396J84725
13557F63127G1886K20733N0138A4329K41809L9797N2651J08812N4634B29005K22198
13546D51203J80246k51211q462r5792J49458O0678I8473M50484k11844O8223m0376
$$ y = [132257, 286401, 377735, 520972, 438669, 26659, 450346, 284646, 456612, 399228, 565478, 649461, 458326, 472800, 491171, 605512, 469529, 470722, 387199, 400655, 232850, 453941, 542678, 625008, 455235, 397234, 390293, 346278, 571948, 397605, 276408, 496749, 528152, 366063, 383518, 599587, 386601, 386199, 431333, 472328, 94012, 458488, 471451, 230801, 297534, 456895, 380827, 148751, 308297, 274312, 598186, 412163, 186614, 220739, 597323, 358860, 404343, 541783, 378431, 419847, 105705, 187422, 279006, 478402, 663127, 71886, 292619, 342757, 14329, 256138, 295935, 348586, 457398, 512032, 229005, 451203, 631449, 380238, 371776, 275984, 425442, 486120, 98473, 548957, 337113, 405336, 364960]
13535C64960P494j48519j6608J76424j33914I690J66069K37325A69390L91660
13525E61050j81644l8894J66172A33655Q9833K01405K0556G3099K86873K13877
13515E73849j1460B75739l5513J94317j94323K37444A72611Q5831J55171j28167
13505B85446F8898K85291A43713J72235k1626l6546L32319j7151B79425K9966
13495C09391n2608I9326K89941J08848A27074J51166K2853J42990A2148J40056
13485A52204J17935j05208L10399A00856K54277j34280C8096J61388J82994j11833
13475B70645q4531J81125A78649k8054n2350J76812L4436K23722B8750N5981a1827
13463D56255r7851i2606B44498M3020K36222b77557D06955A98852H7631L3164
$$ y = [364960, 372454, 223935, 207327, 383751, 249837, 9690, 175759, 413084, 169390, 561050, 379406, 340512, 506684, 133655, 223488, 424893, 445449, 73099, 359972, 573849, 562389, 275739, 240226, 434543, 240220, 477664, 172611, 258442, 413613, 285446, 68898, 354189, 143713, 315948, 294322, 257776, 590095, 572944, 279425, 309391, 256783, 99326, 389267, 498115, 127074, 278240, 301093, 444083, 12148, 152204, 270139, 164931, 475330, 100856, 355133, 220853, 38096, 199484, 382478, 270645, 186114, 367239, 178649, 150595, 98245, 275057, 309493, 533215, 28750, 84731, -11827, 456255, 358404, -92606, 244498, 287518, 523740, -277557, 406955, 198852, 87631, 120795]
13453A20795J09717j5543K6055J86183A84531J70897I7645R3661J4266K18319
13443D23891j09399r0570F4137K44350a64C21108j7864a53422B38797P5967B9800
13431B61267p2133J44126l509F1441M15157B00265J60689E9848Q6967a4412C76019
13419B58263R8475o6138A39782n1388K01713j196K31396A95558J26039I5852l2803
13408F3049K34598k6757A09968L97285k00107J24433p6558b51262C01720E9931
13397D6472J64589E4847K59059G6767Q2755K82646I5383M55443B61631m4640K16745
13386D33736A27913O8976j6902n7739J68907j41038l7170J72558F2922j6428J75409
13375B21903G3043M72827A39582J13748B038J19292J03341I1058J41683N5305
$$ y = [120795, 230512, 214969, 241024, 427207, 184531, 355428, 97645, 191306, 205572, 423891, 314492, 223922, 64137, 308487, -164, 321108, 303244, -153422, 238797, 314764, 29800, 261267, 189134, 333260, 329751, 61441, 476598, 200265, 360954, 59848, 146815, -14412, 376019, 258263, 356738, 290600, 139782, 88394, 290107, 288911, 520307, 195558, 321597, 95852, 63049, 297647, 270890, 109968, 507253, 307146, 431579, 355021, -251262, 301720, 59931, 46472, 211061, 54847, 313906, 76767, 159522, 442168, 95383, 550826, 261631, 216991, 433736, 127913, 196889, 179987, 122248, 291155, 150117, 112947, 285505, 62922, 46494, 221903, 73043, 545870, 139582, 253330, 2038, 121330, 224671, 91058, 232741, 288046]
13365B88046p2981p9837e7096A39782L3587C9554K43505A19779J33757J85286
13355D38822q8004q4441K7794f0103C04571F3002K89383H5224L21241D8316M17821
13344D66137A13686C9930P0106L75258I5184K98409Q3358A7208K15579N44j5045
13333B18286H5374K46396j13711K8090o531J28106j72742J01392J02526j17688
13323B81212o6470Q3184K02896A71782Q1320j8608I9731J98253r1810I7K63976
13312B64073a5698F5650L93736F103L58338j01352K25825A05584K32955j58162
13302A80377O9818J0753D5258K70208q5396E7317b48048A71589a77574B6320K94411
13291C20731j44889a82824B51499D0213L50748A81637H8608j8496a81363G4776
$$ y = [288046, 215065, 135228, -57096, 139782, 173369, 39554, 283059, 119779, 253536, 438822, 350818, 266377, 294171, -60103, 304571, 63002, 352385, 85224, 406465, 48316, 466137, 113686, 39930, 110036, 485294, 95184, 393593, 476951, 17208, 232787, 233331, 218286, 85374, 331770, 218059, 246149, 239618, 367724, 194982, 296374, 398900, 281212, 214742, 297926, 500822, 171782, 253102, 234494, 99731, 297984, 206174, 97, 264073, -15698, 65650, 459386, 6103, 364441, 263089, 488914, 105584, 338539, 180377, 250195, 260948, 45258, 315466, 230070, 57317, -248048, 171589, -177574, 26320, 320731, 175842, -182824, 251499, 40213, 390961, 181637, 88608, 70112, -181363, 74776]
13280A96282L27585A79305F9664j4893L98434a70134A53970l9879a10611D62122
13269a1230A92703H9714N14056F1875a49358a0728C6827R0257K24556j9924j31490
13258B00226k0989H5810J91540q1877J0144J7659I657K44178l1511F7113R8834
13247A65947d556C44280n0868B9749K17748g7830o5139C33745F882d7423A79447
13235h8256j58124A68771n815O3408I3702L02338A22764a59629B07010a02649
13224B82905q4643l1688k045D0163d2758B37469J73169C7287J15590a2954A70993
13212C52126I8838a86535C78033C8860a15673H8703K68863b436B52215b4906H4873
13200B548M5109K02353C0690A757c4132B76532G8367b79695A03853K7462f7016
$$ y = [196282, 523867, 179305, 69664, 54771, 453205, -170134, 153970, 114091, -110611, 462122, -11230, 192703, 89714, 603770, 61875, -149358, -10728, 36827, 127084, 351640, 331716, 200226, 179237, 85810, 277350, 195473, 205617, 223276, 9657, 253835, 222324, 67113, 165947, -4556, 344280, 293412, 29749, 247497, -77830, -142969, 333745, 6882, -47423, 179447, -88256, -246380, 168771, 162956, 226364, 93702, 396040, 122764, -159629, 207010, -102649, 282905, 198262, 166574, 164529, 40163, -42758, 237469, 410638, 37287, 152877, -12954, 170993, 352126, 98838, -186535, 378033, 38860, -115673, 88703, 357566, -2436, 252215, -24906, 84873, 2548, 47657, 250010, 30690, 1757, -34132, 276532, 78367, -279695, 103853, 131315, -67016]
13188c7342B2099J75294b1397A66595b45033E5343J89898b29336b265A22563o119
13177A16444J9710K76328e2140B12296C2413b61574H2719L2778J20289b6452A54045
13165A44654a22885o5687A41418A3271d8354A67992p3912b14371R4506a8882B24468
13153I6158r13l3123J28178a29306l6196B15721n4580M21833B0853J3221d0438
13141D06859j64347o1122b62249C50112b57605H885L60019r7566a58567E3424
13130B01203a55802f968k01425D8513R3772b4703C46223F7445P5215J61090J103
13119C04853A42322J11456i3900D74452k11920E0708b0795O319l31454C32697
13108C09993a31925B63713K76088c5785C67687F9433L9008J01443h1662c5980
$$ y = [-37342, 22099, 197393, -21397, 166595, -245033, 55343, 245241, -229336, -2265, 122563, 116444, 136154, 412482, -52140, 212296, 32413, -261574, 82719, 115497, 235786, -26452, 154045, 144654, -122885, -188572, 141418, 13271, -48354, 167992, 94080, -214371, -119865, -18882, 224468, 96158, 95245, 62122, 190300, -129306, -165502, 215721, 161141, 582974, 20853, 34074, -40438, 406859, 242512, 181390, -262249, 350112, -257605, 8885, 368904, 271338, -158567, 53424, 201203, -155802, -6968, -208393, 48513, 142285, -24703, 346223, 67445, 142660, 303750, 304853, 142322, 253778, -93900, 474452, 262532, 50708, -20795, -14476, -345930, 332697, 309993, -131925, 263713, 539801, -35785, 367687, 69433, 108441, 209884, -81662, -35980]
13097f1906j65816B72833F3068J19279n297n6982a24920A99181a40416I7141K1362
13086A18503a48209G9598g7327j29269B32086G8053K7947d0760B95021j39301
13076A55720c3841A81912F1878B534Q4764d5970D99366c8723A35444J27C055K79613
13064B82668M410n3082d7804I8023b574C53503A11686a18007a9423B57767c2527
13052A26615E7764A0269e782D8002R9995K45117A317f2691o5695k7443A10544
13040A22746h5842H3911k6470K16932B8089L23256C387J02898J35981H0196B1954
13028A96088a94361B92445c05308H6963Q6933J83432i730B2738b6280C2900a12574
13016C52608j42319p8715e6893A19105J89804F435K52435J7159J71398a1411E6230
$$ y = [-61906, -227722, 272833, 63068, 182347, 177050, 120068, -124920, 199181, -140416, 97141, 118503, -148209, 79598, -77327, -206596, 232086, 78053, 106000, -40760, 295021, 155720, -33841, 181912, 61878, 2534, 87298, -45970, 499366, -38723, 135444, 135571, 3055, 282668, 287078, 233996, -47804, 98023, -2574, 353503, 111686, -118007, -19423, 257767, -32527, 126615, 57764, 10269, -5782, 48002, 147997, 393114, 1317, -62691, -128386, -155829, 110544, 122746, -85842, 83911, 57441, 274373, 28089, 351345, 3387, 106285, 242266, 80196, 21954, 196088, -194361, 292445, -305308, 86963, 173896, 357328, -9730, 22738, -26280, 32900, -112574, 352608, 210289, 131574, -56893, 119105, 308909, 6435, 258870, 276029, 447427, -11411, 56230]
13004A47500J25845q6826B5175K28189m5098Q1059J17443A67213L23247j57735
12994C32725C5736J04897K77881e1057B52599j01949q149J5248a50076B31294
12983f8403E1474c2370L219B01777p4547E5134j0549J80287J83916B976J03984
12972A06960J62221g0429B02868a5017B04787E5391K30630d7602C14542j49022
12962A65520J07055E9785c2025A88706K20702b47269A40246E5362Q9465c55652
12951A41101M5299n1980a93787d9892G4564b06345a4842j18180B26394E7546d7939
12939B00239R7944c91018K6597f4635n8117i539k30707A63472F1164B2932a17276
12927h0885D68633G4679a18438o9363c0256j41870A86555i4370A29334J11855
$$ y = [147500, 273345, 186519, 25175, 253364, 208266, 289325, 406768, 167213, 490460, 332725, 35736, 140633, 418514, -51057, 252599, 150650, 142501, 157749, -150076, 231294, -68403, 51474, -32370, -29151, 201777, 127230, 55134, 44585, 224872, 408788, 2976, 106960, 269181, -70429, 202868, -15017, 204787, 55391, 286021, -47602, 314542, 165520, 272575, 59785, -32025, 188706, 409408, -247269, 140246, 55362, 144827, -355652, 141101, 186400, 134420, -193787, -49892, 74564, -206345, -14842, -133022, 226394, 57546, -47939, 200239, 298183, -391018, -364421, -64635, -122752, -9539, -240246, 163472, 61164, 22932, -117276, -80885, 468633, 74679, -118438, -187801, -30256, -172126, 186555, -94370, 129334, 241189]
12917B41189i8062k4036q0180B81816p0983d7705k8805A3064b08442a4969l73948
12906c88917a11579B78956E0819i8234O657A31342k0402B0724M44440a51756m5734
12895a97490L0078D2124e1397j34131B59836b73353F144R3560d9530B80632j7253
12884B63379D3684N3888O9897a46568P0626F8638a2665B28968c8141D23234a20946
12872G9664a1884A06271a32618o6305f7896C24730a50307D0694J09015l2165a65148
12860c9995q038B45917J76461b44206A04973K20226p5593P12b9185j12556I0446
12848A63009M25665I7340R4882a43266L4931F3120N4887D3345c0298C71497A11281
12836B00466d55567D8940i8043E7118L4290B4369n62n84K39821r2927l5104a71748
$$ y = [241189, -98062, -122098, -202278, 281816, 210833, -47705, -76510, 13064, -208442, -14969, -388917, -111579, 278956, 50819, -98234, -91577, 131342, 110940, 20724, 465164, -151756, -197490, -167412, 42124, -51397, -185528, 259836, -273353, 6144, 99704, -49530, 280632, 263379, 43684, 97572, 167469, -146568, -75942, 68638, -12665, 228968, -38141, 423234, -120946, 79664, -11884, 106271, -132618, -198923, -67896, 324730, -150307, 40694, 149709, 117544, -165148, -39995, -48033, 245917, 422378, -244206, 104973, 325199, 249606, 250318, -29185, -141741, 90446, 163009, 588674, 97340, 192222, -143266, -108335, 63120, 118007, 43345, -30298, 371497, 111281, 200466, -455567, 48940, -98043, 57118, 91408, 24369, 23807, 23223, 263044, 170117, 135013, -171748]
12823a0735C14530C3968J45337O8284p5691o2282J18091l9077l033C3539D89K0376
12811B0865J60962H855c803D3729O500J2762J78996b3330G5465c02873b2247k31101
12799b53348F1999L3564L6438J88712j59724o9966K6084a95727k78839A27980
12788a5383o4029L2695n3372B70292P8995f4462p0949E8617g7097k08895A60552
12776D00492a56205E8715L7132J97603F2873a46506A34458l110b98393N6368K6721
12765b15304K1010F574h7522A7016h3106H6899K05022a2994E0933d8172J092K0338
12753b6742B53355D7952b9010B92491E9073b20745r7110J43866E1163B0772a68310
12741B60136I2643J35188A01826A4606L50857B9374c3023A1553N8011h3330B805
$$ y = [-10735, 314530, 33968, 179305, 247589, 171898, 109616, 227707, 188630, 185597, 33539, 489, 20865, 181827, 8855, -3803, 43729, 50229, 62991, 241987, -23330, 75465, -302873, -22247, -253348, 61999, 95563, 132001, 320713, 160989, 91023, 117107, -195727, -474566, 127980, -15383, -79412, -46717, -100089, 270292, 349287, -64462, -135411, 58617, -77097, -285992, 160552, 400492, -156205, 58715, 95847, 293450, 62873, -146506, 134458, 131348, -298393, -242025, -215304, -194294, 6574, -87522, 17016, -83106, 86899, 291921, -12994, 50933, -48172, -47080, -26742, 253355, 47952, -29010, 292491, 59073, -220745, -317855, -173989, 51163, 20772, -168310, 260136, 92643, 227831, 101826, 14606, 365463, 29374, -33023, 11553, 69564, -83330, 2805]
12729E4047e19j33642A50596h9106A41768P3880J33537E9959K2849L22518a31473
12717A25317A6282O5986R8308K5663r5975f8963q4100k6635C3778A5356L21805
12706C37161A2002J8179b16939b4277j14566k900b6522Q623A78324i4537q3862
12695a78399B40924a02946E85278j64566A52897D8486M54991C79K06203J38561
12685C45143J6379A53856b24131c304C4521K1474a2905A02358J29886j06315L5568
12674A61497a55919B02039F4004B5151O7098m2845a63123E473i9517A58303c66243
12662C91392a53230B2935I560J14141K4238J02937p6590l6121J38111J03944p9770
12651C00450J8958J67793K14345a32472f1233A91439a33525h999A47124k8905
$$ y = [54047, -519, -134161, 150596, -89106, 141768, 215648, 349185, 59959, 82808, 405326, -131473, 125317, 16282, 82268, 180576, 206239, 110264, -68963, -153063, -179698, 33778, 15356, 337161, 12002, 30181, -216939, -24277, -138843, -141743, -26522, -17899, 178324, -94537, -178399, 240924, -102946, 585278, 420712, 152897, 48486, 503477, 379, 206582, 345143, 361522, 153856, -224131, -3304, 34521, 55995, -12905, 102358, 232244, 125929, 161497, -155919, 202039, 64004, 25151, 92249, 49404, -163123, 5473, -99517, 158303, -366243, 391392, -153230, 22935, 9560, 123701, 147939, 250876, 174286, 138165, 276276, 380220, 300450, 319408, 487201, 701546, -132472, -61233, 191439, -133525, -8999, 147124, 118219]
12641A18219K36992o9947J65351A95118J30751A35K28038I2277m4389a14965A33066
12629c3796B8723R6413a28248B23115c77375E3694K02621C3494a47329o0795A12226
12617C2783c1655B00391a90468C63005O055F2646J05916k8901A4703b9336A48004
12605B35150d6409C5676R2430c86186B6541K2725n427J80050b57967C92573c94412
12593A72754C6862A6160L69451c2052j11404m4922c1394N65D8113J41833c5875
12581f7371A07495M9727J08125F6481M24746A37846e3151B07950B5723a68515
12570b17384B23547g795n2244j44605C9394K82930h0695I009d724j38568k2535
12559a65827A81315J7737J45517a83637b9825m02038a92938E56225d8867A55470
$$ y = [118219, 355211, 285264, 450615, 195118, 325869, 135, 228173, 92277, 47888, -114965, 133066, -33796, 28723, 125136, -128248, 223115, -377375, 53694, 256315, 33494, -147329, -208124, 112226, 32783, -31655, 200391, -190468, 363005, 369060, 62646, 168562, 139661, 14703, -29336, 148004, 235150, -46409, 35676, 128106, -386186, 26541, 49266, 43839, 223889, -257967, 392573, -394412, 172754, 36862, 16160, 385611, -32052, -143456, -188378, -31394, -30829, 48113, 189946, -35875, -67371, 107495, 157222, 265347, 66481, 491227, 137846, -53151, 207950, 25723, -168515, -217384, 223547, -7795, -60039, -204644, 39394, 322324, -80695, 9009, -4724, -143292, -165827, 181315, 199052, 344569, -183637, -29825, -431863, -192938, 556225, -48867, 155470]
12548G5574d2172C59182f2603a960C78039m1288a73217O5970h293r0781F0847
12536i6774B6120i0419o173q0846j3817B74881k7853a19747a628k40977D42433
12524d0218j03687B24016b25718A77905q6382J34099H8310N541a57368f650j33390
12513a40040A73909d283A77414k9582i3467K1765j21963h3823B31786b5564A26392
12501D9885a30822B80579f8642C9184c04193A21687E7280c34994B60828d2997
12490a90985N0126C174J71568e7982J4894A73481g3971a2568B92490j2755d18068
12478a2087A28080k6040C7462a15231A39209P9785P3773b1254A63949g3127C19672
12466I6324c9197l2754q2532K4932j60983f7074A00421q310c0177B53340O5922
$$ y = [75574, -42172, 359182, -62603, -1960, 378039, 336751, -173217, -107247, -8293, -99074, 60847, -96774, 26120, -90419, -96592, -177438, -191255, 274881, 247028, -119747, -1628, -242605, 442433, -40218, -143905, 224016, -225718, 177905, 91523, 225622, 88310, 93851, -157368, -6650, -140040, 173909, -4283, 177414, 147832, -93467, -71702, -193665, -83823, 231786, -25564, 126392, 49885, -130822, 280579, -68642, 39184, -304193, 121687, 57280, -334994, 260828, -42997, -190985, -140859, 3174, 174742, -57982, -43088, 173481, -73971, -12568, 292490, 279735, -418068, -12087, 128080, 102040, 37462, -115231, 139209, 218994, 292767, -21254, 163949, -73127, 319672, 96324, -39197, -71951, -154483, -129551, -290534, -67074, 100421, 92111, -30177, 253340, 319262]
12455C19262a23450A8927g942A06963A0838j279L56265i6861J1866a4730B63160
12443a06809n7674B31682a57234E3066a36762O2362B95780o2727I4593a51130
12432c04428H4704N0154A0031Q4014J20760L4888m8281a00491B20851r9744f4910
12420A24509j2303A7076J2365h4744j26090I2760K8661L250D3186O0232a18589
12408b24527h1094q3532C8667d028B36937r2100a1347k08437e0013k9101A5419
12396e5914a5283B945c17895E2348c7162D9483d4861k75755J29438A3887Q4148
12385I8035a2483D5360J0410J06213l7752a54069F3214J05407a22240K0748B19485
12373b9694n5672p0872F4478a80993F669b18520B6449a4290B30824h1784A56935
$$ y = [319262, -123450, 18927, -7942, 106963, 10838, 9559, 365824, -96861, -84995, -14730, 263160, -106809, -164483, 231682, -157234, 53066, -136762, -74400, 295780, 233053, 94593, -151130, -304428, 84704, 134858, 10031, 94045, 214805, 249693, 201412, -100491, 220851, 121107, -64910, 124509, 112206, 17076, 29441, -84744, -210834, 92760, 121421, 124671, 43186, 103418, -118589, -224527, -81094, -164626, 38667, -4028, 236937, 144837, -11347, -219784, -50013, -79114, 15419, -55914, -15283, 2945, -317895, 52348, -37162, 49483, -44861, -320616, -191178, 13887, 98035, -12483, 45360, 55770, 161983, 124231, -154069, 63214, 168621, -122240, -101492, 219485, -29694, -85366, -156238, 64478, -180993, 6669, -218520, 26449, -14290, 230824, -81784, 156935]
12361c12154c3649p0986F2769b19247B91812e5092b5216k36219i61C7388J96984
12350B34372k4446c3161D0153K30219g7124D9066a87624R1567B47848a56521F3056
12338C22827A4493a94262A21184J76089B4919a74088L0196O0233A21889a37196
12327A95300D8281P6464m5880a70440C0881a48312j84483h5395E4385L63030B3464
12315a40200B37393C7504L01379n3876b69243E3873L9274C8775b9671n3958k88178
12304c71807D1004M348a04075p1307A16248d1410B05779d75n2291A21163a18020
12292d3574A41417a40503h820j54341n0499B80709e4615A15683K2912b3041H0382
12280H4359K81982B6380J8389L67475j67076J874A08773n0009K4656J72819g3141
$$ y = [-312154, -33649, -104635, 62769, -219247, 291812, -55092, -25216, -261435, -961, 37388, 234372, 209926, -33161, 40153, 270372, -77124, 49066, -187624, -96057, 247848, -156521, 63056, 322827, 14493, -194262, 121184, 297273, 24919, -174088, -143892, -83659, 121889, -137196, 195300, 48281, 124745, 78865, -170440, 30881, -148312, -332795, -85395, 54385, 417415, 23464, -140200, 237393, 37504, 338883, 285007, -269243, 53873, 93147, 38775, -29671, -83629, -371807, 41004, 45352, -104075, -175382, 116248, -41410, 205779, -475, -52766, 121163, -118020, -43574, 141417, -140503, -8820, -163161, -213660, 280709, -54615, 115683, 138595, -23041, 80382, 84359, 366341, 26380, 44769, 412244, 245168, 247042, 108773, 58764, 83420, 256239, -73141]
12268B4734J54760g3901L1619q6370B36056a15298A88281F6836c9868a6601A19960
12256H0073R4936q4078K2609D0847a04636l7984D4897J8241b595k2381F2364J3257
12244G5621J92340c6934k9228F5483M29585p505A58092P1893q6005q313l7007
12233I8660l6267J91887A21224j1780d8474F6952R0716a05117B09044L7149J45548
12222C91741a58750E4811a1082A55590a06296k3218D14485j6745n2233j01840
12212B43667Q6870L5547p6818A14642R5561a06452F01392B4229M75025B4364J15387
12201A39751a755A50601J26724A9813M29135B02382m499F4811K86160K30306A34520
12189H5868F06e037A01194M45755a57883C6869R3335L28433A99895m7202n2604
$$ y = [24734, 179494, -73901, -42282, -128652, 236056, -115298, 188281, 66836, -39868, -16601, 119960, 80073, 175009, 90931, 113540, 40847, -104636, -142620, 44897, 63138, -2595, -24976, 62364, 75621, 267961, -36934, -66162, 65483, 495068, 487563, 158092, 229985, 143980, 135667, 98660, 62393, 254280, 121224, 109444, -48474, 66952, 157668, -105117, 209044, 246193, 391741, -158750, 54811, -11082, 155590, -106296, -129514, 414485, 397740, 345507, 243667, 330537, 366084, 289266, 114642, 210203, -106452, 601392, 24229, 499254, 24364, 139751, -1755, 150601, 277325, 19813, 448948, 202382, 197883, 64811, 350971, 581277, 134520, 85868, 606, -5037, 101194, 546949, -157883, 36869, 130204, 458637, 199895, 152693, 100089]
12178A00089J81680j06416J51757O3017A34922e3921B74274j3006C3910j1336
12168B2574b2315m2014A41446d8737C76964j60270e9944C40017H1354a04984b7633
12156B71271o0560l7418k858O3132F0263a84035B90195M2152A58660N7138j02038
12145A13760c4851A24372J71222L8875A41391j9075a7366j54106G7949A9594a06082
12133C2645a56231d086B56080B0188a3564p9993j01194I1993a56399G1884b36395
12121G7537a27949j75612E8246J74652N4784b569k17636D10235a41125C32082
12110B8781d6271q4440A76683k254a41464B96964C6087J32898a80962A49230E6281
12098E41477h2802D1827K15432j12340N7483a30268b0404H2644J2853Q7037o2965
$$ y = [100089, 281769, 175353, 327110, 390127, 134922, -53921, 274274, 261268, 33910, 22574, -22315, -64329, 141446, -48737, 376964, 216694, -59944, 340017, 81354, -104984, -27633, 271271, 210711, 173293, 170435, 233567, 60263, -184035, 290195, 332347, 158660, 215798, 113760, -34851, 124372, 295594, 334469, 141391, 122316, -17366, -171472, 77949, 19594, -106082, 32645, -156231, -4086, 256080, 20188, -13564, -93557, -194751, 91993, -156399, 71884, -236395, 77537, -127949, -303561, 58246, 232898, 287682, -2569, -220205, 410235, -141125, 332082, 28781, -46271, -130711, 176683, 174429, -141464, 296964, 36087, 168985, -180962, 149230, 56281, 541477, -82802, 41827, 257259, 144919, 202402, -130268, -20404, 82644, 95497, 182534, 119569]
12087A19569a87576Q5315A3229a75162A199K19152F497J27648b63973j47335D9628
12075F5075c7957j27976q9118i8210j76028A14835k3942M0978E2797J5936a59174
12063D8127h5090A03810l2303J67899I2138b62018E7279a27194C23656N528O66688
12052I95872L54936F20815B79346m9700J93963D8265R9713d997C30495A23603
12041h486A08716b05761H7614A8778J45361g0548A82788K264F5556C531J34439
12030A37970a0512j51633A35048a02595b4006A7726e2596j47812A24007K188d47564
12018a05520q6000j6279c892A69031G7505K4933c9866j5914j64509c4717j61994
12007a96711D01039I4863D3706N5466a83850b6101R774A01615k0998d1596n6607
$$ y = [119569, -187576, -102261, 13229, -175162, 1199, 220351, 6497, 134145, -263973, -411308, 49628, 65075, -37957, -165933, -255051, -98210, -274238, 114835, 90893, 131871, 52797, 68733, -159174, 48127, -85090, 103810, 71507, 239406, 92138, -262018, 57279, -127194, 323656, 329184, 995872, 1350808, 620815, 279346, 229646, 423609, 48265, 147978, -4997, 330495, 123603, -8486, 108716, -205761, 87614, 18778, 164139, -70548, 182788, 185052, 65556, 3531, 137970, -10512, -162145, 135048, -102595, -24006, 17726, -52596, -200408, 124007, 126195, -447564, -105520, -191520, -207799, -3892, 169031, 77505, 102438, -39866, -55780, -220289, -34717, -196711, 401039, 94863, 43706, 99172, -183850, -26101, -16327, 101615, 80617, -41596, -98203]
11996i8203B52236j8087C9973f3823B29555a71785j39699C1057d07671C0467a46108
11984I1466a10540l7250N7412n0971j3533d808C0582P6593b62584a08536l7733
11973a46269j23879A23396L68811A2810a55154A12573b9048j64067A68667b77564
11962B21961j03586J15767D007a89152D3020a80200Q8364j72632B5045c84186
11951F7742b93258J02562G7871a49590m5412c141j02510q5579f3569A45884D1441
11939c43873a32472a5350k04270C29904A08576J66892E3987i6442B1154a32217
11928a4211k26687e1296m24341A17818c9636A12203c3936B46410a9081E0282L3114
11917H3396b70084C0569e1456A74606h4237G9601b15204E4625j7242a62174M4681
$$ y = [-98203, 252236, 234149, 39973, -63823, 229555, -171785, -311484, 31057, -407671, 30467, -146108, 91466, -110540, -147790, -90378, -141349, -154882, -4808, 30582, 107175, -262584, -108536, -146269, -270148, 123396, 492207, 12810, -155154, 112573, -29048, -193115, 168667, -277564, 221961, 118375, 234142, 4007, -189152, 43020, -180200, -91836, -264468, 25045, -384186, 67742, -293258, -190696, 77871, -149590, -195002, -3141, -105651, -191230, -63569, 145884, 41441, -343873, -132472, -15350, -219620, 329904, 108576, 275468, 53987, -96442, 21154, -132217, -14211, -240898, -51296, -475637, 117818, -39636, 112203, -33936, 246410, -19081, 50282, 83396, -270084, 30569, -51456, 174606, -84237, 79601, -215204, 54625, 37383, -162174, -117493]
11906a17493I520J17750b9346A0041c20381a59318N7907R472B788K1929a82100
11894A65491b77940h9427J8651n2632D0482j93L5284g7558j37045I1581k6450
11883F5131a25108A06872a6236G7421B6886a54972h875r5813A52290e8766A32766
11871a86262B67189b83350B8407h8839A33085e016D53513a20823B86792h8138
11860B454a79218E364K94572H8869J35329a531B2798J44739d74120h1656A2769
11848b6280l81029a87987P7341C26434C4200f0461G7729J65826J17455j50072
11838B10938i8789A6190J54563j8030A4786O3628a36784F1406i5288g807j25839
11827a33646b6194I045i1219o4893f8549A7702b78836C5279R9273a09600m0391
$$ y = [-117493, 9520, 127270, -29346, 10041, -320381, -159318, -101411, -91939, 2788, 24717, -182100, 165491, -277940, -89427, -70776, -123408, 40482, 40289, 75573, -77558, -214603, 91581, 65131, -125108, 106872, -16236, 77421, 26886, -154972, -8875, -104688, 152290, -58766, 132766, -186262, 267189, -283350, 28407, -88839, 133085, -5016, 453513, -120823, 286792, -88138, 2454, -179218, 5364, 299936, 88869, 224198, -1531, 22798, 167537, -474120, -81656, 12769, -26280, -407309, -187987, -110646, 326434, 34200, -60461, 77729, 243555, 361010, 210938, -98789, 16190, 170753, 152723, 14786, 78414, -136784, 61406, -95288, -7807, -133646, -26194, 9045, -91219, -156112, -68549, 17702, -278836, 35279, 134552, -109600, -149991]
11816a49991A4461m25B693b67246F3200J08904C260L4011J43058a77258j8107
11805a95365d9498A5353b8844q6775k81655A14015a85911N5404d2018n5081k4620
11794a21719b1220j03827A34757c18834E9167B6729c8526m9796j48919I9719a69183
11782B16774G4754b4511j20722B37834O0095c17036J15168F6998a93987A80803
11771b32012l9713A41282b98249l6699I8393J31188F5133A2141h6389A7862c8012
11759a21994A27013l3148a51432B36894A1770J70049g2577A82463R7734b95795
11748F2325a67163B46309a97134A4473c18185A80313C2027a60821A79509N9081
11738B38590b70662a13567A34820d1200m3808l7927M1116n6832C00730A32937
$$ y = [-149991, 14461, 14036, 2693, -267246, 63200, 172104, 3260, 37271, 180329, -177258, -195365, -49498, 15353, -28844, -115619, -397274, 114015, -185911, -130507, -42018, -97099, -121719, -21220, -125047, 134757, -318834, 59167, 26729, -38526, -88322, -237241, 99719, -169183, 216774, 74754, -24511, -145233, 237834, 297929, -317036, -201868, 66998, -193987, 180803, -232012, -271725, 141282, -298249, -334948, 98393, 229581, 65133, 12141, -86389, 17862, -38012, -121994, 127013, 93865, -151432, 236894, 11770, 181819, -72577, 182463, 280197, -295795, 62325, -167163, 246309, -197134, 14473, -318185, 180313, 32027, -160821, 179509, 238590, -270662, -113567, 134820, -41200, -85008, -122935, -81819, -138651, 300730, 132937]
11727D9640L91227h0398J0153F5463J1485n054g1436b0182l2966j858A1858b39750
11714b35407E0335M751L22662j42906b38859R0249j05727L821A82129a76633A65233
11702C9333Q8851L13940j87283F9600E187M9171J48365H5427h4045E07982B7759
11690B08046h3406A45975O6315D6978d02288A99159K26660c70680B46195a68332
11679A5084f2224A35947L27474i2409L6756B5283L81730d0929j6153G1439M2986
11668A14425J2937e3397B14504d8832B91868b30005E47124A73793P5618d4933
11657G5672J9855i5793A37862a2929A54433b15755O5966P2876B11774B0057g4102
11645G1381C0001d3047D13239a37979m3170A08052a69538B9321c8121B37008A14406
$$ y = [49640, 440867, -80398, -70245, 65463, 76948, 71894, -71436, -20182, -53148, -55006, 11858, -239750, -235407, 50335, 55086, 377748, 234842, -238859, -148610, -254337, -250516, 182129, -176633, 165233, 39333, 128184, 442124, 254841, 69600, 5187, 54358, 202723, 85427, -84045, 507982, 27759, 208046, -83406, 145975, 212290, 46978, -402288, 199159, 425819, -370680, 246195, -168332, 15084, -62224, 135947, 463421, -92409, -55653, 25283, 407013, -40929, -57082, 71439, 114425, 127362, -53397, 214504, -48832, 291868, -230005, 547124, 173793, 249411, -44933, 75672, 95527, -95793, 137862, -12929, 154433, -215755, -149789, -76913, 211774, 20057, -74102, 71381, 30001, -43047, 413239, -137979, -181149, 108052, -169538, 29321, -38121, 237008, 114406]
11633B24310D4746b73398A68673a33159B06376d3403D04987a58312l8500F7810
11622f90j23695H3430c03974c1513k00324F9767a34875c6152B72594a73915K8567
11611a45348B98495M701F6743b9958D71701c7465A03115B9161O5489c25112J24481
11600b00631A23868R6595n4035e6504h124C944b51770A56579l4519J13290G651
11588b39954N3154d2799B07159b66130J15450A87948b66998H8646a39508A09627
11577C92083A86422E6639b45183A8608J91827d0101C7235R1879J54079C8197g6179
11565D0786b26554a2110A04388Q601J18375a32482d1565A30674J01150e038B17959
11553c5581A80215K26217A19906j7538b1849K610B33847A01779J57825A0781P4718
$$ y = [224310, 44746, -273398, 168673, -133159, 206376, -43403, 404987, -158312, -196812, 67810, -690, -124385, 83430, -303974, -31513, -231837, 69767, -134875, -36152, 272594, -173915, -145348, 298495, 303196, 66743, -29958, 471701, -37465, 103115, 29161, 94650, -325112, -200631, 123868, 220463, 166428, -56504, -8124, 3944, -251770, 156579, 122060, 235350, 7651, -239954, -186800, -42799, 207159, -266130, -150680, 187948, -266998, 88646, -139508, 109627, 392083, 186422, 56639, -245183, 18608, 210435, -40101, 37235, 129114, 283193, 38197, -76179, 40786, -226554, -12110, 104388, 112989, 231364, -132482, -41565, 130674, 231824, -5038, 217959, -35581, 180215, 406432, 119906, 102368, -21849, -19239, 233847, 101779, 259604, 10781, 85499]
11542H5499a29738L0249H9340J1153M76845i44j67786O7952A64275a48691D6784
11530D3628R4389j3876l7768a06551F1704a23834j5302E8004b00648H646J56778
11519A65424D8990Q9876b37033c8531D52071c36218H7021a69937B31071A04385
11508C04892a94806r1508D611L30767n502i861D18684i4444A19791a20595A96293
11496A69196N7938f9680A86009j9926K99238j90382P2942J26001E5373a13157
11485B22639M1484A08998K62021A44044J3991a0082H9485m2138a16244C48075
11474F9284L40931c285D22909A77517O162B8236J66526J29721j33261j7244Q4695
11463B58673d5498B52894L8601K62132A85020n4399o0155K71196j56928R6164
$$ y = [85499, -129738, -99489, 89340, 100493, 577338, -944, -168730, -100778, 164275, -148691, 46784, 43628, 138017, 124141, 86373, -106551, 61704, -123834, -139136, 58004, -200648, 8646, 165424, 48990, 138866, -237033, -38531, 452071, -336218, 87021, -169937, 231071, 104385, 304892, -194806, -286314, 4611, 335378, 329876, -9861, 418684, -94444, 119791, -120595, 196293, 169196, 227134, -69680, 186009, 166083, 465321, 274939, 347881, 473882, 55373, -113157, 222639, 264123, 108998, 371019, 144044, 158035, -10082, 89485, 47347, -116244, 348075, 69284, 410215, -3285, 422909, 177517, 183679, 28236, 194762, 324483, 191222, 173978, 258673, -45498, 252894, 291495, 553627, 185020, 130621, 70466, 341662, 184734, 280898]
11453B80898K34123A38960o8730N00823A87502J07872a08620A54700J16150G2095
11442B72547l005f5331A43649J7099a98268I4139N8171d024j42901C06292c2654
11430e2198E266a66663g6110r5778E6493B6371L70348e3575B4503b9499C3333
11418G6208a34514A96962F9794b7372B04757A1748A547a01658I0841K12798A4903
11406a8423j10348B05630b89872D9666J77871a99022c6296A7679c10130A76401
11395A26251b2598m9677B72421H6304Q6624a01299C24804a80321C11161a84062
11384A48112c8384p2359B0699a40386G9669R0470p8591C2648P1928B3085c519
11372f733A2136N2762j5248e1645A61431o7571m5085j662a07388I0009J04g432
$$ y = [280898, 515021, 138960, 70230, 571053, 187502, 295374, -108620, 154700, 270850, 72095, 272547, 269542, -65331, 143649, 160748, -198268, 94139, 152310, -4024, -146925, 306292, -32654, -52198, 5266, -166663, -76110, -171888, 56493, 26371, 396719, -53575, 24503, -29499, 33333, 76208, -134514, 196962, 69794, -27372, 204757, 11748, 1547, -101658, 90841, 303639, 14903, -18423, -128771, 205630, -289872, 49666, 227537, -199022, -36296, 17679, -310130, 176401, 126251, -22598, -72275, 272421, 86304, 172928, -101299, 324804, -180321, 311161, -184062, 148112, -38384, -110743, 20699, -140386, 79669, 170139, 91548, 32648, 104576, 23085, -3519, -6733, 12136, 64898, 49650, -51645, 161431, 93860, 48775, 47113, -107388, 90009, 90113, -7432]
11359a7430B79405A20436N203N6287a14975D40058A03105B1375G227K45388b05491
11347B8502b43101C90159g5765G8995N2299c3305j60049A53136d5989A27823m8119
11336G9704a06901j70802B641h1107C12742a40396e8267q1376L0784A9745P2804
11325I2549J62366A06449b35368A4387d01337B24280E1433b5118A84526B0073
11314b00546D5583a26500D8649J89790n5919I0131B8350c70036B406J81707c60631
11302F6347j5661H714h8702m81A2660J46064l2301a92827A50398C69a30497b2560
11289B97692E0963a32932d6867j34618B07216a19545d2481B3963b08446B82326
11278G2485b6366A93802J589H6655B2914K02167b94550b9752A331a86922J5023
$$ y = [-17430, 279405, 120436, 125639, 181926, -114975, 440058, 103105, 21375, 7227, 252615, -205491, 28502, -243101, 390159, -75765, 78995, 131294, -33305, -193354, 153136, -45989, 127823, 79704, -106901, -277703, 2641, -81107, 312742, -140396, -58267, -139643, -108859, 19745, 92549, 254915, 106449, -235368, 14387, -401337, 224280, 51433, -25118, 184526, 20073, -200546, 45583, -126500, 48649, 238439, 182520, 90131, 28350, -370036, 2406, 184113, -360631, 66347, 50686, 8714, -88702, -89183, 12660, 158724, 126423, -192827, 150398, 369, -130497, -22560, 297692, 50963, -132932, -46867, -181485, 207216, -119545, -42481, 23963, -208446, 282326, 72485, -26366, 193802, 195391, 86655, 22914, 225081, -294550, -29752, 1331, -186922, -171899]
11267a71899I071d1183D7206a35605k22336F0387e9441B00453I931J91517i3507
11255A38100i3101I9562d7476N816j60369B95484E0457a0291B6459b77014j45423
11244d22437A8194g7651A00764J81238A2840e8176D1231f8116m7609r0315g4544
11232a07698D6085a55753H3451a96106j39577J8076A0672b6012m5416l16210a09127
11220b08661h4309i717C1726P9868e8704p8204A16602a0048l5418k93200c3642
11208b20156Q6789B35945a39402B88392d2869j08306i847D8728J0564e7960j59698
11197b17658h3448j68468R2956B1343J16206o3888h374G031J22379F560f110k8401
11185c4511k03605m5506J12976A13459a9261l18856A44674b60273N8013A25078
$$ y = [-171899, 9071, -41183, 47206, -135605, -357941, 60387, -59441, 200453, 9931, 201448, -93507, 138100, -93101, 99562, -47476, -41660, -202029, 295484, 50457, -10291, 26459, -277014, -422437, 18194, -77651, 100764, 282002, 12840, -58176, 41231, -68116, -115725, -206040, -74544, -107698, 46085, -155753, 83451, -196106, -335683, -317607, 10672, -26012, -71428, -387638, -109127, -208661, -84309, -9717, 31726, 111594, -58704, -136908, 116602, -10048, -45466, -338666, -33642, -220156, -133367, 235945, -139402, 288392, -42869, -151175, -9847, 48728, 59292, -57960, -217658, -83448, -251916, -158960, 21343, 137549, 73661, -8374, 7031, 129410, 6560, -6110, -34511, -238116, -283622, -170646, 113459, -19261, -338117, 144674, -260273, -202260, 125078]
11174G2569J07778a68866o9371B75809D7107a25736j99805C03399b3053r3815
11164a16868K0504B0310g0861c4848j7479D0690b05402N1071o6349f2929B82544
11152c372A90948a31856A9233B69d6207k22880B90904r6614b21910O0986K7020
11141a33904c1098k04273e1042B321J97165b69094A29764f7877p4426c856q9427
11130i3283p804n3976B9597M1104Q043A2500c817E0367b17979A12415J62084a681
11117G1550c6616k9560j5511G3071J1257O0440e0972B2997K78586A8526M94926
11106E13452h6685j0687A25316a81455B55645b70775B26605i4474B22153h2866
11095F9412K7883N426J75127L9998n8953k0971B8439J23801J22767a969A19130
$$ y = [72569, 180347, -168866, -238237, 275809, 47107, -125736, -325541, 303399, -23053, -116868, -96364, 20310, -70861, -34848, -52327, 40690, -205402, -154331, -220680, -62929, 282544, -3372, 190948, -131856, 19233, 269, -46207, -269087, 290904, 194290, -221910, -160924, -133904, -31098, -235371, -51042, 2321, 199486, -269094, 129764, -67877, -142303, -3856, -93283, -101087, -155063, 29597, 70701, 78744, 12500, -3817, 50367, -217979, 112415, 274499, -1681, 71550, -36616, -66176, -81687, 73071, 84328, 144768, -50972, 22997, 301583, 18526, 513452, -86685, -97372, 125316, -181455, 255645, -270775, 226605, -94474, 222153, -82866, 69412, 97295, 102721, 277848, 317846, 258893, 237922, 28439, 152240, 275007, -1969, 119130]
11083C16045A33479a2837q7096B20191P7588n7854L1636N3309j36385J51279L2969
11072C72733j29682F6672N7205J56851E9603M3790M09419b57984B66270K89186
11062E55456A21453J49867A07647L05852J85260k10239p1342q0434k6488n0531
11052A59725L42338k23301n0805K80691j46401J77395r6921p6809J49705Q6274
11042F01891J53249j13960k1207j39716P4031J48347l5810J06447j11005j2017
11032F50250M43662n32303K69363J50832o4527j66544M01151l49787J19933j90180
11022G31850J66232k55695K63391j91640N4481O8519k21405m5819L86028l59221
11012E96721J3479N43241l33659p326J47372l37983L06779j76128l19463M88416
$$ y = [316045, 133479, -12837, -99933, 220191, 297779, 239925, 271561, 324870, 188485, 339764, 372733, 243051, 66672, 123877, 280728, 59603, 103393, 512812, -257984, 266270, 555456, 121453, 271320, 107647, 413499, 598759, 388520, 317178, 236744, 210256, 159725, 502063, 278762, 227957, 508648, 362247, 539642, 442721, 365912, 515617, 601891, 755140, 641180, 619973, 480257, 554288, 702635, 666825, 773272, 662267, 650250, 1093912, 561609, 830972, 981804, 917277, 750733, 1151884, 802097, 922030, 731850, 898082, 642387, 905778, 714138, 768619, 837138, 615733, 569914, 955942, 596721, 610200, 1153441, 819782, 812456, 959828, 621845, 928624, 752496, 433033, 921449]
11002I21449l07130m8383K95990J03641k89579k29290J06587j2842J53846K09645
10992I03934r6978j08816j58366M13644m29843K47064j82283K98801J39050m52906
10982E73301j02402L17322L2316m3475J09265j28889J04046k56869J89383O9912
10972H63910J55780k49443K54937j16610M52610N2821k38583K91008J68720j22192
10962A512958J75150K68521M76231q9144N00095K69767n9685N5705M3228n71224
10952B581602K92338m17092j31823L44962n89408o4917K05422k04985r6579K87564
10942B207084q3061l1247n4455l09310m9358o4463J04885q21431Q8348j97482
10932G89510P398k46728Q6940j2419j93394j52641j12271l4262K62017L6609k335
$$ y = [921449, 614319, 565936, 861926, 965567, 675988, 446698, 553285, 540443, 694289, 903934, 806956, 698140, 539774, 953418, 523575, 770639, 588356, 887157, 1026207, 573301, 470899, 788221, 820537, 777062, 886327, 757438, 861484, 604615, 793998, 863910, 1019690, 770247, 1025184, 908574, 1361184, 1414005, 1175422, 1466430, 1635150, 1512958, 1688108, 1956629, 2432860, 2343716, 2843811, 3113578, 3053893, 3109598, 3152826, 2581602, 2873940, 2456848, 2325025, 2669987, 2080579, 2015662, 2221084, 2016099, 1919520, 2207084, 2124023, 2092776, 2038321, 1729011, 1679653, 1615190, 1720075, 898644, 986992, 789510, 796908, 550180, 637120, 624701, 431307, 278666, 166395, 132133, 394150, 430759, 428424]
10921D28424b1157C66915A20867R4363n0514n2499K5667k9402K92203K3575d312
10909b55895A25476a60517A46788R289J18094J39930j52314J0876b2994A46129
10898g2584j3305F167K7127a74843c8936l0534A07313h9940F9774h3216I617g9525
10885e0257o089C76114e2213l53273e6847A83859F3771a31519B19282G2909L416
10874G6325a11959j35005h4758C2731J23796b79q1348N226k75655j4231A04423
10862A84721o5954a17455B76990j12820D7795C202b8827F1238a48863l9681O1061
10851a27483G4090H050l590N59475a51976B1117J4636J11244K22022b8807I5532
10839A25827n2636a07508A37100n5112R6372b56935O5653h2660a3442B47225I082
$$ y = [428424, -21157, 366915, 120867, 215230, 164716, 112217, 137884, 108482, 400685, 424260, -4312, -255895, 125476, -160517, 146788, 156077, 274171, 414101, 261787, 272663, -22994, 146129, -72584, -85889, 6167, 33294, -174843, -38936, -69470, 107313, -89940, 69774, -83216, 9617, -79525, -50257, -56346, 376114, -52213, -405486, -56847, 183859, 63771, -131519, 219282, 72909, 76325, -111959, -246964, -84758, 32731, 156527, -279, -81627, -76401, -352056, -366287, 104423, 184721, 118767, -117455, 276990, 164170, 47795, 3202, -28827, 61238, -148863, -188544, -127483, 74090, 8050, 4460, 563935, -151976, 21117, 35753, 146997, 369019, -28807, 95532, 125827, 73191, -107508, 137100, 81988, 178360, -256935, -191282, -82660, -13442, 247225, 9082]
10827c87185I044a45607p8932B0970a0835j86272H1598r161l5975J91799A04365
10815b3693A2480R8441k6440a81059A35960j8802a51638E9984a8790r7720e7240
10803b09864R8039A10839d6096A74013D0354b63721a26589m5466A31340a5557
10792F5298D646c09712A17746N7864l0715J31520b65226F0914i1870k25288D89908
10780a71238B18303b99958i2049k24083A98301A4335K88398b69425f7538L175
10770f4363H752a75076B38142F7934b28145A36372o5990d4416n2311j32161D7511
10758D8086J05773i852j73214B33290a74533E8793b4725j28645f0462r910k6069
10747i6441j79317D0492K27979G7200J96862d92077H9949a73440P9600A25388
$$ y = [-387185, 9044, -145607, -224539, 20970, -10835, -197107, 81598, 72437, 36462, 228261, 104365, -23693, 12480, 110921, 84481, -181059, 135960, 117158, -151638, 59984, -18790, -116510, -57240, -209864, -111825, 110839, -46096, 174013, 40354, -263721, -126589, -172055, 131340, -15557, 65298, 4646, -309712, 117746, 175610, 144895, 276415, -265226, 60914, -91870, -317158, 489908, -171238, 218303, -299958, -92049, -316132, 198301, 14335, 302733, -269425, -67538, -64363, 8752, -175076, 238142, 67934, -228145, 136372, 70382, -44416, -96727, -228888, 47511, 48086, 153859, -9852, -183066, 233290, -174533, 58793, -24725, -153370, -60462, -70372, -96441, -275758, 40492, 268471, 77200, 274062, -492077, 89949, -173440, -93840, 125388]
10736a95850p6293a34569r7028d8183j09907n30190C67675c67078A97787o4820
10726A32967b46744C29454G1673J4504I765c97966B14240h8505m089A8733a96620
10714a49389j52940P2974D2743b56481A12415a47924B37335a22521C7882e3481
10703b6339E009J30024n3892c4759I3027J46211B762b57627G699b17138E9843
10691a06084a4078j69242C03554A1632c18110A06451K7659g4409A67309I89c1744
10679G8592O3942c0881A31792J9764a46678o7043a3487k56379M0742a8081j21144
10668a39225B17495a61963D8213i0770R685k84629J49036A29719E0373a14766
10657a55995c5630l43790a56155C6108c27611Q6283C4061J41320P3304c40018
$$ y = [-195850, -272143, -134569, -231597, -48183, -158090, -688280, 367675, -367078, 197787, 132967, -246744, 329454, 71673, 86177, 9765, -397966, 214240, -88505, -92594, 18733, -196620, -149389, -302329, -229355, 42743, -256481, 112415, -147924, 237335, -122521, 37882, -53481, -26339, 5009, 135033, 81141, -34759, 93027, 239238, 2762, -257627, 7699, -217138, 59843, -106084, -14078, -183320, 303554, 11632, -318110, 106451, 134110, -74409, 167309, 989, -31744, 78592, 142534, -30881, 131792, 151556, -146678, -213721, -13487, -269866, -229124, -18081, -139225, 217495, -161963, 48213, -90770, -81085, -365714, -216678, 129719, 50373, -114766, -155995, -35630, -379420, -156155, 36108, -327611, -241328, 34061, 175381, 248685, -340018]
10646a89114i2896j66459Q6935j37881d2582B4103K16587b61319d2100l4802I9142
10634B21910j2258a43274p5022A43915b15k26278F466d29106J55444a21949B94729
10622C3044b6935k7079k4750A55714b10980f1825B73458A8484b1674F6527g1451
10610A42501a17539B73115a56126E9156c57096g4519B32244a16773l6695Q429
10600a45039k41955h3113j93190a25770A73946a28488j21168i69B47788A05124
10589a55895d9202j63698H1636R5160H7091J61749a55826a8500B01625c28381
10578a08466k60658H2492a48248J9776d4529I2940B7351e7707j34142b6674r4739
10567a21413A74160C5861O3947M7646A2754b53121B52678f2251j33632C02782
$$ y = [-189114, -92896, -259355, -172420, -310301, -42582, 24103, 240690, -261319, -42100, -76902, 99142, 221910, 209652, -143274, -218296, 143915, -215, -226493, 6466, -429106, -273662, -121949, 294729, 33044, -26935, -54014, -78764, 155714, -210980, -61825, 273458, 18484, -21674, 66527, -71451, 142501, -117539, 273115, -156126, 59156, -357096, -74519, 232244, -116773, -153468, -145039, -386994, -83113, -276303, -125770, 173946, -128488, -249656, -969, 247788, 105124, -155895, -49202, -212900, 81636, 176796, 87091, 248840, -155826, -18500, 201625, -328381, -108466, -369124, 82492, -148248, -128472, -44529, 92940, 27351, -57707, -191849, -26674, -121413, 174160, 35861, 99808, 147454, 12754, -253121, 252678, -62251, -195883, 302782]
10556G2953N1830i0233o4319A09758b18654A40830b30054A61094a40855I0487
10545b61378B17166G71e4244j91036E1044a23070A5336a70469l44219A95530p9532
10534A15998b19099e8108C2481b18065A5368b04489I455b6015o5307B23537g8725
10522I9194L520b6392l78520f85k36330j2468G2314h5475B56479c5607A15729
10510f1186A38721a94119A0626a10664M5957E3141J29604r0058L7373c3787o0443
10499i4230A15455a86467g4843D3661a72129C2566b09329J00184j03234A50399
10488d40614e7111J1019B4987f6026C5221b39461F7341a26236l25707i0105d0687
10476b891B10750D8356c02024A69743j1007E9942a19366B42057i5513A43407K13450
$$ y = [72953, 124783, -90233, -154552, 109758, -218654, 140830, -230054, 161094, -140855, 90487, -261378, 217166, 771, -54244, -245280, 51044, -123070, 15336, -170469, -514688, 195530, 115998, -219099, -58108, 32481, -218065, 15368, -204489, 9455, -26015, -91322, 223537, -78725, 99194, 102714, -26392, -404912, -685, -237015, -249483, 72314, -85475, 256479, -35607, 115729, -61186, 138721, -194119, 10626, -110664, -64707, 53141, 182745, 92687, 130060, -33787, -94230, 115455, -186467, -74843, 43661, -172129, 32566, -209329, -109145, -212379, 150399, -440614, -57111, -46092, 24987, -66026, 35221, -239461, 67341, -126236, -451943, -90105, -40687, -2891, 210750, 48356, -302024, 169743, 158736, 59942, -119366, 242057, -95513, 143407, 356857]
10465C56857K15712p5947A18277P4815h150H1330a07131r3706G7119C1639J15318
10454A46957o1633b67856A37062b84141h7679H8285i8527b5072j96225k7410o518
10443b55225e4574p2776C325i4913k03865F4257a9841k34711a23460I9687k2147
10432G7540K38093I9069P9791e1083b4941I4724k6006H132c7531a8607B50739
10420B45613l4290b3994B56114a21648e2852B54014C98J31130P8723a95837A85235
10408e6793A60654a6957G748d7475d679A52821a68382H3356b43415A11319d6459
10396B9843J7395b69660O2337N1693D1279b40883G9897a44451p7139J02587p0814
10385a89817C16348a23365M4766k53797a27423B29627h9036J4289A98655C967
$$ y = [356857, 572569, 496622, 118277, 193092, -8150, 81330, -107131, -200837, 77119, 31639, 146957, 85324, -267856, 137062, -284141, -87679, 88285, -98527, -25072, -221297, -248707, -255225, -54574, -127350, 3325, -94913, -298778, 64257, -19841, -254552, -123460, 99687, 77540, 315633, 99069, 178860, -51083, -24941, 94724, 68718, 8132, -37531, -18607, 250739, 245613, 211323, -23994, 256114, -121648, -52852, 254014, 398, 131528, 210251, -195837, 185235, -56793, 160654, -16957, 7748, -47475, -4679, 152821, -168382, 83356, -243415, 111319, -46459, 29843, 47238, -269660, -207323, -155630, 41279, -240883, 79897, -144451, -221590, -119003, -189817, 316348, -123365, -78599, -332396, -127423, 229627, -89036, -74747, 198655, 3967]
10374A82952a56260L5970A91934f2410A03104i6701o0699Q706j3470B71825B4324
10362B88731j42381L7841o7162B954N20740p4858k23083n4076N16100C08677K79745
10351E88422B51446L52430j92184j75271J0415K11298q1844j17172j04266a0045
10340F814M05344j70759H7907j6723L88177A92335F3724M03501Q8758A92187J96104
10329C88291j33904m008p977K47792A78482Q1772R5800P1431A33027L09883j93819
10318B49091N9209J54150A27028R6427k7666a0820O82k49605d6297D83301k40791
10307B42510J0900q4224R3450q5008J80946j66617J29495J1258N5604a35917B58362
10295B3364K28225f2084B71315K56634F5024a02961B52156a29073j08852J02081
$$ y = [182952, -156260, -120290, 191934, -62410, 103104, -96701, -157400, -148694, -162164, 271825, 24324, 288731, 146350, 184191, 117029, 2954, 523694, 448836, 225753, 171677, 687777, 308677, 588422, 251446, 603876, 411692, 236421, 246836, 458134, 376290, 259118, 154852, -10045, 6814, 412158, 241399, 87907, 71184, 459361, 192335, 63724, 467225, 555983, 192187, 388291, 254387, 250379, 242402, 490194, 178482, 260254, 356054, 427485, 133027, 442910, 249091, 308300, 462450, 127028, 223455, 195789, -10820, -10138, -259743, -46297, 483301, 242510, 253410, 169186, 262636, 177628, 358574, 191957, 321452, 332710, 388314, -135917, 258362, 23364, 251589, -62084, 271315, 527949, 65024, -102961, 252156, -129073, -237925, -135844]
10285a35844H0241h3994j73505A99262o9090c3917D113a39597p4956F7787a7993
10273b59889C3231L9450N9237J47515A3585b47457p6212N4466I6564a30432p301
10262a37733O7312A47193F0488r531a40962A54473o4769d29082b2912D4690c85289
10250c52481I3420m0058b06858f8095I880K67528n169L31534B30839J9759Q354
10239B58952K40038A19416C4565i8358B70472c7251A1675a9081A362K59864h9140
10227E3367L7590c30335h8447B09259D1694c14644E8444b95530N2846c0930A41890
10215a38635n204J2484B58986e9768l43911F3623M0353a32803P606N974A73121
10203c75535B55404A01144b0242j64361B21120a01702A04527L0333i6046k15727
$$ y = [-135844, 80241, -83994, -257499, 199262, 130172, -33917, 4113, -139597, -214553, 67787, -17993, -259889, 33231, 72681, 131918, 279433, 13585, -247457, -323669, -269203, 96564, -130432, -137733, -70421, 147193, 60488, 50957, -140962, 154473, 89704, -429082, -22912, 44690, -385289, -352481, 93420, 53362, -206858, -68095, 9880, 277408, 272239, 603773, 230839, 250598, 258952, 498990, 119416, 34565, -98358, 270472, -37251, 11675, -19081, 1362, 261226, -89140, 53367, 90957, -330335, -88447, 209259, 41694, -314644, 58444, -295530, -242684, -30930, 141890, -138635, -143839, -131355, 258986, -59768, -403679, 63623, 103976, -132803, -125197, -119223, 173121, -375535, 255404, 101144, -20242, -184603, 221120, -101702, 104527, 134860, -96046, -311773]
10193c11773f3992j64979E2302J47356b35962M1918j50662b6049j11620N0380
10183h7289l1712C5532a00047G8215a62978L2112l2434o5415i134A67847a44912
10171a00337A76643a44782O102k44475E1025b99002h6321A21387a07302o0285
10161a67587g3437H7271l3884k1481f3136l38435a11556C01358b89692f2756B09924
10149C9118N7362m5748c60674d7190k08808Q2946E1475K03868N9524g8748j73517
10138b52265k8141A07265b67328p2463e3950k04057n3282A0679J6820f0060a8518
10126H8600h3844k20121R5110b2707k20091d015k62694A43610h1823k05476A22044
10114e345F09f6574j79157R9527A61606J79496a44171C47182b12686e9227l51217
$$ y = [-311773, -63992, -228971, 52302, 199658, -235962, -194044, -344706, -26049, -137669, -87289, -119001, 35532, -100047, 78215, -162978, -130866, -163300, -228715, -9134, 167847, -144912, -100337, 176643, -144782, -138680, -383155, 51025, -299002, -86321, 121387, -107302, -167587, -73437, 87271, 53387, 31906, -63136, -401571, -111556, 301358, -289692, -62756, 209924, 39118, 96480, 50732, -360674, -47190, -255998, -173052, 51475, 255343, 314867, -78748, -252265, -280406, 107265, -267328, -339791, -53950, -258007, -311289, 10679, 27499, -60060, -18518, 88600, -83844, -303965, -208855, -22707, -242798, -4015, -266709, 143610, -81823, -287299, 122044, -5345, 609, -66574, -245731, -146204, 161606, 341102, -144171, 347182, -212686, -59227, -410444]
10103d10444A83774a65190I6847b06687c0524j69595J199d8957G7529b4124j71032
10092a95156A04809R566n1362a77326j2507J9129P1089j96339a07559D375R524
10081A3899b69927h0366C2425a9655m6055A26036b28249e7497j21081H061b74380
10069A6327c18665B60982a10014j4477l609M3183E3615K07781i9518i392n32350
10058e41742A0921b58394P2636A01394b3511m5887F8737a10234m2967n664B30200
10046c00787A00682b25526L3163K6581H5761J01334m3183B9062h5814a8782o9368
10035h8150j35169I0613f0346n1449o6908a5914F5602q350a73890e9059k05102
10024b64161b760k62110a3038o0100C6034J59316a29136A11104B427J01788O381
$$ y = [-410444, 183774, -165190, 96847, -206687, -30524, -200119, -198920, -48957, 77529, -24124, -195156, 104809, 114375, 63013, -177326, -189833, -170704, -99615, -295954, -107559, 4375, 13899, -269927, -80366, 32425, -19655, -65710, 126036, -228249, -57497, -178578, 8061, -274380, 16327, -318665, 260982, -110014, -124491, -128100, -84917, 53615, 261396, -99518, -9392, -541742, 10921, -258394, -185758, 101394, -23511, -69398, 68737, -110234, -153201, -158865, 230200, -300787, 100682, -225526, -192363, -165782, 85761, 187095, 143912, 29062, -85814, -18782, -88150, -223319, 90613, -60346, -111795, -178703, -15914, 65602, 57252, -173890, -59059, -264161, -2760, -264870, -13038, -73138, 36034, 195350, -129136, 111104, 2427, 104215, 110596]
10013A10596c7037E5962e9432a4140l24868A17473b72412N3930R7939A38961c70127
10001C9012J80435b44228L697R9770b4513k79353Q7292Q0120j99470A50075a81527
9989a7113A08319c4276l96691K10795O7278A09189a31502k21139c7379l38288
9979c75667h6401l09711A32934b62984a2329B80551a7087k65449j03510a41191
9968b30681B27626B1859a31622I9457c23600J00817M5134j51684B0461i8795A67318
9956F5768b18859A30750b55091A6260c43340e4505B8316J71954b51091A15010
9945b7330o383l9122j89482D6838b60034I7517k5304K8350a47136F8298b6879
9933a50202a512l28671b0555n6660k2441k23042A0978a01846C77303c14865K691
$$ y = [110596, -37037, 55962, -59432, -14140, -339008, 117473, -272412, -218482, -120543, 138961, -370127, 39012, 219447, -244228, -240531, -140761, -24513, -303866, -216574, -136454, -335924, 150075, -181527, -17113, 108319, -34276, -430967, -220172, -152894, 109189, -131502, -352641, -37379, -375667, -86401, -396112, 132934, -262984, -12329, 280551, -17087, -282536, -386046, -141191, -230681, 227626, 21859, -131622, 99457, -323600, -222783, -177649, -329333, 20461, -98795, 167318, 65768, -218859, 130750, -255091, 16260, -343340, -54505, 28316, 200270, -251091, 115010, -27330, -33713, -72835, -262317, 46838, -260034, 97517, 72213, 100563, -147136, 68298, -26879, -150202, -1512, -330183, -20555, -77215, -99656, -322698, 10978, -101846, 377303, -314865, -312174]
9922c12174O9469A13728J7910J9057A7861J3450K43150g0237B3105l243b92717
9910c81469K2968e9615i361E4091b47938k33647a86648k1527d8522C60108A13023
9898d1927I9761Q4138h8653b7122j00515k9111B3253J03175C5040P2020b01309
9886b6939k11841h6356B1994L16220c23433A19851g601j20204A61895M140i9357
9874G7036e1744d566p4264E7894a77406B53418a7309m14617f455I2524a57058
9862A87769c64074D1291d497k2789J2105k69643Q6697F5452E769J05623E2176
9850f2467l8685j50922f7074l1515A8907J30202b06237A63552g8598J2722o2244
9839a28120j03176b2660j89202A537P9562b67325n3146c6914k39530C5926J3037
$$ y = [-312174, -242705, 113728, 131638, 150695, 17861, 31311, 274461, -70237, 23105, 19862, -292717, -381469, -358501, -59615, -9361, 54091, -247938, -481585, -186648, -208175, -48522, 360108, 113023, -41927, 99761, 183899, -88653, -27122, -127637, -156748, 23253, 126428, 35040, 107060, -201309, -26939, -238780, -86356, 21994, 338214, -323433, 119851, -7601, -127805, 161895, 166035, -99357, 77036, -51744, -4566, -78830, 57894, -177406, 253418, -17309, -431926, -6455, 92524, -157058, 187769, -364074, 41291, -4497, -27286, -15181, -284824, -198127, 65452, 5769, 111392, 52176, -62467, -101152, -252074, -67074, -98589, 18907, 149109, -206237, 163552, -78598, -65876, -128120, -231296, -22660, -211862, 1537, 81099, -267325, -320471, -36914, -276444, 35926, 48963]
9828D8963b52350m709H321K1595d4210l43865C757R1054a18145l2264m9485G432
9815c09895J32216L4667e4410q1314C61377A37332b19551A54628n3727R0917a99864
9803i7556A07837h9519A33346K06677c18411a54654o806C63262a10363A52915
9792a65621C8680O3942m4444a25776j73641K8720O8928D8990c55398C81552j85466
9781A96086a51058j18777B5670b30795O5366q1968B88559b84330O3301j28517
9771c49546a23900E9557i3277F3459L15645A82544a30362L0305k35099G3210A6869
9759a39099A92287c496j26645j86266b6292j08544N1245J7841J0342p067C3072
9747A1185Q7962B9508J23098b61876j6363P6394e0090j98320B81073a03427m6498
$$ y = [48963, -252350, -257059, 8321, 29916, -44210, -388075, 3757, 94811, -118145, -150409, -199894, 7432, -309895, -177679, -143012, -54410, -135724, 361377, 137332, -219551, 154628, 100901, 191818, -199864, -97556, 107837, -89519, 133346, 340023, -318411, -154654, -161460, 363262, -110363, 152915, -165621, 38680, 102622, 58178, -125776, -299417, -270697, -201769, 48990, -355398, 381552, 196086, -151058, -269835, 25670, -230795, -165429, -247397, 288559, -284330, -221029, -349546, -123900, 59557, -93277, 63459, 379104, 182544, -130362, -100057, -335156, 73210, 16869, -139099, 192287, -3496, -130141, -316407, -26292, -134836, -83591, -65750, -55408, -62475, 33072, 11185, 99147, 29508, 152606, -261876, -278239, -201845, -50090, -248410, 281073, -103427, -149925]
9736a49925m0357e3325F0989a20757k16191a9980E7186L8824a16254B7918Q692
9725C6610j5175J81789a78645O5647A2157K081M4938A4065c45593A06894a5578
9713A01589d8605p5343c5069l1332F4233b12022K4248j46079A3378b97212p0281
9702c67493O3985A4660c45870K1786J9659E276c051A94305O2323b19673C6020
9690b48471A15731E5661a45548f4703k7161M3197C3670a9085p6871L7523E1818
9678A39201a7066p5309j19593g5326m065m0518A45813a45015j77931P403A3835
9666b11731A78433h092n2852D6460a4164A39353a75134o0900d6072B21126c02057
9654d28144J42285F0445f1047m5841p7005H3776b99853P4593F5239j4605c46475
$$ y = [-149925, -190282, -53325, 60989, -120757, -336948, -19980, 57186, 96010, -116254, 27918, 36610, 21435, 203224, -178645, -112998, 12157, 14238, 59176, 14065, -345593, 106894, -15578, 101589, -48605, -123948, -35069, -66401, 64233, -212022, -187774, -333853, 13378, -297212, -367493, -303508, 14660, -345870, -324084, -304425, 5276, -3051, 194305, 256628, -219673, 36020, -248471, 115731, 55661, -145548, -64703, -91864, -48667, 33670, -19085, -95956, -58433, 51818, 139201, -17066, -92375, -211968, -75326, -79391, -119909, 145813, -145015, -322946, -315543, 13835, -211731, 178433, -8092, -60944, 46460, -14164, 139353, -175134, -236034, -46072, 221126, -302057, -428144, -285859, 60445, -61047, -106888, -183893, 83776, -299853, -225260, 65239, 50634, -346475]
9642B30714b10961a00492D168a58725g1983m1694C2955r539a47197a8704j15708
9631a34412k58148h1973c1837r9496a950l29625e217B07178a33076j1736a1922
9619a13056C420f6311j40123a01448q2175A08533c75525f1678k5355A08400P8455
9608A86855i8122b3909k97599p4513D7331g1303L0414B03329d0135B27280b86528
9596d7865o918n7313A33136b36452I7812D5118M5085D4569g5186k07282R6619
9585a85849H443a78957A33520D7226N537c39363g9297A04888d25336a86344A30609
9573I0677D772J48747a79193f0399j10871A31881j7610c51665a47802C4162h3066
9561H1005C3750a11064D6221g4930A13241c37243g5202j67467L0299H35a43417
$$ y = [230714, -210961, -100492, 4168, -158725, -71983, -113677, 32955, 23416, -147197, -18704, -134412, -392560, -81973, -31837, -131333, -1950, -331575, -5217, 207178, -133076, -144812, -11922, -113056, 3420, -66311, -206434, -101448, -183623, 108533, -375525, -61678, -87033, 108400, 186855, -98122, -23909, -321508, -396021, 47331, -71303, -40889, 203329, -40135, 227280, -286528, -47865, -54783, -112096, 133136, -236452, 97812, 45118, 90203, 44569, -75186, -282468, -185849, 8443, -178957, 133520, 47226, 52763, -339363, -79297, 104888, -425336, -186344, 130609, 90677, 4772, 153519, -179193, -60399, -171270, 131881, 114271, -351665, -147802, 34162, -83066, 81005, 33750, -111064, 46221, -74930, 113241, -337243, -75202, -242669, -212370, 835, -143417]
9549b02415f3743m7259J1380j18967C8727b66313a28919r9898C1595J56258d10736
9537B7639F477b9460k47296D1791a91641L1315A70369H1957B9379i3832q9871
9526a83703j368q3344A65344D063K68518f6737A41181l4982c3241B29958a60313
9514A95603f2486a6601g579j10437G5041Q6781h9679J941A08059J73473A2889
9502c26082A65041i9800m02828F6597d8119k66941a1846E0866A8819J06919f3869
9490a09927A40514a27221J1940j51756B8856j2216Q1109B6449b15480A4584b02750
9478B53219I1931a3j37620b8521j40315G1728K75662a80868b8450l7204A66347
9466b8771D27226j94361a13559j63800c0440k50516g2347l07060f0596a8568j76562
$$ y = [-202415, -63743, -111002, -99622, -218589, 38727, -266313, -128919, -228817, 31595, 187853, -410736, 27639, 6477, -29460, -276756, 41791, -191641, -160326, 170369, 81957, 29379, -93832, -183703, -185071, -268415, 165344, 4063, 272581, -66737, 141181, 106199, -33241, 229958, -160313, 195603, -62486, -16601, -7579, -118016, 75041, 161822, -89679, -87738, 108059, 281532, 12889, -326082, 165041, -99800, -502628, 66597, -48119, -315060, -11846, 50866, 18819, 125738, -63869, -109927, 140514, -127221, -115281, -267037, 28856, 16640, 97749, 26449, -215480, 14584, -202750, 253219, 91931, -13, -137633, -28521, -168836, 71728, 347390, -180868, -28450, -65654, 166347, -28771, 427226, 232865, -113559, -277359, -30440, -280956, -72347, -379407, -60596, -18568, -195130]
9455a95130m9639A004J56686a28954j9291f2058j40311C086a56997O0190j78618
9444b75425J12544e8563a1621m4687p3693A33203a46796g979n8992A32014C4971
9432g3582k30829B14584D1105c85896a11751j48334N1762n0108J04942D9557R4789
9421A44346F1550b0971H9069a38755r1830h0913B88737g3065A77908b45171g5297
9409A98528a0820M770j66046q8961N2891j63510J62617P4737D2689a04867o8499
9398a73366A29241K8314a90843L5666e296m34787h0239a7129a377B14881a26866
9386e6354H7426a1582q9612K5948k05120J02061O0090A40972b02295M7084b4014
9374i7015B05881c38293J55067I2715b31015M2408G2367h8606A44247n3516M6110
$$ y = [-195130, -244769, 1004, 157690, -128954, -148245, -62058, -202369, 3086, -156997, -96807, -275425, -162881, -58563, -11621, -56308, -130001, 133203, -146796, -7979, -66971, 132014, 34971, -73582, -304411, 214584, 41105, -385896, -111751, -260085, -208323, -258431, -153489, 49557, 144346, 61550, -20971, 89069, -138755, -230585, -80913, 288737, -73065, 177908, -245171, -75297, 198528, -10820, -6050, -172096, -261057, -208166, -371676, -209059, -134322, 42689, -104867, -173366, 129241, 157555, -190843, -155177, -5296, -440083, -80239, -17129, -1377, 214881, -126866, -56354, 87426, -11582, -101194, -75246, -280366, -178305, -118215, 140972, -202295, -155211, -24014, -97015, 205881, -338293, -183226, 92715, -231015, -188607, 72367, -88606, 144247, 90731, 136841]
9363A36841e09492b1581r4052R216h890k02144B46776c48403m3197J52700i312
9351A03885a27428a9509j0979j7676A0944a41606b1153B52607n9721a56856r4758
9340b51614J2553i3186l89743B09978j01141l241a22585c5271C9739b26998A28712
9328c8808n4810b2812j01281A36659b41664r0123a6861A65555c64556o3714J14196
9317c14074a2508n3724b3867j1409k7024H3097C38e0991A55885d8492A99050d0166
9304e3151D617J23104b4048j01348l82255A24722b39341J01065d5687C4326j1882
9293B2444c94643a79635O6228k7379C96924b76596b0646A09230c39313d3254j09536
9282a52790d1781p0644l78417G4949J47147G2597a43328o0453i2877j19331a539
$$ y = [136841, -509492, -21581, -115633, -106417, -8890, -211034, 246776, -348403, -391600, -238900, -9312, 103885, -127428, -19509, -30488, -48164, 10944, -141606, -21153, 252607, 192886, -156856, -251614, -239061, -93186, -482929, 209978, 108837, 105596, -122585, -35271, 39739, -226998, 128712, -38808, -93618, -22812, -124093, 136659, -241664, -331787, -16861, 165555, -364556, -428270, -314074, -12508, -66232, -23867, -35276, -62300, 83097, 338, -50991, 155885, -48492, 199050, -40166, -53151, 4617, 127721, -24048, -125396, -507651, 124722, -239341, -138276, -45687, 34326, 22444, -394643, -179635, -113407, -140786, 396924, -276596, -20646, 109230, -339313, -43254, -152790, -41781, -112425, -490842, 74949, 222096, 72597, -143328, -203781, -92877, -212208, -1539]
9270g8073A73160c76942J82968e5864j41044C1101N028a40167K9867j2085D3111
9258B39929a84076l7096n9765C2340d1055D96106i7642c4523A0390J89623a52457
9246E7880a51391A20747e7338l45390J48315J1178B28079G6619J35930a7899A8517
9234c42282a350p1308o621C0289a40991B32054F2468a89188f2882j35951i2150
9222a84398i530B13557I856a64023A0412c12063J11797O062g9532i216B35669
9210b24338A6974a54085f71A45391J82985b82031h909k96367e9924K3030i67j31788
9198a32755r7983B3441g771k67356a26382j01876m751K3177B83234J6483c09892
9186A51596i4664k53654e4094j7737I000M7256a75090L3823C50908F5855b08152
$$ y = [-78073, 173160, -376942, -193974, -55864, -196908, 31101, 36129, -140167, -110300, -122385, 43111, 239929, -184076, -221172, -280937, 32340, -41055, 496106, -97642, -34523, 10390, 200013, -152457, 57880, -151391, 120747, -57338, -402728, -254413, -243235, 228079, 76619, 212549, -17899, 18517, -342282, -1350, -72658, -79279, 30289, -140991, 232054, 62468, -189188, -62882, -198833, -92150, -184398, -9530, 213557, 9856, -164023, 10412, -312063, -200266, -194204, -79532, -9216, 235669, -224338, 16974, -154085, -671, 145391, 328376, -282031, -8909, -305276, -59924, -36894, -967, -132755, -230738, 23441, -7771, -275127, -126382, -228258, -233009, -209832, 283234, 299717, -309892, 151596, -94664, -348318, -54094, -71831, 9000, 56256, -175090, -141267, 350908, 65855, -208152]
9174C8763a54696A32428b80077h3072m0972J1912A23172F0098a14947J6123a7393
9162a15108q926j59339A22042O010a78173R19j07690E1222p102J32397m1048d8952
9149a61664B30706c7012q0372e3699m8349G511J08261d09826a69753c2992J2684
9138b0308j23749a4542A34706d0024o4352k8885a6676k48435A94865J6618c26850
9126a96537J5182l9819h1188q4122N4268j5315D9795g2609j12584A5833c68946
9114A05226R9135C2413A4186a3189j728j63841f623A82319J62931j44349D4491
9102A97653E2623a30496n8159M6381C07276b88945g2118j39149r199f4207l3932
9091i8139j87290G2575b19401k342J00911c6622D9994b90614c8536J5890B54658
$$ y = [38763, -154696, 132428, -280077, -83072, -124044, -112132, 123172, 60098, -114947, -98824, -17393, -115108, -124034, -283373, 122042, 128052, -178173, -177254, -284944, 51222, 44120, 176517, 135469, -48952, -161664, 230706, -37012, -117384, -53699, -102048, 7511, 115772, -409826, -169753, -32992, -20308, -144057, -14542, 134706, -40024, -104376, -133261, -16676, -265111, 194865, 211483, -326850, -196537, -181355, -221174, -81188, -165310, -111042, -126357, 49795, -72609, -185193, 15833, -368946, 105226, 204361, 32413, 14186, -13189, -14917, -178758, -6623, 182319, 345250, 200901, 44491, 197653, 52623, -130496, -188655, -142274, 307276, -288945, -72118, -211267, -220466, -64207, -98139, -285429, 72575, -219401, -221743, -120832, -36622, 49994, -290614, -38536, -22646, 254658]
9079a74033O6713A4805a59302A22046D0956a55937e742j36271a2954F8859c3414
9067C4210c99700a47130A44500e056A27874K7151c7670k06747c8904L850j99995
9056b35049c6804k13208h7244j49891C8096d869A40742i1264m98530K20899e008
9044B33687d2566j25229l93672c2217j76362l2794h3401A620b45218o5656J17872
9033a93002o9495a641H6961f7410j11581A4809i0420k1313l4049p1522L011j86921
9021d01214J20061a06121j36670Q9395K0146B06927c65853M252J6681a38252C1816
9009A05722L19150a42283f0687j10880j6761B99830m1223a71206G1405J21788
8999A93193b54729D5676J81881a7905j2211E6471b22354H3140d617E5021P3030
$$ y = [-174033, -107320, 14805, -159302, 122046, 40956, -155937, -5742, -142013, -12954, 68859, -33414, 34210, -399700, -147130, 144500, -5056, 127874, 155025, -37670, -244417, -38904, -35054, -235049, -36804, -250012, -87244, -237135, 38096, -4869, 140742, -91264, -589794, -368895, -5008, 233687, -42566, -167795, -561467, -32217, -208579, -241373, -83401, 1620, -245218, -310874, -193002, -262497, -1641, 86961, -67410, -178991, 14809, -90420, -111733, -145782, -217304, -214293, -401214, -281153, -106121, -242791, -153396, -133250, 206927, -365853, -361601, -344920, -138252, 31816, 105722, 424872, -142283, -60687, -171567, -188328, 299830, 258607, -171206, 71405, 193193, -254729, 45676, 227557, -17905, -30116, 56471, -222354, 83140, -4617, 55021, 128051]
8988A28051a71334j58152J62241k57805a65090k91272C8342J69674b15570R1417
8978a24153A49340D7809h6097B8969f784j07122A88660A819J05983b33212A54419
8966A84064j3402g8763C8884M5557N506c39624Q5533E557K77136j7125G9903f5974
8953a14621b4378p9828C7853a40656E0684b28704k02603G8981b39776Q1464E8958
8941h3317k279F7221a93755j1300j39513G3341L5839c07450d7352A42027c62325
8929g3284H1831K4264C020a28355B47715k2831e3521m695H0234J89276f8351C74128
8916C17952j42100J23962D9917A8208K77805E8200M34352O45167O29556J096653
8906B863928K556820K588849C567008j414477r76605m07722k07506k32632P600
$$ y = [128051, -171334, -329486, -167245, -425050, -165090, -456362, 38342, 208016, -215570, -124153, 149340, 47809, -86097, 28969, -6784, -113906, 188660, 1819, 107802, -233212, 154419, 184064, 170662, -78763, 38884, 84441, 89947, -339624, -254091, 5557, 282693, 265568, 79903, -65974, -114621, -24378, -104206, 37853, -140656, 50684, -228704, -431307, 78981, -239776, -158312, 58958, -83317, -85596, 67221, -193755, -205055, -344568, 73341, 109180, -307450, -47352, 142027, -362325, -73284, 81831, 106095, 3020, -128355, 247715, 224884, -53521, -58216, 80234, 269510, -68351, 374128, 317952, 175852, 299814, 49917, 18208, 296013, 58200, 492552, 1137719, 1767275, 2863928, 5420748, 8009597, 3567008, 2152531, 1175926, 768204, 560698, 328066, 335666]
8897C35666A51801B7846Q0444J69943J59563J36137e9906A84607b01646b9977
8886A3322J18639c16898B64882g7698R947j74497e3419C0557a70229C59328B1259
8874C8802c48170b477p4400d162j44261A68055b56282B28428C067M04517c02685
8862A68785d2740k72546A13537b082B40264e4474J8648p2971a1900d885A3223
8850b27191e2216M751k72127i3552D6538L7502a57547L6092E1546b68556A25204
$$ y = [335666, 151801, 27846, 108290, 278233, 437796, 573933, -59906, 184607, -201646, -29977, 13322, 131961, -316898, 264882, -77698, -67751, -242248, -53419, 30557, -170229, 359328, 21259, 38802, -348170, -2477, -76877, -4162, -148423, 168055, -256282, 228428, 3067, 407584, -302685, 168785, -42740, -315286, 113537, -2082, 240264, -54474, -35826, -108797, -11900, -4885, 13223, -227191, -52216, -47465, -319592, -93552, 46538, 84040, -157547, -121455, 51546, -268556, 125204]
$$ [...]
##END NTUPLES=NMR SPECTRUM
##END=
