
##TITLE=UV1137_M5-1005-1002_6275509_Clq61s99YJ
##JCAMPDX= 6.0         $$ Bruker NMR JCAMP-DX V2.0
##DATA TYPE= NMR SPECTRUM
##DATA CLASS= NTUPLES
##ORIGIN= BRUKER
##OWNER= Administrator
$$ 1.72 TOPSPIN		Version 2.1
$$ 2012-06-04 18:23:14.265 -0500  Administrator@TOPSPIN
$$ Compression mode = diff/dup
##.OBSERVE FREQUENCY= 400.13188235
##.OBSERVE NUCLEUS= ^1H
##.ACQUISITION MODE= SIMULTANEOUS (DQD)
##.ACQUISITION SCHEME= undefined
##.AVERAGES= 64
##.DIGITISER RES= 22
##SPECTROMETER/DATA SYSTEM= spect
##.PULSE SEQUENCE= noesygpps1d.comp
##.SOLVENT NAME= COFFEE_meoh
##.SHIFT REFERENCE= INTERNAL, COFFEE_meoh, 1, 14.96691
##AUDIT TRAIL= $$ (NUMBER, WHEN, WHO, WHERE, PROCESS, VERSION, WHAT)
$$ ##TITLE= Audit trail, TOPSPIN		Version 2.1
$$ ##JCAMPDX= 5.01
$$ ##ORIGIN= Bruker BioSpin GmbH
$$ ##OWNER= Administrator
$$ $$ C:\Bruker\TOPSPIN/data/COFFEE/nmr/UV1137_M5-1005-1002_6275509_Clq61s99YJ/12/pdata/1/auditp.txt
$$ ##AUDIT TRAIL=  $$ (NUMBER, WHEN, WHO, WHERE, PROCESS, VERSION, WHAT)
(   1,<2012-06-03 02:55:13.796 -0500>,<Administrator>,<TOPSPIN>,<go>,<TOPSPIN 2.1>,
      <created by zg
	started at 2012-06-03 02:43:43.531 -0500,
	POWCHK enabled, PULCHK disabled,
       configuration hash MD5:
       D5 CA 7A 23 FE 6B EE E2 50 67 74 61 24 F7 5E 3B
       data hash MD5: 64K
       75 25 C6 D3 2D D9 25 98 A9 55 53 0C 0F 45 CC BD>)
(   2,<2012-06-03 02:55:16.671 -0500>,<Administrator>,<TOPSPIN>,<proc1d>,<TOPSPIN 2.1>,
      <Start of raw data processing
       efp LB = 0.3 FT_mod = 6 PKNL = 1 PHC0 = 0 PHC1 = 0 SI = 128K 
       data hash MD5: 128K
       EA 76 6A 1A 8D 9C 1A 95 F0 8D F9 5A 23 91 E9 4F>)
(   3,<2012-06-03 02:55:17.890 -0500>,<Administrator>,<TOPSPIN>,<proc1d>,<TOPSPIN 2.1>,
      <pk PHC0 = 34.25537 PHC1 = 0 
       data hash MD5: 128K
       83 A5 33 CD 01 88 AB AE 6E 7A 14 C9 27 CA 7E B5>)
(   4,<2012-06-03 02:55:18.562 -0500>,<Administrator>,<TOPSPIN>,<proc1d>,<TOPSPIN 2.1>,
      <abs ABSG = 1 
       data hash MD5: 128K
       BE 25 6C 98 B1 E4 37 6B 8C C4 0F 70 9C 67 5E C6>)
(   5,<2012-06-03 02:55:18.640 -0500>,<Administrator>,<TOPSPIN>,<proc1d>,<TOPSPIN 2.1>,
      <abs ABSG = 2 
       data hash MD5: 128K
       0F 7C 2B F6 37 67 F5 3D 03 FF 26 0F 9B 78 2B FD>)
(   6,<2012-06-03 02:55:18.718 -0500>,<Administrator>,<TOPSPIN>,<proc1d>,<TOPSPIN 2.1>,
      <abs ABSG = 3 
       data hash MD5: 128K
       F6 77 F5 49 05 94 23 E4 A3 09 12 7B 07 F5 C9 72>)
(   7,<2012-06-03 02:55:18.781 -0500>,<Administrator>,<TOPSPIN>,<proc1d>,<TOPSPIN 2.1>,
      <abs ABSG = 4 
       data hash MD5: 128K
       43 3A EF AD 29 E4 6D B5 58 11 B8 5A ED 5E 89 61>)
(   8,<2012-06-03 02:55:18.843 -0500>,<Administrator>,<TOPSPIN>,<proc1d>,<TOPSPIN 2.1>,
      <abs ABSG = 5 
       data hash MD5: 128K
       EF 8A 28 80 A4 52 74 82 09 D5 42 A7 50 D1 9F 3B>)
(   9,<2012-06-03 02:55:21.343 -0500>,<Administrator>,<TOPSPIN>,<audit>,<TOPSPIN 2.1>,
      <user comment:
       ICON-NMR User ID: COFFEE
       data hash MD5: 128K
$$ [...]
##$TP07= 0
##$TPNAME0= <>
##$TPNAME1= <>
##$TPNAME2= <>
##$TPNAME3= <>
##$TPNAME4= <>
##$TPNAME5= <>
##$TPNAME6= <>
##$TPNAME7= <>
##$TPOAL= (0..7)
0.5 0.5 0.5 0.5 0.5 0.5 0.5 0.5
##$TPOFFS= (0..7)
0 0 0 0 0 0 0 0
##$TUNHIN= 0
##$TUNHOUT= 0
##$TUNXOUT= 0
##$USERA1= <user>
##$USERA2= <user>
##$USERA3= <user>
##$USERA4= <user>
##$USERA5= <user>
##$V9= 5
##$VALIST= <valist>
##$VCLIST= <CCCCCCCCCCCCCCC>
##$VD= 0
##$VDLIST= <DDDDDDDDDDDDDDD>
##$VPLIST= <PPPPPPPPPPPPPPP>
##$VTLIST= <TTTTTTTTTTTTTTT>
##$WBST= 2048
##$WBSW= 25
##$XGAIN= (0..3)
0 0 0 0
##$XL= 0
##$YL= 0
##$YMAX_a= 12638967
##$YMIN_a= -7215507
##$ZGOPTNS= <>
##$ZL1= 120
##$ZL2= 120
##$ZL3= 120
##$ZL4= 120
##$ABSF1= 14.96691
##$ABSF2= -5.58562
##$ABSG= 5
##$ABSL= 3
##$ALPHA= 0
##$AQORDER= 0
##$ASSFAC= 0
##$ASSFACI= 0
##$ASSFACX= 0
##$ASSWID= 0
##$AUNMP= <proc_prof1d_extract.lims>
##$AXLEFT= 0
##$AXNAME= <>
##$AXNUC= <1H>
##$AXRIGHT= 0
##$AXTYPE= 0
##$AXUNIT= <>
##$AZFE= 0.1
##$AZFW= 0.1
##$BCFW= 0
##$BC_mod= 0
##$BYTORDP= 0
##$COROFFS= 0
##$CY= 15
##$DATMOD= 1
##$DC= 0
##$DFILT= <>
##$DTYPP= 0
##$F1P= 0
##$F2P= 0
##$FCOR= 0.5
##$FTSIZE= 131072
##$FT_mod= 6
##$GAMMA= 0
##$GB= 0
##$INTBC= 1
##$INTSCL= 1
##$ISEN= 128
##$LB= 0.3
##$LEV0= 0
##$LPBIN= 0
##$MAXI= 10000
##$MC2= 0
##$MEAN= 0
##$ME_mod= 0
##$MI= 0
##$NCOEF= 0
##$NC_proc= -3
##$NLEV= 6
##$NOISF1= 0
##$NOISF2= 0
##$NSP= 0
##$NTH_PI= 0
##$NZP= 0
##$OFFSET= 14.96691
##$PC= 1
##$PHC0= 34.25537
##$PHC1= 0
##$PH_mod= 1
##$PKNL= yes
##$PPARMOD= 0
##$PPDIAG= 0
##$PPIPTYP= 0
##$PPMPNUM= 2147483647
##$PPRESOL= 1
##$PSCAL= 4
##$PSIGN= 0
##$PYNMP= <proc.py>
##$REVERSE= no
##$SF= 400.13000548414
##$SI= 131072
##$SIGF1= 0
##$SIGF2= 0
##$SINO= 400
##$SIOLD= 131072
##$SPECTYP= <>
##$SREGLST= <1H.CDCl3>
##$SSB= 0
##$STSI= 131072
##$STSR= 0
##$SW_p= 8223.68421052632
##$SYMM= 0
##$S_DEV= 0
##$TDeff= 65536
##$TDoff= 0
##$TI= <>
##$TILT= no
##$TM1= 0
##$TM2= 0
##$TOPLEV= 0
##$USERP1= <user>
##$USERP2= <user>
##$USERP3= <user>
##$USERP4= <user>
##$USERP5= <user>
##$WDW= 1
##$XDIM= 131072
##$YMAX_p= 478016814
##$YMIN_p= -352856309
##$CURPLOT= <Network HP LaserJet P1505>
##$CURPRIN= <$Network HP LaserJet P1505>
##$DFORMAT= <normdp>
##$LAYOUT= <+/1D_H.xwp>
##$LFORMAT= <normlp>
##$PFORMAT= <normpl>
##$SURQMSG= 1
$$ End of Bruker specific parameters
$$ ---------------------------------
##NTUPLES= NMR SPECTRUM
##VAR_NAME=  FREQUENCY,     SPECTRUM/REAL,   SPECTRUM/IMAG
##SYMBOL=    X,             R,               I
##VAR_TYPE=  INDEPENDENT,   DEPENDENT,       DEPENDENT
##VAR_FORM=  AFFN,          ASDF,            ASDF
##VAR_DIM=   131072,        131072,          131072
##UNITS=     HZ,            ARBITRARY UNITS, ARBITRARY UNITS
##FACTOR=    0.0627417313425165, 1,          1
##FIRST=     8223.62146879498, -383,         -120303
##LAST=      0,             1811,            -121215
##MIN=       0,             -352856309,      0
##MAX=       8223.62146879498, 478016814,    0
$$ Real data points
##PAGE= N=1
##DATA TABLE= (X++(R..R)), XYDATA
$$ [...]
61155A424689J2685J1153J0748J1434J2068J2204J1980J1027Q880O101L924K997
$$ 1424689 1437374 1448527 1459275 1470709 1482777 1494981 1506961 1517988 1526868 1532969 1536893 1539890
61143A539890L082L617M013L907L633L988N157O497P652R160J1527J4390J7046
$$ 1539890 1542972 1546589 1550602 1554509 1558142 1562130 1567287 1573784 1581436 1590596 1602123 1616513 1633559
61130A633559J9058J9985J9340J7376J5173J3434J1754R488O676L782J170o39
$$ 1633559 1652617 1672602 1691942 1709318 1724491 1737925 1749679 1759167 1765843 1769625 1770795 1770156
61118A770156j031j63P46M71j203l734o438q581r645r983j0614j1917j3074j3258
$$ 1770156 1769125 1768962 1769708 1770179 1768976 1765242 1758804 1750223 1740578 1730595 1719981 1708064 1694990 1681732
61104A681732j2956j3579j5828j8850k0928k1127k0277k0033k0798k1218k0218
$$ 1681732 1668776 1655197 1639369 1620519 1599591 1578464 1558187 1538154 1517356 1496138 1475920
61093A475920j8621j7864j7778j7093j5522j3871j2260r937o939m400k999k450
$$ 1475920 1457299 1439435 1421657 1404564 1389042 1375171 1362911 1352974 1346035 1341635 1338636 1336186
61081A336186k686m009n829o893p094p423p737o548l760j601j517j824j33L251
$$ 1336186 1333500 1329491 1323662 1316769 1309675 1302252 1294515 1287967 1284207 1282606 1281089 1279265 1279132 1282383
61067A282383O146P802R446J1948J4757J7264J9746K2478K4946K6586K7820K9760
$$ 1282383 1288529 1296331 1305777 1317725 1332482 1349746 1369492 1391970 1416916 1443502 1471322 1501082
61055A501082L2725L5471L6460L6006L6443L9340M3163M4887M3615M1218L9369
$$ 1501082 1533807 1569278 1605738 1641744 1678187 1717527 1760690 1805577 1849192 1890410 1929779
61044A929779L7604L4871L1455K8379K5892K3538K0973J7807J3284O947n53p928
$$ 1929779 1967383 2002254 2033709 2062088 2087980 2111518 2132491 2150298 2163582 2170529 2169976 2162048
61032B162048j4294j9481k3658k6888k8941k9698k9945l1139l3588l5554l5347
$$ 2162048 2147754 2128273 2104615 2077727 2048786 2019088 1989143 1958004 1924416 1888862 1853515
61021A853515l3745l2822l2886l2417l0805k9067k7628k5650k3146k1462k0811
$$ 1853515 1819770 1786948 1754062 1721645 1690840 1661773 1634145 1608495 1585349 1563887 1543076
61010A543076j9299j5681j1360q248o255m171j705P99L412N993P588P836P961
$$ 1543076 1523777 1508096 1496736 1488488 1482233 1478062 1476357 1477156 1480568 1486561 1494149 1501985 1509946
60997A509946R110J0638J1328J1531J2701J5443J9078K2647K5504K7553K9541
$$ 1509946 1519056 1529694 1541022 1552553 1565254 1580697 1599775 1622422 1647926 1675479 1705020
60986A705020L2539L6580M0621M4080M7335N0511N3262N6089O0051O4809O8863
$$ 1705020 1737559 1774139 1814760 1858840 1906175 1956686 2009948 2066037 2126088 2190897 2259760
60975B259760P2330P7124Q3475Q8917R2150R5275J00305J05974J10458J14986
$$ 2259760 2332090 2409214 2492689 2581606 2673756 2769031 2869336 2975310 3085768 3200754
60965C200754J21984J31203J40362J48283J55003J60341J64966J71536J82066
$$ 3200754 3322738 3453941 3594303 3742586 3897589 4057930 4222896 4394432 4576498
60956D576498J95391K09746K26320K47408K72465K99258L27689L59458L95457
$$ 4576498 4771889 4981635 5207955 5455363 5727828 6027086 6354775 6714233 7109690
60947G109690M37006M88049N51877O26908P10029Q02729R08990J029011J162014
$$ 7109690 7546696 8034745 8586622 9213530 9923559 10726288 11635278 12664289 13826303
60938A3826303J314343J496374J711308J956658K233891K531154K776463K826698
$$ 13826303 15140646 16637020 18348328 20304986 22538877 25070031 27846494 30673192
60930C0673192K549451J946008J186785N06153N6530j39486j26853M0047K74777
$$ 30673192 33222643 35168651 36355436 36861589 36918119 36778633 36651780 36691827 36966604
60921C6966604M19445K94977j71545q74090j595655k150916k470635k580749k539410
$$ 36966604 37386049 37681026 37509481 36635391 35039736 32888820 30418185 27837436 25298026
60912B5298026k401558k214075k012512j814529j623597j441043j271292j117912
$$ 25298026 22896468 20682393 18669881 16855352 15231755 13790712 12519420 11401508
60904A1401508r81071q60061p54842o64495n86970n20752m64745m16716l74011
$$ 11401508 10420437 9560376 8805534 8141039 7554069 7033317 6568572 6151856 5777845
60895E777845l35636l01762k71692k44277k19854j99522j82635j67156j52379
$$ 5777845 5442209 5140447 4868755 4624478 4404624 4205102 4022467 3855311 3702932
60886C702932j39336j28575j19565j12382j07696j04498r9996r2820q4781p8407
$$ 3702932 3563596 3435021 3315456 3203074 3095378 2990880 2890884 2798064 2713283 2634876
60876B634876p3990p0150o6202o2508n9121n5490n1638m8534m6844m5859m4234
$$ 2634876 2560886 2490736 2424534 2362026 2302905 2247415 2195777 2147243 2100399 2054540 2010306
60865B010306m1709l9497l8623l8292l6562l2702k8103k4563k2341k0477j8452
$$ 2010306 1968597 1929100 1890477 1852185 1815623 1782921 1754818 1730255 1707914 1687437 1668985
60854A668985j6666j5371j3950j1676q821o484n184l970j511J947M619N653O540
$$ 1668985 1652319 1636948 1622998 1611322 1602501 1596017 1590833 1586863 1585352 1587299 1591918 1597571 1604111
60841A604111Q858J1576J2460J1872J2824J6702K1138K3356K3770K4554K6111
$$ 1604111 1612969 1624545 1637005 1648877 1661701 1678403 1699541 1722897 1746667 1771221 1797332
60830A797332K7116K7253K7729K9188L0921L2341L3638L4628L4441L2904L1246
$$ 1797332 1824448 1851701 1879430 1908618 1939539 1971880 2005518 2040146 2074587 2107491 2138737
60819B138737L0624L0606K9730K7088K3051J8781J5316J2753J0022N853K26n417
$$ 2138737 2169361 2199967 2229697 2256785 2279836 2298617 2313933 2326686 2336708 2342561 2342787 2337370
60807B337370r763j3180j7188k2410k7536l0736l1878l2613l4173l5906l6555
$$ 2337370 2327607 2314427 2297239 2274829 2247293 2216557 2184679 2152066 2117893 2081987 2045432
60796B045432l6253l6115l6330l6145l5710l6374l8465m0182l9677l7284l4687
$$ 2045432 2009179 1973064 1936734 1900589 1864879 1828505 1790040 1749858 1710181 1672897 1638210
60785A638210l2663l0767k8722k6979k6102k6421k7978l0130l1502l1151k9557
$$ 1638210 1605547 1574780 1546058 1519079 1492977 1466556 1438578 1408448 1376946 1345795 1316238
60774A316238k7829k6304k4659k2923k1497k0385j9279j8198j7317j6358j4943
$$ 1316238 1288409 1262105 1237446 1214523 1193026 1172641 1153362 1135164 1117847 1101489 1086546
60763A086546j3293j1814j0232q112o023n137n621o315o172n236m040k835j671
$$ 1086546 1073253 1061439 1051207 1043095 1037072 1031935 1026314 1019999 1013827 1008591 1004551 1001716 1000045
60750A000045o93j33k72j252k444k406l77K353L592K786J406P03L01n30j347j206
$$ 1000045 999352 999219 998947 997695 995251 992845 992468 994821 998413 1001199 1002605 1003308 1003609 1003079 1001732 1000526
60734A000526j84O20L69q65k424l610m087m191m608n523o337o488o204o123o571
$$ 1000526 1000342 1000962 1001331 1000466 998042 994432 990345 986154 981546 976023 969686 963198 956994 950871 944300
60719I44300p411q268q559p841o523n814o418p637q287q093p567o893n838m595
$$ 944300 936889 928621 920062 912221 905698 899884 893466 885829 877542 869449 861882 854989 849151 844556
60705H44556l760l314k560j280j34M03O75R78R21L58Q5O22J023J84j137j124L43
$$ 844556 840796 837482 834922 833642 833508 833911 834586 835564 836485 836843 836928 837550 838573 838757 837620 836496 836839
60688H36839J479J451J744L623N836O327N247M474M605M226K222p64l451n294
$$ 836839 838318 839769 841513 845136 850972 857299 862546 867020 871625 875851 878073 877309 873858 868564
60674H68564o256o346n871n321m635l458k427l027n510q016q635p535o222n487
$$ 868564 862308 855962 850091 844770 840135 836677 834250 831223 825713 817697 809062 801527 795305 789818
60660G89818n145n100n435n688n266m500m325m860n271n069m672m459m125l343
$$ 789818 784673 779573 774138 768450 763184 758684 754359 749499 744228 739159 734487 730028 725903 722560
60646G22560k418j812j524j363j435j872k320k197j444o58m18o31p03k86K73M17
$$ 722560 720142 718330 716806 715443 714008 712136 709816 707619 706175 705517 705099 704468 703765 703479 703752 704169
60630G04169J73K20R67J991K614K860L269M041M831N496O358P442Q014P444O227
$$ 704169 704342 704562 705529 707520 710134 712994 716263 720304 725135 730631 736989 744431 752445 759889 766116
60615G66116N470N473N509N121M883N416O349O912P117P399P411O294M256K665
$$ 766116 771586 777059 782568 787689 792572 797988 804337 811249 818366 825765 833176 839470 843726 846391
60601H46391K183J908J077N07J244K587K859J754N45P9j26o57j244j381r87k17
$$ 846391 848574 850482 851559 852066 853310 855897 858756 860510 861055 861134 861008 860351 859107 857726 856739 856522
60585H56522O78J083M28j028k606m289o480q683r744r643r669j0303j0246q336
$$ 856522 857200 858283 858711 857683 855077 850788 844308 835625 825881 816238 806569 796266 786020 777684
60571G77684n319k899j905k203l355m458m215k294JJ296J646J670J183j10j282
$$ 777684 772365 769466 767561 765358 762003 757545 753330 751036 751037 752333 753979 755649 756832 756722 755440
60556G55440j107N0N71k61j602k440k597k310j687p44N12J887K581J668l12j179
$$ 755440 754333 754383 754954 754693 753091 750651 748054 745744 744057 743313 743825 745712 748293 749961 749649 748470
60540G48470L83K835L657K597J419R31K39r55j413m16R74J599J809K367K905K678
$$ 748470 748853 751688 755345 757942 759361 760292 760531 759576 758163 757747 758721 760320 762129 764496 767401 770079
60524G70079K003J754J912J691Q92K30L61J296K675M032M830M828M555N030O744
$$ 770079 772082 773836 775748 777439 778331 778561 778922 780218 782893 786925 791755 796583 801138 806168 812912
60509H12912R051J0744J1231J1097J1361J2265J3125J3476J3749J4377J4731J3698
$$ 812912 821963 832707 843938 855035 866396 878661 891786 905262 919011 933388 948119 961817
60497I61817J1099P740M286R18j945l666m354m879n539n407l542k96L063N629
$$ 961817 972916 980656 984942 985860 983915 980249 975895 971016 965477 960070 956528 956232 959295 964924
60483I64924P402Q934J0649J2333J3288J3563J4708J8322K3491K6915K6252K2574
$$ 964924 972326 981260 991909 1004242 1017530 1031093 1045801 1064123 1087614 1114529 1140781 1163355
60471A163355J8761J6200J3963J0741O352J474l133o865r299j0189r395p040m100
$$ 1163355 1182116 1198316 1212279 1223020 1229372 1230846 1227713 1220848 1211549 1201360 1191965 1184925 1180825
60458A180825k222k230l062k928j516k07p0m72jJ870M462O725Q012Q409Q820J0443
$$ 1180825 1178603 1176373 1173311 1170383 1168867 1168660 1168590 1168118 1168117 1169987 1174449 1181174 1189186 1197595 1206415 1216858
60442A216858J3765J8110K2481K6598L0775L5056L9161M3233M7868N2991N7216
$$ 1216858 1230623 1248733 1271214 1297812 1328587 1363643 1402804 1446037 1493905 1546896 1604112
60431A604112N9054N8506N6859N4846N1732M6407L8653K8791J6744K452j2899
$$ 1604112 1663166 1721672 1778531 1833377 1885109 1931516 1970169 1998960 2015704 2018156 2005257
60420B005257k7098l8796m8521n7271o4614o8947o9383o6654o2139n6835n1586
$$ 2005257 1978159 1939363 1890842 1833571 1768957 1700010 1630627 1563973 1501834 1444999 1393413
60409A393413m7458m4978m3252m0706l6833l2593k8977k5974k3248k1016j9455
$$ 1393413 1345955 1300977 1257725 1217019 1180186 1147593 1118616 1092642 1069394 1048378 1028923
60398A028923j7911j5710j3473j2469j2622j2368j0827q968p988p519o487n026
$$ 1028923 1011012 995302 981829 969360 956738 944370 933543 924575 916587 909068 902581 897555
60386H97555m331m782n432n530n612o545p996q402o587l236n49j11j168j556m27
$$ 897555 893224 888442 883010 877480 871868 865323 857327 848925 842338 839102 838553 838442 837274 835718 835291
60371H35291Q09O61m09j073j376k364l810m086k595q99p16j871k923k910j824
$$ 835291 836100 836761 836352 835279 833903 831539 827729 823643 821048 820149 819433 817562 814639 811729 809905
60356H09905j45J270J562Q80M88J080J751J504J175K451N191P117O506M084J818
$$ 809905 809760 811030 812592 813472 813960 815040 816791 818295 819470 821921 827112 834229 840735 844819 846637
60341H46637P35N90R54J758K911M075M902N189M923M351L917L804L680L166K476
$$ 846637 847372 847962 848916 850674 853585 857660 862562 867751 872674 877025 880942 884746 888426 891592 894068
60326H94068K254K770L627M327M857N529O365O841O331M895L559L490M592N239
$$ 894068 896322 899092 902719 907046 911903 917432 923797 930638 936969 941864 945423 948913 953505 958744
60312I58744L976J470MP55K348K755J982J780K924M072L819K741K487L389M060
$$ 958744 962720 964190 964194 964949 967297 970052 972034 973814 976738 980810 984629 987370 989857 993246 997306
60297I97306L455K383K506M315O623P979Q150P994Q234Q857R754J1272J3469J5211
$$ 997306 1000761 1003144 1005650 1009965 1016588 1024567 1032717 1040711 1048945 1057802 1067556 1078828 1092297 1107508
60283A107508J4955J2640R923Q172O865M611J069k988p009j0908j3939j4693j2798
$$ 1107508 1122463 1135103 1145026 1153198 1160063 1164674 1165743 1162755 1155746 1144838 1130899 1116206 1103408
60270A103408r913q202q197q741q742q161p359o340n054l882l204k828k354j922
$$ 1103408 1093495 1085293 1077096 1068355 1059613 1051452 1044093 1037753 1032699 1028817 1025613 1022785 1020431 1018509
60256A018509j945k119j488K42K159L378M242N638P550R148J0132J1174J2971
$$ 1018509 1016564 1014445 1012957 1013199 1015358 1018736 1022978 1028616 1036166 1045314 1055446 1066620 1079591
60243A079591J5600J8865K2523K5851K7687K7394K5376K2336J8351J3010O220
$$ 1079591 1095191 1114056 1136579 1162430 1190117 1217511 1242887 1265223 1283574 1296584 1302804
60232A302804j394q719j4709j8963k1814k3672k4401k3725k1960j9749j7375j5023
$$ 1302804 1301410 1292691 1277982 1259019 1237205 1213533 1189132 1165407 1143447 1123698 1106323 1091300
60220A091300j3430j3087j2921j1147p793n021m301m617m381l794m062n211o198
$$ 1091300 1077870 1064783 1051862 1040715 1032922 1027901 1023600 1018983 1014602 1010808 1006746 1001535 995337
60207I95337o683p141p429o750n211m193m623n660n661m112k152j250j516j665
$$ 995337 988654 981513 974084 967334 962123 957930 953307 947647 941986 937874 935722 934472 932956 931291
60193I31291p78K79J9j298j782o85L88m4j088j009M2N79L22L39R39J299J351K106
$$ 931291 930513 930792 930811 929513 927731 927046 927434 927390 926302 925293 925335 925914 926236 926575 927514 928813 930164 932270
60175I32270L599M112K542L83J41K283M749N376M017K188J229J252J828L022N117
$$ 932270 935869 939981 942523 942906 943047 945330 950079 955455 959472 961660 962889 964141 965969 968991 974108
60160I74108P492Q773Q433P457O954O834O491N975N737N875O509Q148J0724J2890
$$ 974108 981600 990373 998806 1006263 1013217 1020051 1026542 1032517 1038254 1044129 1050638 1058786 1069510 1082400
60146A082400J3340J2337J1024R895R087R305J0867J2444J2361J0856R554R016
$$ 1082400 1095740 1108077 1119101 1128996 1138083 1147388 1158255 1170699 1183060 1193916 1203470 1212486
60134A212486Q487P717P203O687N415L912L512L831K827l5k714l595l574m148
$$ 1212486 1220973 1228690 1235893 1242580 1247995 1251907 1255419 1259250 1262077 1262042 1259328 1255733 1252159 1248011
60120A248011n146n793o391p349p805p015o176o990q747q816o188k969j719k477
$$ 1248011 1242865 1237072 1230681 1223332 1215527 1208512 1202336 1195346 1186599 1177783 1171595 1168626 1166907 1164430
60106A164430l297l153l039l960m987m477k788k062k894l030p29K132K332k28
$$ 1164430 1161133 1157980 1154941 1150981 1145994 1141517 1138729 1136667 1133773 1130743 1130014 1132146 1134478 1134250
60092A134250k601k891j901p31P38K403L288L211L222L582L182J842J205K186
$$ 1134250 1131649 1128758 1126857 1126126 1126864 1129267 1132555 1135766 1138988 1142570 1145752 1147594 1148799 1150985
60078A150985L347L229K684L401N403P432Q644Q726P550N888N221N668N565M205
$$ 1150985 1154332 1157561 1160245 1163646 1169049 1176481 1185125 1193851 1201401 1207289 1212510 1218178 1223743 1227948
60064A227948L286L990M519K730j97j232L12K533M236N899P619Q530Q525Q516
$$ 1227948 1231234 1235224 1239743 1242473 1242276 1241044 1241356 1243889 1248125 1254024 1261643 1270173 1278698 1287214
60050A287214Q696Q328P363O520N563L458N54j227j134p88j771l447m270m082
$$ 1287214 1295910 1304238 1311601 1318121 1323684 1327142 1327696 1326469 1325335 1324547 1322776 1319329 1315059 1310977
60036A310977l888m125m401m503m647m659l791j705P56K212K190J535J229J174
$$ 1310977 1307089 1302964 1298563 1294060 1289413 1284754 1280963 1279258 1280014 1282226 1284416 1285951 1287180 1288354
60022A288354P08j5k34j24r07l019n275o564p288q242r158r439r470r984j0869
$$ 1288354 1289062 1289047 1288813 1288689 1287782 1284763 1279488 1272924 1265636 1257394 1248236 1238797 1229327 1219343 1208474
60007A208474j1699j2707j4020j4647j3699j1989j1051j1016j0858j0232r596
$$ 1208474 1196775 1184068 1170048 1155401 1141702 1129713 1118662 1107646 1096788 1086556 1076960
59996A076960q869p573o108n327n060m469l675l396l287k325o68P35K226M831
$$ 1076960 1068091 1060518 1054410 1049083 1044023 1039554 1035879 1032483 1029196 1026871 1026203 1026938 1029164 1033995
59982A033995P492P485M549K125L002N704P030O538O249O846O742M886K519J375
$$ 1033995 1041487 1048972 1053521 1055646 1058648 1064352 1071382 1077920 1084169 1091015 1097757 1102643 1105162 1106537
59968A106537J397J032p77l514n778o709o700o855p833r333j0617j1129j0587
$$ 1106537 1107934 1108966 1108189 1104675 1098897 1092188 1085488 1078633 1070800 1061467 1050850 1039721 1029134
59955A029134q998p011n858o378p956q853p923n983n069o111p768q043o685n077
$$ 1029134 1020136 1013125 1007267 1000889 992933 984080 976157 970174 965105 958994 951226 943183 936498 931421
59941I31421l930k437q4J991K439J518M33l10q03q18k97o5o37q21Q68L776N708
$$ 931421 927491 925054 924970 926961 929400 930918 931351 931041 930238 929420 929123 929058 928421 927600 928468 932244 937952
59924I37952N751M899L981K822J676J522K342K718J910Q49L28l09j665k849k845
$$ 937952 943703 948602 952583 955405 957081 958603 960945 963663 965573 966422 966750 966441 964776 961927 959082
59909I59082k263k414l283l685l071k051j328j006q80p27l28L38R93J464J924
$$ 959082 956819 954405 951122 947437 944366 942315 940987 939981 939101 938374 938046 938384 939377 940841 942765
59894I42765K519L032L230L171K956K554K164K358L480N128O476O923O385N264
$$ 942765 945284 948316 951546 954717 957673 960227 962391 964749 968229 973357 979833 986756 993141 998405
59880I98405M161L349K589J788J471J994K583K150R08J71N14J183J497J557J344
$$ 998405 1002566 1005915 1008504 1010292 1011763 1013757 1016340 1018490 1019398 1019569 1020083 1021266 1022763 1024320 1025664
59865A025664L97r32j184L03K150K662K061J903K796L850M226M185M479N436O779
$$ 1025664 1026061 1025129 1023945 1024248 1026398 1029060 1031121 1033024 1035820 1039670 1043896 1048081 1052560 1057996 1064775
59850A064775P912Q220P467N908L961J902J2j256j578j057j36P18J235J520J971
$$ 1064775 1072687 1080907 1088374 1094282 1098243 1100145 1100157 1098901 1097323 1096266 1096130 1096848 1098083 1099603 1101574
59835A101574K746L454L817M309N418O424O014M279L045L705N683P571Q748R172
$$ 1101574 1104320 1107774 1111591 1115900 1121318 1127742 1133756 1138035 1141080 1144785 1150468 1158039 1166787 1175959
59821A175959Q540O871N354N256O119O267N190M217M293M186J913k464o638q738
$$ 1175959 1184499 1191370 1196724 1201980 1208099 1214366 1219556 1223773 1228066 1232252 1234165 1231701 1225063 1216325
59807A216325r239r703j0427j0485r681r032q965q367o398m226l648m431m454
$$ 1216325 1207086 1197383 1186956 1176471 1166790 1157758 1148793 1140426 1134028 1129802 1126154 1121723 1117269
59794A117269k509K28J858K054K254M071P664J1441J3500J3640J3545J4441J5367
$$ 1117269 1114760 1114988 1116846 1118900 1121154 1125225 1132889 1144330 1157830 1171470 1185015 1199456 1214823
59781A214823J4666J2414R905P345L935K28j636p14J357K562K619K047N71k182
$$ 1214823 1229489 1241903 1251808 1259153 1263088 1263316 1261680 1260966 1262323 1264885 1267504 1269551 1270122 1267940
59767A267940n306p356q071q435r303j0673j2014j2718j2543j1939j1598j1410
$$ 1267940 1262634 1255278 1247207 1238772 1229469 1218796 1206782 1194064 1181521 1169582 1157984 1146574
59755A146574j0563q866p187o109n026l166p85J190K173K001P40j000k230k613
$$ 1146574 1136011 1127145 1119958 1113849 1108823 1105657 1104872 1106062 1108235 1110236 1110976 1109976 1107746 1105133
59741A105133k808l411m244n016n760o102n206l258j978k599m124m622l643k231
$$ 1105133 1102325 1098914 1094670 1089654 1083894 1077792 1072586 1069328 1067350 1064751 1060627 1056005 1052362 1050131
59727A050131j135l25pq11k675m359m467k711l04P83o07l550n766n960m920m020
$$ 1050131 1048996 1048671 1048664 1047853 1045178 1040819 1036352 1033641 1033337 1034120 1033513 1029963 1024197 1018237 1013317 1009297
59711A009297l392k267m34J480K766K985J970J94j161j137J73K068L983N343N427
$$ 1009297 1005905 1003638 1003204 1004684 1007450 1010435 1012405 1012599 1011438 1010301 1010474 1012542 1016525 1021868 1027295
59696A027295M249L023K933L755M411M546M752N469O526P667Q879J0055J0786
$$ 1027295 1031544 1034567 1037500 1041255 1045666 1050212 1054964 1060433 1066959 1074626 1083505 1093560 1104346
59683A104346J0635R551Q059O902O199N236L661K495K905M244M700L990L685M503
$$ 1104346 1114981 1124532 1132591 1139493 1145692 1150928 1154589 1157084 1159989 1164233 1168933 1172923 1176608 1181111
59669A181111N110M545L981M657N649N402M315L925M339M348L562K695K014J179
$$ 1181111 1186221 1190766 1194747 1199404 1205053 1210455 1214770 1218695 1223034 1227382 1230944 1233639 1235653 1236832
59655A236832L76K06N62Q71J174J753K091J590R20J156J878J715P09M33J601L095
$$ 1236832 1237208 1237414 1237976 1238847 1240021 1241774 1243865 1245455 1246375 1247531 1249409 1251124 1251833 1252266 1253867 1256962
59639A256962L670L318K676K211K265K904L545L622L570M106M736M311K889J640
$$ 1256962 1260632 1263950 1266626 1268837 1271102 1274006 1277551 1281173 1284743 1288849 1293585 1297896 1300785 1302425
59625A302425Q39m20k237l267k664j413j082k276m718p663r697r394p013m626
$$ 1302425 1303264 1302844 1300607 1297340 1294676 1293263 1292181 1289905 1285187 1277524 1267827 1258433 1251420 1246794
59611A246794l968m863o265p689r036r892r904r310q410p035n145l418k645k749
$$ 1246794 1242826 1237963 1231698 1224009 1214973 1205081 1195177 1185867 1177457 1170422 1165277 1161859 1159214 1156465
59597A156465k740j577Q87L453M426L451K137K115K949L117K461K110K159J370
$$ 1156465 1153725 1152148 1153035 1156488 1160914 1164365 1166502 1168617 1171566 1174683 1177144 1179254 1181413 1182783
59583A182783o09k508l409l784m081m036m089n459p830q869p490n787n974p112
$$ 1182783 1182174 1179666 1176257 1172473 1168392 1164356 1160267 1154808 1146978 1138109 1130619 1124832 1118858 1111746
59569A111746o854n166l936l730l355k365j735k004k695l580m730n246l934j517
$$ 1111746 1104892 1099726 1095790 1092060 1088705 1086340 1084605 1082601 1079906 1076326 1071596 1066350 1062416 1060899
59555A060899l44j252k523k667k445l034l811l461k191j252q97k35J127K499L096
$$ 1060899 1060555 1059303 1056780 1054113 1051668 1048634 1044823 1041362 1039171 1037919 1037022 1036787 1037914 1040413 1043509
59540A043509K635J101j142k979l232k037r02j036k051k575j865m94M17L97k6
$$ 1043509 1046144 1047245 1046103 1043124 1039892 1037855 1036953 1035917 1033866 1031291 1029426 1028932 1029349 1029746 1029720
59525A029720p5L13M15n42k711n462p464p241m522j158K10j069k954l242k025
$$ 1029720 1029645 1029958 1030373 1029831 1027120 1021658 1014194 1006953 1002431 1001273 1001483 1000414 997460 994218 992193
59510I92193q72n63q56j763l435m960m853l138j494r62p54J34J396K288K800L036
$$ 992193 991321 990758 989902 988139 984704 979744 974891 971753 970259 969297 968543 968677 970073 972361 975161 978197
59494I78197K567J556J473L274N602O257N041L674L241L335L637M602O260P750
$$ 978197 980764 982320 983793 987067 992669 998926 1003967 1007641 1010882 1014217 1017854 1022456 1028716 1036466
59480A036466Q624R502J0845J2162J3012J3896J5510J7710J9768K1011K0710J8019
$$ 1036466 1045090 1054592 1065437 1077599 1090611 1104507 1120017 1137727 1157495 1178506 1199216 1217235
59468A217235J2729N883o74n242o962o292m766l563k305p6K601L976L409K115
$$ 1217235 1229964 1235847 1235173 1229931 1222969 1216677 1211911 1208348 1206043 1205967 1208568 1212544 1215953 1218068
59454A218068J187J61j824m594p412r843j1449j1747j1274j1474j2632j3127j1858
$$ 1218068 1219255 1219416 1217592 1212998 1205586 1195743 1184294 1172547 1161273 1149799 1137167 1124040 1112182
59441A112182j0159r765r997q901o558n053n229n396l880j306M64P29M12P04J801
$$ 1112182 1102023 1092258 1082261 1073360 1066802 1061749 1056520 1051124 1047244 1045938 1046402 1047131 1047543 1048247 1050048
59426A050048K818K764J696Q81J539L547N762P257P826P719P537Q180J0039J2293
$$ 1050048 1052866 1055630 1057326 1058207 1059746 1063293 1069055 1076312 1084138 1091857 1099394 1107574 1117613 1129906
59412A129906J3597J3440J2325J0752Q713O296M176L124L070K859J331j091k249
$$ 1129906 1143503 1156943 1169268 1180020 1188733 1195029 1199205 1202329 1205399 1208258 1209589 1208498 1206249
59399A206249n00L023N492N922O281Q499J1725J3754J4008J3692J3673J3766J3835
$$ 1206249 1205749 1208772 1214264 1220186 1226467 1234966 1246691 1260445 1274453 1288145 1301818 1315584 1329419
59386A329419J4157J4610J4604J3848J2276R368M602j343o741j0416j2545j3923
$$ 1329419 1343576 1358186 1372790 1386638 1398914 1408282 1412884 1411541 1404800 1394384 1381839 1367916
59374A367916j4987j5578j5118j3154j0177p667o752p065p396p011n830l821j132
$$ 1367916 1352929 1337351 1322233 1309079 1298902 1291235 1284483 1277418 1270022 1263011 1257181 1253360 1252228
59361A252228J578L734N639Q048J1170J4602J7894K0660K2593K3796K4780K5906
$$ 1252228 1253806 1257540 1263179 1271227 1282397 1296999 1314893 1335553 1358146 1381942 1406722 1432628
59349A432628K7418K9858L2938L3700K7902J4717j244j3990k1081k3522k2776
$$ 1432628 1460046 1489904 1522842 1556542 1584444 1599161 1597917 1583927 1562846 1539324 1516548
59338A516548j9966j6461j2556o611J728Q162O665l780j7710k8561l3502l3249
$$ 1516548 1496582 1480121 1467565 1460954 1462682 1470844 1477509 1473729 1456019 1427458 1393956 1360707
59326A360707l0040k6544k4379k2601j9227j4573j1132r700q131m893j525j85
$$ 1360707 1330667 1304123 1279744 1257143 1237916 1223343 1212211 1202511 1194380 1189487 1187962 1187777
59314A187777o35j208j212p15P09L259N796P035P311P886Q952R521Q999P908P150
$$ 1187777 1187142 1185934 1184722 1184007 1184716 1187975 1193771 1200806 1208117 1216003 1224955 1234476 1243475 1251383 1258533
59299A258533P289Q459J0389J2500J4235J5393J6239J7423J9333K1172K1423K0005
$$ 1258533 1265822 1274281 1284670 1297170 1311405 1326798 1343037 1360460 1379793 1400965 1422388 1442393
59287A442393J9156K0856K4053K6106K6478K6894K7840K7335K4097J9794J6722
$$ 1442393 1461549 1482405 1506458 1532564 1559042 1585936 1613776 1641111 1665208 1685002 1701724
59276A701724J4743J2089Q346M894K627M88l196q451j3275j5862j6885j8708k2123
$$ 1701724 1716467 1728556 1736902 1741796 1744423 1744911 1741715 1733264 1719989 1704127 1687242 1668534 1646411
59263A646411k5123k5737k4639k3597k2673k0881j8656j7328j6754j5778j4564
$$ 1646411 1621288 1595551 1570912 1547315 1524642 1503761 1485105 1467777 1451023 1435245 1420681
59252A420681j4035j3437j1219q196o754o748n364j767J369K111J961K846M353
$$ 1420681 1406646 1393209 1381990 1373794 1367040 1360292 1354928 1353161 1354530 1356641 1358602 1361448 1365801
59239A365801N748Q015J1605J4623J5644J6392J8952K1773K0929J4602M549n882
$$ 1365801 1371549 1379564 1391169 1405792 1421436 1437828 1456780 1478553 1499482 1514084 1518633 1512751
59227A512751j3567j6777j6517j5853j6374j6433j4206j0859q685p600n829l144
$$ 1512751 1499184 1482407 1465890 1450037 1433663 1417230 1403024 1392165 1383480 1375880 1370051 1366907
59215A366907r69J83J149K243K961L476M766P059R485J1332J2677J3765J4407
$$ 1366907 1365938 1366121 1367270 1369513 1372474 1375950 1380716 1387775 1397260 1408592 1421269 1435034 1449441
59202A449441J3856J1043N759k19m420o587q786j2001j4684j5728j6576j8401
$$ 1449441 1463297 1474340 1480099 1479880 1475460 1468873 1460087 1448086 1433402 1417674 1401098 1382697
59190A382697j9293j6898j2495r625r344r471q346o838o457p361q584q806o869
$$ 1382697 1363404 1346506 1334011 1324386 1315042 1305571 1297225 1290387 1283930 1276569 1267985 1259179 1252310
59177A252310k876J275L514L689L135K842L038L809M715M412K075j158l344l827
$$ 1252310 1249434 1250709 1254223 1257912 1261047 1263889 1266927 1270736 1275451 1279863 1281938 1280780 1277436 1273609
59163A273609l208k121j322k008m492p223q536q655q622q220o673m513k917j859
$$ 1273609 1270401 1268280 1266958 1264950 1260458 1253235 1244699 1236044 1227422 1219202 1212529 1208016 1205099 1203240
59149A203240o67K87K75j7O40J886K382K089K134K824L612M538N779O278M900
$$ 1203240 1202573 1202860 1203135 1203118 1203758 1205644 1208026 1210115 1212249 1215073 1218685 1223223 1229002 1235280 1240180
59134A240180K677J796K495L039K622K259K641L245L832M866O006N939M383K784
$$ 1240180 1242857 1244653 1247148 1250187 1252809 1255068 1257709 1260954 1264786 1269652 1275658 1281597 1285980 1288764
59120A288764K509L395M307M213K739O26n96l86k4n41q21N93K814L991M617O742
$$ 1288764 1291273 1294668 1298975 1303188 1305927 1306553 1305957 1305571 1305547 1305006 1304185 1304778 1307592 1311583 1316200 1322942
59104A322942J0146J2102J1448J0245J0493J1370J0967R101P188O330O318N835
$$ 1322942 1333088 1345190 1356638 1366883 1377376 1388746 1399713 1408814 1416002 1422332 1428650 1434485
59092A434485L461n82l934m614l876m802q154j1368j1970j0193p790o021n497
$$ 1434485 1437946 1437364 1433430 1428816 1424940 1420138 1411984 1400616 1388646 1378453 1370663 1364642 1359145
59079A359145o491q463j0157j0708j0055q494o890o843r012j1357j0886p390l783
$$ 1359145 1352654 1344191 1334034 1323326 1313271 1304777 1297887 1291044 1282032 1270675 1259789 1252399 1248616
59066A248616k407k599k349q65J135K490K530J778J784L374N441O670P707R856
$$ 1248616 1246209 1243610 1241261 1240396 1241531 1244021 1246551 1248329 1250113 1253487 1258928 1265598 1273305 1283161
59052A283161J2298J2876J1505J0338J0302R943Q264O457N774N596M683K972J252
$$ 1283161 1295459 1308335 1319840 1330178 1340480 1350423 1358687 1365144 1370918 1376514 1381197 1384169 1385421
59039A385421K58N38J949L015K162k24k328l365l856l825k863k008k983n157n772
$$ 1385421 1385679 1386217 1388166 1391181 1393343 1393119 1390791 1387426 1383570 1379745 1376882 1374874 1371891 1366734 1360962
59024A360962l940j959j765k534k965l649n575q167j0306j1876j3001j3193j2318
$$ 1360962 1357022 1355063 1353298 1350764 1347799 1344150 1338575 1330408 1320102 1308226 1295225 1282032 1269714
59011A269714j1127j0024q797q011q741j0331j0575r037p749p644o961m677k734
$$ 1269714 1258587 1248563 1239766 1231755 1223014 1212683 1202108 1193071 1185322 1177678 1170717 1166040 1163306
58998A163306k798l305k341j184j940l437k890o92o5k063m071l765k024j008j292
$$ 1163306 1160508 1157203 1154862 1153678 1151738 1148301 1145411 1144719 1144654 1142591 1138520 1134755 1132731 1131723 1130431
58983A130431k015k495k618k319j537n48N6k38j347k389k332r70R53K574L339
$$ 1130431 1128416 1125921 1123303 1120984 1119447 1118899 1118955 1118717 1117370 1114981 1112649 1111679 1112632 1115206 1118545
58968A118545K981J987J901L854O720Q175P824P753R419J1720J2954J3205J3507
$$ 1118545 1121526 1123513 1125414 1129268 1135988 1144163 1151987 1159740 1169159 1180879 1193833 1207038 1220545
58955A220545J3959J3880J3051J1743J0142Q430O762M781K188J8m3J851L492L616
$$ 1220545 1234504 1248384 1261435 1273178 1283320 1291750 1298512 1303293 1305481 1305499 1305456 1307307 1310799 1314415
58941A314415L434M224N216N297N291O773R546J1910J2750J2111J0378Q154O405
$$ 1314415 1317849 1322073 1327289 1332586 1337877 1344650 1354196 1366106 1378856 1390967 1401345 1409499 1415904
58928A415904N637N298M713L925L015J532o59k688l508k787o88K144M211M271
$$ 1415904 1421541 1426839 1431552 1435477 1438492 1440024 1439365 1436677 1433169 1430382 1429694 1431838 1436049 1440320
58914A440320L277L655O135R041J1236J3569J6447J8369J8419J8141J9090K0370
$$ 1440320 1443597 1447252 1453387 1462428 1473664 1487233 1503680 1522049 1540468 1558609 1577699 1598069
58902A598069K0534K0152K0272J9994J7917J4729J1925R004M543p52m740p239
$$ 1598069 1618603 1638755 1659027 1679021 1696938 1711667 1723592 1732596 1737139 1736387 1731647 1724408
58890A724408j0209j4541j8882k1899k3697k4666k4647k3850k3162k2993k2759
$$ 1724408 1714199 1699658 1680776 1658877 1635180 1610514 1585867 1562017 1538855 1515862 1493103
58879A493103k1830k0233j8244j5960j3438j0827q457o903o511o623o085m827
$$ 1493103 1471273 1451040 1432796 1416836 1403398 1392571 1384114 1377211 1370700 1364077 1357992 1353165
58867A353165l962m018m165l760l263l004k455j642j693k868l550k501o43O61
$$ 1353165 1349203 1345185 1341020 1337260 1333997 1330993 1328538 1326896 1325203 1322335 1318785 1316284 1315641 1316302
58853A316302J665L034M123M195M079M866O113P103Q445J0589J2158J2077J2144
$$ 1316302 1317967 1321001 1325124 1329319 1333398 1338264 1344377 1351480 1359925 1370514 1382672 1394749 1406893
58840A406893J4831J9329K2461K3103K3160K4195K5560K6153K5937K5226K4204
$$ 1406893 1421724 1441053 1463514 1486617 1509777 1533972 1559532 1585685 1611622 1636848 1661052
58829A661052K3593K4424K6718K9440L1842L3893L5477L6068L5074L2010K6916
$$ 1661052 1684645 1709069 1735787 1765227 1797069 1830962 1866439 1902507 1937581 1969591 1996507
58818A996507K1213J6959J4213J0446L934l562r226j2932j6561k0532k3482k4850
$$ 1996507 2017720 2034679 2048892 2059338 2063272 2059710 2050484 2037552 2020991 2000459 1976977 1952127
58806A952127k5578k6305k6717k6579k5879k4267k1768j9533j8449j7831j6939
$$ 1952127 1926549 1900244 1873527 1846948 1821069 1796802 1775034 1755501 1737052 1719221 1702282
58795A702282j6784j8408k0464k0863k0042k0175k1624k2673k2500k1862k1058
$$ 1702282 1685498 1667090 1646626 1625763 1605721 1585546 1563922 1541249 1518749 1496887 1475829
58784A475829j9568j7748j6559j5706j4347j3403j4519j6673j6664j3519r814
$$ 1475829 1456261 1438513 1421954 1406248 1391901 1378498 1363979 1347306 1330642 1317123 1307309
58773A307309p850o976n698m250l820m876p145r772j0912q829m207J48K488L504
$$ 1307309 1299459 1292483 1286785 1282535 1278715 1273839 1266694 1256922 1246010 1237181 1232974 1233122 1235610 1239114
58759A239114M151M063L034K320L177N174O963P849P897P440O936O596N785L725
$$ 1239114 1243265 1247328 1250362 1252682 1255859 1261033 1267996 1275845 1283742 1291182 1298118 1304714 1310499 1314224
58745A314224R31j016j321o37M1J50o12k004k966k989l433n923r562j1649j1213
$$ 1314224 1315155 1314139 1312818 1312181 1312222 1312372 1311760 1309756 1306790 1303801 1300368 1294445 1284883 1273234 1262021
58730A262021r991r591r508q532o607m501k854j981j581n30J770L920L964K319
$$ 1262021 1252030 1242439 1232931 1224399 1217792 1213291 1210437 1208456 1206875 1206345 1208115 1212035 1215999 1218318
58716A218318J566L057N362O408N523L054k84l132m289m391n339p493q994q530
$$ 1218318 1219884 1222941 1228303 1234711 1240234 1243288 1243004 1239872 1235583 1231192 1225853 1218360 1209366 1200836
58702A200836p176o620o939p141o814o259n722n260m773l814j933O96L475N995
$$ 1200836 1193660 1187040 1180101 1172960 1166146 1159887 1154165 1148905 1144132 1140318 1138385 1139081 1142556 1148551
58688A148551P643P232M490J616J559M593P993R311Q642P586P450Q638J0418J1180
$$ 1148551 1156194 1163426 1167916 1169532 1171091 1175684 1183677 1192988 1201630 1209216 1216666 1225304 1235722 1246902
58674A246902J0154Q761Q940J0367J0960R861Q156O805N805N413O073O956O591
$$ 1246902 1257056 1265817 1274757 1285124 1296084 1305945 1314101 1320906 1326711 1332124 1338197 1345153 1351744
58661A351744N277M856N792O550O323O190O928P721P836P742P858P895P988Q672
$$ 1351744 1357021 1361877 1367669 1374219 1380542 1386732 1393660 1401381 1409217 1416959 1424817 1432712 1440700 1449372
58647A449372R175P726M298R62j218l594p187j0662j2484j3397j5157j8036k0913
$$ 1449372 1458547 1466273 1470571 1471533 1470315 1466721 1459534 1448872 1436388 1422991 1407834 1389798 1368885
58634A368885k2945k4053k4523k4740k4624k3158j9730j5869j3971j4053j3701
$$ 1368885 1345940 1321887 1297364 1272624 1248000 1224842 1205112 1189243 1175272 1161219 1147518
58623A147518j1668r466q665q705q460q129q206q055o815m603j974O57K418K239
$$ 1147518 1135850 1126384 1117719 1109014 1100554 1092425 1084219 1076164 1069349 1064746 1062772 1063429 1065847 1068086
58609A068086N35o83n2J954M513P474J0341J1879J1717J0890J0163R064P181M922
$$ 1068086 1068621 1067938 1067886 1069840 1074353 1081827 1092168 1104047 1115764 1126654 1136817 1145881 1153062 1157984
58595A157984K576P2j959k524k016j949k685l251l564m510n604n139l269k313
$$ 1157984 1160560 1160632 1158673 1156149 1154133 1152184 1149499 1146248 1142684 1138174 1132570 1127431 1124162 1121849
58581A121849l223m402m852n452n938m036N24M182M278K921L476N497O187N122
$$ 1121849 1118626 1114224 1109372 1103920 1097982 1093946 1094470 1098652 1102930 1105851 1109327 1114824 1121011 1126133
58567A126133M335M754N405N578N338M411K684J372J744L117L812L627L706M378
$$ 1126133 1130468 1135222 1140627 1146205 1151543 1155954 1158638 1160010 1161754 1164871 1168683 1172310 1176016 1180394
58553A180394M727M213L429L206L754M529M542L378K096K200L477M136L324K022
$$ 1180394 1185121 1189334 1192763 1195969 1199723 1204252 1208794 1212172 1214268 1216468 1219945 1224081 1227405 1229427
58539A229427J080J31j004j681j935k639l462k793o18Q47O17N85K211M075M654
$$ 1229427 1230507 1230638 1229634 1227953 1226018 1223379 1219917 1217124 1216506 1217353 1217970 1218555 1220766 1224841 1229495
58524A229495N234P623J0867J2777J3363J4302J6129J8050J9570K0391J9677J7309
$$ 1229495 1234729 1242352 1253219 1265996 1279359 1293661 1309790 1327840 1347410 1367801 1387478 1404787
58512A404787J4963J4165J4309J4147J4068J5151J7163J9348K2041K5621K8894
$$ 1404787 1419750 1433915 1448224 1462371 1476439 1491590 1508753 1528101 1550142 1575763 1604657
58501A604657L0492L0920L1477L2110L2092L1819L1891L1263K8325K3262J7615
$$ 1604657 1635149 1666069 1697546 1729656 1761748 1793567 1825458 1856721 1885046 1908308 1925923
58490A925923J2090O512J287k816n905q485j0231j0517r766r067r065j0052j2350
$$ 1925923 1938013 1944525 1945812 1942996 1937091 1928606 1918375 1907858 1898092 1889025 1879960 1869908 1857558
58477A857558j5573j8529k0867k3718k7552l0603l0782k8207k4730k1892k0341
$$ 1857558 1841985 1823456 1802589 1778871 1751319 1720716 1689934 1661727 1636997 1615105 1594764
58466A594764j9954j9433j6992j2679q716o584n206l139r51Kl55j385k972m735
$$ 1594764 1574810 1555377 1538385 1525706 1516990 1510406 1505200 1502061 1501110 1501112 1500757 1499372 1496400 1491665
58452A491665n520m978m478n091o036o182n629m796l611k642l059m424m504k468
$$ 1491665 1486145 1481167 1476689 1471598 1465562 1459380 1453751 1448955 1445344 1442702 1439643 1435219 1430715 1428247
58438A428247j55R02J259J259q1k305k750o66Q95k56j889j145J013K350L535O220
$$ 1428247 1428092 1428994 1430253 1431512 1431431 1429126 1426376 1425710 1426605 1426349 1424460 1423315 1424328 1426678 1430213 1436433
58422A436433R152J0096R868J0900J3116J4704J5696J7437J9537K0543K0613K0606
$$ 1436433 1445585 1455681 1465549 1476449 1489565 1504269 1519965 1537402 1556939 1577482 1598095 1618701
58410A618701J9640J6488J2228Q693N543J730j670l237m305o804r310q775n264
$$ 1618701 1638341 1654829 1667057 1675750 1681293 1683023 1681353 1678116 1673811 1667007 1657697 1648922 1643658
58397A643658j434J767N210Q203Q871P823P886R959J2102J2850J2567J1380Q527
$$ 1643658 1642224 1643991 1649201 1657404 1666275 1674098 1681984 1691943 1704045 1716895 1729462 1740842 1749369
58384A749369M144m63m493p896j0302j1319j1327j0522q242m736j997j035k25
$$ 1749369 1753513 1753050 1748557 1740661 1730359 1719040 1707713 1697191 1688949 1684213 1682216 1681181 1680956
58371A680956J616K712J509P0J174M060O368Q344J1477J4623J5421J4454J4180
$$ 1680956 1682572 1685284 1686793 1686863 1688037 1692097 1698465 1706809 1718286 1732909 1748330 1762784 1776964
58358A776964J4688J3973J1567Q540M913L78l567n497o832r369j1584j1007q790
$$ 1776964 1791652 1805625 1817192 1825732 1830645 1831023 1827456 1821959 1815127 1805758 1794174 1783167 1774377
58345A774377p895q174p345n670n284n809n015l167k416k414p01K903O204Q359
$$ 1774377 1766482 1758308 1750963 1745293 1740009 1734200 1729185 1726018 1723602 1721188 1720487 1723390 1729594 1737953
58331A737953J0013J0522R035P452Q160R779R270P253O698P443O903N354N399
$$ 1737953 1747966 1758488 1767523 1774975 1783135 1792914 1802184 1809437 1816135 1823578 1830481 1835835 1841234
58318A841234O678O351M575M321N856O681O905R093J2423J2786R767Q102J0614
$$ 1841234 1847912 1854263 1858838 1863159 1869015 1875696 1882601 1891694 1904117 1916903 1926670 1934772 1945386
58305A945386J4634J7049J8236J9242J9315J8310J7977J9098K0404K1294K2657
$$ 1945386 1960020 1977069 1995305 2014547 2033862 2052172 2070149 2089247 2109651 2130945 2153602
58294B153602K4191K4132K2208J9915J7611J4537J1644J0918J1817J1872J0808
$$ 2153602 2177793 2201925 2224133 2244048 2261659 2276196 2287840 2298758 2310575 2322447 2333255
58283B333255J0667J2057J3682J5160J6910J8009J7710J7992K0706K3671K3858
$$ 2333255 2343922 2355979 2369661 2384821 2401731 2419740 2437450 2455442 2476148 2499819 2523677
58272B523677K2712K3490K5125K4381K2510K3480K6635K7554K5775K5056K6157
$$ 2523677 2546389 2569879 2595004 2619385 2641895 2665375 2692010 2719564 2745339 2770395 2796552
58261B796552K5948K3856K2720K2777K1264J8480J7927J9854K0892K0577K1859
$$ 2796552 2822500 2846356 2869076 2891853 2913117 2931597 2949524 2969378 2990270 3010847 3032706
58250C032706K4709K5858K5542K7605L2021L4190L2904L2216L4094L5881L6428
$$ 3032706 3057415 3083273 3108815 3136420 3168441 3202631 3235535 3267751 3301845 3337726 3374154
58239C374154L8117M1128M2219M0756L9855M0342L9855L8839M0749M5255M8024
$$ 3374154 3412271 3453399 3495618 3536374 3576229 3616571 3656426 3695265 3736014 3781269 3829293
58228C829293M8265M9604N2620N3774N2830N3987N8364O2515O5435O9609P4389
$$ 3829293 3877558 3927162 3979782 4033556 4086386 4140373 4198737 4261252 4326687 4396296 4470685
58217D470685P6231P6419Q0311Q7883R3238R4590R6173R9351J00814J00770J03605
$$ 4470685 4546916 4623335 4703646 4791529 4884767 4979357 5075530 5174881 5275695 5376465 5480070
58206E480070J09121J12376J13414J17430J24253J28093J28979J33415J42127
$$ 5480070 5589191 5701567 5814981 5932411 6056664 6184757 6313736 6447151 6589278
58197F589278J48491J50988J55512J63112J67747J68743J73029J82185J90046
$$ 6589278 6737769 6888757 7044269 7207381 7375128 7543871 7716900 7899085 8089131
58188H089131J96117K07789K25885K41972K54103K70884K95543L20570L43013
$$ 8089131 8285248 8493037 8718922 8960894 9214997 9485881 9781424 10101994 10445007
58179A0445007L69783M02120M30370M50779M72479N01332N32084N62989O02212
$$ 10445007 10814790 11216910 11647280 12098059 12570538 13071870 13603954 14166943 14769155
58170A4769155O52659P06246P59816Q20060Q86215R46039R96437J049711J112261
$$ 14769155 15421814 16128060 16887876 17707936 18594151 19540190 20536627 21586338 22698599
58161B2698599J176824J243251J325132J426716J535369J646192J770751J912096
$$ 22698599 23875423 25118674 26443806 27870522 29405891 31052083 32822834 34734930
58153C4734930K057008K203744K370045K562208K766507K984580L244539L561260
$$ 34734930 36791938 38995682 41365727 43927935 46694442 49679022 52923561 56484821
58145E6484821L920499M320327M791873N360760O029184O816724P771511Q914444
$$ 56484821 60405320 64725647 69517520 74878280 80907464 87724188 95495699 104410143
58137A04410143J0221278J1685125J3334956J5158379J7080111J9072871K1236821
$$ 104410143 114631421 126316546 139651502 154809881 171889992 190962863 212199684
58130B12199684K3751698K6840534L0712950L5133766L8692356L8762557L2946080
$$ 212199684 235951382 262791916 293504866 328638632 367330988 406093545 439039625
58123D39039625K1096867N906582q704220j9861696k6701896k9772374l0097060
$$ 439039625 460136492 466043074 457338854 437477158 410775262 381002888 350905828
58116C50905828k8755353k6750575k4787821k3111146k1638268k0230570j8817431
$$ 350905828 322150475 295399900 270612079 247500933 225862665 205632095 186814664
58109A86814664j7376618j5916925j4475498j3082590j1740818j0460844r283955
$$ 186814664 169438046 153521121 139045623 125963033 114222215 103761371 94477416
58102I4477416q240481p315675o483355n744791n108641m559994m076798l655745
$$ 94477416 86236935 78921260 72437905 66693114 61584473 57024479 52947681 49291936
58094D9291936l298318k990306k716203k476625k273313k093978j928586j783592
$$ 49291936 45993618 43003312 40287109 37810484 35537171 33443193 31514607 29731015
58086B9731015j663993j557214j449996j345893j251948j163298j075001r94393
$$ 29731015 28067022 26509808 25059812 23713919 22461971 21298673 20223672 19229279
58078A9229279r27746q68012q08496p55375p14332o77998o39032o02820n74951
$$ 19229279 18301533 17433521 16625025 15869650 15155318 14477320 13838288 13235468 12660517
58069A2660517n48543n16501m84566m59781m37164m10132l83578l64339l48398
$$ 12660517 12111974 11595473 11110907 10651126 10213962 9803830 9420252 9055913 8707515
58060H707515l29622l12012l01301k92901k79884k65217k54750k45462k31791
$$ 8707515 8377893 8065881 7764580 7471679 7191795 6926578 6671828 6426366 6194575
58051F194575k16927k06953j99684j89606j78380j70637j64504j55625j46002
$$ 6194575 5977648 5770695 5571011 5381405 5203025 5032388 4867884 4712259 4566257
58042D566257j40148j36764j32059j26886j23347j18965j11248j03338r8505r4007
$$ 4566257 4426109 4289345 4157286 4030400 3907053 3788088 3676840 3573502 3474997 3380990
58032C380990q6697p9417p5404p1821o5344n8770n5540n3225m8969m5782m6716
$$ 3380990 3294293 3214876 3139472 3067651 3002307 2943537 2887997 2834772 2785803 2740021 2693305
58021B693305m8318m6686m4512m5209m5625m2045l7984l8299m0319l8636l4360
$$ 2693305 2644987 2598301 2553789 2508580 2462955 2420910 2382926 2344627 2304308 2265672 2231312
58010B231312l1859l0475k7270k4340k5388k8056k7231k3429k0974k0460j9607
$$ 2231312 2199453 2168978 2141708 2117368 2091980 2063924 2036693 2013264 1992290 1971830 1952223
57999A952223j8946k0070k0832j8689j6171j6800j8417j7033j4439j5041j7529
$$ 1952223 1933277 1913207 1892375 1873686 1857515 1840715 1822298 1805265 1790826 1775785 1758256
57988A758256j6894j2999j0229r798q971p184o751p915q648q892j0099j1329j0632
$$ 1758256 1741362 1728363 1718134 1708336 1699365 1692181 1685430 1677515 1668867 1659975 1649876 1638547 1627915
57975A627915r208r553j0582r376o711o072p995r939j0927j2059j3122j2877j1968
$$ 1627915 1618707 1609154 1598572 1589196 1582485 1576413 1568418 1558479 1547552 1535493 1522371 1509494 1497526
57962A497526j1809j1510r476o835n767n831n482n447o710p076m166l00P3l058
$$ 1497526 1485717 1474207 1464731 1457896 1452129 1446298 1440816 1435369 1428659 1421583 1417417 1417117 1417190 1414132
57948A414132n566n227l479j780j93P48J87j098j579j352j342j313r10j258l073
$$ 1414132 1408566 1403339 1399860 1398080 1397887 1398635 1398822 1397724 1396145 1394793 1393451 1392138 1391228 1389970 1386897
57933A386897m852n225n164n545m949k506l05o7j37J106J836L17j190k4K107K213
$$ 1386897 1382045 1376820 1371656 1366111 1361162 1358656 1358351 1358284 1358147 1359253 1361089 1361406 1360216 1360192 1362299 1364512
57917A364512J228J712K742J849l6l86P9q99k199j023J816L132K827L431N185
$$ 1364512 1365740 1367452 1370194 1372043 1372007 1371621 1371700 1370801 1368602 1367579 1369395 1372527 1375354 1378785 1383970
57902A383970O096O050O421O426M257J137n7M90L38n44j96J030R63k35n58o9j57
$$ 1383970 1390066 1396116 1402537 1408963 1413220 1414357 1414300 1414790 1415128 1414584 1414388 1415418 1416381 1416146 1415588 1415519 1415362
57885A415362K11K922O177O316L848K878M623O359O923Q350J1296J3401J3391
$$ 1415362 1415573 1418495 1424672 1430988 1434836 1437714 1442337 1448696 1455619 1463969 1475265 1488666 1502057
57872A502057J2898J3105J3135J2526J2037J1282Q966O033N210O713P535N682
$$ 1502057 1514955 1528060 1541195 1553721 1565758 1577040 1586006 1592039 1597249 1603962 1611497 1617179
57860A617179K358n46k320k579j413n73j879m347n561n407n561n899m897l210
$$ 1617179 1619537 1618991 1616671 1614092 1612679 1612106 1610227 1605880 1600319 1594912 1589351 1583452 1578555 1575345
57846A575345l207m938n948n179l680j741R98K822J344k122l506j685N46J420
$$ 1575345 1572138 1567200 1561252 1556073 1552393 1550652 1551650 1554472 1555816 1553694 1550188 1548503 1549049 1550469
57832A550469K043K761J989p9o32J330L271L311L007M270O411P784P897O717M387
$$ 1550469 1552512 1555273 1557262 1557183 1556551 1557881 1561152 1564463 1567470 1571740 1578151 1585935 1593832 1600549 1604936
57817A604936K512L155N633O885N781M409M445N075N246N140M471K239q95k625
$$ 1604936 1607448 1610603 1616236 1623121 1628902 1633311 1637756 1642831 1648077 1653217 1657688 1659927 1659032 1656407
57803A656407k314j701j689j245j40K16m27m66N77J326J560K863N227O321N336
$$ 1656407 1654093 1652392 1650703 1649458 1649318 1649534 1649107 1648641 1649218 1650544 1652104 1654967 1660194 1666515 1671851
57788A671851M466N061N465M316L019L062L519L139K509K479K549K360K630L379
$$ 1671851 1676317 1681378 1686843 1691159 1694178 1697240 1700759 1703898 1706407 1708886 1711435 1713795 1716425 1719804
57774A719804L501L203M238O557P492N748L394K364J933J454K467N631Q275P790
$$ 1719804 1723305 1726508 1730746 1737303 1744795 1750543 1753937 1756301 1758234 1759688 1762155 1767786 1776061 1783851
57760A783851N355L720L247K770K691M278O946Q810R390R743J0433J0855J0188
$$ 1783851 1789206 1792926 1796173 1798943 1801634 1805912 1812858 1821668 1831058 1840801 1851234 1862089 1872277
57747A872277Q006M687J787Q13J087M88j209j816k83J622K358K854M080M799L790
$$ 1872277 1880283 1884970 1886757 1887570 1888657 1889145 1887936 1886120 1885837 1887459 1889817 1892671 1896751 1901550 1905340
57732A905340K264K001K760L422M089N133N797N552N333N637N253L773L422N923
$$ 1905340 1907604 1909605 1912365 1915787 1919876 1925009 1930806 1936358 1941691 1947328 1952581 1956354 1959776 1965699
57718A965699R213J0013Q400P238Q011R734J1222J1970J1343R326P621P794Q792
$$ 1965699 1974912 1984925 1993325 2000563 2008574 2018308 2029530 2041500 2052843 2062169 2069790 2077584 2086376
57705B086376Q443O940O411P324P820O928N882N670N416M272L142L212L973M136
$$ 2086376 2094819 2101759 2108170 2115494 2123314 2130242 2136124 2141794 2147210 2151482 2154624 2157836 2161809 2165945
57691B165945L791M313O228Q301R120Q778Q392Q298P738O463N512N658O001N358
$$ 2165945 2169736 2174049 2180277 2188578 2197698 2206476 2214868 2223166 2230904 2237367 2242879 2248537 2254538 2259896
57677B259896M330M462N725O451N816M677L783K949K398L076M809N758M752L026
$$ 2259896 2264226 2268688 2274413 2280864 2286680 2291357 2295140 2298089 2300487 2303563 2308372 2314130 2318882 2321908
57663B321908K598L873N668O817P011O725O718P010O401M087J539J266L572O136
$$ 2321908 2324506 2328379 2334047 2340864 2347875 2354600 2361318 2368328 2374729 2378816 2380355 2381621 2385193 2391329
57649B391329P048O566N633M553L677L563L792L367K857M140P210R430R046P451
$$ 2391329 2398377 2404943 2410576 2415129 2418806 2422369 2426161 2429528 2432385 2436525 2443735 2453165 2462211 2469662
57635B469662O744P048P595Q486R667R877Q537P264P764R345J0251J0299J0485
$$ 2469662 2476406 2483454 2491049 2499535 2509202 2519079 2527616 2534880 2542644 2551989 2562240 2572539 2583024
57622B583024J1004J1456J2242J4045J6295J7726J8222J9093K1521K5347K9153
$$ 2583024 2594028 2605484 2617726 2631771 2648066 2665792 2684014 2703107 2724628 2749975 2779128
57611B779128L1489L2659L5066M0580M7775N3492N6874N9374O0501N6580M5194
$$ 2779128 2810617 2843276 2878342 2918922 2966697 3020189 3077063 3136437 3196938 3253518 3298712
57600C298712K8515J0842m927j7169k4670k8024k9684l0561k8675k3234j7500
$$ 3298712 3327227 3338069 3333142 3315973 3291303 3263279 3233595 3203034 3174359 3151125 3133625
57589C133625j4747j3552j0415n423j756n28K02J605K681K983L723N518P360Q505
$$ 3133625 3118878 3105326 3094911 3089488 3087732 3087204 3087406 3089011 3091692 3094675 3098398 3103916 3111276 3119781
57575C119781R448J0523J1161J1203J1457J2448J3619J4041J3255J1465R619Q818
$$ 3119781 3129229 3139752 3150913 3162116 3173573 3186021 3199640 3213681 3226936 3238401 3248020 3256838
57563C256838Q945Q573P119O136P229R683J1603J2426J2752J2506J1185R426Q525
$$ 3256838 3265783 3274356 3281475 3287611 3294840 3304523 3316126 3328552 3341304 3353810 3364995 3374421 3382946
57550C382946Q652R003R435J0466J1933J3103J3817J4376J4642J4293J3512J2467
$$ 3382946 3391598 3400601 3410036 3420502 3432435 3445538 3459355 3473731 3488373 3502666 3516178 3528645
57538C528645J0976R661J0150J2642J4595J3668J1002R549J0028J0733J0686J0601
$$ 3528645 3539621 3549282 3559432 3572074 3586669 3600337 3611339 3620888 3630916 3641649 3652335 3662936
57526C662936J0902J0920J0308R597R245R308R909J0815J1183J0821J0879J1963
$$ 3662936 3673838 3684758 3695066 3704663 3713908 3723216 3733125 3743940 3755123 3765944 3776823 3788786
57514C788786J2752J2109J1226J1646J2551J2424J2156J3469J5202J4556J1785
$$ 3788786 3801538 3813647 3824873 3836519 3849070 3861494 3873650 3887119 3902321 3916877 3928662
57503C928662J0207J1311J3143J3989J4501J5176J4840J3204J2361J3973J6807
$$ 3928662 3938869 3950180 3963323 3977312 3991813 4006989 4021829 4035033 4047394 4061367 4078174
57492D078174J8603J8928J8848J9047J9463J9759J9327J7823J6157J5858J7064
$$ 4078174 4096777 4115705 4134553 4153600 4173063 4192822 4212149 4229972 4246129 4261987 4279051
57481D279051J8420J9147J9725K0287K0148J9409J9269K0138K1004K1225K1330
$$ 4279051 4297471 4316618 4336343 4356630 4376778 4396187 4415456 4435594 4456598 4477823 4499153
57470D499153K1454K0894J9897K0002K1635K3113K3113K2471K2397K2510K1916
$$ 4499153 4520607 4541501 4561398 4581400 4603035 4626148 4649261 4671732 4694129 4716639 4738555
57459D738555K0839J9944J9294J9135K0311K2510K3577K2166J9938J9417K0448
$$ 4738555 4759394 4779338 4798632 4817767 4838078 4860588 4884165 4906331 4926269 4945686 4966134
57448D966134K0625J8724J6090J4667J5019J6396J7756J8459J8469J8053J7337
$$ 4966134 4986759 5005483 5021573 5036240 5051259 5067655 5085411 5103870 5122339 5140392 5157729
57437E157729J6568J6587J8045J9970K0423J9084J7957J8627K0159K0775K0425
$$ 5157729 5174297 5190884 5208929 5228899 5249322 5268406 5286363 5304990 5325149 5345924 5366349
57426E366349K0335K0876K1450K1864K2342K2482K1678K0430J9929K0291K0461
$$ 5366349 5386684 5407560 5429010 5450874 5473216 5495698 5517376 5537806 5557735 5578026 5598487
57415E598487K0032J9879K0620K1488K1414K0427J9303J8375J7504J6946J7416
$$ 5598487 5618519 5638398 5659018 5680506 5701920 5722347 5741650 5760025 5777529 5794475 5811891
57404E811891J9088K1086K2305K2451K2030K1589K1425K1751K2550K3197K2929
$$ 5811891 5830979 5852065 5874370 5896821 5918851 5940440 5961865 5983616 6006166 6029363 6052292
57393F052292K1917K1208K1263K1338K0754K0047K0016K0381K0407K0297K0773
$$ 6052292 6074209 6095417 6116680 6138018 6158772 6178819 6198835 6219216 6239623 6259920 6280693
57382F280693K1591K1793K1389K1403K2084K2374K1630K0750K0872K1765K2246
$$ 6280693 6302284 6324077 6345466 6366869 6388953 6411327 6432957 6453707 6474579 6496344 6518590
57371F518590K1692K0546J9670J9660K0520K1627K2188K1907K1071K0102J9358
$$ 6518590 6540282 6560828 6580498 6600158 6620678 6642305 6664493 6686400 6707471 6727573 6746931
57360F746931J9286K0207K1817K3199K3538K2662K1159K0068K0097K0759K0757
$$ 6746931 6766217 6786424 6808241 6831440 6854978 6877640 6898799 6918867 6938964 6959723 6980480
57349F980480J9674J8670J8810J9426J9159J8101J7653J8425J9560K0154K0210
$$ 6980480 7000154 7018824 7037634 7057060 7076219 7094320 7111973 7130398 7149958 7170112 7190322
57338G190322K0114K0086K0320K0819K1034K0510J9797J9805K0328K0311J9604
$$ 7190322 7210436 7230522 7250842 7271661 7292695 7313205 7333002 7352807 7373135 7393446 7413050
57327G413050J9307K0104K1277K1758K1367K0717K0637K1638K3285K4120K3133
$$ 7413050 7432357 7452461 7473738 7495496 7516863 7537580 7558217 7579855 7603140 7627260 7650393
57316G650393K1148J9796J9399J9138J8920J9439K0260J9700J7289J4768J3862
$$ 7650393 7671541 7691337 7710736 7729874 7748794 7768233 7788493 7808193 7825482 7840250 7854112
57305G854112J4374J5306J6507J8086J9206J8803J7052J5228J4382J4646J5384
$$ 7854112 7868486 7883792 7900299 7918385 7937591 7956394 7973446 7988674 8003056 8017702 8033086
57294H033086J5536J4494J3033J2723J3932J5211J5190J4341J4083J4791J5508
$$ 8033086 8048622 8063116 8076149 8088872 8102804 8118015 8133205 8147546 8161629 8176420 8191928
57283H191928J5352J4427J3545J3403J4004J4694J4957J5092J5622J6093J5320
$$ 8191928 8207280 8221707 8235252 8248655 8262659 8277353 8292310 8307402 8323024 8339117 8354437
57272H354437J2966J0153Q248P654Q022Q841R507R479Q848Q234P933P723P629
$$ 8354437 8367403 8377556 8385804 8393458 8401480 8410321 8419828 8429307 8438155 8446389 8454322 8462045 8469674
57259H469674Q054Q869R130Q216O670N480N001M820M247K801P85n79k52J223K084
$$ 8469674 8477728 8486597 8495727 8503943 8510613 8516093 8521094 8525914 8530161 8532962 8533747 8533168 8532916 8534139 8536223
57244H536223J256o84k474l208k499o36J069J103o30k656l672l718l437l191l170
$$ 8536223 8537479 8536795 8534321 8531113 8528614 8527978 8529047 8530150 8529520 8526864 8523192 8519474 8516037 8512846 8509676
57229H509676l473l599k711r35M01K74r61k329l337m014m625n870q485j2117j5285
$$ 8509676 8506203 8502604 8499893 8498958 8499359 8499633 8498672 8496343 8493006 8488992 8484367 8478497 8470012 8457895 8442610
57214H442610j6991j7733j8599k0012k1733k3266k3809k2717k0654j9453k0006
$$ 8442610 8425619 8407886 8389287 8369275 8347542 8324276 8300467 8277750 8257096 8237643 8217637
57203H217637k0842j9729j6330j2507j0169r517r382q666p245n723m598l889l375
$$ 8217637 8196795 8177066 8160736 8148229 8138060 8128543 8119161 8110495 8103250 8097527 8092929 8089040 8085665
57190H085665k800j733L0J587J336r47l287l978m151o320j0787j5323j8397k0769
$$ 8085665 8082865 8081132 8081162 8082749 8084085 8083138 8079851 8075873 8071722 8065402 8054615 8039292 8020895 8000126
57176H000126k3511k6280k8514l0688l3279l5716l7553l9603m2601m5453m6252
$$ 8000126 7976615 7950335 7921821 7891133 7857854 7822138 7784585 7744982 7702381 7656928 7610676
57165G610676m4703m2457m1134m0933m1125m0976l9916l7441l3405k8324k3222
$$ 7610676 7565973 7523516 7482382 7441449 7400324 7359348 7319432 7281991 7248586 7220262 7197040
57154G197040j8893j5350j2127r106o562m257j279K603N995P187O074M000K115
$$ 7197040 7178147 7162797 7150670 7141564 7135002 7130745 7129466 7132069 7138064 7145251 7151325 7155325 7157440
57141G157440P74J15k1n02k063m009m934m752m735n420n780n055m238m924p375
$$ 7157440 7158214 7158329 7158308 7157806 7155743 7151734 7146800 7142048 7137313 7131893 7126113 7121058 7116820 7111896 7104521
57126G104521j0479j3096j4793j5451j5027j3962j3429j4458j6566j7909j7467
$$ 7104521 7094042 7080946 7066153 7050702 7035675 7021713 7008284 6993826 6977260 6959351 6941884
57115F941884j6538j7047j8783j9876j9829k0184k1835k3840k5702k8751l3979
$$ 6941884 6925346 6908299 6889516 6869640 6849811 6829627 6807792 6783952 6758250 6729499 6695520
57104F695520m0483m7387n5478o5384p6074q6998r9800j15692j32834j48510j62336
$$ 6695520 6655037 6607650 6552172 6486788 6410714 6323716 6223916 6108224 5975390 5826880 5664544
57093E664544j75040j85752j93048j97254j99105j97531j91450j82466j73224
$$ 5664544 5489504 5303752 5110704 4913450 4714345 4516814 4325364 4142898 3969674
57084C969674j64305j55488j48645j46534j49689j56851j66767j76949j82797
$$ 3969674 3805369 3649881 3501236 3354702 3205013 3048162 2881395 2704446 2521649
57075B521649j81528j75769j70639j69204j73467j86453k08775k35556k61406
$$ 2521649 2340121 2164352 1993713 1824509 1651042 1464589 1255814 1020258 758852
57066G58852k86496A58914a82151l66884l93453m26446m67903n16949n74975o43894
$$ 758852 472356 158914 -182151 -549035 -942488 -1368934 -1836837 -2353786 -2928761 -3572655
57056c572655p21285q03900q94294r97551j113670j240319j380618j540038j717864
$$ -3572655 -4293940 -5097840 -5992134 -6989685 -8103355 -9343674 -10724292 -12264330 -13982194
57047a3982194j910456k120969k357052k621378k914133l241791l612428m025672
$$ -13982194 -15892650 -18013619 -20370671 -22992049 -25906182 -29147973 -32760401 -36786073
57039c6786073m479802m985991n562250o216516o949030p765201q671235r669031
$$ -36786073 -41265875 -46251866 -51814116 -58030632 -64979662 -72744863 -81416098 -91085129
57031i1085129j0773582j2004798j3309876j4519362j5485350j6308273j7331188
$$ -91085129 -101858711 -113863509 -127173385 -141692747 -157178097 -173486370 -190817558
57024a90817558j8789883k0467830k1768238k2130430k1324579j9376139j6350631
$$ -190817558 -209607441 -230075271 -251843509 -273973939 -295298518 -314674657 -331025288
57017c31025288j2312066p439389k079566L335900Q396115J2760620J6194677
$$ -331025288 -343337354 -350776743 -352856309 -349520409 -341124294 -328363674 -312168997
57010c12168997J8616856K0107029K0840741K0999623K0724045K0115862J9257260
$$ -312168997 -293552141 -273445112 -252604371 -231604748 -210880703 -190764841 -171507581
57003a71507581J8219990J7061799J5820375J4518388J3179723J1838960J0532996
$$ -171507581 -153287591 -136225792 -120405417 -105887029 -92707306 -80868346 -70335350
56996g0335350R289535Q129214P072554O135677N321124M619721M019498L507425
$$ -70335350 -61045815 -52916601 -45844047 -39708370 -34387246 -29767525 -25748027 -22240602
56988b2240602L066749K681642K344512K053403J803886J589055J405021J249722
$$ -22240602 -19173853 -16492211 -14147699 -12094296 -10290410 -8701355 -7296334 -6046612
56980f046612J117415J000456Q95733Q03829P22861O48566b78197B38916M60643
$$ -6046612 -4929197 -3928741 -3033008 -2229179 -1506318 -857752 -278197 238916 699559
56971F99559M08409L62018L24453K94080K65966K39284K18389K06237K01156K00257
$$ 699559 1107968 1469986 1794439 2088519 2354485 2593769 2812158 3018395 3219551 3419808
56961C419808K00828J97329J81720J49713J04979N6486J3289j8720l8383m8889
$$ 3419808 3620636 3817965 3999685 4149398 4254377 4310863 4324152 4305432 4267049 4218160
56951D218160n4531n7724n9857o2985o8183p3554p6650p7916p9259q0564q0568
$$ 4218160 4163629 4105905 4046048 3983063 3914880 3841326 3764676 3686760 3607501 3526937 3446369
56940C446369q0217q2070q6795r2788r8642j03753j07340j09147j10206j10735
$$ 3446369 3366152 3284082 3197287 3104499 3005857 2902104 2794764 2685617 2575411 2464676
56930B464676j08622j02328r3851q6276p9797p2869o5875o0656n7555n5785n5706
$$ 2464676 2356054 2253726 2159875 2073599 1993802 1920933 1855058 1794402 1736847 1681062 1625356
56919A625356n7957o1351o4275o7100p0538p3077p2819p0483o7724o3911n7791
$$ 1625356 1567399 1506048 1441773 1374673 1304135 1231058 1158239 1087756 1020032 956121 898330
56908H98330n0856m5533m1134l5168k7832k1714j7727j4683j2304j1320j1177
$$ 898330 847474 801941 760807 725639 697807 676093 658366 643683 631379 620059 608882
56897F08882j0903j1699j5447k1179k6227l0306l5013l9888m2479m2244m0966
$$ 608882 597979 586280 570833 549654 523427 493121 458108 418220 375741 333497 292531
56886B92531l9348l6474l2577k9137k6127k2133j7213j2784q718l637J996O171
$$ 292531 253183 216709 184132 154995 128868 106735 89522 76738 68020 64383 66379 72550
56874G2550Q857J2249J7209K2003K4605K3843J8599Q831k740j2581j9733k4898
$$ 72550 81407 93656 110865 132868 157473 181316 199915 208746 206006 193425 173692 148794
56862A48794k7286k5758k2400k0937k1598I586h924j5380j3010j0367p412n911
$$ 148794 121508 95750 73350 52413 30815 9586 -8924 -24304 -37314 -47681 -55093 -61004
56850f1004o040n598l713k216k236k368j336K99J965L927N516N363M173M512O920
$$ -61004 -67044 -72642 -76355 -78571 -80807 -83175 -84511 -84212 -82247 -78320 -72804 -67441 -63268 -58756 -51836
56835e1836R115R698R895J0810d11A2651J5087J7384J8072J7421J7896J9557J8923
$$ -51836 -42721 -33023 -23128 -12318 -411 12651 27738 45122 63194 80615 98511 118068 136991
56822A36991J4077P713L057k15l656o347o343m125k026j124m64J321M676Q545
$$ 136991 151068 158781 161838 161623 157967 151620 145277 141152 139126 138002 137538 138859 143535 152080
56808A52080J0722J0111Q861J0424J5285K0835K5507L0210L5064L7854L6990L3197
$$ 152080 162802 172913 181774 192198 207483 228318 253825 284035 319099 356953 393943 427140
56796D27140K7019J7613N724m975j1697j5488j8379j9938j8793j5569j1870p755
$$ 427140 454159 471772 477496 472521 460824 445336 426957 407019 388226 372657 360787 353032
56784C53032k484L407Q657J3048J7135K1159K5383L0403L6091M1339M5562M8836
$$ 353032 350548 353955 362612 375660 392795 413954 439337 469740 505831 547170 592732 641568
56772F41568M9744M5187L3802J8077J878j2484k3867l1176l4414l5253l5013l3249
$$ 641568 691312 736499 770301 788378 790256 777772 753905 722729 688315 653062 618049 584800
56760E84800k9485k4710j9828j4380q178k606J276M488Q450J2930J7103K1244
$$ 584800 555315 530605 510777 496397 488219 485613 486889 491377 499827 512757 529860 551104
56748E51104K5860L0142L2483L1502K5842J4635n66j5752k7525l5099l8843l8834
$$ 551104 576964 607106 639589 671091 696933 711568 711002 695250 667725 632626 593783 554949
56736E54949l5940l2251k9001k5611k1750j8339j5538j1992p450l721j531J043
$$ 554949 519009 486758 457757 432146 410396 392057 376519 364527 357077 353356 351825 352868
56724C52868N198R112J1185J2924J5827J7740J5485R450K429m533j1921j8570
$$ 352868 358066 367178 378363 391287 407114 424854 440339 449789 452218 447685 435764 417194
56712D17194k2345k3472k4080k4653k3788k1425j9388j8462j7361j5072j2234
$$ 417194 394849 371377 347297 322644 298856 277431 258043 239581 222220 207148 194914
56701A94914r773p864o615o210o200n842n181m614l806k331r30o47j121j209r05
$$ 194914 185141 177277 170662 164452 158252 152410 147229 142615 138809 136478 135548 134901 133780 132571 131666
56686A31666j013j364j121n96r00j814j817m45R92J420J314J512J877J734Q51
$$ 131666 130653 129289 128168 127572 126672 124858 123041 122596 123588 125008 126322 127834 129711 131445 132296
56671A32296l67j170r30J51Q91K65j377k730k920k055p73K58P45J002J418J499
$$ 132296 131929 130759 129829 129980 130871 131136 129759 127029 124109 122054 121281 121539 122284 123286 124704 126203
56655A26203L38j717k922k207l88J315K728L874M009K615M89j280k542l426l381
$$ 126203 126541 124824 121902 119695 119307 120622 123350 127224 131233 133848 134337 133057 130515 127089 123708
56640A23708k069l01R17J531J722J138j14q21j97R25J647K538M168N239M020J065
$$ 123708 121639 121338 122255 123786 125508 126646 126532 125711 125514 126439 128086 130624 134792 140031 144051 145116
56624A45116j219j381K6J770K959L059K184J178N71p4j036j476p07K37k09j917
$$ 145116 143897 142516 142542 144312 147271 150330 152514 153692 154263 154189 153153 151677 150970 151207 150998 149081
56608A49081l223l044j836p12m52j131j969j928r09K5k5r02j985k690k170J12
$$ 149081 145858 142814 140978 140266 139814 138683 136714 134786 133877 133902 133877 132975 130990 128300 126130 126242
56592A26242L141N179O295Q327J1688J4239J4468J3689J3543J3296J1600R316
$$ 126242 129383 134562 140857 149184 160872 175111 189579 203268 216811 230107 241707 251023
56580B51023Q411R105J0054J0483J0336R205O902M434K903K036R78l20j663l425
$$ 251023 259434 268539 278593 289076 299412 308617 315519 319953 322856 324892 325870 325550 323887 320462
56566C20462n549o955p119o917o774n673l389j803k191l090k785k121k597l538
$$ 320462 314913 307958 300839 293922 287148 281475 278086 276283 274092 271002 268217 266096 263499 259961
56552B59961l602l369l790l696j867Kl95j885j525M60J052o24k340k691k609k583
$$ 259961 256359 252990 249200 245504 243637 243639 243244 241359 239834 240294 241346 240722 238382 235691 233082 230499
56536B30499j616L12J540J344R13J058J177J094J657K816L053J679j5n11L80K056
$$ 230499 228883 229195 230735 232079 232992 234050 235227 236321 237978 240794 243847 245526 245511 245000 245380 247436
56520B47436L792M542L592J713N16N74J239J959K537K607K222K430L766M980M917
$$ 247436 251228 255770 259362 261075 261591 262165 263404 265363 267900 270507 272729 275159 278925 283905 288822
56505B88822M693N984Q071Q980Q750R022R953J0315J0353J1597J3739J4473J2842
$$ 288822 293515 299499 307570 316550 325300 334322 344275 354590 364943 376540 390279 404752 417594
56492D17594J0306Q135O140M304L353L258L199L251M018M591L348Q76m71k97p73
$$ 417594 427900 436035 442175 446479 449832 453090 456289 459540 463558 468149 471497 472373 471902 471605 470832
56477D70832k958n139n706n278m991m833m658m908n397n169m335m293n469o588
$$ 470832 467874 462735 457029 451751 446760 441927 437269 432361 426964 421795 417460 413167 407698 401110
56463D01110o737o279n307l313j033n05k296m482n125m168k319n0J636J397n34
$$ 401110 394373 388094 382787 379474 378441 377936 375640 371158 366033 361865 359546 359496 361132 362529 361995
56448C61995k267k708k554k424k023j607k194l557m054l267k757l406m063l925
$$ 361995 359728 357020 354466 352042 350019 348412 346218 342661 338607 335340 332583 329177 325114 321189
56434C21189l944m636m455k073J223L094L008K205J750J737J727J158k3q24j86
$$ 321189 317245 312609 308154 306081 307304 310398 313406 315611 317361 319098 320825 321983 321960 321136 320950
56419C20950J365K284K277K544L595M430M374M005L794L341K580K201K365K327
$$ 320950 322315 324599 326876 329420 333015 337445 341819 345824 349618 352959 355539 357740 360105 362432
56405C62432J777J249R08M32J89R20K037J992O54l99k65K38K84O6j49m43m71J17
$$ 362432 364209 365458 366366 366798 366987 367907 369944 371936 372590 372191 371926 372164 372448 372514 372365 371922 371451 371568
56387C71568O25K60j28P54K135K177J178J104K078K244J274R20J697K078J654
$$ 371568 372193 372453 372325 373079 375214 377391 378569 379673 381751 383995 385269 386189 387886 389964 391618
56372C91618J923L085L098J101j046j896k274k773k264k97J562K262K632L001
$$ 391618 393541 396626 399724 400825 399779 397883 395609 392836 390572 390275 391837 394099 396731 399732
56358C99732K143n2j510j158n11o61m20Q87J692J154J034K462L529K481Q81R37
$$ 399732 401875 401823 400313 399155 398644 397983 397563 398450 400142 401296 402330 404792 408321 410802 411683 412620
56342D12620J826J417j14j058j107j138j155o31J13O75J623L296M690M930M485
$$ 412620 414446 415863 415749 414691 413584 412446 411291 410660 410773 411448 413071 416367 421057 425987 430472
56327D30472L879K702J154O66J776L146L888M737N716N146K635M95L01L36j371
$$ 430472 434351 437053 438207 438873 440649 443795 447683 452420 458136 463282 465917 466412 466713 467049 465678
56312D65678l751m681m239l631k749j098M54J050J386K050K069J037O35J905K962
$$ 465678 461927 457246 453007 449376 446627 445529 445983 447033 448419 450469 452538 453575 454210 456115 459077
56297D59077J796m03j145k56P20J230J609J637J272J413K222K307J338J346L455
$$ 459077 460873 460470 459325 459069 459789 461019 462628 464265 465537 466950 469172 471479 472817 474163 477618
56282D77618N493N170L522K692K469J758J440K740M402M484L642L785M754N022
$$ 477618 483111 488281 491803 494495 496964 498722 500162 502902 507304 511788 515430 519215 523969 528991
56268E28991M471L898L060J704J195K672M860O001O389O752O059L656J620K018
$$ 528991 533462 537360 540420 542124 543319 545991 550851 556852 563241 569993 576052 579708 581328 583346
56254E83346L549L938L888N265P040O710M648L425L688M059M292N226O331O479
$$ 583346 586895 590833 594721 599986 607026 613736 618384 621809 625497 629556 633848 639074 645405 651884
56240F51884O491P865R735J0171R675J0161J1274J1005R378Q196P677O622N555
$$ 651884 658375 666240 675975 686146 695821 705982 717256 728261 737639 745835 753512 760134 765689
56227G65689O377R024J1467J2902J4017J4589J3901J3298J4997J8358K0398K0162
$$ 765689 772066 781090 792557 805459 819476 834065 847966 861264 876261 894619 915017 935179
56215I35179J9663K0279K1142K1495K1940K2884K4075K6032K9754L4664L8784
$$ 935179 954842 975121 996263 1017758 1039698 1062582 1086657 1112689 1142443 1177107 1215891
56204A215891M1162M2481M3504M4685M6879N0560N4753N8454O2411O7775P3946
$$ 1215891 1257053 1299534 1343038 1387723 1434602 1485162 1539915 1598369 1660780 1728555 1802501
56193A802501P9837Q6136R4135J03261J12043J20580J29928J40100J50669J61951
$$ 1802501 1882338 1968474 2062609 2165870 2277913 2398493 2528421 2668521 2819190 2981141
56183B981141J73400J82641J88578J93562J99519K03855K02508J95344J84958
$$ 2981141 3154541 3337182 3525760 3719322 3918841 4122696 4325204 4520548 4705506
56174D705506J71851J54638J33696J10487Q4290N3758K0886j0606m0015o8747
$$ 4705506 4877357 5031995 5165691 5276178 5360468 5414226 5435112 5424506 5384491 5315744
56164E315744r5542j17136j33425j47519j60526j70326j75652j77589j76937j73724
$$ 5315744 5220202 5103066 4969641 4822122 4661596 4491270 4315618 4138029 3961092 3787368
56154C787368j69274j65058j59771j51354j41568j34381j29896j24218j15497
$$ 3787368 3618094 3453036 3293265 3141911 3000343 2865962 2736066 2611848 2496351
56145B496351j05905r7319q9411q2413p7484p3649o8415o1992n6941n3305m8528
$$ 2496351 2390446 2293127 2203716 2121303 2043819 1970170 1901755 1839763 1782822 1729517 1680989
56134A680989m2658l8880l7795l5913l1416k6912k4629k3069k0536j8120j6892
$$ 1680989 1638331 1599451 1561656 1525743 1494327 1467415 1442786 1419717 1399181 1381061 1364169
56123A364169j5577j3298j1533j1245j0858r108p257o580o051m397k292r30k48
$$ 1364169 1348592 1335294 1323761 1312516 1301658 1292550 1285293 1278713 1272662 1268265 1265973 1265043 1264795
56110A264795K02N09J253L040M703M312K531K427N265Q953J1262J2161J2383J2254
$$ 1264795 1264997 1265506 1266759 1269799 1274502 1278814 1281345 1283772 1289037 1297990 1309252 1321413 1333796 1346050
56096A346050J2550J4158J6344J7472J7756J9095K2203K6083K9943L3266L4725
$$ 1346050 1358600 1372758 1389102 1406574 1424330 1443425 1465628 1491711 1521654 1554920 1589645
56085A589645L4072L4327L8701M5823N1473N4607N8007O3265O9096P4678Q0741
$$ 1589645 1623717 1658044 1696745 1742568 1794041 1848648 1906655 1969920 2039016 2113694 2194435
56074B194435Q7050R2246R6242R9402R9767R4883Q6127P7355O9725O1934N4784
$$ 2194435 2281485 2373731 2469973 2569375 2669142 2764025 2850152 2927507 2997232 3059166 3113950
56063C113950N0677M8619M4504L6684K6968J6455N085m975j0858j4148j9375k7220
$$ 3113950 3164627 3213246 3257750 3294434 3321402 3337857 3342942 3337967 3327109 3312961 3293586 3266366
56051C266366l4449m0714m9432o1038p1080p6456p8350p7905p4274o8187o2290
$$ 3266366 3231917 3191203 3141771 3080733 3009653 2933197 2854847 2776942 2702668 2634481 2572191
56040B572191n6727m9413m1435l6651l4958l1788k5522j9578j5699j1178m807
$$ 2572191 2515464 2466051 2424616 2387965 2353007 2321219 2295697 2276119 2260420 2249242 2244435
56029B244435K51J864K078K787L230L507N650R429J1990J2996J5177J8871K1303
$$ 2244435 2244686 2246550 2248628 2251415 2254645 2258152 2263802 2273231 2285221 2298217 2313394 2332265 2353568
56016B353568K2033K3348K4652K2804J8931J8143K1332K4083K4968K7557L2639
$$ 2353568 2375601 2398949 2423601 2446405 2465336 2483479 2504811 2528894 2553862 2581419 2614058
56005B614058L5977L5987L6241L8100L8367L6628L7127M0703M2557M0975M0472
$$ 2614058 2650035 2686022 2722263 2760363 2798730 2835358 2872485 2913188 2955745 2996720 3037192
55994C037192M3213M5220M4380M4257M6354M6617M3490M1648M3729M6100M6610
$$ 3037192 3080405 3125625 3170005 3214262 3260616 3307233 3350723 3392371 3436100 3482200 3528810
55983C528810M8709N3840N7848N9034O1695O7444P1394P1470P3055P9491Q6175
$$ 3528810 3577519 3631359 3689207 3748241 3809936 3877380 3948774 4020244 4093299 4172790 4258965
55972D258965Q9025R0657R3352R4331R2992R4445J00730J06677J09223J12389
$$ 4258965 4347990 4438647 4531999 4626330 4719322 4813767 4914497 5021174 5130397 5242786
55962E242786J18473J23460J25765J30019J37431J42382J43417J47183J56288
$$ 5242786 5361259 5484719 5610484 5740503 5877934 6020316 6163733 6310916 6467204
55953F467204J64245J67969J73715J84781J95336K02855K14179K32256K49672
$$ 6467204 6631449 6799418 6973133 7157914 7353250 7556105 7770284 8002540 8252212
55944H252212K62767K79082L02905L26961L46826L69471L98406M24804M43347
$$ 8252212 8514979 8794061 9096966 9423927 9770753 10140224 10538630 10963434 11406781
55935A1406781M62525M89066N17121N43538N78174O27216O81727P34656P92868
$$ 11406781 11869306 12358372 12875493 13419031 13997205 14624421 15306148 16040804 16833672
55926A6833672Q59958R24501R79216J034403J098434J163643J226480J301757
$$ 16833672 17693630 18618131 19597347 20631750 21730184 22893827 24120307 25422064
55918B5422064J399855J509492J620361J742048J882632K031380K182473K351963
$$ 25422064 26821919 28331411 29951772 31693820 33576452 35607832 37790305 40142268
55910D0142268K550267K764538K992005L262241L599039L989504M421033M918940
$$ 40142268 42692535 45457073 48449078 51711319 55310358 59299862 63720895 68639835
55902F8639835N516962O225386P062737Q077344R292597J0670790J2179850J3854494
$$ 68639835 74156797 80382183 87444920 95522264 104814861 115485651 127665501 141519995
55894A41519995J5744993J7865287K0253985K3010925K6180452K9660101L3269437
$$ 141519995 157264988 175130275 195384260 218395185 244575637 274235738 307505175
55887C07505175L6660770L8830716L7854023L1752294K0176025N237811r567191
$$ 307505175 344165945 382996661 420850684 452602978 472779003 478016814 468449623
55880D68449623k1389395k9157249l3223619l4466554l3781009l1954120k9568227
$$ 468449623 447060228 417902979 384679360 350212806 316431797 284477677 254909450
55873B54909450k6934611k4198321k1490759j8943174j6624787j4552743j2738982
$$ 254909450 227974839 203776518 182285759 163342585 146717798 132165055 119426073
55866A19426073j1178218r824143q630116p592994o720958n985522n342896m778832
$$ 119426073 108247855 98423712 89793596 82200602 75479644 69494122 64151226 59372394
55858E9372394m296502l880862l509024l178914k896852k651056k424139k217975
$$ 59372394 55075892 51195030 47686006 44507092 41610240 38959184 36535045 34317070
55850C4317070k041628j887861j744242j614305j505764j409910j313402j219171
$$ 34317070 32275442 30387581 28643339 27029034 25523270 24113360 22799958 21580787
55842B1580787j136422j061139r85207r14114q57153q09540p61242p14373o75561
$$ 21580787 20444365 19383226 18398019 17483905 16626752 15817212 15055970 14341597 13666036
55833A3666036o40311o00888n61294n29124n00647m68573m36578m11787l90542
$$ 13666036 13025725 12424837 11863543 11334419 10833772 10365199 9928621 9516834 9126292
55824I126292l65646l40409l21806l06780k88633k70413k58851k51381k41864
$$ 9126292 8760646 8420237 8098431 7791651 7503018 7232605 6973754 6722373 6480509
55815F480509k33064k30895k31816k28124k20533k14219k07791j97490j86848
$$ 6480509 6247445 6016550 5784734 5556610 5336077 5121858 4914067 4716577 4529729
55806D529729j80878j75875j66041j54967j49455j46958j40586j31737j26303
$$ 4529729 4348851 4172976 4006935 3851968 3702513 3555555 3414969 3283232 3156929
55797C156929j22487j14122j02661r4667r0132q3952p6492p2321p0527o6288o0302
$$ 3156929 3034442 2920320 2817659 2722992 2632860 2548908 2472416 2400095 2329568 2263280 2202978
55786B202978n7365n7239n5722n2995n2436n2926n0595m6471m4496m3811m0747
$$ 2202978 2145613 2088374 2032652 1979657 1927221 1874295 1823700 1777229 1732733 1688922 1648175
55775A648175l6413l4713l4761l2892l0133l0113l1491l0014k6304k4237k3379
$$ 1648175 1611762 1577049 1542288 1509396 1479263 1449150 1417659 1387645 1361341 1337104 1313725
55764A313725k0494j6911j6939k0136k2164k2167k2619k3158k1206j7688j5838
$$ 1313725 1293231 1276320 1259381 1239245 1217081 1194914 1172295 1149137 1127931 1110243 1094405
55753A094405j5475j4204j2695j2907j3037j0246o426n199n415l848j904k859
$$ 1094405 1078930 1064726 1052031 1039124 1026087 1015841 1009415 1004216 998801 994953 993049 990190
55741I90190m727l129O61J812M80P50K379J320k155l514k060j742l638m591l814
$$ 990190 985463 982334 982995 984807 985287 986037 988416 989736 987581 984067 982007 980265 976627 972036 968222
55726I68222m326o927q805q903r058r284p541m778m783q177j1580j3276j4764
$$ 968222 963896 956969 948164 939261 930203 920919 913378 908600 903817 895640 884060 870784 856020
55713H56020j6358j6175j4109j2197j0552p318k829M87K206L662L912O69n066
$$ 856020 839662 823487 809378 797181 786629 779311 776482 776969 779175 782837 786749 787418 782352
55700G82352r849j2933j5920j8042j7042j4452j4456j7274j8957j8086j7288j7449
$$ 782352 772503 759570 743650 725608 708566 694114 679658 662384 643427 625341 608053 590604
55688E90604j5967j1995q420p033o232n016n006o906q669q836q326p775o293l863
$$ 590604 574637 562642 554222 547189 540957 535941 530935 524029 515360 506524 498198 490423 484130 480267
55674D80267k078j598j516j537k098k485j789j339l012n647o624o336p223q895
$$ 480267 478189 476591 475075 473538 471440 468955 467166 465827 462815 457168 450544 444208 436985 428090
55660D28090q517n910l913l534k923j523r67j366p58J094K160J992K465M174N664
$$ 428090 419573 413663 409750 406216 403293 401770 400803 399437 398679 399773 401933 403925 406390 410564 416228
55645D16228O551P699Q135N697J045k804n213q156j1433j2056r241n936m322l662
$$ 416228 422779 430478 438613 444310 445355 442551 437338 429182 417749 405693 396452 390516 386194 382532
55631C82532l352m101n074l872o87J213L38j096j155n02K90K076M487N446M653
$$ 382532 379180 375079 370005 366133 365446 366659 366997 365901 364746 364244 364534 366610 371097 376543 381196
55616C81196M366N495O125M982L333K355J682J320J882K308P37j720j726R67K805
$$ 381196 385562 391057 397182 402164 405497 407852 409534 410854 412736 415044 415781 414061 412335 413302 416107
55601D16107J893K88k07l32k87J360L982M333J792R4J500L163J989o00j779j918
$$ 416107 418000 418288 418081 417749 417462 418822 422804 427137 428929 429023 430523 433686 435675 435075 433296 431378
55585D31378k776l779l449k486k383k700k305j797k383l697m794n892p358q375
$$ 431378 428602 424823 421374 418888 416505 413805 411500 409703 407320 403623 398829 392937 385579 377204
55571C77204q348q127q366q178o841n328m676m377l577k518j739j289j431k476
$$ 377204 368856 360729 352363 344185 337344 332016 327340 322963 319386 316868 315129 313840 312409 309933
55557C09933l463l082k343l760p151q969p046l340p52K02J44j057l134m685n204
$$ 309933 306470 303388 301045 297285 290134 281165 274119 270779 270027 270229 270373 269316 266182 261497 256293
55542B56293n730o211m781j325J020Lk463l427l012k990l131j869O15K464K781
$$ 256293 250563 244352 239571 238246 239266 239269 236806 233379 230367 227377 224246 222377 222992 225456 228237
55527B28237K323J983J913J666N48j427k654j429J406L062K475J359J163J365
$$ 228237 230560 232543 234456 236122 236670 235243 232589 231160 232566 235628 238103 239462 240625 241990
55513B41990J559K589M481N710N786O162P273P301N476L915M191M494K572n94
$$ 241990 243549 246138 250619 256329 262115 268277 275550 282851 288327 292242 296433 300927 303499 302905
55499C02905k363k131j278q66j246k685m504m921l277j231m27m63m27p10j775
$$ 302905 300542 298411 297133 296267 295021 292336 287832 282911 279634 278403 277976 277513 277086 276376 274601
55484B74601k839l259l581l906l033o98J209J284O21O47R55R66J574L113L676
$$ 274601 271762 268503 264922 261016 257983 257285 258494 259778 260399 261046 262001 262967 264541 267654 271330
55469B71330J786q37j472k2J547K106J643rk746n361o815p372p426o654n501n601
$$ 271330 273116 272279 270807 270785 272332 274438 276081 276072 273326 267965 261150 253778 246352 239698 234197 228596
55453B28596p238q337p527o181n727n174l449j897j994k530j690j80L08J02L87
$$ 228596 221358 213021 205494 199313 193586 188412 184963 183066 181072 178542 176852 176672 176980 177082 177469
55438A77469O22j78j044o83j0l70p36L50J522N91j456j902q20n75j468j548n84
$$ 177469 178091 177913 176869 176186 176176 175806 175070 175420 176942 177533 176077 174175 173355 172780 171312 169764 169180
55421A69180n28j714k061o88O84P10J52j09l04l32N35J779J759M96J03J468K624
$$ 169180 168652 166938 164877 164189 164873 165583 165735 165626 165322 164990 165525 167304 169063 169559 169662 171130 173754
55404A73754J676m91j711j333l37K51J3r25j769j617o76j04k98k79P11K022K548
$$ 173754 175430 174939 173228 171895 171558 171809 171822 170897 169128 167511 166835 166731 166433 166154 166865 168887 171435
55387A71435K054J016j60j057j007K82J985K673J695q9j165r93n18p78j422j365
$$ 171435 173489 174505 174345 173288 172281 172563 174548 177221 178916 178827 177662 176669 176151 175373 173951 172586
55371A72586n94j39j83L61J864K936K357Q83R6K00J35p26k001k959l079k279j101
$$ 172586 171992 171853 171670 172031 173895 176831 179188 180071 180167 180367 180502 179776 177775 174816 171737 169458 168357
55354A68357j47Q22K443M162M404K777Q11q0j03M0L60P38L93q19j773j631r09
$$ 168357 168210 169032 171475 175637 180041 182818 183629 183549 183446 183486 183846 184584 184977 184158 182385 180754 179845
55337A79845j86P47J646J438J15o80j77J65q75k229k461k006j783j251K80J836
$$ 179845 179659 180406 182052 183490 183605 182925 182748 182913 182038 179809 177348 175342 173559 172308 172588 174424
55321A74424K066J242L88k48n09J80J238P51j390k423p45J230Q11p06n54Q38J133
$$ 174424 176490 177732 178120 177872 177363 177543 178781 179532 178142 175719 174974 176204 177015 176309 175755 176593 177726
55304A77726M64P49J680J222m93j378j173j553k553k340o81O04R72J726K883K577
$$ 177726 178190 178939 180619 181841 181348 179970 178797 177244 174691 172351 171670 172274 173246 174972 177855 180432
55288A80432M53j292j204m53m06o27l24J87L88L71Q9o91j368r50K64R98R82R36
$$ 180432 180885 179593 178389 177936 177530 176903 176579 176766 177154 177525 177614 176923 175555 174605 174869 175867 176849 177785
55270A77785Q03r3j240j478j202j788k738j875J173L977M357K594J82j721k347
$$ 177785 178588 178495 177255 175777 174575 172787 170049 168174 169347 173324 177681 180275 180457 178736 176389
55255A76389j638q11r41j161j39J178P77p80q83Q63J903P68j067k016k232j772
$$ 176389 174751 173940 172999 171838 171699 172877 173654 172874 171991 172854 174757 175525 174458 172442 170210 168438
55239A68438J25K789L834K430M79n51j392k484k518j043J04k39o17K07R45M25
$$ 168438 168563 171352 175186 177616 178095 177544 176152 173668 171150 170107 170211 169972 169355 169562 170507 170932
55223A70932N7J289K613J937K58R9J441K084J402R63J524J884J103q9o43n81n27
$$ 170932 170989 172278 174891 176828 177086 177185 178626 180710 182112 183075 184599 186483 187586 187497 186854 186273 185746
55206A85746o93o78P4J523K614K151L94r68q62k6L52K28J79K36R0j98m34p33j078
$$ 185746 185053 184375 184449 185972 188586 190737 191131 190163 189301 189275 189627 189855 190034 190270 190360 190162 189728 188995 187917
55187A87917j068n24J45N16M42k60j497k346j954j017r26j430q47J021K216J599
$$ 187917 186849 186325 186470 186986 187428 187168 185671 183325 181371 180354 179428 177998 177151 178172 180388 181987
55171A81987N38N59J038O70k21m10L00J183J707J496K06j471j879o08M96j89j688
$$ 181987 182525 183084 184122 184792 184571 184161 184461 185644 187351 188847 189053 187582 185703 185095 185591 185402 183714
55154A83714j974q45K74N56L48P4L4P26K105K972K338Q75r8n45j250k033j898
$$ 183714 181740 180895 181169 181725 182073 182147 182181 182907 185012 187984 190322 191197 191099 190554 189304 187271 185373
55137A85373q15R4K64M13J255K326K548J497r1r63n79K49K82n65j124o36K29L86
$$ 185373 184558 184652 184916 185329 186584 188910 191458 192955 192864 191901 191322 191571 191853 191288 190164 189528 189757 190143
55119A90143k58r14q83j55O12O18r8l74O00J789J459k72j499j228m22pL64Q63
$$ 190143 189885 188971 188088 187933 188545 189163 189065 188691 189291 191080 192539 192267 190768 189540 189118 189111 189475 190338
55101A90338N78q16j907j303M65J933K558K554J887N51q83j866k383k330j421
$$ 190338 190916 190100 188193 186890 187355 189288 191846 194400 196287 196838 195955 194089 191706 189376 187955
55086A87955k17M2o66q34K47J393J700K010K947L303K040L92J8M07J29n22l45
$$ 187955 187738 187780 187114 186280 186527 187920 189620 191630 194577 197880 199920 200312 200330 200737 200866 200344 199999
55069A99999K33k08j473j999j469j078j304j348q38k50M38J653K734K263L44j118
$$ 199999 200232 200024 198551 196552 195083 194005 192701 191353 190515 190265 190703 192356 195090 197353 197697 196579
55053A96579r36k1K70j86q25j414j769j339N1J618K328J980J158M60N7j40j05
$$ 196579 195643 195622 195892 195706 194881 193467 191698 190359 190410 192028 194356 196336 197494 197954 198011 197871 197766
55036A97766M26J500K482K560J848J343J473J520Q83L6m53q41j289r85N27J944
$$ 197766 198192 199692 202174 204734 206582 207925 209398 210918 211801 211837 211384 210543 209254 208269 208796 210740
55020B10740J656K22j83J173K546K036j63k317l102k459j090K88J227J436P88
$$ 210740 212396 212618 212435 213608 216154 218190 218027 215710 212608 210149 209059 209347 210574 212010 212798
55005B12798k72p42j19O35J77j203j792j032l55q16j382p45M57P63K66J83O83
$$ 212798 212526 211784 211665 212300 212477 211274 209482 208450 208095 207279 205897 205152 205609 206372 206638 206821 207504
54988B07504Q61N62N94J114J190K53j084j858j661o78M90J053P37J22j55k43n83
$$ 207504 208365 208927 209521 210635 211825 212078 210994 209136 207475 206797 207287 208340 209077 209199 209044 208801 208218
54971B08218j019j060n68L35J592K897L558L244K299J049l44j082k13J465J617
$$ 208218 207199 206139 205571 205906 207498 210395 213953 217197 219496 220545 220201 219119 218906 220371 221988
54956B21988l97k181j704l38m93j640j370N28J754J090k54j046j436j480m17J730
$$ 221988 221591 219410 217706 217368 216875 215235 213865 214393 216147 217237 216983 215937 214501 213021 212604 214334
54940B14334L495L708K686J256j48j036q11J99P24J01r39j352r19j26L56J02n16
$$ 214334 217829 221537 224223 225479 225331 224295 223484 223683 224407 224508 223569 222217 221298 221172 221528 221630 221114
54923B21114n27K15M01q32k095j423Q10K409K515K256K309J929Q38P5K42N29K03
$$ 221114 220587 220802 221203 220371 218276 216853 217663 220072 222587 224843 227152 229081 229919 229994 230236 230765 230968
54906B30968k59k48P1M77R91J103R6j321j357J35R59l43k135j861N16K697L054
$$ 230968 230709 230461 230532 231009 232000 233103 233199 231878 230521 230656 231615 231272 229137 227276 227792 230489 233543
54889B33543K102J172Q24O94L38m9K08J269K154J734J66j337j955j673n51J210
$$ 233543 235645 236817 237641 238335 238673 238624 238832 240101 242255 243989 244155 242818 240863 239190 238639 239849
54873B39849K522K178N83m70q7Q30J256J228J014M78o0L89K101M007N084N417
$$ 239849 242371 244549 245132 244662 244575 245405 246661 247889 248903 249381 249321 249710 251811 255818 260902 266319
54857B66319N468N389N564O584Q098Q858Q545Q222Q264P393M763J603n06j816
$$ 266319 271787 277176 282740 289324 297422 306280 314825 323047 331311 338704 343467 345070 344564 342748
54843C42748l495n507o860p170o667n334l409k135k552l974m859m779m270l298
$$ 342748 339253 333746 326886 319716 313049 307715 304306 302171 299619 295645 290786 286007 281737 278439
54829B78439j404Q01J820J074n51k005k830k679j419K26J166J471K234L662M535
$$ 278439 277035 277836 279656 280730 280179 278174 275344 272665 271246 271472 272638 274109 276343 280005 284540
54814B84540M098L417L885N216O003N910O133P598R536J0198Q444M539j21l680
$$ 284540 288638 292055 295940 301156 307159 313069 319202 326800 336336 346534 354978 359517 359396 355716
54800C55716m954m472m128n106o526o856o304o461p520p579n557l315l315n131
$$ 355716 350762 346290 342162 337056 330530 323674 317370 310909 303389 295810 290253 286938 283623 278492
54786B78492o169n410m428m554n011m530l278k143j201o4R36R60j64j612k355
$$ 278492 272323 266913 262485 257931 252920 248390 245112 242969 241768 241704 242640 243600 243436 241824 239469
54771B39469k025j145o00n89l72M86J080L54j075j607j081q28j232r99L55J240
$$ 239469 237444 236299 235699 235110 234738 235224 236304 236658 235583 233976 232895 232067 230835 229836 230191 231431
54755B31431L77j041j080J86J169J200R12P66P75J263K426L329K754J065q4N2
$$ 231431 231808 230767 229687 229873 231042 232242 233154 233920 234695 235958 238384 241713 244467 245532 245448 245500
54739B45500N53M70R4K40J127K237K748K019K83j116r38M32J395J041n0q65q58
$$ 245500 246053 246523 246617 246857 247984 250221 252969 254988 255271 254155 253217 253649 255044 256085 256035 255170 254312
54722B54312J97K095L570L035O17j367r63J162K867L314L327L459L232K562K446
$$ 254312 254509 256604 260174 263209 263826 262459 261496 262658 265525 268839 272166 275625 278857 281419 283865
54707B83865L456M632M900M817N771P826R566R951R178P739N900M432M444N782
$$ 283865 287321 291953 296853 301670 307441 315267 324833 334784 343962 351701 357601 362033 366477 372259
54693C72259O560N254K455k40k275m109n871p237q174q670q186o578n199n660
$$ 372259 378819 384073 386528 386288 384013 379904 374033 366796 358622 349952 341766 335188 329989 324329
54679C24329p463q269o706l831j522n58n69q82r56p00o57j252j848j381Q8J403
$$ 324329 316866 308597 301891 298060 296538 295980 295411 294529 293573 292873 292216 290964 289116 287735 287823 289226
54663B89226J995K499L485M551N057M979M750M859N663O842P269O328N063M810
$$ 289226 291221 293720 297205 301756 306813 311792 316542 321401 327064 333906 341175 347503 352566 357376
54649C57376M978L744Q51k057l998n599p018p103n568m155m302n237n615n559
$$ 357376 362354 366098 366949 364892 360894 355295 348277 341174 335606 331451 327149 321912 316297 310738
54635C10738n746n797n169m507m606m930m533l541k450j004P75J532K58j818k779
$$ 310738 304992 299195 294026 289519 284913 279983 275450 271909 269459 268455 269230 270762 271020 269202 266423
54620B66423k687k894l370k830j295k98m28n18K63J173J321R80P62O30K92j46
$$ 266423 263736 260842 257472 254642 253347 253049 252621 252103 252366 253539 254860 255840 256602 257232 257524 257378
54604B57378n54j095j747k037j519k22J419K710K952K009N34p63j709k200j835
$$ 257378 256824 255729 253982 251945 250426 250204 251623 254333 257285 259294 259828 259065 257356 255156 253321
54589B53321p48j66r46k093j937n39M37J71l69j33O61J274J489J335O37m47j164
$$ 253321 252573 252407 251461 249368 247431 246892 247329 247500 247131 246998 247659 248933 250422 251757 252394 251947 250783
54572B50783j100r32j547k578k550o70J896L012J874j73j345j429j412j633j542
$$ 250783 249683 248751 247204 244626 242076 241406 243302 246314 248188 248015 246670 245241 243829 242196 240654
54557B40654j177j333j813j151J030K788K288L96n52K19J510K142J903J004p9
$$ 240654 239477 238144 236331 235180 236210 238998 241286 241682 241130 241349 242859 245001 246904 247908 247829
54542B47829n29m8M89L17N8O30J634K176K413K708K081l68l022l074l86K150K409
$$ 247829 247300 247252 247741 248058 248116 248746 250380 252556 254969 257677 259758 259390 256368 253294 252908 255058 257467
54525B57467J115j70j021j387q56K77P56K14o8P91J753J373k29j815k520k125
$$ 257467 258582 258412 257391 256004 255148 255425 256181 256395 256327 257118 258871 260244 260015 258200 255680 253555
54509B53555q58L26K88p01r15N36K358K847J998R58L19k8j39j60n05j016o83Q93
$$ 253555 252697 253023 253311 252610 251695 252231 254589 257436 259434 260392 260711 260683 260544 260384 259879 258863 258180 259073
54491B59073K439K497J346L95J35k16j211k350k742j959l41J060J311P40Q15K198
$$ 259073 261512 264009 265355 265750 265885 265669 264458 262108 259366 257407 257066 258126 259437 260177 260992 263190
54475B63190L682L851L152L197M321N127M511L014J839J268N97p17k238k980k545
$$ 263190 266872 270723 273875 277072 281393 286520 291031 294045 295884 297152 297749 297032 294794 291814 289269
54460B89269j714j483j630r18Q88K130J204j135k520j920q12j139l005m829n189
$$ 289269 287555 286072 284442 283524 284412 286542 287746 286611 284091 282171 281359 280220 277215 272386 267197
54445B67197l920j755M37J981K457J836N65o22j049m40Q29J790J590M66k43L75
$$ 267197 263277 261522 261959 263940 266397 268233 268798 268176 267127 266687 267516 269306 270896 271362 271119 271494
54429B71494J524J635N22m15l38q7n04q16R0J667K379J821P65l52j458j711l05
$$ 271494 273018 274653 275175 274760 274422 274335 273831 273015 273105 274772 277151 278972 279737 279385 277927 276216 275911
54412B75911J629J886M23k57J325L475L908K778J745J266O48r2j43N66J174J287
$$ 275911 277540 279426 279849 279592 280917 284392 288300 291078 292823 294089 294737 294645 294502 295068 296242 297529
54396B97529J377J770K053J728P98l63j362j973k212k148j675q70l98p99j308
$$ 297529 298906 300676 302729 304457 305255 304892 303530 301557 299345 297197 295522 294652 294254 293455 292147
54381B92147m88J655L327L115J451o18k658l976l169j28K598K346l56k674l139
$$ 292147 291659 293314 296641 299756 301207 300589 297931 293955 290786 290658 293256 295602 295246 292572 289433
54366B89433k695k355j857r22j75l5R9Q86K013K636K296J155j45p60l20O72J502
$$ 289433 286738 284383 282526 281604 281429 281394 281493 282379 284392 287028 289324 290479 290334 289574 289254 289926 291428
54349B91428J991K069J261l61j393o41Q93J166P9m60M31J418J394J184J800K638
$$ 291428 293419 295488 296749 296388 294995 294354 295247 296413 296492 296032 296463 297881 299275 300459 302259 304897
54333C04897K737K528K906L541L566L070K522J459n30k109j458Q31J988O93j201
$$ 304897 307634 310162 313068 316609 320175 323245 325767 327226 326696 324587 323129 323960 325948 326641 325440
54318C25440j325K05J457J367N10k37n89n17rN92O83J27m67m38J96P86P44R1m97
$$ 325440 324115 324320 325777 327144 327654 327417 326828 326311 326302 326894 327577 327704 327237 326799 326995 327781 328525 328616 328119
54299C28119k79Q07K081K931L427L789L635K380M19r09q44j5O88J401K662M103
$$ 328119 327840 328647 330728 333659 337086 340875 344510 346890 347309 346400 345556 345541 346229 347630 350292 354395
54283C54395M759M676M978O041O481M766J275j989l544l731l827m409m897m556
$$ 354395 359154 363830 368808 374849 381330 386096 387371 385382 381838 378107 374280 369871 364974 360418
54269C60418l681l426m363n510n351l726k004j271j140p65l42o75j650k105j309
$$ 360418 356737 353311 348948 343438 338087 334361 332357 331086 329946 329181 328839 328164 326514 324409 323100
54254C23100J30J066J034M51l7j65j83m68r97j373j537k067l253m204l703j983
$$ 323100 323230 324296 325330 325781 325744 325579 325396 324928 323931 322558 321021 318954 315701 311497 307794 305811
54238C05811o78o16n17J167L747M814L254O36q86j008q74r07m41N96J000j08j838
$$ 305811 305133 304517 304000 305167 308914 313728 316982 317618 316732 315724 314850 313943 313502 314098 315098 314990 313152
54221C13152k543j750l15Q86J545J457O03k08R8J281J696L83j438j780k94J508
$$ 313152 310609 308859 308544 309430 310975 312432 313035 312827 312925 314206 315902 316285 314847 313067 312773 314281
54205C14281K204J893J628K070K851L010K000L64o90o37l17q71k223l058k346
$$ 314281 316485 318378 320006 322076 324927 327937 329937 330301 329611 328974 328657 327786 325563 322505 320159
54190C20159m78J195J661R28k54j103j232o94J61Q38J027R47J112J487J213k63
$$ 320159 319681 320876 322537 323465 323211 322108 320876 320182 320343 321181 322208 323155 324267 325754 326967 326704
54174C26704k053k618j731p83q26j319j305r70j103j559j323p2J312J868J536
$$ 326704 324651 322033 320302 319519 318693 317374 316069 315099 313996 312437 311114 311042 312354 314222 315758
54159C15758Q88M23M12R43J811K506K523J737N97j19m4J89m77k167l762m259l796
$$ 315758 316646 317069 317481 318424 320235 322741 325264 327001 327598 327479 327435 327624 327147 324980 321218 316959 313163
54142C13163k792q82K244N263N871L397j10j932j346J72Q93M00o21j463j936j985
$$ 313163 310371 309489 311733 316996 322867 326264 326154 324222 322876 323048 323941 324341 323720 322257 320321 318336
54126C18336j380j57R27J052M78L10R22J381Q87p3o81j059j663k077j592n90q0
$$ 318336 316956 316799 317726 318778 319256 319566 320488 321869 322756 322683 322002 320943 319280 317203 315611 315021 314941
54109C14941p4K60R21R99L68M1L88M83j05l07O56J596Q73j164k649k703k127j672
$$ 314941 314867 315127 316048 317047 317415 317456 317844 318327 318222 317915 318571 320167 321040 319876 317227 314524 312397 310725
54091C10725r60M99K105K611J478n16j813j315O38K510L043K368J465Q04J26o65
$$ 310725 309765 310264 312369 314980 316458 315942 314129 312814 313452 315962 319005 321373 322838 323642 323768 323103
54075C23103j112q55j62M41P15P62Q61J262J855J913P37j263k546j956K2J844
$$ 323103 321991 321136 320974 321415 322130 322892 323753 325015 326870 328783 329520 328257 325711 323755 323777 325621
54059C25621K602K706K986L559L715K734P26j208j800q80K65J94j009j787r81
$$ 325621 328223 330929 333915 337474 341189 343923 344649 343441 341641 340761 341026 341220 340211 338424 337443
54044C37443Q30K137K208J506P94N01Q31J786K771K778J374o24j780j259M55J921
$$ 337443 338273 340410 342618 344124 344918 345419 346250 348036 350807 353585 354959 354335 352555 351296 351751 353672
54028C53672J985J023P05J993L584L210N36k188k750j294N21J747K561L174L485
$$ 353672 355657 356680 357385 359378 362962 366172 366708 364520 361770 360476 360997 362744 365305 368479 371964
54013C71964L598L669L328K169P98M70J546K990L614L286K764K835L732M928N498
$$ 371964 375562 379231 382559 384728 385526 385996 387542 390532 394146 397432 400196 403031 406763 411691 417189
53998D17189N125M572M713N331N677N922O986Q920J0488J0630R456P518N125K772
$$ 417189 422314 426886 431599 436930 442607 448529 455515 464435 474923 485553 495009 502527 507652 510424
53984E10424J244O58K75k21j07J048K367K854K854L331M372N556P114R325J1042
$$ 510424 511668 512326 512601 512380 512273 513321 515688 518542 521396 524727 529099 534655 541769 551094 562136
53969E62136J0543Q187O742Q214J1255J2716J1273Q548O774O301N791M299K371
$$ 562136 572679 580866 587608 595822 607077 619793 631066 639614 646388 652689 658480 662779 665150
53956F65150J084O44M36J16j1J54o1j529m435q078j1119j2094j0585q241p644
$$ 665150 666234 666878 667314 667430 667419 667573 667512 665983 661548 653470 642351 630257 619672 611431 603787
53941F03787r393j1066j0142p247n309n771p138p321o057m542l802m096n084n911
$$ 603787 594394 583328 573186 565939 560630 554859 547721 540400 534343 529801 525999 521903 516819 510908
53927E10908n759m772l926l697l585l226l033l111k647j225J38M40L81J234K523
$$ 510908 505149 500377 496451 492754 489169 485943 482910 479799 477152 475927 476065 476505 476886 478120 480643
53912D80643K536R58o50j318j918l244m209l186l24K532L815L321J896R29J712
$$ 480643 483179 484137 483487 482169 480251 477007 472798 469612 469288 471820 475635 478956 480852 481781 483493
53897D83493M291P048Q238P778O996O909P597Q839J0172J0441Q582N263K647K003
$$ 483493 487784 494832 503070 510848 517844 524753 532350 541189 551361 561802 570384 575647 578294 580297
53883E80297K469K685K699L381M707N687N779N516N807P164R408J1583J2413J1513
$$ 580297 582766 585451 588150 591531 596238 601925 607704 613220 619027 626191 635599 647182 659595 671108
53869F71108R943Q982Q689Q381Q068Q251Q429P349N284M633P030J0722J2291J0833
$$ 671108 681051 690033 698722 707103 715171 723422 731851 739200 744484 749117 756147 766869 779160 789993
53855G89993Q989R520J2040J4054J4462J4762J6698J9864K2259K2700K1801K0750
$$ 789993 798982 808502 820542 834596 849058 863820 880518 900382 922641 945341 967142 987892
53843I87892K0065J9856K0461K2052K3996K5365K5931K5801K4030J8624Q649m157
$$ 987892 1007957 1027813 1048274 1070326 1094322 1119687 1145618 1171419 1195449 1214073 1222722 1218565
53831A218565j6391k5431l0609l2613l2687l2246l2257l2520l2070l0531k8648
$$ 1218565 1202174 1176743 1146134 1113521 1080834 1048588 1016331 983811 951741 921210 892562
53820H92562k7149k5773k3902k1624j9462j7391j5130j3174j2442j2671j2328
$$ 892562 865413 839640 815738 794114 774652 757261 742131 728957 716515 703844 691516
53809F91516j0752r278r276j0020r815q732q460r501j0259r567q530q644r296
$$ 691516 680764 671486 662210 652190 642375 633643 625183 615682 605423 595856 587326 578682 569386
53796E69386q653o538m760m528n062n166m985n269n758n416m108l046l214m078
$$ 569386 560733 554195 549435 544907 539845 534679 529694 524425 518667 513251 509143 506097 502883 498805
53782D98805m355l723l058l019l150k711j816j143q79p11o26q53r85j87J369K236
$$ 498805 494450 490727 487669 484650 481500 478789 476973 475830 474951 474240 473614 472761 471776 471589 472958 475194
53766D75194J430k00j004m19P51J472J262K45q35j019r4J090J793K348L362M564
$$ 475194 476624 476424 475420 475001 475752 477224 478486 478731 477896 476877 476783 477873 479666 482014 485376 489940
53750D89940N224N339N394N401N126M979N532O348O477N999N939O690P670Q624
$$ 489940 495164 500503 505897 511298 516424 521403 526935 533283 539760 545759 551698 558388 566058 574682
53736E74682R805J0799J0617R413Q637Q840Q837P838O918P085P243N733L087J452
$$ 574682 584487 595286 605903 615316 623953 632793 641630 649468 656386 663471 670714 676447 679534 680986
53722F80986J616K294K236J558O94n47k213l620m188m387n197o942q988j0367
$$ 680986 682602 684896 687132 688690 689384 688837 686624 683004 678816 674429 669232 662290 653302 642935
53708F42935j0533r760r009r060r643r737q852p707p284p393o757m644k183j455
$$ 642935 632402 622642 613633 604573 594930 585193 576341 568634 561350 553957 547200 542556 540373 538918
53694E38918l150n564o408n242l445k082r73k8j93k042m348n187m157k547j530
$$ 538918 535768 530204 523796 518554 515109 513027 512054 512026 511833 509791 505443 500256 496099 493552 492022
53679D92022j227j353j695j779j056J87Q95N47j64k43N60J793K831L095K410J464
$$ 492022 490795 489442 487747 485968 484912 485099 485994 486541 486377 486134 486694 488487 491318 494413 496823 498287
53663D98287J317K123K889K871K469K329K302K060K070K949M237M889M743M524
$$ 498287 499604 501727 504616 507487 509956 512285 514587 516647 518717 521666 525903 530792 535535 540059
53649E40059M442M025L418L566M557N002L992K689K864M307N094M303L281L869
$$ 540059 544501 548526 551944 555510 560067 565069 569061 571750 574614 578921 584015 588318 591599 595468
53635E95468O195Q696R679Q583O144L772K510K338K572K717K564J782K34j291
$$ 595468 601663 610359 620038 628621 634765 638537 641047 643385 645957 648674 651238 653020 653254 651963
53621F51963j588n85M25M84k9m97j225k504l381k572m13J195Q84q60k475k812
$$ 651963 650375 649790 650215 650699 650670 650173 648948 646444 643063 640491 640078 641273 642157 641297 638822 636010
53605F36010j865o58l53j096j858j811j336j187j187p26m2R6k66m10l16o28j139
$$ 636010 634145 633487 633134 632038 630180 628369 627033 625846 624659 623933 623891 623987 623721 623311 622995 622367 621228
53588F21228p01R47K436K532J686J194J533K270K941L359L418L172K888K753K814
$$ 621228 620527 621474 623910 626442 628128 629322 630855 633125 636066 639425 642843 646015 648903 651656 654470
53573F54470L222M047M767M605L544K404J889K175L281M920O014N572M235L729
$$ 654470 657692 661739 666506 671111 674655 677059 678948 681123 684404 689324 695338 700910 705145 708874
53559G08874M523N300N209N194O376Q376J0075J0902J0608R092P333P156Q879
$$ 708874 713397 718697 723906 729100 735476 743852 753927 764829 775437 784529 791862 799018 807897
53546H07897J0435J0140R000Q813R232Q687P190O145N788M901L023J077j05m05
$$ 807897 818332 828472 837472 846285 855517 864204 871394 877539 883327 888228 891251 892328 892223 891818
53532H91818L31K050L613L877L537M130N303M991K604J9j145j400j751k037j916
$$ 891818 892149 894199 897812 901689 905226 909356 914659 919650 922254 922273 921128 919728 917977 915940 914024
53517I14024k102l332n147o616p367p199n790l657k309k529l326l418k793k002
$$ 914024 911922 908590 903443 896827 889460 882261 876471 872814 870505 867976 864650 861232 858439 856437
53503H56437r71L48J145P82O7K39J204J740J121l53j829k166m37K747N236N770
$$ 856437 855466 855814 856959 857741 857808 858047 859251 860991 862112 861759 859930 857764 857327 860074 865310 871080
53487H71080N728P014Q978R270P521O107O883Q969J0559J1349J2041J2582J2382
$$ 871080 876808 883822 892800 902070 909591 915698 922581 931550 942109 953458 965499 978081 990463
53474I90463J1776J1992J3620J5962J8024J9454K0397K1011K1492K2291K3799
$$ 990463 1002239 1014231 1027851 1043813 1061837 1081291 1101688 1122699 1144191 1166482 1190281
53463A190281K5782K7314K7618K6976K6612K7472K9293L1080L2406L3914L6393
$$ 1190281 1216063 1243377 1270995 1297971 1324583 1352055 1381348 1412428 1444834 1478748 1515141
53452A515141L9640M2464M3815M3839M3736M4542M6082M7262M7345M6749M6454
$$ 1515141 1554781 1597245 1641060 1684899 1728635 1773177 1819259 1866521 1913866 1960615 2007069
53441B007069M6870M7482M7484M6601M5263M4125M3425M2843M2003M0975M0041
$$ 2007069 2053939 2101421 2148905 2195506 2240769 2284894 2328319 2371162 2413165 2454140 2494181
53430B494181L9101L7787L6192L4929L4277L3771L3099L2845L3622L4761L4715
$$ 2494181 2533282 2571069 2607261 2642190 2676467 2710238 2743337 2776182 2809804 2844565 2879280
53419B879280L2917L0489K8651K6972K3904J8985J3804J0345Q683O970L771l37
$$ 2879280 2912197 2942686 2971337 2998309 3022213 3041198 3055002 3065347 3074030 3081000 3084771 3084434
53407C084434m005p325j1601j6986k1579k3599k3627k3776k5123k6930k8129k8548
$$ 3084434 3080429 3073104 3061503 3044517 3022938 2999339 2975712 2951936 2926813 2899883 2871754 2843206
53395B843206k8708k9255l0821l3558l6499l8064l7674l6320l5172l4216l2791
$$ 2843206 2814498 2785243 2754422 2720864 2684365 2646301 2608627 2572307 2537135 2502919 2470128
53384B470128l0949k9463k8555k7383k4955k1313j7544j4743j2941j1132q545
$$ 2470128 2439179 2409716 2381161 2353778 2328823 2307510 2289966 2275223 2262282 2251150 2242605
53373B242605n706l722k466l93L354P462J0063J1221J2609J5010J7602J9830K2415
$$ 2242605 2236899 2233177 2230711 2230318 2233672 2241134 2251197 2262418 2275027 2290037 2307639 2327469 2349884
53360B349884K5806K9041L1243L3232L6287M0019M2837M4333M5905M8929N3372
$$ 2349884 2375690 2404731 2435974 2469206 2505493 2545512 2588349 2632682 2678587 2727516 2780888
53349B780888N8238O2442O5243O6889O8855P2421P6888Q0293Q2131Q4038Q7390
$$ 2780888 2839126 2901568 2966811 3033700 3102555 3174976 3251864 3332157 3414288 3498326 3585716
53338C585716R1496R4966R7587R9898J01839J03015J03601J03866J03439J02075
$$ 3585716 3677212 3772178 3869765 3969663 4071502 4174517 4278118 4381984 4485423 4587498
53328D587498J00532R9562R8549R6427R3495R0806Q8064Q3775P7610P1091O5402
$$ 4587498 4688030 4787592 4886141 4982568 5076063 5166869 5254933 5338708 5416318 5487409 5552811
53317E552811N9871N3305M5723L7847K9745K1003J1740K619o007j4357k2840l1817
$$ 5552811 5612682 5665987 5711710 5749557 5779302 5800305 5812045 5814664 5808657 5794300 5771460 5739643
53305E739643m1564n1924o2074p1038p8415q4399q9148r2450r4112r4524r4556
$$ 5739643 5698079 5646155 5584081 5513043 5434628 5350229 5261081 5168631 5074519 4979995 4885439
53294D885439r4805r4982r4305r2440q9812q7020q4371q2147q0714q0051p9618
$$ 4885439 4790634 4695652 4601347 4508907 4419095 4332075 4247704 4165557 4084843 4004792 3925174
53283C925174p9059p8480p7787p6376p4046p1424o8865o5731o1654n7672n4863
$$ 3925174 3846115 3767635 3689848 3613472 3539426 3468002 3399137 3333406 3271752 3214080 3159217
53272C159217n2609m9616m6078m3223m1057l8468l5556l3884l3967l4265l3328
$$ 3159217 3106608 3056992 3010914 2967691 2926634 2888166 2852610 2818726 2784759 2750494 2717166
53261B717166l1402k9211k6629k3551k0758j8835j7278j5571j4097j3078j1630
$$ 2717166 2685764 2656553 2629924 2606373 2585615 2566780 2549502 2533931 2519834 2506756 2495126
53250B495126q977n728k822o8L260P050J0746J4379J8155K1515K3771K5253K6850
$$ 2495126 2486149 2480421 2477599 2477531 2480791 2487841 2498587 2512966 2531121 2552636 2576407 2601660 2628510
53237B628510K8797L0903L3406L6565L9707M1838M2981M3991M5263M6408M6992
$$ 2628510 2657307 2688210 2721616 2758181 2797888 2839726 2882707 2926698 2971961 3018369 3065361
53226C065361M6683M5026M1933L8258L5039L2287K9161K5030J9792J3701P654
$$ 3065361 3112044 3157070 3199003 3237261 3272300 3304587 3333748 3358778 3378570 3392271 3399925
53215C399925K929m23m214r966j6590k1690k4794k7736l1839l6302l9661m1502
$$ 3399925 3402854 3402431 3398217 3388251 3371661 3349971 3325177 3297441 3265602 3229300 3189639 3148137
53203C148137m2345m2998m4381m6832m9256n0132m9788n0460n3312n6540n7502
$$ 3148137 3105792 3062794 3018413 2971581 2922325 2872193 2822405 2771945 2718633 2662093 2604591
53192B604591n6032n4377n4149n4521n3717n1420m9019m7740m7415m7401m7885
$$ 2604591 2548559 2494182 2440033 2385512 2331795 2280375 2231356 2183616 2136201 2088800 2040915
53181B040915m9228n0328m9257m6066m3449m3467m4749m4457m2074l9310l6928
$$ 2040915 1991687 1941359 1892102 1846036 1802587 1759120 1714371 1669914 1627840 1588530 1551602
53170A551602l3873k9777k6127k4217k3506k2991k2733k3107k3595k3434k2797
$$ 1551602 1517729 1487952 1461825 1437608 1414102 1391111 1368378 1345271 1321676 1298242 1275445
53159A275445k2515k3077k4402k6019k7123k7173k6724k6767k7010k5980k3280
$$ 1275445 1252930 1229853 1205451 1179432 1152309 1125136 1098412 1071645 1044635 1018655 995375
53148I95375k0433j8798j7884j6737j5798j6026j7096j7827j7877j7629j6868
$$ 995375 974942 956144 938260 921523 905725 889699 872603 854776 836899 819270 802402
53137H02402j4934j2115r685q594q941j0453j2433j3495j2586j0428q819q384
$$ 802402 787468 775353 765668 757074 748133 737680 725247 711752 699166 688738 679919 671535
53125F71535q067p082o127o039o256n615m204l441m292o038p095o703n436m185
$$ 671535 663468 656386 650259 644220 637964 632349 628145 624704 620412 614374 607279 600576 595140 590955
53111E90955l097j885p72m09q24j258j331j604k487l297l132k089q32M37J585
$$ 590955 587858 585973 585201 584792 583968 582710 581379 579775 577288 573991 570859 568770 567938 568375 569960
53096E69960J657j86k917m186l069j166n53j492k681l010k492k004k501l943m789
$$ 569960 571617 571431 568514 564328 561259 560093 559540 558048 555367 552357 549865 547861 545360 541417 536628
53081E36628l335Q8L071L816K983K236J971J558R75P50P04J85o01q72q10j376
$$ 536628 533293 533381 536452 540268 543251 545487 547458 549016 549991 550741 551445 551630 551029 550157 549347 547971
53065E47971k354k252p44L75k87j553j400J16J250J269J087J422J898K188K543
$$ 547971 545617 543365 542621 542996 542709 541156 539756 539872 541122 542391 543478 544900 546798 548986 551529
53050E51529K803K165O20m50J02J688K745K398Q19j325l251m351m728m905m744
$$ 551529 554332 556497 557117 556667 556769 558457 561202 563600 564419 563094 559843 555492 550764 545859 541115
53035E41115l480j242M20L92o39j499k251l342l887k619j99J154M71r98j822j879
$$ 541115 537635 536393 536813 537205 536566 535067 532816 529474 525587 522968 522769 523923 524394 523396 521574 519695
53019E19695j467l46J483L122L701L177J720o45l139m019k491k03L34j407l549
$$ 519695 518228 517882 519365 522487 526188 529365 531085 530440 527301 523282 520791 520588 520922 519515 515966
53004E15966m120k883q97Q68K036K474K098J190N42P12J173P50o87j760j459p07
$$ 515966 511846 508963 508066 508934 510970 513444 515542 516732 517274 517986 519159 519909 519222 517462 516003 515296
52988E15296q42j263l77J291J205j288l360k326Q16L090L394K728J692L6j730
$$ 515296 514454 513191 512814 514105 515310 514022 510662 508336 509152 512242 515636 518364 520056 520092 518362
52973E18362k498k379k450k551j339J036K233P50j846k945k011n66J16P3p4J39
$$ 518362 515864 513485 511035 508484 507145 508181 510414 511164 509318 506373 504362 503796 503912 503985 503911 504050
52957E04050P95J327Q10q23k188j852p3J606K312K498K757K816K167J070L65M83
$$ 504050 504845 506172 506982 506159 503971 502119 502046 503652 505964 508462 511219 514035 516202 517272 517637 518120
52941E18120R15Q25K2q04r20m54j36k50l66k58l09o08k67J456L788N149N104M574
$$ 518120 519035 519860 519882 519078 518158 517704 517568 517318 516952 516694 516385 515777 515510 516966 520754 525903 531007 535581
52923E35581M001K630K10j673j241J014K801K870K220K244K918L407L470L286
$$ 535581 539582 542212 542422 540749 539508 540522 543323 546193 548413 550657 553575 556982 560452 563738
52909E63738K545R19q18j273j99J100J355N38o87j837k439j875k18J310J576Q96
$$ 563738 566283 567202 566384 565111 564912 566012 567367 567905 567218 565381 562942 561067 560849 562159 563735 564631
52893E64631M13M39K93l56r66j112j111j302j481j451j542j993k428k498k628
$$ 564631 565044 565483 565776 565420 564454 563342 562231 560929 559448 557997 556455 554462 552034 549536 546908
52878E46908l338m182m133l033j731p32M22J985L026K399L99j405j962j695j574
$$ 546908 543570 539388 535255 532222 530491 529759 530181 532166 535192 537591 537990 536585 534623 532928 531354
52863E31354j971k651l396l995l956k786p35J167J908J319J26q15j356k083l261
$$ 531354 529383 526732 523336 519341 515385 512599 511864 513031 514939 516258 516384 515569 514213 512130 508869
52848E08869l910k664K06K475K323M93p72n44J77L94L45M82N43K16j04m7J01J12
$$ 508869 504959 502295 502501 504976 507299 507792 507020 506476 506653 507047 507392 507874 508417 508633 508529 508482 508583 508695
52830E08695M60J375J950J255j07o91j58N42Q77J331K015J835r1k710l704j991
$$ 508695 509155 510530 512480 513735 513628 512937 512779 513321 514198 515529 517544 519379 519288 516578 512874 510883
52814E10883Q80K214J105n67m97J085J784M99r35l95J520K636K385K011J995J477
$$ 510883 511763 513977 515082 514515 514018 515103 516887 517386 516451 516056 517576 520212 522597 524608 526603 528080
52798E28080M06L8O02M98j071k437k070j228j955l596l645j715l03j196l158m033
$$ 528080 528486 528524 529126 529624 528553 526116 524046 522818 520863 517267 513622 511907 511604 510408 507250 503217
52782E03217l570l025l088l382l472l359l135k868k707k614k178j106K45J177
$$ 503217 499647 496622 493534 490152 486680 483321 480186 477318 474611 471997 469819 468713 468958 470135
52768D70135J378J168J030J117J156Q92N95Q70J656J870O39j353k586k607k237
$$ 470135 471513 472681 473711 474828 475984 476876 477471 478341 479997 481867 482506 481153 478567 475960 473723
52753D73723j874r56N31J343P31j67J93J606K603K495J703N80p46j597j237r8
$$ 473723 471849 470893 471424 472767 473498 473331 473524 475130 477733 480228 481931 482511 481765 480168 478931 478833
52737D78833O99J028J544J858O30k040l993l708k235j314q84J81J797K708K362
$$ 478833 479532 480560 482104 483962 484592 482552 478559 474851 472616 471302 470418 470599 472396 475104 477466
52722D77466J303j6j397k014q85J474L070K627R44l21m30K90J240J847J558K95
$$ 477466 478769 478753 477356 475342 474457 475931 479001 481628 482572 482251 481821 482111 483351 485198 486756 487051
52706D87051j197j975j898j734k133k734k545j333j79j52o72j06J799L241K726
$$ 487051 485854 483879 481981 480247 478114 475380 472835 471502 471323 471171 470499 470393 472192 475433 478159
52691D78159J154M05O72N95l42j135r34J27J884M387O651O712L997N63j034m12
$$ 478159 479313 479718 480390 480985 480643 479508 478574 478701 480585 484972 491623 498335 502332 502895 501861 501449
52675E01449R59J977K641L039K829J886P61K28O57J751K786L354L872M850N581
$$ 501449 502408 504385 507026 510065 512894 514780 515541 515769 516426 518177 520963 524317 528189 533039 538620
52660E38620M457J196k088k970j567l99j529m397o477n628j969K087L811K588
$$ 538620 543077 544273 542185 539215 537648 537249 535720 531323 524846 519218 517249 519336 523147 525735
52646E25735L05q10m40L9n28j994l414l936l293j895n25K64M21J02m34n99J65
$$ 525735 526040 525230 524790 524829 524301 522307 518893 514957 511664 509769 509244 509508 509929 510031 509597 508998 509163
52629E09163J493K310K297K310K745K522P88j209j385L46J864J591J55q26o26
$$ 509163 510656 512966 515263 517573 520318 522840 523628 522419 521034 521380 523244 524835 524990 524164 523538
52614E23538M02J585K256J868L79j480k574k100k96J489J803O26n29m95L4l98
$$ 523538 523940 525525 527781 529649 530028 528548 525974 523874 523578 525067 526870 527496 526967 526472 526506 526108
52598E26108j933l267l311k045l4J889K620J731N37J043L464N717N816M009K112
$$ 526108 524175 520908 517597 515552 515518 517407 520027 521758 522295 523338 526802 532519 538335 542344 544456
52583E44456J515K201L108K999J478n13j626j702j835k708l607l494k402j235
$$ 544456 545971 548172 551280 554279 555757 555244 553618 551916 550081 547373 543766 540272 537870 536635
52569E36635n95l78k29k6J48K53M47Q24R85L28r17j494o04R05J566J090K10p27
$$ 536635 536040 535662 535433 535407 535555 535808 536255 537079 538064 538392 537475 535981 535377 536282 537848 538938 539148 538421
52551E38421j774k353j671k18O66P94J288K420K976K162O93o58j949k685j414
$$ 538421 536647 534294 532623 532405 533071 533865 535153 537573 540549 542711 543404 542746 540797 538112 536698
52536E36698J969M995N352L705K221J360J12j342j530j55J280J727J773K120K355
$$ 536698 538667 543662 549014 552719 554940 556300 556412 555070 553540 553385 554665 556392 558165 560285 562640
52521E62640J994J573J740K028J472J53o88j48J124J505K10j657k236j105K21
$$ 562640 564634 566207 567947 569975 571447 571600 570912 570764 571888 573393 573603 571946 569710 568605 568826
52506E68826J99r41j836j811j324j017j093j443j644j054M28J951K688K888L200
$$ 568826 569025 568084 566248 564437 563113 562096 561003 559560 557916 556862 557290 559241 561929 564817 568017
52491E68017L332K418N39j184k118k645l096l141k603j928j415p41K81J087J056
$$ 568017 571349 573767 574306 573122 571004 568359 565263 562122 559519 557591 556176 555435 555716 556803 557859
52476E57859K69p79j818k656k843k030n41P93J348J142O83M65M23l1j130k021
$$ 557859 558128 557349 555531 552875 550032 548002 547461 548254 549602 550744 551427 551892 552315 552284 551154 549133
52460E49133j461P28L323M850M727L267J292j08n6J351L061M181M706N000M947
$$ 549133 547672 548400 551723 556573 561300 564567 565859 565751 565695 567046 570107 574288 578994 583994 588941
52445E88941M190K832J511P90P23Q98O49m62k045k882k086k61Q33Q2j763k945
$$ 588941 593131 595963 597474 598264 598987 599885 600534 600072 598027 595145 593059 592798 593631 593713 591950 589005
52429E89005k681j893j884k677l164k583j224K75J544K108J285q05k593k366j11
$$ 589005 586324 584431 582547 579870 576706 574123 572899 573174 574718 576826 578111 577306 574713 572347 572236
52414E72236K490L883L873L190K525K162K041K021K214K922L878M072K955J585
$$ 572236 574726 578609 582482 585672 588197 590359 592400 594421 596635 599557 603435 607507 610462 612047
52400F12047J647L345N069N286M054K437J256O19J45p41k244l741m417m341m277
$$ 612047 613694 617039 622108 627394 631448 633885 635141 635760 635905 635164 632920 629179 624762 620421 616144
52385F16144m370l894k569j189n37n30r33j900l135l453k275q61q17j865k299
$$ 616144 611774 607880 605311 604122 603585 603055 602122 600222 597087 593634 591359 590498 589681 587816 585517
52370E85517j469n22n09r14n81P64K393L436L424K494J515J550K678L609L035
$$ 585517 584048 583526 583017 582103 581522 582286 584679 588115 591539 594033 595548 597098 599776 603385 606420
52355F06420J299K31J163L381M857M484L291L252M972O996P537O579N905P131
$$ 606420 607719 607950 609113 612494 617351 621835 625126 628378 633350 640346 647883 654462 660367 667498
52341F67498J0022J2805J3839J2936J1176R503P654M635K63m176p061p962p577
$$ 667498 677520 690325 704164 717100 728276 737779 745433 750068 750331 746155 739094 731132 723555
52328G23555o576n158l703k991l278l735l356k173j071n31j52N59J483K250K885
$$ 723555 716979 711821 708118 705127 701849 698114 694758 692585 691514 690983 690831 691390 692873 695123 698008
52313F98008L626M337M581M389M458N401O952Q219Q574Q168P653P562P806P606
$$ 698008 701634 705971 710552 714941 719399 724800 731752 739971 748545 756713 764366 771928 779734 787340
52299G87340O073L137p5k028j921j23K270L997M232L258K557L512N812P701Q028
$$ 787340 793413 796550 796475 794447 792526 792403 794673 798670 802902 806160 808717 812229 818041 825742 833770
52284H33770P493P461Q128Q517P963O930O370O916Q734J1567J4684J7151J8508
$$ 833770 841263 848724 856852 865369 873332 880262 886632 893548 902282 913849 928533 945684 964192
52271I64192J9063J9461K0137K1257K2847K4754K6582K7866K8403K8543K9206
$$ 964192 983255 1002716 1022853 1044110 1066957 1091711 1118293 1146159 1174562 1203105 1232311
52260A232311L1293L4588L7386L7952L6611L5660L6637L8355L8458L6516L4393
$$ 1232311 1263604 1298192 1335578 1373530 1410141 1445801 1482438 1520793 1559251 1595767 1630160
52249A630160L3575L3494L3094L2695L3161L3896L3271L0957K8515K7187K6274
$$ 1630160 1663735 1697229 1730323 1763018 1796179 1830075 1863346 1894303 1922818 1950005 1976279
52238A976279K4356K1434J8895J7652J7088J5857J3338J0143P377N392L320N5
$$ 1976279 2000635 2022069 2040964 2058616 2075704 2091561 2104899 2115042 2122419 2127811 2131131 2131186
52226B131186m335q512j1116j1711j0633q654o904o155n765m198j087K074M050
$$ 2131186 2126851 2118339 2107223 2095512 2084879 2076225 2069321 2063166 2057401 2053203 2052116 2054190 2058240
52213B058240N628Q178J1353J3689J4932J6204J7965J9515K0656K2314K4918K7381
$$ 2058240 2063868 2072046 2083399 2097088 2112020 2128224 2146189 2165704 2186360 2208674 2233592 2260973
52201B260973K8356K7631K5791K3568K2035K2298K4147K5711K5385K3540K1714
$$ 2260973 2289329 2316960 2342751 2366319 2388354 2410652 2434799 2460510 2485895 2509435 2531149
52190B531149K0738K0303J9767J8525J6081J2508Q590M993J666j494l937n092
$$ 2531149 2551887 2572190 2591957 2610482 2626563 2639071 2647661 2652654 2654320 2652826 2648889 2643797
52178B643797n284n359n725o300p042p961q883r633j0154j0144r170p501o137
$$ 2643797 2638513 2633154 2627429 2621129 2614087 2606126 2597243 2587610 2577456 2567312 2558142 2550641 2544504
52165B544504n477m754l391j990j239p53l8M28L29Q03K967N859P572Q013Q603
$$ 2544504 2539027 2534273 2530882 2528892 2527653 2526900 2526862 2527290 2527619 2528422 2531389 2537248 2544820 2552833 2561436
52150B561436R574R766R323J0122J2718J4989J5178J4502J5067J6562J6942J5569
$$ 2561436 2571010 2580776 2590099 2600221 2612939 2627928 2643106 2657608 2672675 2689237 2706179 2721748
52138B721748J3775J2435J0877Q534O345N774P022Q811R584Q725O808M986M095
$$ 2721748 2735523 2747958 2758835 2767369 2773714 2779488 2786510 2795321 2804905 2813630 2820438 2825424 2829519
52125B829519M264N164O171O259M438R20k474l733k699j326j795m572q333j1506
$$ 2829519 2833783 2838947 2845118 2851377 2855815 2856735 2854261 2850528 2847829 2846503 2844708 2840136 2831803 2820297
52111B820297j3642j5128j5990j5597j3831j1839j0898j0855j0526r454q200o863
$$ 2820297 2806655 2791527 2775537 2759940 2746109 2734270 2723372 2712517 2701991 2692537 2684337 2677474
52099B677474m588j209J705K482J541R07J612K475J711p00k701k425n01M50r40
$$ 2677474 2672886 2671677 2673382 2675864 2677405 2678312 2679924 2682399 2684110 2683410 2680709 2678284 2677783 2678233 2677293
52084B677293k876k732p96J39j040j970l95K351L305K226J598K684L898L749L378
$$ 2677293 2674417 2671685 2670889 2671028 2669988 2668018 2667623 2669974 2673279 2675505 2677103 2679787 2683685 2687434 2690812
52069B690812M900Q403J2071J4775J7295K0800K5081K8805L1218L3013L5376L8532
$$ 2690812 2695712 2704115 2716186 2730961 2748256 2769056 2794137 2822942 2854160 2887173 2922549 2961081
52057B961081M1678M4283M6691M9135N0823N0721M8984M6835M5140M3588M1275
$$ 2961081 3002759 3047042 3093733 3142868 3193691 3244412 3293396 3340231 3385371 3428959 3470234
52046C470234L7605L2765K7756K3859K1496J9656J6914J2966Q774N353K904J019
$$ 3470234 3507839 3540604 3568360 3592219 3613715 3633371 3650285 3663251 3672025 3677378 3680282 3681301
52034C681301p57k451l375k641n54Q92k21l616p313r976j1858j3507j4892j6019
$$ 3681301 3680544 3678093 3674718 3672077 3671523 3672415 3672194 3668578 3661265 3651289 3639431 3625924 3611032 3595013
52020C595013j7265j8472j8572j6736j3372r487n645j973J370M293O981R666J2458
$$ 3595013 3577748 3559276 3540704 3523968 3510596 3501109 3495464 3493491 3494861 3499154 3506135 3515801 3528259
52007C528259J5458J8520K0848K1644K1303K1157K1781K2361K2075K1057J9543
$$ 3528259 3543717 3562237 3583085 3604729 3626032 3647189 3668970 3691331 3713406 3734463 3754006
51996C754006J7101J3590R985P252N089K721L84j110k018l808p546j2758j7765
$$ 3754006 3771107 3784697 3794682 3801934 3807023 3809744 3810128 3809018 3807000 3803192 3795646 3782888 3765123
51983C765123k0864k1597k1480k2957k6972l2017l6029l8598m0488m1838m2111
$$ 3765123 3744259 3722662 3701182 3678225 3651253 3619236 3583207 3544609 3504121 3462283 3420172
51972C420172m1349m0137l8522l6210l3686l1738k9947k7070k3238k0344j9655
$$ 3420172 3378823 3338686 3300164 3263954 3230268 3198530 3168583 3141513 3118275 3097931 3078276
51961C078276k0115j9798j8291j6951j7270j9408k2040k3461k3217k2615k3061
$$ 3078276 3058161 3038363 3020072 3003121 2985851 2966443 2944403 2920942 2897725 2875110 2852049
51950B852049k4263k5009k5333k6462k8594l0456l1641l3537l6893m0018m1002
$$ 2852049 2827786 2802777 2777444 2750982 2722388 2691932 2660291 2626754 2589861 2549843 2508841
51939B508841m0596m1113m3207m5508m7061m8182m8804m7972m5638m3466m2743
$$ 2508841 2468245 2427132 2383925 2338417 2291356 2243174 2194370 2146398 2100760 2057294 2014551
51928B014551m2499m0828l7424l3771l1140k9530k8579k8373k8792k8674k6623
$$ 2014551 1972052 1931224 1893800 1860029 1828889 1799359 1770780 1742407 1713615 1684941 1658318
51917A658318k2804j9274j8095j9308k1115k1957k1881k1781k1867k1436j9946
$$ 1658318 1635514 1616240 1598145 1578837 1557722 1535765 1513884 1492103 1470236 1448800 1428854
51906A428854j7821j6010j4964j4222j2968j0858q218n487k748J5K470M224N457
$$ 1428854 1411033 1395023 1380059 1365837 1352869 1342011 1333793 1328306 1325558 1325573 1328043 1332267 1337724
51893A337724O724Q033Q564P574N227K288o24l274n520p091p595o761m907l098
$$ 1337724 1344448 1352481 1361045 1368619 1373846 1376134 1375510 1372236 1366716 1359625 1352030 1345269 1340362 1337264
51879A337264k211j782k54L138P322J0522J2091J2745J3329J3903J3932J2935
$$ 1337264 1335053 1333271 1333017 1336155 1343477 1353999 1366090 1378835 1392164 1406067 1419999 1432934
51867A432934J0912Q225N067J086m045r739j4663j7978j9944k1213k2190k3247
$$ 1432934 1443846 1452071 1457138 1458224 1454179 1444440 1429777 1411799 1391855 1370642 1348452 1325205
51855A325205k4708k6042k5871k3508j9970j6835j4538j2430r909o843l363k9
$$ 1325205 1300497 1274455 1248584 1225076 1205106 1188271 1173733 1161303 1151394 1144551 1141188 1141159
51843A141159K305L643N338Q565J2762J6573J9893K3742K8315L2294L3984L2200
$$ 1141159 1143464 1147107 1152445 1161010 1173772 1190345 1210238 1233980 1262295 1294589 1328573 1360773
51831A360773K6348J6943O010m288j3454k1971k9127l3174l3881l3147l2396l0913
$$ 1360773 1387121 1404064 1410074 1405786 1392332 1370361 1341234 1308060 1274179 1241032 1208636 1177723
51819A177723k7635k3247j9310j6300j3674j1082q527n875l068l45K360N453Q467
$$ 1177723 1150088 1126841 1107531 1091231 1077557 1066475 1057948 1052073 1049005 1048660 1051020 1056473 1064940
51806A064940R816Q828P014O133N721L993O29k958n824q311j0525j1654j1287
$$ 1064940 1074756 1083584 1090598 1096731 1102452 1106445 1107074 1104116 1098292 1089981 1079456 1067802 1056515
51793A056515j0157q980p531n506l427j975r65K91J963L548M483M548L801K398
$$ 1056515 1046358 1037378 1029847 1024341 1020914 1018939 1017974 1018265 1020228 1023776 1028259 1032807 1036608 1039006
51779A039006L95k267n302p753q700q366p954q202q655q481p378n441k981r00
$$ 1039006 1039401 1037134 1031832 1024079 1015379 1007013 999059 990857 982202 973721 966343 960902 957921 957021
51765I57021m28j569k443j275J183K335Q86j803l777m722n412n994n938n300m732
$$ 957021 956593 955024 952581 951306 952489 954824 955710 953907 950130 945408 939996 934002 928064 922764 918032
51750I18032m296l391k000q97k04J073L369N390N700M696L726K790O18k953o240
$$ 918032 913736 910345 908345 907448 907244 908317 911686 917076 922776 927472 931198 933988 934606 931653 925413
51735I25413p725p569o596n028l037j541j482k766m635o426p446o982n333m026
$$ 925413 917688 910119 903523 898495 895458 893917 892435 889669 885034 878608 871162 864180 858847 854821
51721H54821l941l847k089Q12K736K814K160J770J297L91k84k12n8n52j114m74
$$ 854821 850880 847033 844944 845756 848492 851306 853466 855236 856533 856924 856640 856428 856370 855818 854704 854230
51705H54230J740M711P378R087R810J0240J1261J2806J3801J3681J3297J3463
$$ 854230 855970 860681 868059 877146 886956 897196 908457 921263 935064 948745 962042 975505
51693I75505J3272J1013O538J519k589n784q511j0540j1406j1207j0306q819o911
$$ 975505 988777 999790 1006328 1007847 1005258 999474 990963 980423 969017 957810 947504 938685 931774
51680I31774n107l676k169k12J599K372K278K440L595N667Q574J2330J5989J7648
$$ 931774 926667 922991 920822 920610 922209 924581 926859 929299 932894 938561 947135 959465 975454 993102
51666I93102J6393J3559J1083R228O978M291K499K255K381J348j002l918o994
$$ 993102 1009495 1023054 1034137 1043365 1050343 1054634 1057133 1059388 1061769 1063117 1062115 1058197 1051203
51653A051203j0024j2197j2530j1062q796o523m462l034l030m584o583p623p317
$$ 1051203 1041179 1028982 1016452 1005390 996594 990071 985609 982575 979545 974961 968378 960755 953438
51640I53438o283n066l541j400J134L341M630M995M833M408L640K303K98k100
$$ 953438 947155 942089 938548 937148 938282 941623 946253 951248 956081 960489 964129 966432 966730 964630
51626I64630m049m429k867n26O51k56k400m327n332n569n449n410n742o100n505
$$ 964630 960581 956152 953285 952759 953410 953154 950754 946427 941095 935526 930077 924667 918925 912825 907320
51611I07320l411m63K248M387O407Q669J1017J2922J3668J2967J1812J2001J3857
$$ 907320 903909 903446 905694 910081 916488 925157 936174 949096 962764 975731 987543 999544 1013401
51598A013401J5078J3006P735J803k909o512r435j1169j1285j0467r605q697p220
$$ 1013401 1028479 1041485 1049220 1051023 1048114 1041602 1032167 1020998 1009713 999246 989641 980944 973724
51585I73724m897j576K640O466P612N020L83l459n396o496q034j0038j1648j2057
$$ 973724 968827 967251 969891 976357 983969 988989 989372 985913 980517 974021 965987 955949 944301 932244
51571I32244j1030r132p573p286q044q692q338o986n198l526k306j650j502j709
$$ 932244 921214 912082 904509 897223 889179 880487 872149 865163 859965 856439 854133 852483 850981 849272
51557H49272j947j689p41P0o09l011n358n333k466J294L357K752O65r26j114m97
$$ 849272 847325 845636 844895 844965 844356 841345 835987 830654 828188 829482 832839 835591 836256 835330 834216 833719
51541H33719J56J137L138N620O937O383N243N271O798Q880J0646J1837J2566J3207
$$ 833719 833875 835012 838150 843770 850707 857090 862333 867604 874402 883282 893928 905765 918331 931538
51527I31538J4092J4787J4027J1082O787K739r6j506j556p58j39j44J02J662M441
$$ 931538 945630 960417 974444 985526 992313 995052 994956 993450 991894 991136 990997 990853 990955 992617 997058
51512I97058P684J1126J4653J7601J9732K2223K6056K9954L1928L2499L4169L7426
$$ 997058 1004742 1015868 1030521 1048122 1067854 1090077 1116133 1146087 1178015 1210514 1244683 1282109
51500A282109L9741L9360L7857L7545L8320L8994M0133M3259M7821N1145N1298
$$ 1282109 1321850 1361210 1399067 1436612 1474932 1513926 1554059 1597318 1645139 1696284 1747582
51489A747582M8421M3222L5750K5928J4069N39j4072k8185l9667m7535n2554n5927
$$ 1747582 1796003 1839225 1874975 1900903 1914972 1915511 1901439 1873254 1833587 1786052 1733498 1677571
51477A677571n8129n9192n9165n7734n4176m8462m2005l6575l2638k9252k5550
$$ 1677571 1619442 1560250 1501085 1443351 1389175 1340713 1298708 1262133 1229495 1200243 1174693
51466A174693k1804j8966j7541j7151j6991j6409j5094j3157j1312j0637j1493
$$ 1174693 1152889 1133923 1116382 1099231 1082240 1065831 1050737 1037580 1026268 1015631 1004138
51455A004138j2686j2469j0563q587p987q301q160p281o412n693m418k610j588
$$ 1004138 991452 978983 968420 959833 951846 943545 935385 928104 921692 915999 911581 908971 907383
51442I07383k312l916m592l510j344O51J607J395P10N99J468K493K460J166l60
$$ 907383 905071 901155 896563 893053 891709 892360 893967 895362 896072 896671 898139 900632 903092 904258 903898
51427I03898j068r99j028j724k684l021k459j843k393m446p016q649q717p816
$$ 903898 902830 901831 900803 899079 896395 893374 890915 889072 886679 882233 875217 866568 857851 850035
51413H50035o986o714o772o952p560q812r967r741p869n672m598m661m806m391
$$ 850035 843049 836335 829563 822611 815051 806239 796272 786531 778662 772990 768392 763731 758925 754534
51399G54534l560k502j310n12p35j589j854r77L15J281K165L477M989O119O740
$$ 754534 750974 748472 747162 746650 745915 744326 742472 741495 741810 743091 745256 748733 753722 759841 766581
51384G66581P061P178P270P706Q406Q829R138J0649J4148J8373K1180K1758K0557
$$ 766581 773642 780820 788090 795796 804202 813031 822169 832818 846966 865339 886519 908277 928834
51371I28834J7541J2103M876j723n307n252k654M41J714j48m222q134j0437j1432
$$ 928834 946375 958478 963354 961631 956324 951072 948418 948859 950573 950425 946203 938069 927632 916200
51357I16200j1614j0629q475o385n476n322m846l933l034j903K2K337M023M922
$$ 916200 904586 893957 885482 879097 873621 868299 863453 859520 856486 854583 854605 856942 860965 865887
51343H65887N741O660P071O781O428O439O597O950Q128J0198J2025J2447J1602
$$ 865887 871628 878288 885359 892140 898568 905007 911604 918554 926682 936880 948905 961352 972954
51330I72954J0539J0026J0313J1573J3827J6583J9245K1819K4733K8058L1500
$$ 972954 983493 993519 1003832 1015405 1029232 1045815 1065060 1086879 1111612 1139670 1171170
51319A171170L5135L9578M5140N1258N7068O2186O6643P0372P3246P5389P6728
$$ 1171170 1206305 1245883 1291023 1342281 1399349 1461535 1528178 1598550 1671796 1747185 1823913
51308A823913P6029P1037O0178M4133K5438O762j0254k4982l7512m8419n8174
$$ 1823913 1899942 1970979 2031157 2075290 2100728 2107490 2097236 2072254 2034742 1986323 1928149
51297A928149o6371p2005p4723p5399p5130p4032p1415o6951o1114n4670m8144
$$ 1928149 1861778 1789773 1715050 1639651 1564521 1490489 1419074 1352123 1291009 1236339 1188195
51286A188195m1882l6274l1661k8046k5068k2388k0155j8752j8008j7075j5512
$$ 1188195 1146313 1110039 1078378 1050332 1025264 1002876 982721 963969 945961 928886 913374
51275I13374j3968j3026j1838r090n391l224m030o471q326q975r006q485p004
$$ 913374 899406 886380 874542 865452 860061 856837 852807 846336 838010 829035 820029 811544 804540
51262H04540m944l308k544k511l216m528n483n129l898k963k409j362R6O55l25
$$ 804540 799596 796288 793744 791233 788017 783489 778006 772877 768979 766016 763607 762245 762341 762996 762671
51247G62671j769k281j571j75J339K487L014L180L324L161K416J870K531L755
$$ 762671 760902 758621 757050 756875 758214 760701 763715 766895 770219 773380 775796 777666 780197 783952
51233G83952L820K573J800K308K459O83k060l709l823l399k887k025j045o04o53
$$ 783952 787772 790345 792145 794453 796912 797595 795535 791826 788003 784604 781717 779692 778647 778043 777390
51218G77390n60j73K44Q59K083L667M826N040M181K334K62n81M71K246L131L132
$$ 777390 776830 776657 776901 777760 779843 783510 788336 793376 797557 799891 800153 799572 800043 802289 805420 808552
51202H08552L331L840L670K598J773K129L221L979L767K505N54j230k029j923
$$ 808552 811883 815723 819393 821991 823764 825893 829114 833093 836860 839365 839919 838689 836660 834737
51188H34737j885k681m141n500o111n896n401n181m974l929k071p14q35j756k273
$$ 834737 832852 830171 826030 820530 814419 808523 803122 797941 792967 789038 786967 786253 785418 783662 781389
51173G81389k271k155j555LJ690K308K203K497K698J034k531n542n959m339k473
$$ 781389 779118 776963 775408 775411 777101 779409 781612 784109 786807 787841 785310 779768 773809 769470 766997
51158G66997j266p32p28p83k24P88J234Q05M13N47M45k34k46J477L786M500L142
$$ 766997 765731 764999 764271 763488 763264 764052 765286 766091 766504 767051 767496 767262 767016 768493 772279 776779 779921
51141G79921J374R48K246M501O617P824Q156Q230Q314Q084P429O757N962M080
$$ 779921 781295 782243 784489 788990 795607 803431 811587 819817 828131 836215 843644 850401 856363 860443
51127H60443P15k819m706m458k946j295m41r79k417l136k159m93J58m92j513k458
$$ 860443 861158 858339 853633 849175 846229 844934 844493 843514 841097 837961 835802 835309 835467 834975 833462 831004
51111H31004l569m566m683l937l187k766k086p51Q26K099K872K970K345J729K272
$$ 831004 827435 822869 818186 814249 811062 808296 806210 805459 806285 808384 811256 814226 816571 818300 820572
51096H20572M077N784O074N121M239M305M826M399K060j564m582n536m619l057
$$ 820572 824649 830433 836507 841628 845867 850172 854998 859397 861457 859893 855311 849775 845156 842099
51082H42099j740r39p12q30o65o4J17p14j502o92J322K380J354m99j498j504j279
$$ 842099 840359 839420 838708 837878 837213 837149 837266 836552 835050 834358 835680 838060 839414 838915 837417 835913 834634
51065H34634j042p11p45j579k532k285m57J839L014K337N62n31L66K720M643M970
$$ 834634 833592 832881 832136 830557 828025 825740 825283 827122 830136 832473 833035 832504 832870 835590 840233 845203
51049H45203M379M087M271M348M224M303M617M836M964N218N252M459L216K945
$$ 845203 849582 853669 857940 862288 866512 870815 875432 880268 885232 890450 895702 900161 903377 906322
51035I06322M365O272O720N304L626L384M327M582K905J59j748k078j737j620
$$ 906322 910687 916959 923679 928983 932609 935993 940320 944902 947807 947966 946218 944140 942403 940783
51021I40783j418n89K69N6r96j276J25K119L043K807K835L914N098M980L654K703
$$ 940783 939365 938776 939045 939101 938105 936829 936954 939073 942116 944923 947758 951672 956770 961750 965404 968107
51005I68107L395N417P587R388J1217J3301J5055J5865J6200J7299J9750K2743
$$ 968107 971502 976919 984506 993894 1005111 1018412 1033467 1049332 1065532 1082831 1102581 1125324
50993A125324K4798K4966K3219K0150J6687J3952J2884J3802J6270J9322K1716
$$ 1125324 1150122 1175088 1198307 1218457 1235144 1249096 1261980 1275782 1292052 1311374 1333090
50982A333090K2392K1208J9130J7191J5130J1630O094l66o100j0339j3022j3923
$$ 1333090 1355482 1376690 1395820 1413011 1428141 1439771 1445865 1445499 1439399 1429060 1416038 1402115
50970A402115j3096j1925j2448j5392j9611k3507k6077k6434k3814j8933j4311
$$ 1402115 1389019 1377094 1364646 1349254 1329643 1306136 1280059 1253625 1229811 1210878 1196567
50959A196567j1949j1188r837p007l686q12J890M898P799R749J0425J0241J0118
$$ 1196567 1184618 1173430 1163593 1156586 1152900 1152088 1153978 1158876 1166675 1176424 1186849 1197090 1207208
50946A207208J1155J3764J6855J8567J8379J7894J8920K1207K2846K2710K1670
$$ 1207208 1218363 1232127 1248982 1267549 1285928 1303822 1322742 1343949 1366795 1389505 1411175
50935A411175K1181K1380K1213K0189J9113J8797J8746J7968J6776J6628J7932
$$ 1411175 1432356 1453736 1474949 1495138 1514251 1533048 1551794 1569762 1586538 1603166 1621098
50924A621098J9066J8355J6251J4582J4193J4419J4556J4745J5406J6879J9718
$$ 1621098 1640164 1658519 1674770 1689352 1703545 1717964 1732520 1747265 1762671 1779550 1799268
50913A799268K4261K9626L4122L6970L8752M0090M0974M1908M4307M8886N4576
$$ 1799268 1823529 1853155 1887277 1924247 1962999 2003089 2044063 2085971 2130278 2179164 2233740
50902B233740O0075O5707P2592Q0491Q7781R3450R8062J02685J07542J11834J14339
$$ 2233740 2293815 2359522 2432114 2512605 2600386 2693836 2791898 2894583 3002125 3113959 3228298
50891C228298J14364J12490J10067J07471J03477R7145Q9666Q3011P7244P0808
$$ 3228298 3342662 3455152 3565219 3672690 3776167 3873312 3962978 4045989 4123233 4194041
50881D194041O3457N7061N2899M9938M6803M4008M2582M1479L8273L2238K5112
$$ 4194041 4257498 4314559 4367458 4417396 4464199 4508207 4550789 4592268 4630541 4662779 4687891
50870D687891J8671J2894O980P41n791j3230k2321l2895m4049n5107o5830p6040
$$ 4687891 4706562 4719456 4726436 4727177 4721386 4708156 4685835 4652940 4608891 4553784 4487954 4411914
50858D411914q5694r5148j04584j13212j19609j23008j23795j22700j20003j15796
$$ 4411914 4326220 4231072 4126488 4013276 3893667 3770659 3646864 3524164 3404161 3288365
50848C288365j10534j04908r9230r3182q6252p8493p0839o4433n9500n5211n0892
$$ 3288365 3177831 3072923 2973693 2880511 2794259 2715766 2644927 2580494 2520994 2465783 2414891
50837B414891m6871m3605m0549l6909l3201l0701k9241k7032k3153j8915j5843
$$ 2414891 2368020 2324415 2283866 2246957 2213756 2183055 2153814 2126782 2103629 2084714 2068871
50826B068871j3597j1101q557o816n427l103N6K585L924N136O964Q755R840J0759
$$ 2068871 2055274 2044173 2035616 2028800 2023373 2020270 2020326 2022911 2026835 2031971 2038935 2047690 2057530 2068289
50812B068289J2301J4325J6296J8204K0273K2429K4645K7246L0305L3367L6269
$$ 2068289 2080590 2094915 2111211 2129415 2149688 2172117 2196762 2224008 2254313 2287680 2323949
50801B323949L9638M4073M9410N5118O0719O5534O9002P1974P6708Q4601R4602
$$ 2323949 2363587 2407660 2457070 2512188 2572907 2638441 2707443 2779417 2856125 2940726 3035328
50790C035328J04628J13892J23028J32701J43177J54718J67143J79305J90044
$$ 3035328 3139956 3253848 3376876 3509577 3652754 3807472 3974615 4153920 4343964
50781D343964J99448K08355K16999K25111K32867K40445K46808K50059K49040
$$ 4343964 4543412 4751767 4968766 5193877 5426744 5667189 5913997 6164056 6413096
50772F413096K43707K34190K20532K03312J83462J61621J38627J16386R6930Q0679
$$ 6413096 6656803 6890993 7111525 7314837 7498299 7659920 7798547 7914933 8011863 8092542
50762H092542O6829N5345M7143M2337M0030M0096M3285M8867N3907N5972N4964
$$ 8092542 8159371 8214716 8261859 8304196 8344226 8384322 8427607 8476474 8530381 8586353 8641317
50751H641317N1063M2309K6078K231k6694n7988r0229j22615j54324j84639k12782
$$ 8641317 8692380 8734689 8760767 8762998 8736304 8678316 8588087 8465472 8311148 8126509 7913727
50740G913727k37688k58493k74906k86363k91452k89283k81019k69106k55156
$$ 7913727 7676039 7417546 7142640 6856277 6564825 6275542 5994523 5725417 5470261
50731E470261k39571k22726k05273j87440j69370j52072j36620j22339j07344
$$ 5470261 5230690 5007964 4802691 4615251 4445881 4293809 4157189 4034850 3927506
50722C927506r1401p6849o5899n8286n2377m7540m4064m1609l9239l6851l5278
$$ 3927506 3836105 3759256 3693357 3635071 3582694 3535154 3491090 3449481 3410242 3373391 3338113
50711C338113l4709l4083l2541l0886l0791l2735l5262l6551l6404l6171l6828
$$ 3338113 3303404 3269321 3236780 3205894 3175103 3142368 3107106 3070555 3034151 2997980 2961152
50700B961152l7825l8201l8125l8343l8518l7393l4772l2048l0239k8500k5374
$$ 2961152 2923327 2885126 2847001 2808658 2770140 2732747 2697975 2665927 2635688 2607188 2581814
50689B581814k0679j5295r845m604p3L565P159J1624J6484K0670K4603K9959L7143
$$ 2581814 2561135 2545840 2535995 2531391 2531318 2534883 2542042 2553666 2570150 2590820 2615423 2645382 2682525
50676B682525M4475N0571N6221O2975P0855P8613Q5576R2154R8774J05285J11279
$$ 2682525 2727000 2777571 2833792 2896767 2967622 3046235 3131811 3223965 3322739 3428024 3539303
50665C539303J16255J19722J21758J23260J24905J26119J25868J24129J21642
$$ 3539303 3655558 3775280 3897038 4020298 4145203 4271322 4397190 4521319 4642961
50656D642961J18354J13245J05779R6541Q6162P4547O1521M7395L2588J7599L869
$$ 4642961 4761315 4874560 4980339 5076880 5163042 5237589 5299110 5346505 5379093 5396692 5400561
50645E400561o224j1149j1465q798m139K144R226J5911K1624K6457L0058L1171
$$ 5400561 5394337 5383188 5371723 5362925 5358786 5360930 5370156 5386067 5407691 5434148 5464206 5495377
50633E495377K8431K1385J0506l579k0798m1383o4659q8201j08965j25434j37873
$$ 5495377 5523808 5545193 5555699 5552120 5531322 5489939 5425280 5337079 5228114 5102680 4964807
50622D964807j46411j50108j48665j43734j37221j29147j18728j06756r4925q3073
$$ 4964807 4818396 4668288 4519623 4375889 4238668 4109521 3990793 3884037 3789112 3706039
50612C706039o9381n3818l9258k8071j9190r899O84J1219K0275K7303L2003L4351
$$ 3706039 3636658 3582840 3543582 3515511 3496321 3486422 3487106 3498325 3518600 3545903 3577906 3612257
50600C612257L5211L5768L6167L5627L3848L1551K9549K8116K7429K7819K9207
$$ 3612257 3647468 3683236 3719403 3755030 3788878 3820429 3849978 3878094 3905523 3933342 3962549
50589C962549L0847L2028L2739L3506L4851L7008L9863M3044M6225M9492N3323
$$ 3962549 3993396 4025424 4058163 4091669 4126520 4163528 4203391 4246435 4292660 4342152 4395475
50578D395475N8154O3943P0133P5968Q0921Q4848Q7691Q9207Q9285Q8206Q6103
$$ 4395475 4453629 4517572 4587705 4663673 4744594 4829442 4917133 5006340 5095625 5183831 5269934
50567E269934Q2359P6368O8876O1756N6215N2082M8697M5031L8244K4138J001
$$ 5269934 5352293 5428661 5497537 5559293 5615508 5667590 5716287 5761318 5799562 5823700 5824701
50556E824701k7304n3542p2221q1910q3791p9955p2911o4736n6029m6630l7386
$$ 5824701 5797397 5743855 5671634 5589724 5505933 5425978 5353067 5288331 5232302 5185672 5148286
50545E148286k9893k4554k0487j7638j7376k0482k6104l3514m3332n5937o9893
$$ 5148286 5118393 5093839 5073352 5055714 5038338 5017856 4991752 4958238 4914906 4858969 4789076
50534D789076q3282r5645j07277j17276j23732j25713j24131j20684j16610j12111
$$ 4789076 4705794 4610149 4502872 4385596 4261864 4136151 4012020 3891336 3774726 3662615
50524C662615j06492r9215r1183q4202p8651p2722o4862n6106m8854m4019m0530
$$ 3662615 3556123 3456908 3365725 3281523 3202872 3130150 3065288 3009182 2960328 2916309 2875779
50513B875779l7080l3067k8399k3608j9817j7354j4783j0546n081K2M345Q479
$$ 2875779 2838699 2805632 2777233 2753625 2733808 2716454 2701671 2691125 2686044 2686066 2690411 2698890
50501B698890J2227J5021J7925K2752K8987L4018L7129M0651M6077N1573N5161
$$ 2698890 2711117 2726138 2744063 2766815 2795802 2829820 2866949 2907600 2953677 3005250 3060411
50490C060411N8071O2466O7455P0187P0066O9090O8410O7228O5406O4552O5590
$$ 3060411 3118482 3180948 3248403 3318590 3388656 3457746 3526156 3593384 3658790 3723342 3788932
50479C788932O7221O8040O8783P1235P5896Q1851Q8348R5533J03885J13589J24349
$$ 3788932 3856153 3924193 3992976 4064211 4140107 4221958 4310306 4405839 4509724 4623313 4747662
50468D747662J35473J46374J57014J67558J77828J87736J98012K09291K20324
$$ 4747662 4883135 5029509 5186523 5354081 5531909 5719645 5917657 6126948 6347272
50459F347272K28328K31719K31442K29034K24493K16942K06253J92619J75318
$$ 6347272 6575600 6807319 7038761 7267795 7492288 7709230 7915483 8108102 8283420
50450H283420J53339J27041R7878O6655L3478o29l3403o3256r0423j15590j38106
$$ 8283420 8436759 8563800 8661678 8728333 8761811 8761182 8727779 8664523 8574100 8458510 8320404
50439H320404j56196j68385j74116j73459j66784j54690j37909j17408r4463p0473
$$ 8320404 8164208 7995823 7821707 7648248 7481464 7326774 7188865 7071457 6976994 6906521
50429F906521m6594k3980m224J1134K1424K6310K4392J3700n737l0946n8691q8105
$$ 6906521 6859927 6835947 6831723 6842857 6864281 6890591 6914983 6928683 6922946 6892000 6833309 6745204
50417F745204j19249j49888j75699j94036k05923k13780k18501k19498k16434
$$ 6745204 6625955 6476067 6300368 6106332 5900409 5686629 5468128 5248630 5032196
50408E032196k09858k00759j90400j79996j69681j58293j45107j31265j18480
$$ 5032196 4822338 4621579 4431179 4251183 4081502 3923209 3778102 3646837 3528357
50399C528357j06767r4923q3132p3359o6512o0601n2928m3450l4739k8809k4901
$$ 3528357 3421590 3326667 3243535 3170176 3103664 3043063 2990135 2946685 2911946 2883137 2858236
50388B858236k0585j4362o957l53M205P256J0134J3091J4992J5059J4195J3957
$$ 2858236 2837651 2823289 2816332 2815979 2820184 2827440 2837574 2850665 2865657 2880716 2894911 2908868
50376B908868J4643J5245J5004J4009J2372R976P394O022O525P904Q888R731J1726
$$ 2908868 2923511 2938756 2953760 2967769 2980141 2990117 2997511 3003533 3010058 3017962 3026850 3036581 3048307
50363C048307J5131J8671K1176K2914K4969K7885L1497L5621M0472M6309N3049
$$ 3048307 3063438 3082109 3103285 3126199 3151168 3179053 3210550 3246171 3286643 3332952 3386001
50352C386001O0174O6904P2617P7370Q2064Q7713R4400J01032J06274J09720J11904
$$ 3386001 3446175 3513079 3585696 3663066 3745130 3832843 3927243 4028275 4134549 4244269 4356173
50341D356173J13255J13407J11639J07609J01260R2435Q1358O9320N7830M6671
$$ 4356173 4469428 4582835 4694474 4802083 4903343 4995778 5077136 5146456 5204286 5250957
50331E250957L3703J7262j931k1990m2085o2160q0941r6031j06373j13175j17674
$$ 5250957 5284660 5301922 5299991 5278001 5235916 5173756 5092815 4996784 4890411 4777236 4659562
50320D659562j19241j16578j09722r9749q7322p2915n7963m4248l2083k0476r254
$$ 4659562 4540321 4423743 4314021 4214272 4126950 4054035 3996072 3951824 3919741 3899265 3890011
50309C890011J82O481R569R567N672k991j5839l0898m6040n9668p0918p9961q7760
$$ 3890011 3890193 3896674 3906243 3915810 3921482 3918491 3902652 3871754 3825714 3766046 3695128 3615167 3527407
50296C527407r4686r9731j01747j01170r9535r7471r4228q9338q3686p8514p4037
$$ 3527407 3432721 3332990 3231243 3130073 3030538 2933067 2838839 2749501 2665815 2587301 2513264
50285B513264o9690o5067o0111n4695m8699m2436l6525l1337k6792k2546j8138
$$ 2513264 2443574 2378507 2318396 2263701 2215002 2172566 2136041 2104704 2077912 2055366 2037228
50274B037228j3211p907k857J581N842J0455J4965J8254K0150K1991K5072K8919
$$ 2037228 2024017 2016110 2013253 2014834 2020676 2031131 2046096 2064350 2084500 2106491 2131563 2160482
50262B160482L1618L1817K9701K5965K0594J3342N090k101o586q315q253p246
$$ 2160482 2192100 2223917 2253618 2279583 2300177 2313519 2318609 2316508 2309922 2301607 2293354 2286108
50250B286108n939n282n953p279p550n985l708k332k058j921j392q31m97lJ028
$$ 2286108 2280169 2274887 2268934 2261655 2254105 2248120 2244412 2242080 2240022 2238101 2236709 2235878 2235381 2235378 2236406
50235B236406K599M757P580J0384J2005J2486J3658J7024K1604K5069K6637K7435
$$ 2236406 2239005 2243762 2251342 2261726 2273731 2286217 2299875 2316899 2338503 2363572 2390209 2417644
50223B417644K8132K8044K7381K8634L3826M0671M3165L6668K1901L964j1695
$$ 2417644 2445776 2473820 2501201 2529835 2563661 2604332 2647497 2684165 2706066 2710030 2698335
50212B698335k2184k7377k8588k7313k4634k1323j8130j5681j4091j2965j1913
$$ 2698335 2676151 2648774 2620186 2592873 2568239 2546916 2528786 2513105 2499014 2486049 2474136
50201B474136j0940j0269r959r793r472q867q199p861p898p708o555m421k041
$$ 2474136 2463196 2452927 2442968 2433175 2423703 2414836 2406637 2398776 2390878 2383170 2376615 2372194 2370153
50188B370153j67J065K059L432N614Q417J1026J2866J4448J6766J9870K2773K4997
$$ 2370153 2369986 2371051 2373110 2376542 2382156 2390573 2401599 2414465 2428913 2445679 2465549 2488322 2513319
50175B513319K7319L0456L3725L5767L6206L5814L5297L4622L3318L0818K6727
$$ 2513319 2540638 2571094 2604819 2640586 2676792 2712606 2747903 2782525 2815843 2846661 2873388
50164B873388K1500J6707J3768J2348J0676P528L219j458o493j2482j9857k8577
$$ 2873388 2894888 2911595 2925363 2937711 2948387 2955915 2959134 2957676 2951183 2938701 2918844 2890267
50152B890267l7973m6484n2190n4281n3840n2651n1333m9030m4804l8893l2688
$$ 2890267 2852294 2805810 2753620 2699339 2645499 2592848 2541515 2492485 2447681 2408788 2376100
50141B376100k7759k4978k4355k5503k8098l1787l5778l8897m0238l9672l7723
$$ 2376100 2348341 2323363 2299008 2273505 2245407 2213620 2177842 2138945 2098707 2059035 2021312
50130B021312l5197l2887l1260l0126k8802k6844k4598k2944k2514k3019k3194
$$ 2021312 1986115 1953228 1921968 1891842 1863040 1836196 1811598 1788654 1766140 1743121 1719927
50119A719927k1712j8604j5602j4512j5246j6068j5786j4904j4334j3951j3140
$$ 1719927 1698215 1679611 1664009 1649497 1634251 1618183 1602397 1587493 1573159 1559208 1546068
$$ [...]
##END NTUPLES=NMR SPECTRUM
##END=
