
##TITLE=UV1138_M5-1005-1002_6275562_rSnh2jbMtO
##JCAMPDX= 6.0         $$ Bruker NMR JCAMP-DX V2.0
##DATA TYPE= NMR SPECTRUM
##DATA CLASS= NTUPLES
##ORIGIN= BRUKER
##OWNER= Administrator
$$ 1.72 TOPSPIN		Version 2.1
$$ 2012-06-07 04:47:36.765 -0500  Administrator@TOPSPIN
$$ Compression mode = diff/dup
##.OBSERVE FREQUENCY= 400.13188235
##.OBSERVE NUCLEUS= ^1H
##.ACQUISITION MODE= SIMULTANEOUS (DQD)
##.ACQUISITION SCHEME= undefined
##.AVERAGES= 8
##.DIGITISER RES= 22
##SPECTROMETER/DATA SYSTEM= spect
##.PULSE SEQUENCE= zg30
##.SOLVENT NAME= COFFEE_meoh
##.SHIFT REFERENCE= INTERNAL, COFFEE_meoh, 1, 14.98061
##AUDIT TRAIL= $$ (NUMBER, WHEN, WHO, WHERE, PROCESS, VERSION, WHAT)
$$ ##TITLE= Audit trail, TOPSPIN		Version 2.1
$$ ##JCAMPDX= 5.01
$$ ##ORIGIN= Bruker BioSpin GmbH
$$ ##OWNER= Administrator
$$ $$ C:\Bruker\TOPSPIN/data/COFFEE/nmr/UV1138_M5-1005-1002_6275562_rSnh2jbMtO/20/pdata/1/auditp.txt
$$ ##AUDIT TRAIL=  $$ (NUMBER, WHEN, WHO, WHERE, PROCESS, VERSION, WHAT)
(   1,<2012-06-07 04:47:28.625 -0500>,<Administrator>,<TOPSPIN>,<go>,<TOPSPIN 2.1>,
      <created by zg
	started at 2012-06-07 04:46:22.062 -0500,
	POWCHK enabled, PULCHK disabled,
       configuration hash MD5:
       D5 CA 7A 23 FE 6B EE E2 50 67 74 61 24 F7 5E 3B
       data hash MD5: 64K
       05 8A 46 4F F8 10 10 69 2D 76 FB BB DF 5B 6A FF>)
(   2,<2012-06-07 04:47:32.656 -0500>,<Administrator>,<TOPSPIN>,<proc1d>,<TOPSPIN 2.1>,
      <Start of raw data processing
       efp LB = 0 FT_mod = 6 PKNL = 1 PHC0 = 0 PHC1 = 0 SI = 32K 
       data hash MD5: 32K
       F3 E0 FB 69 04 07 20 C5 0B 18 25 9E 0A 8B B0 26>)
(   3,<2012-06-07 04:47:32.968 -0500>,<Administrator>,<TOPSPIN>,<proc1d>,<TOPSPIN 2.1>,
      <pk PHC0 = 209.8334 PHC1 = 0 
       data hash MD5: 32K
       AB 26 95 68 F6 A4 12 D9 D4 0D A7 97 29 E5 15 C4>)
(   4,<2012-06-07 04:47:33.062 -0500>,<Administrator>,<TOPSPIN>,<proc1d>,<TOPSPIN 2.1>,
      <abs ABSG = 1 
       data hash MD5: 32K
       FB FB AE 33 38 AC CC 1F 8D F8 5A A8 B2 F9 8A 05>)
(   5,<2012-06-07 04:47:33.093 -0500>,<Administrator>,<TOPSPIN>,<proc1d>,<TOPSPIN 2.1>,
      <abs ABSG = 2 
       data hash MD5: 32K
       31 45 0A 27 54 22 FE 0B 78 5F 67 9A 96 25 50 45>)
(   6,<2012-06-07 04:47:33.125 -0500>,<Administrator>,<TOPSPIN>,<proc1d>,<TOPSPIN 2.1>,
      <abs ABSG = 3 
       data hash MD5: 32K
       4D 95 07 F9 22 85 E2 2C 80 A7 62 4C 10 4B B0 C1>)
(   7,<2012-06-07 04:47:33.156 -0500>,<Administrator>,<TOPSPIN>,<proc1d>,<TOPSPIN 2.1>,
      <abs ABSG = 4 
       data hash MD5: 32K
       E6 DE 5B 46 70 91 D6 7E 53 46 C3 A1 80 F6 A1 01>)
(   8,<2012-06-07 04:47:33.187 -0500>,<Administrator>,<TOPSPIN>,<proc1d>,<TOPSPIN 2.1>,
      <abs ABSG = 5 
       data hash MD5: 32K
       0F B8 EE CA E2 A2 50 ED A4 8B 44 55 3A D7 AA 90>)
$$ ##END=
$$ 
$$ $$ hash MD5
$$ $$ 8F 45 64 1D 95 54 DD 5E 5D 24 CA 3D F9 1D C4 B0
##$RELAX= 
##$RELAX= 
##$RELAX= 
##$RELAX= 
##$RELAX= 
##$RELAX= 
##$RELAX= 
$$ Bruker specific parameters
$$ --------------------------
$$ [...]
##$TP= (0..7)
150 150 150 150 150 150 150 150
##$TP07= 0
##$TPNAME0= <>
##$TPNAME1= <>
##$TPNAME2= <>
##$TPNAME3= <>
##$TPNAME4= <>
##$TPNAME5= <>
##$TPNAME6= <>
##$TPNAME7= <>
##$TPOAL= (0..7)
0.5 0.5 0.5 0.5 0.5 0.5 0.5 0.5
##$TPOFFS= (0..7)
0 0 0 0 0 0 0 0
##$TUNHIN= 0
##$TUNHOUT= 0
##$TUNXOUT= 0
##$USERA1= <user>
##$USERA2= <user>
##$USERA3= <user>
##$USERA4= <user>
##$USERA5= <user>
##$V9= 5
##$VALIST= <valist>
##$VCLIST= <CCCCCCCCCCCCCCC>
##$VD= 0
##$VDLIST= <DDDDDDDDDDDDDDD>
##$VPLIST= <PPPPPPPPPPPPPPP>
##$VTLIST= <TTTTTTTTTTTTTTT>
##$WBST= 2048
##$WBSW= 25
##$XGAIN= (0..3)
0 0 0 0
##$XL= 0
##$YL= 0
##$YMAX_a= 503046
##$YMIN_a= -608453
##$ZGOPTNS= <>
##$ZL1= 120
##$ZL2= 120
##$ZL3= 120
##$ZL4= 120
##$ABSF1= 14.98061
##$ABSF2= -5.57192
##$ABSG= 5
##$ABSL= 3
##$ALPHA= 0
##$AQORDER= 0
##$ASSFAC= 0
##$ASSFACI= 0
##$ASSFACX= 0
##$ASSWID= 0
##$AUNMP= <proc_prof1d_extract_pilot.lims>
##$AXLEFT= 0
##$AXNAME= <>
##$AXNUC= <1H>
##$AXRIGHT= 0
##$AXTYPE= 0
##$AXUNIT= <>
##$AZFE= 0.1
##$AZFW= 0.1
##$BCFW= 0
##$BC_mod= 0
##$BYTORDP= 0
##$COROFFS= 0
##$CY= 15
##$DATMOD= 1
##$DC= 0
##$DFILT= <>
##$DTYPP= 0
##$F1P= 0
##$F2P= 0
##$FCOR= 0.5
##$FTSIZE= 32768
##$FT_mod= 6
##$GAMMA= 0
##$GB= 0
##$INTBC= 1
##$INTSCL= 1
##$ISEN= 128
##$LB= 0
##$LEV0= 0
##$LPBIN= 0
##$MAXI= 10000
##$MC2= 0
##$MEAN= 0
##$ME_mod= 0
##$MI= 0
##$NCOEF= 0
##$NC_proc= -8
##$NLEV= 6
##$NOISF1= 0
##$NOISF2= 0
##$NSP= 0
##$NTH_PI= 0
##$NZP= 0
##$OFFSET= 14.98061
##$PC= 1
##$PHC0= 209.8334
##$PHC1= 0
##$PH_mod= 1
##$PKNL= yes
##$PPARMOD= 0
##$PPDIAG= 0
##$PPIPTYP= 0
##$PPMPNUM= 2147483647
##$PPRESOL= 1
##$PSCAL= 4
##$PSIGN= 0
##$PYNMP= <proc.py>
##$REVERSE= no
##$SF= 400.13
##$SI= 32768
##$SIGF1= 0
##$SIGF2= 0
##$SINO= 400
##$SIOLD= 32768
##$SPECTYP= <>
##$SREGLST= <1H.CDCl3>
##$SSB= 0
##$STSI= 32768
##$STSR= 0
##$SW_p= 8223.68421052632
##$SYMM= 0
##$S_DEV= 0
##$TDeff= 65536
##$TDoff= 0
##$TI= <>
##$TILT= no
##$TM1= 0
##$TM2= 0
##$TOPLEV= 0
##$USERP1= <user>
##$USERP2= <user>
##$USERP3= <user>
##$USERP4= <user>
##$USERP5= <user>
##$WDW= 1
##$XDIM= 32768
##$YMAX_p= 460388844
##$YMIN_p= -688134
##$CURPLOT= <Network HP LaserJet P1505>
##$CURPRIN= <$Network HP LaserJet P1505>
##$DFORMAT= <normdp>
##$LAYOUT= <+/1D_H.xwp>
##$LFORMAT= <normlp>
##$PFORMAT= <normpl>
##$SURQMSG= 1
$$ End of Bruker specific parameters
$$ ---------------------------------
##NTUPLES= NMR SPECTRUM
##VAR_NAME=  FREQUENCY,     SPECTRUM/REAL,   SPECTRUM/IMAG
##SYMBOL=    X,             R,               I
##VAR_TYPE=  INDEPENDENT,   DEPENDENT,       DEPENDENT
##VAR_FORM=  AFFN,          ASDF,            ASDF
##VAR_DIM=   32768,         32768,           32768
##UNITS=     HZ,            ARBITRARY UNITS, ARBITRARY UNITS
##FACTOR=    0.250966925370066, 1,           1
##FIRST=     8223.43324360095, 74246,        -89992
##LAST=      0,             -1483,           -9031
##MIN=       0,             -688134,         0
##MAX=       8223.43324360095, 460388844,    0
$$ Real data points
##PAGE= N=1
##DATA TABLE= (X++(R..R)), XYDATA
$$ [...]
19561c19094F3063b96585J43337d9145j63414C54066a03301B9431n248K2393h5001
19549c59168J56037A92079a06340K603n5648L8456e7156j59581b2973F4068d5605
19537H6531f6365j12832j22555g2403o3898r1974c7012k63390B50243b18577F4937
19525b05015B6151a06869p3889C4073J40064b3238A7019a44926N2852j14611e9257
19513C0627g4020I5639N2180d22093B59919c9645j00260I6659a2233j64604h0257
19501B6716c8087p4039k09437J23647A87410n0199c09260a25589m0258N1438c4988
19489e14826d0588A76345n0967c8562j79946A07464a66609K0426O4380j35895
19479b17698O8886k32029a40292A78815c16494A31426m4665P1107B206K7162b4692
$$ y = [-319094, 63063, -296585, -153248, -49145, -212559, 354066, -103301, 29431, 24183, 46576, -85001, -359168, -203131, 192079, -106340, -103737, -159385, -120929, -57156, -216737, -22973, 64068, -45605, 86531, -66365, -179197, -301752, -72403, -136301, -228275, -37012, -300402, 250243, -218577, 64937, -205015, 26151, -106869, -180758, 34073, 174137, -23238, 17019, -144926, -92074, -206685, -59257, 30627, -74020, 95639, 147819, -422093, 259919, -39645, -139905, 96659, -12233, -176837, -80257, 26716, -38087, -112126, -321563, -197916, 187410, 137211, -309260, -125589, -165847, -114409, -34988, -514826, -40588, 176345, 125378, -38562, -218508, 107464, -166609, -146183, -81803, -217698, -148812, -380841, -140292, 178815, -316494, 131426, 86761, 157868, 2206, 29368, -24692]
19467A08172a41486J532J3152L8030G5666b6059n826A09802a1792j00945A84898
19455a97931c611j80178j85207D2320a3262A88739c47454b2444l53671i4682c8229
19443C0843d3917p7003r8330B438a16036A2207f9225J2006k8852k00941J08265
19432a78747B55857c5113A57893a72373N9182A11536C2082L21J35993F3129C0508
19420a22644N6008a7967j29523q1891j36178D4540R4087b51994B16630b60460
19409C5648b2279A96072b38600Q3534j28745A05436a18423j70893a25424B07196
19398C0928c32090h9792j54785b5993A30487J42399D3308a76833a4298H351a2284
19386a14808e4202E9280R9772a44501e0142D19731a83078g5748K8475l21086E0402
$$ y = [108172, -141486, -139954, -126802, -88772, 75666, -26059, -31885, 109802, -11792, -112737, 184898, -197931, -3611, -183789, -368996, 42320, -13262, 188739, -347454, -22444, -376115, -94682, -38229, 30843, -43917, -120920, -219250, 2438, -116036, 12207, -69225, -57219, -86071, -287012, -178747, 255857, -35113, 157893, -172373, -113191, 111536, 32082, 32403, 168396, 63129, 30508, -122644, -66636, -17967, -147490, -229381, -365559, 44540, 138627, -251994, 216630, -260460, 35648, -22279, 196072, -238600, -155066, -283811, 105436, -118423, -289316, -125424, 207196, 30928, -332090, -89792, -244577, -25993, 130487, 272886, 43308, -176833, -14298, 8351, -12284, -114808, -54202, 59280, 159052, -144501, -50142, 419731, -183078, -75748, -47273, -368359, 50402]
19374A07085a81588a3536A04627J65535c322p2113l0C27J86267i1558k558A25806
19361i1917B41460g200B05973D88K2029G729J13877g6314n2886h719A36275a49965
19348b70312B0936a29579G7641L8470a28877D9486L6854J14620R0233E2170B5631
19336a75548A83913b09716i5913b9026j21745q1124d7673I0467A1414J05527B6887
19324c35650i4439k26149a3089j4138o4597k7317E5224p007a38623B9106a99061
19312c72709B1533J44904o112a63006B08103a46263b8545G8847b7703D45103a51637
19300I0255a3565m0401p7654A1800M4025c90665B38095q3407c9733d48m15940
19289d16388a13213Fc58174J02802n961A36301e2289j49089e1816j59265I2565
$$ y = [107085, -181588, -13536, 104627, 270162, -3322, -75435, -75465, 327, 186594, -91558, -94116, 125806, -91917, 241460, -7200, 205973, 488, 22517, 7729, 121606, -76314, -129200, -8719, 136275, -149965, -270312, 20936, -129579, 77641, 116111, -128877, 49486, 86340, 200960, 291193, 52170, 25631, -175548, 183913, -209716, -95913, -29026, -150771, -231895, -47673, 90467, 11414, 116941, 26887, -335650, -94439, -320588, -13089, -27227, -91824, -119141, 55224, 48217, -138623, 29106, -199061, -372709, 21533, 166437, 160325, -163006, 208103, -146263, -28545, 78847, -27703, 445103, -151637, 90255, -13565, -53966, -131620, 11800, 55825, -390665, 238095, 154688, -39733, -448, -416388, -113213, 6, -358174, -255372, -261333, 136301, -52289, -201378, -51816, -211081, 92565]
19277b3154j54282g8527B07884l322d55512C3741d0149f823j6804A1241c9274
19265e9911k07713b0582A60996o1949a02538j8222B18142f9195C3115b29647L9238
19254a90409R0905F9226b0963B3969a04926L6116K2603k97442J38087B74058A815
19242b5664e763k90448g220C11771b99662c2197A22313a23958a521j44425d8021
19230a95922i6933j1912k57153A27698f4129J2973E3952a03529k9861p7303j28103
19219c38796i1751b2317k34645K4026i0538M028k68817g570A64064K4496a56438
19207G8237M1507a74313c7196l00008d1568A88916p8007D8077M41822A47900o8943
19196G8957l1054a65517j54873a04128c1985j3791A93515a03029k37755A07567
$$ y = [-23154, -177436, -78527, 207884, 204562, -455512, 33741, -40149, -6823, -23627, 11241, -39274, -59911, -267624, -20582, 160996, 99047, -102538, -120760, 218142, -69195, 33115, -229647, -190409, -99504, 69226, -20963, 23969, -104926, -68810, -46207, -343649, -205562, 274058, 1815, -25664, -5763, -296211, -7220, 311771, -299662, -32197, 122313, -123958, -1521, -145946, -48021, -195922, -96933, -108845, -365998, 127698, -64129, -51156, 53952, -103529, -133390, -210693, -338796, -91751, -22317, -256962, -232936, -90538, -86510, -355327, -7570, 164064, 188560, -156438, 78237, 119744, -174313, -37196, -337204, -41568, 188916, 110909, 48077, 489899, 147900, 78957, 47903, -165517, -320390, -104128, -31985, -45776, 193515, -103029, -340784, 107567]
19185A67987b25312f2802o3382H0494P9664b51154B0937E98J45589b63521b9651
19173B72390A8043N1334K8230B1344a06943R028j01827B01392b5134E7146a15904
19161a65590N9088k24883B15207a04723j79863E0296b70475F0236L9438J22750
19151B22424b47304Q9790M280B4475a41429G6452K14631a26634k83753J44936
19141b65451Q9756B31779a96817n1137b4816n2217l3225M1358k03574B3740b02800
19129A83259K6473a25055k10122c893B76519G7189K28402b08202A50438L3270
19119A83708e8218k1021m5278j30976B63774b7717j14405C07508r8469a90321
19108b11230B18365G4048R6778b16074e0666F2467J0044J71345a95830A7006b139
$$ y = [167987, -225312, -62802, -126184, 80494, 160158, -251154, 20937, 598, 146187, -263521, -29651, 272390, 18043, 69377, 97607, 21344, -106943, -97915, -199742, 201392, -25134, 57146, -115904, -165590, -106502, -331385, 215207, -104723, -284586, 50296, -270475, 60236, 99674, 222424, -247304, -157514, -153234, 24475, -141429, 76452, 291083, -126634, -410387, -265451, -175695, 231779, -196817, -247954, -24816, -77033, -110258, -68900, -272474, 23740, -202800, 183259, 209732, -125055, -335177, -3893, 276519, 77189, 305591, -208202, 150438, 183708, -58218, -79239, -124517, -255493, 263774, -27717, -142122, 307508, 209039, -190321, -211230, 218365, 74048, 170826, -216074, -50666, 62467, 72511, 243856, -195830, 17006, -2139]
19096D6305b93775D7846J2783a50380G3422d71649g671A21852a63771A32534c3170
19084B0304J26852b703A15798b22478R9414N9222A57959d50221I1109i5986A51023
19072b74065o7632e8326C8153b35158D5375h3457A48696C4454f2836j55748j87485
19061d06069C73762i966A94732D7909H669a45588m0512A33338b6503k08196A08434
19049A30201P2517C7193b3545I5593e4168H9862f111k03246F4713a45058C5790
19037B04299a09468o2073N0050G2379i0583C98101b08814E38910a96842H3022
19026C23853A0638J8715b55947B7529L70247n046A09809c1885l43553C13091A00422
19014A77585E3503f3707I3688a49618D3769i7964I6286B7195e0130j62255A89333
$$ y = [46305, -293775, 47846, 60629, -150380, 73422, -471649, -7671, 121852, -163771, 132534, -33170, 20304, 147156, -2703, 115798, -222478, -123064, -63842, 157959, -450221, 91109, -95986, 151023, -274065, -341697, -58326, 38153, -235158, 45375, -83457, 148696, 34454, -62836, -218584, -406069, 373762, -9966, 194732, 47909, 8669, -145588, -186100, 133338, -26503, -234699, 108434, 130201, 202718, 37193, -23545, 95593, -54168, 89862, -6111, -209357, 64713, -145058, 35790, 204299, -109468, -171541, -121491, 72379, -90583, 398101, -208814, 538910, -196842, 83022, 323853, 10638, 29353, -255947, 27529, 397776, 392730, 109809, -31885, -375438, 313091, 100422, 177585, 53503, -63707, 93688, -149618, 43769, -97964, 96286, 27195, -50130, -212385, 189333]
19002b49670B15824b7787A53659A922d55945K18466l486a03852L2381p6486o2621
18991b10578k4426Q3336I9389g9636A01968g7879j27918j21757E7209b62054A03822
18979B8163J63497a82473g0996A17125a12171j30873a20858H128c02088F2864
18968A08173K03512A08488E2066a83687A23810m2689b81141Q6449G6405i0828
18957f7169k29686E279a08164j37855a03941B4445c8679J5693i096D9984B3973
18945a94694j37988g8339F6838P3110b18070j16100J32962P8472A02617E705c18258
18933g7093j05472K6159A37924n4881O2935l4334g559A98861m5807b05698Q5764
18922a19934C3736J14241F8691j8125c56470c0997K458k45663m9043A39168Q4604
$$ y = [-249670, 215824, -27787, 153659, 1922, -455945, -237479, -240965, -103852, -71471, -147957, -210578, -235004, -151668, 99389, -79636, 101968, -77879, -205797, -327554, 57209, -262054, 103822, 28163, 191660, -182473, -70996, 117125, -112171, -243044, -120858, 8128, -302088, 62864, 108173, 311685, 108488, 52066, -183687, 123810, 81121, -281141, -194692, 76405, -90828, -67169, -296855, 5279, -108164, -246019, -103941, 24445, -38679, -22986, -9096, 49984, 23973, -194694, -332682, -78339, 66838, 139948, -218070, -334170, -201208, -122736, 102617, 5705, -318258, -77093, -182565, -156406, 137924, 83043, 145978, 111644, -7559, 198861, 153054, -205698, -119934, 33736, 147977, 68691, 50566, -356470, -30997, -28539, -274202, -323245, 139168, 223772]
18911B23772m6992a00357B72925j11366n0066c03253a28713m4874f0187q9279
18901a49466a2145j0475g490j60782O8493m2277B2250b69242d7633j13184A19056
18889i6873k09417a19176H5389d75827a645B8168J76821g8535A04144E0182K18451
18878B68633a36685B41773a13266q4177A13486D0958b44714G87b13866A70803
18867A24962E9924a94183P3497B0905K94019A05209a60515I0994e0473A19265
18856c2952p1538A56077c33373H4262a75938o6709G611N4419R5679i3936k87768
18845c81704B46066e3157d773A14716b07689A02679l4391K96660c45029o9593
18835d14622B07328a75868l18916b05361j30880I5878a33612k70522G8729a22990
$$ y = [223772, 176780, -100357, 272925, 161559, 111493, -303253, -128713, -173587, -60187, -149466, -12145, -22620, -7490, -168272, -99779, -142056, 22250, -269242, -47633, -160817, 119056, -96873, -306290, -119176, 85389, -475827, -1645, 28168, 204989, -78535, 104144, 50182, 268633, -136685, 241773, -113266, -197443, 113486, 40958, -244714, 787, -213866, 170803, 124962, 59924, -194183, -120686, 20905, 314924, 105209, -160515, 90994, -50473, 119265, -32952, -104490, 156077, -333373, 84262, -175938, -242647, 7611, 62030, 157709, -93936, -381704, 246066, -53157, -4773, 114716, -207689, 102679, 68288, 364948, -345029, -414622, 207328, -175868, -494784, -205361, -336241, 95878, -133612, -404134, 78729, -122990]
18824A4812a51821f360n0220B8467L7773h8732j79399j23604I3111o225j5463
18813G1423C3981a35656B1891i21A47469K22191c3676l1620G0954L4985b30236
18801B04791F7610a03361J1646B17970G9767M4016M498K60225F0750a8222m6974
18790f5196p9708j55428i3030b3871G2396d1263a7242F4737L54421a49196j79720
18779c28916b1728q4689q9598q9035A52408h4400E938J18042c57136a76345Q2049
18768i4296j24220A80867B5132N8584L1781h142m4322j45202a5691B13725J05672
18757C19397b41350N9059P4263P468F7464a41179e7189B90895a27215J3602d5296
18745g1448B07877a89332k41411A11952c70259A2922b77426F1335a28249q2211
$$ y = [14812, -151821, -6360, -56580, 28467, 66240, -88732, -268131, -391735, 93111, 86886, 71423, 33981, -135656, 21891, -921, 147469, 369660, -33676, -65296, 70954, 105939, -230236, 204791, 67610, -103361, -91715, 217970, 79767, 123783, 128281, 388506, 60750, -18222, -65196, -144904, -300332, -93030, -23871, 72396, -41263, -17242, 64737, 419158, -149196, -328916, -21728, -106417, -196015, -285050, 152408, -84400, 5938, 123980, -357136, -176345, -94296, -218516, 180867, 25132, 83716, 115497, -8142, -52464, -197666, -15691, 213725, 319397, -241350, -182291, -108028, -100560, 67464, -141179, -57189, 290895, -127215, -113613, -45296, -71448, 207877, -189332, -430743, 111952, -370259, 12922, -277426, 61335, -128249, -210460]
18735b10460g0579j4179k274A3043L49649b409n4563n0403C44162h747j12496
18724a21243C5523a42215D5869J72694b34749P7234f5454q8361G404g8936c4898
18712b55408B68322b47092a03130K8181k19263d2601B34298A09052d81607B28284
18701a62379B3023L1390f621I8861b75154C18850G7961a77011A91726a06113C85938
18689c50482J47074G811c08858A15464J6581r237c63143J60584K2815A16623b25905
18677B01490J03397E3164a98723c7551E6221d0399j11270C52750h2841k28031
18667c10872b1402o1610A85370M0343b78433c7351A45888f2333n0262c1185B4701
18655h0634p2715o0604I1468a25685A48916K40604A58218b3964n2203C04526i9445
$$ y = [-210460, -70579, -84758, -87032, 13043, 362692, -2409, -56972, -107375, 344162, -8747, -121243, 35523, -142215, 45869, 218563, -234749, -157515, -65454, -153815, 7404, -78936, -34898, -255408, 268322, -247092, -103130, -74949, -294212, -42601, 234298, 109052, -481607, 228284, -162379, 23023, 54413, -6621, 98861, -275154, 318850, 77961, -177011, 191726, -106113, 385938, -350482, -203408, 7811, -308858, 115464, 132045, 122808, -363143, -202559, -179744, 116623, -225905, 201490, 304887, 53164, -198723, -37551, 56221, -40399, -151669, 352750, -82841, -310872, -21402, -83012, 185370, 225713, -278433, -37351, 145888, -62333, -112595, -31185, 24701, -80634, -153349, -213953, 91468, -125685, 148916, 389520, 158218, -23964, -76167, 304526, -99445]
18643b79646H0316e9678l2249L2128B64880K007a809k07252B51348f1415j06503
18632a67918G437J37110b89933c0406p8088J6505J9586j47428A89801n7897g3263
18620a94917f4640k93150A65321D990a56341n7773A07180R4228b02831g5130j23044
18609a98174P5150q9846k58613A26950F2911K19313a04118L2737p9801A61160
18598B4811j731L0788K34776b66354D2508c0944a5009A26640h8124B31177f2388
18586d2994D167a52086O6483k0064p6288Q7687m5255N8832a7849j99526G3610
18574a094k7564j69521A57058O8738a36224H1860b47311H3844a88338C84874F8156
18562A4200h5858r9786B41302a34959F8785N6473B8237b41286e585B2224h8138
$$ y = [-279646, 80316, -59678, -91927, -59799, 264880, 266887, -1809, -209061, 251348, -61415, -167918, 7437, 144547, -289933, -30406, -108494, -91989, -72403, -219831, 189801, 131904, -73263, -194917, -64640, -357790, 165321, 4990, -156341, -214114, 107180, 201408, -202831, -75130, -198174, -123024, -212870, -471483, 126950, 62911, 282224, -104118, -71381, -151182, 161160, 24811, 23080, 53868, 288644, -266354, 42508, -30944, -15009, 126640, -88124, 231177, -62388, -42994, 4167, -152086, -85603, -105667, -181955, -94268, -139523, -80691, -17849, -217375, 73610, -1094, -28658, -198179, 157058, 225796, -136224, 81860, -247311, 83844, -188338, 384874, 68156, 14200, -85858, -185644, 241302, -134959, 68785, 125258, 28237, -241286, -5585, 22224, -88138]
18550B37889a74609m8545b4546n71A94581e6085k80534I4176K7851D0550c12152
18538d81715b09873l700L5586o9359l2149a02662m4071j39686g4594j35026A10236
18526c8231I9755a46359F8409N5866m3423J61625a03747L2004A2918i326A54260
18514c7118E22109G4541O4055g7383A88679a71707N7822E6516a28791p584O100
18503a30275A28239a85490c3070i43A66413D1192a50555q3639d2991l18040J43093
18492b17938Q296m3992J24676I6498a87473j90135E4218J4848e5872I8042O90
18481I8732b35973j4994A42806b5843j48210A71049K4219a46929j06135g5069
18470e0827B03085Q5621q4744b33994F9164a7535m0454a8887E5163c30710A63973
$$ y = [237889, -174609, -223154, -24546, -25117, 194581, -56085, -336619, 94176, 122027, 40550, -312152, -481715, -209873, -213573, -177987, -247346, -279495, -102662, -146733, -286419, -74594, -209620, 110236, -38231, 99755, -146359, 68409, 124275, 80852, 242477, -103747, -71743, 12918, -9326, 154260, -37118, 522109, 74541, 138596, -77383, 188679, -171707, -113885, 56516, -128791, -136375, -130275, 128239, -185490, -33070, -943, 166413, 41192, -150555, -234194, -42991, -361031, -217938, -209642, -253634, -128958, 96498, -187473, -377608, 54218, 69066, -55872, 98042, 98732, -235973, -250967, 142806, -25843, -174053, 171049, 195268, -146929, -253064, -75069, -50827, 203085, 288706, 203962, -233994, 69164, -17535, -57989, -18887, 55163, -330710, 163973]
18458C4539J05451d2179j07561c9451A01569g9308L638k9139B7914M9712B102
18446A55296L2587q5879C4706A2473J03382c12089J0608l31066a0377m6149B63623
18434A53404D1301b75654b8862B1521J03458a34457n3705H2175J06293a0826C6311
18422B03240c06881h1211o8471L7189A18035g3199A8667d5634j73001A39115b19813
18410a33737J6361m2362c1906l06068R2847e5165j27636B3841K36930a91818A43352
18398i5848l5390M8391p3813g5900D0509j7178J45569a60869G3934L8480P4415
18387A86829B290J04713l4784d9425C2422N2008e4979n9665q8625P2673B50712
18375b05721c6497l9923a7291A38413d28062a7174l78874b0795A17791J0972l8435
$$ y = [34539, 139990, -42179, -149740, -39451, 101569, -79308, -75670, -104809, 27914, 77626, 2102, 155296, 187883, 102004, 34706, 12473, 115855, -312089, -301481, -632547, -10377, -56526, 263623, 153404, 41301, -275654, -28862, 21521, 124979, -134457, -188162, 82175, 188468, -10826, 36311, 203240, -306881, -81211, -149682, -112493, 118035, -73199, 18667, -45634, -218635, 139115, -219813, -133737, -117376, -159738, -31906, -337974, -245127, -55165, -182801, 23841, 260771, -191818, 143352, -95848, -131238, -82847, -156660, -75900, 40509, 23331, 168900, -160869, 73934, 112414, 186829, 2290, 107003, 72219, -49425, 32422, 84430, -54979, -114644, -203269, -130596, 250712, -205721, -36497, -76420, -17291, 138413, -428062, -17174, -396048, -20795, 117791, 128763, 90328]
18364I0328I492a74406n6705Q06e8540A4833a03501a6239A08971L2909e0714B32654
18351A30682k6030b9751j07858F3527d9349C39353e3796k5839c9434a2535k93159
18340c05694a49136g0297A65816a41490B1450i1034B6184P3364C6051b32868B76210
18328a80528K7692A64714a68451d4396j02854F7091b20085f2353A8636L02111
18318C20747a42469L1015l3903K2554E8378c9589l2894P737j0703c0749q1464
18307a12213c8319A28127a42623B1336a66810G4904G98J09620C1930h4425F0816
18295d6566E0471d6214A83976a3139q7131A27037n2894e7655l7570o4096a6607
18283A09716i5917B41890H4621a21761B69405g4588r6703B958L1760b5077A03637
$$ y = [90328, 9492, -174406, -231111, -230305, -58540, 14833, -103501, -16239, 108971, 141880, -50714, 232654, 130682, 104652, -29751, -137609, 63527, -49349, 339353, -53796, -79635, -39434, -12535, -305694, -149136, -70297, 165816, -141490, 21450, -91034, 26184, 99548, 36051, -232868, 276210, -180528, -152836, 164714, -168451, -44396, -147250, 67091, -220085, -62353, 18636, 320747, -142469, -111454, -145357, -122803, 58378, -39589, -72483, -64746, -75449, -30749, -112213, -38319, 128127, -142623, 21336, -166810, 74904, 798, 110418, 31930, -84425, 60816, -46566, 50471, -46214, 183976, -13139, -100270, 127037, 74143, -57655, -95225, -159321, -16607, 109716, -95917, 241890, 84621, -121761, 269405, -74588, -171291, 2958, 34718, -25077, 103637]
18271D2980b72560I3091a2436j69018G0935O0956c430B2646j1242b10882A27110
18259b73148A8381a59508f0137A07482m2690B6192J8664J41770g4920I3811a97277
18247a75099j31003g4650F7717a83981f9150n4144j59921h2478b4653k66046a15026
18235A37263k4281a70125Q3923K678B08513h6208b5000k03665A84721R9699b86389
18223h2728G6359k6872J94799j15685J36356b44938g9895r5167k68364A2021a70541
18211c0491A1206K60433A7300G419J73499J3641D8781h9494K2267I5361L6855
18200A32216b2094m43950B4670a85295j26296R302f9256C61148a68263a9135j519
18189b0654A44054a71491j14200i446A3591b06967i3129A81956C1347a21756o4945
$$ y = [42980, -272560, 93091, -12436, -181454, 70935, 131891, -3430, 22646, 11404, -210882, 127110, -273148, 18381, -159508, -60137, 107482, 64792, 26192, 44856, 186626, -74920, 93811, -197277, -175099, -306102, -74650, 67717, -183981, -69150, -123294, -283215, -82478, -24653, -290699, -115026, 137263, 112982, -170125, -86202, -83524, 208513, -86208, -25000, -228665, 184721, 284420, -286389, -82728, 76359, 49487, 244286, 128601, 264957, -244938, -79895, -175062, -443426, 12021, -170541, -30491, 11206, 271639, 17300, 7419, 180918, 194559, 48781, -89494, -67227, 95361, 132216, -22094, -466044, 24670, -185295, -311591, -302289, -69256, 361148, -168263, -19135, -20654, 144054, -171491, -285691, -9446, 13591, -206967, -93129, 181956, 31347, -121756, -186701]
18178a86701e62j44189A67303a59422B10685a63413m0773o987p7337b6979j861
18167b8840B03819G9364a7389l18673a00609l16473A49062a16214k81449A32213
18156a64951e0391A08072l8150P7189g357j792j39937k52022c7418A04129J84251
18145B88380a05841j3697K1421G9167a0879j03973A11965a08100A63547a08234
18134H2203Q5711G6787K93399b10566J01660k3680K8338A01711h3550A52844B721
18122a41702B25438H590c3878M342k86451G9954g9225j5753M4706k8757C5388
18110a31138B2588a49132j29615D246a70085P4102n7529l12328a33568A5853b84972
18098a50634C21010a11550A76787a64874a2180j1311B18032a01245B7534L13735
$$ y = [-186701, -562, -144751, 167303, -159422, 210685, -163413, -204186, -211173, -288510, -26979, -28840, 203819, 79364, -17389, -336062, -100609, -417082, 149062, -116214, -397663, 132213, -164951, -50391, 108072, 69922, 147111, -7357, -9149, -149086, -401108, -37418, 104129, 288380, -105841, -119538, -98117, 79167, -10879, -114852, 111965, -108100, 163547, -108234, 82203, 167914, 76787, 370186, -210566, -108906, -132586, -104248, 101711, -83550, 152844, 2721, -141702, 225438, 8590, -33878, -29536, -315987, 79954, -79225, -94978, -50272, -79029, 35388, -131138, 22588, -149132, -278747, 4246, -170085, -95983, -153512, -465840, -133568, 15853, -284972, -150634, 321010, -111550, 176787, -164874, -12180, -23491, 218032, -101245, 27534, 341269]
18088C41269f8575E945b59039J1951J00552D1366h544k96683J06552f5414j19955
18077a85369C0976c86331B00133b5307C5841J85757k0717a84709A06159m1699
18067F4460b70948H5998i6824k50975A93269G8091a21941N7489F4126J59202G6181
18055h3568A33392E1539a28416N3226b3660k4420g244r9128B01898a70498B35893
18043a90438n4632R6254E1046a45k3912k59118E3538K21298q0201a0997k21878
18032b32875B59761A26495n0977i6327l79099a27625a1265j78105R0807A33326
18021A71257b36586R9538j22974A11317b20819A96934h5145A61142b6745h794
18010b60468B03145c6335I7928c5329k75803e7499q7868e4807j27256A89214b37307
$$ y = [341269, -68575, 5945, -259039, -247088, -146536, 41366, -8544, -305227, -198675, -65414, -185369, 30976, -386331, 200133, -25307, 35841, 221598, 200881, -184709, 106159, 64460, -270948, 85998, -96824, -347799, 193269, 78091, -121941, -64452, 64126, 223328, 76181, -83568, 133392, 51539, -128416, -75190, -23660, -48080, -7244, -106372, 201898, -170498, 235893, -190438, -245070, -148816, 51046, -145, -24057, -283175, 53538, 274836, 194635, -10997, -232875, 259761, 126495, 75518, -96327, -475426, -127625, -11265, -189370, -98563, 133326, 171257, -236586, -137048, -260022, 111317, -220819, 196934, -85145, 161142, -26745, -8794, -260468, 203145, -36335, 97928, -35329, -311132, -57499, -145367, -54807, -182063, 189214, -237307]
17998c5697k79913A66854J37948i2193a9460k54142R9325B44351A21558j7283
17988A04275d3279p933l3944r9354G341a9360r0131N2552r9392H4516P7599a21293
17975d04430G2397l2325k189L3312a84304H0884b58715A86129i16j295k05716
17964b07927g0135C205b4364A98495e4931B8856R2080c49391G0562f3169j85978
17953b49147h041j27684r6643F9143c01439I3064f3990A48984g1478k06831O6218
17942b12091A37062a92264c793l5878D57337a3631j10211c264H7316N932b92494
17930A81624o6300c38280O6467C0850L9687d77725a18861j60003B5982K7081a05899
17918E3979Qf9279J9045l7967A39638a65732F6617E006J25361c9387A1485R4672
$$ y = [-35697, -315610, 166854, 304802, -92193, -19460, -273602, -174277, 244351, 121558, 104275, -43279, -51212, -85156, -184510, 7341, -19360, -109491, -56939, -156331, 84516, 162115, -121293, -404430, 72397, 40072, 37883, 71195, -184304, 80884, -258715, 186129, -916, -2211, -207927, -70135, 3205, -24364, 198495, -54931, 28856, 120936, -349391, 70562, -63169, -249147, -8041, -135725, -232368, 69143, -301439, 93064, -63990, 148984, -71478, -278309, -212091, 137062, -192264, -3793, -39671, 457337, -13631, -123842, -3264, 87316, 93248, -292494, 181624, 115324, -338280, -271813, 30850, 70537, -477725, -118861, -278864, 25982, 53063, -105899, 53979, 53987, -69279, -50234, -88201, 139638, -165732, 66617, 5006, 130367, -39387, 11485, 106157]
17906A06157a85747J3013o3699j73890a70291B41326I6006j126b12704B7956a61410
17894A00097b09582A1516b07880L6458r6962B0842a6361I1150J15485A1968a6977
17882C7055a68427G4684J4581m479J51260D4132K1196b2996j1228A8456a20131
17870F5933f8245E1988a78300A07653Q407a576B06276k9333A5893P0840K5503
17859A12236a14487B74187a71197Q0701A68371D7125a58381C121L48046A57278
17848b4303j95296A59977K61427e8651A99804A8345M23113A53996o9703e3712
17837E1063f9845A92702E4898b36049d4607k20633a24812r1519A15511a62177
17826i5418f727l3949A01621c09565H0155b47489F702a61194A49440a18068p828
$$ y = [106157, -185747, -172734, -236433, -410323, -170291, 241326, 96006, 94880, -212704, 27956, -161410, 100097, -209582, 11516, -207880, -171422, -268384, 20842, -16361, 91150, 206635, 11968, -16977, 37055, -168427, 74684, 89265, 84786, 236046, 44132, 65328, -22996, -34224, 18456, -120131, 65933, -68245, 51988, -178300, 107653, 116060, -1576, 206276, 176943, 15893, 86733, 112236, -114487, 274187, -171197, -90496, 168371, 47125, -158381, 3121, 351167, 157278, -24303, -219599, 159977, 421404, -58651, 199804, 18345, 441458, 153996, 84293, -53712, 51063, -69845, 192702, 54898, -236049, -44607, -265240, -124812, -216331, 115511, -162177, -95418, -6727, -40676, 101621, -309565, 80155, -247489, 6702, -161194, 149440, -118068, -125896]
17815a25896b9650A17626f3046D8696b2120c613F4687K59133c24247a61328c5807
17803b60882d9374B6299J43441c94508d6916E5645d4026j45186A24316R972a4774
17791e7854b1553A5644b61567A7313d4979l09973f8405j11662d6351j95688J18073
17780a23966F095i0365j039a0660k4647j90834b4712j40538B42000I9773h1150
17768A24853a46776l0488l2914m6658M5761A2535J05741D1540R6485a9806r3145
17757a12951j78916k46017b8453I1761c06649A59411F4744b76920A47363B4774
17746D7013d9870C14389d4547l7347a6445k02194K8173I8209J78315K7188c8550
17734a16051B3859b80033A54949k1733b44317G1491c06210D9431M4579c5848A3684
$$ y = [-125896, -29650, 117626, -63046, 48696, -22120, -3613, 64687, 323820, -324247, -161328, -35807, -260882, -49374, 26299, 169740, -394508, -46916, 55645, -44026, -189212, 124316, 134288, -14774, -57854, -21553, 15644, -261567, 17313, -44979, -354952, -68405, -180067, -46351, -242039, -123966, 6095, -90365, -91404, -10660, -35307, -226141, -24712, -165250, 242000, 99773, -81150, 124853, -146776, -177264, -210178, -256836, -211075, 12535, 118276, 41540, 138025, -19806, -112951, -291867, -537884, -28453, 91761, -306649, 159411, 64744, -276920, 147363, 24774, 47013, -49870, 314389, -44547, -81894, -16445, -218639, -190466, 98209, 276524, 303712, -38550, -116051, 23859, -280033, 154949, 133216, -244317, 71491, -306210, 49431, 94010, -35848, 13684]
17722e0054p5752R394A7965f2978k7016c1470B2093h2311b1896k59125A81935
17710a10765P783J0832n2739k7374E9965j2087J72882H1529B1476a00629C13240
17698f5262k9401p9414A29175a20705n7943F9346J45180a07320c1825k7020j3563
17687g2408l7043B92388a15278p1735G6801M7829c9354j27405B57679F8261c98825
17675E43563j55381a31316A48501c07657A8053N5598a41254e5110A81035K8249
17665B09284f6532r070A70466c17373J51757D52822f740B01716f2815q4035C9559
17653b20292J03175D7056J97041D1586J1455M4983B0191J73422c91357B48809
17642C75378A07584c86991c3557m6956H7758g6402A98077K08962c18971J37659
$$ y = [-50054, -125806, -116412, 17965, -62978, -89994, -31470, 22093, -82311, -21896, -281021, 181935, -110765, -102982, -92150, -144889, -172263, 59965, 47878, 220760, 81529, 21476, -100629, 313240, -65262, -94663, -174077, 129175, -120705, -178648, 69346, 214526, -107320, -31825, -58845, -72408, -109451, 292388, -115278, -187013, 76801, 124630, -39354, -166759, 257679, 68261, -398825, 543563, 388182, -131316, 148501, -307657, 18053, 73651, -141254, -55110, 181035, 209284, -66532, -75602, 170466, -317373, -165616, 452822, -6740, 201716, -62815, -146850, 39559, -220292, -117117, 47056, 244097, 41586, 53041, 98024, 20191, 193613, -391357, 248809, 375378, 107584, -386991, -33557, -80513, 87758, -76402, 198077, 407039, -318971, -181312]
17632a81312h295n9337A8821O4696J5571d1834E10395d2777B65591d1498A34188
17620d389A06460a03788h968G1536a53384a6853j65913h0705D7734a70981A75047
17608h6328G0387K34476c1594B22019r348j5847H9283f6912a7169A26946h827
17596C26623d8885j9700B70649G9711b261B71779h4902j43043Q9601E2312a5110
17584A73271f2453C65044b51250e8821k82805h6328j35775A99163a0746j50683
17574a61429L31E05239F2016O326l0362c8008j90695C89092j29675J01948A21849
17562d15730B4133c0952b656j12712A6299K38424p7212a35308E2152j6031f4195
17550A00249l4168J28948I5299L00439e4630J5108i500A0493M974L6797h930L207
$$ y = [-181312, -8295, -67632, 18821, 83517, 99088, -41834, 510395, -42777, 265591, -41498, 134188, -4389, 106460, -103788, -8968, 71536, -153384, -16853, -182766, -80705, 47734, -170981, 175047, -86328, 70387, 304863, -31594, 222019, 212671, 196824, 89283, -66912, -17169, 126946, -8827, 326623, -48885, -68585, 270649, 79711, -2261, 271779, -84902, -227945, -138344, 52312, -15110, 173271, -62453, 365044, -251250, -58821, -341626, -86328, -222103, 199163, -10746, -161429, -161098, 505239, 62016, 68342, 37980, -38008, -228703, 389092, 259417, 361365, 121849, -415730, 24133, -30952, -2656, -115368, 16299, 254723, 177511, -135308, 52152, 36121, -64195, 100249, 66081, 195029, 95299, 395738, -54630, -39522, -9500, 10493, 15467, 52264, -8930, -5723]
17538e723k87788e7257k3136A86454a03938E78053k37080o0110H4376J3292k2834
17527G4834L24215A84151G9309j5210a35200G5079b6871A93072R393A1165e8254
17515h5076E62533E9398a33842C00471b36981f0919I6552J45585J60203a3460
17504b31185J2866A41949i7160D3513K6766c60122A64872n3237C5681a7028C56710
17492A2825c08595C45009A0996Q6861j6617a00415C0706L12357a27611I903O1022
17481G0925R2384J96537o3142G6507L69545j93206K0233p4447D5747J77195K0756
17470B43698a08766A05986J35376H8149J44277r4296j8347a03672B21268J95983
17460D17251A75850J6513b0125B89518E5094k5174c297H8963b72650c5063B89552
$$ y = [-5723, -293511, -57257, -80393, 186454, -103938, 578053, 340973, 280863, 84376, 97668, 74834, 399049, 184151, 79309, 64099, -135200, 75079, -26871, 193072, 202465, 11165, -58254, -85076, 562533, 59398, -133842, 300471, -236981, -60919, 96552, 242137, 402340, -13460, -231185, -218319, 141949, -97160, 43513, 70279, -360122, 164872, 111635, 35681, -17028, 356710, 12825, -308595, 345009, 10996, 97857, 81240, -100415, 30706, 343063, -127611, 9903, 70925, 163309, 359846, 296704, 76507, 446052, 252846, 273079, 198632, 45747, 222942, 243698, -108766, 105986, 241362, 88149, 232426, 138130, 119783, -103672, 221268, 417251, 175850, 192363, -20125, 289518, 55094, 29920, -3297, 88963, -272650, -35063, 289552]
17448A27593N7653m2594n6557J26939a37450C52944r8775J33894N6855B07657
17437B94297J1580j46935J01697J03306K7999A34020N748M4572a12899B97802
17426b5040A91414J25q5057C6224a1940A41943J72194j7522e3419A94555p4679
17415A19876J14839L2634q5472K47275G1736J24255J66056M0867A13908R0588
17405B04496J90647A78793Q9385I5966J72933m967L55626a01032D7215J25497
17395A72712d9397D9681Q3011J0664F5861J01353J70916B517J60514J07006j17210
17384A52827J83554A01476J04989J54320a25323A44664D195N28154B44557n6566
17374A87991J32530a17338B70092l1088J5296H8471P6942O5753a74169G9646R4569
$$ y = [127593, 185246, 142652, 86095, 213034, -137450, 352944, 254169, 388063, 444918, 207657, 294297, 305877, 158942, 260639, 363945, 391944, 134020, 139768, 184340, -112899, 297802, -25040, 191414, 191539, 106482, 36224, -11940, 141943, 314137, 296615, -53419, 194555, 119876, 234715, 267349, 181877, 429152, 71736, 195991, 362047, 402914, 113908, 204496, 395143, 178793, 268178, 95966, 268899, 263932, 619558, -101032, 47215, 172712, -49397, 49681, 132692, 143356, 65861, 167214, 338130, 2517, 163031, 270037, 152827, 336381, 101476, 206465, 360785, -125323, 144664, 4195, 532349, 244557, 187991, 320521, -117338, 270092, 239004, 254300, 88471, 165413, 231166, -174169, 79646, 174215]
17363A74215l4597E2346J75795r3179E4603a32507c2557G0795J13035R7116D3684
17351I9919p621K35243A49117f0717k71814B63748C00Q4593J76513b17467C69172
17339F8209i8891A67723c8284C15280q7970D0481a38474A77187R1658K37194g6600
17327A44358M0311C2566Q1510b73540c2080D43611G7291a3347A12933a60748F4791
17315B10377c9416A58187a92181A51926l2648L2708E9769J05730K1873R4979h3377
17303C5298K28018J22408q7145n307g3094P134D69761A74153L3434c9559C23845
17291A81749m462N8118e7670I8553M2346J89184a22185A31904d6938B52500J75191
17280D27691J1586F86N3805K53197a07372a066A56163K39760A48351K50969a07126
$$ y = [174215, 139618, 52346, 228141, 134962, 54603, -132507, -32557, 70795, 183830, 280946, 43684, 99919, 92298, 327541, 149117, -60717, -332531, 263748, 300, 84893, 261406, -217467, 369172, 68209, -98891, 167723, -38284, 315280, 227310, 40481, -138474, 177187, 268845, 506039, -76600, 144358, 184669, 32566, 114076, -273540, -32080, 443611, 77291, -13347, 112933, -160748, 64791, 210377, -39416, 158187, -192181, 151926, 119278, 151986, 59769, 165499, 187372, 282351, -83377, 35298, 263316, 385724, 298579, 293272, -73094, -65960, 469761, 174153, 207587, -39559, 323845, 181749, 177287, 235405, -57670, 98553, 140899, 330083, -122185, 131904, -46938, 252500, 427691, 439277, 686, 54491, 307688, -107372, -1066, 156163, 395923, 148351, 399320, -107126]
17268A16034i9139A07470a37258C06262A08845K92817j78711j09196b89914C06520
17257C07748F2680K91976j63677J39563A46868K0981C0931l005L07164j55342
17247A79748J87919b5038H3802c201D55979a74275C26066q1619b67376e1309H9576
17235i6114a092D9803J56175J20751J21410k13212a64803b4287C67267j12667
17225B54600J73746e0401D02515j64998P2297D1147K83400A40840N9780D1877
17214B32445q3773P6904J23420A23024P406B5054J15328M22848I8698l7046J59671
17203B21323A0141J93202R7124a09865H6884J01192K86895B7391a9330E9451M97845
17192E57296A50712J67538N993n1571J10737j59848N8835K28156k36496p4644
$$ y = [116034, -99139, 107470, -137258, 306262, 108845, 401662, 222951, 113755, -289914, 306520, 307748, 62680, 354656, 190979, 330542, 146868, 167849, 30931, 27926, 335090, 179748, 367667, -25038, 83802, -3201, 455979, -174275, 326066, 244447, -267376, -51309, 89576, -96114, -1092, 49803, 205978, 326729, 448139, 234927, -164803, -24287, 367267, 254600, 428346, -50401, 402515, 237517, 309814, 41147, 324547, 140840, 200620, 41877, 232445, 148672, 225576, 348996, 123024, 130430, 25054, 140382, 563230, 98698, 61652, 221323, 10141, 203343, 300467, -109865, 86884, 188076, 474971, 27391, -19330, 59451, 557296, 150712, 318250, 324243, 272672, 383409, 223561, 282396, 510552, 274056, 199412]
17182A99412H5399L63125j92542l9421J47785K50692A18271J57086j26713J65281
17172C13925o9191L11996k65011b6906E6306L14935p1484N8123J80484j03325
17162D35039h6326A98070p8182L52974C5366K45291q2175E1209B2199J91393J07419
17151C21011J30147e0994B82572J44322B07379n7890K87385j66049p9682M2858
17141B34001l1974j6851J4639J86027j25089F602L35262O0806K1917Q5829A06533
17129B48544P4997J2918J8463J10775J12850A09037K63183l5461j35472M0662
17119B41949K17764h3330A11390j04L74114A49116J38129j07670N276J72522A69646
17107A47283O18257A45425J20693J10402p4107j109J5252K83615j16308j93916
$$ y = [199412, 85399, 448524, 255982, 216561, 364346, 615038, 118271, 275357, 148644, 313925, 244734, 556730, 291719, -26906, 56306, 371241, 299757, 357880, 538364, 435039, -86326, 198070, 119888, 472862, 35366, 280657, 198482, 51209, 22199, 213592, 321011, 451158, -50994, 282572, 426894, 207379, 149489, 436874, 270825, 191143, 234001, 202027, 185176, 199815, 385842, 260753, 6602, 341864, 402670, 424587, 510416, 106533, 248544, 323541, 336459, 354922, 465697, 578547, 109037, 372220, 336759, 201287, 241949, 459713, -83330, 111390, 111286, 485400, 149116, 287245, 179575, 184851, 357373, 169646, 147283, 765540, 145425, 266118, 376520, 302413, 301304, 316556, 600171, 483863, 289947]
17097B89947J68536j30742k0203P8070n4023k1065d7761E36022j90686j14844
17087B30492r4848J44615K32339j45472n6778j06557N616K97937q9527k6475O4797
17076D56139k02924N4255N2365M12069C58651o501Q0307k021J82612p5619J30114
17065F67543j96943A50534J30932K41332A80838L98423j34765O6671J2225J51942
17055F75334k80444J33212P9112l369R7790M9205B10747J42477J70728P4517A71263
17043C83222R1672J1554J37535o6379j42573A77581A4459N93572m8969N0329j02055
17032E07336j08783N53732r2184l91971J10163O1803j19238K4478G5274M25418
17022E00692J82924M4372l58359l336l9525K4779L31661A37769J43651J18461
$$ y = [289947, 458483, 327741, 307538, 385608, 331585, 310520, -47761, 536022, 345336, 230492, 135644, 280259, 512598, 367126, 310348, 203791, 209407, 507344, 417817, 391342, 456139, 253215, 307470, 359835, 771904, 358651, 352150, 432457, 430436, 613048, 537429, 667543, 470600, 150534, 281466, 522798, 180838, 579261, 444496, 511167, 523392, 675334, 394890, 528102, 607214, 603845, 701635, 750840, 210747, 353224, 523952, 598469, 171263, 383222, 474894, 486448, 623983, 557604, 415031, 177581, 14459, 608031, 559062, 609391, 507336, 398553, 952285, 860101, 468130, 578293, 640096, 520858, 545336, 75274, 500692, 683616, 727988, 369629, 366293, 326768, 351547, 683208, 137769, 281420, 399881]
17012C99881J07404o0900K77442n0011j56755J03299j53970L93615l75498J65068
17002F49575J84920p5370j579o8889P1065K15147D47922J74154K70923k13649
16992F79350L56622j35128r8000n3906J03817n9908J80592J68815k57801j50996
16982G33457J27060k49104J53587K00396L5785r8500q9264O4771l05295M12654
16972I85547m20881K96044P1674j40894J48365l7498J17129l38559J35646k65008
16962E51565q06L95568k883K5490k84922K36508J29448k01410J92577k81499N95407
16951A355043F25747L42625j64091L41948J69839j10930E55071N33343l7239Q05
16941A051980J68554k05451l1447j79724J98814J46446k53397L80840p0858R3147
$$ y = [399881, 507285, 446385, 723827, 673816, 517061, 620360, 466390, 860005, 484507, 649575, 834495, 759125, 757546, 688657, 759722, 974869, 447922, 622076, 892999, 679350, 1035972, 900844, 802844, 748938, 852755, 792847, 973439, 1142254, 884453, 733457, 860517, 611413, 765000, 965396, 1001181, 902681, 813417, 878188, 572893, 985547, 564666, 860710, 932384, 791490, 939855, 902357, 1019486, 680927, 816573, 551565, 550759, 946327, 943444, 968934, 684012, 920520, 1049968, 848558, 1041135, 759636, 1355043, 625747, 968372, 804281, 1146229, 1316068, 1205138, 555071, 1088414, 1051175, 1051980, 1220534, 1015083, 983636, 803912, 1002726, 1149172, 895775, 1276615, 1205757, 1298904]
16931A298904k88660n8729K97531O3656l63933M24337M1274j52389k46368K39768
16921A255391Q4543N8627l47285K3065K64324m5127k5674O36269k75585k30307
16911A398241K18089p6110k30346L0580K04912m24435L02297O4178K52490l8226
16901A701670j91194j2833j11681J1864N94505n31165J26605L7880j44536M19115
16891A900230n4483j67885K11027k71923L19137n09706K79334J39915J94353j22309
16881A917690o3k23624K51966J58792J05182m07396K69359P2394J7695l78681
16871A783314L23209J42413k53486M46119j61236J96402J65569m28418L13361
16862B527247J03924k22206K9715J87774p7726J58413N0864k01013o23J02204
$$ y = [1298904, 1010244, 951515, 1249046, 1312702, 948769, 1373106, 1414380, 1261991, 1015623, 1255391, 1339934, 1398561, 1051276, 1074341, 1338665, 1293538, 1267864, 1904133, 1628548, 1398241, 1616330, 1540220, 1309874, 1340454, 1545366, 1120931, 1423228, 1487406, 1739896, 1701670, 1510476, 1497643, 1385962, 1397826, 1992331, 1461166, 1587771, 1625651, 1481115, 1900230, 1845747, 1677862, 1888889, 1616966, 1936103, 1426397, 1705731, 1845646, 2039999, 1917690, 1917627, 1694003, 1945969, 2104761, 2209943, 1802547, 2071906, 2144300, 2161995, 1783314, 2106523, 2248936, 1995450, 2441569, 2280333, 2476735, 2642304, 2213886, 2527247, 2631171, 2408965, 2438680, 2626454, 2548728, 2707141, 2758005, 2556992, 2556369, 2658573]
16852B658573j30496M83915m57549J26482r5520M10464k71574K89369p8234j14756
16842B820674M06843j70924K47018m0989q8704J44719j95309N00023j40283J49680
16832C632748K94802j35760M6913j99962M4396L38333J36165k397L6337p9362
16822D112213K27959R9112K46530k37912M21902m47701L50359q3292J04928K05217
16812D999315J72664n9987M8032K80389N1106J20071K62780K98562j86726m1320
16802E944886N16882k22962M06726j6579P2322J67865L14985Q4606K0405M1549
16792G330685N22147J06766m99744J008680k17467N23777o1793K53196O0386J0122
16782I036755M88762M28812J471M59372R2255L71370P08148K24545J3915O55179
$$ y = [2658573, 2528077, 3011992, 2554443, 2680925, 2585405, 2995869, 2724295, 3013664, 2935430, 2820674, 3227517, 3056593, 3303611, 3262622, 3173918, 3318637, 3123328, 3623351, 3483068, 3632748, 3927550, 3791790, 3838703, 3638741, 3683137, 4021470, 4157635, 4155238, 4191575, 4112213, 4340172, 4439284, 4685814, 4447902, 4869804, 4422103, 4772462, 4689170, 4794098, 4999315, 5171979, 5111992, 5160024, 5440413, 5491519, 5611590, 5874370, 6172932, 5986206, 5944886, 6461768, 6238806, 6645532, 6628953, 6701275, 6869140, 7184125, 7268731, 7289136, 7330685, 7852832, 7959598, 7459854, 8468534, 8251067, 8774844, 8713051, 8966247, 9026633, 9036755, 9525517, 9954329, 9955800, 10415172, 10507427, 10878797, 11586945, 11811490, 11825405, 12480584]
16772A2480584M6417O01312O8649N78400K24862N92687N14417M09169O25921M46984
16762A6589402M86313O16411O67289L69812P20538R32828R03956M24897Q94274
16753B2605720Q00125J181004Q22604J097012P31806J309487J248675J239164
16745C1035597J240578J816284J317951J432552J706748J930852K011653J879685
16737D4371900K026560K796480K271328K957751L168413K954617L066487L333200
16729F6946736L565811L866197M000531M555003M771783M634968M650608O034074
16721A03025711N161918N551892N647926O149433O049586N708829O130020N351873
16713A48777188N558785M792603M238261L849667K897544J938436J375537N28736
$$ y = [12480584, 12527001, 13128313, 13196962, 13775362, 14000224, 14592911, 15107328, 15516497, 16142418, 16589402, 17075715, 17692126, 18359415, 18729227, 19449765, 20382593, 21286549, 21711446, 22605720, 23405845, 24586849, 25409453, 26506465, 27238271, 28547758, 29796433, 31035597, 32276175, 34092459, 35410410, 36842962, 38549710, 40480562, 42492215, 44371900, 46398460, 49194940, 51466268, 54424019, 57592432, 60547049, 63613536, 66946736, 70512547, 74378744, 78379275, 82934278, 87706061, 92341029, 96991637, 103025711, 108187629, 113739521, 119387447, 125536880, 131586466, 137295295, 143425315, 148777188, 154335973, 159128576, 163366837, 167216504, 170114048, 172052484, 173428021, 173956757]
16705A73956757p60435j747821k642488l153410m216067m725725n187699n924997
16697A45598115n908704n942736o432982n831272n886740o192342n596745n869030
16689I7937564n155478n013238m536957m548785m238087m318343l509171l530892
16681F3086613l934220k526136k950689k781838k557113k443166k245048j761410
16673D1886993k428027j814269j895091j444493j564235j509644j125777j519316
16665B8586141r53353j525888p93042r55903o94957j159783j213876n73800n92456
16656B0123083n88087j036910n42155q72816k52231o56006p10255m49386j87768
16647A4827469r42239l35318l9183o20481k27123o03719m78369j52023j48405
$$ y = [173956757, 173196322, 171448501, 168806013, 165652603, 161436536, 156710811, 151523112, 145598115, 139689411, 133746675, 127313693, 121482421, 115595681, 109403339, 103806594, 97937564, 92782086, 87768848, 83231891, 78683106, 74445019, 70126676, 66617505, 63086613, 59152393, 56626257, 53675568, 50893730, 48336617, 45893451, 43648403, 41886993, 39458966, 37644697, 35749606, 34305113, 32740878, 31231234, 30105457, 28586141, 27632788, 26106900, 25313858, 24357955, 23662998, 22503215, 21289339, 20715539, 20123083, 19534996, 18498086, 17955931, 17083115, 16830884, 16174878, 15464623, 15015237, 14827469, 13885230, 13549912, 13510729, 12890248, 12663125, 12059406, 11581037, 11429014, 11280609]
16638A1280609n98696k15938p9799m10135k52387m36814j2919k68835m73608k32750
16628H298728j18719J9219n02032N6739k94237k51627l40665m309k18794M4410
16618F688713l10460k60848n2633m3037k16961O1534l94450K01685k03824P7640
16608E547359p9693m20697j01673J56570j80414M7800l36309O9407n32454Q5728
16598D255624p8410O2567l07512N7658r7786m7123M4366P620k80008Q5059l62012
16587C340043K77873k96146j22733K58302l5377j64626J67886m69489K14441J80398
16577C350572m20224n7910K2817j46333N6148q6091L9259k9489l95542K82951
16567B616158k18124o2689J32387O537K33138l58714K73079o41137L80912j07935
$$ y = [11280609, 10681913, 10465975, 10386176, 9976041, 9723654, 9286840, 9273921, 9005086, 8531478, 8298728, 8180009, 8199228, 7697196, 7753935, 7459698, 7208071, 6867406, 6863097, 6644303, 6688713, 6378253, 6117405, 6064772, 6021735, 5804774, 5866308, 5471858, 5673543, 5469719, 5547359, 5467666, 5046969, 4945296, 5101866, 4921452, 4969252, 4632943, 4702350, 4169896, 4255624, 4177214, 4239781, 3932269, 3989927, 3892141, 3845018, 3889384, 3897004, 3616996, 3702055, 3340043, 3617916, 3321770, 3199037, 3457339, 3421962, 3257336, 3425222, 2955733, 3170174, 3350572, 2930348, 2872438, 2895255, 2748922, 2805070, 2718979, 2758238, 2728749, 2333207, 2616158, 2398034, 2335345, 2467732, 2474269, 2707407, 2348693, 2621772, 1980635, 2361547, 2253612]
16557B253612o1561K33801l63318j67971N0548j83005J35027L26933r8980p8590
16547B046496j56848l21104j95442N72993J2216k23540j50610K46553l34339j8699
16537A477676M23107l4748k96386j65013J65940j23814K32426k33768J87010l7592
16527A594838n1314m70099K68574O4477j57291Q3469K6341k0072l870j94114m4551
16516A096388M4136M06521l87763J52456j66769K753J86224j01501o2939o3792
16506A105714k05956l4336J13792L34631l53792L04207L4416k66898K68350k43054
16496A057074l26823L48698q2526j02630J52605j49897N6802R3493L60135F90485
16485A086191j79308j23532l9091J99641j76967j20621J82961J78502J3611k20851
$$ y = [2253612, 2192051, 2425852, 2062534, 1894563, 1945111, 1762106, 1897133, 2224066, 2125086, 2046496, 1889648, 1568544, 1373102, 1946095, 1958311, 1734771, 1584161, 1830714, 1496375, 1477676, 1900783, 1866035, 1569649, 1404636, 1570576, 1446762, 1679188, 1445420, 1632430, 1594838, 1543524, 1073425, 1341999, 1406476, 1249185, 1332654, 1358995, 1338923, 1335053, 1140939, 1096388, 1140524, 1547045, 1159282, 1311738, 1144969, 1147722, 1333946, 1232445, 1169506, 1105714, 899758, 865422, 979214, 1313845, 960053, 1264260, 1298676, 1031778, 1300128, 1057074, 730251, 1078949, 996423, 893793, 1046398, 896501, 953303, 1046796, 1406931, 690485, 1086191, 906883, 783351, 744260, 943901, 766934, 646313, 829274, 1007776, 1021387, 800536]
16475H00536J04011j03543J81910j01963m101q9969j4363K77594j08690j9167
16465I22255q8545L1930m19258L40360k68235L97323C17069O04765k63965N2090
16455G09959j4416n5450K4965j53024j49394M92606k75763L71102l28975M2988
16445F64598Q6859O2096j08651j4530j81095q8486J33945Q5072Q8376M2072j95405
16434E74851m9038k12322K67455q2310l8203j72642J23825K42768j16599q3968
16424D53817M51962D32941R8103B10916M04220k32259J40422j00597j06307J96475
16414E12870j31934K0670j49327N70545B02118M96293B89945m0374q2132K50114
16404D17553B02197N43965C29780L65681k74877K3338K65015C24254A29153N08845
$$ y = [800536, 904547, 801004, 982914, 880951, 876850, 786881, 772518, 1050112, 941422, 922255, 833710, 865640, 446382, 786742, 518507, 915830, 317069, 921834, 657869, 709959, 695543, 640093, 665058, 512034, 362640, 855246, 579483, 950585, 621610, 664598, 751457, 813553, 704902, 690372, 509277, 420791, 554736, 639808, 728184, 770256, 574851, 525813, 313491, 580946, 498636, 460433, 287791, 411616, 654384, 537785, 453817, 905779, 432941, 531044, 210916, 615136, 382877, 523299, 422702, 316395, 512870, 380936, 401606, 252279, 822824, 202118, 698411, 289945, 249571, 167439, 417553, 202197, 746162, 329780, 695461, 420584, 443922, 708937, 324254, 129153, 637998]
16394F37998B99461q1019J54180K3787q5374o8142K49669r2515A81987L76150
16384E58137j25530J83530B89174A40960J36646K12806K3342O5290j50409j37087
16374B91548G339M49426I2816L40361l2399j25984m6570K87822j31414A75913
16363B87020A42017M76569B76998j15624L83997A99780p7169K42916A67528F5926
16352C65539A18783N12658k01038H1272K91433j74727P4749n3520J28017c0156
16341B31762o5772H1348J57061b3412D92727d0875k843B28682J40401j54362K89252
16330E03973k40670q1313J37891L3016j5555j11666O1997B3229M4528M22965B6242
16318B31454J32260E7672J30386O8115D7056K81628m9676r2436J12179d3842D45555
$$ y = [637998, 299461, 218442, 372622, 396409, 311035, 242893, 492562, 400047, 181987, 558137, 432607, 616137, 289174, 140960, 277606, 490412, 513754, 579044, 428635, 291548, 7339, 456765, 92816, 433177, 400778, 274794, 228224, 516046, 384632, 175913, 287020, 142017, 618586, 276998, 161374, 545371, 199780, 122611, 365527, 167528, 65926, 365539, 118783, 631441, 430403, 81272, 372705, 197978, 272727, 219207, 347224, -30156, 231762, 165990, 81348, 238409, -23412, 492727, -40875, -43718, 228682, 369083, 214721, 503973, 263303, 181990, 319881, 352897, 337342, 225676, 287673, 23229, 67757, 490722, 26242, 231454, 363714, 57672, 188058, 256173, 47056, 328684, 279008, 186572, 298751, -43842, 445555]
16306A87073K43480K7116j57118j40285J87655A67426G8640J36906M8826f9093
16295C28722O4390F9135J68951e4491B47586L8499A16569A6236K43358G4204J9491
16284I3695P1191J66594c4027B87235m5011f2392A17664R4490J36179J59277B10747
16272C08516r5270q7066A9942b549B93631k5074d3438B66343K51895a7691C56558
16260B82510N0568A59734k6588J53977h7477B19532K32960B05768k1505n1283
16250A32980h1411B81527L4837q671b36985J07423A34661B3822J22825K5144G2860
16238D27571A95801R149n0384J58416G3131N20587Q055E1662q791R1057k8696
16227A05232K31749l3595j11408m8720L7900b81818D997J74623p7856F989a05906
$$ y = [187073, 430553, 457669, 300551, 160266, 347921, 167426, 78640, 215546, 264372, -69093, 328722, 393112, 69135, 238086, -54491, 247586, 286085, 116569, 16236, 259594, 74204, 93695, 164886, 331480, -34027, 287235, 242224, -62392, 117664, 212154, 348333, 507610, 210747, 308516, 213246, 126180, 19942, -2549, 293631, 268557, -43438, 266343, 518238, -17691, 356558, 282510, 333078, 159734, 133146, 287123, -87477, 219532, 452492, 205768, 184263, 132980, -81411, 281527, 316364, 307693, -236985, -129562, 134661, 23822, 146647, 171791, 72860, 427571, 195801, 204950, 154566, 312982, 73131, 593718, 601773, 51662, 42871, 133928, 105232, 336981, 303386, 191978, 143258, 181158, -281818, 4997, 179620, 101764, 6989, -105906]
16215a36430N6705r530j62976B54862G0777f6138A04579E551L56690l4900A04405
16203I7342C9478K310n025b5452C03913E9566L12613D6635J11768i7113k70238
16192c67351B10706E6464J4075c11110a7963C3412c1165j55078C2763e6594B72401
16180B80713a610H7733m42K00661A26794Q560J54533D3242f4298A42621h7062
16168b7164B76159I753a29542L2698H8211K548g1540I6055b8538B3333R8509l4298
16156H7544a45817K9257A03658B7292J00796L2180Ea14343A52146a43691F8519
16144b5160E801J28800e5235k4196A51127O0579o5942H124b23401C2152J7321
16133D9473f331A92908M86a99787R8193o6734A8971e1922o8460H2185M9612J63613
$$ y = [-136430, -79725, -89255, -252231, 254862, 70777, -66138, 104579, 5551, 362241, 327341, 104405, 97342, 39478, 41788, 36763, -25452, 303913, 59566, 372179, 46635, 158403, -97113, -367351, 210706, 56464, 70539, -311110, -17963, 33412, -31165, -186243, 32763, -56594, 272401, 280713, -1610, 87733, 87291, 287952, 126794, 135354, 289887, 43242, -64298, 142621, -87062, -27164, 276159, 9753, -129542, -96844, 88211, 90759, -71540, 96055, -28538, 23333, 121842, 87544, -145817, -116560, 103658, 27292, 128088, 160268, 5, -114343, 152146, -143691, 68519, -25160, 5801, 134601, -55235, -79431, 151127, 211706, 145764, 8124, -223401, 32152, 49473, -6331, 192908, 193394, -199787, -101594, -168328, 18971, -51922, -120382, 82185, 131797, 295410]
16121B95410C7666a5171m3908q7781B26655H9146b04983C62180N4243A58057p8471
16110G9586o770a97274h9517j17682A45135a03485E19722k52271A22375n2601
16100F9774d8007J3462r931l5631q845j00230A12310a02458c5856G3895a19410
16088A05700a29679B17940M5804c7870l8560A31769a44484o3615E3439b9042I8603
16076B26054q2416K4719d37233A19066d7040F4576B1365a83149e6721C05694m7658
16065B58036l4851G4746J78863c3766I3766j1447a03783B2062h4656q7840J7052
16054a55444f3794j02998D5355M5705a00936D0698a78715k059B03138a3831B42593
16042a63139g0254j86052A59316a2125L530A33967a02959A01003L7499R6963f4614
$$ y = [295410, 37666, -15171, -59079, -146860, 226655, 89146, -204983, 362180, 416423, 158057, 79586, 72816, -197274, -89517, -207199, 145135, -103485, 519722, 267451, 122375, 69774, -48007, -34545, -44476, -80107, -88952, -189182, 112310, -102458, -35856, 73895, -119410, 105700, -129679, 217940, 263744, -37870, -76430, 131769, -144484, -208099, 53439, -29042, 98603, 226054, 143638, 168357, -437233, 119066, -47040, 64576, 21365, -183149, -56721, 305694, 258036, 223185, 74746, 253609, -33766, 93766, 82319, -103783, 22062, -84656, -172496, -155444, -63794, -166792, 45355, 91060, -100936, 40698, -178715, -180774, 203138, -13831, 242593, -163139, -70254, -256306, 159316, -12125, -8595, 133967, -102959, 101003, 138502, 235465, -64614]
16030D1589a98374A36909K11136i545E3046a37418C55422I0782g2874b5069j91031
16019b16100A25319E96c6696l4033A89743e953G8476f7218k08193A58706b49989
16007H3538h0027C6800j411K46634c71007F4884c75762J59947A63543n7401h1565
15995B2898K9281K16787C5501b23440A32354c00880g6027n4995A96553G3048K85328
15984C58376a98960J7272L3797I241a92561M2858J3123j1053q8306A10K93613
15973B93723B8693b1599B8632L81870A01598J84369j16223F3391J08863q4995
15963H7259L8922J75652E726b78972J32416F8725b327j79531B59255c29108a39335
15951C1415J98203D4741K54161F6231a80720J6585K2841e1712A11074K63298a96933
$$ y = [41589, -198374, 136909, 348045, -9545, 53046, -137418, 355422, 90782, -72874, -25069, -216100, 125319, 596, -36696, -70729, 189743, -5953, 78476, -67218, -275411, 158706, -249989, 83538, -80027, 36800, 35389, 282023, -371007, 64884, -375762, -215815, 163543, 106142, -81565, 22898, 52179, 268966, 35501, -223440, 132354, -300880, -76027, -131022, 196553, 73048, 358376, -198960, -181688, -147891, 9241, -192561, -149703, -136580, -147633, -235939, 110, 293723, 28693, -21599, 28632, 410502, 101598, 285967, 169744, 63391, 172254, 87259, 126181, 301833, 5726, -278972, -146556, 68725, -2327, -181858, 259255, -329108, -139335, 31415, 229618, 44741, 298902, 66231, -180720, -164135, -141294, -51712, 111074, 374372, -196933]
15939e700j3124j34712a5096O036j10891D31504B01127q6974n1171h7104p9741
15928a66845k7814B12186a96352m7178A82672b04708C9658N62628b47712a23018
15917f5246C5757d191C5446b74741c5493G8573l3133a83136A59893D0955i7539
15905A28003a90101c3718j50430j51109A20768l4495K83239b20749E5994a67540
15894a35355j38526N6478B48957h2922j26255a3690m4004K8813j75025j16059
15884c19965g8947A9818b40324f664A35635E4362b01923j3185f8061C1224a14270
15872a46040M5315A41635d5083E3314A4348f8336c3756j74643B26263c7087j22078
15861a59165L5113A32903a0822n1795j2380k90416h3329D75733A15379a68452
$$ y = [-5700, -18824, -153536, -15096, -9060, -119951, 431504, 201127, 114153, 62982, -87104, -166845, -194659, 212186, -196352, -243530, 182672, -204708, 39658, 602286, -247712, -123018, -65246, 35757, -4191, 35446, -274741, -35493, 78573, 45440, -183136, 159893, 40955, -97539, 128003, -190101, -33718, -184148, -335257, 120768, 86273, 369512, -220749, 55994, -167540, -135355, -273881, -217403, 248957, -82922, -209177, -13690, -57694, -28881, -203906, -319965, -78947, 19818, -240324, -6664, 135635, 54362, -201923, -215108, -68061, 31224, -114270, -146040, -100725, 141635, -45083, 53314, 14348, -68336, -33756, -208399, 226263, -37087, -159165, -124052, 132903, -10822, -62617, -74997, -365413, -83329, 475733, 115379, -168452]
15850c9829C9761I658b20043D8473Q7780C4837h6355k67442A25717f1841j31056
15839a92897b394k19315c7237p7694M7701J0737j48765g9639k42124h383k94785
15828c03168J17917A19088m3977b0966n1055B88032F7411P1878c48595A4429N2086
15817F6515g2298k69972c3095j6969m0007k29593A60533f043B37612c33255a12908
15805F142J53943R246b73637h21p5589B23352h7464A7311P306b45951O3524j28691
15793c11118A00066D8340a59454c6635F7906B3444L4081e4608k2042q3708b5136
15781a33464c8092A07863b15449B3401M843J96273G2143J37980H2812a15066D3202
15769G5257f8136A13385b5004D33711a96985h3832m7002l03209A4824a08438M162
$$ y = [-39829, 39761, 9658, -220043, 48473, 136253, 34837, -86355, -353797, 125717, -61841, -192897, -2394, -221709, -37237, -114931, -67230, -56493, -205258, -79639, -321763, -8383, -303168, -185251, 119088, 75111, -20966, -72021, 288032, 67411, 139289, -348595, 14429, 66515, -72298, -342270, -33095, -50064, -90071, -319664, 160533, -6043, 237612, -333255, -112908, 6142, 160085, 169331, -273637, -821, -76410, 223352, -87464, 17311, 24617, -245951, -182427, -311118, 100066, 48340, -159454, -36635, 67906, 23444, 57525, -54608, -76650, -160358, -25136, -133464, -38092, 107863, -215449, 23401, 28244, 224517, 72143, 210123, 82812, -115066, 43202, 75257, -68136, 113385, -25004, 433711, -196985, -83832, -130834, -434043, 14824, -108438, -104276]
15758a04276d8202D5234L63156H4706M86397B21861f4595A02J3917P1442b29749
15746b21425M1083h4054b4019j93723A90713c8800C62192a72985k226D5114d8815
15734b11947Q3447j64630g6191C5155a10231o3006d9788A46378b84867a08907
15723b44875c6530C44775b79203a19538G9486c7760l04583D5253a69387a2198
15712a2912E9517a38323n0936k42701d7071r0928j6004n8712H3398a62184C2524
15700D7667J43126a38556I2057Q9276b66914B08177R707b6655E0234a55732n6865
15689b12597f140k46722F9983c13285K5158d0703B4845K01802c6397j03652A32561
15677B02193K21038D2720L9003a28852d4806l27463H3087O5611D6168L87785c31674
$$ y = [-104276, -48202, 45234, 408390, 84706, 571103, 221861, -64595, 102, 14019, 85461, -229749, -221425, -180342, -84054, -24019, -217742, 190713, -38800, 362192, -172985, -175211, 45114, -48815, -211947, -128500, -293130, -76191, 35155, -110231, -173237, -49788, 146378, -284867, -108907, -244875, -36530, 344775, -279203, -119538, 79486, -37760, -342343, 45253, -169387, -12198, -12912, 59517, -138323, -189259, -431960, -47071, -137999, -154003, -212715, 83398, -162184, 32524, 47667, 190793, -138556, 92057, 181333, -266914, 208177, 217884, -26655, 50234, -155732, -212597, -6140, -252862, 69983, -313285, -288127, -40703, 24845, 226647, -36397, -140049, 132561, 202193, 423231, 42720, 81723, -128852, -44806, -372269, 83087, 148698, 46168, 433953, -331674]
15665D2795g7095L6579q8061M0169A88490E3167N0035O8516K9473P18h6281K1584
15653f4697A18a38688I6910O9581a54248A43550j5445K86257a470k54651a04520
15641b28877O1716E4382a92282i0361K0457A54961b6704B61572E4871K46953D5702
15629a3589K755j34779g443B64630r5260D5302a27721A02204H347K52273B9790
15617a13660d3748f744A20752a93957C9660f6351p4317B956K36509G7691J31895
15606B09586m1088D1406J18963l5709a02646B41758B427a98552B08975a67948
15595a45416M0801b3681l2293k2412H6576b52145a18060E5041a75590M0679J5809
15584a19102m161B34526h8823G6167K4521C0927a87442B8630K7130J82249A7692
$$ y = [42795, -77095, -40516, -128577, -88408, 188490, 53167, 103202, 171718, 201191, 201909, -86281, -64697, 118, -138688, 96910, 166491, -154248, 143550, 128105, 414362, -1470, -256121, -104520, -228877, -167161, 54382, -192282, -90361, -69904, 154961, -26704, 261572, 54871, 301824, 45702, -13589, -10834, -145613, -7443, 264630, 169370, 45302, -127721, 102204, 8347, 260620, 29790, -113660, -43748, -6744, 120752, -193957, 39660, -66351, -140668, 2956, 239465, 77691, 209586, 168498, 41406, 160369, 124660, -102646, 241758, 2427, -198552, 208975, -167948, -145416, -104615, -23681, -55974, -78386, 86576, -252145, -118060, 55041, -175590, -134911, -119102, -123263, 234526, -88823, 76167, 100688, 30927, -187442, 28630, 55760, 238009, 17692]
15572A87953a2276B23176a8100I2146l3813c4017j16082O6257C2266a34273b3497
15560a46139c0592l11288A14466a213j74417a0724l97816B90113A1890a5470A71431
15548B448a17612C47140a23229c1817k24454A96603I323M2621g571P59E80027
15536C3491b25328B12709p4812a14838a3048r5232H3891h5342b1991j61916O842
15525a77065B07070p7054b45429P8685B1837J20049B7124d60331A25116k8839
15515I6277a69622K449B90046j07103a26375d9664G911J41418m3720D6135k047
15504D4088d2974I3670R7645a44397K394J706d2055k96578A08920b4125A03392
15492A63540a54962B02725b4269j48835K6618B41275b14878j53578J01065A03266
$$ y = [187953, -12276, 223176, -18100, 92146, 58333, -34017, -150099, -83842, 32266, -134273, -23497, -146139, -30592, -341880, 114466, -1213, -175630, -10724, -408540, 290113, 11890, -15470, 171431, 2448, -117612, 347140, -123229, -31817, -256271, 196603, 9323, 51944, -7571, -6812, 580027, 33491, -225328, 212709, 137897, -114838, -13048, -108280, 83891, -85342, -21991, -183907, -177065, 207070, 130016, -245429, -166744, 21837, 141886, 27124, -460331, 125116, 96277, -169622, -167173, 290046, 182943, -126375, -49664, 7911, 149329, 105609, 46135, 44088, -42974, 93670, 191315, -144397, -142003, -140297, -42055, -338633, 108920, -24125, 103392, 163540, -154962, 202725, -24269, -173104, -146486, 241275, -214878, -368456, -267391, 103266]
15481e3025B86254g429D2025R1614l0050b54115h737o0082C5806M689a90444m9071
15469b39515J2941i5155K7897j81412a4971k86279B89981j44564d29518C8296
15458I1637a67704C81925e7661C79426F7723k8235i6278j9793c7180A11001K6304
15447A37305J79961h0285o6647C88293j23151N455l561a4741r6625K644L3467
15436g5255E4520a05312c6195k84550d121j27897f657A97067r3039e4733B06824
15424A13820d17569B8764O1187R1187J14018E4243a24957k0933H0591L3824I749
15412a53985r2182B5061a72521L3607J5204B9915a92300a4096k57652D9208R8061
15401A47269i871j07505A21047a33560f511k4029l45634a02380o3840O2574m6078
$$ y = [-53025, 286254, -7429, 42025, 133639, 103589, -254115, -8737, -68819, 35806, 40495, -190444, -239515, -226574, -95155, -67258, -248670, -14971, -301250, 289981, 145417, -429518, 38296, 91637, -167704, 381925, -57661, 379426, 67723, 39488, -96278, -116071, -37180, 111001, 137305, 317266, -80285, -146932, 388293, 265142, 270597, 267036, -14741, -111366, -108722, -75255, 54520, -105312, -36195, -320745, -4121, -132018, -6657, 197067, 104028, -54733, 206824, 113820, -417569, 28764, 89951, 181138, 295156, 54243, -124957, -145890, 80591, 114415, 9749, -153985, -246167, 25061, -172521, -138914, -123710, 29915, -192300, -14096, -271748, 49208, 147269, -9871, -117376, 121047, -133560, -6511, -30540, -376174, -102380, -166220, -103646, -149724]
15390a49724A03985R639a21556j0306B242a22072B3256L17241i5126B48498c21984
15378g1105c4093A20282D4348K82489C1547J42616a08770A06519c94395E7548
15367A23509B4378a23622j05137f590o661A14410C6375K18J7657d42163Q7755
15356c54408H404K52945D4741a10380k3549A54656c368n2251A65313c5905i317
15344A99199g0474A19667a54841f3131j24253r4655e7832C6742J46578a69686
15333h9030C08787a10963G4753L7230J17079b9780C42196b37978h7364A22068
15322A05928b60833A02941a73529A73639M1893R7589a28618E11946a69821h0280
15311H2788O9364a98309B38004A13827P7039j9875a92905C15758b24541A6513
$$ y = [-149724, 103985, 113624, -121556, -131862, 2242, -122072, 23256, 340497, -95126, 248498, -321984, -71105, -34093, 120282, 44348, 326837, 31547, 174163, -108770, 106519, -394395, 57548, 123509, 24378, -123622, -228759, -6590, -13251, 114410, 36375, 36593, 54250, -442163, -354408, 8404, 261349, 44741, -110380, -133929, 154656, -3368, -55619, 165313, -35905, -9317, 199199, -70474, 119667, -154841, -63131, -187384, -282039, -57832, 36742, 183320, -169686, -89030, 308787, -110963, 74753, 111983, 229062, -29780, 342196, -237978, -87364, 122068, 105928, -260833, 102941, -173529, 173639, 215532, 313121, -128618, 511946, -169821, -80280, 82788, 152152, -198309, 238004, 113827, 190866, 170991, -192905, 315758, -224541, 16513]
15300A9190a39690B63638O1176a76219e233j14698d3112j02158p1783D220L48897
15289C53117l7943a81136J066D53237h1929k74243A03705J10716a77345A74049
15278C23125b05026b4589j73494l7058P2381M4245C6349j4214a22303e3121F02081
15266a1021A27439b5831A89087d1282A63109d9186B14211L23804C8898J13283
15256A52181d21319A0266k952b9524D49928d9697G8356C8611P9396A9352J48754
15245A68106h6502B46037F7242i2735h315A95069a45239D20377j49259N9o5258
15234B05919Q89228N0450K32069k63018l04308l53256J19902B69419A14558a00613
15223B29931b29533G7306O4252J39981p178a19079B43138A17641L5630b79005
$$ y = [19190, -139690, 263638, 324814, -176219, -5233, -119931, -43112, -145270, -217053, 4220, 353117, 315174, -181136, -180070, 453237, -81929, -356172, 103705, 214421, -177345, 174049, 323125, -205026, -24589, -198083, -235141, -162760, -118515, 36349, 22135, -122303, -53121, 602081, -11021, 127439, -25831, 189087, -41282, 163109, -49186, 214211, 538015, 38898, 152181, -421319, 10266, 7314, -29524, 449928, -49697, 78356, 38611, 118007, 19352, 168106, -86502, 246037, 67242, -92735, -8315, 195069, -145239, 420377, 271118, 271177, 205919, 1095147, 1145597, 1377666, 1114648, 810340, 457084, 576986, 269419, 114558, -100613, 229931, -229533, 77306, 141558, 281539, 274361, -119079, 243138, 117641, 153271, -279005]
15212C73230d4614A42117d5212I0038A4581a1368A16178A8060J12339F903a35998
15200a0954j9047B80295a92351k2488B28223i4458A10206L37981b11709E5284
15189A12551i529A69174F7808a31830A6817d26182C07822r6001g5410C34716E613
15177a76240B60676e8508A3896K8128a04705B38155q1928l5268J18627h7963A55225
15165D0827c16528C44830a44596B27876m7118D8421a4582j98692d2082A13815
15154b24922d4804l9578A37985K57793D8559a13826F6119O1019o1645J82608d6657
15142h4781A97837J97572c0891B80883N7584r7909J36362g1279A20620b42674
15131a6939E9911a37349a0426D0601L4863a32440j37A89488N2002J11663c3964
$$ y = [373230, -44614, 142117, -45212, 90038, 14581, -11368, 116178, 18060, 130399, 6903, -135998, -10954, -30001, 280295, -192351, -214839, 228223, -94458, 110206, 448187, -211709, 55284, 112551, -9529, 169174, 67808, -131830, 16817, -426182, 307822, 211821, -75410, 334716, 5613, -176240, 260676, -58508, 13896, 42024, -104705, 238155, 156227, 120959, 239586, -87963, 155225, 40827, -316528, 344830, -144596, 227876, 180758, 48421, -14582, -213274, -42082, 113815, -224922, -44804, -84382, 137985, 395778, 48559, -113826, 66119, 127138, 65493, 248101, -46657, -84781, 197837, 395409, -30891, 280883, 338467, 240558, 376920, -71279, 120620, -242674, -16939, 59911, -137349, -10426, 40601, 75464, -132440, -132577, 189488, 241490, 353153, -33964]
15119A97720k6785o0484E4297L09876k0878a7761N425d102k0415j03869q6966
15108b15352B15953G4901d996n1131B09425h8199C44921a0509A04152J88096f2064
15096a7602B12726r8865J40692p4206f0303C50090n0421A3892P4628L73182A926
15084C05118m3744l8881k0516m8321b43350A14926f9733a2621B16059A4123c5945
15072D3926B0692R5560l5406b07553C23392Q9892A26534a87161A99338Q950d3444
15060a72511B74100P9173e3432B83780k2596q3610K9556K30602a45246a931B10811
15048d9821J3321B3276b5048D4109L54929n7975m4099p5071B5650J64094o611
15037A83133H6615J952a15587C30746J6421i1848C87374a40918A32034K35883
$$ y = [197720, 170935, 110451, 54297, 364173, 343295, -17761, -12336, -4102, -24517, -128386, -215352, 215953, 74901, -4996, -56127, 209425, -88199, 344921, -10509, 104152, 292248, -62064, -17602, 212726, 113861, 254553, 180347, -60303, 350090, 299669, 13892, 88520, 461702, 1926, 305118, 261374, 222493, 201977, 153656, -243350, 114926, -69733, -12621, 216059, 14123, -35945, 43926, 20692, 116252, 80846, -207553, 323392, 413284, 126534, -187161, 199338, 208288, -43444, -172511, 274100, 353273, -53432, 283780, 261184, 177574, 207130, 437732, -145246, -1931, 210811, -49821, -36500, 23276, -25048, 44109, 399038, 341063, 296964, 221893, 25650, 189744, 183133, 86615, 88567, -115587, 330746, 347167, -91848, 387374, -140918, 132034, 367917]
15027C67917j32716a29734A08351A6992K13606m6862c3B11374L43290a64924R895
15016a55029K5692D53308F5143J5384C3474M18071i0604A59688K02790j02147
15006B60331a15107A62105N5685n3154R816G5178c274n1381E5140M0145K43933
14995C39218q9243j21689J32081L3539f4304G8960e1601B64960E7272J22789J25808
14984C05869j50763E4866Q1473J53746F6343L74549D5390J52754J09836B8982
14973A62942J88807j45449r0372J9925K63363D0502Q5945C460K63967J01447j58390
14962B10484K40805A82006J03368j17177B4149c5082A91492K83412j22131j50115
14952B02658C9697J26428B3437L56706p3224k2118E5973a91710D05560J8606A08559
$$ y = [367917, 235201, -129734, 108351, 16992, 230598, 183736, -33, 211374, 554664, -164924, -155029, -129337, 453308, 65143, 80527, 33474, 451545, -90604, 159688, 362478, 260331, -115107, 162105, 217790, 164636, 174452, 75178, -3274, -54655, 55140, 95285, 339218, 249975, 128286, 260367, 293906, -64304, 78960, -51601, 264960, 57272, 180061, 305869, 155106, 54866, 136339, 290085, 66343, 440892, 45390, 198144, 307980, 28982, 162942, 351749, 206300, 115928, 135853, 399216, 40502, 126447, 3460, 267427, 368874, 210484, 451289, 182006, 285374, 168197, 24149, -35082, 191492, 474904, 352773, 202658, 39697, 166125, 23437, 380143, 306919, 284801, 55973, -191710, 405560, 424166, 108559]
14940D36113n4754a105D75609j16763j64527G4241K57023A19944M0668J86231
14930C46843j08403p0333O446Q2236d7502C35157A19706K57356k0386J2447a51323
14918b5717C88978I5205j8903L05248k8369A20759J91902q0779K61573p133A26166
14906B26497r8096P8190J01742f242C17249J63654G0119N4700J68596r7996L2724
14895B28143Q2969k1622J28769A55086c01762i2801b3447A54569n7238J88707
14885B86038l075j1890F0528N1707f7147D81988K1393K44601C59541o5976Q7122
14874C80687a88868D42768A57085J21449C2107L56460n7018Q3811A07368R0666
14864A98034K14697A39281o7336M75668P028j6822k29071K67600k29142j18077
$$ y = [436113, 381359, -1105, 475609, 358846, 194319, 74241, 331264, 119944, 160612, 346843, 238440, 168107, 174553, 256789, -47502, 335157, 119706, 377062, 356676, 369123, -151323, -25717, 388978, 95205, 76302, 381550, 353181, 120759, 312661, 231882, 493455, 486322, 126166, 226497, 128401, 206591, 308333, -6242, 317249, 480903, 70119, 124819, 293415, 195419, 228143, 311112, 289490, 418259, 155086, -301762, -92801, -23447, 154569, 97331, 286038, 282963, 271073, 60528, 112235, -67147, 481988, 503381, 747982, 359541, 293565, 380687, -188868, 442768, 157085, 278534, 32107, 388567, 331549, 415360, 107368, 198034, 412731, 139281, 71945, 547613, 554641, 537819, 308748, 576348, 347206, 229129]
14854B29129K46584j50172K20250J31069A50238J03795K07466j22418k5347Q4976
14844C98710j26639o7704R2619B5274K75495j20903K84744J18578P044l8985k15064
14833C36183n8519M58925l36536K3421j71328R6282L4369k0306p2512J00179j69561
14822B20597j2882M03477j26142M4658J70101A68921J52880J30847k05154o6704
14812A80790J26894p4078K82710j48115r0962J67095q5942m9299J79090Q8185
14802E76368A54878M23815k4554o3288P5557B37449F7364N01444j36610J87932
14792F20130k63677R4731Q9032J91164B61885M3237N1930k7113K48783k32332
14782C46390J59905J75718H9391L29798j03620K97394B76447K39549J33249k54667
$$ y = [229129, 475713, 325541, 545791, 676860, 150238, 254033, 461499, 339081, 313734, 398710, 272071, 204367, 296986, 25274, 300769, 179866, 464610, 583188, 590232, 551247, 336183, 277664, 736589, 400053, 423474, 252146, 348428, 382797, 362491, 289979, 390158, 220597, 207715, 611192, 485050, 529708, 699809, 168921, 321801, 452648, 247494, 180790, 307684, 233606, 516316, 368201, 277239, 444334, 358392, 309093, 488183, 576368, 154878, 578693, 554139, 490851, 566408, 237449, 67364, 568808, 432198, 620130, 356453, 451184, 540216, 731380, 261885, 305122, 357052, 329939, 578722, 346390, 506295, 682013, 89391, 419189, 315569, 612963, 276447, 515996, 649245, 394578]
14772C94578J06093n4864q6040L71052k82784J66026k46302M9104K23497J45305
14762G85665k87478A89190J62035m4702o5166M70367q5958r4354A29613M30816
14752E60429n9343p6551K69112k93850K86900k06251R8774j37625M3443J99447
14742F84485q8578J33062k48864L92332j34042k93843M2445K89880O8782r3657
14732G52002k8062l9981r2483p5969O35677E64970J17517K78239j90392n4464
14722G15870r7688l05781J27426L51846j36539l08082J64215m2352K16246J13017
14712G98178C47796J64348L05113k15862j39065L57220j15199Q4974p8514K31584
14702I42395m721r2353k39512P6275J53961p3766q9299K35629K5904l53383M03403
$$ y = [394578, 500671, 445807, 359767, 730819, 448035, 614061, 367759, 416863, 640360, 785665, 498187, 189190, 351225, 306523, 241357, 711724, 625766, 531412, 129613, 560429, 501086, 424535, 693647, 399797, 686697, 480446, 579220, 441595, 485038, 684485, 595907, 728969, 480105, 872437, 738395, 444552, 486997, 776877, 845659, 752002, 723940, 683959, 591476, 515507, 1151184, 564970, 682487, 960726, 770334, 715870, 618182, 312401, 439827, 791673, 655134, 347052, 511267, 468915, 685161, 798178, 347796, 512144, 817257, 601395, 462330, 819550, 704351, 789325, 710811, 942395, 937674, 845321, 605809, 682084, 836045, 762279, 672980, 908609, 934513, 581130, 984533]
14691I84533n7571m6469o7934l03518J66130K68156m05802L4455J19019n7100
14681F33899K50961K3530m4075D11681M29973j51281k7943J73784o186j80090
14671F49938L56936l18563J04997l52673L63690K49230j72160k95738L78216n1213
14661I12660J90865n20586K78066K77888l22099K44029l3235j1445l38326K03599
14651H81416j09081K90572J17403J4183m53986O06132k72347M2597k32179k0612
14641H64098J59009j36364J51187k02737j82269M71445j37625Q5977j74551j10035
14631G88135L44769j26086J32733k46066K23618p9340K29640L93955p55578M96739
14621A402519O9788n92412K80929O5553M2021M3126j36897P1592p2062L80349
$$ y = [984533, 926962, 880493, 812559, 509041, 675171, 943327, 537525, 571980, 690999, 633899, 884860, 908390, 864315, 411681, 841654, 690373, 662430, 836214, 830028, 649938, 1006874, 688311, 793308, 440635, 804325, 1053555, 881395, 585657, 963873, 912660, 1103525, 582939, 861005, 1138893, 816794, 1060823, 1027588, 1016143, 677817, 881416, 772335, 1062907, 1180310, 1194493, 740507, 1346639, 1074292, 1116889, 884710, 864098, 1023107, 886743, 1037930, 835193, 652924, 1124369, 986744, 1072721, 898170, 788135, 1132904, 1006818, 1139551, 893485, 1117103, 1037763, 1267403, 1661358, 905780, 1402519, 1472307, 879895, 1160824, 1226377, 1268398, 1311524, 1174627, 1246219, 1174157, 1554506]
14611A554506m10593j40846j44949M14034m1438M999J91873j77151J23723j05872
14601A268286o5610R4994r5999k15044J35652L48627j18393m3453J05446j57769
14591A256737J75403J28435j89779j35890J59429n8062M42114l87813P217J38012
14581A535803m8008k31342K10240j78399O6145M41644j90147p5248J7042K32918
14571A780648j61783k8031O7839K08067K51950l96765J8727J40476k29453J61047
14561A812722M548K28870j92599j27162L45425m6710j30489j8723K32928K2189
14551B130999Q169J65625k23169J38344K55152J0234J40712J86113J23824J96151
14541C132154L67849P1640K97585O16111K56532J596290J274278K086761M333474
$$ y = [1554506, 1143913, 1003067, 858118, 1272152, 1230714, 1235713, 1427586, 1250435, 1374158, 1268286, 1202676, 1297670, 1201671, 986627, 1122279, 1470906, 1352513, 1309060, 1414506, 1256737, 1432140, 1560575, 1370796, 1234906, 1394335, 1336273, 1778387, 1390574, 1397791, 1535803, 1487795, 1256453, 1466693, 1288294, 1354439, 1796083, 1605936, 1530688, 1547730, 1780648, 1618865, 1590834, 1658673, 1866740, 2118690, 1721925, 1740652, 1881128, 1651675, 1812722, 1817270, 2046140, 1853541, 1726379, 2071804, 2025094, 1894605, 1875882, 2108810, 2130999, 2139168, 2304793, 2081624, 2219968, 2475120, 2485354, 2626066, 2812179, 2936003, 3132154, 3500003, 3571643, 3869228, 4485339, 4741871, 6338161, 7612439, 9699200, 14032674]
14532A4032674P563975J0501775k437207j2309230p469714l911738j967076q77048
14524C126411n66797j29226M7991n83517J16604m356J80488q8555j13209r0946
14514A894888K7337J82474J38805l56483L71873k55288M80955l93582K21604q216
14504B304367k17150j08377L74497J69336k07531M4866L4977J23266p4316l8261
14494B405674J42330J3123K41399j95776j19120K48975m2087J0338j45637J26949
14484B686168K07261k84425O3704L98159m3048J52782k64850K69016M28867m20583
14474C193051k51599M44300j12340J25503k11906J22837J39332j58958J61203
14465C451423J06897J34467k41697o9114L55807o6409J02370j9421k0582O5499
$$ y = [14032674, 21596649, 32098424, 29661217, 17351987, 9882273, 5970535, 4003459, 3126411, 2559614, 2430388, 2478379, 1894862, 2011466, 2007110, 2187598, 2099043, 1985834, 1894888, 1922225, 2104699, 2243504, 1887021, 2258894, 2003606, 2484561, 2090979, 2312583, 2304367, 2087217, 1978840, 2353337, 2522673, 2315142, 2360008, 2394985, 2518251, 2443935, 2405674, 2548004, 2561127, 2802526, 2606750, 2487630, 2736605, 2694518, 2704856, 2559219, 2686168, 2893429, 2609004, 2672708, 3070867, 3027819, 3180601, 2915751, 3184767, 3613634, 3193051, 2941452, 3385752, 3273412, 3398915, 3187009, 3309846, 3449178, 3290220, 3451423, 3558320, 3692787, 3451090, 3381976, 3737783, 3671374, 3773744, 3754323, 3733741, 3799240]
14455C799240o1599J35582R6874O2388O6617M71929l08383j0801l61675M70422
14445D360594J88534O0953k9998j12838J1923L02051L5036l4095n882K78946l73942
14434D681282N96872l38643K26288J31561m34778N46420N462R9297j71779L40220
14424E682202j9455J26136k47459K4533N24078n9067p3212J96480j3065j6892
14414F124279L35190j59662K82474L01514q281l78248M23487L02723l10384J89798
14404G102890K52543l2277M81554M4733n3684J16281l03227N67184j33065O3722
14394H106654M60957k8776K91575n3948K435N25601k29692K17588K56759K51968
14384I801121J52618j4845o1833K72735L19461J30616l7158M41175J17021Q4370
$$ y = [3799240, 3737641, 3873223, 3970097, 4032485, 4099102, 4571031, 4262648, 4251847, 3890172, 4360594, 4549128, 4610081, 4580083, 4467245, 4479168, 4781219, 4816255, 4782160, 4776278, 5055224, 4681282, 5278154, 4939511, 5165799, 5297360, 4862582, 5409002, 5414464, 5513761, 5341982, 5682202, 5662747, 5788883, 5541424, 5565957, 6090035, 6030968, 5957756, 6154236, 6141171, 6124279, 6459469, 6299807, 6582281, 6883795, 6875514, 6497266, 6920753, 7223476, 6913092, 7102890, 7355433, 7323156, 7804710, 7849443, 7795759, 7912040, 7608813, 8175997, 8042932, 8106654, 8567611, 8538835, 8830410, 8776462, 8778897, 9304498, 9074806, 9292394, 9549153, 9801121, 9953739, 9938894, 9877061, 10149796, 10469257, 10599873, 10562715, 11003890, 11120911, 11205281]
14374A1205281J15919N38587q4069L51655J18871K18503L34567Q1946O71431j1811
14364A3540880J73067M39280J94563j32078N39941L94854P37325j36766M63050
14355A6214116L8877O36369L49153J40823N18844P58895j56313O61678L42648
14346A9505090M16303K71129P07981K74396N72024L83110Q14400K19140Q75482
14337B4039055L52264Q15068L50271Q97123M54308P18545O66688Q46171N64188
14328B9703681Q95798M97191J039208J233482R44734R40003Q13593J256797J040415
14319C8364902J254533J239999J054934J463541J321805J734942J475432J736141
14311D9646229J762249J630861J442579K014226K203190J757245K630127K368008
$$ y = [11205281, 11321200, 11859787, 11775718, 12127373, 12246244, 12464747, 12799314, 12881260, 13552691, 13540880, 13713947, 14153227, 14347790, 14215712, 14755653, 15150507, 15887832, 15751066, 16214116, 16252993, 16889362, 17238515, 17379338, 17898182, 18657077, 18500764, 19162442, 19505090, 19921393, 20192522, 20900503, 21174899, 21746923, 22130033, 22944433, 23163573, 24039055, 24391319, 25206387, 25556658, 26453781, 26908089, 27626634, 28293322, 29139493, 29703681, 30599479, 31096670, 32135878, 33369360, 34314094, 35254097, 36067690, 37324487, 38364902, 39619435, 40859434, 41914368, 43377909, 44699714, 46434656, 47910088, 49646229, 51408478, 53039339, 54481918, 56496144, 58699334, 60456579, 63086706, 65454714]
14303F5454714K464338K494383L021635K619051L434709L218587L593114L947816
14295I0248347L701019L987245M235984M910546M802021N800040N802600N833463
14287A29321265O736330O517695P307385P783845P932402Q911770R195697J0135592
14279A93841981J0291879J1104310J1548842J2199820J2992180J3097701J4145339
14272B79222052J3920771J4457449J4537107J4791398J4276391J4590416J3731265
14265C79526849J3550123J3011236J2069767J0085508Q241754P261201N766951
14258D49513389N309035K960973J140465J464982o382547n465553n226208q659633
14250D34654903j0156047j2294800j4606830j5308979j5290336j5380206j5360031
$$ y = [65454714, 67919052, 70413435, 73435070, 76054121, 79488830, 82707417, 86300531, 90248347, 93949366, 97936611, 102172595, 107083141, 111885162, 117685202, 123487802, 129321265, 136057595, 142575290, 149882675, 157666520, 165598922, 174510692, 183706389, 193841981, 204133860, 215238170, 226787012, 238986832, 251979012, 265076713, 279222052, 293142823, 307600272, 322137379, 336928777, 351205168, 365795584, 379526849, 393076972, 406088208, 418157975, 428243483, 436485237, 443746438, 449513389, 454822424, 457783397, 458923862, 460388844, 454006297, 448540744, 443314536, 434654903, 424498856, 412204056, 397597226, 382288247, 366997911, 351617705, 336257674]
14243C36257674j5733152j4682884j4711793j3396691j3641341j3416627j3018391
14236B37656795j1883938j1821748j1155617j1032305r913892r815244q668498
14229A63365553q225657p809157p201534o794657o382343o084122n239489m938102
14221A10690492n143756m709475m402565m467003l711733l250555l709657l125259
14213G8170489l315052l107886k479316k521513k554455k259144k263070j895333
14205E7774720j893749j926596j904136j763550j561979j502855j405010j419104
14197D4397741j466690j528403r81608j504669p80398p42819j352028p06901j425198
14188C3909027p92426q82046o73126o48783j053774o71590q18514r24841o22942
$$ y = [336257674, 320524522, 305841638, 291129845, 277733154, 264091813, 250675186, 237656795, 225772857, 213951109, 202795492, 191763187, 181849295, 172034051, 163365553, 155139896, 147330739, 140129205, 133334548, 126952205, 120868083, 115628594, 110690492, 105546736, 100837261, 96434696, 91967693, 88255960, 85005405, 81295748, 78170489, 74855437, 71747551, 69268235, 66746722, 64192267, 61933123, 59670053, 57774720, 55880971, 53954375, 52050239, 50286689, 48724710, 47221855, 45816845, 44397741, 42931051, 41402648, 40421040, 38916371, 38135973, 37393154, 36041126, 35334225, 33909027, 33116601, 32234555, 31561429, 30912646, 29858872, 29187282, 28368768, 27443927, 26820985]
14179B6820985n96555o47269p80737l27537o09891r38912k01895p44315n83056
14170B1390818m97926q0387o71155j62614n74975k74287k43040q35401j48635
14161A7902398j087649J48338J72713r10613l46524r6516q09584K27500p88037
14152A4412026J27366k28304k19267k77223k51205k36638j05203m23063l01136
14143A2497353m93892Q7704l06745M8665j67924j36157m06713j2507k92917k34525
14133A0582342k654l92025r1955K1127M2250n17765r4139j7752p37155K62397
14123I054671J85822l74955Q8803l79973l14459J98050j07644p39213N13983j17975
14113H007110j51184j99051J69482r0691l75186L5924n12707J72730o6456K42373
$$ y = [26820985, 26224430, 25577161, 24796424, 24468887, 23858996, 22920084, 22718189, 21973874, 21390818, 20892892, 20812505, 20141350, 19978736, 19403761, 19129474, 18886434, 18051033, 17902398, 16814749, 16963087, 17135800, 16225187, 15878663, 15782147, 14972563, 15200063, 14412026, 14539392, 14311088, 14091821, 13814598, 13563393, 13326755, 13221552, 12798489, 12497353, 12003461, 12091165, 11784420, 11833085, 11665161, 11529004, 11122291, 11109784, 10816867, 10582342, 10579688, 10187663, 10095708, 10116835, 10159085, 9641320, 9547181, 9529429, 8792274, 9054671, 9240493, 8865538, 8954341, 8574368, 8259909, 8457959, 8350315, 7611102, 8125085, 8007110, 7855926, 7656875, 7826357, 7735666, 7360480, 7396404, 6883697, 7056427, 6989971, 7232344]
14103G232344m20551O9280j32975J58780p33290L16876m32495O4593J85168l15102
14093E992628L9210O8164r3980l70005k64462K38883J52416j87244j28358j05729
14083E341523r5206j36953j21029l8739M1631j21311n9072L20892l14091K40280
14073E057925K8796l33826k07249J61635K3657o3401l65962J84433J59515k35139
14063D410384l03290l5118Q5891j7591k22681L14879j17817m4869j39991n1126
14053C878671k70400O3498K92458k50734K1895J89346l68856K07546m5186k87928
14043C430310L95286L3150m66599K49296j1904j01143J42731l34357O8134k91133
14033C113771M02058m33884j47638K2004j54841K77499j91395K02176M9241O0830
$$ y = [7232344, 6811793, 6881073, 6748098, 6906878, 6173588, 6490464, 6057969, 6122562, 6307730, 5992628, 6031838, 6100002, 6006022, 5636017, 5371555, 5610438, 5762854, 5575610, 5447252, 5341523, 5246317, 5109364, 4988335, 4949596, 4991227, 4869916, 4810844, 5131736, 4817645, 5057925, 5086721, 4752895, 4545646, 4707281, 4730938, 4667537, 4301575, 4486008, 4645523, 4410384, 4107094, 4071976, 4157867, 4140276, 3917595, 4232474, 4114657, 4069788, 3929797, 3878671, 3608271, 3671769, 3964227, 3713493, 3735388, 3924734, 3555878, 3763424, 3718238, 3430310, 3825596, 3858746, 3392147, 3641443, 3629539, 3528396, 3671127, 3336770, 3404904, 3113771, 3515829, 3081945, 2934307, 2956311, 2801470, 3078969, 2887574, 3089750, 3138991, 3199821]
14023C199821k04404n1626j3121j2996o6887R789k34947P4140j61514L31425K2554
14012B892234l95480J13253J1882n28263Q91344n49069M8149k47249j8818L2709
14002B250692J75953k18135K7978l3866j23554O8741P4735k2734K4711K2581o8165
13991B178937p0750N5595m9845k28272L08713L2292k20122j73618L48459K04069
13981B385458j86090L59760K77696k45475K88108Q50537J106323J742080K696779
13972I275176P116125J1597196K638989j1047547p204926l578691k498893j128143
13964E169286r51078l58724k14691m38674j87234k13471l90697K85102l08294
13955B391525j16251J3234o2701q0603j26625Q737K29735m47065M16000l39642
$$ y = [3199821, 2995417, 2943791, 2930670, 2917674, 2850787, 2860576, 2625629, 2699769, 2538255, 2869680, 2892234, 2496754, 2610007, 2621889, 2093626, 2984970, 2435901, 2484050, 2236801, 2217983, 2250692, 2426645, 2208510, 2236488, 2202622, 2079068, 2147809, 2222544, 2199810, 2224521, 2247102, 2178937, 2108187, 2163782, 2113937, 1885665, 2194378, 2226670, 2006548, 1832930, 2181389, 2385458, 2199368, 2559128, 2836824, 2591349, 2879457, 3729994, 4836317, 6578397, 9275176, 16391301, 27988497, 30627486, 19579939, 12375013, 8796322, 6297429, 5169286, 4218208, 3859484, 3644793, 3206119, 3018885, 2805414, 2414717, 2699819, 2391525, 2275274, 2288508, 2225807, 2145204, 2018579, 2027316, 2257051, 1809986, 2225986, 1886344]
13945A886344J03948Q0344j79314J8088j79447q0560M05061p53872L82021q652
13935A673961L31947k12674j44160k0329J30641j19209K03660l04626J28888Q3700
13925A751799k75051q0154L29043q5557j16686k50692m0521P6199K75046l26389
13915A257037K17479k41178J00836J37760P6026m7167j52910J63956j64966O4768
13905A411641j60447m4400O27393l66330l73006L58950j48700R5387q0862P8918
13895A398544j44201J8422j33663J20049J19911p7027o0854l9812L1387K65184
13885A497940j63101k47827m1058k9589M02774r9202k38632J32695j53302K34839
13875A295537p4017k73151K92597k09004J16983P6404L1720M7621j00858P6093
$$ y = [1886344, 1990292, 2070636, 1891322, 1909410, 1729963, 1649403, 2054464, 1300592, 1682613, 1673961, 2005908, 1793234, 1649074, 1628745, 1759386, 1640177, 1843837, 1539211, 1668099, 1751799, 1476748, 1396594, 1725637, 1640080, 1523394, 1272702, 1232181, 1308380, 1583426, 1257037, 1474516, 1233338, 1334174, 1471934, 1547960, 1500793, 1347883, 1511839, 1346873, 1411641, 1251194, 1206794, 1834187, 1467857, 1094851, 1453801, 1305101, 1400488, 1319626, 1398544, 1254343, 1272765, 1139102, 1259151, 1379062, 1302035, 1241181, 1201369, 1232756, 1497940, 1334839, 1087012, 1045954, 1016365, 1419139, 1319937, 1081305, 1214000, 1060698, 1295537, 1221520, 948369, 1240966, 1031962, 1148945, 1225349, 1257069, 1304690, 1203832, 1279925]
13865A279925k93802J26143J55781j16971n8403o7433j58554K60217K51052l13164
13855A064791j80873R9754N3132j15500K1331q9717J28264M66714l61155N7980
13845A144721j59471J92425k4205l34919N3436o0035L97532l24772K1321r7495
13835H08538L20359l52181M9981k06064J91625j06855m4034L27618k76658J11504
13825H23833o3408K17840j49904J62697j02043j15765j2606k7969Q1075r0618
13815G23132J20385j8847J19699j93784Q6349j63546R2975j86084K15887j08549
13805F87617O9428J60277m56483L18828n2638K98566m3737k10665q205j91475
13795E71513J70174q0078j21425K61887j35335j22076M91297k4690l00095j36997
$$ y = [1279925, 986123, 1112266, 1268047, 1151076, 1092673, 1025240, 866686, 1126903, 1377955, 1064791, 883918, 983672, 1036804, 921304, 942635, 852918, 981182, 1447896, 1086741, 1144721, 985250, 1177675, 1153470, 818551, 871987, 811952, 1209484, 884712, 906033, 808538, 1128897, 776716, 826697, 620633, 812258, 705403, 661369, 988987, 712329, 823833, 760425, 978265, 828361, 991058, 889015, 773250, 760644, 732675, 813750, 723132, 843517, 824670, 944369, 750585, 836934, 673388, 766363, 580279, 796166, 687617, 757045, 917322, 460839, 779667, 727029, 1025595, 981858, 771193, 762988, 571513, 741687, 661609, 540184, 802071, 666736, 544660, 1035957, 1011267, 711172, 574175]
13785E74175Q6455L27164j43054j66280M6944J51231l01118L47135K5587l04638
13775F43601J83569j41681J48103Q4705l21141K15348L62436n54247K74668k15694
13765F79667n184J54198M6519C38974N39112k31627k19636N53309m17796N6520
13755F18856n723B46110O69701m21388B15027N24450j14091k83598L49365P9196
13745G70349k64726j49669K10732J95254k34581J74421j53475O5095K97809B68149
13734G23011l26964M18245j29072k92419j54528J48326K84595k23421J9546K94257
13724G61576k50502r4619R9580J52054q4284j38407K09423j65224j52385N19565
13714H56777j86452j25278J54024J30662j12010k27369M0528J10863j87899J93546
$$ y = [574175, 660630, 987794, 844740, 678460, 725404, 876635, 575517, 922652, 948239, 643601, 827170, 685489, 833592, 918297, 597156, 812504, 1174940, 620693, 895361, 679667, 674483, 828681, 875200, 338974, 878086, 646459, 426823, 980132, 562336, 618856, 613133, 246110, 915811, 494423, 215027, 739477, 625386, 341788, 691153, 770349, 505623, 355954, 566686, 761940, 527359, 701780, 548305, 613400, 911209, 268149, 723011, 396047, 814292, 685220, 392801, 238273, 386599, 671194, 447773, 467319, 761576, 511074, 416455, 516035, 668089, 583805, 445398, 654821, 489597, 337212, 856777, 670325, 545047, 699071, 829733, 717723, 490354, 530882, 641745, 453846, 647392]
13704F47392K39506k28624j8593j35445L59587D09601o3799O5903J24589k46411
13694B89883J85527j88578N00687C86283H5158L17396J3946J00916A91247N21850
13684G13097A64998N07489n0715P5474l35701K41851J15719B74934L00207q0092
13674D95049L6861j75376L30959j18675j54791j45720L72707k02992R0058A14897
13663D56343j47933O8142n580n3418J30387J61537k19119J18190j91947K42557
13653E59159k37331N99571l01068r6477q7150j90439L38045k07659L15060o5775
13643F25936r9509B18419L50030j24537B20322J69411j15848J95957R5706p7621
13633D87927B38920J00961R363j62438L12717J02838j31635A64889K47789K4570
$$ y = [647392, 886898, 658274, 639681, 504236, 863823, 409601, 345802, 411705, 536294, 289883, 475410, 286832, 787519, 386283, 85158, 402554, 416500, 517416, 191247, 713097, 164998, 672487, 621772, 697246, 361545, 603396, 719115, 274934, 575141, 495049, 531910, 356534, 687493, 568818, 414027, 268307, 641014, 438022, 528080, 114897, 456343, 308410, 376552, 370972, 317554, 447941, 609478, 390359, 508549, 316602, 559159, 321828, 921399, 620331, 523854, 436704, 246265, 584310, 376651, 691711, 625936, 526427, 218419, 568449, 443912, 220322, 389733, 273885, 469842, 565548, 487927, 238920, 339881, 349244, 186806, 499523, 602361, 470726, 164889, 412678, 437248]
13623D37248n1171j34326K07673j7060K5769n9507j77634J67627j48266K65818
13613E16171A91130K10855j95333c5461C38761M88097A21889K84641o1993J27977
13603D72514p3727L09287A82045J29582J26210J07801A06640J05311J4486m1456
13593A84981K39968E394P244M20320K59336A83825m916K81824l4064A23144K27668
13582C50812O5442o325j27131L74171A70890J97325R2740k19767j04704J44830
13572B81314K99968j52446j53505o8135M44189l17342j02598j15140L27480I6722
13561A66741M67095k35444m4484K4892A36783K16735j02936m2911o4811m4901
13551I7959K59028F7802M51892b54212A77724J47564c6291E54259r5987k11980
$$ y = [437248, 386077, 251751, 459424, 442364, 468133, 408626, 230992, 398619, 250353, 516171, 191130, 401985, 206652, -35461, 338761, 826858, 121889, 406530, 344537, 472514, 398787, 708074, 182045, 311627, 437837, 545638, 106640, 211951, 226437, 184981, 424949, 5394, 12638, 432958, 692294, 183825, 178909, 460733, 426669, 123144, 350812, 416254, 409929, 282798, 656969, 170890, 368215, 460955, 241188, 136484, 281314, 581282, 428836, 275331, 207196, 651385, 334043, 231445, 116305, 443785, 96722, 166741, 633836, 398392, 353908, 378800, 136783, 353518, 250582, 207671, 142860, 97959, 356987, 67802, 519694, -254212, 177724, 325288, -36291, 554259, 458272, 246292]
13541B46292K96985p8714k15798K84499A45539B8319M4551K41500j26364o9058
13531A18948M65433j51157A15141K8031a6407A76241J53233P091A49071J20851
13521B69922e1721D08831P3235m8383j00326A64838J43606j50876L7111K30680
13511D25359D4110l734J08353D4861d627C63752F2860M46146B37236J41518r5119
13500B83635j33517J56473J78024B17724n4327F425O05826k09879F069L40006
13490C46075j62196L4228D3003K92342a38316B08418n595J39937C8461L25129
13480C63590n4308A11856O6301a28374C55204E5647b5352B57826k9161A8203K08716
13469B26919K71911j53649J30131G7472K03962o8915I5972K29561r200p586J45800
$$ y = [246292, 543277, 464563, 248765, 533264, 145539, 28319, 72870, 314370, 188006, 118948, 584381, 433224, 115141, 143172, -16407, 176241, 329474, 336565, 149071, 269922, -51721, 408831, 482066, 433683, 333357, 164838, 308444, 157568, 194679, 425359, 44110, 40376, 148729, 44861, -4627, 363752, 62860, 509006, 237236, 378754, 283635, 150118, 306591, 484615, 217724, 163397, 6425, 612251, 402372, 6069, 346075, 183879, 218107, 43003, 335345, -138316, 208418, 202823, 342760, 38461, 363590, 309282, 111856, 178157, -128374, 355204, 55647, -25352, 257826, 228665, 18203, 226919, 498830, 345181, 475312, 77472, 281434, 212519, 95972, 325533, 316333, 308747, 454547]
13458D54547k17334r1057J59673m2215a21053A25487J14830J3951A23684J47690
13448B71374J20603D7855a27582B1713a440D01541q3042r4424J48244J32466I6396
13436A42785K36596O4667e7561B12552j0519F7077J51402R0618F5675O29209B05464
13424B07646N9607i6606D0538M90993a95584B28634J81306q0019A1038L89841
13414D00879C4669K34400q146j993J0123A01796c1752A03949J47619I9989A1484
13402A81526L06030j41426m7756J12459j70252J14208I5421N7594P2983r517M8614
13391B65095j2164b42447A60520J43392J01681E0595L54720J9293j80664O7478
13381C11422r4427k8443m6594J5163A5714J57115E0453K8556J39971a79271B82788
$$ y = [454547, 237213, 146156, 305829, 263614, -121053, 125487, 240317, 254268, 123684, 271374, 391977, 47855, -127582, 21713, -1440, 401541, 318499, 224075, 372319, 504785, 96396, 142785, 379381, 444048, -57561, 212552, 202033, 67077, 218479, 309097, 65675, 694884, 205464, 207646, 267253, -96606, 40538, 531531, -195584, 228634, 409940, 329921, 11038, 400879, 34669, 269069, 260923, 258930, 269053, 101796, -31752, 103949, 251568, 99989, 11484, 181526, 487556, 346130, 298374, 410833, 240581, 354789, 95421, 153015, 225998, 216481, 265095, 252931, -242447, 160520, 303912, 405593, 50595, 405315, 424608, 243944, 311422, 216995, 188552, 141958, 157121, 15714, 172829, 50453, 79009, 218980, -179271, 282788]
13369A52445a89408A32990e4087B57832g458B34366G1420c1572I4385a02125A77735
13357A11732k0271L63319H498Q6337K7444J82754G4641O9425J75596A50828K3587
13346A74415M1252I5894J73481G8431L89743B27258j02897J18063M8167M0258
13336C30849I9291B8616L09778K8151J38750j22948j01561m6798m173I1347k8646
13325F2701J22922J53255J16439j12315i556A20259G990K54742K05511j85321
13315B82922h2120A98776f7359B62128N5325j1240j12893J6455J4688H0604a0920
13303A78566l4165n0690J07900E7511M39076H0354A5533R6337a2355B58395L766
13292B62161B1807c36991E03946F487L99259C1158J19116R4795j15952O2904J57284
$$ y = [152445, -189408, 132990, -54087, 257832, -7458, 234366, 71420, -31572, 94385, -102125, 177735, 111732, 91461, 454780, 8498, 94835, 122279, 305033, 74641, 144066, 319662, 150828, 174415, 215667, 95894, 269375, 78431, 468174, 227258, 124361, 242424, 290591, 330849, 99291, 28616, 338394, 366545, 505295, 382347, 280786, 233988, 229815, 91347, 62701, 185623, 338878, 455317, 343002, -9556, 120259, 7990, 262732, 468243, 282922, -82120, 198776, -67359, 262128, 317453, 306213, 193320, 209775, 224463, 80604, -10920, 178566, 144401, 93711, 201611, 57511, 496587, 80354, 15533, 111870, -12355, 258395, 262161, 21807, -336991, 503946, 6487, 405746, 31158, 150274, 245069, 129117, 192021, 349305]
13281C49305K4499j57880D3520J98140p527b55899A56232D8546a73716c1919D40919
13269A46560e8612C65086J21667c8760A2528g5629C05646j09142B6393e6558k80681
13258c37239B98279e0511B92390k1331d4565J4634r1502A93558n0420g6780I1317
13246C80902a42715e1553C34491c298B1341M5595e8835m005B75487o9755C6417
13234B6704K16924r7633J45818L1317j34461D0664J12003K60700B9530J77601
13224B07131o7534k260b3591G8307K82587D2802R0702D7027L57505A58097l3964
13213A24133M8854a86019B62179n4829a66040E14249A07354M4889L0633e5390
13202A70303o5035K06376A05519b27935J01700I6561M1350o7481L32353j61139
$$ y = [349305, 373804, 215924, 43520, 241660, 234133, -255899, 156232, 48546, -173716, -31919, 440919, 146560, -58612, 365086, 486753, -38760, 12528, -75629, 305646, 196504, 26393, -56558, -337239, 298279, -50511, 292390, 271059, -44565, -29931, -121433, 193558, 143138, -76780, 91317, 380902, -142715, -51553, 334491, -3298, 21341, 66936, -58835, -62840, 275487, 205732, 36417, 26704, 243628, 145995, 291813, 323130, 188669, 40664, 152667, 413367, 29530, 207131, 139597, 137337, -23591, 78307, 360894, 42802, 133504, 47027, 404532, 158097, 124133, 172987, -186019, 262179, 207350, -166040, 514249, 107354, 152243, 182876, -55390, 170303, 105268, 311644, 105519, -227935, -126235, 96561, 137911, 70430, 402783, 241644]
13192B41644b0288A04803K08351j34699K35292b66543B74625j24564b36127i7679
13181a75401e5908K6528I3242b0263B25805A6616M39775b7218A93920c91018A29612
13169A62610p5168L37566a2509D02968l9607B4322K86596A13992M741G252M45134
13158D52386i6806K8806A27052D667J29934k3807L6379m6181f8591C23581b7135
13146C53111i717o971m947A98862j1318a3952o4017A78263r559a98572A82998
13134F0959J61093a35704a9961I9902a58619E0294q159a14854F1024L35623a27042
13122C96219a30377A77474o7199m3354N04563A09300f1971F5307b79637F5148
13111i5191l3942f839A82555J13351c43247A8982b11763A17709g0720A03052a64647
$$ y = [241644, -20288, 104803, 313154, 178455, 413747, -266543, 274625, 150061, -236127, -97679, -175401, -55908, -29380, 93242, -20263, 225805, 16616, 456391, -27218, 193920, -391018, 129612, 162610, 87442, 425008, -12509, 402968, 363361, 24322, 310918, 113992, 118733, 7252, 452386, -96806, -68000, 127052, 4667, 134601, 110794, 147173, 100992, -68591, 323581, -27135, 353111, -9717, -16688, -21635, 198862, 187544, -13952, -77969, 178263, 168704, -198572, 182998, 60959, 222052, -135704, -19961, 99902, -158619, 50294, 42135, -114854, 61024, 396647, -127042, 396219, -130377, 177474, 110275, 66921, 571484, 109300, -61971, 65307, -279637, 65148, -95191, -129133, -6839, 182555, 295906, -343247, 18982, -211763, 117709, -70720, 103052, -164647]
13099h8750k77388C9079a09223B51532a22400L5499G9162C2275J7782L06975G8304
13087B09453F3920N2612a67006B19610l0250a16653K7272A2588f0725E02040A75729
13075i4477k1760E7062c99196J67001A50585b40488B18560A7023L77822j16240
13065B78605A20540K9688J41122N6585B142L46127b64337F4868J44385K21417
13055D30670A40263b03480I5093J17240q0168b17749O0375A34757J45205b98659
13044b16417j8233B06202e4751k9590a9407I9068l6710J16937n8737b976A90045
13032F2579A8484K37614A2483K11359a10817A97538G1271O03254A83765K26888
13022D10653k4615a24117J5516k4995i967C89345A01870K49585a40122M1670A01495
$$ y = [-88750, -366138, 39079, -109223, 251532, -122400, -86901, 79162, 32275, 50057, 357032, 78304, 209453, 63920, 116532, -167006, 219610, 189360, -116653, -89381, 12588, -60725, 502040, 175729, -94477, -116237, 57062, -399196, -232195, 150585, -240488, 218560, 17023, 394845, 278605, 120540, 150228, 291350, 347935, 2142, 348269, -264337, 64868, 209253, 430670, 140263, -203480, 95093, 212333, 132165, -217749, -157374, 134757, 279962, -298659, -216417, -234650, 206202, -54751, -84341, -19407, 99068, 62358, 179295, 120558, -2976, 190045, 62579, 18484, 256098, 12483, 223842, -110817, 197538, 71271, 674525, 183765, 410653, 386038, -124117, -108601, -133596, -9967, 389345, 101870, 351455, -140122, -98452, 101495]
13010B98544o6258R4792E5433N9397b3589A5770J95226J0252j9355q4096E8509
12998A41512h499k28372C74695I8196J98744A923a52390j74135B77835j03593
12988A74242B0127a30118K4066A77263e380A36989n4226j7939J06703l5608E0484
12976H4811c5372A42589o7114R7551i8047f020I4712K56766B4694O5284K19154
12965C09132a99020A05811i4852A10367j6995J4h6016P042A26450J01087a33758
12953C42200A15064i4395k13501D0859a34146d0361q9118a5948j05640j44000
12943b65588D286b8460o3660b9569c89j24641B2556b92764A06124B4115k034K26505
12931B48586a0624o358A51816b52254d7895G5722O7526m5372J20718J53484A29778
$$ y = [298544, 232286, 327078, 55433, 114830, -23589, 15770, 210996, 221248, 201893, 117797, 58509, 141512, -8499, -236871, 374695, 98196, 296940, 1923, -152390, -326525, 277835, 174242, 20127, -130118, -106052, 177263, -5380, 136989, 82763, 64824, 171527, 135919, 50484, 84811, -35372, 142589, 75475, 173026, -98047, -6020, 94712, 351478, 24694, 89978, 309132, -199020, 105811, -94852, 110367, 93372, 93386, -86016, -78974, 126450, 227537, -133758, 342200, 115064, -94395, -307896, 40859, -134146, -40361, -129479, -15948, -121588, -265588, 4286, -28460, -92120, -29569, -389, -125030, 22556, -292764, 106124, 24115, 22081, 248586, -10624, -16982, 151816, -252254, -47895, 75722, 143248, 97876, 218594, 372078, 129778]
12919a6537A02262K0547C522J87726a60324P7068c8991q1027A66375f0296b1890
12907a2837j06826C97852a57137A77126a5454o3678B72648a76015E69006b01608
12896A90034d9725H6895f2009B5861K67654A41894K85715j59911E2215L0966L2214
12885A15395J53137D9402a66111A64476n1050m6248L045b49431o3468D00709a6489
12873a16746K626j26780C22964C1722J36059p8077M0589A6048p686Q242a2395
12861C68002I1652a50765f1953b6649l67974F7591a11691H3898K64808c07377
12850c06344B24782l4492I3434c6266A23849f0177j5586B07559e2916I0605k1275
12839F9330e8127r031k3020p9508D189K40786k5186j01668J24984K39278B10293
$$ y = [-16537, 102262, 122809, 3522, 191248, -160324, -83256, -38991, -120018, 166375, -60296, -21890, -12837, -119663, 397852, -157137, 177126, -15454, -79132, 272648, -176015, 569006, -201608, 190034, -49725, 86895, -62009, 25861, 293515, 141894, 427609, 267698, 52215, 83181, 115395, 268532, 49402, -166111, 164476, 113426, 67178, 70223, -249431, -312899, 400709, -16489, -116746, -114120, -240900, 322964, 31722, 167781, 89704, 130293, 16048, 8362, 16604, -12395, 368002, 91652, -150765, -61953, -26649, -394623, 67591, -111691, 83898, 348706, -307377, -306344, 224782, 190290, 93434, -36266, 123849, -60177, -75763, 207559, -52916, 90605, 69330, -58127, -67158, -90178, -169686, 4189, 244975, 219789, 118121, 243105, 482383, 210293]
12827I277b54952G7169A2316a24987b8029p2618j2319B78065A5982Q6398k0369
12816H2011g274H1702c29926b419j27710j5151I0906l0948e6992B20956e1120
12804C9180P6758A7899A296M7189g2032A74335k4082a9226q1604L8740m4163A34282
12791e1798A66643h454r8991D2070b21771A97504J13672n5595c21772C8168b54504
12779a11161C1707M1601J27199j3487b49208I7375J65420d33896J26421A0837
12768g6043b4600A82921g724B42235a59341E8818c22792B23783E5113L0540L55026
12757D40679b79841f602j58593c7242j1289p8533j09387c262B9196J02629L4350
12746A66175J094a01722A728f2024F8449g2567a9261j41728O2797a9604E9784
$$ y = [9277, -254952, 77169, 12316, -124987, -28029, -100647, -112966, 278065, 15982, 102380, 82011, -7274, 81702, -329926, -2419, -130129, -145280, 90906, 59958, -56992, 220956, -51120, 39180, 115938, 17899, 1296, 48485, -72032, 174335, 150253, -19226, -100830, -62090, -106253, 134282, -51798, 166643, -8454, -107445, 42070, -221771, 197504, 311176, 255581, -321772, 38168, -254504, -111161, 31707, 73308, 200507, 187020, -249208, 97375, 262795, -433896, -307475, 10837, -76043, -24600, 182921, -7724, 242235, -159341, 58818, -322792, 223783, 55113, 85653, 440679, -279841, -6602, -165195, -37242, -48531, -127064, -236451, -3262, 29196, 131825, 166175, 167269, -101722, 1728, -62024, 68449, -72567, -19261, -160989, -98192, -19604, 59784]
12734a2699B3993J25087a41802o0999I0106h7298B64575a92835p9735g0701j5189
12723h5890A44851a7224k46848A8041L8765J12023B8218J52507j1478a20395b4385
12711c0885j77183B39487m5164f5207A33486J26806r2908b4877I4639j7744b68599
12699D9745b9388q750C0255M06500c5349l0317A89699M7822I896N65390k17325
12688C57961l3457j46651a23093L2399l9465J1668d1063A18713E5921a88928F7155
12676A53128a39764G1241D477J39144K41862e1843B24383B1729a98104C07920
12665H0182L20265h4524A78066J54782c4830m0538B47322G4319i0264B90119b3495
12653D5738L52625j71686a58540m40953A79794H8892i3533q7813B11906a47550
$$ y = [-12699, 23993, 149080, -141802, -202801, 90106, -87298, 264575, -192835, -272570, -70701, -85890, 144851, -17224, -264072, 18041, 56806, 168829, 28218, 180725, 169247, -120395, -24385, -30885, -208068, 239487, 194323, -65207, 133486, 260292, 167384, -24877, 94639, 76895, -268599, 49745, -29388, -38138, 30255, 436755, -35349, -65666, 189699, 237521, 9896, 575286, 357961, 324504, 177853, -123093, -90694, -130159, -118491, -41063, 118713, 55921, -188928, 67155, 153128, -139764, 71241, 4477, 143621, 385483, -51843, 224383, 21729, -198104, 307920, 80182, 400447, -84524, 178066, 332848, -34830, -75368, 247322, 74319, -90264, 290119, -23495, 45738, 398363, 226677, -158540, -599493, 179794, 88892, -93533, -181346, 211906, -147550]
12642A13686C382m2K30544e3989K2413A23751j3900c017j8490A43092E290g6727
12629C12665a19250L5838k8126k99227H6197d7586D68041e9567C54220p1884f1597
12617A82854M3263a06629A34777e6796B95189O4996F8028Q7285J51088j27544
12607A78857J10723D894J03780a16220d2079A23325l118j0682a92430a7584B33444
12595b78343a21035E4656c8910A50147l567a25591e7331m1016B73228A08082H246
12583D82124a41416A75389j4279J4470R882E102Q9637N9620F7025K03818e4342
12571C02304b1560j01848C24563I908L45285b5529O685p5373j5802q77D9496R9014
12559A48510a90719A50253o9334J55390H676b9293B17394n2408E1303K19747G5203
$$ y = [113686, 3382, 3340, 233884, -53989, -31576, 123751, 109851, -3017, -21507, 143092, 5290, -76727, 312665, -119250, -83412, -111538, -410765, 86197, -47586, 468041, -59567, 354220, 282336, -61597, 182854, 226117, -106629, 134777, -56796, 295189, 360185, 68028, 155313, 306401, 178857, 289580, 4894, 108674, -116220, -42079, 123325, 120207, 109525, -192430, -17584, 233444, -278343, -121035, 54656, -38910, 150147, 146580, -125591, -57331, -98347, 273228, 108082, 8246, 482124, -141416, 175389, 161110, 175580, 185462, 5102, 94739, 154359, 67025, 270843, -54342, 302304, -21560, -123408, 324563, 9908, 355193, -25529, -18844, -94217, -110019, -110896, 49496, 148510, -190719, 150253, 80919, 236309, 8676, -29293, 217394, 164986, 51303, 271050, 75203]
12547a26130H898a07482M3259E0692L24027c68386f0212m3755F7203J29056R9806
12536B96065a71501D1522b80536A21833a92353N7986A9411K02531b50277E129
12525b52756A93161A8951a50481A19863E2783K22746b27321J4291g6674L5241
12515d1433C9277N8531b16923e6626B74894F9803B9850J38157K83412d23994H5255
12503a20276B62917A7449M2620g6952C2943J50081o0436a31293l9564K9124A29302
12491b5365A15490b97715g3708B11070l3843a06656G6204l960b50916D294L5058
12480C9352b395I6468J15055G3165a20755B34509D1539i3920l4729M2445D9065
12468B9485K1048a98492g7748e626A38247a44890p1583d628j21576o8366A28055
$$ y = [-126130, 8898, -107482, -64223, 50692, 374719, -368386, -60212, -103967, 67203, 196259, 296065, -171501, 41522, -280536, 121833, -192353, -134367, 19411, 221942, -250277, 5129, -252756, 193161, 18951, -150481, 119863, 52783, 275529, -227321, -213030, -76674, -41433, 39277, 97808, -216923, -56626, 274894, 69803, 29850, 168007, 451419, -423994, 85255, -120276, 262917, 17449, 60069, -76952, 32943, 183024, 122588, -131293, -170857, -141733, 129302, -25365, 115490, -297715, -73708, 211070, 177227, -106656, 76204, 72244, -250916, 4294, 39352, -2395, 96468, 211523, 73165, -120755, 234509, 41539, -93920, -128649, -86204, 49065, 29485, 50533, -198492, -77748, -5626, 138247, -144890, -216473, -4628, -126204, -194570, 128055]
12456a1770r0549M3035A34790h763j77477C24401A25923a79420A99439c49F9040
12444a29744A24802b14211e453j27227j01332e8580E8427A7038n572a2172p9391
12433i1563B13995A03192D3992a88588I0959A4094L06107j34586c35468F0051
12422F7158g6980k5677l0881j35246G7601a05009A18143a5636k38428i7803j08142
12411b05945q9014C62692h4458j19399k5534e6762b0130F255J52528a33323B34860
12399c55331e4689j69515K0490e3686k11664E9402N3788A5716O1724b5245j76808
12388b02053C23394a62619C5875a88841A36181K9754J47947G7716d50076H4724
12377B79270a9780A7771d8854l6101n3615A03756a020k1776R810j16923A55470
$$ y = [-11770, -102319, -59284, 134790, -8763, -186240, 324401, 125923, -179420, 199439, -349, 69040, -129744, 124802, -214211, -5453, -132680, -234012, -58580, 58427, 17038, 11466, -12172, -91563, 213995, 103192, 43992, -188588, 90959, 14094, 320201, 185615, -335468, 60051, 67158, -76980, -102657, -133538, -268784, 77601, -105009, 118143, -15636, -254064, -97803, -205945, -294959, 362692, -84458, -203857, -229391, -56762, -20130, 6255, 158783, -133323, 234860, -355331, -54689, -224204, -203714, -53686, -265350, 59402, 113190, 15716, 77440, -25245, -202053, 323394, -162619, 35875, -188841, 136181, 165935, 313882, 77716, -450076, 84724, 279270, -19780, 17771, -48854, -84955, -138570, 103756, -1020, -22796, -12986, -129909, 155470]
12365h229B77820H9880a18841B52034g4479C3716a90486f201A06400d5448j47667
12354a93115C21687C6919J18797b00722g9478A14919J35168o7052a34188C2282
12343H9616M718b0189B402f9116A36121a09713A8688a42203e7923A32140o4156
12332F7984b74925C63394o4803B5855a05562B5384b18246G6647a86087P6162A05197
12320A55855D6808A5254b68950d2455A6365m82K11918f1699D197Q5942d50165
12308H7238L4358c5993B50830r5044i930A90542B6313O6975Q2057G611J1404J87260
12296B06275c03287B91994A22379b04257E6572J63693a97450A646a5083A13406
12285h7492j9407j23816B2864P8539b14446C60844c19868F0701a128A03042a04304
$$ y = [-8229, 277820, 89880, -118841, 252034, -74479, 33716, -190486, -6201, 106400, -45448, -193115, 321687, 36919, 155716, -200722, -79478, 114919, 250087, 183035, -134188, 32282, 89616, 94334, -20189, 2402, -69116, 136121, -109713, 18688, -142203, -57923, 132140, 67984, -274925, 363394, 298591, 25855, -105562, 25384, -218246, 76647, -186087, -109925, 105197, 155855, 46808, 15254, -268950, -42455, 16365, 15883, 227801, -61699, 4197, 90139, -450165, 87238, 121596, -35993, 250830, 155786, -9930, 190542, 26313, 93288, 175345, 7611, 19015, 206275, -303287, 291994, 122379, -204257, 56572, 220265, -197450, 1646, -15083, 113406, -87492, -106899, -230715, 22864, 101403, -214446, 360844, -319868, 60701, -1128, 103042, -104304]
12273A6999a58918j0204E7814L96475C7477J52450a19196d4163q4915C9597i695
12261c8585B02989p86K4624J31076A75433e6730A46496D3618J9700K91165I8610
12249a94961A5001J2622c22830a3684B25080f8886j98479A41069F6842B9789b54336
12237a39342A58218E3496J67215I9539b31334c5806A4988e3451A30961A0381a39788
12225B12998r6615c7406I351J01799J86713M8255h3655o6208k9205c4533B50471
12213C36536G8670J24365q99m7992J57569G5641J26135b0893I8393P2997K18191
12202C89581j37651K9228a05821A45025O6453b5879B0400J52588l4291e8050A29954
12190B57400Q7961a5828P217k95924A39370D2623L35630j69068J68281g9437B48595
$$ y = [16999, -158918, -169122, 57814, 454289, 37477, 189927, -119196, -44163, -129078, 39597, -9695, -38585, 202989, 202203, 226827, 357903, 175433, -56730, 146496, 43618, 63318, 354483, 98610, -194961, 15001, 27623, -322830, -13684, 225080, -68886, -267365, 141069, 66842, 29789, -254336, -139342, 158218, 53496, 220711, 99539, -231334, -35806, 14988, -53451, 130961, 10381, -139788, 212998, 116383, -37406, 9351, 111150, 297863, 346118, -83655, -149863, -179068, -34533, 250471, 336536, 78670, 203035, 202136, 154144, 311713, 75641, 201776, -20893, 98393, 171390, 389581, 251930, 281158, -105821, 145025, 211478, -25879, 20400, 172988, 138697, -58050, 129954, 257400, 345361, -15828, -8611, -304535, 139370, 42623, 378253, 209185, 377466, -79437, 248595]
12178b06815A19531L4998M2955c7168B33436j07541A8768O2768B0915N408c2309
12166a05476A54150m1236n1754J8865K7290b6788B57193o65c2653I3022L0771
12155A23793a06292B77687m3478j15592M1730c1559A8111J65888P3861A17059
12144A42772F0958J90056D5108J80105a00866D9486Q7603Q7843a35011H5125a48908
12132f0850r2789F7038K86786j48804g3838A27485a24546C07080G4598c4997J7350
12121a7647k38431B17211A3094f3585E8276a01543F657a89065c4779q7431G3937
12109g3800A54760L2151i0537A05492m9179a40202K2854b7211j00598I1028c00399
12097a98944B70778c8264F3339M4674i1523B38540A01730L0823a01116o5784E7692
$$ y = [-206815, 119531, 154529, 197484, -37168, 233436, 125895, 18768, 81536, 20915, 26323, -32309, -105476, 154150, 112914, 61160, 80025, 107315, -26788, 257193, 256528, -32653, 93022, 123793, -106292, 277687, 234209, 118617, 160347, -31559, 18111, 183999, 257860, 117059, 142772, 60958, 251014, 45108, 225213, -100866, 49486, 137089, 224932, -135011, 85125, -148908, -60850, -153639, 67038, 353824, 205020, -73838, 127485, -124546, 307080, 74598, -34997, -17647, -256078, 217211, 13094, -63585, 58276, -101543, 6657, -189065, -34779, -122210, 73937, -73800, 154760, 186911, -90537, 105492, 56313, -140202, -117348, -27211, -127809, 91028, -300399, -198944, 270778, -38264, 63339, 108013, -91523, 238540, 101730, 132553, -101116, -166900, 57692]
12085G3664a61457b8294B16935j3373f6288l52189A97766j6321r0661A9849K61065
12074B80914j19105L7028A4226M4560A5915J71641B245J25482i1369C77903L94432
12063G72335N91637k69593B71999k70j3045B7309J85559b1427j91245C79437A04945
12051a63123A6236Q7356K0350N409K10168b14158I797K89607c14184J1027c2121
12039c79219b6930A94664c74158b041k89524b0877G9787c77339B62829h596k2582
12028c1178A25943f6631A47077o6128J31358b93716A91417b0447A39323a08302
12017a81389P7748H6017j3933C0113P743L19202b34794C3532O03c3361I5480N7392
12005A52872l9331a63971N288A92208b38232P0845E6595b02346f1311q0289j32258
$$ y = [73664, -161457, -28294, 216935, 203562, -66288, -418477, 197766, 181445, 90784, 19849, 280914, 161809, 198837, 14226, 58786, 15915, 187556, 2245, 127727, -91369, 377903, 772335, 1363972, 1094379, 271999, 271729, 258684, 27309, 212868, -21427, -212672, 379437, 104945, -163123, 16236, 103592, 123942, 129351, 339519, -214158, 9797, 299404, -314184, -303157, -32121, -379219, -26930, 194664, -374158, -2041, -291565, -20877, 79787, -377339, 262829, -8596, -31178, 125943, -66631, 147077, 80949, 212307, -293716, 191417, -20447, 139323, -108302, -181389, -103641, 86017, 72084, 30113, 37856, 357058, -234794, 33532, 34135, -33361, 95480, 152872, 113541, -163971, -158683, 192208, -238232, -167387, 56595, -202346, -61311, -141600, -273858]
11994b73858a35401K2655C35352a2811k35955M0850R274d9395A88862g6689p5653
11983a52342j44328A26850C8090i3875A9322K47801c58538a19947C08580b13915
11972A58208l6342c4865G722c8049B00921D6154M9018R280c49766J00702A48551
11960d8803I6257j2299J84652b69336p2888A8888L3212c37048h4459B2637J94881
11949B17518d2856i255B96883J8976E8131J65728B2901L47700d8194C32623A14365
11937C85189b26055D5121J44787b4052H1667J10794q3821c84930a031q3880A68484
11925h0916B00342D797d4182A6906J80332d0029H5801j8101b0527j27859C41876
11913a24409a9020k01152q7448D4590a99699D641a3512I5779j0454J11218b59584
$$ y = [-273858, -135401, -112746, 335352, -12811, -248766, -207916, -198642, -49395, 188862, -76689, -152342, -296670, 126850, 38090, -93875, 19322, 267123, -358538, -119947, 308580, -213915, 158208, 121866, -34865, 7722, -38049, 200921, 46154, 95172, 104452, -349766, -249064, 148551, -48803, 96257, 83958, 268610, -269336, -342224, 18888, 52100, -337048, -84459, 22637, 217518, -42856, -9255, 296883, 315859, 58131, 223859, 22901, 370601, -48194, 332623, 114365, 385189, -226055, 45121, 189908, -24052, 81667, 192461, 108640, -384930, -1031, -84911, 168484, -80916, 200342, 4797, -44182, 16906, 197238, -40029, 85801, 67700, -20527, -148386, 341876, -124409, -19020, -220172, -307620, 44590, -199699, 4641, -13512, 95779, 85325, 196543, -259584]
11901b3103j45203A04667b16101B4388c2781l75676a26080r8009C31872b34695
11890c28135a36335H7454K7920D0216b88612f4821H3855B7148R1515N1289J6244
11879A86196B3687e1359l7986D4078a65374Q2405n8245B95737A3271a15310A68557
11867c19381L1647L666a31616A64744a40141p5702R5538A31531a3791C79122j63905
11856B15217f1924A61543D1074i9867n5228F0657a87440A358J01370i40k22688
11845b23628i0161j9533A76430R2734j12175L1101p1920e855A03014Q7619a58837
11833f5978B0507J80928J95864E9305L04131D0957J22963a32101A24057f3432
11822A5904a3532H4343a00202k43099b9738j23853A60935C7319a74392k03651
$$ y = [-23103, -168306, 104667, -216101, 24388, -32781, -408457, -126080, -224089, 331872, -234695, -328135, -136335, 87454, 115374, 40216, -288612, -64821, 83855, 27148, 118663, 169952, 186196, 23687, -51359, -89345, 44078, -165374, -82969, -141214, 295737, 13271, -115310, 168557, -319381, -287734, -284068, -131616, 164744, -140141, -215843, -120305, 131531, -13791, 379122, 215217, -61924, 161543, 41074, -99867, -155095, 60657, -187440, 1358, 102728, -940, -223628, -90161, -109694, 176430, 269164, 156989, 188090, 116170, -5855, 103014, 190633, -158837, -65978, 20507, 201435, 397299, 59305, 363436, 40957, 163920, -132101, 124057, -63432, 15904, -13532, 84343, -100202, -343301, -29738, -153591, 160935, 37319, -174392, -378043]
11812c78043A27948i4394D7295a35742k08800J27061R9560a8293l72191A70175
11801A3965N056b69728H8d2171k33804F8901a01812j2341A76400h998l6276a4206
11788f0465A54747K84177r0607A07268n0724a02597l59822a77590j59082A23189
11777a28917J6915n5817A03201a18085a154A99715c5544o8060B02574l0507c32592
11765d7042F4476b31610E3946K08985b75389f3045j34819o3159B30235f3197k62771
11754c25968H6354d9738j00064B59629h8868c8737A15306a06754A7748f4285n9522
11743a23807m4224B39861h4714B22867a41271A44517Q7052f0880H7186a78039
11732B2011K38334b46979n2786G1315M00j3672j7213K07961O2684a12361F7205
$$ y = [-378043, 127948, -94394, 47295, -135742, -344542, -217481, -117921, -18293, -390484, 170175, 13965, 19021, -269728, 88, -42171, -275975, 68901, -101812, -114153, 176400, -8998, -45274, -14206, -60465, 154747, 438924, 348317, 107268, 56544, -102597, -462419, -177590, -336672, 123189, -128917, -112002, -167819, 103201, -118085, -1154, 199715, -35544, -103604, 202574, 172067, -332592, -47042, 64476, -231610, 53946, 262931, -275389, -63045, -197864, -261023, 230235, -63197, -325968, 86354, -49738, -149802, 259629, -88868, -38737, 115306, -106754, 17748, -64285, -123807, -168031, 239861, -84714, 222867, -141271, 144517, 231569, -60880, 87186, -178039, 22011, 260345, -246979, -299765, 71315, 71715, 58043, 40830, 248791, 311475, -112361, 67205]
11720a55411B50519C2828j918J43011R0288b46819p0169J50943E4446b16524A38977
11708e9464j24171A39054c40066F1173a42623B27351A3319b42673C99042c2631
11697C112a8900D04421B6198i9113B27126a7029A20353a0624j24989N7059b3260
11685H1821C8794M0318a20777j83514Q5800b6992B81903A35303a08174C59246
11674d7236j36423c4862F6362f4509k69959B61161j28157j3245K23769a32723
11663B08915g7310A19838O3766m5741a43372M1266l17367C0681K86826b8467k10161
11652b38628B08883b45809j27172h4064A24700c78328a30879A57958J4884M3711
11642B16553b41585A50612o1999J31905N9399C2478c4405D8064a46287A48825
$$ y = [-155411, 250519, 32828, 30910, 173921, 264209, -246819, -316988, -166045, 54446, -216524, 138977, -59464, -183635, 139054, -340066, 61173, -142623, 227351, 13319, -242673, 399042, -32631, 3112, -18900, 404421, 26198, -99113, 227126, -17029, 120353, -10624, -135613, -78554, -23260, 81821, 38794, 79112, -120777, -304291, -218491, -26992, 281903, 135303, -108174, 359246, -47236, -183659, -34862, 66362, -64509, -334468, 261161, 133004, 119759, 343528, -132723, 208915, -77310, 119838, 183604, 137863, -143372, -102106, -419473, 30681, 317507, -28467, -238628, 208883, -245809, -372981, -84064, 124700, -378328, -130879, 157958, 172842, 216553, -241585, 150612, 88613, 220518, 279917, 32478, -34405, 48064, -146287, 148825]
11631D2961R2758o1979i0832A89176b12902f4825p9485A39672Q7115G7344B3107
11619G1740P873b69210A6884f2019K0978C92236c38800A76718j8828I34K20284
11608B21218E3467a9596A63526f4422B26483b77534i5295M6883A4519d38652A83086
11596A10166c51468A40583j1532J91181b3843c788m6231E5338L72512a6204j25114
11585a41318B39454n6680E8871J28710L08860b5623G6868J00054F857h5842n5041
11574a40883A82757a198B02088J65695b6660A73588f7772c2523J4328A22219i3448
11562E6661Q3063K79970f1144k55847a8122f991A78186E4795J05572B0312b31585
11550a44748C75391A65111p2927B3488N3056j7961e4442E1411B810c86415C87418
$$ y = [42961, 135719, 73740, -90832, 189176, -212902, -64825, -144310, 139672, 226787, 77344, 23107, 71740, 79613, -269210, 16884, -62019, -41041, 392236, -338800, 176718, 157890, 934, 221218, 53467, -19596, 163526, -64422, 226483, -277534, -95295, -48412, 14519, -438652, 183086, 110166, -351468, 140583, 129051, 320232, -23843, -3788, -50019, 55338, 427850, -16204, -141318, 239454, 182774, 58871, 187581, 496441, -25623, 76868, 176922, 6857, -85842, -140883, 182757, -1198, 202088, 367783, -26660, 173588, -67772, -32523, -18195, 122219, -93448, 56661, 139724, 419694, -61144, -316991, -18122, -6991, 178186, 54795, 160367, 20312, -231585, -144748, 375391, 165111, 92184, 23488, 76544, 58583, -54442, 51411, 2810, -386415, 387418]
11538B7120J36274q1200c31900C3188O3334a54019E6824A8804J79724r6458k388
11527I9682J68435D2311a10519C96006b60510B07296a09874A7790p985K39879
11517B49684q5924j0061k4368n2651c10506F6226d6992A16143D3094N4043h3998
11505A86729a7098j64283A37999a01224C61425b8121L772l0717B18428H1634J92097
11494B73731p9854J11501H8421a57719A60818p1378R5589a9523A69827K0088E4459
11482a1583A09414h3949r8208N9966A56044P6745e6723r5758C79067A62766J8496
11471A81262K4320b3441p8175j04326A03804K5818N973A0136J4031M9332L4925
11460A08424l3208K50150d5717P223J5981B81251M9727I3208b86125g337A90113
$$ y = [27120, 163394, 82194, -331900, 33188, 96522, -154019, 56824, 18804, 198528, 102070, 99682, 268117, 42311, -110519, 396006, -260510, 207296, -109874, 17790, 9805, 249684, 163760, 153699, 129331, 76680, -310506, 66226, -46992, 116143, 43094, 97137, -83998, 186729, -17098, -181381, 137999, -101224, 361425, -28121, -24349, -55066, 218428, 81634, 273731, 193877, 305378, 88421, -157719, 160818, 89440, 185029, -19523, 169827, 189915, 54459, -11583, 109414, -83949, -182157, -122191, 156044, 232789, -56723, -152481, 379067, 162766, 181262, 205582, -23441, -101616, -205942, 103804, 129622, 135595, 10136, 24167, 73499, 108424, 75216, 325366, -45717, -38494, -22513, 281251, 330978, 93208, -286125, -7337, 190113]
11448B9532J98043A2107a7955j23783f7714C49948B6357a92311B05827d03901
11437A15920c2317A73233k4016A6735b24628C81940a32057B67584A4538d790B20968
11425A73907K14237h6875A86536j324m5778A5042J73938q4652K34582a72543I5383
11413G809h5967l06262F4207L962j3438a84610H9239m1332g5514A68121d0294
11401b36957D643J93478a27179B72576p5603a97578b2875l09680H3286K30681
11391C13967a0410B0368O0486d4483C09457a3866B4330K6740g2268f450j04577
11380a11027e073F1780c60262f1617p7624j22568M2178C29074b39960E7143k5151
11369C1992b1614D4601a254B44959a35585b9834j39505N8806B56868a25987A03581
$$ y = [29532, 227575, 12107, -17955, -141738, -67714, 349948, 26357, -192311, 205827, -403901, 115920, -32317, 173233, 149217, 16735, -224628, 381940, -132057, 267584, 14538, -4790, 220968, 173907, 388144, -86875, 186536, 185212, 139434, 15042, 188980, 104328, 338910, -172543, 95383, 7809, -85967, -392229, 64207, 68169, 54731, -184610, 89239, 47907, -75514, 168121, -40294, -236957, 4643, 198121, -127179, 272576, 196973, -197578, -22875, -332555, 83286, 313967, -10410, 20368, 80854, -44483, 309457, -13866, 24330, 51070, -72268, -6450, -111027, -5073, 61780, -360262, -61617, -139241, -261809, -219631, 329074, -239960, 57143, 31992, -21614, 44601, -1254, 244959, -135585, -29834, -169339, -110533, 256868, -125987, 103581]
11357C19058c02767J22513F1270M874o010a76972h1330E9772J34068l2534c9236
11345D7279a51150e7537o0838J6814G8021b19587a08292b13j33189A46984a671
11333a27393G7217j8279a6521E6810a58331a3373m99593K52159b9278B29156m0155
11322A89001O015r6996a08516A26297C4078M4478g3379B98419G6995b15520A7535
11310c5605D274J84501b00218A52013k9979b13911A30403c90044D2853c15712
11299a30391J4727F7055i4197A06124e1967D0379f0614l6212a829k41678A43403
11287a14220d6294l5803A47059a29907q3115A39153n9097a51765q0306H7690P6382
11276A64072a53583a4037A14894f0056C21113c2843o7489k29891I9832d9536J8108
$$ y = [319058, -302767, -180254, 61270, 66144, 60134, -176972, -81330, 59772, 193840, 161306, -39236, 47279, -151150, -57537, -118375, -101561, 78021, -219587, -108292, -213, -133402, 146984, -1671, -127393, 77217, 58938, -16521, 56810, -158331, -13373, -512966, -260807, -29278, 229156, 189001, 195016, 98020, -108516, 126297, 34078, 78556, -73379, 298419, 76995, -215520, 17535, -35605, 4274, 188775, -200218, 152013, 122034, -213911, 130403, -390044, 42853, -315712, -130391, -115664, 67055, -94197, 106124, -51967, 40379, -60614, -96826, -1829, -243507, 143403, -114220, -46294, -82097, 147059, -129907, -213022, 139153, 80056, -151765, -232071, 87690, 164072, -153583, -14037, 114894, -60056, 321113, -32843, -100332, -330223, 99832, -49536, -31428]
11265c1428a1982D975a46529e719r4322c4261F2297L3860b45868c4048j65456
11254a99504e8020B45623G3020g4912m6140j81917C18911A28487k1797K25852
11244C32542G7821C1387i4723E9181b07738A23500Q4434c2145j38619A28497b1939
11232c26623B18254f8289n1421H655J38983A1012g4935j47892A23490b9732C1801
11220f5181o2949A04869A4531l767R1771b5095I49e0831j05303o276J9151r769
11208a53028L8755A78313A4735a496p1965d536D601K70670b50720P9073e3414
11196a63337F610L9243A2734a79764C3754a02733F3876c74392C00497d9063A89027
11184e0999A36148a48176c4866l29889a58004b1915A6765b94438A81623m2914
$$ y = [-31428, -11982, 4975, -146529, -5719, -100041, -34261, 62297, 96157, -245868, -34048, -199504, -58020, 245623, 73020, -74912, -121052, -302969, 318911, 128487, 106690, 332542, 77821, 31387, -94723, 59181, -207738, 123500, 207934, -32145, -170764, 128497, -21939, -326623, 218254, -68289, -119710, 8655, 147638, 11012, -74935, -222827, 123490, -29732, 31801, -65181, -128130, 104869, 14531, 10764, 102535, -25095, 949, -50831, -156134, -162410, -143259, -153028, -114273, 178313, 14735, -1496, -73461, -4536, 4601, 275271, -250720, -171647, -53414, -163337, 6610, 45853, 12734, -179764, 33754, -102733, 63876, -374392, 300497, -49063, 189027, -50999, 136148, -148176, -34866, -364755, -158004, -21915, 16765, -294438, 181623, 138709]
11174A38709K72380b84195h1433A15461D916b23128J2401a2286k00867g5955j60003
11163b35958A43842a89945B12456c64534G1176K18388d7040A52649d1453B42720
11152G684b43058K4063L1428O3761C98887a78700A44507l2330a23383c0125l41610
11141c71735d8692j58340K3120f8606L3669A98578J43202a1785M61C99583b53202
11129B1771J97253b8869j86391N4014A08990D0481O027M9990b09339A32001D5963
11117C21548B2759b27192I5275A4239a22400C5623c1054F2585c2444k5856J5170
11106d3130o7082A61016n8945k6093c9579B32437I5174a9202B54114J74135a3007
11094A13714a09995A47990C7942K73248H6427p866g8682a3366G5052M0842b99180
$$ y = [138709, 411089, -284195, -81433, 115461, 4916, -223128, -210727, -12286, -213153, -75955, -235958, 143842, -189945, 212456, -364534, 71176, 289564, -47040, 152649, -41453, 242720, 7684, -243058, -218995, -187567, -123806, 398887, -178700, 144507, 112177, -123383, -30125, -371735, -48692, -207032, -183912, -68606, -34937, 198578, 341780, -11785, -11324, 399583, -253202, 21771, 219024, -28869, -215260, -161246, 108990, 40481, 46508, 96498, -209339, 132001, 45963, 321548, 22759, -227192, 95275, 14239, -122400, 35623, -31054, 62585, -32444, -58300, -43130, -110212, 161016, 102071, 75978, -39579, 232437, 95174, -19202, 254114, 428249, -13007, 113714, -109995, 147990, 37942, 311190, 86427, 78561, -78682, -13366, 75052, 115894, -299180]
11082A5156J28225K82005B6226j1586J25898C7549J98003b2295n0916C30946J21877
11071D52823b3959G4214C3851L95041d4344B16631p9851D1123A8802J29400K49661
11060C97863A20604D504b7301B62060A05598K67794J25478J09761k17322D4365
11049B56323r8899K20002j67775Q1951O5809j44256K33871p5624J26705j57114
11039C40993J06783J15588J58472k03762K72029k13390j62260K74966o3306L62197
11029I88310k15200l84714j75153M00680J43164r2201K65378l47180K17171l93441
11019D06814L95574L5369l26799M30936D69795J40080K69784j70402l06354m3556
11009C59347K12956L74515j34790j97672N5954L2546l8877p8254j34215M10553
$$ y = [15156, 143381, 425386, 26226, 14640, 140538, 37549, 235552, -22295, -73211, 330946, 452823, -23959, 74214, 33851, 428892, -44344, 216631, 136780, 41123, 18802, 148202, 397863, 120604, 4504, -27301, 262060, 105598, 373392, 498870, 608631, 391309, 44365, 256323, 157424, 377426, 209651, 291602, 357411, 213155, 447026, 371402, 498107, 340993, 447776, 563364, 721836, 518074, 790103, 576713, 414453, 689419, 626113, 988310, 773110, 388396, 213243, 613923, 757087, 664886, 930264, 583084, 800255, 406814, 802388, 837757, 510958, 941894, 469795, 609875, 879659, 709257, 402903, 359347, 572303, 946818, 812028, 614356, 670310, 702856, 663979, 585725, 451510, 862063]
10999H62063k48301k14197J03385K30641l48314J7092M60126D02240N5357J75495
10989F33092j18194m1546J00416N4086Q040K55249j71575O7810M3568j45579M0479
10978G25846n3948N353K44964J8488k21425L8450J8167j8191J73083R6977m54875
10967E72889M06254o2003K96904k79095L06180J07239L91521J43697J39097j41633
10957A881050n832O83605k71060M45648n58728q8702K50412n59973j38018j29399
10947A509003j93318K58705n5765Q6511j15700j44257P122J35557k60154k7166
10937A200538r4718l9147j57908M4921m22538L617j95416n5897A28603L24959
10927D53562A85635J9177J820J69043a13878b7632I9598K30878a22348B73428
$$ y = [862063, 613762, 399565, 502950, 733591, 385277, 402369, 862495, 402240, 457597, 633092, 514898, 473352, 573768, 627854, 635894, 891143, 719568, 787378, 830946, 685367, 725846, 671898, 677251, 922215, 940703, 719278, 757728, 775895, 757704, 930787, 1027764, 572889, 979143, 917140, 1214044, 934949, 1241129, 1348368, 1739889, 1883586, 2022683, 1881050, 1875218, 2558823, 2287763, 2733411, 2174683, 2085981, 2336393, 1776420, 1638402, 1509003, 1315685, 1574390, 1518625, 1605136, 1489436, 1345179, 1352301, 1487858, 1227704, 1200538, 1105820, 1066673, 908765, 953686, 531148, 534765, 339349, 283452, 128603, 453562, 185635, 204812, 206632, 375675, -113878, -27632, 99598, 330476, -122348, 273428]
10916a25860B37142J81263A95284n0424M3480a04764m5205d4269A55649a0250
10905A57705a08703D04771A46451d6A59679J18855P2279j46607K7032j810h4360
10893B34436a55830A5826D754J25069d0672B2221K07470b34325A1566a19779J9191
10882a00588B42975j02890a04556H1656e1733e1j44385a0463j36334O9723C07377
10870A7728b1264A74976b15976I2817J38229a3728H5858c85576E9172O1871h697
10858e7547A00720m0511J07156g1919k48766F5339j433A2368K473R6442a05638
10846A62547E563b14677O4606o8888n074e2291A97499h8922L144G8672P8486f9480
10833D7459K52192b38846A57640a34892a8418p5849j52219A44071J01116c09290
$$ y = [-125860, 237142, 418405, 195284, 144860, 188340, -104764, -149969, -44269, 155649, -10250, 157705, -108703, 404771, 146451, -46, 159679, 278534, 350813, 204206, 231238, 229428, -84360, 234436, -155830, 15826, 4754, 129823, -40672, 22221, 229691, -234325, 11566, -119779, -100588, 242975, 140085, -104556, 81656, -51733, -51, -144436, -10463, -146797, -77074, 307377, 17728, -21264, 174976, -215976, 92817, 231046, -13728, 85858, -385576, 59172, 121043, -8697, -57547, 100720, 60209, 167365, -71919, -320685, 65339, 63906, 12368, 14841, 111283, -105638, 162547, 5563, -214677, -150071, -218959, -224033, -52291, 197499, -88922, -85778, 78672, 157158, -69480, 47459, 299651, -238846, 157640, -134892, -18418, -94267, -246486, 144071, 245187, -309290]
10822i0482m686B03913H4178h1517G1441a01219O680c3050m0143b0613B1930h7896
10809a29655C37235b45350f8185B66826d5782E0701K47951a56999e8762I753K22607
10798B32360E5529A5216d61584O9369B78537b11224l9471B51153k3253H8435a43631
10786c17862f6071L319G3153d0219m9953f444k44354f2674A0002K15983r8022
10775A27963J11447a66455B01607q2938R3182e0708D072b88407A69930J08339
10765B78269a45824F7071K1514b42107d0319l14612a61337B08024p4975a26069
10754E5146a68757l2525Q0697A70701b66342A4802N2283J52145R8203a05477A13135
10742A20416L8716a07400p3162K4197j41017d3833j15682q021G7559d672p8464
$$ y = [-90482, -95168, 203913, 84178, -81517, 71441, -101219, -94539, -33050, -73193, -20613, 21930, -87896, -129655, 337235, -245350, -68185, 266826, -45782, 50701, 298652, -156999, -58762, 9753, 232360, 55529, 15216, -461584, -392215, 278537, -211224, -250695, 251153, 227900, 88435, -143631, -317862, -66071, -62752, 73153, -40219, -90172, -6444, -250798, -62674, 10002, 225985, 127963, 239410, -166455, 201607, 118669, 211851, -50708, 4072, -288407, 169930, 278269, -145824, 67071, 88585, -242107, -40319, -354931, -161337, 208024, 133049, -126069, 55146, -168757, -201282, -120585, 170701, -266342, 14802, 67085, 219230, 317433, -105477, 113135, 120416, 159132, -107400, -180562, -156365, -297382, -43833, -159515, -167536, 77559, -4672, -83136]
10731h3136A29869A6394a72187c407B31333b34596A93861a7128j7479n2479p2823
10720a59909O8547D5236b30734B0675a96927N870A33708B1177M4680J31998b0812
10708A58049a3121j93186j26385Q628R7182H4574c5560j70571c4697E6369e4590
10696b892B7018b07954A52191h8868D3944I902e7335j50948f1995A86630p6008
10685A10622h3213C1731e3062l16102I1264a04883a6846B24873C132K12323D8131
10673a33289B86973f037n1330A06204K3153a90380I9692A4933h1229M01C07373
10661B48612b08002G8184b11530p7380f1013H2615e1167j07915C48388b75484
10650b51821f3829r5533B6904j0692i8941j41204h034k05415M0125h179B6608
$$ y = [-83136, 129869, 16394, -172187, -3407, 231333, -234596, 193861, -17128, -34607, -87086, -159909, -91362, 45236, -230734, 20675, -196927, -191057, 133708, 21177, 65857, 197855, -20812, 158049, -13121, -206307, -332692, -324064, -226882, 84574, -35560, -206131, -34697, 56369, -54590, -2892, 27018, -207954, 152191, -88868, 43944, 9902, -57335, -208283, -61995, 186630, 110622, -83213, 31731, -53062, -369164, 91264, -104883, -16846, 224873, 3132, 215455, 48131, -133289, 286973, -6037, -57367, 106204, 129357, -190380, 99692, 14933, -81229, -80828, 307373, 248612, -208002, 78184, -211530, -288910, -61013, 82615, -51167, -159082, 348388, -275484, -251821, -63829, -159362, 26904, 16212, -98941, -240145, -8034, -213449, -173324, -8179, 26608]
10638A87087a9257j86313B9821b26548j03350h4207B4703J57758B6598b23626
10627C813a93460J0190A7039i0290r0153B13042C0726b70852N7379i1654A86580
10615i0218C71522b55285c0426q2295C504a23614C3446a41259f191G6698J44816
10604B21514K7404K6626I8258H509K37183F29a48597J2375J9733m8788j37544
10593c02821Q0392H5399G259N9775a21943C0857b18922B34846i9613j33917R2387
10582a41143G1176A9557L4280b78128D7100a6279j25184A743a44566G3227a77580
10570a32060F2670a65488F0332K5193P4982b09190I3118c6684H8416b35088L2204
10559b02884j10049a02832D428J12588J99922g590o7274I0810k1854B808J18879
$$ y = [187087, -19257, -205570, 29821, -226548, -329898, -84207, 24703, 182461, 26598, -223626, 3813, -193460, -183270, 17039, -90290, -180443, 213042, 30726, -270852, -213473, -91654, 186580, -90218, 371522, -255285, -30426, -112721, 3504, -123614, 33446, -141259, -6191, 76698, 221514, 248918, 275544, 98258, 8509, 245692, 629, -148597, -136222, -116489, -165277, -302821, -222429, 85399, 7259, 67034, -121943, 30857, -218922, 234846, -99613, -233530, -141143, 71176, 19557, 53837, -278128, 47100, -16279, -141463, 1743, -144566, 73227, -177580, -132060, 62670, -165488, 60332, 85525, 160507, -209190, 93118, -36684, 88416, -235088, -202884, -312933, -102832, 4428, 117016, 316938, -7590, -74864, 90810, 68956, 2808, 121687]
10548A21687b41350d7234j74417H6781a86262J878j15104B07184f61659b9393
10537f3037k92784J38996H4585d0182A71694F6732p593b10057A86762e06996a39465
10525A00231b4724j48342B31673a3454n3672k92103d1078l1662c6218J0565A70894
10513D4055b75210B9726J81973a33047a5306j87094A86557C6280a91265D6642
10502H9245h9972A45372C0386J46079f6743k22097D629a05434A84342a00549J2299
10491h8250o2483I2788a36879A74406c3959A39969D2569A4225K90671a29062n9728
10480a88790O1512K590K7188C18089b02432j8312B2226d2457o7909L6145m4162
10469a18383A59867b30834D81912q5596G6640L84927n7671j74321q4653L5245
$$ y = [121687, -241350, -47234, -221651, 86781, -186262, -184384, -299488, 207184, -661659, -29393, -63037, -355821, -216825, 84585, -40182, 171694, 66732, 59139, -210057, 186762, -506996, -139465, 100231, -24724, -173066, 231673, -13454, -67126, -359229, -41078, -72740, -36218, -25653, 170894, 44055, -275210, 29726, 211699, -133047, -15306, -202400, 186557, 36280, -191265, 46642, 89245, -89972, 145372, 30386, 176465, -66743, -288840, 4629, -105434, 184342, -100549, -88250, -150733, 92788, -136879, 174406, -33959, 139969, 42569, 14225, 304896, -129062, -188790, -127278, -124688, -97500, 318089, -202432, -220744, 22226, -42457, -110366, -74221, -118383, 159867, -230834, 481912, 396316, 76640, 461567, 403896, 229575, 144922, 180167]
10459A80167J0786K3970h0472j51445f7481A03450a89229g0255k04508B12889
10448d5671k38952a32824E5552G591b40768B88406c50218a55786A46879j6029
10438A30850F1327a04639A43423a56438j43574d8985A98924D9658M787d1667l0167
10427g1834B6044J61888j981c7354B67896g4409q2647A1999K33558E7850b0087
10415C1440R8069a04537j32084n442L5939A43253Q9837b59360q507C0754a14658
10403d55709H8917c78152K6554B594a24478E2539b90k42949C0711j5328c52876
10391b8440C09108b3684A03713b90339A51453C4500c0869A09291B1794e7924j72711
10380b30635Q1583c9007A19200J09876a4066A97744D7130J79395B0309b04582
$$ y = [180167, 190953, 214923, -80472, -231917, -67481, 103450, -189229, -70255, -274763, 212889, -45671, -284623, -132824, 55552, 7591, -240768, 288406, -350218, -155786, 146879, 130850, 61327, -104639, 143423, -156438, -300012, -48985, 198924, 49658, 54445, -41667, -71834, 26044, 187932, 185951, -37354, 267896, -74409, -157056, 11999, 245557, 57850, -20087, 31440, 129509, -104537, -236621, -242063, -206124, 143253, 233090, -259360, -267867, 30754, -114658, -455709, 88917, -378152, -351598, 2594, -124478, 52539, -290, -243239, 30711, 15383, -352876, -28440, 309108, -23684, 103713, -290339, 151453, 34500, -30869, 109291, 21794, -57924, -230635, -149052, -39007, 119200, 229076, -14066, 197744, 47130, 226525, 20309, -204582]
10369A80434F8299a8891Q704I5403J0532D1454J23737a5441B16781M7370m6352
10358B17799J2014M5489E7037M09522A92843J29336J7531j49174J06788p9259
10348B18065R8825G0833L08249p1873j25988K0667k3316q2694i3246D79541k04316
10337B75225j0580J07098L17142l30978r8547j8203G1613K92555C0742K3273h7914
10325D11958j89528K03695q5858J59211B45233I3599a67970C87324b05788A66545
10314C6474a54369B7902J150K60445j01721b64355B65531J10037j67919D8966
10303E1963K16988R2595l2470o1655B5362L9657A4142h82B14140E7750a13922
10291a07736E4114L32669c96909B54082E8085a2754B74J54974b3380g526D7694
$$ y = [180434, 68299, -18891, -10187, 95403, 105935, 41454, 165191, -15441, 216781, 264151, 217799, 229813, 275302, 57037, 466559, 192843, 322179, 339710, 190536, 297324, 218065, 316890, 70833, 379082, 307209, 181221, 201888, 178572, 95878, -93246, 479541, 275225, 264645, 371743, 688885, 357907, 259360, 241157, 71613, 364168, 30742, 54015, -87914, 411958, 222430, 426125, 340267, 499478, 245233, 93599, -167970, 387324, -205788, 166545, 36474, -154369, 27902, 29052, 289497, 187776, -264355, 265531, 375568, 207649, 48966, 51963, 268951, 361546, 329076, 267421, 25362, 65019, 14142, -882, 214140, 57750, -113922, -107736, 54114, 386783, -396909, 254082, 58085, -12754, 274, 155248, -23380, -7526, 47694]
10279A00056J09883a96283k1985e2586r5203c8482j80245c9301j04146F0348b07457
10267F2943b8085l1535n6919A37736g8014B83097f9719A41926e6932J6479j61983
10256b02436m1316C03177E5523a97318E4326B7147b33375B04898I7957P3642C0392
10244i687A70242J41408L4399A24241O1011l2873o9052q928O0429Q0854c46042
10232c57888F8064d7225j23636e914k34529P856B26491c60634j264A26249c35963
10220c64849B0693K33573R6994J1013A48838b07255a3333j13282m5776I2787l1306
10209F1481O4460g2627j41796j15733B01554E9596e0635k77362J11341A73687
10198g9272j62451J0914r0131a52587j29510A5471a66421L7679J2221G6884M5485
$$ y = [100056, 209939, -196283, -218268, -52586, -147789, -38482, -218727, -39301, -143447, 60348, -207457, 62943, -28085, -59620, -116539, 137736, -78014, 283097, -69719, 141926, -56932, -40453, -202436, -243752, 303177, 55523, -197318, 54326, 27147, -233375, 204898, 97957, 171599, 30392, -9687, 170242, 311650, 346049, 124241, 185252, 152379, 83327, 74399, 134828, 215682, -346042, -357888, 68064, -47225, -170861, -5914, -240443, -232587, 226491, -360634, -361898, 126249, -335963, -364849, 20693, 254266, 351260, 362273, 148838, -207255, -13333, -126615, -172391, 92787, 61481, 125941, -72627, -214423, -330156, 201554, 59596, -50635, -327997, -216656, 173687, -79272, -241723, -230809, -320940, -152587, -282097, 15471, -166421, -128742, -116521, 76884, 122369]
10187A22369R8753i2884B88961j01320e4779A07940O0252a96394j02945k6457
10177c25796h1046A6871b95295a08192B22155F7255i2132K1774B94851a93254
10166b25547e6083j13928O959k2515F9176b49551Q7760l2944f1606k8669D0451
10154a91270e0878K3103A13200a73813f9047F820c63342A9858a30541q9802h5872
10142A75375J19743B7528a40018a8609j99524I0950a5311A4121i1866C5306a09484
10130d6082j56880B28757a25885k48427i699A38958B4722f7357j7725a3253q9141
10119a02394j22853A98316a39941N3934G2548b40402B97511A32363a72692k84731
10109d57423c8602j43383A80684C9107a40345A67465h7213K3660k13129h1867
$$ y = [122369, 221122, -92884, 288961, 187641, -54779, 107940, 168192, -196394, -299339, -325796, -81046, 16871, -295295, -108192, 222155, 67255, -92132, -70358, 294851, -193254, -225547, -56083, -170011, -163052, -185567, 69176, -249551, -161791, -194735, -61606, -90275, 40451, -191270, -50878, -27775, 113200, -173813, -69047, 6820, -363342, 19858, -130541, -220343, -85872, 175375, 295118, 27528, -140018, -18609, -218133, 90950, -15311, 14121, -91866, 35306, -109484, -46082, -202962, 228757, -125885, -374312, -9699, 138958, 24722, -67357, -85082, -13253, -102394, -225247, 198316, -139941, -86007, 72548, -240402, 297511, 132363, -172692, -457423, -38602, -181985, 180684, 39107, -140345, 167465, -87213, -63553, -276682, -81867]
10098E5157A0246D507K6538c47646R2650N2549C10759g7506l70562b4163q321
10087c2484o0236A91620m9115h9769c8549B29525d4007l0483c624o0786A75159
10075i1927k4522d9624A30860c33109N9176I8571c64695a21302o3086A52740e8603
10063a16756j80863h5483B21864B9420b7949l11061C06525F2610k4014c8043j03641
10052a41684A29706k8750C404d7552l4935J2279B47748C5616c73430J53400C37062
10040e9319j48352K9850d5205G7610g3278H5070f3702o6638E0224i1014L9939
10029e1075a837D4709a6770m16071g1995B4800M4011J13523a91451j39590a6777
10017b6731h911k89451i9683B85075a54108Q180n8043B77922q5420d26442R6857
$$ y = [55157, 10246, 4507, 31045, -347646, -254996, -202447, 310759, -77506, -448068, -24163, -32484, -92720, 191620, 142505, -89769, -38549, 229525, -44007, -74490, -3624, -64410, 175159, -91927, -116449, -49624, 130860, -333109, -273933, 98571, -364695, -121302, -184388, 152740, -58603, -116756, -297619, -85483, 221864, 29420, -27949, -339010, 306525, 62610, 38596, -38043, -141684, 129706, 100956, 3404, -47552, -82487, -70208, 247748, 35616, -373430, -220030, 337062, -59319, -207671, -177821, -45205, 77610, -73278, 85070, -63702, -130340, 50224, -91014, -51075, -1837, 44709, -16770, -432841, -71995, 24800, 68811, 182334, -191451, -331041, -16777, -26731, -8911, -298362, -99683, 285075, -154108, -145928, -203971, 277922, 192502, -426442, -329585]
10006c29585a52659H6185a2380k1610l9244A48614P46F5558b49525J12613a2119
9994b32147f3142b3781A22627a03491j07555f3651j03914d9871j19612D9229b5556
9982A17475L7843i4813m241M8525q9827j1987I1493b40743L1324A6476d7851B96736
9969H0934a4335l5115l0202J2569j21554n2417C8418J75793a82880p985O3924
9958a26941B25884a13486A98284c34433B69719H6103Q9118d01524B10977a15844
9947h6715H7906Q3819b95234B2906c2135o5019A16181a70689K7141d0009a8306
9935a67924P271J0637B32071e6695C2557N1345d4261j97172b9995A17034a16834
9923B38025e3943A02420c42221J53152r5554a9177j07254M000A02704D9446J28635
$$ y = [-329585, -152659, 86185, -12380, -33990, -73234, 148614, 149360, 65558, -249525, -136912, -12119, -232147, -63142, -23781, 122627, -103491, -211046, -63651, -167565, -49871, -169483, 49229, -25556, 117475, 155318, -94813, -99054, -50529, -140356, -152343, 91493, -240743, -209419, 16476, -47851, 296736, 80934, -14335, -49450, -79652, -67083, -188637, -241054, 38418, 214211, -182880, -190865, -126941, 225884, -113486, 198284, -334433, 269719, 86103, 175221, -401524, 210977, -115844, -86715, 87906, 171725, -295234, 22906, -32135, -97154, 116181, -170689, -143548, -40009, -18306, -167924, -160653, -150016, 232071, -56695, 32557, 83902, -44261, -241433, -29995, 117034, -116834, 238025, -53943, 102420, -342221, -189069, -284623, -19177, -126431, -122431, 102704, 49446, 178081]
9912A78081Q7887b21732f2494k01602K4811J18131i389j55137k682f5044I118
9900a58185E721c50237G949J68997a4957k36967G3600l3535a989q9972j66115
9889b58076O7088m33447a17236N4863B17740b32945F4548b62631a29383B58125
9878E3135e0396j44614g5243j40085I2253a366H9451a240j20459m2348F6112c12187
9865b97742P8022o7769g2183C44692A52245c70883c7603F8971C1423b74319j09289
9854c83608J43523Q7374A45818n5449m4026f8901q8296a7129G1791e2917K1547
9843c1370A43701c88966A81605F746g3287j58207m9500B15891c0414A5124N3091
9832F8215a63720l7714R2237K2838j89291e7679H3833Q2544A3239g7263A27128
$$ y = [178081, 265968, -221732, -62494, -264096, -239285, -121154, -9389, -164526, -167208, -65044, 9118, -158185, 5721, -350237, 7949, 176946, -14957, -251924, 73600, 40065, -1989, -91961, -258076, -190988, -624435, -117236, -62373, 217740, -232945, 64548, -262631, -129383, 258125, 53135, -50396, -195010, -75243, -215328, 92253, -1366, 89451, -1240, -121699, -164047, 66112, -312187, -297742, -219720, -287489, -72183, 344692, 152245, -370883, -37603, 68971, 31423, -274319, -383608, -240085, -152711, 145818, 90369, 46343, -68901, -157197, -17129, 71791, -52917, -31370, 143701, -388966, 181605, 6746, -73287, -231494, -280994, 215891, -30414, 15124, 68215, -163720, -201434, -109197, -86359, -275650, -57679, 83833, 166377, 13239, -77263, 127128]
9820h6290G9799b30028e3062A34306c34517F5971a47736N6108E1050J43139g7706
9808c17294a17002n71132B72910d45852J77183I9947K31356b08210I9320c33456
9797g2223k51316a13801p33B20276b88962m4329c4368k109C1975g8479j34349
9786b12828h4105r9500G8492e0947a6681k07687A01533a88147j91281C0006J33291
9775A63297c55922a8676A56679f4140A23578b30682E4720J36360b75507d8721
9764b27632B11260b0848j61673F138c58229b4358m8009j289j22939H5711b12884
9752a51834j95846a50570M1016K4581J525B05862n2427b13538b341D5939J24412
9741A70351H3363b16103A45015e7585A18124a15114c316A46804i3731j35326a9452
$$ y = [-86290, 79799, -230028, -53062, 134306, -334517, 65971, -147736, -91628, 51050, 194189, -77706, -317294, -117002, -688134, 272910, -445852, -268669, 99947, 331303, -208210, 99320, -333456, -72223, -323539, -113801, -114534, 220276, -288962, -333291, -34368, -36477, 31975, -78479, -212828, -84105, -183605, 78492, -50947, -16681, -224368, 101533, -188147, -379428, 30006, 163297, -355922, -18676, 156679, -64140, 123578, -230682, 54720, 191080, -275507, -48721, -227632, 211260, -20848, -182521, 6138, -358229, -24358, -72367, -73656, -196595, 85711, -212884, -151834, -347680, -150570, -109554, -84973, -83448, 205862, 153435, -213538, -2341, 45939, 170351, 83363, -216103, 145015, -57585, 118124, -115114, -3316, 146804, -93731, -229057, -19452]
9729a63962O5035B4982K8063J00508b46107j38691D043c2443A7149i1353m0987
9718a32340H1352J1633b68525A3281c41861h5327m8548A64514a23612A89396C7460
9706c23078b5924j04046J2295A82954J02805b57347k0158A55121c67961e2111
9695G3162c2247B3532q506K50096a03198B4174h288A62165J6086b3919j7790E2313
9682H4870a0286k40080d2139k56200C1525R4695c87903J34244c5546A08211a40765
9670A05110b56365B18349a75759K9439J9406J1559j52473a32623N7376e346j38818
9659a44164G539L66610i037k24664A23067O04b9055k93523e2238k95541G62f1203
9646D13312c4305k00150N9076d709p8012j61585M6147b6276j37848J5940A66685
$$ y = [-163962, -98927, 24982, 53045, 153553, -246107, -384798, 4043, -32443, 17149, -91353, -132340, 81352, 92985, -268525, 13281, -341861, -85327, -133875, 164514, -123612, 189396, 37460, -323078, -25924, -129970, -117675, 182954, 285759, -257347, -277505, 155121, -367961, -52111, 73162, -32247, 23532, 15026, 265122, -103198, 24174, -8288, 162165, 178251, -23919, -41709, 52313, 84870, -10286, -250366, -42139, -298339, 31525, 126220, -387903, -253659, -35546, 108211, -140765, 105110, -256365, 218349, -175759, -146320, -126914, -115355, -267828, -132623, -75247, -5346, -144164, 7539, 374149, -9037, -233701, 123067, 123671, -29055, -322578, -52238, -347779, 762, -61203, 413312, -34305, -234455, -175379, -4709, -82721, -244306, -198159, -26276, -164124, -148184, 166685]
9634a99377l8380j0857l28271B3429L4104b150k39366a13743A21991a44207F2617
9622A72541e3121A77372p5588K54680b29024q1616B39151a2444j01484a7993C01832
9610b30323O3911C80188f1697a027r2763r6596j57617a40933p4028a770j50349
9599a52119a2156N742m00474A35451a72028D4220b51940a06589A6347J21975e2855
9587e1983p8503o4242H0981m0266d46077c8942A3541a62539D11941a41758A5050
9575a48645I6300D5132b35637f377A68448c49746B2695M3962b76646a22190j71274
9564b93464l4622A5488J88677b95249A73964H3720a510A83179Rf6938l2088j9819
9552a18845D2949a48175G9125J15775F3501L0419J71820b7782n2420A73689b76514
$$ y = [-199377, -237757, -248614, -576885, 23429, 57533, -2150, -241516, -113743, 121991, -144207, 62617, 172541, -53121, 177372, 101784, 356464, -229024, -310640, 239151, -12444, -113928, -17993, 301832, -230323, -166412, 380188, -61697, -1027, -93790, -190386, -348003, -140933, -214961, -1770, -152119, -12156, -6414, -406888, 135451, -172028, 44220, -251940, -106589, 16347, 138322, -52855, -51983, -130486, -194728, 80981, 40715, -446077, -38942, 13541, -162539, 411941, -141758, 15050, -148645, 96300, 45132, -235637, -6377, 168448, -349746, 22695, 66657, -276646, -122190, -293464, -328086, 15488, 204165, -295249, 173964, 83720, -1510, 183179, 183188, -66938, -99026, -118845, 42949, -148175, 79125, 194900, 63501, 93920, 265740, -27782, -80202, 173689, -276514]
9540b44288n6066N0283N760a10696C30196A07504c63577a74012j05366A22114
9529e7643k2521A34686a7725A21466l5128L8458O5480O4672h4343A04733C8363
9517a0108j92259J8402E1206J0986P1757F6213a16100D25238a83098E6017b98132
9505a0725A66676b24146l9869A9968P4751c51830A20959a47147B40095E7991b90705
9493f5274C7668f0596J2778A91002b64996F9400b21806B2771K3538a20887B23722
9481H4217c20681f7389a1282j27335A29974a11873J6888Q607I3357a24181K3738
9470a00443a0212j76260g9365J6213j35705n6269F7637a54566I611d2390q9503
9459a31893A43328n0819a13232C2202E726d6064m6453m1810L0497A43591a91082
$$ y = [-244288, -300354, -250071, -244311, -110696, 330196, 107504, -363577, -174012, -279378, 122114, -57643, -80164, 134686, -17725, 121466, 86338, 124796, 190276, 254948, -84343, 104733, 38363, -10108, -202367, -183965, 51206, 62192, 133949, 66213, -116100, 425238, -183098, 56017, -298132, -10725, 166676, -224146, -264015, 19968, 94719, -351830, 120959, -147147, 240095, 57991, -290705, -65274, 37668, -60596, -47818, 191002, -264996, 69400, -221806, 22771, 46309, -120887, 223722, 84217, -320681, -67389, -11282, -138617, 129974, -111873, -94985, -86378, 93357, -124181, -100443, -10212, -186472, -79365, -63152, -198857, -255126, 67637, -154566, 9611, -42390, -131893, 143328, 92509, -113232, 32202, 5726, -46064, -92517, -134327, -103830, 143591, -191082]
9447b80286K8288B31357c10588C42689a39493E7091A0818b52919H1750a64698
9436h7552b0787j45183A18386b55988j15248I4096i8232j2951l6167b21k60029
9425b60250A50943b14258O1081k30004g4672n3721j46947h6871I2578i7219j16211
9414b13430j44120a14122B31713a28051B73995a37844j4322B6990b82565B07019
9403H5330B1020a15460A54104b07055A29347a20341J6256k63744J8200M3004e3249
9391a37590F3924a37263n8907e9736A94282a35850F5837K38305j03090A3585a53785
9379A43883a17829A2313f7920B20339b28989A55427c01162A71868b92752a08190
9368a71200B80972d099A82267d79844a30696B74027r6518J48568a75711h2758
$$ y = [-280286, -251998, 231357, -310588, 342689, -139493, 57091, 10818, -252919, 81750, -164698, -87552, -20787, -165970, 118386, -255988, -371236, 94096, -98232, -111183, -147350, -221, -260250, 150943, -214258, -153177, -383181, -74672, -128393, -275340, -86871, 92578, -97219, -213430, -357550, -114122, 231713, -128051, 273995, -137844, -152166, 26990, -282565, 207019, 85330, 21020, -115460, 154104, -207055, 129347, -120341, -104085, -367829, -349629, -306625, -53249, -137590, 63924, -137263, -196170, -59736, 194282, -135850, 65837, 304142, 201052, 13585, -153785, 143883, -117829, 12313, -67920, 220339, -228989, 155427, -301162, 171868, -292752, -108190, -171200, 280972, -4099, 182267, -479844, -130696, 274027, 177509, 326077, -175711, -82758]
9357i6591r4581P3187e8768p2810k7790A05735b66472C44747d43820A95629b40844
9345d68500F875a37141F3584K44470D5951J56309b55850o0282P5122R4715B12419
9333D793J79476c48179B63728d4075A67175c07508F7231a04738b6085n6641F8198
9321b4014B74900P6866b6450F7525Q6962Q7166b651j67417Q695P955O7830j45896
9309b31484c2536A61893b49838g6735A02068J9198d60921a38066j6893L9730r355
9298a24584A46436b95556O9775A43195a36761N6388b2499A1896J10022D6428a86730
9286b15747g2526n7952j70285g7569A36932a35198A43084E5553a29407C8079h1860
9274A03892h1607A16199a92156H316N6973G614J49083B5454a74347P4097c4301
$$ y = [-96591, -191172, -117985, -58768, -131578, -159368, 105735, -266472, 344747, -443820, 195629, -240844, -468500, 6875, -137141, 63584, 308054, 45951, 202260, -255850, -316132, -241010, -146295, 212419, 4793, 184269, -348179, 263728, -44075, 167175, -307508, 67231, -104738, -26085, -82726, 68198, -24014, 274900, 351766, -26450, 67525, 154487, 241653, -2651, -170068, -161373, -153418, -85588, -231484, -32536, 161893, -249838, -76735, 102068, 121266, -460921, -138066, -154959, -115229, -124584, 146436, -295556, -225781, 143195, -136761, -80373, -22499, 11896, 121918, 46428, -186730, -215747, -72526, -130478, -300763, -77569, 136932, -135198, 143084, 55553, -129407, 38079, -81860, 103892, -81607, 116199, -192156, 8316, 65289, 7614, 156697, 25454, -174347, -100250, -34301]
9262B1395c10888C0833i273k1613p8457R414B50157i5028d5132A56450a39399
9250a16273A81172f1576A82840E6692b12479a9472j24611A40181D7532A8378K75781
9239B94159c659B54374A12339f7444l16858A38196b37680A88706a46236B32952
9228b6719j25777A34592b08735o0323L0163a06935L3356q3074j39205M9421A44874
9216G7169K15689a08115E6456R6276l11a81921h319n3870D7603K10167B9493a62040
9203g5826A11665b69500d9610j7186l53350H1175a25100B11607a29834e888p341
9192a3229B7615L7570c05237a38777A03104N4347D0817c0457l24885C080b80082
9180A10460L5253D2458M1665c3535j23567k18k59811a98611E7758h0851k5299
$$ y = [21395, -310888, 30833, -9273, -30886, -109343, -99929, 250157, -95028, -45132, 156450, -139399, -116273, 181172, -61576, 182840, 56692, -212479, -19472, -144083, 140181, 47532, 18378, 294159, -3659, 254374, 112339, -67444, -384302, 138196, -237680, 188706, -146236, 232952, -26719, -152496, 134592, -208735, -269058, -238895, -106935, -73579, -156653, -295858, -246437, 144874, 77169, 292858, -108115, 56456, 152732, 152421, -181921, -8319, -62189, 47603, 257770, 29493, -162040, -75826, 111665, -269500, -49610, -66796, -420146, 81175, -125100, 211607, -129834, -5888, -13229, 27615, 65185, -305237, -138777, 103104, 157451, 40817, -30457, -355342, 3080, -280082, 110460, 145713, 42458, 84123, -33535, -157102, -157320, -417131, -198611, 57758, -80851, -106150]
9169a06150l63975b02034A66767r17b3971F9430g787A25978K3169D1262J11801
9158A53063h44k16565A30042c63764a54848L6656a8530l65864a38975a1252m65643
9147d76895a75978j87362C26817A26570f8147j30703K0047n0313M265I5925m6634
9136D9291J03044h2469B65232c57711a05050M5118k4618j17292d3774k1219A9658
9124a9933D59590b08708N8581N4746D4273i8056l09731a25451j5338o4544K3801
9113a81532f7882I1574J2475a97441D1778a7353A38066D4423K10199a1754H4336
9101h8772D2296N24P5822a86051A3920M869b4657j11936j2673e129E4910A8305
9088b26763f9529n8492j34421j29828A49408b34549a10411K3061K8676q4098D4023
$$ y = [-106150, -470125, -202034, 166767, 165850, -23971, 69430, -7787, 125978, 149147, 41262, 153063, -844, -217409, 130042, -363764, -154848, -118192, -18530, -384394, -138975, -11252, -476895, -175978, -363340, 326817, 126570, -68147, -198850, -178803, -229116, -224851, 95925, 49291, 152335, -82469, 265232, -357711, -105050, -59932, -84550, -201842, -43774, -64993, 19658, -19933, 459590, -208708, -150127, -95381, 44273, -98056, -407787, -125451, -140789, -205333, -181532, -67882, 91574, 104049, -197441, 41778, -17353, 138066, 44423, 254622, -11754, 84336, -88772, 42296, 42820, 118642, -186051, 13920, 18789, -24657, -136593, -149266, -5129, 54910, 18305, -226763, -69529, -128021, -262442, -392270, 149408, -234549, -110411, -87350, -58674, -142772, 44023]
9076F6199c08742B8163h3357A43740a47731d9559I3038e6343C1110a89675F5581
9064a09362j64423J36034B7619K42089E8124e724j39149E415f8019B96931j36293
9053A60638a91775n6452A53872a88886h5150j65153A26495g083A16212Q3951b53095
9041B19545g4199j98091a24654k27951J19343A55753a09594p5321F7344J52914
9031B20258H8414a17939A55202a7183B5821i9071b0125j05868m2486I211J5749
9020B4960a47356p9858A95500p1415c7407j7383C1486c29351J31499F5230a75933
9008f8386m476j9451c2045m4621j84610f9643q509j62962h3725A4388a58605A07261
8995A04629k0388A8817h9430E605J77224a18174k44941a56425k69319a18468P349
$$ y = [66199, -308742, 28163, -83357, 143740, -147731, -49559, 93038, -56343, 31110, -189675, 65581, -109362, -273785, -137751, 27619, 269708, 58124, -5724, -144873, 5415, -68019, 296931, 160638, -191775, -248227, 153872, -188886, -85150, -250303, 126495, -7083, 116212, 200163, -253095, 219545, -74199, -272290, -124654, -352605, -233262, 155753, -109594, -184915, 67344, 220258, 88414, -117939, 155202, -17183, 25821, -99071, -20125, -125993, -168479, 9211, 24960, -147356, -227214, 195500, 124085, -37407, -54790, 31486, -329351, -197852, 65230, -175933, -68386, -72862, -92313, -32045, -76666, -261276, -69643, -78152, -241114, -83725, 14388, -158605, 107261, 104629, 84241, 18817, -89430, 5605, 182829, -118174, -363115, -156425, -425744, -118468, -111119]
8984a11119a8909n8639A10485A3790a71642A3346K49956g6814A75934g7230C0370
8972D2791e5119a6721o6728K6711j19712B5044L74138d9050j4941L550G6246c5522
8959D61541E0410K65092j54584A0792Q5749b1668r5106C52J83003a03844b7520
8947d13164a01028L3131r6647E08h9768K124C296a10616J0218A07657i1884B51009
8934B35805q398e9957k73656J26310B2806J97201a85100f658A03409a87127A22106
8922g023A79010a39939B66722n6181a238p176j52220j02125d4298G9845J86438
8911B66283L02803K73906o29N45545J164228L029191K728977m097381k103081
8902B109842I18726m06063j47453C0841P5910K63936A70389K2817c6415C29813
$$ y = [-111119, -18909, -77548, 110485, 13790, -171642, 13346, 263302, -76814, 175934, -77230, 30370, 42791, -55119, -16721, -83449, -56738, -176450, 25044, 399182, -49050, -63991, -60441, 76246, -35522, 461541, 50410, 315502, 160918, 10792, 96541, -21668, -116774, 352, 183355, -103844, -27520, -413164, -101028, -67897, -164544, 508, -89768, -87644, 3296, -110616, -100398, 107657, -91884, 251009, 235805, 227407, -59957, -333613, -207303, 22806, 220007, -185100, -6658, 103409, -187127, 122106, -7023, 179010, -139939, 266722, 210541, -1238, -8414, -160634, -262759, -44298, 79845, 266283, 569086, 842992, 842363, 1387908, 2552136, 5581327, 8310304, 4212923, 2109842, 918726, 512663, 365210, 30841, 106751, 370687, 170389, 193206, -36415, 329813]
8891A61871K27026a03246D1931L6647a26880A72071a13148H4067i4012C273L3728
8880C7001Q06J8973a89714O9002K3466E3358J04565A142d05399a21784j34075
8869b55859B3529a64323j89872C26a84666j14747A57458b82986b861G3471J7880
8858I1351b10715A02224c60695k7552B69288d26107a68934P1502l5830l0980a0858
8846a93270b0787j710j78907E6218d5715H7936g2007J9801n6706A00544D7120
$$ y = [161871, 388897, -103246, 41931, 78578, -126880, 172071, -113148, 84067, -94012, 3273, 37001, 37807, 56780, -189714, -120712, -97246, 53358, 157923, 1142, -405399, -121784, -255859, 23529, -164323, -354195, 326, -184666, -299413, 157458, -282986, -2861, 73471, 91351, -210715, 102224, -360695, -388247, 269288, -426107, -168934, -97432, -133262, -164242, -10858, -193270, -20787, -22497, -201404, 56218, -45715, 87936, -72007, -52206, -108912, 100544, 47120]
$$ [...]
##END NTUPLES=NMR SPECTRUM
##END=
