
##TITLE=UV1138_M5-1005-1002_6275562_rSnh2jbMtO
##JCAMPDX= 6.0         $$ Bruker NMR JCAMP-DX V2.0
##DATA TYPE= NMR SPECTRUM
##DATA CLASS= NTUPLES
##ORIGIN= BRUKER
##OWNER= Administrator
$$ 1.72 TOPSPIN		Version 2.1
$$ 2012-06-07 05:00:39.640 -0500  Administrator@TOPSPIN
$$ Compression mode = diff/dup
##.OBSERVE FREQUENCY= 400.13188235
##.OBSERVE NUCLEUS= ^1H
##.ACQUISITION MODE= SIMULTANEOUS (DQD)
##.ACQUISITION SCHEME= undefined
##.AVERAGES= 64
##.DIGITISER RES= 22
##SPECTROMETER/DATA SYSTEM= spect
##.PULSE SEQUENCE= noesygpps1d.comp
##.SOLVENT NAME= COFFEE_meoh
##.SHIFT REFERENCE= INTERNAL, COFFEE_meoh, 1, 14.96705
##AUDIT TRAIL= $$ (NUMBER, WHEN, WHO, WHERE, PROCESS, VERSION, WHAT)
$$ ##TITLE= Audit trail, TOPSPIN		Version 2.1
$$ ##JCAMPDX= 5.01
$$ ##ORIGIN= Bruker BioSpin GmbH
$$ ##OWNER= Administrator
$$ $$ C:\Bruker\TOPSPIN/data/COFFEE/nmr/UV1138_M5-1005-1002_6275562_rSnh2jbMtO/22/pdata/1/auditp.txt
$$ ##AUDIT TRAIL=  $$ (NUMBER, WHEN, WHO, WHERE, PROCESS, VERSION, WHAT)
(   1,<2012-06-07 05:00:34.500 -0500>,<Administrator>,<TOPSPIN>,<go>,<TOPSPIN 2.1>,
      <created by zg
	started at 2012-06-07 04:49:04.390 -0500,
	POWCHK enabled, PULCHK disabled,
       configuration hash MD5:
       D5 CA 7A 23 FE 6B EE E2 50 67 74 61 24 F7 5E 3B
       data hash MD5: 64K
       E6 43 7E BB D9 2A 14 9A 2D 90 AF C3 6E 5E 2C BD>)
(   2,<2012-06-07 05:00:37.390 -0500>,<Administrator>,<TOPSPIN>,<proc1d>,<TOPSPIN 2.1>,
      <Start of raw data processing
       efp LB = 0.3 FT_mod = 6 PKNL = 1 PHC0 = 0 PHC1 = 0 SI = 128K 
       data hash MD5: 128K
       45 C7 86 68 43 C1 AF 80 45 06 21 9D 68 F5 A4 67>)
(   3,<2012-06-07 05:00:38.562 -0500>,<Administrator>,<TOPSPIN>,<proc1d>,<TOPSPIN 2.1>,
      <pk PHC0 = 32.0636 PHC1 = 0 
       data hash MD5: 128K
       81 66 61 05 02 E5 BE EB 4C F3 63 C8 93 03 2B 50>)
(   4,<2012-06-07 05:00:39.296 -0500>,<Administrator>,<TOPSPIN>,<proc1d>,<TOPSPIN 2.1>,
      <abs ABSG = 1 
       data hash MD5: 128K
       E6 04 F3 30 BE 99 42 73 9E 04 61 7C B9 9A A6 74>)
(   5,<2012-06-07 05:00:39.375 -0500>,<Administrator>,<TOPSPIN>,<proc1d>,<TOPSPIN 2.1>,
      <abs ABSG = 2 
       data hash MD5: 128K
       C5 1E A6 98 E0 67 BE 8A B3 15 BB 28 FB 84 CB 58>)
(   6,<2012-06-07 05:00:39.421 -0500>,<Administrator>,<TOPSPIN>,<proc1d>,<TOPSPIN 2.1>,
      <abs ABSG = 3 
       data hash MD5: 128K
       B5 24 C4 EF 6F A3 AF 54 8A 66 82 5F 35 1C A4 92>)
(   7,<2012-06-07 05:00:39.500 -0500>,<Administrator>,<TOPSPIN>,<proc1d>,<TOPSPIN 2.1>,
      <abs ABSG = 4 
       data hash MD5: 128K
       75 9D E0 1F 23 71 36 14 51 86 96 BB 7D 96 5B 34>)
(   8,<2012-06-07 05:00:39.562 -0500>,<Administrator>,<TOPSPIN>,<proc1d>,<TOPSPIN 2.1>,
      <abs ABSG = 5 
       data hash MD5: 128K
       C2 8E 52 44 E6 0D CC 7B A2 69 DF E2 3F A6 9E 0F>)
$$ ##END=
$$ 
$$ $$ hash MD5
$$ $$ AF FF 61 BB 7B 8E 1C B1 0B F4 27 2D D4 E1 A8 9B
##$RELAX= 
##$RELAX= 
##$RELAX= 
##$RELAX= 
##$RELAX= 
##$RELAX= 
##$RELAX= 
##$RELAX= 
$$ Bruker specific parameters
$$ [...]
##$TP07= 0
##$TPNAME0= <>
##$TPNAME1= <>
##$TPNAME2= <>
##$TPNAME3= <>
##$TPNAME4= <>
##$TPNAME5= <>
##$TPNAME6= <>
##$TPNAME7= <>
##$TPOAL= (0..7)
0.5 0.5 0.5 0.5 0.5 0.5 0.5 0.5
##$TPOFFS= (0..7)
0 0 0 0 0 0 0 0
##$TUNHIN= 0
##$TUNHOUT= 0
##$TUNXOUT= 0
##$USERA1= <user>
##$USERA2= <user>
##$USERA3= <user>
##$USERA4= <user>
##$USERA5= <user>
##$V9= 5
##$VALIST= <valist>
##$VCLIST= <CCCCCCCCCCCCCCC>
##$VD= 0
##$VDLIST= <DDDDDDDDDDDDDDD>
##$VPLIST= <PPPPPPPPPPPPPPP>
##$VTLIST= <TTTTTTTTTTTTTTT>
##$WBST= 2048
##$WBSW= 25
##$XGAIN= (0..3)
0 0 0 0
##$XL= 0
##$YL= 0
##$YMAX_a= 10058276
##$YMIN_a= -8981400
##$ZGOPTNS= <>
##$ZL1= 120
##$ZL2= 120
##$ZL3= 120
##$ZL4= 120
##$ABSF1= 14.96705
##$ABSF2= -5.585481
##$ABSG= 5
##$ABSL= 3
##$ALPHA= 0
##$AQORDER= 0
##$ASSFAC= 0
##$ASSFACI= 0
##$ASSFACX= 0
##$ASSWID= 0
##$AUNMP= <proc_prof1d_extract.lims>
##$AXLEFT= 0
##$AXNAME= <>
##$AXNUC= <1H>
##$AXRIGHT= 0
##$AXTYPE= 0
##$AXUNIT= <>
##$AZFE= 0.1
##$AZFW= 0.1
##$BCFW= 0
##$BC_mod= 0
##$BYTORDP= 0
##$COROFFS= 0
##$CY= 15
##$DATMOD= 1
##$DC= 0
##$DFILT= <>
##$DTYPP= 0
##$F1P= 0
##$F2P= 0
##$FCOR= 0.5
##$FTSIZE= 131072
##$FT_mod= 6
##$GAMMA= 0
##$GB= 0
##$INTBC= 1
##$INTSCL= 1
##$ISEN= 128
##$LB= 0.3
##$LEV0= 0
##$LPBIN= 0
##$MAXI= 10000
##$MC2= 0
##$MEAN= 0
##$ME_mod= 0
##$MI= 0
##$NCOEF= 0
##$NC_proc= -1
##$NLEV= 6
##$NOISF1= 0
##$NOISF2= 0
##$NSP= 0
##$NTH_PI= 0
##$NZP= 0
##$OFFSET= 14.96705
##$PC= 1
##$PHC0= 32.0636
##$PHC1= 0
##$PH_mod= 1
##$PKNL= yes
##$PPARMOD= 0
##$PPDIAG= 0
##$PPIPTYP= 0
##$PPMPNUM= 2147483647
##$PPRESOL= 1
##$PSCAL= 4
##$PSIGN= 0
##$PYNMP= <proc.py>
##$REVERSE= no
##$SF= 400.13000542777
##$SI= 131072
##$SIGF1= 0
##$SIGF2= 0
##$SINO= 400
##$SIOLD= 131072
##$SPECTYP= <>
##$SREGLST= <1H.CDCl3>
##$SSB= 0
##$STSI= 131072
##$STSR= 0
##$SW_p= 8223.68421052632
##$SYMM= 0
##$S_DEV= 0
##$TDeff= 65536
##$TDoff= 0
##$TI= <>
##$TILT= no
##$TM1= 0
##$TM2= 0
##$TOPLEV= 0
##$USERP1= <user>
##$USERP2= <user>
##$USERP3= <user>
##$USERP4= <user>
##$USERP5= <user>
##$WDW= 1
##$XDIM= 131072
##$YMAX_p= 115404131
##$YMIN_p= -355013766
##$CURPLOT= <Network HP LaserJet P1505>
##$CURPRIN= <$Network HP LaserJet P1505>
##$DFORMAT= <normdp>
##$LAYOUT= <+/1D_H.xwp>
##$LFORMAT= <normlp>
##$PFORMAT= <normpl>
##$SURQMSG= 1
$$ End of Bruker specific parameters
$$ ---------------------------------
##NTUPLES= NMR SPECTRUM
##VAR_NAME=  FREQUENCY,     SPECTRUM/REAL,   SPECTRUM/IMAG
##SYMBOL=    X,             R,               I
##VAR_TYPE=  INDEPENDENT,   DEPENDENT,       DEPENDENT
##VAR_FORM=  AFFN,          ASDF,            ASDF
##VAR_DIM=   131072,        131072,          131072
##UNITS=     HZ,            ARBITRARY UNITS, ARBITRARY UNITS
##FACTOR=    0.0627417313425165, 1,          1
##FIRST=     8223.62146879498, 1047,         -20326
##LAST=      0,             1399,            -20383
##MIN=       0,             -355013766,      0
##MAX=       8223.62146879498, 115404131,    0
$$ Real data points
##PAGE= N=1
##DATA TABLE= (X++(R..R)), XYDATA
$$ [...]
63095C80942j1420j1087j0501j0035r747r371q721q021p638p517p170o303n195
63082B68216m295l701l217k756k369k013j578j088o57k58K29P66J178J426J682
63067B51565K054K401K480K196J669J144Q57Q92J111J270J190Q41L48k0ML62O36
63050B71000M60k5l64l44j80r4n5J2j9k73n46m81l6L96M21R4j63l3M02Q00R51
63029B71923R55J049J317J603J691J539J335J350J725K354K956L293L344L289
63015B99723L321L517L817M112M369M663N098N700O386P054P635Q099Q523R055
63001C81072R781J0578J1249J1832J2645J3921J5524J7084J8343J9236J9787K0085
62989E61137K0292K0466K0475K0198J9817J9648J9679J9514J8876J8015J7389
$$ plain form
63095 380942 369522 358435 347934 337899 328152 318781 310060 302039 294401 286884 279714 273411 268216
63082 268216 263921 260220 257003 254247 251878 249865 248287 247199 246542 246284 246513 247279 248457 249883 251565
63067 251565 253619 256020 258500 260696 262365 263509 264366 265258 266369 267639 268829 269670 270018 269998 270002 270364 271000
63050 271000 271460 271435 271071 270727 270547 270453 270398 270410 270391 270118 269572 269091 269055 269451 269872 269966 269803 269770 270172 270972 271923
63029 271923 272878 273927 275244 276847 278538 280077 281412 282762 284487 286841 289797 293090 296434 299723
63015 299723 303044 306561 310378 314490 318859 323522 328620 334320 340706 347760 355395 363494 372017 381072
63001 381072 390853 401431 412680 424512 437157 451078 466602 483686 502029 521265 541052 561137
62989 561137 581429 601895 622370 642568 662385 682033 701712 721226 740102 758117 775506
62978G75506J7117J6881J6355J5526J4538J3390J1930J0094P957N559K792m43
62966I07202m000p546j0847j3856j6558j8847k0587k1644k1899k1344k0266j9083
62954G10725j7923j6551j4795j2816j0768q520n999l534j496K68K136M040N567
62941F30334O746Q033R456J0408J0590J0594J1039J1640J1688J1116J0454R951
62929G52049R380Q643P884O949N353L019M90j793m009o488r163j1805j4419j7006
62915G29084j9187k0574k1280k1719k2000k1926k1478k0890k0232j9337j8198
62904E02263j7099j6250j5537j4774j3946j3128j2323j1534j0829j0261r852r626
62892C47104r549r385q854p971p056o350n869n590n535n547n290m686m069l697
$$ plain form
62978 775506 792623 809504 825859 841385 855923 869313 881243 891337 899294 904853 907645 907202
62966 907202 903202 895656 884809 870953 854395 835548 814961 793317 771418 750074 729808 710725
62954 710725 692802 676251 661456 648640 637872 629352 623353 619819 618323 618591 620727 624767 630334
62941 630334 637080 645113 654569 664977 675567 686161 697200 708840 720528 731644 742098 752049
62929 752049 761429 770072 777956 784905 790258 793277 793767 791974 787965 781477 772314 760509 746090 729084
62915 729084 709897 689323 668043 646324 624324 602398 580920 560030 539798 520461 502263
62904 502263 485164 468914 453377 438603 424657 411529 399206 387672 376843 366582 356730 347104
62892 347104 337555 328170 319316 311345 304289 297939 292070 286480 280945 275398 270108 265422 261353 257656
62878B57656l394k903k387k223k397k474k112j417p30l19k54m03n60o65q54j177
62862B33387j419j397j306j443j737j860j761j710j787j760j543j377j420j425
62848B11442j132o50k72p0L9K8j83m83o77p47q21q85p88m70q7K04L86N16N67M38
62828B06355J20j84k05N9K47L7m02o23n27n21q82j278j204o94k61k42m77o34n90
62809A98094m24k65k19l14m47m74l83k60j23R9L70M85L23M8o4P6K85L45K52J70
62789A97574J73J35o8l18l91k73j98l45o47r34j112j136r31n34j00K31M62O03
62771A92191O06N36N85P88R10Q00O68Q03J129J339J382J495J808K193K501K706
62755B12440K810K812K786K798K763K623K555K798L245L566L695L887M243M564
$$ plain form
62878 257656 254262 251359 248972 246749 244352 241878 239766 238349 237619 237300 237046 236643 236083 235418 234564 233387
62862 233387 231968 230571 229265 227822 226085 224225 222464 220754 218967 217207 215664 214287 212867 211442
62848 211442 210310 209660 209388 209318 209357 209385 209202 208719 208042 207295 206474 205589 204801 204331 204244 204448 204834 205350 205917 206355
62828 206355 206475 206291 206086 206145 206392 206429 206027 205404 204877 204356 203474 202196 200992 200298 200037 199795 199318 198684 198094
62809 198094 197670 197405 197186 196872 196425 195951 195568 195308 195185 195284 195654 196139 196462 196510 196446 196522 196807 197152 197404 197574
62789 197574 197747 197882 197814 197496 197105 196832 196634 196289 195642 194708 193596 192460 191529 190995 190895 191126 191588 192191
62771 192191 192797 193333 193918 194706 195616 196416 197084 197887 199016 200355 201737 203232 205040 207233 209734 212440
62755 212440 215250 218062 220848 223646 226409 229032 231587 234385 237630 241196 244891 248778 253021 257585
62741B57585M756N029N520O041O430O863P551Q351R065R863J1078J2593J3934
62728C64659J4924J5948J7361J8953K0259K1228K2273K3706K5331K6684K7532
62717E98858K7960K8077K7827K7065K5725K3834K1450J8651J5468J1805P533K721
62705H36974k283p121j1640j5740j9203k1851k3825k5463k6920k8064k8716k8798
62693E97350k8314k7359k6185k5012k3812k2399k0738j8940j7038j5085j3431
62682C59037j2481j2107j1635j0634r382q297p325o164m886l849l139k521j933
62669B64684j575j478j296p53jO16J022J397J858K341K803L346M057M861N602
62654B87484O227O809P412Q028Q693R548J0704J2113J3597J4981J6138J6986J7624
$$ plain form
62741 257585 262341 267370 272890 278931 285361 292224 299775 308126 317191 327054 338132 350725 364659
62728 364659 379583 395531 412892 431845 452104 473332 495605 519311 544642 571326 598858
62717 598858 626818 654895 682722 709787 735512 759346 780796 799447 814915 826720 834253 836974
62705 836974 834691 827570 815930 800190 780987 759136 735311 709848 682928 654864 626148 597350
62693 597350 569036 541677 515492 490480 466668 444269 423531 404591 387553 372468 359037
62682 359037 346556 334449 322814 312180 302798 294501 287176 281012 276126 272277 269138 266617 264684
62669 264684 263109 261631 260335 259582 259581 260197 261219 262616 264474 266815 269618 272964 277021 281882 287484
62654 287484 293711 300520 307932 315960 324653 334201 344905 357018 370615 385596 401734 418720 436344
62641D36344J8392J9596K1120K2523K3483K4061K4397K4392K3843K2718K1131
62630F82000J9053J6293J2755Q688M544O25l155p058j1104j4923j8122k0649k2658
62617F46289k4139k4985k5342k5541k5593k5141k4043k2700k1528k0414j9031
62606C87832j7490j6260j5464j4698j3607j2319j1136j0122r137q166p381o869
62594B45183o511o111n602n044m467l819l097k485k221k313k449k323j931j472
62580A95338j025n41r6K9l13q83j290j413j432j432j231p23j69M9l0PL73Q20J046
62561A87084J110J245J442J540J549J629J850K199K691L227L473L241K881K919
62547B18080L386L949M601N644O926P768P892P920Q500R465J0308J1073J2142
$$ plain form
62641 436344 454736 474332 495452 517975 541458 565519 589916 614308 638151 660869 682000
62630 682000 701053 717346 730101 738789 743333 743958 740803 733745 722641 707718 689596 668947 646289
62617 646289 622150 597165 571823 546282 520689 495548 471505 448805 427277 406863 387832
62606 387832 370342 354082 338618 323920 310313 297994 286858 276736 267599 259433 252052 245183
62594 245183 238672 232561 226959 221915 217448 213629 210532 208047 205826 203513 201064 198741 196810 195338
62580 195338 194313 193772 193676 193705 193392 192509 191219 189806 188374 186942 185711 184988 184819 184868 184838 184845 185218 186038 187084
62561 187084 188194 189439 190881 192421 193970 195599 197449 199648 202339 205566 209039 212280 215161 218080
62547 218080 221466 225415 230016 235660 242586 250354 258246 266166 274666 284131 294439 305512 317654
62534C17654J3392J4190J4220J3830J3435J2961J2039J0497Q532O529M688K819
62522D44786N76k033m548o587q216r632j0775j1522j2066j2679j3229j3323j2883
62509C27869j2198j1479j0700r853r035q230p344o466n805n307m692l933l388
62496B29439l320l480l359k691j663p24k35k06k75r4L36P32Q98Q52O99N38M71
62479B17918N17O12P49J033J468J875K204K668L353L974M285M497M902N366N652
62464B61073O016O905Q211R387J0256J1080J1883J2395J2712J3362J4467J5518
62452C93265J6189J6731J7281J7415J6821J5880J5045J4107J2609J0626Q580O577
62440E61126M540K723J625J328J469J775K257K940L817N049O805Q876J0760J2185
$$ plain form
62534 317654 331046 345236 359456 373286 386721 399682 411721 422218 430750 437279 441967 444786
62522 444786 445362 443329 438781 432194 423978 414346 403571 392049 379983 367304 354075 340752 327869
62509 327869 315671 304192 293492 283639 274604 266374 259030 252564 246759 241452 236760 232827 229439
62496 229439 226119 222639 219280 216589 214926 214202 213967 213761 213486 213392 213728 214460 215358 216210 216909 217447 217918
62479 217918 218435 219047 219796 220829 222297 224172 226376 229044 232397 236371 240656 245153 250055 255421 261073
62464 261073 267089 273994 282205 291592 301848 312928 324811 337206 349918 363280 377747 393265
62452 393265 409454 426185 443466 460881 477702 493582 508627 522734 535343 545969 554549 561126
62440 561126 565666 568389 570014 571342 572811 574586 576843 579783 583600 588649 595454 604330 615090 627275
62426F27275J3285J4226J4931J5231J4967J3923J1880Q871N305J685j722m996
62414G34861q366j1918j5465j8669k1320k3380k4847k5714k6113k6212k5983k5251
62402D81623k4068k2729k1340j9668j7622j5517j3645j1909j0183q670p540o499
62390C02233n191l853l030k751k463j815j031m22L8M87Q76J083J161J237J307
62375B87866J209P64p8j155k166k930l486l864l934l690l471l589l871l875l547
62360B50183l278l274l322l236l154l195l118k660j976j460j210r64n76k53k20
62345B18287l15j74K51N53M08M8j3L66Q52J167J390J635J798J826J922K221K520
62328B34742K606K628K821L075L154L151L318L604L747L762L881M106M251M405
$$ plain form
62426 627275 640560 654786 669717 684948 699915 713838 725718 734589 739894 741579 739857 734861
62414 734861 726495 714577 699112 680443 659123 635743 610896 585182 559069 532857 506874 481623
62402 481623 457555 434826 413486 393818 376196 360679 347034 335125 324942 316272 308732 302233
62390 302233 297042 293189 290159 287408 284945 283130 282099 281677 281715 282202 283078 284161 285322 286559 287866
62375 287866 289075 289839 289761 288606 286440 283510 280024 276160 272226 268536 265065 261476 257605 253730 250183
62360 250183 246905 243631 240309 237073 233919 230724 227606 224946 222970 221510 220300 219336 218760 218507 218287
62345 218287 217972 217798 218049 218602 219010 219058 219045 219411 220263 221430 222820 224455 226253 228079 230001 232222 234742
62328 234742 237348 239976 242797 245872 249026 252177 255495 259099 262846 266608 270489 274595 278846 283251
62314B83251M860N539O047O327O776P521Q150Q420Q766R720J1181J2629J3820
62301C93007J4879J5916J6915J7894J8784J9331J9319J8885J8250J7307J5678
62290E86165J3263J0398P532M834K213m56l112n504p417q949j0438j1985j3271
62277E63273j3908j3872j3417j2762j2038j1427j1031j0640r916q861p891p356
62265D30154p181p084p013p181p688q283q583q471q169p911p687p389p082o927
62251C23505o875o696o311n846n348m686l870l218k958k888k625k101j507r53
62237B67623m14M5L10M38O42R88J365J742K163K489K421J961J581J682K126K505
62221B89667K718L014L477L901M151M371M721N121N441N734O101O521O983P657
$$ plain form
62314 283251 288111 293650 299697 306024 312800 320321 328471 336891 345657 355377 366558 379187 393007
62301 393007 407886 423802 440717 458611 477395 496726 516045 534930 553180 570487 586165
62290 586165 599428 609826 617358 622192 624405 623949 620837 615333 607916 598967 588529 576544 563273
62277 563273 549365 535493 522076 509314 497276 485849 474818 464178 454262 445401 437510 430154
62265 430154 422973 415889 408876 401695 394007 385724 377141 368670 360501 352590 344903 337514 330432 323505
62251 323505 316630 309934 303623 297777 292429 287743 283873 280655 277697 274809 272184 270083 268576 267623
62237 267623 267209 267254 267564 268002 268644 269632 270997 272739 274902 277391 279812 281773 283354 285036 287162 289667
62221 289667 292385 295399 298876 302777 306928 311299 316020 321141 326582 332316 338417 344938 351921 359578
62207C59578Q637R641J0297J0715J1381J2505J3816J5115J6567J8212J9590K0237
62195E26291K0282K0146J9795J8786J6917J4447J1666Q691N766L223J006j428
62183F65588m449p772j0782j3170j5063j6710j8198j9394k0003j9850j9121j8194
62171D82882j7250j6217j5123j4150j3290j2262j0982r729q710p722o556n453
62159C45438m726m219l499k535j744j426j415j358j051n49r6K5k04m49m11j83
62143C21598QK53Q10J590K163K351K468K791L134L157K870K618K666K970L280
62128C54727L369L237L138L334L756M014L854L461L247L378L677L921M050M137
62114D05300M270M584N263O386P763R031R970J0683J1386J2118J2672J2808J2392
$$ plain form
62207 359578 368215 377856 388153 398868 410249 422754 436570 451685 468252 486464 506054 526291
62195 526291 546573 566719 586514 605300 622217 636664 648330 657021 662787 666010 667016 665588
62183 665588 661139 653367 642585 629415 614352 597642 579444 560050 540047 520197 501076 482882
62171 482882 465632 449415 434292 420142 406852 394590 383608 373879 365169 357447 350891 345438
62159 345438 340712 336493 332994 330459 328715 327289 325874 324516 323465 322916 322820 322845 322641 322192 321781 321598
62143 321598 321606 321859 322669 324259 326422 328773 331241 334032 337166 340323 343193 345811 348477 351447 354727
62128 354727 358096 361333 364471 367805 371561 375575 379429 382890 386137 389515 393192 397113 401163 405300
62114 405300 409570 414154 419417 425803 433566 442597 452567 463250 474636 486754 499426 512234 524626
62101E24626J1373R800P885N871L801J553q16k926m465n561o635p910r274j0523
62087E16799j1568j2402j2989j3260j3140j2598j1729j0763r878r082q279p443
62075C83668o622n851n157m584m131l749l461l356l342l127k611k114j963j903
62061C31697j375k78Q14J335J308J071P03j3j111k245k953l059k723k223j771
62046C19177j522j582j972k554l161l739m247m445m012k981j805r02k61L16Q12
62031B87122J082J192J410J871K501L175L749M039M017M010M388N121N862O482
62017C36021P202Q112Q942R388R468R398R323R283R314R449R688J0009J0301J0354
62003D66252J0057R514Q830P824O301M499K861J358m66k700m760o168p214q510
$$ plain form
62101 524626 535999 545799 553684 559555 563356 564909 564093 561167 556702 551141 544506 536596 527322 516799
62087 516799 505231 492829 479840 466580 453440 440842 429113 418350 408472 399390 391111 383668
62075 383668 377046 371195 366038 361454 357323 353574 350113 346757 343415 340288 337677 335563 333600 331697
62061 331697 330322 330044 330858 332193 333501 334572 335275 335262 334151 331906 328953 325894 323171 320948 319177
62046 319177 317655 316073 314101 311547 308386 304647 300400 295955 291943 288962 287157 286255 285994 286310 287122
62031 287122 288204 289396 290806 292677 295178 298353 302102 306141 310158 314168 318556 323677 329539 336021
62017 336021 343223 351335 360277 369665 379133 388531 397854 407137 416451 425900 435588 445597 455898 466252
62003 466252 476309 485823 494653 502477 508778 513277 516138 517496 517030 514330 509570 503402 496188 487678
61989D87678j0165j1781j3062j3996j4598j4842j4839j4772j4639j4282j3656
61978C37046j2886j2039j1076j0016r033q331p946p671p189o366n466m919m820
61965B29288m810m514l933l282k721k424k555k994l236k905k215j682j500j483
61951A89034j496j536j510j251p63j89M31J072J507J525J323J304J495J553J360
61936A93859J154J018P23K26j04j23k49q42j527j690j425j397j822k121j774j092
61920A82814q07j139j590j647j336j059j021j053r14o44m51m21m65n24o68q87
61904A68188r77p33k45J80L38K93K45L30N88R90J431J723J744J626J704K190K885
61887A82500L372L494L542L847M362M764M909M977N181N517N821N933N760N361
$$ plain form
61989 487678 477513 465732 452670 438674 424076 409234 394395 379623 364984 350702 337046
61978 337046 324160 312121 301045 291029 281996 273665 265719 258048 250859 244493 239027 234108 229288
61965 229288 224478 219964 216031 212749 210028 207604 205049 202055 198819 195914 193699 192017 190517 189034
61951 189034 187538 186002 184492 183241 182478 182289 182720 183792 185299 186824 188147 189451 190946 192499 193859
61936 193859 195013 196031 196754 196980 196876 196753 196504 195662 194135 192445 191020 189623 187801 185680 183906 182814
61920 182814 182007 180868 179278 177631 176295 175236 174215 173162 172248 171604 171153 170732 170267 169743 169075 168188
61904 168188 167211 166478 166233 166413 166751 167044 167289 167619 168207 169197 170628 172351 174095 175721 177425 179615 182500
61887 182500 185872 189366 192908 196755 201117 205881 210790 215767 220948 226465 232286 238219 243979 249340
61873B49340M981M862M923M785M217L428K784K365J920J230L44n06j119j413j431
61858B80710j284j060p32k29M34J132J768K392L101L812M256M280M090M008L982
61843C10660L595K643J482O18J23k71o51q87j033j375j953k428k529k376k220
61828C03398k129k121k321k676k847k676k550k921l597l949l751l435l451l731
61814B61243l911l753l235k425j516p83l38KM85J136J792K365K881L349L700L917
61798B64909M151M603N312O100O760P250P693Q170Q624Q938Q998Q722Q176P655
61784C66061P361O967N823L814J731M53l4m60j218j931k066j585q56k40Q0J54
61768C84054L01Q59J761K481K597K227J787J460J019J29j279k860m066m627m847
$$ plain form
61873 249340 254321 259183 264106 268891 273108 276536 279320 281685 283605 284835 285179 284673 283554 282141 280710
61858 280710 279426 278366 277634 277405 277839 278971 280739 283131 286232 290044 294300 298580 302670 306678 310660
61843 310660 314255 316898 318380 318998 319121 318850 318199 317312 316279 314904 312951 310523 307994 305618 303398
61828 303398 301269 299148 296827 294151 291304 288628 286078 283157 279560 275611 271860 268425 264974 261243
61814 261243 257332 253579 250344 247919 246403 245620 245282 245284 245769 246905 248697 251062 253943 257292 260992 264909
61798 264909 269060 273663 278975 285075 291835 299085 306778 314948 323572 332510 341508 350230 358406 366061
61784 366061 373422 380389 386212 390026 391757 392210 392176 391716 390498 388567 386501 384916 384060 383820 383900 384054
61768 384054 384355 385214 386975 389456 392053 394280 396067 397527 398546 398675 397396 394536 390470 385843 380996
61753C80996n243n911o473o641o582o636o878p149p289p226o965o602o234n816
61739B89351n311m864m608m330l751l074k824l001l003k574k187k156j993j280
61725B44395n78o82j345j599j189p94q19q36m46N6K49K34L46O41R92J357J664
61708B41646J758J731J957K571L158L286L030K732K522K367K318K379K298J814
61694B75567R98R9p87j675k474l042l385l625l821l988m109m083l788l315k913
61679B35659k661k400k062j751j419q97l86m61j193j820j680j087p66p94p01l82
61663B15199j89k59l88n08p05p62l25L52N43K8n66o77n00n41r17j393j772j929
61645B04691j800j578j604j846j850j440j085j204j523j535j286j226j432j519
$$ plain form
61753 380996 375753 369842 363369 356728 350146 343510 336632 329483 322194 314968 308003 301401 295167 289351
61739 289351 284040 279176 274568 270238 266487 263413 260589 257588 254585 252011 249824 247668 245675 244395
61725 244395 243817 243135 241790 240191 239002 238208 237389 236553 236107 236163 236412 236646 236992 237633 238625 239982 241646
61708 241646 243404 245135 247092 249663 252821 256107 259137 261869 264391 266758 269076 271455 273753 275567
61694 275567 276565 276664 275877 274202 271728 268686 265301 261676 257855 253867 249758 245675 241887 238572 235659
61679 235659 232998 230598 228536 226785 225366 224469 224083 223622 222429 220609 218929 217842 217076 216282 215581 215199
61663 215199 215010 214751 214363 213855 213150 212388 212063 212415 212958 212986 212420 211743 211243 210702 209785 208392 206620 204691
61645 204691 202891 201313 199709 197863 196013 194573 193488 192284 190761 189226 187940 186714 185282 183763
61631A83763j272r29p90q63j000j138j284j436j542j460j051m30Oj7l02m53l74
61614A69428k76k50j78l6%j51l22l07j08J58M18O53Q38R87J157J377J553J523
61596A76464J194O56J83J7J14K10K14L38P42J151J152P77N15P05J151J420J370
61579A88373J190J086J037Q97O17L08O8k30p97j554k068k054j786j735j951k059
61563A79342j886j685j627j495j081o11m17m34l72k89n52j170j612j457r65p04
61547A62985q17r66r15q48j011j382j780k137k415k400j891j117o59q08j215j293
61531A41331q91l81j36j61k41k73l08m12n74p04o75m15j7L18M54M29L35K00N0
61512A37929l4j3K2JL5K71O13Q20Q52R22J127J256J104Q03O48P52J031J361J522
$$ plain form
61631 183763 182491 181562 180772 179909 178909 177771 176487 175051 173509 172049 170998 170568 170574 170557 170255 169802 169428
61614 169428 169152 168902 168724 168688 168688 168537 168215 167908 167800 167958 168376 169029 169867 170854 172011 173388 174941 176464
61596 176464 177658 178314 178497 178514 178628 178838 179052 179390 180132 181283 182435 183212 183727 184432 185583 187003 188373
61579 188373 189563 190649 191686 192583 193200 193508 193576 193346 192549 190995 188927 186873 185087 183352 181401 179342
61563 179342 177456 175771 174144 172649 171568 170957 170540 170106 169734 169445 168893 167723 166111 164654 163689 162985
61547 162985 162168 161202 160287 159439 158428 157046 155266 153129 150714 148314 146423 145306 144647 143839 142624 141331
61531 141331 140440 140059 139923 139762 139521 139248 138940 138528 137954 137250 136575 136160 136143 136461 136915 137344 137679 137879 137929
61512 137929 137895 137882 137904 137905 137940 138211 138824 139644 140496 141418 142545 143801 144905 145708 146356 147108 148139 149500 151022
61493A51022J192L44m60n87j10K83K28Pp9j50k85j60L55P51N60J58K46P30Q69
61474A54914M63R9J71L39K78K06L22L59J09j08j3M0l65r17j043p83n82l96J74
61455A53267R58J227P87L10L11N12N07M65O64Q21N34Q4J43P86J370J436J228J180
61437A66590J312J401J400J444J542J532J319R63N51J38j66k00K5K63K88K13L28
61420A78943O23O99K93l02n62l96k28l76o79p71n67k80j22j63l42n34o22o18o30
61401A73366o64n87l40p7J4l5n4N7K87O27R97J194J077P90O26O45O67N99O02Q27
61381A80618J171J400J438J328J112Q38O50O77Q44R67J040J226J498J522J072
61366A97401M65K92P43J400J755J700J396R09K66k95m83l53k84m49n83l86L3L50
$$ plain form
61493 151022 152214 152558 152098 151511 151401 151684 151912 151919 151840 151690 151405 151245 151600 152351 152911 153069 153315 154045 154914
61474 154914 155377 155476 155647 155986 156264 156470 156792 157151 157260 157152 157139 157179 156814 155897 154854 154071 153489 153093 153267
61455 153267 154225 155452 156239 156549 156860 157372 157879 158344 159008 159829 160363 160447 160590 161376 162746 164182 165410 166590
61437 166590 167902 169303 170703 172147 173689 175221 176540 177503 178054 178192 178026 177826 177851 178114 178402 178615 178943
61420 178943 179566 180265 180558 180256 179694 179298 179070 178694 178015 177244 176677 176397 176275 176112 175770 175236 174614 173996 173366
61401 173366 172702 172115 171775 171698 171712 171677 171623 171680 171967 172594 173591 174785 175862 176652 177278 177923 178590 179189 179791 180618
61381 180618 181789 183189 184627 185955 187067 187905 188555 189232 190076 191043 192083 193309 194807 196329 197401
61366 197401 197866 198158 198901 200301 202056 203756 205152 206061 206327 206032 205549 205196 204912 204463 203880 203494 203527 203877
61348B03877M90O48R12J110J080Q60N59J68l30p83r59q26o37o47q55j040j043
61331B02584r16p61n70l12j00o5j43r1J83M67N07L45K63M22O85P94O68M64M05
61312B04829N60P76Q37O85M81L94L86K69ok12n3M87J081J373J346J286J356J392
61294B17267J208J007J194J759K143J884J219P83Q21R73Q61N82M83O39P86P38
61278B34347O50P65J035J096P29J78p0J41M72N30L53K73M59P40Q74P97N57K37
61260B44163J3J12N83J206J709K027K262K500K795L215L731M151M313M305M335
61245B81420M381M165L517K596J721J073O35K83j25o52j243j779k221k605k880
61230B88286k945k845k835l054l317l315k990k551k214k014j897j802j647j345
$$ plain form
61348 203877 204367 205015 205927 207037 208117 208977 209536 209704 209374 208591 207632 206806 206169 205522 204667 203627 202584
61331 202584 201668 200907 200337 200025 199925 199860 199717 199626 199809 200276 200783 201128 201391 201813 202498 203292 203960 204424 204829
61312 204829 205389 206165 207002 207687 208168 208562 208948 209217 209211 208999 208946 209433 210514 211887 213233 214519 215875 217267
61294 217267 218475 219482 220676 222435 224578 226462 227681 228464 229285 230258 231119 231701 232184 232823 233609 234347
61278 234347 234997 235762 236797 237893 238622 238800 238730 238871 239343 239873 240226 240499 240958 241698 242572 243369 243926 244163
61260 244163 244176 244288 244871 246077 247786 249813 252075 254575 257370 260585 264316 268467 272780 277085 281420
61245 281420 285801 289966 293483 296079 297800 298873 299508 299791 299666 299014 297771 295992 293771 291166 288286
61230 288286 285341 282496 279661 276607 273290 269975 266985 264434 262220 260206 258309 256507 254860 253515
61216B53515q95m09m0J45K37M31Q12J213J397J396J471J699J855J844J946K351
61200B68968K655K348J602J162J327J581J348P17J74p1j33j26p1j2M7J95M05M49
61182B82565K43M4R3K04N3k71l49l8L60N23M80M67O40J027J513J912K094K120
61164B93680K094K044K042K273K710K961K726K329K329K681K761K296J719J468
61150C26113J421J329J325J581J810J623J231J252J851K530K896L147L611M142
61136C55862M325M119L875L747L408K595J581Q69N09J47l31o29o90r93j895k989
61120C73510l587l589l434l403l449l633m061m446m300l707l296l291l240k859
61106C23215k523k548k620k409k177k200k091j399m82o4j44j15K02M55O03J043
$$ plain form
61216 253515 252620 252211 252171 252316 252553 252984 253796 255009 256406 257802 259273 260972 262827 264671 266617 268968
61200 268968 271623 273971 275573 276735 278062 279643 280991 281708 281882 281811 281678 281552 281481 281469 281516 281711 282116 282565
61182 282565 282808 282852 282945 283149 283202 282931 282582 282544 282904 283427 283907 284374 285014 286041 287554 289466 291560 293680
61164 293680 295774 297818 299860 302133 304843 307804 310530 312859 315188 317869 320630 322926 324645 326113
61150 326113 327534 328863 330188 331769 333579 335202 336433 337685 339536 342066 344962 348109 351720 355862
61136 355862 360187 364306 368181 371928 375336 377931 379512 380381 380890 381037 380706 380077 379387 378394 376499 373510
61120 373510 369923 366334 362900 359497 356048 352415 348354 343908 339608 335901 332605 329314 326074 323215
61106 323215 320692 318144 315524 313115 310938 308738 306647 305248 304766 304702 304558 304443 304645 305100 305703 306746
61090C06746J774K165J844J167N91J14l06l77R9P97J298J669K188K812L273L554
61074C29408L934M587N414O196O717O899O948P257P997Q926R716J0325J0870J1397
61060D36591J1904J2431J2946J3251J3249J3126J3118J3234J3334J3291J2964
61049E79439J2230J1238J0350R623Q602O952N002L292J827J93j712l543n073o408
61035F32012p615q594r397j0248j1123j1659j1665j1382j1083j0742j0320j0037
61023E08147j0053j0089r731q981q247p790p455o958o269n638n288n135m795l967
61009D07751k821j863j382j175r14n65k94j03K44R04J759K534L045L335L653M228
60993D18336N037N845O524P164P850Q525R209J0089J1208J2226J2833J3206J3793
$$ plain form
61090 306746 308520 310685 312529 313696 314287 314401 314095 313718 313817 314614 315912 317581 319769 322581 325854 329408
61074 329408 333342 337929 343343 349539 356256 363155 370103 377360 385357 394283 403999 414324 425194 436591
61060 436591 448495 460926 473872 487123 500372 513498 526616 539850 553184 566475 579439
61049 579439 591669 602907 613257 622880 631482 638434 643436 646728 648555 648748 647036 643493 638420 632012
61035 632012 624397 615803 606406 596158 585035 573376 561711 550329 539246 528504 518184 508147
61023 508147 498094 488005 478274 469293 461046 453256 445801 438843 432574 426936 421648 416513 411718 407751
61009 407751 404930 403067 401685 400510 399596 399031 398737 398634 398878 399782 401541 404075 407120 410455 414108 418336
60993 418336 423373 429218 435742 442906 450756 459281 468490 478579 489787 502013 514846 528052 541845
60980E41845J4685J5556J6224J6972J8195J9961K1948K3731K5091K6262K7772
60969G68242K9847L2060L3920L5662L8005M1124M4464M7679N1244N5747O1122
60958A239116O6997P3363Q0386Q7884R5657J04172J14328J26740J41796J60282
60948B290721J83128K10495K41853K77114L16822L61048M09153M61408N19281
60939E271023N81222O36606O64988O44552N65086M36134K84527J43494M0567j0294
60929I257905j1673J7737M7449M4807j2050j24416k72477m24242n48662o26547
60919G347831o54910o43728o07939n60191n08286m56455m07030l60916l18081
60910B830295k78595k43128k12256j85779j63005j43261j25951j10528r6849q5195
$$ plain form
60980 541845 556530 572086 588310 605282 623477 643438 665386 689117 714208 740470 768242
60969 768242 798089 830149 864069 899731 937736 978860 1023324 1071003 1122247 1177994 1239116
60958 1239116 1306113 1379476 1459862 1547746 1643403 1747575 1861903 1988643 2130439 2290721
60948 2290721 2473849 2684344 2926197 3203311 3520133 3881181 4290334 4751742 5271023
60939 5271023 5852245 6488851 7153839 7798391 8363477 8799611 9084138 9227632 9268199 9257905
60929 9257905 9246232 9263969 9311418 9356225 9344175 9219759 8947282 8523040 7974378 7347831
60919 7347831 6692921 6049193 5441254 4881063 4372777 3916322 3509292 3148376 2830295
60910 2830295 2551700 2308572 2096316 1910537 1747532 1604271 1478320 1367792 1270943 1185748
60900A185748p5587o7359n9819n2945m7015m1879l7170l2999k9833k7649k5862
60889F87631k4104k2603k1582k0805j9945j8990j8022j6924j5656j4568j4012
60878D80420j3833j3561j3012j2384j1822j1251j0669j0234r954r556q842p960
60866C47342p194o610o107n660n317n030m706m386m195m106l962l778l755l954
60852B78582m064l743l064k481k368k690l075l091k565j743j148j140j575j997
60838B43838k118k011j881j855j955k109k109j783j275j001j153j468j555j368
60824B20197j154j044r30p21n42n64q11j125j280j103o09l6L26L82K84K35K81
60807B11786L32L32L32M44O76Q78Q94P81P48Q47Q23M44j05l89k79j05k07n13p24
$$ plain form
60900 1185748 1110161 1042802 982983 930038 883023 841144 803974 770975 741142 713493 687631
60889 687631 663527 640924 619342 598537 578592 559602 541580 524656 509000 494432 480420
60878 480420 466587 453026 440014 427630 415808 404557 393888 383654 373700 364144 355302 347342
60866 347342 340148 333538 327431 321771 316454 311424 306718 302332 298137 294031 290069 286291 282536 278582
60852 278582 274518 270775 267711 265230 262862 260172 257097 254006 251441 249698 248550 247410 245835 243838
60838 243838 241720 239709 237828 235973 234018 231909 229800 228017 226742 225741 224588 223120 221565 220197
60824 220197 219043 217999 217069 216348 215806 215242 214431 213306 212026 210923 210314 210278 210604 210986 211270 211505 211786
60807 211786 212118 212450 212782 213226 213902 214780 215674 216455 217203 218050 218873 219317 219212 218823 218544 218439 218232 217719 216995
60788B16995p89r15j244j659j979k140k176k175k259k482k681k620k344k220k461
60773A86851k815k873k590k223j874j454j048r38j112j138p87m73o61j097j081
60758A64687m59J31R0m25q47r00o91l87j04m0l29p59q97n63l9K78L13L03M61P04
60738A60527P80O12M29M79O68O51K97j06k42j79j92l17l52k39j79k93m35m62m64
60719A60983n80p42p84p20p26q64j003j036r83q74o32k22J43J51k27o10n76j30
60701A50568L34M80L48J66J7j71l68l62kN91J076J194R86P85R25J389J766J664
60683A61386J137N59J17l59r55j376j330j014q58q96p13j43L74L83P6L3M25Q25
60665A57671Q20M71P9j96l26k22J59N93P14L99r5m09m25l06l17n56q51r41p84
$$ plain form
60788 216995 216206 215291 214047 212388 210409 208269 206093 203918 201659 199177 196496 193876 191532 189312 186851
60773 186851 184036 181163 178573 176350 174476 173022 171974 171036 169924 168786 167999 167526 166865 165768 164687
60758 164687 164228 164359 164449 164024 163177 162277 161586 161199 161095 161055 160726 159967 159070 158507 158468 158746 159059 159362 159823 160527
60738 160527 161307 161919 162348 162827 163495 164146 164443 164337 164095 163916 163724 163407 163055 162816 162637 162344 161909 161447 160983
60719 160983 160403 159661 158877 158157 157431 156567 155564 154528 153545 152671 152039 151817 151960 152111 151884 151274 150698 150568
60701 150568 150902 151382 151730 151896 151913 151742 151374 151012 151010 151601 152677 153871 154857 155642 156567 157956 159722 161386
60683 161386 162523 163082 163199 162840 161885 160509 159179 158165 157307 156411 155698 155555 155929 156312 156388 156421 156846 157671
60665 157671 158491 158962 159041 158845 158519 158297 158456 159049 159763 160162 160067 159658 159233 158927 158610 158054 157203 156262 155478
60646A55478o50q00j118j244j005o05l52l42m78o21o82n99l99j84o8r2k12l03
60628A45724j93J80O35Q73P88N99N94Q46J215J525J649J543J303J138J137J133
60612A60689Q71L69q7k97l51m53o22p19p06p37r04j066r72n86j20K37M77O37O47
60593A56307M78L01L28N38P25P86P93P99P63O38L80j41r36j646j758j221n49j60
60575A56425O7L83O20M41p9m97o22o65p81p73m21J45N83O97N43L00J13N6J02J87
60555A56824K48K46J74J48K94N44O34M63K93L45M21J98j96k80Q1M77N57M47M42
60536A62360N47O27O64O88O54O24Q48J396J901J969J664J317J006O15K69K87O29
60519A78065Q90Q84R12J204J511J522J398J553K049K573K900L079L166L135L065
$$ plain form
60646 155478 154828 154028 152910 151666 150661 150056 149704 149362 148884 148263 147581 146982 146583 146399 146331 146239 146027 145724
60628 145724 145531 145711 146346 147219 148007 148606 149200 150046 151261 152786 154435 155978 157281 158419 159556 160689
60612 160689 161560 161929 161842 161545 161194 160741 160119 159400 158694 157957 157053 155987 155015 154429 154309 154546 155023 155660 156307
60593 156307 156785 157086 157414 157952 158677 159463 160256 161055 161818 162456 162836 162695 161759 160113 158355 157134 156585 156425
60575 156425 156492 156875 157495 157936 157857 157360 156738 156073 155292 154519 154098 154243 154826 155523 156066 156366 156479 156535 156637 156824
60555 156824 157072 157318 157492 157640 157934 158478 159112 159575 159868 160213 160634 160832 160636 160356 160437 160914 161471 161918 162360
60536 162360 162907 163534 164198 164886 165540 166164 167012 168408 170309 172278 173942 175259 176265 176880 177149 177436 178065
60519 178065 178955 179839 180751 181955 183466 184988 186386 187939 189988 192561 195461 198540 201706 204841 207906
60504B07906L171L433L493L077K414J943J747J463P67j95r16j027n71O0N13P51
60488B28029J024J539K200K749L098L440L987M720N412N899O242O655P299Q096
60474B90389Q791R137R059Q625P904O890N541L856J962J33j352k460l436m431
60460C40608n187n294m728l940l353k957k493j862j136l59M83J317K006K574L251
60445C18930M288N691P229Q613R737J0771J1950J3317J4656J5679J6203J6142
60433D53206J5540J4588J3494J2253J0738R054P584O563N771M801L479J786l72
60420E58485l093o217r413j2491j5415j8077k0218k1555k1884k1182j9809j8443
60408C70688j7452j6488j5009j3143j1568j0607r873q966q033p388o960o438n785
$$ plain form
60504 207906 211077 214510 218003 221080 223494 225437 227184 228647 229414 229219 228303 227276 226705 226765 227278 228029
60488 228029 229053 230592 232792 235541 238639 242079 246066 250786 256198 262097 268339 274994 282293 290389
60474 290389 299180 308317 317376 326001 333905 340795 346336 350192 352154 352287 350935 348475 345039 340608
60460 340608 335421 330127 325399 321459 318106 315149 312656 310794 309658 309299 309782 311099 313105 315679 318930
60445 318930 323218 328909 336138 344751 354488 365259 377209 390526 405182 420861 437064 453206
60433 453206 468746 483334 496828 509081 519819 528873 536457 543020 548791 553592 557071 558857 558485
60420 558485 555392 549175 539762 527271 511856 493779 473561 452006 430122 408940 389131 370688
60408 370688 353236 336748 321739 308596 297028 286421 276548 267582 259549 252161 245201 238763 232978
60395B32978n226m843m449l869l167k586k348k443k566k328j652q78l85k23k12
60380A95803k63m36p27r49r04o06l21l08n13n92l69q3p5l12m71m32l43k65j01
60361A87733R9J37L6R8M26P38Q14P66O98M48k4l25j11M10P82R29J082J254J222
60342A97212R61P00N82N81O73Q34Q68O28L61N15J135J756J920J617J175R34J005
60325B13457J228J314J228J263J599J907J760J231P77O21O50Q05J109J347J202
60310B31498P80N42O19O81N47M95O92Q75Q67R80J512K220K645K745K802K951L124
60293B56575L287L370L173K626K025J625J184L06r29k027k688k966k957k737k603
60278B57264k845l228l113k296j363r89j118j189r25o30o84j034j270j147q56
$$ plain form
60395 232978 227752 222909 218460 214591 211424 208838 206490 204047 201481 199153 197501 196623 196238 196015 195803
60380 195803 195540 195104 194377 193428 192524 191918 191597 191289 190776 190184 189815 189732 189657 189345 188874 188442 188099 187834 187733
60361 187733 187832 187969 188005 188103 188529 189267 190081 190847 191545 191993 191969 191644 191533 191943 192725 193654 194736 195990 197212
60342 197212 198173 198873 199455 200036 200709 201543 202411 203039 203400 203915 205050 206806 208726 210343 211518 212452 213457
60325 213457 214685 215999 217227 218490 220089 221996 223756 224987 225764 226385 227035 227840 228949 230296 231498
60310 231498 232278 232820 233439 234120 234667 235162 235854 236729 237596 238576 240088 242308 244953 247698 250500 253451 256575
60293 256575 259862 263232 266405 269031 271056 272681 273865 274171 273242 271215 268527 265561 262604 259867 257264
60278 257264 254419 251191 248078 245782 244419 243430 242312 241123 240198 239568 238884 237850 236580 235433 234577
60263B34577p49q12o57o2O93J195J460J852K539L305L879M144M040L587L066K868
60247B64925L020L145L036K959L156L340L011K121J084J43q89k171l473m433m978
60232B73996n291n440n298m848m327l970l726l377k895k483k285k182k032j874
60218B23968j799j742j595j428j390j464j496j505j643j866j869j506j019p00
60204B02946n38l71j76l8J10L91P24Q42O36L20J87L57P03R73R65P52O69R49J396
60185B11797J575J313Q37M38J93P3P4J09j5l33n42l11L04R26J306J466J502J431
60167B22143J324J361J616J939K180K382K639K899L072L214L393L486L317K990
60153B57955K808K840K848K714K619K674K662K398K100K100K321K420K311K205
$$ plain form
60263 234577 233828 233016 232359 232297 232990 234185 235645 237497 240036 243341 247220 251364 255404 258991 262057 264925
60247 264925 267945 271090 274126 277085 280241 283581 286592 288713 289797 289940 289051 286880 283407 278974 273996
60232 273996 268705 263265 257967 253119 248792 244822 241096 237719 234824 232341 230056 227874 225842 223968
60218 223968 222169 220427 218832 217404 216014 214550 213054 211549 209906 208040 206171 204665 203646 202946
60204 202946 202408 202037 201861 201823 201933 202324 203048 203890 204526 204846 205033 205390 206093 207066 208031 208783 209452 210401 211797
60185 211797 213372 214685 215522 215960 216153 216226 216300 216409 216394 216061 215519 215208 215512 216438 217744 219210 220712 222143
60167 222143 223467 224828 226444 228383 230563 232945 235584 238483 241555 244769 248162 251648 254965 257955
60153 257955 260763 263603 266451 269165 271784 274458 277120 279518 281618 283718 286039 288459 290770 292975
60139B92975K121J827J290Q05N07J58l94q75j018j002j156j382j338j037q73j073
60123B89535j451j748j848j668j160n71l36n53q27q04o03n42o47p22p12o94o22
60106B74027l71o6p1n52j209j569j443j007n64k91j80j13M3L18O22P78O72L91
60088B69415J60R9P7p2k44j35L33Q82J197J290J348J418J406J340J368J510J624
60071B83016J607J532J480J410J255J070R40Q50P33O21O42Q80J263J633J842J866
60055C02640J848J980K284K498K353J967J780J976K129J696Q01J94L33Q02Q65
60040C26146L99p3j54J2J34J68K09J57k17r89j978k836l230l093k743k593k664
60023C06655k642k409k300k570k979l144l117l248l603l875l832l552l191k827
$$ plain form
60139 292975 295096 296923 298213 299018 299525 299683 299289 298414 297396 296394 295238 293856 292518 291481 290608 289535
60123 289535 288084 286336 284488 282820 281660 281089 280753 280200 279373 278569 277966 277424 276777 276055 275343 274649 274027
60106 274027 273656 273590 273519 272967 271758 270189 268746 267739 267175 266884 266704 266591 266634 266952 267574 268352 269024 269415
60088 269415 269575 269674 269751 269679 269435 269300 269633 270515 271712 273002 274350 275768 277174 278514 279882 281392 283016
60071 283016 284623 286155 287635 289045 290300 291370 292310 293160 293893 294514 295156 296036 297299 298932 300774 302640
60055 302640 304488 306468 308752 311250 313603 315570 317350 319326 321455 323151 323952 324146 324479 325281 326146
60040 326146 326545 326472 326318 326330 326464 326632 326841 326998 326781 325792 323814 320978 317748 314655 311912 309319 306655
60023 306655 304013 301604 299304 296734 293755 290611 287494 284246 280643 276768 272936 269384 266193 263366
60009B63366k489k215j975j781j767j951k024j667j079p94r64j180j052o62k82
59994B41484k8M3j69n39o30j82M94Q93R41R79J207J453J492J311J063Q71P79O97
59976B52159M42m2n60q75r64r74r45q09o53p47j215j839k303k539k701k832k752
59959B29851k356j914j827k096k213j777j031n60n23n46l46j24j77m71p70j020
59943B12100j258j358j132o92l68l08l40k58j9L23O97R82J102J153J306J488J406
59926B14824R47M28K72N14P75P11L62Pk12l70n36o22n68n10n86o73n42k37p2j67
59906B13745k88k47j77k15j62K24P72J035Q49M64J31j53m52o61n91j55N14J105
59888B15738J286J019O47M63L45Qm34m98kO62J010J010R09Q45Q47J017J425J871
$$ plain form
60009 263366 260877 258662 256687 254906 253139 251188 249164 247497 246418 245624 244660 243480 242428 241766 241484
59994 241484 241456 241499 241330 240791 240161 239979 240473 241366 242307 243286 244493 245946 247438 248749 249812 250683 251462 252159
59976 252159 252601 252559 251999 251124 250160 249186 248241 247432 246779 246032 244817 242978 240675 238136 235435 232603 229851
59959 229851 227495 225581 223754 221658 219445 217668 216637 216077 215554 215008 214662 214538 214361 213890 213120 212100
59943 212100 210842 209484 208352 207660 207292 206984 206644 206386 206367 206690 207387 208369 209471 210624 211930 213418 214824
59926 214824 215771 216199 216471 216985 217760 218471 218833 218840 218628 218258 217722 217100 216532 216022 215436 214763 214221 213984 213912 213745
59906 213745 213457 213210 213033 212818 212656 212880 213652 214687 215536 216000 216131 215978 215526 214865 214274 214119 214633 215738
59888 215738 217024 218043 218690 219153 219498 219506 219072 218574 218572 219234 220244 221254 222163 223008 223855 224872 226297 228168
59870B28168K070K022K000K074J955J362M81k31n36o08o56n93j54O44J395J659
59854B41052J374Q85O28Q01J248J590J557J218Q51N60K02k63n45l83kP1l59r13
59836B49572j087p48j36M07O63O39N64P02J060J387J494J473J532J724J914J996
59820B63156K004K020K083K164K183K050J741J375J156J161J206J001N09L5j37
59805B83707j01j79m45o48o00l93j52J81O51J092J347J512J757K058K342K696
59789B94825L147L393L114K460J847J383Q51K76M1K50M86L61K3j50j06r5k68o36
59771C11202j200j856k279k211j853j694j952k392k668k666k420j990j482j076
59757B83463q86p99o08k80k0m4l30o54p92o83m38k69l58o55q44o43k10qk26n61
$$ plain form
59870 228168 230238 232260 234260 236334 238289 239651 240132 239901 239365 238757 238101 237508 237354 237998 239393 241052
59854 241052 242426 243311 243939 244740 245988 247578 249135 250353 251204 251764 251966 251703 251158 250775 250773 250844 250485 249572
59836 249572 248485 247737 247601 248008 248671 249310 249874 250576 251636 253023 254517 255990 257522 259246 261160 263156
59820 263156 265160 267180 269263 271427 273610 275660 277401 278776 279932 281093 282299 283300 283809 283844 283707
59805 283707 283606 283427 282982 282334 281734 281341 281189 281370 282021 283113 284460 285972 287729 289787 292129 294825
59789 294825 297972 301365 304479 306939 308786 310169 311020 311296 311337 311587 312073 312434 312457 312307 312201 312106 311838 311202
59771 311202 310002 308146 305867 303656 301803 300109 298157 295765 293097 290431 288011 286021 284539 283463
59757 283463 282577 281778 281170 280890 280870 280826 280496 279842 279050 278367 277929 277660 277302 276647 275803 275160 274950 274942 274716 274155
59737B74155o58n62n36o28p19q11r55j009p77l70j18j61l81o95j086j387j371
59720B61931j083q00o42n25m49m99n43l39K2K00K00M03Q93J263J267J212J409
59703B63920J719J954K275K799L216L259L194L371L602L499L194L115L261L219
59689C05597K908K652K611K568K417K266K062J575Q88M64M81N98N31N08P79J078
59673C29983R25L30k02l10j42l4q1j39j33k09n12q93r98p01k73j5J07K70M06L15
59653C27694R3J32N77J117J403J526J855K527L246L586L423L091L056L424L845
59638C60595L964L851L811L921L947L692L124K241J095j6p02q84q28p29n64m31
59622C86087o45j282j937k203k173k221k453k703k947l268l528l392k849k295
$$ plain form
59737 274155 273497 272935 272399 271771 271052 270241 269286 268277 267500 267130 267012 266851 266470 265775 264689 263302 261931
59720 261931 260848 260048 259406 258881 258432 257933 257390 257051 257073 257273 257473 257876 258769 260032 261299 262511 263920
59703 263920 265639 267593 269868 272667 275883 279142 282336 285707 289309 292808 296002 299117 302378 305597
59689 305597 308505 311157 313768 316336 318753 321019 323081 324656 325544 326008 326489 327087 327618 328126 328905 329983
59673 329983 330908 331238 331036 330726 330584 330550 330469 330330 330197 329988 329476 328583 327585 326884 326611 326596 326703 326973 327379 327694
59653 327694 327787 327919 328496 329613 331016 332542 334397 336924 340170 343756 347179 350270 353326 356750 360595
59638 360595 364559 368410 372221 376142 380089 383781 386905 389146 390241 390225 389523 388639 387811 387082 386518 386087
59622 386087 385442 384160 382223 380020 377847 375626 373173 370470 367523 364255 360727 357335 354486 352191
59608C52191k025j859j493r65n20j89J97O52J002J201J416J688J793J608J347
59593C56044J259J273J139Q22M20j14r19j903k834l644m375m870m945m831n000
59578C27522n426n534n054m426m100l940l684l532l695l847l584l200l278l715
59564B70507l855l548l319l393l320k828k354k352k587k534k147j759j495j226
59550B33790r03n83k31J72M62M63K76J41R0qj55j63R5N17Q69R38O98L87L04M72
59530B37631O23N40L11J01q4k92m40m51m22m75n52n38m61m29m80o23q93j204j308
59511B30554j137r42q85p04j23N59P34L16j63k92k11j87j45N4K46K26J78M40R23
59492B29441J157R38O49P55J250J765K069K240K455K805L310L954M686N424O061
$$ plain form
59608 352191 350166 348307 346814 345849 345329 345140 345337 345989 346991 348192 349608 351296 353089 354697 356044
59593 356044 357303 358576 359715 360537 360957 360843 359924 358021 355187 351543 347168 342298 337353 332522 327522
59578 327522 322096 316562 311508 307082 302982 299042 295358 291826 288131 284284 280700 277500 274222 270507
59564 270507 266652 263104 259785 256392 253072 250244 247890 245538 242951 240417 238270 236511 235016 233790
59550 233790 232887 232304 232073 232245 232707 233170 233446 233587 233677 233669 233514 233351 233446 233963 234832 235770 236468 236855 237159 237631
59530 237631 238254 238794 239105 239206 239122 238830 238390 237939 237517 237042 236490 235952 235491 235062 234582 233959 233066 231862 230554
59511 230554 229417 228475 227590 226886 226763 227322 228056 228372 228209 227917 227706 227519 227374 227428 227674 227900 228078 228518 229441
59492 229441 230598 231536 232185 232940 234190 235955 238024 240264 242719 245524 248834 252788 257474 262898 268959
59477B68959O358N931M546K487M84q43j412j534j465j245q40l10J91M62L80L8
59461B82187k94m46n29q06j388k119k686k744k226j550j413k095l107l704l657
59446B53423l249k703j980j151n61m28n91p48p44n33j07L78O18N06K67J74K59
59429B42830M58P80J164J379J316J231J436J831J976J626J011N69N49Q83J265
59414B60304J399J224J002R76J043Q84M29O8J96P08J072R55N89M55P14J159J617
59397B74794K122K630K891K771K542K482K422K004J300Q25Q47J091J167J012P57
59382C01657M41L3m28q57j154j130o78n3K74K10J79N67J175J558J609J602J771
59365C06776K166K787L582M354M925N345N787O254O601O841P219P957Q925R601
$$ plain form
59477 268959 275317 281248 285794 288281 288765 287922 286510 284976 283511 282266 281426 281116 281307 281769 282149 282187
59461 282187 281893 281447 280918 280112 278724 276605 273919 271175 268949 267399 265986 263891 260784 257080 253423
59446 253423 250174 247471 245491 244340 243779 243351 242760 242012 241268 240735 240628 241006 241624 242130 242397 242571 242830
59429 242830 243288 244068 245232 246611 247927 249158 250594 252425 254401 256027 257038 257607 258156 259039 260304
59414 260304 261703 262927 263929 264905 265948 266832 267261 267329 267525 268233 269305 270260 270849 271304 272018 273177 274794
59397 274794 276916 279546 282437 285208 287750 290232 292654 294658 295958 296783 297630 298721 299888 300900 301657
59382 301657 302098 302131 301703 300846 299692 298562 297884 297831 298105 298315 298494 299061 300236 301794 303403 305005 306776
59365 306776 308942 311729 315311 319665 324590 329935 335722 341976 348577 355418 362637 370594 379519 389120
59351C89120R288P560M650J392j343l103l860l782l116k123r55K69J151J017m65
59336C95700k830n171o888p916q375q316p820p044o099m999l792k627j664j027
59322C21132p68p90q47p19l82O0N17Q79J005Q91Q14J050J513J848J857J700J632
59305C31392J740J927K048K015J872J786J892K163K438K576K576K609K959L736
59291C63729M607N001M689M022L502L275L180L096K989K769K361J868J432R70
59277D07490K73o74j630k408l058l712m336m710m698m480m523n042n633n663n066
59262C52130m476m379m540m478m176l951l888l803l644l546l484l271k866k423
59248B99205k033j669j327r56l34O98J910K900L567M073M376M138L150J567k60
$$ plain form
59351 389120 398408 405968 410618 412010 410667 407564 403704 399922 396806 394683 393728 393997 395148 396165 395700
59336 395700 392870 387699 380811 372895 364520 356204 348384 341340 335241 330242 326450 323823 322159 321132
59322 321132 320364 319574 318727 318008 317626 317686 318203 319082 320087 320978 321792 322842 324355 326203 328060 329760 331392
59305 331392 333132 335059 337107 339122 340994 342780 344672 346835 349273 351849 354425 357034 359993 363729
59291 363729 368336 373337 378026 382048 385550 388825 392005 395101 398090 400859 403220 405088 406520 407490
59277 407490 407763 407089 405459 403051 399993 396281 391945 387235 382537 378057 373534 368492 362859 357196 352130
59262 352130 347654 343275 338735 334257 330081 326130 322242 318439 314795 311249 307765 304494 301628 299205
59248 299205 297172 295503 294176 293220 292886 293584 295494 298394 301961 306034 310410 314548 317698 319265 319005
59233C19005j911k972l265l110k953k803k345j538p58k44J63O28J052J382J826
59218C02157K546L360L972M286M393M422M510M734M945M899M589M266M068L932
59204C61079L845L816L575K699J278J2n96q17j212j856k455k910l317l573l470
59189C56098l152l067l359l625l447k892k368k125k078k071k077k133k176k075
59175C19453j841j644j582j534j396j352j688k341k856k837k300j560r69p81j012
59160B93760j391j548j405j226j212j243j106q09n16l13j72j10k03m86q46j013
59144B80161p46j25L84L64j13n93p86p65o81n51l96k97k12jK96M24K96J19P7J15
59124B76970J43K47M68O30N59L19J3m25j070j771k237k290j917j281o90l87k69
$$ plain form
59233 319005 317094 314122 310857 307747 304794 301991 299646 298108 297350 297106 297269 297897 298949 300331 302157
59218 302157 304703 308063 312035 316321 320714 325136 329646 334380 339325 344224 348813 353079 357147 361079
59204 361079 364924 368740 372315 375014 376292 376304 375708 374891 373679 371823 369368 366458 363141 359568 356098
59189 356098 352946 349879 346520 342895 339448 336556 334188 332063 329985 327914 325837 323704 321528 319453
59175 319453 317612 315968 314386 312852 311456 310104 308416 306075 303219 300382 298082 296522 295553 294772 293760
59160 293760 292369 290821 289416 288190 286978 285735 284629 283820 283304 282991 282819 282709 282506 282020 281174 280161
59144 280161 279415 279290 279674 280038 279925 279332 278546 277781 277100 276549 276153 275856 275644 275643 275939 276363 276659 276778 276855 276970
59124 276970 277113 277360 277828 278458 279017 279336 279349 278924 277854 276083 273846 271556 269639 268358 267668 267281 267012
59107B67012n1K23J90k00m49k30R2Ml87n75m50l91o56j129j582j848j770j335
59089B56468r24r63j385j754j896j992k087j929j501j206j327j598j626j414j223
59074B33643j130j041r55q59n06L33J362J936J807J457J477J884K338K760L362
59059B47868M072M424M204L875L979M354M342L701K921K560K619K753K746K591
59045B97009K289J834J273O60L5m51o22n86p38j222j636j527j060p76q59j008
59029B92615r70q54q85j103j446j820k053j992j752j642j785k015k213k436k636
59014B67013k507j896j152p76q38r79r64r43j086j275j285j156j116j219j266
58999B48555j129r59r60j096j181j162j139j152j109r30n61N4Q41J390J253N39
$$ plain form
59107 267012 266961 267184 267374 267174 266725 266495 266587 266591 266204 265629 265179 264788 264132 263003 261421 259573 257803 256468
59089 256468 255544 254581 253196 251442 249546 247554 245467 243538 242037 240831 239504 237906 236280 234866 233643
59074 233643 232513 231472 230517 229658 229152 229485 230847 232783 234590 236047 237524 239408 241746 244506 247868
59059 247868 251940 256364 260568 264443 268422 272776 277118 280819 283740 286300 288919 291672 294418 297009
59045 297009 299298 301132 302405 303065 303100 302649 302027 301441 300703 299481 297845 296318 295258 294482 293623 292615
59029 292615 291645 290791 289906 288803 287357 285537 283484 281492 279740 278098 276313 274298 272085 269649 267013
59014 267013 264506 262610 261458 260682 259844 258865 257901 256958 255872 254597 253312 252156 251040 249821 248555
58999 248555 247426 246467 245507 244411 243230 242068 240929 239777 238668 237738 237177 237231 238072 239462 240715 241254
58983B41254k5J21P01R51N36j50n48m97j89J93O35J122J498J568J357J171J327
58966B51025J840K428K875L198L466L621L590L424L200K844K208J315L98k56n01
58951B84675m17k69k99m73n33l58j26k2P8M38J068J662J909J769J446J184J062
58934B92794R68P64M94K98J83P5L8K24N18N63L00J63N08J121J615K033K677L458
58916C08794L906L818L533L497L834M372M819M822M200L256K635K659K973K974
58902C60092K436J584P18j6o03j043j390j741k207k855l671m561n369n893n982
58887C29499n633n049m511m141l847l474k961k357j775j386j278j290j137p45
58873B89915l05K1K55L93L02Rj95j29j9j41l74m15k92l10m94m89l1P01J259J352
$$ plain form
58983 241254 241229 241350 242051 243002 243538 243388 242840 242343 242154 242347 242982 244104 245602 247170 248527 249698 251025
58966 251025 252865 255293 258168 261366 264832 268453 272043 275467 278667 281511 283719 285034 285432 285176 284675
58951 284675 284258 283989 283690 283217 282684 282326 282200 282178 282256 282694 283762 285424 287333 289102 290548 291732 292794
58934 292794 293762 294526 295020 295318 295501 295576 295614 295838 296356 296919 297219 297382 297890 299011 300626 302659 305336 308794
58916 308794 312700 316518 320051 323548 327382 331754 336573 341395 345595 348851 351486 354145 357118 360092
58902 360092 362528 364112 364830 364814 364211 363168 361778 360037 357830 354975 351304 346743 341374 335481 329499
58887 329499 323866 318817 314306 310165 306318 302844 299883 297526 295751 294365 293087 291797 290660 289915
58873 289915 289610 289631 289886 290279 290581 290590 290395 290266 290247 290106 289732 289317 289025 288715 288221 287732 287701 288402 289661 291013
58853B91013J062Q07R79J515J976K124K259K740L432L946M257M597M933M976M735
58838C35351M579M742N054N242N127M611L894L624M303N493O161N954N519N362
58824D05016N106M272L217K581K321J915J304Q64O15J53n53j003r94r97j374j773
58808D20670j686j283j159j488j901k198k639l423m256m746m961n259n705n951
58794C74015n806n548n529n677n586n082m439m002l834l776l791l970m326m641
58780C08008m691m496m256m062l782l321k793k332j837j146m58j90m27p48p80
58765B72689n87l63n6M48R43J151J124J118J117R09N78M78O79Q42P25M86L01M6
58747B82628m03q67j102j158j267j488j675j742j773j861j983k030j913j670j451
$$ plain form
58853 291013 292075 292882 293861 295376 297352 299476 301735 304475 307907 311853 316110 320707 325640 330616 335351
58838 335351 339930 344672 349726 354968 360095 364706 368600 372224 376527 382020 388181 394135 399654 405016
58824 405016 410122 414394 417611 420192 422513 424428 425732 426596 427211 427364 426811 425808 424814 423817 422443 420670
58808 420670 418984 417701 416542 415054 413153 410955 408316 404893 400637 395891 390930 385671 379966 374015
58794 374015 368209 362661 357132 351455 345869 340787 336348 332346 328512 324736 320945 316975 312649 308008
58780 308008 303317 298821 294565 290503 286721 283400 280607 278275 276438 275292 274834 274644 274217 273469 272689
58765 272689 272102 271739 271683 272131 273074 274225 275349 276467 277584 278493 279071 279549 280228 281070 281795 282281 282582 282628
58747 282628 282225 281358 280256 279098 277831 276343 274668 272926 271153 269292 267309 265279 263366 261696 260245
58732B60245j314j094o36j41j0k60l82R1J021J878K316K369K241K120K162K357
58716B72963K500K369J960J385O56j95r33j278j345j568k168k878l343l553l690
58701B60882l678l249k393j506j015r63j125j313j491j614j566j226o11P7N25
58686B39734N82M78O25J135J674J950K101K375K632K524K073J707J673J801J876
58671B64940J920J962J896J718J601J576J423J088Q83J048J355J477J447J528
58657B85862J772K007K088J964J629J185P64L11l66j147j665j945k516l548m444
58642B81951m736m907n621o546o761o106n331m927m652m242l853l617l372l103
58628B14177l047l159k981k327j618j277j221j201j189j177r82n63j69K0J58M05
$$ plain form
58732 260245 258931 257837 257201 257060 257050 256790 256408 256499 257520 259398 261714 264083 266324 268444 270606 272963
58716 272963 275463 277832 279792 281177 281833 281638 280705 279427 278082 276514 274346 271468 268125 264572 260882
58701 260882 257204 253955 251562 250056 249041 248078 246953 245640 244149 242535 240969 239743 239132 239209 239734
58686 239734 240316 240794 241419 242554 244228 246178 248279 250654 253286 255810 257883 259590 261263 263064 264940
58671 264940 266860 268822 270718 272436 274037 275613 277036 278124 279007 280055 281410 282887 284334 285862
58657 285862 287634 289641 291729 293693 295322 296507 297271 297582 297216 296069 294404 292459 289943 286395 281951
58642 281951 277215 272308 266687 260141 253380 247274 241943 237016 232364 228122 224269 220652 217280 214177
58628 214177 211130 207971 204990 202663 201045 199768 198547 197346 196157 194980 193998 193435 193266 193286 193444 193849
58612A93849O76Q89J137J431J620J718J969K387K622K512K338K287K035J269K13
58597B18952o83j293j714j911j867j876k168k475k366j938j716j872k036j881
58583A93156j604j555j689j648j292q88p15o60m60j84j85m36m23J20O74O51K86
58566A83148K92P24R15N37M9m9J63L94O25Q99J075J108J189J396J476J279J036
58549A96256R70R88R39R04R69J035J025R83Q51N28K49M27R15J050O70M79R74J657
58531B11869J803J547J552K041K707L319L815M051M007M029M322M459L995L267
58517B56783K994L270L551L569L588L780L952L993M091M399M919N719O815P834
58503C19257Q211P856P300P036P051O993O515N409L750J994O55j89q78j618k239
$$ plain form
58612 193849 194525 195414 196551 197982 199602 201320 203289 205676 208298 210810 213148 215435 217470 218739 218952
58597 218952 218269 216976 215262 213351 211484 209608 207440 204965 202599 200661 198945 197073 195037 193156
58583 193156 191552 189997 188308 186660 185368 184480 183765 183105 182645 182461 182276 181840 181417 181537 182211 182862 183148
58566 183148 183440 184164 185079 185616 185665 185616 185779 186173 186798 187697 188772 189880 191069 192465 193941 195220 196256
58549 196256 197226 198214 199153 200057 201026 202061 203086 204069 204920 205448 205697 206124 207039 208089 208759 209238 210212 211869
58531 211869 213672 215219 216771 218812 221519 224838 228653 232704 236711 240740 245062 249521 253516 256783
58517 256783 259777 263047 266598 270167 273755 277535 281487 285480 289571 293970 298889 304608 311423 319257
58503 319257 327468 335324 342624 349660 356711 363704 370219 375628 379378 381372 382027 381838 380960 379342 377103
58488C77103k499k447k376k620l341m391n373o002o340o601o841p008p120p216
58474C06928p228p085o853o567o074n257m268l385k764k506k691l140l378l119
58460B42613k606k212j926j537j094q00o32m26k21k17m28o59p82p60n67k83j22
58443B27341j33l9L53Q31J093J136J107R71P37O52Q69J148J251J389J842K433
58427B42981K820L077L496L974M108L882L694L811M143M481M629M344L565K644
58413B95649J968J460Q02k5p62j350j890k273k267j923j525j170p14j49L67P48
58397B86946J033J262J556K114K838L158K651J568M94l65j140j865k476l040l577
58382B91157l834l651l272k951k561k009j613j569j452q59j82%p4K82J055J598
$$ plain form
58488 377103 374604 372157 369781 367161 363820 359429 354056 348054 341714 335113 328272 321264 314144 306928
58474 306928 299700 292615 285762 279195 273121 267864 263596 260211 257447 254941 252250 249110 245732 242613
58460 242613 240007 237795 235869 234332 233238 232438 231806 231380 231159 230942 230514 229855 229073 228313 227746 227463 227341
58443 227341 227208 227169 227522 228353 229446 230582 231689 232660 233397 234049 234918 236066 237317 238706 240548 242981
58427 242981 245801 248878 252374 256348 260456 264338 268032 271843 275986 280467 285096 289440 293005 295649
58413 295649 297617 299077 299879 299854 299092 297742 295852 293579 291312 289389 287864 286694 285980 285831 286198 286946
58397 286946 287979 289241 290797 292911 295749 298907 301558 303126 303620 303255 302115 300250 297774 294734 291157
58382 291157 287323 283672 280400 277449 274888 272879 271266 269697 268245 267386 267204 267204 267130 267412 268467 270065
58366B70065J723J866K184K284J920J326P31J39l81p05j012j530k063k227k141
58351B72179k199k342k137j572j131j025j029r70q28m32K88Q48P28K64K96R57
58335B61895J593J828J943K094K003J600J259J152J045Q60Q33R96J124J286J786
58320B83297K444K630K209J768J758K003K204K333K367K245K181K474K925L077
58306C15915K968L084L496L743L613L370L175K946K815K970L108K776K207K017
58292C58203K135J898J247Q39R35J115J215J562K111K368K343K656L417M012M209
58277C90265M494M996N154M802M604M924N224N019M603M314L971L403K853K401
58263D51027J808J170J007J370J765K090K776L740M242M151M246M930N623N890
$$ plain form
58366 270065 271788 273654 275838 278122 280042 281368 282099 282238 281857 281152 280140 278610 276547 274320 272179
58351 272179 269980 267638 265501 263929 262798 261773 260744 259774 258946 258514 258802 259650 260378 260642 260938 261895
58335 261895 263488 265316 267259 269353 271356 272956 274215 275367 276412 277272 278105 279101 280225 281511 283297
58320 283297 285741 288371 290580 292348 294106 296109 298313 300646 303013 305258 307439 309913 312838 315915
58306 315915 318883 321967 325463 329206 332819 336189 339364 342310 345125 348095 351203 353979 356186 358203
58292 358203 360338 362236 363483 364322 365257 366372 367587 369149 371260 373628 375971 378627 382044 386056 390265
58277 390265 394759 399755 404909 409711 414315 419239 424463 429482 434085 438399 442370 445773 448626 451027
58263 451027 452835 454005 455012 456382 458147 460237 463013 466753 470995 475146 479392 484322 489945 495835
58249D95835O104O523O783O777P022P629P918P590P285P456P729P849Q177Q708
58235E99385Q801Q449Q699J0035J1459J1951J1807J1783J1946J2203J2895J4053
58223G33466J4905J4997J4957J5458J6284J7060J7955J9048J9886K0417K1298
58212I25731K2758K4131K5097K6277K7949K9414L0290L1271L2852L4533L6012
58201A246315L7853M0214M2229M3448M4607M6228M7785M9089N0975N3798N6668
58190A759209N9095O1845O5370O8987P2512P6926Q2375Q7443R1478R5770J01174
58179B622184J06609J11324J16580J23452J30939J37955J45288J53882J63108
58170C811321J72446J82921J95067K07528K19558K32720K48205K64752K81372
$$ plain form
58249 495835 501939 508462 515245 522022 529044 536673 544591 552181 559466 566922 574651 582500 590677 599385
58235 599385 608186 616635 625334 635369 646828 658779 670586 682369 694315 706518 719413 733466
58223 733466 748371 763368 778325 793783 810067 827127 845082 864130 884016 904433 925731
58212 925731 948489 972620 997717 1023994 1051943 1081357 1111647 1142918 1175770 1210303 1246315
58201 1246315 1284168 1324382 1366611 1410059 1454666 1500894 1548679 1597768 1648743 1702541 1759209
58190 1759209 1818304 1880149 1945519 2014506 2087018 2163944 2246319 2333762 2425240 2521010 2622184
58179 2622184 2728793 2840117 2956697 3080149 3211088 3349043 3494331 3648213 3811321
58170 3811321 3983767 4166688 4361755 4569283 4788841 5021561 5269766 5534518 5815890
58161E815890K99809L22080L47822L76288M08472M44815M83434N23349N66878
58152I588837O16185O70315P28287P91891Q62333R37668J017111J104446J203729
58143A7520802J315976J444544J599449J791324K025278K305408K639538L032633
58135C3674952L480076L973055M505218N073573N692229O414927P303860Q307538
58127G8425428R142655R339655Q476911O433261L470103J16118l038393n532541
58119A06833197p154585p952130q131351p918915p483001o933536o345111n762121
58111D9152447n201461m669405m175009l725080l316722k943351k602968k295418
58103B0223033k017325j765542j541437j346836j179142j034331r11094q08186
$$ plain form
58161 5815890 6115699 6437779 6785601 7161889 7570361 8015176 8498610 9021959 9588837
58152 9588837 10205022 10875337 11603624 12395515 13257848 14195516 15212627 16317073 17520802
58143 17520802 18836778 20281322 21880771 23672095 25697373 28002781 30642319 33674952
58135 33674952 37155028 41128083 45633301 50706874 56399103 62814030 70117890 78425428
58127 78425428 87568083 96907738 105384649 111817910 115288013 115404131 112365738 106833197
58119 106833197 99678612 91726482 83595131 75676216 68193215 61259679 54914568 49152447
58111 49152447 43950986 39281581 35106572 31381492 28064770 25121419 22518451 20223033
58103 20223033 18205708 16440166 14898729 13551893 12372751 11338420 10427326 9619140
58095I619140p21014o44798n78426n22003m73281m29703l91399l59046l30874
58086E168596l04633k80443k59080k39386k20019k01925j86661j73792j62256
58077C140401j52571j45436j39559j33044j25796j18726j11840j04897r8601r3465
58067A916466q8620q3244p7983p3560o9349o4687o0262n6807n3767n0629m8121
58056A189437m6698m5250m2839m0317l8753l7614l6041l4558l3839l3083l1327
58045G69118k9271k8059k7294k5951k4328k3338k2681k1418j9688j8308j7280
58034E11502j6103j4977j4315j3681j2529j1384j0946j0721r878q761q256q220
58022C71731p967p707q045q553q245p191o271n725n161m767n098n922o387o281
$$ plain form
58095 9619140 8898126 8253328 7674902 7152899 6679618 6249915 5858516 5499470 5168596
58086 5168596 4863963 4583520 4324440 4085054 3865035 3663110 3476449 3302657 3140401
58077 3140401 2987830 2842394 2702835 2569791 2443995 2325269 2213429 2108532 2009931 1916466
58067 1916466 1827846 1744602 1666619 1593059 1523710 1459023 1398761 1341954 1288187 1237558 1189437
58056 1189437 1142739 1097489 1054650 1014333 975580 937966 901925 867367 833528 800445 769118
58045 769118 739847 711788 684494 658543 634215 610877 588196 566778 547090 528782 511502
58034 511502 495399 480422 466107 452426 439897 428513 417567 406846 396968 388207 379951 371731
58022 371731 363764 356057 348012 339459 331214 324023 317752 312027 306866 302099 297001 291079 284692 278411
58008B78411o023n678m991m229l899l853l573l162l130l409l514l454l602l881
57994B22013l946l911m057m125l727l170k969k921k562k187k433l109l457l395
57980A76044l458l679l554l094k859k967k914k484k055j901j925k088k454k764
57966A37848k664k326k257k523k689k552k319k134j916j621j256p84l54l19o37
57951A11497o87j65L49L01R6L58P67N76m6k48J47M84M07J68p8m72q21o89k30j20
57931A11594n62j066j319j544j832j892j630j409j457j530j372j087q73p78p62
57916I2481o97l51K51O17L69q9l7N17Q65O43K40Q3R2l3l29o41q06p70o67p31r39
57895I0068r73p77p85j217j569j327q17o53p44n54j02J03O1L08R61J537J772J870
$$ plain form
58008 278411 272388 266710 261719 257490 253591 249738 246165 243003 239873 236464 232950 229496 225894 222013
57994 222013 218067 214156 210099 205974 202247 199077 196108 193187 190625 188438 186005 182896 179439 176044
57980 176044 172586 168907 165353 162259 159400 156433 153519 151035 148980 147079 145154 143066 140612 137848
57966 137848 135184 132858 130601 128078 125389 122837 120518 118384 116468 114847 113591 112807 112453 112134 111497
57951 111497 110810 110645 110994 111295 111391 111749 112516 113092 113046 112798 112945 113429 113836 114004 113926 113454 112633 111944 111714 111594
57931 111594 111032 109966 108647 107103 105271 103379 101749 100340 98883 97353 95981 94894 94021 93243 92481
57916 92481 91784 91433 91684 92301 92670 92581 92544 93061 93926 94569 94809 94892 94984 94951 94622 93981 93175 92405 91738 91007 90068
57895 90068 89095 88318 87533 86316 84747 83420 82603 81950 81206 80652 80550 80653 80714 81022 81983 83520 85292 87162
57877H7162J869J524J009R84J603K161J967J136K18m55q24r13r03j098j555k002
57861I1883k206k162j952j669j559j789k127k159j843j457j068n18Q5L70K15j10
57845G1934l75n67o41n62n50q38j210j215q62n90n65n55m76n15o33n27k42k03
57827F0808m72n35n4O02Q69O10Q1l87m76o5N12P41N51K86J09j06k45O0P23J147
57807F4759J097J108J606K228K391K142J925J870J808J719J722J716J482J079
57793H8652P70O43N24K43j98o87j047j141j026r57j097j316j363j165q55n96m45
57776G8939l31j67pk1k33m29m33l40k90j84J04M15N30N56P24R20Q20M38J09j4
57756H1106m6pJ87L74K40j91o06r54j437j970k196k102k127k402k515k212j850
$$ plain form
57877 87162 89031 90555 91564 92548 94151 96312 98279 99415 99633 99178 98354 97441 96538 95440 93885 91883
57861 91883 89677 87515 85563 83894 82335 80546 78419 76260 74417 72960 71892 71374 71459 71829 72044 71934
57845 71934 71559 70992 70351 69789 69239 68401 67191 65976 65114 64524 63959 63404 62928 62413 61780 61253 61011 60808
57827 60808 60336 59801 59747 60349 61218 61828 61909 61522 61046 60981 61493 62234 62785 63071 63180 63074 62829 62889 63612 64759
57807 64759 65856 66964 68570 70798 73189 75331 77256 79126 80934 82653 84375 86091 87573 88652
57793 88652 89422 90065 90589 90832 90634 89947 88900 87759 86733 85776 84679 83363 82000 80835 79980 79384 78939
57776 78939 78608 78441 78434 78413 78180 77751 77318 76978 76688 76504 76608 77023 77553 78109 78833 79753 80573 81011 81120 81106
57756 81106 81060 81053 81240 81614 81854 81663 81057 80103 78666 76696 74500 72398 70271 67869 65354 63142 61292
57739F1292j817j955j873j537j143p74m34k07j11n1n8k93o58p64m82j85j54j65
57721D8631N2L08L10J87K32L54K58qr5N4P4l49j067j679j900j764j532j427j448
57702C9191j441j314j072o84j58K77L47J65J75O01J167J528J657J683J620J468
57686D5210J346J320J305J283J351J496J512J341J216J236J145P54L18J94L38
57671F1365M73N49O74P59O11L25K27L90N01L02j10m74o62o82n66m04l70n69q61
57652F1478j000r47r59j240j623j746j538j323j354j499j496j344j187j013p05
57637D2504l40j30j54l19n33o75n32l1N35Q17Q59R67J203J353J387J522J882K333
57619E2648K734L048L249L389L715M416N378O430P681R231J0746J1810J2506J3040
$$ plain form
57739 61292 59475 57520 55647 54110 52967 52193 51759 51552 51441 51390 51332 51039 50381 49617 49135 48950 48796 48631
57721 48631 48683 48991 49301 49488 49720 50074 50332 50324 50229 50283 50357 50008 48941 47262 45362 43598 42066 40639 39191
57702 39191 37750 36436 35364 34680 34522 34799 35146 35311 35486 36087 37254 38782 40439 42122 43742 45210
57686 45210 46556 47876 49181 50464 51815 53311 54823 56164 57380 58616 59761 60515 60833 61027 61365
57671 61365 61838 62387 63061 63820 64431 64756 64983 65373 65874 66176 66066 65592 64930 64248 63682 63278 62908 62339 61478
57652 61478 60478 59531 58572 57332 55709 53963 52425 51102 49748 48249 46753 45409 44222 43209 42504
57637 42504 42164 42034 41880 41561 41028 40353 39821 39790 40325 41142 42001 42968 44171 45524 46911 48433 50315 52648
57619 52648 55382 58430 61679 65068 68783 73199 78577 85007 92688 101919 112665 124475 136981 150021
57605A50021J2873J1006P222K387k523p027j0667j2785j3272j2863j2295j1608
57593A00469j0632r528q453p249n946n054m802m602l866k931k486k454k202j595
57579B8669j149j151j322j357j271j132r32q29j033j423j574j324r65q17q70r35
57563A0585r37r61j112j403j715j856H72d98q45k61Q8r1o86j230j459j538j591
57546h111j423r52n96p74j309j642j481r56l27Q2n0p09j425j779j816j737j468
57529b6473r78o87r70j505j632j326j145j329j450j123n50j60r5k79o29j021j252
57512d2604j187q95n84m87p62j293j734j866j853j867j706j112l29O6r9m35n75
57495e9322n09l35k9L13M21J98p8r6J25L45L94K78J19J00L24O55Q62R01R32J015
$$ plain form
57605 150021 162894 173900 181122 183509 180986 173959 163292 150507 137235 124372 112077 100469
57593 100469 89837 80309 71856 64607 58661 53607 48805 44203 40337 37406 34920 32466 30264 28669
57579 28669 27520 26369 25047 23690 22419 21287 20355 19526 18493 17070 15496 14172 13207 12390 11520 10585
57563 10585 9648 8687 7575 6172 4457 2601 872 -498 -1343 -1604 -1516 -1607 -2293 -3523 -4982 -6520 -8111
57546 -8111 -9534 -10486 -11082 -11856 -13165 -14807 -16288 -17244 -17571 -17489 -17539 -18248 -19673 -21452 -23268 -25005 -26473
57529 -26473 -27451 -28138 -29108 -30613 -32245 -33571 -34716 -36045 -37495 -38618 -39168 -39328 -39423 -39702 -40331 -41352 -42604
57512 -42604 -43791 -44686 -45270 -45757 -46519 -47812 -49546 -51412 -53265 -55132 -56838 -57950 -58279 -58213 -58312 -58747 -59322
57495 -59322 -59831 -60166 -60195 -59882 -59461 -59263 -59341 -59437 -59312 -58967 -58573 -58295 -58176 -58076 -57752 -57097 -56235 -55334 -54402 -53387
57475e3387R87O88J86k88n05m18k23k61o61j189j525j630j646j589j395j175j137
57458f5168j229j206r97q15q09r13j034j146j177j035q40q15r55r98q74q36j039
57441h1886j268j309j267j329j382j243j042j065j282j369j244j154j182j006
57427i9028m44O9r2q97j636j740j355r49p32o29o08o72p12o30n59o78q87r53r29
57408a14061j065j305j270q36l78k79m91p24q04o38j77L55M71q1r34j504j622
57391a25343j510j325j037p15n66o39p16n69k65j13l46q60j271j306j069q52p47
57374a39249o41m93m05m02m28n23p38q80p15m47n82j198j743j769j491j390j618
57357a54712j973k194k061j535j006r81j374j508j062n33m63o92q44j012j440
$$ plain form
57475 -53387 -52400 -51712 -51526 -51814 -52319 -52737 -52960 -53221 -53882 -55071 -56596 -58226 -59872 -61461 -62856 -64031 -65168
57458 -65168 -66397 -67603 -68600 -69415 -70224 -71137 -72171 -73317 -74494 -75529 -76369 -77184 -78139 -79137 -80011 -80847 -81886
57441 -81886 -83154 -84463 -85730 -87059 -88441 -89684 -90726 -91791 -93073 -94442 -95686 -96840 -98022 -99028
57427 -99028 -99472 -99403 -99495 -100392 -102028 -103768 -105123 -106072 -106804 -107433 -108041 -108713 -109425 -110055 -110614 -111292 -112179 -113132 -114061
57408 -114061 -115126 -116431 -117701 -118537 -118915 -119194 -119685 -120409 -121213 -121851 -122028 -121673 -121202 -121283 -122217 -123721 -125343
57391 -125343 -126853 -128178 -129215 -129930 -130496 -131135 -131851 -132420 -132685 -132798 -133144 -134004 -135275 -136581 -137650 -138502 -139249
57374 -139249 -139890 -140383 -140788 -141190 -141618 -142141 -142879 -143759 -144474 -144921 -145503 -146701 -148444 -150213 -151704 -153094 -154712
57357 -154712 -156685 -158879 -160940 -162475 -163481 -164462 -165836 -167344 -168406 -168939 -169402 -170094 -170938 -171950 -173390
57342a73390j878j881j496j144j007j003j108j275j217p92l84m04o61p57p83j068
57326a90248j396j251p38n13p95j099j056r10r74j184j418j787k364k882k942
57311b11557k394j452o33m36q21j139q85m05l67p91j096j016q30p06m65r9Q1k8
57293b25039j66k45n03r46j123p83k76pN7J05M8k12m41l91k14k59n43p67p46n94
57273b33045n09n47o11n84n18o26j010j434j582j486j460j610j684j445r47m31
57257b49529j32j96n48q47q02n62n36q16j043q97n16k71l37n60o71n89m92n51
57239b59895o14m28j78m01j154j733j595j117r43r97p69k95p9j67j06K23M17L37
57221b69494L21N25O49N61N52P73R63R41Q48O31p1j259k247k489k231k052k093
$$ plain form
57342 -173390 -175268 -177149 -178645 -179789 -180796 -181799 -182907 -184182 -185399 -186191 -186575 -186979 -187640 -188397 -189180 -190248
57326 -190248 -191644 -192895 -193633 -194146 -194941 -196040 -197096 -198006 -198980 -200164 -201582 -203369 -205733 -208615 -211557
57311 -211557 -213951 -215403 -216036 -216472 -217293 -218432 -219317 -219722 -220089 -220880 -221976 -222992 -223822 -224528 -224993 -225092 -225011 -225039
57293 -225039 -225205 -225450 -225953 -226899 -228022 -228805 -229081 -229088 -229031 -228926 -228878 -229090 -229531 -229922 -230136 -230395 -230938 -231705 -232451 -233045
57273 -233045 -233554 -234101 -234712 -235296 -235814 -236440 -237450 -238884 -240466 -241952 -243412 -245022 -246706 -248151 -249098 -249529
57257 -249529 -249661 -249857 -250405 -251252 -252054 -252616 -253152 -253968 -255011 -255908 -256424 -256695 -257032 -257592 -258263 -258852 -259344 -259895
57239 -259895 -260509 -260937 -261115 -261516 -262670 -264403 -265998 -267115 -268058 -269055 -269824 -270119 -270198 -270365 -270471 -270248 -269831 -269494
57221 -269494 -269173 -268648 -267999 -267438 -266886 -266113 -265150 -264209 -263361 -262730 -262801 -264060 -266307 -268796 -271027 -273079 -275172
57204b75172k189k375k832l476l966m087l920l734l806m183m563m616m428m388
57190c27735m590m701m506m221m139m242m321m215l858l321k893k853l111l265
57176c81971l094k715k349k234k641l582m502m737m277l638l011k090q10L46R97
57161d20308J340J727K185K564K845L035L077L038L134L432L748L918L908L686
57147c78671L286K935K816K761K520K195K003J779J187L05n48j386k348l099l216
57132c67481l084l592m841o024o641p060p677q300q684q936r131r171r244r756
57118d69622j0617j1298j1757j2610j4048j5472j6456j7414j8850k0630k2380
57107f41154k4013k5493k6661k7594k8648k9833l0722l1185l1643l2423l3506
$$ plain form
57204 -275172 -277361 -279736 -282568 -286044 -290010 -294097 -298017 -301751 -305557 -309740 -314303 -318919 -323347 -327735
57190 -327735 -332325 -337026 -341532 -345753 -349892 -354134 -358455 -362670 -366528 -369849 -372742 -375595 -378706 -381971
57176 -381971 -385065 -387780 -390129 -392363 -395004 -398586 -403088 -407825 -412102 -415740 -418751 -420841 -421651 -421305 -420308
57161 -420308 -418968 -417241 -415056 -412492 -409647 -406612 -403535 -400497 -397363 -393931 -390183 -386265 -382357 -378671
57147 -378671 -375385 -372450 -369634 -366873 -364353 -362158 -360155 -358376 -357189 -356884 -357432 -358818 -361166 -364265 -367481
57132 -367481 -370565 -374157 -378998 -385022 -391663 -398723 -406400 -414700 -423384 -432320 -441451 -450622 -459866 -469622
57118 -469622 -480239 -491537 -503294 -515904 -529952 -545424 -561880 -579294 -598144 -618774 -641154
57107 -641154 -665167 -690660 -717321 -744915 -773563 -803396 -834118 -865303 -896946 -929369 -962875
57096i62875l5019l7231l9933m2558m5151m8347n2272n6372o0503o5239p0716
57085a516216p6218q1322q6507r2196r8075j03839j09749j15960j22182j28440
57075b530704j35358j43294j52038j61654j72669j85136j98533k12904k29051
57066d121341k47300k67301k89243l13967l41486l70911m02277m36965m75836
57057g266627n18632n65908o19879o82520p54565q37271r33585j046627j178633
57048a4404247j332347j511672j720046j959971k235325k552758k920549l348790
57040c1985705l851628m446182n146786n961332o893450p945635r120284j0422106
57032h5773108j1859382j3433725j5119943j6855797j8553228k0115695k1441848
$$ plain form
57096 -962875 -997894 -1035125 -1075058 -1117616 -1162767 -1211114 -1263386 -1319758 -1380261 -1445500 -1516216
57085 -1516216 -1592434 -1673756 -1760263 -1852459 -1950534 -2054373 -2164122 -2280082 -2402264 -2530704
57075 -2530704 -2666062 -2809356 -2961394 -3123048 -3295717 -3480853 -3679386 -3892290 -4121341
57066 -4121341 -4368641 -4635942 -4925185 -5239152 -5580638 -5951549 -6353826 -6790791 -7266627
57057 -7266627 -7785259 -8351167 -8971046 -9653566 -10408131 -11245402 -12178987 -13225614 -14404247
57048 -14404247 -15736594 -17248266 -18968312 -20928283 -23163608 -25716366 -28636915 -31985705
57040 -31985705 -35837333 -40283515 -45430301 -51391633 -58285083 -66230718 -75351002 -85773108
57032 -85773108 -97632490 -111066215 -126186158 -143041955 -161595183 -181710878 -203152726
57025b03152726k2417432k2907758k2754369k1783689j9848983j6904168j3056012
57018c42825137q540847l647782J334281O116195J0407777J3966663J6667685
57011c06521165J8526573J9660750K0225488K0361788K0166022J9685273J8940529
57004a68954742J7959922J6793137J5500621J4138266J2753123J1384946J0065627
56997g0359100Q819315P665679O620788N693426M883332M184742L589710L087516
56989b5814592K664652K308239K008325J756162J542716J360479J204806J072005
56981a1897208R57669Q58078P71433O96225O29779N69849N16278M69572M28755
56972e999570L91925L58126L27373K99399K73426K48934K26068K05709J89391
$$ plain form
57025 -203152726 -225570158 -248477916 -271232285 -293015974 -312864957 -329769125 -342825137
57018 -342825137 -351365984 -355013766 -353679485 -347563290 -337155513 -323188850 -306521165
57011 -306521165 -287994592 -268333842 -248108354 -227746566 -207580544 -187895271 -168954742
57004 -168954742 -150994820 -134201683 -118701062 -104562796 -91809673 -80424727 -70359100
56997 -70359100 -61539785 -53874106 -47253318 -41559892 -36676560 -32491818 -28902108 -25814592
56989 -25814592 -23149940 -20841701 -18833376 -17077214 -15534498 -14174019 -12969213 -11897208
56981 -11897208 -10939539 -10081461 -9310028 -8613803 -7984024 -7414175 -6897897 -6428325 -5999570
56972 -5999570 -5607645 -5249519 -4922146 -4622747 -4349321 -4100387 -3874319 -3668610 -3479219
56963c479219J78308J71863J67753J63777J58896J52528J44115J34008J23702
56954b084269J14439J06215R8595R1666Q5503P9579P3369O7041O0970N5100M9290
56943a202502M3737L8561L3549K8711K4577K1473J9047J6872J5094J4016J3542
56932i33323J3387J3438J3585J3600J3457J3393J3437J3341J3128J3211J3711
56921g85635J4188J4205J3791J3160J2434J1806J1443J1121J0447R555R039R095
56909f45351R307R389R487R692R856J0059J0538J1021J0909J0313J0111J0654
56897e24015J1181J0948J0201R515Q901Q076P164O501O159O090O349O857P268
56884d18805P485P841Q491R103R445R760J0201J0456J0331J0190J0343J0489J0320
$$ plain form
56963 -3479219 -3300911 -3129048 -2961295 -2797518 -2638622 -2486094 -2341979 -2207971 -2084269
56954 -2084269 -1969830 -1863615 -1765020 -1673354 -1587851 -1508272 -1434903 -1367862 -1306892 -1251792 -1202502
56943 -1202502 -1158765 -1120204 -1086655 -1057944 -1033367 -1011894 -992847 -975975 -960881 -946865 -933323
56932 -933323 -919936 -906498 -892913 -879313 -865856 -852463 -839026 -825685 -812557 -799346 -785635
56921 -785635 -771447 -757242 -743451 -730291 -717857 -706051 -694608 -683487 -673040 -663485 -654446 -645351
56909 -645351 -636044 -626655 -617168 -607476 -597620 -587561 -577023 -566002 -555093 -544780 -534669 -524015
56897 -524015 -512834 -501886 -491685 -482170 -473269 -465193 -458029 -451528 -445369 -439279 -432930 -426073 -418805
56884 -418805 -411320 -403479 -394988 -385885 -376440 -366680 -356479 -346023 -335692 -325502 -315159 -304670 -294350
56871b94350J0141J0289J0306R404P584N643M212L316K794K642K827L103L188
56858b18901K967K599K444K732L246L496L303K933K652K450K306K333K512K640
56844a80288K770L260M166M932N024M534L976L709L829M314M936N367N553N781
56830a18137O173O451O391O165N997N826N592N444N339M841L699K388J661J716
56816e0454K124K392K360K201K261K789L605M215M415M515M842N323c652B544
56801I339P536Q319Q939Q925P741N484K965R13n96j684k219k154j905j865j831
56786D7907j396n89K93J264K485L792M854N737O798Q140R587J1096J2606J3557
56772A26131J3069J0821P380L598m3l346o065p887q639q431p612o614n707m906
$$ plain form
56871 -294350 -284209 -273920 -263614 -254210 -246626 -240983 -236771 -233455 -230661 -228019 -225192 -222089 -218901
56858 -218901 -215934 -213335 -210891 -208159 -204913 -201417 -198114 -195181 -192529 -190079 -187773 -185440 -182928 -180288
56844 -180288 -177518 -174258 -170092 -165160 -160136 -155602 -151626 -147917 -144088 -139774 -134838 -129471 -123918 -118137
56830 -118137 -111964 -105513 -99122 -92957 -86960 -81134 -75542 -70098 -64759 -59918 -56219 -53831 -52170 -50454
56816 -50454 -48330 -45938 -43578 -41377 -39116 -36327 -32722 -28507 -24092 -19577 -14735 -9412 -3652 2544
56801 9339 16875 25194 34133 43058 50799 56283 59248 60161 59565 57881 55662 53508 51603 49738 47907
56786 47907 46511 45922 46215 47479 49964 53756 58610 64347 71145 79285 88872 99968 112574 126131
56772 126131 139200 150021 157401 160999 160956 157610 151545 143658 135019 126588 118976 112362 106655 101749
56758A01749m077l113j982p36N10J701L026M758O860Q958J0637J1617J1530R999
56744A61437P088L458j96l529o265p931q284p793p269p099p029o599n551l993
56730A00445k398j302p75l39M37J460K398L188L909M426M429L778K510O69j568
56715A21267l759n417o346o612o354n823n386n198n007m507l758l047k535k247
56701E5271k222k406k517k332j946j577j291j108j106j181r86m21O3Rm03o75o68
56684C4504o31o49n59l02J3K90M56L60J2k51j86m2j57m03m25k80k70k58K18J118
56664C2558J799J887J690J607J560J319R93Q49Q75Q30O33M65N03P07Q13O31K93
56647E0012J59L40N32M40J97Q1J3k26m66l03K18N63M56K25K77N95R03J053R92
$$ plain form
56758 101749 97672 94559 92577 91841 92351 94052 97078 101836 108696 117654 128291 139908 151438 161437
56744 161437 168525 171983 171787 168258 161993 154062 145778 137985 130716 123617 116588 109989 104438 100445
56730 100445 98047 96745 95970 95631 96068 97528 99926 103114 107023 111449 115878 119656 122166 122835 121267
56715 121267 117508 112091 105745 99133 92779 86956 81570 76372 71365 66858 63100 60053 57518 55271
56701 55271 53049 50643 48126 45794 43848 42271 40980 39872 38766 37585 36599 36178 36241 36250 35847 35172 34504
56684 34504 33873 33224 32665 32363 32376 32666 33122 33482 33494 33243 33057 33015 32858 32455 32030 31750 31480 31222 31440 32558
56664 32558 34357 36244 37934 39541 41101 42420 43413 44262 45137 45967 46600 47065 47568 48275 49088 49719 50012
56647 50012 50171 50511 51043 51483 51680 51761 51774 51548 51082 50779 50997 51560 52016 52241 52518 53113 54016 55069 56061
56628E6061P46N22O12R65J167J013Q35R94J325J412J174Q57O01L21J0k08l12m01
56610F7694m30j99K80O48O14L67L34N96P80N86J90k6kkj71l36l38k97l98n65n24
56589F8801j56L66P39P45L81j00l49k42k8n3l46o07n51k24P4N8k68o43q22q11
56569F5964p86p97p22m85j95L7K04L11L23K88L38M88N74M67K57Q8KJ5J77M39O07
56548F7594N70M30L00J62J6J9K52N47O71N97M28K48J02N5R6J10P7J01K17L20L74
56527G3286M62O11O93O46N13K73j08l97k33L32Q29J013J097J165R36L84Q0M42
56509H2024J049J252J049R04R46R82J038J311J712J983K150K374K442J994J173
56494A04383N50L97M79N64O31N86K29l61p77p75n11k50p4M3Q9Kl14q43j241j067
$$ plain form
56628 56061 56807 57329 57941 58906 60073 61086 61921 62915 64240 65652 66826 67683 68284 68605 68615 68407 68095 67694
56610 67694 67264 67065 67345 67993 68607 68974 69308 69904 70684 71270 71460 71434 71432 71430 71259 70923 70585 70288 69890 69325 68801
56589 68801 68645 69011 69750 70495 70876 70776 70427 70185 70157 70104 69758 69151 68600 68376 68450 68508 68240 67597 66775 65964
56569 65964 65178 64381 63659 63174 62979 63016 63220 63531 63854 64142 64480 64968 65542 66009 66266 66354 66356 66371 66548 66987 67594
56548 67594 68164 68594 68894 69056 69072 69091 69343 69890 70561 71158 71586 71834 71936 71991 72087 72197 72274 72375 72592 72912 73286
56527 73286 73748 74359 75052 75698 76211 76484 76376 75979 75746 76078 76907 77920 79017 80182 81118 81502 81582 82024
56509 82024 83073 84325 85374 86278 87224 88206 89244 90555 92267 94250 96400 98774 101216 103210 104383
56494 104383 104933 105330 105809 106373 107004 107590 107819 107458 106681 105906 105395 105145 105071 105114 105203 105205 104891 104048 102807 101740
56474A01740m15J6k19p33r04p16n28m08k57k65n90q45n97j70k20o64q45o37n87
56455I2156q37r01n99m06n55n87j90J59l6m96n74j32M63Q57Q77N05j3k74j76j4
56435H9227J1M8K14L71M48N81P32N97J14k77k27O1J65J2j72k28j41nJ0j21j00
56414I1320L26Q17P56J51k81j35J83J83rj11k25n50q41p15k33J84K89J40q8k01
56394I0960j08Kj64n13n98k67R6J66J08J41J56N5N8L17N49M95L62M55O68P07N92
56373I4237N51N86N40M10L49L99M72M38J44l66o61l43K79M31n5m70k82J54L03
56354I7116K46K84K86M4j88r3J06M5r0Q2M05M50K40J13N6j64l73j74K87M66K47
56333I9391J22M02Q61J173J271J194R71P04M73K12n2j8M18P46M33k30m93k09P4
$$ plain form
56474 101740 101325 101341 101122 100389 99485 98769 98241 97833 97576 97311 96721 95876 95279 95109 94889 94225 93380 92743 92156
56455 92156 91319 90418 89819 89413 88858 88271 88081 88240 88204 87708 87134 87002 87465 88322 89199 89704 89691 89417 89241 89227
56435 89227 89238 89286 89500 89871 90319 90900 91632 92229 92343 92066 91839 91900 92065 92077 91905 91677 91536 91531 91541 91420 91320
56414 91320 91646 92463 93219 93370 93089 92954 93137 93320 93311 93200 92975 92425 91584 90869 90636 90820 91109 91249 91161 90960
56394 90960 90852 90854 90690 90177 89579 89312 89408 89574 89682 89823 89979 90034 90092 90409 90958 91453 91815 92270 92938 93645 94237
56373 94237 94788 95374 95914 96324 96673 97072 97544 97982 98126 97760 97099 96756 97035 97466 97411 96941 96659 96813 97116
56354 97116 97362 97646 97932 97976 97788 97695 97801 97846 97756 97838 98243 98693 98933 99046 99102 98938 98565 98391 98678 99144 99391
56333 99391 99513 99915 100776 101949 103220 104414 105385 106089 106562 106774 106722 106704 107122 107868 108301 108071 107578 107369 107443
56314A07443R5J72M39M80K9m84n12l6N62J025J228J043N17J1j14J14L80M69M23
56295A13284M23O06Q98J011P50L08R5K27M30M19K62K20M11O77P78O31M27M10N87
56276A22854P20P03P23R31J156J130Q71N96M37M26O21R69J162R58N62M32P46J230
56258A37227J503J398J016O66O49R76J349J494J383J085O74M22O79J381J970K081
56242A55953J990K069K257K373K577K983L218K937K534K637L144L385L169K947
56228A94173L015L203L438L921M584N020N138N355N881O299O172N708N509N866
56214B63282O574P258P720Q099Q705R619J0529J1149J1653J2377J3281J4096J4908
56201C99250J6071J7567J9014K0349K2025K4320K6930K9422L1679L3776L5783
$$ plain form
56314 107443 107538 107710 108149 108629 108658 108174 107662 107626 108188 109213 110441 111484 112001 112012 111898 112012 112392 112861 113284
56295 113284 113707 114313 115211 116222 116972 117280 117375 117602 118032 118451 118713 118933 119344 120021 120799 121430 121857 122267 122854
56276 122854 123574 124277 125000 125931 127087 128217 129088 129684 130121 130547 131168 132137 133299 134257 134819 135251 135997 137227
56258 137227 138730 140128 141144 141810 142459 143435 144784 146278 147661 148746 149420 149842 150521 151902 153872 155953
56242 155953 157943 160012 162269 164642 167219 170202 173420 176357 178891 181528 184672 188057 191226 194173
56228 194173 197188 200391 203829 207750 212334 217354 222492 227847 233728 240027 246199 251907 257416 263282
56214 263282 269856 277114 284834 292933 301638 311257 321786 332935 344588 356965 370246 384342 399250
56201 399250 415321 432888 451902 472251 494276 518596 545526 574948 606627 640403 676186
56190F76186L7935M0568M3629M6503M8547M9578M9738M9157M7889M5954M3205
56179A178889L9370L4319K8194K1236J3735O105j336q637j5949k2920k8794l3287
56167A210925l6898m0154m2860m4513m5130m5258m5250m4832m3560m1477l9215
56156G41778l7389l5962l4357l2241k9940k7947k6256k4514k2629k0815j9154
56145D30574j7521j5973j4783j3972j3183j2081j0686r210p873o908o445o277
56133B95662n986n405m729m155l639l075k519k138k063k237k329j918r99o2M57
56118B54865O32O93N59J03l67m25j57L1J25M77J156J800K159K311K400K579L112
56101B72053M034M819M896M472M282M643N268N958O793P650Q219Q610R283J0294
$$ plain form
56190 676186 714121 754689 798318 844821 893368 942946 992684 1041841 1089730 1135684 1178889
56179 1178889 1218259 1252578 1280772 1302008 1315743 1321848 1320512 1311875 1295926 1273006 1244212 1210925
56167 1210925 1174027 1133873 1091013 1046500 1001370 956112 910862 866030 822470 780993 741778
56156 741778 704389 668427 634070 601829 571889 543942 517686 493172 470543 449728 430574
56145 430574 413053 397080 382297 368325 355142 343061 332375 323165 315292 308384 301939 295662
56133 295662 289676 284271 279542 275387 271748 268673 266154 264016 261953 259716 257387 255469 254470 254408 254865
56118 254865 255497 256190 256749 256852 256485 256060 255903 255934 256059 256536 257692 259492 261651 263962 266362 268941 272053
56101 272053 276087 280906 285802 290274 294556 299199 304467 310425 317218 324868 333087 341697 350980 361274
56087C61274J1282J2280J3820J6049J8421K0500K2430K4289K5631K6032K5580
56076E77588K4482K2683K0195J7402J4738J2444J0742R737Q969P649N613L487
56064G35729J718L2j824l505m679n712p227r380j1999j4991j8167k0962k2806
56051F16227k3632k3735k3351k2561k1355j9621j7355j4951j2943j1385r890q317
56039D07131o933n800m631l367k379j872j594j353j236j148p33K3O93J101J504
56024C79406J937K053J889K008K579L038L038L047L499M096M427M689N230N923
56010D26859O515P036P452P437O967O619O807P180P228O995O791O685O701O992
55996E24264P460P734P753P880Q187Q345Q421Q987J0043J0794J0860J0892J1410
$$ plain form
56087 361274 372556 384836 398656 414705 433126 453626 476056 500345 525976 552008 577588
56076 577588 602070 624753 644948 662350 677088 689532 700274 710011 718980 726629 732242 735729
56064 735729 737447 737479 735655 732150 727471 721759 714532 705152 693153 678162 659995 639033 616227
56051 616227 592595 568860 545509 522948 501593 481972 464617 449666 436723 425338 415448 407131
56039 407131 400198 394398 389767 386400 384021 382149 380555 379202 377966 376818 376085 376108 376801 377902 379406
56024 379406 381343 383396 385285 387293 389872 392910 395948 398995 402494 406590 411017 415706 420936 426859
56010 426859 433374 440410 447862 455299 462266 468885 475692 482872 490100 497095 503886 510571 517272 524264
55996 524264 531724 539458 547211 555091 563278 571623 580044 589031 599074 609868 620728 631620 643030
55983F43030J2029J2340J2708J3491J4315J4864J5537J6598J7488J7732J7827
55972H07959J8455J9509K0616K1855K3251K4326K4970K5909K7564K9238L0243
55961A073895L1042L2358L4017L5572L7263L9411M1612M3468M5379M7766N0295
55950A512078N2713N5545N9059O2494O5314O8213P1843P5615P8899Q2323Q6656
55939B270752R1389R5721J00025J05055J10653J16483J23030J30609J38513J46428
55929C428658J55349J65775J76427J86380J96950K09594K23513K37474K52594
55920E232714K71004K92930L17344L44228L73869M05201M37412M72045N11163
55911H657910N54752O02364O55641P16388P84035Q58130R41490J037418J146076
$$ plain form
55983 643030 655059 667399 680107 693598 707913 722777 738314 754912 772400 790132 807959
55972 807959 826414 845923 866539 888394 911645 935971 960941 986850 1014414 1043652 1073895
55961 1073895 1104937 1137295 1171312 1206884 1244147 1283558 1325170 1368638 1414017 1461783 1512078
55950 1512078 1564791 1620336 1679395 1741889 1807203 1875416 1947259 2022874 2101773 2184096 2270752
55939 2270752 2362141 2457862 2557887 2662942 2773595 2890078 3013108 3143717 3282230 3428658
55929 3428658 3584007 3749782 3926209 4112589 4309539 4519133 4742646 4980120 5232714
55920 5232714 5503718 5796648 6113992 6458220 6832089 7237290 7674702 8146747 8657910
55911 8657910 9212662 9815026 10470667 11187055 11971090 12829220 13770710 14808128 15954204
55902A5954204J267811J408205J575721J776796K018185K311188K667109L090432
55894C2069651L581917M143258M769137N439947O135642O846412P531154Q038707
55886G8555825Q088095P375005N746823L316620M43014k397365m772814o427107
55878H9928096p325339p600129p445532p034643o493750n907040n321791m756057
55870C8043815m216401l712586l256029k851503k496950k188554j921351j687836
55862A5712605j481170j298884j140515j003550q84566p82128o95321o21015n55704
55853G249752m98552m49914m08238l71133l38208l10142k85948k63765k43415
55844D080437k25746k10158j95100j80467j67337j55839j45254j35751j27998
$$ plain form
55902 15954204 17222015 18630220 20205941 21982737 24000922 26312110 28979219 32069651
55894 32069651 35651568 39794826 44563963 50003910 56139552 62985964 70517118 78555825
55886 78555825 86643920 94018925 99765748 103082368 103525382 101128017 96355203 89928096
55878 89928096 82602757 75002628 67557096 60522453 54028703 48121663 42799872 38043815
55870 38043815 33827414 30114828 26858799 24007296 21510346 19321792 17400441 15712605
55862 15712605 14231435 12932551 11792036 10788486 9903920 9121792 8426471 7805456 7249752
55853 7249752 6751200 6301286 5893048 5521915 5183707 4873565 4587617 4323852 4080437
55844 4080437 3854691 3644533 3449433 3268966 3101629 2945790 2800536 2664785 2536787
55835B536787j21450j14808j07877j01416r5465q9417q3451p8279p3766o9123
55825A601735o4282n9791n5667n1613m8063m5668m4104m2516m0904l9849l9232
55814A070046l8466l7679l7448l7549l7187l6274l5299l4204l2526l0528k8956
55803F83930k7759k6216k4283k2705k1724k0762j9494j8236j7183j6087j4894
55792D54587j3890j3129j2394j1753j1464j1325j0841r997r196q527p742o913
55780C27416o402o200o001n822n909o065n847n317m918m702m380m052m044m135
55766B53622l768l110k970l530l973l680l007k603k541k520k401k213k019j973
55752B13314k164k299j963j310r69j167j395j156n55N4N35R00J077J068J020R86
$$ plain form
55835 2536787 2415337 2300529 2192652 2091236 1995771 1906354 1822903 1744624 1670858 1601735
55825 1601735 1537453 1477662 1421995 1370382 1322319 1276651 1232547 1190031 1149127 1109278 1070046
55814 1070046 1031580 993901 956453 918904 881717 845443 810144 775940 743414 712886 683930
55803 683930 656171 629955 605672 582967 561243 540481 520987 502751 485568 469481 454587
55792 454587 440697 427568 415174 403421 391957 380632 369791 359794 350598 342071 334329 327416
55780 327416 321014 314814 308813 302991 297082 291017 285170 279853 274935 270233 265853 261801 257757 253622
55766 253622 249854 246744 243774 240244 236271 232591 229584 226981 224440 221920 219519 217306 215287 213314
55752 213314 211150 208851 206888 205578 204609 203442 202047 200891 200336 200390 200925 201825 202902 203970 204990 205976
55736B05976P93L17l38j018j649k113k328k459k797l305l571l312k694k078j701
55721A77723j610j749j936j907j464n74O07J748K556L105L703M245M012K457k
55706A90914k324l874m745n259n575n695n525m912l956l147k909l104l257l174
55692A33458k962k652k214j842j761j808j655j373j309j467j474j176q22o10m90
55677A09843m40n56p54q53r26j226j675j848j587j211j020r61r01q87r70j045
55661I2983j003p88l35L21Q10P18J92j36J34P95J452J953K218K065J443O23q4
55644A03361o07r91j217j286j317j399j462j391j208j037j023j255j626j810j569
55629H4163j027n08j57Q9K52L12L99O51R64J135J233J444J652J534J077O18L34
$$ plain form
55736 205976 206769 207086 206748 205730 204081 201968 199640 197181 194384 191079 187508 184196 181502 179424 177723
55721 177723 176113 174364 172428 170521 169057 168483 169090 170838 173394 176499 180202 184447 188459 190916 190914
55706 190914 188590 184716 179971 174712 169137 163442 157917 153005 149049 145902 142993 139889 136632 133458
55692 133458 130496 127844 125630 123788 122027 120219 118564 117191 115882 114415 112941 111765 110943 110333 109843
55677 109843 109403 108847 108093 107240 106314 105088 103413 101565 99978 98767 97747 96786 95885 94998 94028 92983
55661 92983 91980 91192 90857 91178 91988 92706 92898 92762 92896 93691 95143 97096 99314 101379 102822 103445 103361
55644 103361 102754 101763 100546 99260 97943 96544 95082 93691 92483 91446 90423 89168 87542 85732 84163
55629 84163 83136 82628 82471 82560 82812 83124 83523 84174 85138 86273 87506 88950 90602 92136 93213 93831 94165
55612I4165J01j06j10L2n8n62j128j265q53j36M95O71L13j78l09j26j00l53m76
55593I0017k63p0j59k11Q9M04J83n17j173j521j689j698j428j064j064j521j956
55576G6359j972j748j683j731j524j009n99n86p00n06o1J33j54n61o61n16m40
55559F2041m81m41k72j31o0J8rl77r71j293j090o90n42o35o29m12k17k39l51k86
55539E2933K1L15K95n2m23n25l77k27k37l82n46o02m77k45j11j45j64m2N2q0k73
55518D8708k30k0mk71m82l43Q5N86J012J221J073O49K64J65L40O41Q77Q18L42
55499E5431l56q86j056r27o22k31N7J01Pj2J2n9j52j22j37m72q81p92j65L86M92
55478D9616M90P23R04O24O7k44j50N5J23L4j72m54o96q06p97p34o55o28o86o84
$$ plain form
55612 94165 94266 94160 94050 94082 94024 93462 92334 91069 90216 90080 90575 91246 91559 91381 91072 90946 90846 90493 90017
55593 90017 89754 89684 89525 89314 89403 89807 89990 89473 88300 86779 85090 83392 81964 80900 79836 78315 76359
55576 76359 74387 72639 70956 69225 67701 66692 66093 65507 64807 64301 64240 64373 64219 63658 62997 62481 62041
55559 62041 61560 61119 60847 60716 60656 60674 60665 60288 59317 58024 56934 56244 55702 55067 54438 54026 53809 53570 53219 52933
55539 52933 52954 53269 53564 53512 53089 52564 52187 51960 51723 51341 50795 50193 49716 49471 49360 49215 49051 49009 49061 48981 48708
55518 48708 48478 48458 48454 48183 47701 47358 47443 48029 49041 50262 51335 51984 52248 52413 52753 53394 54271 55089 55431
55499 55431 55075 54189 53133 52206 51584 51353 51410 51511 51518 51506 51518 51459 51307 51185 51048 50576 49695 48903 48738 49124 49616
55478 49616 50106 50829 51733 52357 52424 52180 52030 52085 52208 52242 52070 51616 50920 50114 49317 48583 47928 47300 46614 45930
55458D5930m69j94j63l54m20k81k35l72l83j20Q8Kj21j8R7m4k70k78j31j3J73
55437D2424N30P75N97J52k17m90p43p69m16o9k25p17r50p62m88l06q0J93L02K18
55417C8959J00m1k29k49P6L99K79l2N8M65N02M9k10O8L25Q7k80k90j21j39j50
55396C9626R3K01k92r50q90j01N04M07J27K89O89P20K71j91k97j28lj19m27p13
55376C8816p83o50m72k86L8N00Q39Q20N81M35M36L41N8j69j17P9J30Lj00p0LN1
55354D0483J21K30L25M09N10N11K32k58o11o05l56j08M4P0p8k59j83J94M99M75
55334D1645L57M41N27K27l18n68l72j45j51j57Q7L67L69J24j11k38k80j73Q4K44
55314D1959Rn28r38r12n48j79j4NQ4K91M55L41Jk42j86k7p9l59n77n14k63k9R6
$$ plain form
55458 45930 45461 45267 45104 44750 44330 44049 43814 43442 43059 42939 43027 43029 42908 42890 42987 42943 42673 42395 42264 42251 42424
55437 42424 42954 43729 44326 44478 44261 43771 43028 42259 41843 41774 41549 40832 39882 39120 38632 38326 38246 38439 38741 38959
55417 38959 39059 39018 38789 38540 38616 39015 39294 39262 39320 39785 40287 40336 40126 40194 40519 40606 40326 40036 39915 39776 39626
55396 39626 39719 39920 39628 38678 37788 37687 38191 38598 38725 39014 39703 40423 40694 40503 40206 40078 40075 39956 39529 38816
55376 38816 38033 37383 36911 36625 36663 37163 38002 38822 39403 39838 40274 40615 40673 40504 40387 40466 40596 40599 40499 40429 40432 40483
55354 40483 40604 40834 41159 41568 42078 42589 42821 42563 41952 41347 40991 40883 40927 40997 40919 40660 40477 40671 41170 41645
55334 41645 42002 42443 42970 43197 42879 42311 41939 41794 41643 41486 41573 41940 42309 42433 42322 42084 41804 41631 41715 41959
55314 41959 41968 41440 40502 39590 39042 38863 38849 38854 38938 39229 39684 40025 40026 39784 39598 39571 39492 39133 38556 38042 37779 37750 37846
55291C7846J24L7j93m27m25j27K01K76J52Q0P3j15m91o74l87J01L36L08L62N82
55271C7639O33K87k01m03j90K11N00N13K90K8j25j82j95r8J65L94L02p6l41k09
55251C8942J95N58O78N10J41j62j46P2P6k62n26l29R9K05j40n47o51m38p2L14
55231C8517N35L84p9m96n88m69m05l90j91K26N57N51L35K18K70K91J37j24l69
55212C8910n29n04k44M9K9k91m26n7M55N34K02RJ68K74j5m34n12j86K57O07Q17
55191C9113Q12N48J76o9j69k83m67n75m92k89j25j01j66j62L2L14M24K76Q8Q4
55171C8969J52J0l52o12n51l01j23o7rM0q3m26p14n70M6P30J031Q46M13k8l60
55150C8041m92l45m0J30L4r1N1L95N89M48J47n8j35k26l36l01j7L79O52P14O42
$$ plain form
55291 37846 37970 38007 37814 37387 36962 36835 37036 37312 37464 37544 37617 37502 37011 36337 35950 36051 36387 36695 37057 37639
55271 37639 38272 38559 38358 37955 37765 37976 38476 38989 39279 39307 39182 39000 38805 38707 38872 39266 39568 39492 39151 38942
55251 38942 39137 39695 40373 40883 41024 40862 40716 40788 40864 40602 40076 39747 39846 40051 39911 39364 38713 38275 38203 38517
55231 38517 39052 39436 39357 38861 38273 37804 37399 37009 36818 37044 37601 38152 38487 38705 38975 39266 39403 39279 38910
55212 38910 38381 37877 37633 37682 37711 37420 36994 36937 37392 37926 38128 38137 38305 38579 38564 38130 37618 37432 37689 38296 39113
55191 39113 39925 40473 40649 40580 40411 40128 39661 39086 38594 38305 38180 38079 37913 37751 37783 38097 38521 38797 38885 38969
55171 38969 39121 39131 38779 38167 37616 37315 37192 37125 37116 37156 37073 36647 35933 35363 35409 36139 37170 38016 38429 38401 38041
55150 38041 37549 37204 37164 37294 37328 37237 37288 37683 38272 38720 38867 38809 38674 38448 38112 37811 37794 38173 38825 39539 40181
55129D0181N06L14J58K00L95M33Q0m83q54q60o31k98R0M10N24M82M54L78Q4k74
55109D1289k44K26N42K44l10m06K6L65K03j70k57j1J91N2l40o08m50O7N21N87
55089D1517L64J61P2k0r6LK11K26k9k37j77r6l13o32n60j2N32O46M43K86K78K59
55067D2826J11j14l29m55l75o5K60L14J09n5j9L1j02k86k93j61q5j2K52N86N51
55046D2689K1m94m35R7M71L30l0j11J90N38O53N89N36M89L13K7j47j39j31k13
55026D5243j37K73P10P06L40J45L18M76L43J69K06J94j84o68o92j91L20M44K64
55007D8279lk98n73o65m81j41J86M42O25O89N96L68M9l02o09q35r69r56p02k63
54987D4437J12K73L47M47M10J05j91r4K70L60k9n26p08n44j99J75L82K28j55l59
$$ plain form
55129 40181 40687 41001 41159 41359 41754 42187 42267 41784 40930 40070 39439 39141 39231 39641 40165 40647 41101 41479 41563 41289
55109 41289 41045 41271 41813 42057 41747 41341 41367 41732 41935 41765 41508 41497 41688 41740 41400 40792 40342 40409 40930 41517
55089 41517 41881 42042 42114 42094 41998 42001 42212 42438 42409 42172 41995 41899 41586 40954 40394 40382 40914 41560 42003 42289 42567 42826
55067 42826 42937 42823 42494 42039 41664 41599 41859 42173 42282 42227 42208 42239 42137 41851 41558 41397 41312 41300 41552 42138 42689
55046 42689 42710 42216 41781 41878 42349 42679 42649 42538 42728 43266 43919 44508 45044 45533 45846 45873 45726 45587 45456 45243
55026 45243 45106 45379 46089 46795 47135 47280 47598 48074 48417 48586 48792 48986 48802 48134 47442 47251 47571 48015 48279
55007 48279 48276 47978 47405 46740 46259 46118 46304 46746 47371 48060 48656 49024 49073 48771 48162 47327 46358 45402 44700 44437
54987 44437 44549 44822 45169 45616 46026 46131 45940 45846 46116 46476 46447 45921 45213 44669 44470 44645 45027 45255 45100 44741
54967D4741k26n3j02k31k24j63j81j25J70M94N27L18J64J17nj75j54R1K14n9n81
54946D4557r30q24l89k0qj76q5L61P09O07L32L72O83P91N54L03K54K19L9j51k57
54925D6941l77n40n45l31j20o3j7P1L3j00Q2P26J259J095M58M9L7Jk54m45l73
54904D7587k19j04J12M46O00M36K42K86M33M42L68L75M06L25J74L5j48l39k68
54885E1189J51M72K84j07m0N28Q98O30J04j12j8K9o0l7K39O54J050J279J203Q56
54865E9192N94P95J394J953K249K460K715K721K139J179M41K11J28k61r07j393
54849G5610j566j686j958k160j965j463j118j189j448j500j251q78m97m4M54P14
54833E8055M74p1l75j46L00M62L22K75M85O31N03M33Q63J634K148K165K019K032
$$ plain form
54967 44741 44515 44462 44360 44129 43905 43742 43561 43436 43606 44100 44627 44945 45109 45226 45221 45046 44892 44983 45197 45138 44557
54946 44557 43627 42803 42414 42394 42386 42210 42125 42486 43195 43802 44134 44506 45189 45980 46534 46837 47091 47310 47349 47198 46941
54925 46941 46564 46024 45479 45148 45028 44965 44948 45019 45052 44952 45034 45760 47019 48114 48572 48621 48658 48659 48405 47960 47587
54904 47587 47368 47264 47376 47822 48422 48858 49100 49386 49819 50261 50629 51004 51410 51735 51909 51944 51796 51457 51189
54885 51189 51340 51812 52096 51989 51949 52477 53375 54005 54109 53997 53979 54008 53948 53911 54150 54804 55854 57133 58336 59192
54865 59192 59786 60581 61975 63928 66177 68637 71352 74073 76212 77391 77832 78043 78171 77910 77003 75610
54849 75610 74044 72358 70400 68240 66275 64812 63694 62505 61057 59557 58306 57428 56931 56887 57341 58055
54833 58055 58529 58458 58083 57937 58237 58699 59021 59296 59781 60412 60915 61348 62211 63845 65993 68158 70177 72209
54815G2209K067J823J270O08m6o79j230j598j734j635j376j172j277j654j969
54800F3607j980j809j656j498j261j090j145j262j124p25l54j47j1N7j07m72p36
54783D8287p51p42q70r02n49K7M24N37O06P16O50L03m2o4J97M31M48K93O3j70
54763D8892l08k92k35k94l97k16L72J012J187P91K14j57k84l09k34M4M39O59N36
54744E1420K38O3P9O0j68m31m20j05J72J31q0j07R8K19O7j02P3N16P52M72r8m40
54722E2409k66K56P91J219J638K004J994J397N51R0K59O92J026J351J856K327
54706F9594K358K002J700J607J405Q98L86K06J74j08o54j145j461j790k168k316
54690G0688k053j585j207r49p56p62j077j411j288o72q3J9k65m97m47j96J15L81
$$ plain form
54815 72209 74276 76099 77369 77977 77931 77252 76022 74424 72690 71055 69679 68507 67230 65576 63607
54800 63607 61627 59818 58162 56664 55403 54313 53168 51906 50782 50057 49703 49556 49545 49602 49495 49023 48287
54783 48287 47536 46794 45924 45022 44473 44500 44924 45461 46067 46783 47433 47736 47694 47630 47827 48258 48706 48999 49062 48892
54763 48892 48584 48292 48057 47763 47366 47150 47522 48534 49721 50512 50726 50569 50285 49976 49742 49786 50225 50884 51420
54744 51420 51658 51721 51800 51860 51692 51261 50841 50736 50908 51039 50959 50852 50950 51169 51236 51134 51207 51723 52475 52947 52849 52409
54722 52409 52143 52399 53190 54409 56047 58051 60045 61442 61993 62083 62342 63034 64060 65411 67267 69594
54706 69594 71952 73954 75654 77261 78666 79564 79950 80156 80330 80222 79568 78423 76962 75172 73004 70688
54690 70688 68635 67050 65843 64894 64138 63376 62299 60888 59600 58928 58845 58864 58599 58102 57655 57459 57574 57955
54672E7955N21N24N52P49J001J100J085J210J547J825J786J458J057P69O83P58
54656G4580P51M12j84o94r89j309j752j981j697j174r22r80j045j087j384j848
54640E8697j946j436q02n78o54n60k24L4Q2J45L53N33N08L29Q6k69p14j009r69
54621E1606p47o44o84o17l41o1J4o8j10n7K1J28L08M98M97K30j35l49l48k68k77
54600D8596m04n33n04k64O9K90K75P4j46k10m7K49M37L83K18K17M18N59M03P5
54580E0155j04l7L1j33m21m83j57L07N33M18J68n0k60m56m20m4M00N29L61K44
54560E0581K84K22q0m00n20n35n82n29k31J69M16M99N30M65K44M9J06L12L68K49
54540E1617J58J22o2l48l54J08O58P71L95n5k60l22n17q35r29n34J33N51M68J38
$$ plain form
54672 57955 58476 59000 59552 60301 61302 62402 63487 64697 66244 68069 69855 71313 72370 73139 73822 74580
54656 74580 75331 75743 75559 74865 73876 72567 70815 68834 67137 65963 65041 64061 63016 61929 60545 58697
54640 58697 56751 55315 54513 53935 53281 52721 52497 52531 52613 52758 53111 53644 54152 54481 54567 54298 53584 52575 51606
54621 51606 50859 50215 49531 48914 48573 48512 48526 48458 48348 48291 48312 48440 48748 49246 49743 49973 49838 49489 49141 48873 48596
54600 48596 48192 47659 47155 46891 46960 47250 47525 47599 47453 47243 47196 47445 47882 48265 48483 48700 49118 49677 50080 50155
54580 50155 50051 50014 50045 49912 49491 49008 48851 49158 49691 50109 50277 50227 49967 49511 49091 49047 49447 49976 50337 50581
54560 50581 50865 51087 51007 50607 50087 49552 48970 48441 48210 48379 48795 49294 49824 50289 50533 50582 50688 51000 51368 51617
54540 51617 51775 51897 51835 51487 51133 51241 51899 52670 53065 53010 52750 52428 51911 51076 50147 49613 49746 50297 50765 50903
54520E0903o2k2J36K56J91j44n31n34m1N09O84O30O76P15M30Nk1L98P25O23L29
54499E5855J03j33m03m56k12mj03l39m86n89o17k63N16J185J296J118J105J060
54481E8633N48j80m01m7J17l24p99o38m3K95J78J7L8Mk69m98l39J00L87L34J55
54460E7268O7J0j48l19l55l12k94j53L35R45J103O14Kj41J43L34J52k20m80n21
54440E8030l95k46k01k23j19J46L02J22j93k74j17l8j30j01K73P80J033R04N51
54421F0104K03L0J11L51N10M03J17p0K4K86M64M54M13M93O05N28K30q8k55k15
54401F4698P3N63Q91N73l00r63q55l51k13n30p21m63j10m5j49j50j06k18m31n01
54381F0692l91l09l95n48n81m30j81M6K31M18N68N12J97j33j77L7K15K11J84K41
$$ plain form
54520 50903 50841 50819 50955 51211 51402 51258 50727 50193 50152 50661 51345 51975 52651 53366 53796 53801 53780 54178 54903 55526 55855
54499 55855 55958 55825 55422 54966 54754 54750 54647 54308 53822 53233 52616 52353 52869 54054 55350 56468 57573 58633
54481 58633 59181 59001 58600 58553 58670 58346 57547 56909 56866 57161 57339 57356 57394 57398 57129 56631 56292 56392 56779 57113 57268
54460 57268 57335 57345 57197 56878 56523 56211 55917 55764 56099 57044 58147 58761 58763 58622 58765 59099 59251 59031 58551 58030
54440 58030 57635 57389 57188 56965 56846 56992 57294 57416 57223 56949 56832 56794 56664 56563 56836 57616 58649 59553 60104
54421 60104 60307 60337 60448 60799 61309 61712 61829 61759 61783 62069 62533 62987 63400 63893 64498 65026 65256 65168 64913 64698
54401 64698 64771 65334 66225 66798 66498 65535 64680 64329 64116 63586 62865 62402 62292 62247 62098 61948 61842 61624 61193 60692
54381 60692 60301 59992 59597 59049 58468 58038 57857 57903 58134 58552 59120 59632 59829 59696 59519 59556 59771 59982 60166 60407
54361F0407K41Q4l5J11M01M68J32l95p19n68L0P33J101R90O70M97M83L90J20j21
54341F5020j05J92O21J015J179R31L30k22k79J65O37O95L59l8k85m32n42n43l91
54322F8307k17j66j87j25J9R6L4k3J29N34R81J177J003O82N64P45R56R15O78M99
54302G6601M21K36j73o04p68n89k64l1J5n0j10j37j78k84m63o87r45j169j262
54283F9559j190r93p06l56p2o3l43o40o68m26j31O3J25P9m7k02l66n40o13m12
54263F2058rK25O3k54l64k62j92j99j28J0N7N2J69L44L06O4l9J05J92J0j93j41
54241F1874N0J11N6L1l8k53m25l09n4m0k72l48p8K54L41K80L08L99L84L09L56
54220F2936M73L99J00j23m5J48J65K2l4O6J57J47J49K16K48K21K98N65Q32Q90
$$ plain form
54361 60407 60648 60732 60697 60808 61209 61677 61809 61414 60695 60127 60157 60890 61991 62981 63651 64148 64631 65021 65141 65020
54341 65020 64915 65107 65728 66743 67922 68853 69183 68961 68682 68847 69484 70179 70538 70500 70215 69783 69241 68698 68307
54322 68307 68090 67924 67737 67612 67631 67727 67761 67738 67867 68401 69382 70559 71562 72244 72808 73553 74509 75424 76102 76601
54302 76601 77022 77258 77085 76481 75713 75124 74860 74829 74844 74794 74684 74547 74369 74085 73622 72935 71990 70821 69559
54283 69559 68369 67376 66670 66314 66242 66179 65836 65196 64528 64102 63971 64034 64159 64238 64191 63989 63623 63083 62470 62058
54263 62058 62049 62274 62337 62083 61719 61457 61265 61066 60938 60948 61005 61057 61226 61570 61876 61940 61901 62006 62198 62208 62015 61874
54241 61874 61924 62035 62091 62122 62084 61831 61406 61097 61043 61003 60731 60383 60305 60559 60900 61180 61488 61887 62271 62580 62936
54220 62936 63409 63808 63908 63785 63740 63888 64053 64075 64041 64107 64264 64411 64560 64776 65024 65245 65543 66108 66940 67830
54200F7830P94P09O01L15q9l27k19J37M91O41N07J87j32l62n52o96o36l42o6o5
54180F8726k51l56l22k52j59J1J49J29P0J20J32j31m89n17k43j55m50o86m05K41
54160F5162P13O81K27l05n35l42n2p7l07k62J30L18k3m70m54o5J85J29Mk9j0N3
54138F4671J28J6l90q01q15m51p3J23K25K88K73K68M35O63O54L80J80L13O74J031
54118F7792J266J277R30L05j96k26J00L18R8m97j127j460j342q54k88J0q4l66
54100F5656m79k93j7J18J58K54L55K80J01N6J33M2k37l09L2L86K75j34k64N5M15
54079F6583M57K95K09K28J60n0k22j16K86O93P67M63P3j00K2L96R16J316J252
54060G3628P37K45J79M36O99R37J223J345J019M22O4Q4R8k16p11j034j050q34
$$ plain form
54200 67830 68624 69333 69934 70249 70160 69833 69614 69751 70242 70883 71390 71577 71445 71083 70531 69835 69199 68857 68791 68726
54180 68726 68475 68119 67797 67545 67386 67397 67546 67675 67745 67865 67997 67866 67377 66860 66617 66462 66012 65326 64921 65162
54160 65162 65875 66556 66783 66478 65943 65601 65549 65472 65165 64903 65033 65351 65328 64858 64404 64339 64524 64653 64657 64628 64618 64671
54138 64671 64799 64815 64425 63624 62809 62358 62285 62408 62633 62921 63194 63462 63897 64560 65214 65594 65774 66087 66761 67792
54118 67792 69058 70335 71265 71570 71374 71148 71248 71566 71664 71167 70040 68580 67238 66384 66096 66106 66022 65656
54100 65656 65177 64884 64867 64985 65143 65397 65752 66032 66133 66189 66322 66364 66127 65818 65850 66236 66511 66377 66113 66168 66583
54079 66583 67040 67335 67544 67772 67932 67882 67660 67544 67830 68523 69290 69753 69826 69726 69748 70144 71060 72376 73628
54060 73628 74365 74610 74789 75225 75924 76861 78084 79429 80448 80870 80934 81018 81116 80900 80189 79155 78105 77271
54042G7271n48l66l98n71p27q26r18r54q29n65k70O8M57P19O65M46L80M73M44
54023G3951K24O5R5J44J10J36K62K38l8k22P6P55J329J463J210Q12M72K71K05
54004H1558K95N98J011J139O85n3m06j41L12N02N15O07P00N79L42L15N60Q40J013
53985I0971J195J518J911K162K113J808J559J683K161K623K812K888L082L284
53971A21770L227K924K655K524K346J989J585J340J302J372J389J212Q12L66R4
53956A46907Qj00l82p58j083j374j749k194k485k438k182k052k190k344k222j935
53940A21427j836j966j914j429q39o25p85r35r21r37j048j007o75l14j81p0M25
53923A06370J256J912K052J876J697J461Q92L2p72j343j814k228k282j758r48
$$ plain form
54042 77271 76723 76357 75959 75388 74661 73835 72917 71963 71134 70569 70299 70367 70824 71543 72208 72654 73034 73507 73951
54023 73951 74175 74240 74335 74479 74589 74725 74987 75225 75187 74965 75041 75796 77125 78588 79798 80610 81082 81353 81558
54004 81558 81853 82451 83462 84601 85286 85233 84827 84686 84998 85500 86015 86622 87322 87901 88243 88558 89118 89958 90971
53985 90971 92166 93684 95595 97757 99870 101678 103237 104920 107081 109704 112516 115404 118486 121770
53971 121770 124997 127921 130576 133100 135446 137435 139020 140360 141662 143034 144423 145635 146447 146813 146907
53956 146907 146915 146815 146433 145675 144592 143218 141469 139275 136790 134352 132170 130118 127928 125584 123362 121427
53940 121427 119591 117625 115711 114282 113443 112818 112033 111098 110177 109240 108192 107185 106510 106196 106015 105945 106370
53923 106370 107626 109538 111590 113466 115163 116624 117516 117548 116776 115433 113619 111391 109109 107351 106403
53908A06403m17l92o43r10j128j241j117p82m98m22l86j56K12M67N10N07O00P17
53890A01324P10O29P37J222J900K346K346K126K011J990J808J447J227J385J749
53875A24957J976J968J936K069K320K439K255J892J661J717J884J975K097K450
53861A53596K902L111L030K984L129L222L058K845K879L143L412L590L671L530
53847A98102L038K295J518Q24K72l0r2j71m90r03j173j399j854k490k938l086
53831A91423l251l668m103m210l993l719l515l329l174l214l522l891l958l521
53817A40355k735k032j743j800j845j695j575j758k105k134j633r74p31j056j609
53802A14930j984k069j947j693j357j013p52o28o71q29r35q14n55m38n20n14k28
$$ plain form
53908 106403 105986 105594 104951 104041 102913 101672 100555 99773 99275 98853 98467 98311 98523 98990 99500 100007 100607 101324
53890 101324 102034 102663 103400 104622 106522 108868 111214 113340 115351 117341 119149 120596 121823 123208 124957
53875 124957 126933 128901 130837 132906 135226 137665 139920 141812 143473 145190 147074 149049 151146 153596
53861 153596 156498 159609 162639 165623 168752 171974 175032 177877 180756 183899 187311 190901 194572 198102
53847 198102 201140 203435 204953 205777 206049 206019 205927 205756 205266 204363 203190 201791 199937 197447 194509 191423
53831 191423 188172 184504 180401 176191 172198 168479 164964 161635 158461 155247 151725 147834 143876 140355
53817 140355 137620 135588 133845 132045 130200 128505 126930 125172 123067 120933 119300 118326 117595 116539 114930
53802 114930 112946 110877 108930 107237 105880 104867 104115 103487 102816 101987 101052 100238 99683 99245 98725 98211 97983
53785I7983P2j3m57q80r98q12l91J51N52N70L40K06K75L59L84M56N48M59J99M1
53765I9044M0m5k82l61j02J85J41j14j99K4M08P52R04P89O16P39J204J639J836
53746A07218K087K627L114L079K619K218K066J994J988K223K630K839K653K291
53732A41646K057K012K013J868J460Q65L00q9l20l88k67j76n43j391k172k447
53716A44428k455k562k595k222j674j481j670j843j917k117k335k224j907j846
53702A15580k002j829j278r83j190j322r61n91p81j264j441j331j317j334r70
53687I6986k84J70J11j76l54m44n64o58n63k26K22N20M47P7k39k29O5M86R55J315
53667I7617J254O69l7l29j15K75N53O77O46M46K12J86M28P64R97J071J002Q30
$$ plain form
53785 97983 98055 98042 97585 96705 95707 94895 94504 94655 95207 95777 96117 96323 96598 96957 97341 97797 98345 98804 99003 99044
53765 99044 99084 99039 98757 98396 98294 98479 98620 98506 98307 98331 98739 99491 100395 101184 101800 102539 103743 105382 107218
53746 107218 109305 111932 115046 118125 120744 122962 125028 127022 129010 131233 133863 136702 139355 141646
53732 141646 143703 145715 147728 149596 151056 151921 152221 152132 151812 151424 151157 150981 150438 149047 146875 144428
53716 144428 141973 139411 136816 134594 132920 131439 129769 127926 126009 123892 121557 119333 117426 115580
53702 115580 113578 111749 110471 109488 108298 106976 106015 105424 104643 103379 101938 100607 99290 97956 96986
53687 96986 96702 96872 96983 96807 96453 96009 95445 94787 94224 93998 94220 94740 95187 95264 95025 94796 94861 95347 96302 97617
53667 97617 98871 99540 99503 99174 99059 99334 99887 100564 101210 101656 101868 102054 102482 103246 104243 105314 106316 107146
53649A07146O54O19P72R81J054R56R13J203J762K090J784J107P07Q07J004R83
53633A24542R67J223J492J318P63L03J82K03J23n3k19k88j95L0J75R6l5Q3M34
53614A31144O81O21L55M0k73m97m90k85j73l48o32o78m12j28j28l63m77k13K81
53595A28025N90M85R8k79m37k57K78R05J137P58J80R2O95J504J883J645J093O31
53577A39026M50M89O08O95O40L96J13J24N55J043J119Q47P29R53J081P71L48M02
53559A50389J011J689J931J565P98J71K56J022J714J688J178R04J101J426J590
53544A68433J612J455J040N92M93P24Q39O22L40K18J18j00l22m30m53l78j21J09
53526A74791o2n49p38l42J14Qn21r00r57r79j100j156j056r32q34o68m05j53K8
$$ plain form
53649 107146 107800 108419 109191 110172 111226 112182 113095 114298 116060 118150 119934 121041 121748 122555 123559 124542
53633 124542 125509 126732 128224 129542 130305 130608 130790 130993 131116 131063 130844 130556 130361 130391 130566 130662 130627 130710 131144
53614 131144 131825 132446 132801 132841 132568 132071 131581 131296 131123 130775 130143 129465 129053 128925 128797 128434 127957 127744 128025
53595 128025 128615 129100 129198 128919 128482 128225 128503 129408 130545 131303 131483 131575 132270 133774 135657 137302 138395 139026
53577 139026 139476 139965 140573 141268 141908 142304 142417 142541 143096 144139 145258 146105 146834 147787 148868 149639 149987 150389
53559 150389 151400 153089 155020 156585 157383 157554 157810 158832 160546 162234 163412 164316 165417 166843 168433
53544 168433 170045 171500 172540 173132 173625 174349 175188 175810 176150 176368 176486 176386 176064 175634 175181 174803 174682 174791
53526 174791 174729 174180 173442 173100 173214 173222 172701 171801 170844 169865 168765 167609 166553 165621 164787 164119 163714 163561 163589
53507A63589J60K28K23K25K61J87j16m48m75j40K85N30N44M17L21M44P91J074
53489A68100R96O28K97K06L47P16J283J760J778J403J205J597K332K805K770K507
53473A90730K405K560K836L138L524L969M289M343M319M516M872M981M752M707
53459B45941N326O319O954P019P025P423Q071Q568Q775Q783Q708Q707Q964R458
53445C56041R906J0120J0154J0032R598Q865Q230Q003P978P769P438P349P569
53432D69052P757P655P320O911O597O644P177P788P792P068O267O010O185O260
53418E66483O039N730N471N147M632L961L209K412J603Q41J55m45j010j701k652
53403E99875l692m405m673m892n424o028o175n838n535n614n901o144o384o683
$$ plain form
53507 163589 163749 163977 164200 164425 164686 164873 164757 164309 163834 163694 163979 164509 165053 165470 165791 166235 167026 168100
53489 168100 169096 169724 170021 170227 170574 171290 172573 174333 176111 177514 178719 180316 182648 185453 188223 190730
53473 190730 193135 195695 198531 201669 205193 209162 213451 217794 222113 226629 231501 236482 241234 245941
53459 245941 251267 257586 264540 271559 278584 286007 294078 302646 311421 320204 328912 337619 346583 356041
53445 356041 365947 376067 386221 396253 405851 414716 422946 430949 438927 446696 454134 461483 469052
53432 469052 476809 484464 491784 498695 505292 511936 519113 526901 534693 541761 548028 554038 560223 566483
53418 566483 572522 578252 583723 588870 593502 597463 600672 603084 604687 605528 605683 605238 604228 602527 599875
53403 599875 596183 591778 587105 582213 576789 570761 564586 558748 553213 547599 541698 535554 529170 522487
53389E22487o848o750o633o794p085p057o575n963n525n163m587l728k808k049
53375D44922j466r42m28KL14O18J061J638K221K716L137L537L944M368M801N211
53359D75654N639O223P004P824Q537R233J0042J0781J1146J1187J1267J1527J1778
53346E97842J2015J2580J3559J4464J4896J5203J5975J7121J7981J8278J8467
53335G68381J9030J9846K0457K0612K0428K0167K0031K0031J9990J9733J9307
53324I88013J8892J8523J8057J7346J6338J5017J3485J1990J0687R435Q016O467
53312A152266M954L386J493p11k862m691o261p763r327j1088j3107j5128j6679
53299A074482j7573j8099j8651j9356k0062k0492k0391j9809j9185j8865j8579
$$ plain form
53389 522487 515639 508889 502256 495462 488377 481320 474745 468782 463257 458094 453507 449779 446971 444922
53375 444922 443456 442514 442086 442088 442402 443020 444081 445719 447940 450656 453793 457330 461274 465642 470443 475654
53359 475654 481293 487516 494520 502344 510881 520114 530156 540937 552083 563270 574537 586064 597842
53346 597842 609857 622437 635996 650460 665356 680559 696534 713655 731636 749914 768381
53335 768381 787411 807257 827714 848326 868754 888921 908952 928983 948973 968706 988013
53324 988013 1006905 1025428 1043485 1060831 1077169 1092186 1105671 1117661 1128348 1137783 1145799 1152266
53312 1152266 1157220 1160606 1162099 1161388 1158526 1153835 1147574 1139811 1130484 1119396 1106289 1091161 1074482
53299 1074482 1056909 1038810 1020159 1000803 980741 960249 939858 920049 900864 881999 863420
53288H63420j7830j6764j6103j6094j6128j5713j5208j5140j5279j5006j4255
53277F89900j3498j2937j2331j1517j0641r828r079q486q123p732o898n662m637
53264E68531m380m869n615o110o148n909n737n670n326m420l260k422k075j946
53250E04644j781j471q47J41J084J484J468J714K490L351L842M099M426M844N277
53235E34765N834O522P058P237P289P512P839Q048Q160Q259Q204P824P250O702
53221F38503O136N428M698M068L298K119P84k06q88j780l052m221m893n324n999
53206F38671o973p900q520q821q942r110r574j0368j1183j1630j1609j1332j1097
53193E11612j1069j1202j1246j0980j0453r936r622r477r426r476r574r568r421
$$ plain form
53288 863420 845590 828826 812723 796629 780501 764788 749580 734440 719161 704155 689900
53277 689900 676402 663465 651134 639617 628976 619148 610069 601583 593460 585728 578830 573168 568531
53264 568531 564151 559282 553667 547557 541409 535500 529763 524093 518767 514347 511087 508665 506590 504644
53250 504644 502863 501392 500545 500686 501770 503254 504722 506436 508926 512277 516119 520218 524644 529488 534765
53235 534765 540599 547121 554179 561416 568705 576217 584056 592104 600264 608523 616727 624551 631801 638503
53221 638503 644639 650067 654765 658833 662131 664250 665034 664828 663940 662160 659108 654887 649994 644670 638671
53206 638671 631698 623798 615278 606457 597515 588405 578831 568463 557280 545650 534041 522709 511612
53193 511612 500543 489341 478095 467115 456662 446726 437104 427627 418201 408725 399151 389583 380162
53180C80162r266r118q771q158p624p529p710p663p202o568n952n289m583m083
53166B80646l928l941l927l970m168m350m333m286m475m790m866m666m565m762
53152B19619m975m860m484m132l903l717l561l489l420l240l028k993l159l330
53138A67328l344l236l092k922k712k513k415k479k706k952k946k576k059j717
53124A29659j583j444j287j360j752k136k123j685j071m89o0P7j25m75o96p34
53108A12716p50q39r37r31p58m26r9m7l72p58p53k98K03L60J61j53m01n19m92
53089A04907l61k38k47l94n43m94j63K79M90L09o3l05l50l43l17j68R1K76L26
53070A02692L92N89Q21R81J094J142R90O19K95K58M20N37N77O61P37O01K69K9
$$ plain form
53180 380162 370896 361778 353007 344849 337225 329696 321986 314323 307121 300553 294601 289312 284729 280646
53166 280646 276718 272777 268850 264880 260712 256362 252029 247743 243268 238478 233612 228946 224381 219619
53152 219619 214644 209784 205300 201168 197265 193548 189987 186498 183078 179838 176810 173817 170658 167328
53138 167328 163984 160748 157656 154734 152022 149509 147094 144615 141909 138957 136011 133435 131376 129659
53124 129659 128076 126632 125345 123985 122233 120097 117974 116289 115218 114729 114669 114746 114621 114146 113450 112716
53108 112716 111966 111127 110190 109259 108501 108075 107976 107929 107557 106799 106046 105748 105951 106311 106472 106319 105918 105399 104907
53089 104907 104546 104308 104061 103667 103124 102630 102467 102746 103236 103545 103482 103177 102827 102484 102167 101999 102090 102366 102692
53070 102692 103084 103673 104494 105475 106569 107711 108701 109320 109615 109873 110293 110830 111407 112068 112805 113406 113675 113704
53052A13704P5K48K50%l40n76o66o59n89m37k41j54l01n53o48n41m88o48q14p36
53032A05886n42n48p64q98q25p65q70r59q17n29l11j54R7L73L74l1n31o52k53
53013I7281L06N46L63P9kK2j37m91p14o05l63k69l28l44k72k20j72L7L96O14M69
52992I6196J65J57N88J083J129O14j03n60n69k65N5J14j30m30m37r1K89L73J95
52973I8373L2L8J30J89J77P4j15k90l33k61j57J0L06N79N57K30q9k03k87n17p22
52952I7721n80o2N26Q59Q15M95J73J27L48N54N44M40M05L69K11O3J35L47M43L70
52932A04303K33Ql63o29m02L21J101J584J760J671J244N98J39K9p2n37j185j502
52914A08301j269o82j8N08O84M71J86K33N78P78N78K39J42L17M92M57K11j39m71
$$ plain form
53052 113704 113779 114027 114277 114277 113937 113361 112695 112036 111447 111010 110769 110615 110314 109761 109113 108572 108084 107436 106622 105886
53032 105886 105344 104796 104032 103134 102309 101544 100674 99715 98898 98369 98058 97904 98001 98374 98748 98717 98186 97534 97281
53013 97281 97587 98133 98496 98575 98573 98595 98458 97967 97253 96648 96285 96016 95688 95344 95072 94852 94680 94717 95113 95727 96196
52992 96196 96361 96518 97106 98189 99318 99932 99829 99269 98700 98435 98490 98604 98474 98044 97607 97516 97805 98178 98373
52973 98373 98405 98443 98573 98762 98939 99013 98898 98608 98275 98014 97857 97867 98173 98752 99309 99539 99450 99247 98960 98443 97721
52952 97721 97141 97079 97605 98464 99279 99774 99947 100074 100422 100976 101520 101960 102365 102734 102945 103008 103143 103490 103933 104303
52932 104303 104536 104544 104181 103552 103150 103471 104572 106156 107916 109587 110831 111429 111568 111597 111525 110988 109803 108301
52914 108301 107032 106350 106332 106840 107524 107995 108181 108414 108992 109770 110348 110587 110729 111046 111538 111995 112206 112067 111596
52895A11596o64o75n94n61o28p25p23n18j37K01J85k70q37j040p32k28L7n4k75
52876A03358l62k18J09M91P41O68K72k12m84m45k40q0l7qJ72N04P50O29J27m43
52856A05292p72q14o95m76j46J84L39K80J03j56m89p21n68o0L46K49k24o03o55
52837A00414n13l28m3L96P96Q83O96N64P01R23Q84N12O3k20l43l91l42j92o4l9
52817A04357O1M43R50J192J074R20J000J148J016N30n1l80l00L3J93j44p74j104
52799A10164q23k55P2nl00o32q87r65r23j065j496j801j510q51n05o32o34p6N92
52780I7468O43N6n07o15m60l52k40L6L08K04l20q16p99k40M69R33J007P22J94
52761I7691l28n22k73J80N06O47P40P77N51mn58o81k89K62N28L87P0j29j66k25
$$ plain form
52895 111596 110932 110257 109663 109102 108474 107749 107026 106508 106371 106572 106757 106487 105650 104610 103878 103650 103687 103633 103358
52876 103358 102996 102778 102887 103378 104119 104787 105059 104847 104363 103918 103678 103598 103561 103553 103725 104229 104979 105608 105735 105292
52856 105292 104520 103706 103011 102535 102389 102573 102912 103192 103295 103139 102650 101929 101361 101301 101647 101896 101672 101069 100414
52837 100414 99901 99573 99530 99926 100722 101605 102301 102865 103566 104489 105373 105885 105948 105728 105385 104994 104652 104460 104396 104357
52817 104357 104418 104861 105811 107003 108077 108997 109997 111145 112161 112691 112640 112260 111960 111993 112186 112042 111268 110164
52799 110164 109341 109086 109158 109153 108853 108221 107334 106369 105446 104381 102885 101084 99574 98723 98218 97586 96952 96876 97468
52780 97468 98111 98167 97660 97045 96585 96233 95993 96029 96337 96541 96221 95405 94606 94366 94835 95768 96775 97497 97691
52761 97691 97363 96841 96568 96748 97254 97901 98641 99418 99969 99965 99407 98726 98437 98699 99227 99614 99684 99555 99389 99164
52741I9164m33o84p73o24l40p8N7P2R4K04K53k0n75r71q13k11M00P48Q21O38K47
52720I7176o6K1L89M90N6m85n19lN62P33N34K40L3q5j68k18k13j83k32l99n82
52699I7081n95l84m5L10O29Q35Q41P03N77N18L98K00J57M41Q45R47O30K23P0J44
52679A04525J70O7Q2M05Q09Q44M42N0J3Q2j94p23r40o38k91l67p16q70o83l19
52659A01748J47P07J124J041M66j69m67m06j75Q8L19M59M71L27lm44p50o81l13
52640A03489K6J27R1J08K09K65J83L4K8K84O07N80N9n70q19o67m41k49N5L78L63
52619A04140J7j42J74N14L49q8j64J64L34J29rK15L98P1n07o60k31K53L30J22
52599A05409K8J93M60O43P04O79O48P08R06J190J395J318Q17l0q70j286j170q33
$$ plain form
52741 99164 98731 98047 97274 96650 96310 96232 96289 96361 96455 96659 96912 96892 96317 95346 94533 94322 94722 95470 96291 96929 97176
52720 97176 97110 97131 97520 98010 98066 97581 97062 97059 97621 98354 98888 99128 99161 99076 98908 98690 98477 98294 98062 97663 97081
52699 97081 96486 96102 96057 96367 96996 97831 98672 99375 99952 100470 100868 101068 101225 101666 102511 103458 104088 104311 104381 104525
52679 104525 104695 104762 104844 105249 106058 106902 107344 107394 107407 107489 107295 106572 105632 104994 104703 104336 103620 102750 102067 101748
52659 101748 101895 102602 103726 104767 105233 105064 104597 104191 104016 104104 104423 104882 105353 105680 105677 105233 104483 103802 103489
52640 103489 103515 103642 103733 103841 104050 104315 104498 104532 104560 104844 105451 106031 106090 105520 104701 104034 103593 103344 103399 103777 104140
52619 104140 104157 104015 104189 104703 105052 104964 104800 104964 105298 105427 105418 105633 106031 106102 105595 104935 104704 104957 105287 105409
52599 105409 105437 105630 106090 106733 107437 108116 108764 109472 110378 111568 112963 114281 115098 115068 114198 112912 111742 110909
52581A10909o70p52q13o17k23J31K71K26J29J20K75N90R76J262J250Q41J59n15
52563A13549r21r66p07k99K3M8k50o28q08p09m63k11j4P7J4j64l07k62KL64N92
52542A07960N08K14N4K17M30L09n9j72J85N94N39O2l65m59l17r6J89M95O41N14
52522A11443K28oj17j72k12k03r0J28L95O24P25O05K18l25p38p37l84p3j13l56
52502A10840m22j81J11J84N4q3j47k43m74p88r72q80n71k80j67j70j19N2K91N43
52482A06578P70Q67P38M15R4o5p9p7j33j57J1L83P10O87L04j03k53j85n6J16L34
52461A10899M59M21M38O98R41P14R8l04j98N9O7j0J49M16M01R7q9J18N66R02Q38
52440A17680K68n96j236j261q55n19m40m05l17l85o70q08m63J56N06L43o0k93
$$ plain form
52581 110909 110239 109487 108674 108057 107834 107965 108236 108462 108591 108711 108986 109576 110552 111814 113064 113905 114064 113549
52563 113549 112628 111662 110955 110656 110679 110727 110477 109849 109041 108332 107869 107658 107644 107721 107735 107571 107264 107002 107004 107368 107960
52542 107960 108468 108682 108736 108953 109383 109692 109633 109461 109646 110240 110779 110841 110476 110017 109700 109604 109793 110288 110929 111443
52522 111443 111671 111665 111548 111376 111164 110961 110871 110999 111394 112018 112743 113348 113566 113241 112503 111766 111382 111309 111196 110840
52502 110840 110418 110237 110348 110532 110586 110503 110356 110113 109639 108851 107879 106999 106428 106148 105981 105811 105692 105744 106035 106578
52482 106578 107348 108215 108953 109368 109462 109397 109318 109241 109108 108951 108962 109345 110055 110742 111046 110943 110690 110505 110449 110565 110899
52461 110899 111358 111779 112217 112915 113856 114570 114668 114364 114166 114225 114292 114282 114431 114847 115248 115345 115256 115374 115940 116842 117680
52440 117680 117948 117352 116116 114855 114000 113481 113041 112636 112319 111934 111264 110456 109993 110149 110655 110998 110938 110645
52422A10645j96J10M06N48N23L79J67kM9M13R04J216J242J097Q19L69m7j5N16
52403A19143R92R20N40M65P80R99Q03L90Pl95q44j100j028q90r58j076r17n18
52385A17313k36k10k51k07j59j82k12k44l79o04o85m63p9K02K59J60J8q0p9J0
52365A13892J57M02P85J167J275J012N76K12m9k40k48Q6O95J241J418J186Q18
52348A24385P04J024J545J832J704J396J185J059Q48N10J07l36p21q19n89m10
52332A33424o78j166j222o49j0P8l21o40m85N6O34R43Q76N66K59R3M8J35M45R15
52312A33301J264J305J218J303J595J840J816J503R83M01k4j15J11M66P35P69
52296A48471N42K18R4K57M41L67J74K47O69J103J292J385J663K060K200J837J147
$$ plain form
52422 110645 110449 110559 110965 111513 112036 112415 112582 112580 112629 113042 113946 115162 116404 117501 118320 118689 118642 118627 119143
52403 119143 120135 121055 121595 122060 122840 123839 124642 125032 125039 124644 123800 122700 121672 120782 119824 118748 117831 117313
52385 117313 117077 116867 116616 116409 116250 116068 115856 115612 115233 114629 113944 113481 113402 113604 113863 114023 114041 113961 113882 113892
52365 113892 114049 114451 115236 116403 117678 118690 119266 119478 119429 119189 118941 119027 119722 120963 122381 123567 124385
52348 124385 125089 126113 127658 129490 131194 132590 133775 134834 135682 136192 136299 135963 135242 134423 133834 133424
52332 133424 132746 131580 130358 129709 129699 129777 129456 128816 128331 128387 129021 129964 130840 131406 131665 131758 131806 131941 132386 133301
52312 133301 134565 135870 137088 138391 139986 141826 143642 145145 146128 146529 146505 146390 146501 146967 147702 148471
52296 148471 149013 149231 149325 149582 150023 150390 150564 150811 151480 152583 153875 155260 156923 158983 161183 163020 164167
52279A64167O07O04J126J807K325K654K919L106L147L187L530M237N003N547N890
52264B09856O137O214O062N922O079O459O660O462O040N717N655N848O146O335
52250B95592O349O433O890P566P866P480O825O554O750O918O676O160N695N292
52236C89046M667L649K498J748J680J949J858J115J51m62p08r69j348j596j647
52221D01631j711j759j434p21j92k23l86o3O41J156J387J739K347K857L038L053
52205D11360L013K858K784L219M130M896N124N148N336N458N183M769M679M810
52191D72767M705M306L919L584L057K397J939J644J054L0r95j666k120k556k855
52176D89210k920k967l182l391l432l524l898m265m125l493k908k732k796k785
$$ plain form
52279 164167 164774 165378 166504 168311 170636 173290 176209 179315 182462 185649 189179 193416 198419 203966 209856
52264 209856 215993 222207 228269 234191 240270 246729 253389 259851 265891 271608 277263 283111 289257 295592
52250 295592 301941 308374 315264 322830 330696 338176 345001 351555 358305 365223 371899 378059 383754 389046
52236 389046 393713 397362 399860 401608 403288 405237 407095 408210 408361 407899 407191 406222 404874 403278 401631
52221 401631 399920 398161 396727 396006 395814 395591 395205 395142 395783 396939 398326 400065 402412 405269 408307 411360
52205 411360 414373 417231 420015 423234 427364 432260 437384 442532 447868 453326 458509 463278 467957 472767
52191 472767 477472 481778 485697 489281 492338 494735 496674 498318 499372 499402 498407 496741 494621 492065 489210
52176 489210 486290 483323 480141 476750 473318 469794 465896 461631 457506 454013 451105 448373 445577 442792
52162D42792k663k539k368j990j424r41p29o13k76K65N71M03J55M21J142J647
52146D33853J514J073Q45R20J151J520J985K205J923J506J591K225K731K576J941
52131D59559J368J106J063J084J069Q83M54j07o03r96j443k033k615k917k867
52116D53005k684k599k543k318j949j705j670j571j200p25l79n1M47R00R12N54
52100D36424L78O22Q30N24q8l81j29K61L45J78J45M45Q73J154J260J323J326J130
52082D46620P91O08O59N93J53l02j91M71J056J192J173J411J896K442L105M010
52066D65687M977N649N924O025O250O810P739Q741R277R090Q572Q350Q571Q850
52052E70512Q832Q511Q022P413O742O138N700N420N210M926M393L591K794K316
$$ plain form
52162 442792 440129 437590 435222 433232 431808 430867 430138 429525 429249 429514 430085 430488 430643 431064 432206 433853
52146 433853 435367 436440 437285 438205 439356 440876 442861 445066 446989 448495 450086 452311 455042 457618 459559
52131 459559 460927 462033 463096 464180 465249 466132 466586 466479 465876 464880 463437 461404 458789 455872 453005
52116 453005 450321 447722 445179 442861 440912 439207 437537 435966 434766 434041 433662 433611 434058 434958 435870 436424
52100 436424 436802 437424 438254 438778 438690 438309 438180 438441 438786 438964 439109 439554 440427 441581 442841 444164 445490 446620
52082 446620 447411 448019 448678 449271 449424 449122 448931 449402 450458 451650 452823 454234 456130 458572 461677 465687
52066 465687 470664 476313 482237 488262 494512 501322 509061 517802 527079 536169 544741 553091 561662 570512
52052 570512 579344 587855 595877 603290 610032 616170 621870 627290 632500 637426 641819 645410 648204 650520
52038F50520K059J595O98l91j321k078k862l690m319m567m557m601m887n280n444
52023F10875n194m688m271m104m055l875l426k724j911j146m93J17P35J261J592
52008E78693J842K213K703L103L353L619M002M347M476M437M366M267M133M085
51994F29639M202M241L803K810J625O61k2o75j497k440l308l981m477m853n117
51979F20611n284n487n878o408o817o918o779o558o259n883n635n756o138o378
51965E34433o317o246o432o663o514n978n462n235n098m793m438m357m619m935
51951D57346n029m920m863n064n485n841n914n844o046o688p389p617p310o854
51937C72482o510o197n854n656n704n797n708n512n417n452n548n717n951o044
$$ plain form
52038 650520 652579 654174 654872 654481 653160 651082 648220 644530 640211 635644 631087 626486 621599 616319 610875
52023 610875 605681 600993 596722 592618 588563 584688 581262 578538 576627 575481 574988 575105 575840 577101 578693
52008 578693 580535 582748 585451 588554 591907 595526 599528 603875 608351 612788 617154 621421 625554 629639
51994 629639 633841 638082 641885 644695 646320 646981 646959 646284 644787 642347 639039 635058 630581 625728 620611
51979 620611 615327 609840 603962 597554 590737 583819 577040 570482 564223 558340 552705 546949 540811 534433
51965 534433 528116 521870 515438 508775 502261 496283 490821 485586 480488 475695 471257 466900 462281 457346
51951 457346 452317 447397 442534 437470 431985 426144 420230 414386 408340 401652 394263 386646 379336 372482
51937 372482 365972 359775 353921 348265 342561 336764 331056 325544 320127 314675 309127 303410 297459 291415
51923B91415n861n612n606n792n813n483m930m304l685l219l052k976k506j424
51909B31152q5R20J286J154R69J136J632J985J815J347J076J036Q22L56Q6K98
51893B46985O68P84P01P31R97J526K393L504M512N306O203P304P994P598O297
51878C03503M825L474J992L47j085k081k822l415l771m008m474n176n666n741
51864B75902n817o288o897p119o859o391n882n330m813m425m064l575l073k788
51850B02581k683k453j939j305p99n37m77m42k05L02Q00Q67L58m61j198j675j960
51833A88774k184k369k406k157j611r28l05J03K20Q0j08o5K93P92J218J542J851
51816A82740K138K314K329K211J990J656J180N68r2o42r90j212j409j457j129
$$ plain form
51923 291415 285554 279942 274336 268544 262731 257248 252318 248014 244329 241110 238058 235082 232576 231152
51909 231152 231067 231987 233273 234427 235396 236532 238164 240149 241964 243311 244387 245423 246245 246601 246687 246985
51893 246985 247653 248437 249138 249869 250866 252392 254785 258289 262801 268107 274310 281614 289608 297206 303503
51878 303503 308328 311802 313794 314141 313056 310975 308153 304738 300967 296959 292485 287309 281643 275902
51864 275902 270085 263797 256900 249781 242922 236531 230649 225319 220506 216081 212017 208442 205369 202581
51850 202581 199898 197445 195506 194201 193402 192865 192388 191946 191741 192043 192843 193710 194068 193607 192409 190734 188774
51833 188774 186590 184221 181815 179658 178047 177119 176814 176917 177137 177217 177109 177044 177337 178129 179347 180889 182740
51816 182740 184878 187192 189521 191732 193722 195378 196558 197126 197034 196392 195402 194190 192781 191324 190195
51801A90195m93NN6j48k03j0J85J64p4m10p16q97j033j343j874k294k246j870
51783A76994j654j788j946j804j456j197j086r68p55m87j82J71M84N91M14O0k43
51766A65148l19j59K9qk77m90l81l9K24K72K73M03N52M96K28%KJ24P3k36n11l58
51744A65046K18P20O79K11j16J0K79K87R3Ln1m48j197j763j695j172o11j34L46
51725A60705P10P79O76O54O45L54k05o30o53l72K2M87R39J227J369J554J737J616
51707A71614J177R14J195J713J852J462R08N17K47j16o80j346j833j928j755j703
51691A72238j872j892j477r01o61q21j098j337j527j502j078m40N7M58J118K034
51675A61299K686K751K491K274K037J564R72O17O00P06P57P94Q92Q72M39m06j155
$$ plain form
51801 190195 189702 189707 189763 189615 189412 189402 189587 189751 189677 189267 188551 187654 186621 185278 183404 181110 178864 176994
51783 176994 175340 173552 171606 169802 168346 167149 166063 165095 164340 163853 163671 163842 164326 164917 165331 165391 165148
51766 165148 164829 164670 164699 164691 164414 163924 163543 163504 163728 164000 164273 164676 165228 165724 165952 165952 165954 166078 166151 165915 165404 165046
51744 165046 165264 165984 166663 166874 166758 166768 167047 167334 167427 167430 167379 166931 165734 163971 162276 161104 160493 160359 160705
51725 160705 161415 162194 162870 163524 164169 164523 164318 163688 163035 162663 162685 163172 164111 165338 166707 168261 169998 171614
51707 171614 172791 173705 174900 176613 178465 179927 180835 181352 181599 181483 180803 179457 177624 175696 173941 172238
51691 172238 170366 168474 166997 166096 165435 164614 163516 162179 160652 159150 158072 157632 157689 158147 159265 161299
51675 161299 163985 166736 169227 171501 173538 175102 176074 176691 177291 177997 178754 179548 180440 181312 181751 181345 180190
51658A80190j223p15l84p00j174j060m43r5l66q05r52q72o99k87L58Q03P61N14
51640A72851L89K05k91q36j028r88j069j126p19J5L79P0m79p76q16p78o87o13
51622A63703p53j072j146o80O8O25Q35Q52Q54R49J201J507J592J372J099J066
51606A72072J289J656K174K769L065K679J693N72l45j036j539j773j681j337q55
51591A79403k93L07Q49J152J014M31k32n31n19p24j349j874j843j694k147k939
51575A69011l000k014j041j099j814k044j461p57n20n79n50m18m17o27q95r77
51559A50798p39l75l66r05j519j545r54k99P4L05M90M56K42K38N66P76N49L10
51541A48102O25J360J959K329K826L481L840L674L313L076K783K106J129K64k41
$$ plain form
51658 180190 178967 178252 177868 177168 175994 174934 174491 174396 174030 173225 172273 171401 170702 170415 170773 171576 172337 172851
51640 172851 173240 173445 173154 172318 171290 170302 169233 168107 167388 167403 167782 167852 167373 166597 165781 165003 164316 163703
51622 163703 162950 161878 160732 160052 160120 160745 161580 162432 163286 164235 165436 166943 168535 169907 171006 172072
51606 172072 173361 175017 177191 179960 183025 185704 187397 187969 187624 186588 185049 183276 181595 180258 179403
51591 179403 179110 179417 180266 181418 182432 182863 182631 182100 181581 180857 179508 177634 175791 174097 171950 169011
51575 169011 166011 163997 162956 161857 160043 157999 156538 155781 155261 154682 154132 153714 153297 152670 151775 150798
51559 150798 150059 149684 149318 148413 146894 145349 144395 144096 144170 144475 144965 145421 145663 145901 146467 147243 147792 148102
51541 148102 148727 150087 152046 154375 157201 160682 164522 168196 171509 174585 177368 179474 180603 180867 180626
51526A80626n41r28j456j788j484n12N99J262J492J825K603L563M152M077L509
51511A96999K934K801L164L598L653L362L144L233L477L688L932M349M961N720
51497B49015O538P166P272O792N981N090M167L254K442J641O25n62j524k112k744
51482B93041l859n270o404p036p378p596p618p419p132o835o445n925n336m724
51468B04064m090l563l297l215l077k847k748k842k836k478j960j679j679j613
51454A66140j251q20o83q53j025r84q01o04l78j10Q4J45K61N66P93N49o0m50k90
51435A60229J13L04K56J98J81J17O0J05J22j11n82j076j488j848k083k069j804
51418A50624j406r20m05j20l40r43j454j544j262q21l45Q8L80M50K74j03m40l58
$$ plain form
51526 180626 180085 179157 177701 175913 174429 173917 174516 175778 177270 179095 181698 185261 189413 193490 196999
51511 196999 199933 202734 205898 209496 213149 216511 219655 222888 226365 230053 233985 238334 243295 249015
51497 249015 255553 262719 269991 276783 282764 287854 292021 295275 297717 299358 299983 299421 297897 295785 293041
51482 293041 289182 283912 277508 270472 263094 255498 247880 240461 233329 226494 220049 214124 208788 204064
51468 204064 199974 196411 193114 189899 186822 183975 181227 178385 175549 173071 171111 169432 167753 166140
51454 166140 164889 164069 163386 162533 161508 160524 159723 159119 158741 158631 158715 158860 159121 159687 160480 161029 160969 160519 160229
51435 160229 160342 160646 160902 161100 161281 161398 161458 161563 161685 161574 160992 159916 158428 156580 154497 152428 150624
51418 150624 149218 148298 147893 147773 147433 146490 145036 143492 142230 141409 141064 141152 141532 141982 142256 142153 141713 141355
51400A41355K20Q00Q16L97K37O50J150J179Q56P19R43J255J445J670K173K928
51384A58793L635L991L919L591L189K672J873Q10j91p99r44q03o68q22j378k085
51368A74783k522k578k595k833l034k750k013j359j152j209j124p53k62J83N43
51353A51325P79Q21O67M50L45M35O83R71J171J186J049R04Q78R83J192J503J848
51336A67190K009J839J522J431J683K023K234K342K443K541K810L567M763N784
51322B04181O165O276O824P836Q704R168R593J0210J0606J0289R304P971O363
51309C13490M436K370M87j111k549l961n434o955q305r168r568r877j0236j0260
51295B43359r636q688p989p606p154o425n586m800m072l482l177l134l133l039
$$ plain form
51400 141355 141575 142375 143191 143588 143825 144475 145625 146804 147660 148379 149322 150577 152022 153692 155865 158793
51384 158793 162428 166419 170338 173929 177118 179790 181663 182473 182282 181483 180539 179736 179068 178246 176868 174783
51368 174783 172261 169683 167088 164255 161221 158471 156458 155099 153947 152738 151614 150861 150599 150782 151325
51353 151325 152104 152925 153592 154042 154387 154822 155505 156476 157647 158833 159882 160786 161664 162647 163839 165342 167190
51336 167190 169199 171038 172560 173991 175674 177697 179931 182273 184716 187257 190067 193634 198397 204181
51322 204181 210346 216622 223446 231282 239986 249154 258747 268957 279563 289852 299156 307127 313490
51309 313490 317926 320296 320783 319672 317123 313162 307728 300773 292468 283300 273732 263855 253619 243359
51295 243359 233723 225035 217046 209440 202286 195861 190275 185475 181403 177921 174744 171610 168477 165438
51281A65438k807k364j734j248j237j556j720j590j475j539j542j332j159j200
51267A42935j122n48K66O05J51o28j021p96k73J28K82L14K99J73r1l16l28j58
51249A39872N4L18O88R84R00M55O9M7K45L59L34K80J94m6m16p15p27l55L09R02
51229A43751J005N84J67K92Q59J248J102P11N75Q20J121J164R75Q39R44J140J102
51212A58399P30L12J62K27J89n0k55k23q5q1k24l25l15l20m45o24p14o66n62n27
51192A54603o22p49p10m35j42j51n09q82r21o29l05k00l02m38m51l28k12l23o99
51173A45595j060j024n41K6K66J06k07l55j37M21R69J045N43p5k60K6L55M56M56
51154A46605N23N84N81O92J099J638J955J924J655J238P01K06j4L0R3P9J38L32
$$ plain form
51281 165438 162631 160267 158533 157285 156048 154492 152772 151182 149707 148168 146626 145294 144135 142935
51267 142935 141813 141265 141531 142136 142287 141659 140638 139842 139569 139697 139979 140293 140592 140765 140674 140358 140030 139872
51249 139872 139926 140244 140932 141916 142816 143271 143340 143387 143632 143991 144325 144605 144799 144753 144337 143622 142895 142540 142849 143751
51229 143751 144756 145340 145507 145799 146658 147906 149008 149719 150294 151114 152235 153399 154374 155213 156157 157297 158399
51212 158399 159129 159441 159603 159830 160019 159969 159714 159491 159406 159325 159101 158776 158461 158141 157696 157072 156358 155692 155130 154603
51192 154603 153981 153232 152522 152087 151945 151794 151285 150403 149482 148853 148548 148348 148046 147608 147157 146829 146617 146294 145595
51173 145595 144535 143511 142970 142996 143262 143368 143161 142806 142669 143090 144059 145104 145647 145572 145312 145338 145693 146149 146605
51154 146605 147128 147712 148293 148985 150084 151722 153677 155601 157256 158494 159195 159401 159387 159417 159510 159589 159727 160059
51136A60059M06J59k14l71l17l47n22n52k57J31L00K68K27J87J2k49l44k07r3
51117A58276k24m69n27l02NJ71J50K8j18k45k72j28J25K46M4l47n33l10Q5L07
51097A55962L68N29P62P05K24k77l87k20j41j57JL14M11J66j05j83l00p10j175
51078A55787j222p71k17J09K10K29J95J27J16K51N32Q93J210J302J054O06K90
51061A60701K83M12M00K06O1J82N16P55O50K66%J70O67J053J047P72M89L16K60
51042A69206M03P50J060J053P72N19M17L59L46N78R97J138P14J39L8M04O64N47
51024A80104M28O16Q53P27L25N2L9Q8J40L51P09R33R24R39J199J518J625J621
51006A93191J847K412L101L745M376M972N360N481N550N672N548M809L623K622
$$ plain form
51136 160059 160465 160624 160410 160039 159722 159375 158853 158301 158044 158175 158475 158743 158970 159157 159169 158920 158576 158369 158276
51117 158276 158052 157583 157056 156754 156759 156930 157080 157108 156990 156745 156473 156345 156470 156716 156760 156413 155880 155570 155655 155962
51097 155962 156330 156859 157621 158326 158550 158273 157886 157666 157525 157368 157369 157683 158094 158260 158155 157972 157672 156962 155787
51078 155787 154565 153794 153577 153686 153896 154125 154320 154447 154563 154814 155346 156239 157449 158751 159805 160411 160701
51061 160701 160984 161396 161796 162002 162063 162245 162761 163516 164166 164432 164432 164602 165269 166322 167369 168141 168630 168946 169206
51042 169206 169609 170359 171419 172472 173244 173763 174180 174539 174885 175463 176460 177598 178312 178451 178489 178893 179557 180104
51024 180104 180532 181148 182001 182728 183053 183105 183144 183232 183372 183723 184432 185365 186289 187228 188427 189945 191570 193191
51006 193191 195038 197450 200551 204296 208672 213644 219004 224485 230035 235707 241255 246064 249687 252309
50992B52309K173J979J590J023O28N05L68nm84q46j076j299j576j885k190k397
50976B48817k337j947j375r06p69j078j755k459k748k499k009j580j161o10o7
50961B25517K61N37J121J971K616K770K643K515K396K277K317K521K571K298K035
50946B56366K098K194J828J144P95R42J020O34J61J15M22P10J006J589K344K798
50930B76166K826K819L107L642M323N226O259O997P219P298P698Q277Q464Q076
50916C58397P538P345P623Q314R348J0536J1562J2308J3017J3985J5244J6693
50904D91910J8295J9958K1384K2294K2728K2931K3007K2846K2346K1495K0264
50893G29458J8627J6692J4693J2777J0942R121P273N430L754K496J734J264Q29
$$ plain form
50992 252309 254482 256461 258051 259074 259702 260207 260575 260570 260086 259240 258164 256865 255289 253404 251214 248817
50976 248817 246480 244533 243158 242252 241483 240405 238650 236191 233443 230944 228935 227355 226194 225584 225517
50961 225517 225778 226315 227436 229407 232023 234793 237436 239951 242347 244624 246941 249462 252033 254331 256366
50946 256366 258464 260658 262486 263630 264425 265367 266387 267021 267182 267297 267719 268429 269435 271024 273368 276166
50930 276166 278992 281811 284918 288560 292883 298109 304368 311365 318584 325882 333580 341857 350321 358397
50916 358397 365935 373280 380903 389217 398565 409101 420663 432971 445988 459973 475217 491910
50904 491910 510205 530163 551547 573841 596569 619500 642507 665353 687699 709194 729458
50893 729458 748085 764777 779470 792247 803189 812310 819583 825013 828767 831263 832997 834261 835090
50880H35090M46J96j10q46k050l338m400n325o316p344q296r271j0475j1877j3226
50865G52858j4399j5505j6665j7782j8640j9142j9430j9694j9923j9816j9117
50854E52745j7963j6792j5845j4900j3660j2225j1031j0328r936r487q795p942
50842D03841p116o475o024n591m962m103l211k498j944j361o87j02J82J92J59
50827C60300K61M90P68J062J347J602J907K444L247M061M604M918N264N761O306
50812D04342O824P403Q100Q840R515J0107J0602J1028J1560J2401J3508J4624
50800E28854J5657J6802J8160J9549K0898K2552K4900K7818L0799L3526L6023
50789G95538L8343M0435M2395M4469M6672M8630M9924N0492N0534N0143M9132
$$ plain form
50880 835090 835536 835732 835622 834776 832726 829388 824988 819663 813347 806003 797707 788436 777961 766084 752858
50865 752858 738459 722954 706289 688507 669867 650725 631295 611601 591678 571862 552745
50854 552745 534782 517990 502145 487245 473585 461360 450329 440001 430065 420578 411783 403841
50842 403841 396725 390250 384226 378635 373673 369570 366359 363861 361917 360556 359869 359767 359949 360141 360300
50827 360300 360561 361051 361819 362881 364228 365830 367737 370181 373428 377489 382093 387011 392275 398036 404342
50812 404342 411166 418569 426669 435509 445024 455131 465733 476761 488321 500722 514230 528854
50800 528854 544511 561313 579473 599022 619920 642472 667372 695190 725989 759515 795538
50789 795538 833881 874316 916711 961180 1007852 1056482 1106406 1156898 1207432 1257575 1306707
50778A306707M7219M4252M0276L5435K9911K3983J8107J2692P808L289q33m181
50766A564665o451p792q497q562p869o674n498m610m001l950n076p641j1137j4843
50752A462064j8568k2524k6748l0972l4950l8570m1694m4160m5939m7036m7277
50741A063626m6442m4651m2390m0023l7476l4541l1326k8236k5507k2994k0453
50730F89587j7918j5619j3585j1546r357p322n918n244m943m678m427m290m269
50717E80471m312m368m280l884l353l237l825m710n259n407n584n973o255o162
50703E13862n883n716n663n533n242m771m028k964j770p11J49R69J904L002M229
50688D81834N443O427P112P733Q601R760J1020J2293J3689J5220J6651J7750J8627
$$ plain form
50778 1306707 1353926 1398178 1438454 1473889 1503800 1527783 1545890 1558582 1566390 1569679 1568846 1564665
50766 1564665 1558214 1550422 1541925 1533363 1525494 1518820 1513322 1508712 1504711 1500761 1495685 1488044 1476907 1462064
50752 1462064 1443496 1420972 1394224 1363252 1328302 1289732 1248038 1203878 1157939 1110903 1063626
50741 1063626 1017184 972533 930143 890120 852644 818103 786777 758541 733034 710040 689587
50730 689587 671669 656050 642465 630919 621562 614240 608322 603078 598135 593457 589030 584740 580471
50717 580471 576159 571791 567511 563627 560274 557037 553212 548502 543243 537836 532252 526279 520024 513862
50703 513862 507979 502263 496600 491067 485825 481054 477026 474062 472292 471581 471730 472699 474603 477605 481834
50688 481834 487277 493704 500816 508549 517150 526910 537930 550223 563912 579132 595783 613533 632160
50675F32160J9643K1045K2692K4154K5069K5444K5661K6118K6800K7246K6939
50664I02971K5753K3970K1956J9916J7877J5760J3365J0391O686K516j495m794
50652A054872p262r104j0436j1092j0857r782q213o556n061l777k692j885j539
50639I66616j766k490l568n015p015r672j2790j5976j8815k1019k2507k3403k3845
50626G98735k3744k2902k1401j9636j7841j5862j3559j1211r140p198n005k642
50614F28594n93J022K631M517O328P618Q463R206R804R899R409Q688Q101P716
50600G21403P470P383P518P849Q232Q470Q441Q267Q227Q437Q698Q832R016R550
50586H37793J0441J1391J2211J2914J3513J4000J4550J5402J6439J7126J7036
$$ plain form
50675 632160 651803 672848 695540 719694 744763 770207 795868 821986 848786 876032 902971
50664 902971 928724 952694 974650 994566 1012443 1028203 1041568 1051959 1058645 1061161 1059666 1054872
50652 1054872 1047610 1038506 1028070 1016978 1006121 996339 988126 981570 976509 972732 970040 968155 966616
50639 966616 964850 962360 958792 953777 946762 937090 924300 908324 889509 868490 845983 822580 798735
50626 798735 774991 752089 730688 711052 693211 677349 663790 652579 643439 636241 631236 628594
50614 628594 628001 629023 631654 636171 642499 650117 658580 667786 677590 687489 696898 705586 713687 721403
50600 721403 728873 736256 743774 751623 759855 768325 776766 785033 793260 801697 810395 819227 828243 837793
50586 837793 848234 859625 871836 884750 898263 912263 926813 942215 958654 975780 992816
50575I92816J6310J5490J4950J4612J4065J2934J1273R603Q442P738O895N366
50563A130494L079K22l044o451r418j1250j1680j1081j0122r227q332p116n534
50550A040540l992k973k498k189j825j694k295l885o338r262j2237j5031j7716
50537I58605k0412k2924k4851k6032k6676k6953k6778k6102k5128k4008k2649
50526F86092k1012j9409j8093j6850j5266j3343j1451r790q270o856n707m799
50514E35246l787k366n94J227K845M119N037N711O310O923P525Q075Q564R023
50500E93858R567J0356J1389J2371J2988J3245J3389J3575J3801J4074J4403J4697
50488G47713J4916J5261J5888J6505J6637J6334J6205J6649J7474J8465J9822
$$ plain form
50575 992816 1009126 1024616 1039566 1054178 1068243 1081177 1092450 1102053 1110495 1118233 1125128 1130494
50563 1130494 1133573 1133795 1130751 1124300 1114882 1103632 1091952 1080871 1070749 1061522 1053190 1046074 1040540
50550 1040540 1036548 1033575 1031077 1028888 1027063 1025369 1023074 1019189 1012851 1003589 991352 976321 958605
50537 958605 938193 915269 890418 864386 837710 810757 783979 757877 732749 708741 686092
50526 686092 665080 645671 627578 610728 595462 582119 570668 560878 552608 545752 540045 535246
50514 535246 531459 529093 528499 529726 532571 536690 541727 547438 553748 560671 568196 576271 584835 593858
50500 593858 603425 613781 625170 637541 650529 663774 677163 690738 704539 718613 733016 747713
50488 747713 762629 777890 793778 810283 826920 843254 859459 876108 893582 912047 931869
50477I31869K1735K3865K5715K7333K9122L1114L2937L4464L5996L7716L9374
50466A271240M0711M1862M3026M4002M4358M3934M2837M1091L8547L5209L1277
50455A718094K6840K1734J5855R401K664m211j1048j7460k3098k7972l2195l5470
50443A643134l7232l7325l6220l4391l1856k8497k4494k0130j5459j0508n670
$$ plain form
50477 931869 953604 977469 1003184 1030517 1059639 1090753 1123690 1158154 1194150 1231866 1271240
50466 1271240 1311951 1353813 1396839 1440841 1485199 1529133 1571970 1613061 1651608 1686817 1718094
50455 1718094 1744934 1766668 1782523 1791924 1794588 1790377 1779329 1761869 1738771 1710799 1678604 1643134
50443 1643134 1605902 1568577 1532357 1497966 1466110 1437613 1413119 1392989 1377530 1367022 1361352
$$ [...]
##END NTUPLES=NMR SPECTRUM
##END=
