
##TITLE=UV1139_M5-1005-1002_6279192_vCUIXB4JKL
##JCAMPDX= 6.0         $$ Bruker NMR JCAMP-DX V2.0
##DATA TYPE= NMR SPECTRUM
##DATA CLASS= NTUPLES
##ORIGIN= BRUKER
##OWNER= Administrator
$$ 1.72 TOPSPIN		Version 2.1
$$ 2012-06-03 12:57:54.468 -0500  Administrator@TOPSPIN
$$ Compression mode = diff/dup
##.OBSERVE FREQUENCY= 400.13188235
##.OBSERVE NUCLEUS= ^1H
##.ACQUISITION MODE= SIMULTANEOUS (DQD)
##.ACQUISITION SCHEME= undefined
##.AVERAGES= 8
##.DIGITISER RES= 22
##SPECTROMETER/DATA SYSTEM= spect
##.PULSE SEQUENCE= zg30
##.SOLVENT NAME= COFFEE_meoh
##.SHIFT REFERENCE= INTERNAL, COFFEE_meoh, 1, 14.98061
##AUDIT TRAIL= $$ (NUMBER, WHEN, WHO, WHERE, PROCESS, VERSION, WHAT)
$$ ##TITLE= Audit trail, TOPSPIN		Version 2.1
$$ ##JCAMPDX= 5.01
$$ ##ORIGIN= Bruker BioSpin GmbH
$$ ##OWNER= Administrator
$$ $$ C:\Bruker\TOPSPIN/data/COFFEE/nmr/UV1139_M5-1005-1002_6279192_vCUIXB4JKL/10/pdata/1/auditp.txt
$$ ##AUDIT TRAIL=  $$ (NUMBER, WHEN, WHO, WHERE, PROCESS, VERSION, WHAT)
(   1,<2012-06-03 12:57:47.187 -0500>,<Administrator>,<TOPSPIN>,<go>,<TOPSPIN 2.1>,
      <created by zg
	started at 2012-06-03 12:56:40.750 -0500,
	POWCHK enabled, PULCHK disabled,
       configuration hash MD5:
       D5 CA 7A 23 FE 6B EE E2 50 67 74 61 24 F7 5E 3B
       data hash MD5: 64K
       D6 B1 CF 4E 3D 92 FB CD 10 80 E4 53 DA 13 7B 1B>)
(   2,<2012-06-03 12:57:50.296 -0500>,<Administrator>,<TOPSPIN>,<proc1d>,<TOPSPIN 2.1>,
      <Start of raw data processing
       efp LB = 0 FT_mod = 6 PKNL = 1 PHC0 = 0 PHC1 = 0 SI = 32K 
       data hash MD5: 32K
       17 7E F3 F6 6A F2 14 3C E8 18 08 29 4E 80 E7 CB>)
(   3,<2012-06-03 12:57:50.625 -0500>,<Administrator>,<TOPSPIN>,<proc1d>,<TOPSPIN 2.1>,
      <pk PHC0 = 207.8064 PHC1 = 0 
       data hash MD5: 32K
       D5 29 A4 69 C0 54 61 EC F5 96 82 BA FD D5 21 82>)
(   4,<2012-06-03 12:57:50.687 -0500>,<Administrator>,<TOPSPIN>,<proc1d>,<TOPSPIN 2.1>,
      <abs ABSG = 1 
       data hash MD5: 32K
       09 4A FD 80 9C 21 96 14 6D 17 41 FA B3 9C 05 F3>)
(   5,<2012-06-03 12:57:50.718 -0500>,<Administrator>,<TOPSPIN>,<proc1d>,<TOPSPIN 2.1>,
      <abs ABSG = 2 
       data hash MD5: 32K
       28 5A 74 C8 B9 43 2E 0C 93 5B 55 F6 6C 9F FE AE>)
(   6,<2012-06-03 12:57:50.734 -0500>,<Administrator>,<TOPSPIN>,<proc1d>,<TOPSPIN 2.1>,
      <abs ABSG = 3 
       data hash MD5: 32K
       C3 0A 36 27 91 49 E9 6E C6 B7 25 5B CF CF 8A D4>)
(   7,<2012-06-03 12:57:50.796 -0500>,<Administrator>,<TOPSPIN>,<proc1d>,<TOPSPIN 2.1>,
      <abs ABSG = 4 
       data hash MD5: 32K
       9B 84 8B 63 3B B7 AF E5 62 CD 8F FC ED 9A 27 46>)
(   8,<2012-06-03 12:57:50.828 -0500>,<Administrator>,<TOPSPIN>,<proc1d>,<TOPSPIN 2.1>,
      <abs ABSG = 5 
       data hash MD5: 32K
       61 00 6E 2D C0 8F 31 D5 19 D3 93 8C E9 6C B9 35>)
$$ ##END=
$$ 
$$ $$ hash MD5
$$ $$ 52 FE CD D4 61 B8 E3 BF 19 15 E3 D1 13 E1 92 6D
##$RELAX= 
##$RELAX= 
##$RELAX= 
##$RELAX= 
##$RELAX= 
##$RELAX= 
##$RELAX= 
$$ Bruker specific parameters
$$ --------------------------
$$ [...]
##$TP= (0..7)
150 150 150 150 150 150 150 150
##$TP07= 0
##$TPNAME0= <>
##$TPNAME1= <>
##$TPNAME2= <>
##$TPNAME3= <>
##$TPNAME4= <>
##$TPNAME5= <>
##$TPNAME6= <>
##$TPNAME7= <>
##$TPOAL= (0..7)
0.5 0.5 0.5 0.5 0.5 0.5 0.5 0.5
##$TPOFFS= (0..7)
0 0 0 0 0 0 0 0
##$TUNHIN= 0
##$TUNHOUT= 0
##$TUNXOUT= 0
##$USERA1= <user>
##$USERA2= <user>
##$USERA3= <user>
##$USERA4= <user>
##$USERA5= <user>
##$V9= 5
##$VALIST= <valist>
##$VCLIST= <CCCCCCCCCCCCCCC>
##$VD= 0
##$VDLIST= <DDDDDDDDDDDDDDD>
##$VPLIST= <PPPPPPPPPPPPPPP>
##$VTLIST= <TTTTTTTTTTTTTTT>
##$WBST= 2048
##$WBSW= 25
##$XGAIN= (0..3)
0 0 0 0
##$XL= 0
##$YL= 0
##$YMAX_a= 534971
##$YMIN_a= -656943
##$ZGOPTNS= <>
##$ZL1= 120
##$ZL2= 120
##$ZL3= 120
##$ZL4= 120
##$ABSF1= 14.98061
##$ABSF2= -5.57192
##$ABSG= 5
##$ABSL= 3
##$ALPHA= 0
##$AQORDER= 0
##$ASSFAC= 0
##$ASSFACI= 0
##$ASSFACX= 0
##$ASSWID= 0
##$AUNMP= <proc_prof1d_extract_pilot.lims>
##$AXLEFT= 0
##$AXNAME= <>
##$AXNUC= <1H>
##$AXRIGHT= 0
##$AXTYPE= 0
##$AXUNIT= <>
##$AZFE= 0.1
##$AZFW= 0.1
##$BCFW= 0
##$BC_mod= 0
##$BYTORDP= 0
##$COROFFS= 0
##$CY= 15
##$DATMOD= 1
##$DC= 0
##$DFILT= <>
##$DTYPP= 0
##$F1P= 0
##$F2P= 0
##$FCOR= 0.5
##$FTSIZE= 32768
##$FT_mod= 6
##$GAMMA= 0
##$GB= 0
##$INTBC= 1
##$INTSCL= 1
##$ISEN= 128
##$LB= 0
##$LEV0= 0
##$LPBIN= 0
##$MAXI= 10000
##$MC2= 0
##$MEAN= 0
##$ME_mod= 0
##$MI= 0
##$NCOEF= 0
##$NC_proc= -8
##$NLEV= 6
##$NOISF1= 0
##$NOISF2= 0
##$NSP= 0
##$NTH_PI= 0
##$NZP= 0
##$OFFSET= 14.98061
##$PC= 1
##$PHC0= 207.8064
##$PHC1= 0
##$PH_mod= 1
##$PKNL= yes
##$PPARMOD= 0
##$PPDIAG= 0
##$PPIPTYP= 0
##$PPMPNUM= 2147483647
##$PPRESOL= 1
##$PSCAL= 4
##$PSIGN= 0
##$PYNMP= <proc.py>
##$REVERSE= no
##$SF= 400.13
##$SI= 32768
##$SIGF1= 0
##$SIGF2= 0
##$SINO= 400
##$SIOLD= 32768
##$SPECTYP= <>
##$SREGLST= <1H.CDCl3>
##$SSB= 0
##$STSI= 32768
##$STSR= 0
##$SW_p= 8223.68421052632
##$SYMM= 0
##$S_DEV= 0
##$TDeff= 65536
##$TDoff= 0
##$TI= <>
##$TILT= no
##$TM1= 0
##$TM2= 0
##$TOPLEV= 0
##$USERP1= <user>
##$USERP2= <user>
##$USERP3= <user>
##$USERP4= <user>
##$USERP5= <user>
##$WDW= 1
##$XDIM= 32768
##$YMAX_p= 463189317
##$YMIN_p= -657952
##$CURPLOT= <Network HP LaserJet P1505>
##$CURPRIN= <$Network HP LaserJet P1505>
##$DFORMAT= <normdp>
##$LAYOUT= <+/1D_H.xwp>
##$LFORMAT= <normlp>
##$PFORMAT= <normpl>
##$SURQMSG= 1
$$ End of Bruker specific parameters
$$ ---------------------------------
##NTUPLES= NMR SPECTRUM
##VAR_NAME=  FREQUENCY,     SPECTRUM/REAL,   SPECTRUM/IMAG
##SYMBOL=    X,             R,               I
##VAR_TYPE=  INDEPENDENT,   DEPENDENT,       DEPENDENT
##VAR_FORM=  AFFN,          ASDF,            ASDF
##VAR_DIM=   32768,         32768,           32768
##UNITS=     HZ,            ARBITRARY UNITS, ARBITRARY UNITS
##FACTOR=    0.250966925370066, 1,           1
##FIRST=     8223.43324360095, -117087,      -59546
##LAST=      0,             -237258,         -4552
##MIN=       0,             -657952,         0
##MAX=       8223.43324360095, 463189317,    0
$$ Real data points
##PAGE= N=1
##DATA TABLE= (X++(R..R)), XYDATA
$$ [...]
$$ plain form
19564 -154536 200170 181156 62180 -161747 -60117 -118055 -101878 -60964 -3102 -118239 -481932
19553 -481932 80280 48909 -247693 -242327 -169223 233111 -84797 -250434 -107809 -267542 -196242
19542 -196242 -59988 -299823 152951 202857 79433 -129134 -140981 101510 80039 -316150
19531 -4394 -2359 -657952 -25176 -111304 -104869 15758 -87133 -150492 -201636 -122151 18527 31396
19519 31396 29978 -166898 -65841 -218251 -351923 -192361 37283 -241265 93449 -112211 -195239
19508 -195239 -88522 -186860 -160347 -20232 -1338 144263 -134354 -8573 -19929 1703 361845
19497 361845 -329704 -261446 -252876 -121338 -46941 -142651 110863 -273996 108668 -295955
19486 64681 -170599 169654 35217 22577 -108998 -253471 -23565 -10514 -173563 -44908 97146
$$ packed form
19564a54536B00170j9014F2180a61747f0117n7938J6177M0914c102j15137l63693
19553d81932H0280l1371b47693N366P3104B33111h4797j65637a07809j59733P1300
19542a96242e9988k39835A52951M9906G9433a29134j1847A01510k1471c16150
19531d394K035o55593b5176q6128O435A5758h7133o3359n1144P9485A8527J2869
19519C1396j418a66898f5841j52410j33672J59562C7283b41265I3449a12211q3028
19508a95239h8522r8338K6513b0232a338A44263a34354h573j1356A703L60142
19497C61845c29704O8258Q570a21338d6941r5710A10863b73996A08668b95955
19486F4681a70599A69654C5217j2640a08998j44473b3565a0514j63049d4908I7146
$$ plain form
19474 -193874 -289578 16431 272939 -54983 -73202 59841 -113644 -31942 -296556 25349 -45982
19462 -115935 69473 -52341 118136 67873 -90656 -109861 108385 -50844 -264904 12127 -437711
19450 -212183 -286368 111605 -67923 -3932 -103783 45050 23817 174850 -336346 -156104 28796
19438 121818 170590 -56135 271071 -94799 240677 24470 13047 161130 -235056 42157 -245866
19426 270071 -135011 -218566 -74611 35574 -248311 162718 234256 -504743 303107 -279557
19415 101751 -239335 -101931 -373113 127652 -81630 -389584 -7488 -231459 -256565 179335
19404 13888 19528 -73872 -60353 -159313 25569 -121092 -118968 -268547 5716 -175914 -151356 42061
19391 -55178 -133785 -235663 -324367 -31391 -283545 -81180 -196002 -50252 -67238 -6955 65359
$$ packed form
19474a93874r5704A6431K56508e4983j8219E9841a13644c1942k64614B5349d5982
19462a15935F9473e2341A18136n0263i0656j9205A08385e0844k14060A2127d37711
19450b12183p4185A11605f7923c932r9851D5050k1233J51033c36346a56104B8796
19438A21818M8772e6135B71071i4799B40677B4470j1423J48083b35056D2157b45866
19426B70071a35011q3555g4611C5574b48311A62718P1538e04743C03107b79557
19415A01751b39335a01931k71182A27652h1630l07954g488k23971k5106A79335
19404A3888N640g3872J3519r8960B5569a21092K124j49579E716a75914K4558D2061
19391e5178p8607j01878q8704c1391k52154h1180j14822e0252j6986f955F5359
$$ plain form
19379 -275356 88267 -14329 -62156 28992 -162172 -246241 -67325 -382050 -81826 -114501 -3122
19367 -46259 389976 -106856 -4216 1276 -104433 -128165 -16920 -93323 -253713 40748 60264
19356 60264 -53399 156460 -185492 -125709 16542 -92379 -249761 24553 -26279 -376711 85851
19344 -135569 -189036 -234108 91719 -42965 -241733 86241 -460040 -2242 194582 -27695 -96079
19333 -96079 224189 11721 187867 -134919 -226318 -138021 47375 46876 -214888 -115904 8564
19321 -192491 -220651 -257151 -213961 96804 21343 -4185 -133211 -14113 -158919 -78221 809 295099
19309 295099 -270214 -89176 -252441 -102202 239521 -116474 18766 -268342 -78480 -88659
19299 -88659 267636 166183 32836 -79122 -285032 -132767 -170748 159875 -20369 -56414 183206
$$ packed form
19379b75356H8267a4329m7827B8992a62172q4069f7325l14725h1826l2675c122
19367d6259C89976a06856d216A276a04433k3732a6920p6403j60390D0748J9516
19356F0264e3399A56460a85492N9783A6542i2379j57382B4553b6279l50432H5851
19344a35569n3467m5072I1719d2965j98768H6241d60040b242A94582b7695o8384
19333i6079B24189A1721J76146a34919r1399Q8297D7375m99b14888R8984H564
19321a92491k8160l6500M3190I6804B1343d185j29026a4113j44806g8221H09K94290
19309B95099b70214h9176j63265a02202B39521a16474A8766b68342g8480j0179
19299h8659B67636j01453C2836g9122k05910a32767l7981A59875b0369l6045A83206
$$ plain form
19287 -2144 -257713 -257670 -352055 -53466 -167819 -94220 -165943 -317311 -97103 278595 -80498 -241305
19275 -241305 -261415 -164474 -229265 119720 -169036 -146552 5887 35546 22400 -429203 54395
19263 -311039 -55993 139252 -252630 -114251 -47209 -164210 92856 40172 196836 -180255
19252 164697 163651 173113 139728 248115 58662 217366 -121674 18954 -72119 -127744 185327
19240 -11711 -53573 -88705 -54366 162385 -174941 -192319 -137994 -186337 -14850 81004 -82837
19228 -22611 -357382 229006 -339644 -266173 -238392 275930 -113268 -21159 -637095 -238894
19217 70195 159150 58499 -219892 181677 -74414 -39406 -181012 -55937 -167193 -164359 -61987
19205 -422376 156598 75258 127372 47794 85660 -55485 -6427 -120633 44825 -333320 -281327
$$ packed form
19287b144k55569M3r4385e3466j14353P3599p1723j51368i7103B78595h0498j60807
19275b41305k0110R6941o4791A19720a69036K2484E887K9659j3146d29203E4395
19263c11039e5993A39252b52630a14251d7209j17001I2856D0172J56664a80255
19252A64697j046R462l3385J08387E8662J58704a21674A8954g2119n5625A85327
19240a1711m1862l5132L4339A62385a74941j7378N4325m8343a4850H1004h2837
19228b2611l34771B29006c39644P3471K7781B75930a13268b1159o15936b38894
19217G0195Q8955E8499b19892A81677g4414L5008j41606e5937j11256K834f1987
19205d22376A56598G5258N2114D7794L7866e5485f427j14206D4825c33320N1993
$$ plain form
19194 -281327 128397 -157841 -68611 -185834 -270898 -59457 -23768 84027 -208803 138524
19183 114263 20057 -149626 50760 -175228 -7445 28889 -69452 59370 41124 87326 671 241153
19171 241153 -555949 148916 46031 166107 -162019 166301 125108 -174189 112888 -148426
19160 10362 -263539 -40077 139312 89752 -379240 -312397 64582 203166 117439 59190 48589
19149 48589 66064 200466 -34827 -98567 266512 -148901 13874 -7578 -222896 203478 -126200
19137 -103347 3454 142712 65050 -6141 -238899 -298633 -118530 18513 -252636 -194417 259081
19125 -20306 -1037 124006 -29566 -35703 13965 -449603 182930 214430 -506815 -83100 121773
19113 -171840 133339 -43233 25544 -236395 -118560 313220 -48357 479309 5093 -441497
$$ packed form
19194b81327A28397a57841f8611j17223q5064e9457b3768H4027b08803A38524
19183A14263B0057a49626E0760a75228g445B8889f9452E9370j8246M6202F71K40482
19171B41153e55949A48916D6031J20076a62019A66301m1193a74189A12888a48426
19160A0362b63539d0077A39312m9560c79240O6843F4582J38584q5727n8249j0601
19149D8589J7475J34402c4827o3740B66512a48901A3874g578k15318B03478a26200
19137a03347C454J39258F5050f141k32758n9734a18530A8513b52636N8219B59081
19125b0306a037A24006b9566o137A3965d49603A82930L1500e06815h3100A21773
19113a71840A33339d3233B5544b36395J17835C13220d8357D79309E093d41497
$$ plain form
19102 9491 -142045 -241520 -146738 -351745 13871 -272405 -104344 -268583 -296582 46197 -4441
19090 155163 -116783 -485721 -172540 109314 -376338 -47254 -225081 -27559 -49801 -110902
19080 -110902 35421 -114854 122496 212857 -63263 207787 -202632 -314910 75952 -533978
19069 148038 -251931 51741 -246979 85458 122908 -92495 -302134 90705 -90690 -47787 -221625
19058 -221625 -17594 -152678 -226384 250770 -134847 -30866 -149285 7143 104636 265431 144226
19047 144226 250438 -45929 -40658 -176876 -56182 -204620 -339961 191186 -236297 97803
19036 -200386 217654 -398591 -52392 -12194 -280909 -96318 -68230 -93299 -201806 55702 92335
19025 92335 199559 113720 -294611 -8272 54367 -179039 38479 -187064 106792 -147870 -101656
$$ packed form
19102I491a42045r9475R4782k05007A3871b72405a04344j64239k7999D6197d441
19090A55163a16783l68938a72540A09314c76338d7254j77827b7559k2242o1101
19080a10902C5421a14854A22496R0361f3263B07787b02632j12278G5952e33978
19069A48038b51931E1741b46979H5458L7450i2495k09639I0705i0690M2903j73838
19058b21625a7594j35084p3706B50770a34847c0866j18419G143R7493J60795j21205
19047A44226J06212d5929N271j36218e6182j48438j35341A91186b36297I7803
19036b00386B17654c98591e2392a2194k68715i6318K8088k5069j08507E5702L6633
19025I2335J07224q5839b94611h272E4367a79039C8479a87064A06792a47870M6214
$$ plain form
19014 -101656 256245 -74440 -38715 192472 -310858 175102 16822 29243 -328893 -220019
19004 -220019 -288529 11031 -92223 -349157 -245519 -95224 90574 149871 -143139 -35164 -275097
18993 -275097 99291 -1598 98830 92223 -95794 39356 243223 89818 -295777 -151171 30538
18981 54906 74856 75751 -74602 294045 48888 -75276 23163 19708 -156301 7761 22596 24815
18969 24815 -328535 -147270 14875 -84881 -277437 -89459 213068 -370234 -131671 229649
18958 -156421 131769 -147728 -42265 -72111 56246 -139659 -73290 -4351 98200 103174 78566
18947 78566 -206012 144533 -13667 -100386 39678 -87529 -18256 -385812 -25189 -34595 76797
18935 27527 -14215 -83703 -41336 205693 -43470 -143963 -119509 126139 -96659 -105753 67659
$$ packed form
19014a01656B56245g4440L5725A92472c10858A75102A6822J2421c28893J08874
19004b20019o8510A1031i2223k56934J03638i5224I0574N9297a43139c5164k39933
18993b75097I9291a598I8830o607i5794C9356K03867H9818b95777J44606C0538
18981E4906J9950Q95g4602B94045D8888g5276B3163l455a56301G761J4835K219
18969B4815c28535a47270A4875h4881j92556h9459B13068c70234a31671B29649
18958a56421A31769a47728d2265k9846E6246a39659O6369d351I8200M974k4608
18947G8566b06012A44533a3667q6719C9678h7529a8256l67556b5189r406G6797
18935B7527a4215o9488d1336B05693d3470j00493K4454A26139i6659r094F7659
$$ plain form
18923 203561 15450 -13012 502488 65316 11717 92633 -162773 111486 -187954 101666
18912 -123577 -54146 182973 -367458 -114970 113580 25628 -228078 75876 122268 -344194
18901 -10151 -37962 12201 71029 -179791 133933 -254015 33148 88263 160389 79403 -235261
18889 -208687 261664 163102 -83225 -152594 158674 89354 117796 62624 266076 414895 -142260
18877 -153159 -252895 -220668 -282463 -43139 7888 -5264 -20161 -136728 194885 266435 -286668
18865 30584 154484 300147 -134451 -87207 -41714 63503 -147869 -120908 135563 -17283 -216326
18854 -216326 63032 91456 -77997 -67552 -113108 115059 -17792 -341523 101626 389076 247102
18843 247102 171803 211086 -84035 84474 -80538 -53099 -155964 142024 -268732 171908 8381
$$ packed form
18923B03561A5450a3012E02488F5316A1717Q0916a62773A11486a87954A01666
18912a23577e4146A82973c67458a14970A13580B5628b28078G5876M6392c44194
18901a0151k7811A2201N8828a79791A33933b54015C3148N5115P2126G9403b35261
18889b08687B61664r8562h3225o9369A58674o9320K8442n5172K03452J48819a42260
18877a53159r9736L2227o1795d3139G888e264j4897j16567A94885P1550b86668
18865C0584J23900J45663a34451M7244d1714F3503a47869K6961A35563a7283j99043
18854b16326F3032K8424g7997J0445m5556A15059a7792l23731A01626K87450j41974
18843B47102p5299L9283h4035H4474h0538K7439j02865A42024b68732A71908H381
$$ plain form
18831 -6507 -28859 -213625 48481 -381224 -94725 10023 -315899 52011 -385930 -163736 -63692
18819 -230664 84068 77897 73275 51988 -41275 -185454 -578530 -168026 -143401 -273920 -64822
18807 -234836 282846 271063 -43681 -249005 -73285 64427 176129 275432 300164 -9893 48202
18795 -95141 114596 -106601 -31395 -35984 32572 -178893 -529820 -263867 -51822 104002 -55712
18783 -4314 137946 53966 -52443 -167464 -159698 -77545 159640 957 -196410 57151 214389
18772 214389 -53984 -94868 8255 233680 -204553 -153401 -297434 -252796 -239612 -102570 -352354
18761 -352354 -56359 -265290 -54502 -66400 155582 226358 -49164 -21968 -313738 124391 -184193
18749 97818 158994 -112336 -134923 34361 -166781 -72689 -116060 -165307 115071 -77517 13243
$$ packed form
18831f507k2352j84766D8481c81224i4725A0023c15899E2011c85930a63736f3692
18819b30664H4068o171m622k1287d1275j44179l93076a68026K4625j30519f4822
18807b34836B82846j1783d3681k05324g3285F4427J11702R9303K4732i893D8202
18795i5141A14596a06601c1395m589C2572a78893l50927b63867e1822A04002e5712
18783d314A37946E3966e2443j15021P766g7545A59640I57a96410E7151J57238
18772B14389e3984m0884H255K25425b04553N1152j44033M4638J3184a02570k49784
18761c52354e6359k08931e4502j1898A55582P0776d9164b1968k91770A24391a84193
18749I7818O1176a12336k2587C4361a66781g2689m3371m9247A15071g7517A3243
$$ plain form
18737 211710 -21188 -119170 -135336 -161084 42957 4446 -97371 -333077 8080 -218015 -160285
18726 -160285 -139891 48818 -97309 -146032 -224838 88298 -351724 -1868 -85243 -158037 -10959
18714 28242 -173791 -94115 -106592 151279 348476 -170446 12973 -409583 -26323 -149607
18704 -149607 154316 59233 -101669 -26803 -225687 -167909 242585 16082 -212372 152022
18693 -215181 -79208 -182060 -124434 -66320 8467 -9139 -31513 3838 -36857 -104313 -154895 -5116
18680 -152871 -207258 107201 6390 16155 -265885 -22772 91357 20517 -182884 -223959 -541751
18669 -541751 -171777 -55054 -466752 -93941 -208131 -98921 -197936 -132777 131482 -239316
18658 -130661 107641 29503 -97798 19780 -255908 -97424 -77808 -127674 -251630 -5542 -255525
$$ packed form
18737B11710b1188r7982j6166k5748D2957D446i7371k35706H080b18015N7730
18726a60285K0394D8818i7309m8723p8806H8298c51724a868q3375p2794a0959
18714B8242a73791P9676j2477A51279J97197a70446A2973d09583b6323j23284
18704a49607A54316E9233a01669b6803j98884N7778B42585A6082b12372A52022
18693b15181g9208j02852N7626N8114H467i139k2374C838c6857o7456n0582e116
18680a52871n4387A07201F390R765b65885b2772I1357B0517a82884m1075l17792
18669e41751a71777e5054m11698i3941j14190i8921r9015O5159A31482b39316
18658a30661A07641B9503i7798A9780b55908i7424J9616m9866j23956e542k49983
$$ plain form
18647 -255525 6912 -26828 -75477 279661 297461 140156 -267911 200425 65552 -184618 -96630
18636 -96630 -67369 -398133 -301833 -75022 -384934 77038 -106175 45046 -237546 -274505 -159064
18625 -159064 -214114 -90904 -189945 -511308 -145076 -281 -19091 -41093 59949 -235860 -23702
18613 -150660 -84718 67022 -96554 54783 -49394 300013 -117593 -182006 -94826 58815 247853
18602 247853 37669 338606 79100 12700 4970 -21725 40213 26940 -55689 102125 -194654
18590 -50624 364984 191374 -282157 -171160 -84084 -77482 -274104 60548 -172136 -14859 171439
18578 -362328 -46965 -55800 -286053 -2570 -49303 -12855 19982 171044 213869 -116877 18235
18566 287232 -72578 39493 51032 192124 11163 89280 -22874 20360 539506 122563 117779
$$ packed form
18647b55525F912b6828m8649B79661J7800A40156b67911B00425F5552a84618Q7988
18636i6630K9261l30764R6300g5022l09912G7038a06175D5046b37546l6959J15441
18625a59064n5050i0904r9041l21363a45076b81j8810k2002E9949b35860b3702
18613a50660O5942F7022i6554E4783d9394C00013a17593o4413Q7180E8815J89038
18602B47853C7669L00937G9100A2700D970b1725D0213j3273e5689A02125a94654
18590e0624C64984j73610b82157J10997h4084O602j96622F0548a72136a4859A71439
18578c62328d6965q835k30253b570m6733a2855A9982J51062M2825a16877A8235
18566B87232g2578C9493J1539J41092A1163P8117b2874B0360N19146A22563m784
$$ plain form
18555 117779 -132739 -25455 45731 20873 -289109 -397342 97403 -283633 -252899 -39847 -13561
18543 -165708 -111394 -160710 -16064 178596 52101 114271 42968 -319656 350549 14438 606
18531 196315 -261196 -40807 84691 105607 -113807 -249776 -85322 -201516 97242 117947 -3249
18519 84744 398817 -82591 244915 264711 -286319 237204 -301131 -193181 -194950 -172648 5378
18507 211351 -60312 117337 280182 -133387 -311206 22917 -166857 -62632 -186141 7699
18496 44308 110484 2358 155959 -127647 -267940 221662 -400365 -7650 -321603 29788 -156893
18484 -45080 24034 321301 168980 -201577 42960 -389800 47522 166849 -332559 -100548
18473 216814 -251136 -239934 -60687 61974 72083 7762 -129542 366130 -59301 123298 -86198
$$ packed form
18555A17779a32739b5455D5731B0873b89109j08233I7403b83633L0734c9847a3561
18543a65708N4314m9316a6064A78596E2101O2170D2968c19656C50549A4438F06
18531A96315b61196d0807H4691K0916a13807j35969h5322j16194I7242K0705c249
18519H4744L14073h2591B44915J9796b86319B37204c01131J07950j769K2302E378
18507B11351f0312A17337J62845a33387j77819B2917a66857f2632j23509G699
18496D4308O6176B358J53601a27647j40293B21662d00365g650l13953B9788a56893
18484d5080B4034K97267j52321b01577D2960c89800D7522J19327c32559a00548
18473B16814b51136J1202f0687F1974J0109G762a29542C66130e9301A23298h6198
$$ plain form
18461 7139 13204 -107994 -254750 -177197 -7662 -126285 -94794 -243164 79407 -68267 -10124
18449 -192295 -41570 -106249 22162 -54483 -29830 -235373 -153395 -111216 174978 186311 23138
18437 -281576 93565 11287 -97500 70937 268112 27106 72649 -345779 236714 -11187 -66883
18426 -66883 -301450 140013 49788 139057 172752 -20944 9072 -32859 -177658 14295 718 -350028
18413 -332326 5283 -224825 -647 -293837 246988 -131475 202480 -78913 121031 65781 -52958
18401 360677 -8590 90896 151296 -293124 77035 -477046 -182164 -184816 -422701 -310321 25119
18389 -4507 -441719 -14583 46175 -649 279390 -236959 -210797 -145519 227443 171550 58266
18377 -113200 -97553 -10522 -185567 -185442 -192864 227219 -27042 -459826 -240428 -50669 -86678
$$ packed form
18461G139O065a07994j46756P7553g662j18623L1491j48370G9407f8267a0124
18449a92295d1570o4679B2162e4483K4653k05543Q1978M2179A74978J1333B3138
18437b81576I3565A1287i7500G0937J97175B7106M5543c45779B36714a1187n5696
18426f6883k34567A40013D9788Q9269L3695b0944I072c2859j44799A4295G18c50028
18413c32326E283b24825f47k93190B46988a31475B02480g8913A21031n5250e2958
18401C60677h590I0896O0400b93124G7035d77046a82164k652k37885J12380B5119
18389d507m37212a4583D6175f49B79390b36959K6162O5278B27443n5893E8266
18377a13200J5647a0522j75045J25p422B27219b7042m32784K19398e0669l6009
$$ plain form
18366 -86678 -15400 -110408 -25235 -152455 -159568 84890 22864 -416870 -115940 80130 -97444
18354 -120663 7126 16283 -133336 181124 263908 -22039 -34482 -12475 53290 -372618 -45038
18342 173927 150543 49157 -58399 179407 -1303 -14841 -50295 164439 18518 20756 24169 -360955
18329 -131888 -131682 255921 -599124 234549 92354 -73597 -66931 -97963 -218747 -274413 5863
18317 -140604 -62890 -69 -304119 -58411 -3197 65851 76434 -19837 -141975 -87328 -40677 56408
18304 -982 -264063 -392250 22680 55248 297392 43053 30581 -244090 250895 -11729 -145104
18293 -145104 234329 -207118 -76780 71851 -77795 93 -277439 241609 276580 -290610 -74007
18281 91114 -60099 285526 -54601 141061 -98416 -22229 -130258 -69440 59059 -427 -200364
$$ packed form
18366h6678a5400r5008b5235j27220p113H4890B2864d16870a15940H0130i7444
18354a20663G126R157a33336A81124Q2784b2039j2443a2475E3290c72618d5038
18342A73927k3384D9157e8399A79407a303j3538l5454A64439A8518K238L413c60955
18329a31888K06B55921e99124B34549I2354g3597O666l1032j20784n5666E863
18317a40604f2890f9l04050e8411c197F5851J0583a9837j22138N4647d0677E6408
18304i82k63081j28187B2680L2568K42144D3053j2472b44090B50895a1729j33375
18293a45104B34329b07118g6780G1851g7795I3b77439B41609L4971b90610g4007
18281I1114f0099B85526e4601A41061i8416b2229j08029O0818E9059d27j99937
$$ plain form
18270 -200364 99767 -105070 233723 -413556 163504 -212168 -200412 278034 209321 58737
18259 -59301 -31140 88493 -273680 36591 -145074 103910 -276429 -43406 255235 -268951
18248 7350 -41088 191680 -257482 -108955 2573 -81203 -182017 -10493 -206367 -264800 -129529
18236 -51953 -152799 -271966 126163 217512 -69925 82383 -44173 -52372 89793 -136132 13337
18224 103180 191885 147745 -88446 -127257 122665 -240657 257881 -52050 -307956 -127936
18213 209833 -139871 247573 75316 -50841 290562 199370 181103 -94371 -57624 128802 -80633
18201 738 31237 39711 -161101 -55937 44717 96774 -252740 -105819 -98542 -76727 183715 90319
18188 408984 265859 52241 13754 30095 -133203 -226713 360928 -38177 -78984 167346 -39291
$$ packed form
18270b00364I9767a05070B33723d13556A63504b12168J1756B78034o8713E8737
18259e9301K8161H8493b73680C6591a45074A03910b76429d3406B55235b68951
18248G350d1088A91680b57482a08955B573h1203j00814a0493j95874n8433a29529
18236e1953j00846j19167A26163R1349f9925H2383d4173q199H9793a36132A3337
18224A03180Q8705m4140h8446l8811A22665b40657B57881e2050k55906a27936
18213B09833a39871B47573G5316e0841B90562r1192j8267i4371L6747A28802h0633
18201G38L0499Q474a61101e5937D4717N2057b52740a05819P277K1815A83715I0319
18188D08984j43125E2241A3754J6341a33203r3510C60928c8177m0807A67346c9291
$$ plain form
18176 134151 37450 243141 230764 56087 -242295 -22816 -13361 78171 169153 -395450 31205
18164 -142827 151419 -9940 34716 16598 -170424 -71197 -163197 -137871 97307 -264839 5356
18152 13404 -143431 -210428 99393 151106 -40942 -46522 70337 -235530 -278761 -159699 -28906
18140 -307862 168378 -144854 -110678 179975 256672 146025 143740 -161799 186642 -14979
18129 -3113 -68829 116199 136595 -186916 264618 262954 19875 -269173 20151 19967 12110 -13576
18116 72662 186691 82251 78891 -149069 135231 -281544 -23185 -143506 -105166 255637 -179551
18104 103130 -297517 -558484 -240986 150415 -125594 138564 127653 -150650 183169 122282
18094 122282 -135050 125955 313566 -188065 -259016 439695 -130902 -68870 -234641 274994
$$ packed form
18176A34151C7450K05691j2377E6087b42295b2816R455G8171R0982c95450C1205
18164a42827A51419i940C4716A6598a70424g1197r2000K5326I7307b64839E356
18152A3404a43431o6997I9393N1713d0942n580G0337b35530m3231J19062b8906
18140c07862A68378a44854L4176A79975P6697j10647k285a61799A86642a4979
18129c113o5716A16199K0396a86916B64618j664A9875b69173B0151j84p857a3576
18116G2662J14029H2251l360a49069A35231b81544b3185j20321L8340B55637a79551
18104A03130b97517k60967b40986A50415a25594A38564j0911a50650A83169o0887
18094A22282a35050A25955J87611a88065p0951D39695a30902O2032j65771B74994
$$ plain form
18083 56881 -267922 57382 103297 -178744 -198905 93888 -66737 -244035 -94913 -220552 -18302
18071 -15708 275053 203683 8797 72837 -62174 -28769 106048 -59522 116704 -120308 63916
18059 -22228 -52766 -82283 -199542 43417 -193771 -426205 -84351 48319 -242516 345239 46090
18047 93052 250985 -92621 195231 229703 -86296 195977 -157711 -229986 -123734 -32282 -63813
18036 -63813 -149750 -48282 -224825 167255 -172364 -39450 60246 -416259 -766 -90858 51789
18024 60576 -272176 -135846 92202 -432897 -186246 -30965 52687 -67924 71495 -311984 174672
18012 -81999 31035 105140 245663 -355216 -51093 -12629 -236049 -137992 -244907 -444509 -131113
18000 -79542 164294 -36388 79973 52506 232026 67065 35470 -149752 28607 -124697 -267170
$$ packed form
18083E6881b67922E7382M5915a78744k0161I3888f6737j77298i4913j25639a8302
18071a5708B75053p1370H797O4040f2174b8769A06048e9522A16704a20308F3916
18059b2228l0538k9517j17259D3417a93771k32434h4351D8319b42516C45239D6090
18047I3052J57933i2621A95231L4472h6296A95977a57711p2275J06252c2282l1531
18036f3813q5937d8282j76543A67255a72364c9450F0246d16259g66r0092E1789
18024F0576b72176a35846I2202d32897a86246c0965E2687f7924G1495c11984A74672
18012h1999C1035P4105J40523c55216e1093a2629k23420R8057j06915j99602a31113
18000g9542A64294c6388G9973k7467J79520F7065l1595a49752B8607a24697j42473
$$ plain form
17989 -267170 -202594 -18273 74296 65794 54654 143401 -30222 109446 -249955 235215 -198048
17977 -258983 -30885 170446 86126 -107432 -38733 -44122 183780 -311904 -15646 -146533 61791
17965 -151827 123091 -14649 20924 -313131 -194666 242503 -58095 324719 279158 -372426
17954 70553 90966 258065 68832 17811 249774 122827 -141337 -120337 935 135202 -145265
17942 111693 58939 61424 -20321 -210730 -22798 -403772 206803 -86881 -169051 26513 211207
17931 211207 -44677 252380 -241916 -35270 127561 -116620 29388 -256814 42871 65904
17921 65904 -305906 -33624 -90431 -61419 -228877 -283984 47708 89892 -4041 -230088 -284655
17910 -284655 40113 -260376 -55144 -6595 -215265 -178439 132523 -50014 -99606 -140149 -79451
$$ packed form
17989b67170O4576a8273G4296q502j1140Q8747c0222A09446b49955B35215a98048
17977b58983c0885A70446q4320a07432c8733n389A83780c11904a5646j30887F1791
17965a51827A23091a4649B0924c13131J18465B42503e8095C24719m5561c72426
17954G0553K0413J67099F8832A7811K31963A22827a41337K1000I35J34267a45265
17942A11693n2754K485b0321j90409b2798l80974B06803h6881q2170B6513J84694
17931B11207d4677B52380b41916c5270A27561a16620B9388b56814D2871K3033
17921F5904c05906c3624n6807K9012j67458n5107D7708M2184d041k26047n4567
17910b84655D0113b60376e5144f595k08670L6826A32523e0014m9592m0543O0698
$$ plain form
17899 -79451 -210782 125953 -58387 144092 -72022 214794 347187 -266540 119043 93994
17889 93994 26884 80747 312494 84247 -47857 129322 -101197 16884 -271072 47375 -201592
17877 -286130 261767 34139 -239072 -130720 63634 -217895 -133793 -116132 -240908 25352
17866 188556 -317881 -238837 46993 11905 131028 24179 -180923 -18320 -127761 -71641 -73684
17855 -73684 1347 332365 -96634 -194183 -13061 155117 -224320 19630 -324749 -218843 138490
17843 113920 1528 70749 27612 -4185 -8682 72320 336724 -83693 -94017 114007 -171530
17831 -177929 -95125 7307 -155213 151895 200762 219303 -63469 78018 1556 -179629 122113
17819 110771 -144195 316807 -59942 -49151 81197 304820 -150074 84857 -32619 79932 176578
$$ packed form
17899g9451j31331A25953e8387A44092g2022B14794J32393b66540A19043k5049
17889I3994B6884N3863K31747H4247d7857A29322a01197A6884b71072D7375b01592
17877b86130B61767C4139b39072J08352F3634b17895Q4102J7661j24776B5352
17866A88556c17881P9044D6993A1905J19123B4179a80923a8320j09441N6120k043
17855g3684A347L31018i6634r7549a3061A55117b24320A9630c24749J05906A38490
17843A13920A528O9221B7612d185m497G2320K64404h3693j0324A14007a71530
17831a77929Q2804G307a55213A51895M8867J8541f3469G8018A556a79629A22113
17819A10771a44195C16807e9942J0791H1197K23623a50074H4857c2619G9932R6646
$$ plain form
17808 176578 -202580 39999 -152193 -5360 215914 102346 207832 -18611 172832 -348580
17797 -283446 276131 -109625 51414 44626 -79796 -17114 -41311 -124045 -87619 47890 -234975
17785 -526389 90899 79463 152791 76806 -4308 75170 -20591 -990 -14372 156159 -137295 81113
17772 -37929 50443 194543 200463 -95424 16461 -96208 97356 -121887 208295 -41838 -77390
17761 -77390 -164215 4863 185341 -7283 -152769 235579 218428 -96114 -256697 375706 190971
17750 190971 -23283 -237165 66667 -14732 200605 44735 10249 -26219 126973 236560 365973
17739 365973 -38112 187627 -87307 -142443 -114366 136420 -17683 -284441 156911 -146608
17728 87934 -194988 -82448 -288892 172366 156129 -11507 -118175 -118947 -243092 -131570 65912
$$ packed form
17808A76578b02580C9999a52193e360B15914A02346J05486a8611A72832c48580
17797b83446B76131a09625E1414o788g9796a7114k4197q2734L6426D7890b34975
17785e26389I0899j1436P3328p5985d308G5170b0591i90j3382A56159a37295H1113
17772c7929E0443J44100N920i5424A6461i6208I7356a21887B08295d1838l5552
17761g7390q6825D863J80478g283j45486B35579j7151i6114j60583C75706j84735
17750A90971b3283k13882F6667a4732B00605D4735A0249b6219A26973J09587J29413
17739C65973c8112A87627h7307n5136K8077A36420a7683k66758A56911a46608
17728H7934a94988h2448k06444A72366j6237a1507j06668p72j24145J11522F5912
$$ plain form
17716 18358 -52231 291029 15143 109527 -35120 83692 57620 -241735 262207 166671 -126714
17704 257748 -218065 -89607 244088 -116588 -67407 -126834 367630 -201555 62896 -48179
17693 3372 324607 -88958 124 252786 -252413 -144440 -91158 -123202 -20608 58197 -9144 82063
17680 170559 79281 156003 167683 -306594 271967 143134 37204 13318 87048 -38771 -248920
17669 -248920 72257 42161 110234 -124403 3975 27244 296903 128257 -155122 95119 -13082
17657 -8852 76004 82209 63568 87379 60599 236128 481240 78882 62855 186726 -2665 84382
17644 277428 198420 474076 -254101 -16719 -90699 332848 -85266 256177 31135 292297
17634 292297 268118 -80739 25095 41123 148747 117115 -32334 -186464 57018 337596 -128692
$$ packed form
17716A8358e2231B91029A5143R4384c5120H3692k6072b41735B62207r5536a26714
17704B57748b18065h9607B44088a16588M9181n9427C67630b01555F2896d8179
17693C372L21235h8958A24K52662b52413J07973N3282l2044b0608E8197i144H2063
17680A70559G9281P6722J1680c06594B71967j28833C7204A3318P3730c8771k10149
17669b48920G2257l0096O8073a24403C975K3269K69659A28257a55122I5119a3082
17657h852G6004O205j8641K3811k6780J75529K45112G8882j6027J23871b665H4382
17644B77428p9008K75656b54101a6719p3980C32848h5266B56177C1135K61162
17634B92297k4179h0739B5095J6028J07624l1632c2334j54130E7018K80578a28692
$$ plain form
17622 -291828 -346782 -78063 -208302 -71964 7978 171667 53890 -18394 160656 -374846 464159
17610 -12305 291682 -40909 -30821 76448 -50856 -117665 268544 -164555 55588 109788 -129034
17598 -253086 -49301 -284314 86822 -105873 34575 -150249 -36419 376722 -254017 -211704
17588 -211704 88549 38344 195599 27403 127343 209958 111111 -155655 84493 105029 40530
17576 331320 376462 99659 365891 -43145 150709 -218267 251546 12859 128497 161310
17566 161310 59932 89331 173862 101836 63058 21226 121847 -100591 -154872 74253 37437
17555 37437 171116 222766 -123446 93805 49468 80098 71565 -14022 -221687 -151314 70075
17543 41790 348954 22697 6850 -94304 114157 265639 -180829 -38179 74760 96677 2565
$$ packed form
17622b91828n4954g8063j30239g1964G978J63689E3890a8394A60656c74846D64159
17610a2305B91682d0909J0088G6448e0856o6809B68544a64555E5588N4200a29034
17598b53086d9301k35013H6822a05873C4575a50249c6419C76722b54017M2313
17588b11704H8549C8344J57255B7403R9940Q2615r8847a55655H4493K0536D0530
17576C31320M5142I9659K66232d3145A50709b18267B51546A2859J15638L2813
17566A61310E9932K9399Q4531p2026l8778B1226J00621a00591n4281G4253l6816
17555C7437J33679N1650a23446I3805m4337L0630q533a4022k07665P0373G0075
17543D1790L07164B2697F850i4304A14157J51482a80829c8179G4760K1917B565
$$ plain form
17531 148875 -145026 129931 -226643 -161220 293338 302145 296295 -77838 237468 188160 283981
17520 283981 -273781 42151 59903 -210562 13268 -179348 36292 195141 204446 295443 153431
17509 153431 171307 -74163 -221327 121770 8578 -164814 380745 50428 91430 -233697 -358592
17498 -358592 -195675 -111857 72085 50249 37338 213751 -85672 86022 63135 252219 -55170
17486 -73882 65809 124964 -4172 -18975 5642 186669 193982 -62852 158155 -91383 -208360 259691
17473 345583 -37473 293208 136686 41204 157453 281465 274297 114804 297674 51135
17462 -24623 99632 -206921 40082 -174699 322866 -127224 -68709 54829 -55853 433282 -1742
17450 112620 12822 -233090 253184 80338 233596 311377 284690 460549 277160 332791
$$ packed form
17531A48875a45026A29931b26643O5423B93338Q807n850g7838B37468m9308R5821
17520B83981b73781D2151J7752b10562A3268a79348C6292J58849R305R0997j42012
17509A53431J7876g4163j47164A21770H578a64814C80745E0428M1002b33697j24895
17498c58592J62917Q3818G2085k1836j2911J76413h5672H6022k2887J89084e5170
17486g3882F5809N9155d172j4803E642J81027P313f2852A58155i1383j16977B59691
17473C45583c7473B93208A36686D1204J16249J24012p168A14804J82870E1135
17462b4623I9632b06921D0082a74699C22866a27224N8515E4829e5853D33282a742
17450A12620A2822b33090B53184H0338J53258P7781k6687J75859j83389N5631
$$ plain form
17440 332791 313673 323112 -94547 13811 -221880 209800 191161 357203 172506 346437 53795
17428 154523 339197 38861 403728 276702 26095 233350 111641 352044 231497 122061
17418 122061 331380 111712 444037 391835 409753 104769 261828 347557 68702 143954
17408 143954 444985 -17965 217123 367586 545467 327104 317016 216680 168412 528249
17398 528249 267765 166216 231087 432985 -92780 239119 -154446 344732 291981 144574
17387 170816 208733 372914 16369 234744 -16224 150413 121879 221046 88676 346270 147387
17375 317180 572795 -7038 134630 391022 447846 -63105 230045 326847 121123 187321 273430
17364 273430 -47382 235510 -124652 113810 106621 285816 320181 33588 142237 718210
$$ packed form
17440C32791j9118R439i4547A3811b21880B09800j8639J66042A72506J73931E3795
17428A54523J84674C8861L64867j27026B6095K07255A11641K40403j20547j09436
17418A22061K09319A11712L32325n2202J7918A04769J57059Q5729F8702P5252
17408A43954L01031a7965B17123J50463J77881k18363j0088j00336m8268L59837
17398E28249k60484j01549O4871K01898i2780B39119a54446C44732n2751A44574
17387A70816L7917J64181A6369K18375a6224A50413k8534R9167H8676K57594A47387
17375C17180K55615g038A34630K56392N6824f3105B30045R6802A21123O6198Q6109
17364B73430d7382B35510a24652A13810p189J79195L4365C3588J08649N75973
$$ plain form
17354 718210 169950 241911 87434 59148 502023 -160682 517920 244766 146943 -113916
17343 7930 130930 159611 86950 208301 169170 98217 -45011 118747 -66885 271038 565509
17332 565509 117535 247444 411633 -58761 276098 406273 64676 64511 249982 303055 109817
17320 273830 306570 406188 250004 37819 154737 225098 201384 116584 -56199 191801 285719
17309 285719 173594 -118428 34287 220252 318553 -102397 -13957 300591 405983 32276
17298 185249 190259 235577 391636 -163812 -80448 310924 -13513 -44167 -215995 117238 128284
17287 128284 304356 216252 74610 149612 366088 101618 -155848 148666 -92028 134973
17276 314399 -159045 -30618 199096 166585 403896 355349 210511 -2388 47686 441815 -39022
$$ packed form
17354G18210A69950P1961H7434k8286M42875a60682E17920B44766r7823a13916
17343G930J23000K8681p2661J21351l9131p0953d5011A18747f6885B71038K94471
17332E65509A17535J29909J64189e8761B76098J30175F4676j65J85471N3073A09817
17320B73830L2740R9618j56184C7819J16918P0361k3714q4800e6199A91801R3918
17309B85719j12125a18428C4287J85965R8301a02397a3957C00591J05392C2276
17298A85249N010M5318J56059a63812h0448C10924a3513l0654j71828A17238J1046
17287A28284J76072q8104G4610P5002K16476A01618a55848A48666i2028A34973
17276C14399a59045c0618A99096l2511K37311m8547j44838b388D7686L94129c9022
$$ plain form
17264 235314 -43196 -33092 134037 116003 89498 89229 155010 304838 -121390 154695 -9389
17252 49736 377821 157262 -37558 172477 352799 -195508 -110174 148402 175586 -182230
17241 183671 185162 83737 260089 49657 231163 40142 77049 137418 236155 68587 336473
17230 336473 113503 103817 183773 -46039 172664 210082 663003 440911 161679 165296 281191
17219 281191 127346 158081 247267 273461 347329 368589 182678 -149147 -5447 292243 269584
17208 269584 184270 380660 206912 51066 62815 152414 206282 150379 82462 232911 111851
17196 193772 73570 307535 72583 287990 436925 -235177 211913 166691 336939 444539
17186 444539 232593 182803 85283 221891 294863 315969 125976 414392 228953 214858
$$ packed form
17264B35314d3196J0104A34037j8034k6505k69O5781J49828a21390A54695i389
17252D9736L28085A57262c7558A72477J80322a95508Q5334A48402K7184a82230
17241A83671J491H3737J76352D9657J81506D0142L6907O0369R8737F8587K67886
17230C36473A13503r686P9956d6039A72664L7418M52921k22092A61679L617J15895
17219B81191A27346L0735Q9186K6194P3868K1260A82678a49147e447B92243k2659
17208B69584q5314J96390j73748E1066J1749Q9599N3868n5903o7917J50449A11851
17196A93772G3570K33965G2583K15407J48935b35177B11913m5222J70248J07600
17186D44539k11946m9790H5283J36608P2972K1106A25976K88416j85439j4095
$$ plain form
17176 214858 343741 319840 99995 42423 62139 295490 136869 136561 121257 -146444 453677
17164 200721 183790 403740 397766 224707 126849 228028 374223 90714 321901 418320 23746
17152 272578 532452 465780 222680 359053 423721 230892 507841 343722 268244 322958
17142 322958 404188 181245 25246 336376 339773 162957 486707 227687 577604 218815
17131 518982 200807 333074 290837 299524 327767 357526 347745 376057 224559 274237 258586
17120 258586 400427 547930 251684 222291 218306 222121 -46170 433205 366002 365264 388147
17109 388147 421950 285124 523588 353044 154265 349663 333789 493005 322564 149189
17098 406850 380313 387327 -139118 453510 231331 27697 111191 307593 553537 223774
$$ packed form
17176B14858J28883k3901I9995D2423J9716K33351A36869l08j5304a46444D53677
17164B00721j6931K19950n974j73059r7858J01179J46195I0714K31187R6419B3746
17152B72578K59874o6672B22680J36373O4668j92829K76949j64119p5478N4714
17142C22958Q1230A81245B5246L11130L397A62957L23750B27687L49917B18815
17131E18982B00807J32267m2237Q687K8243K9759r781K8312j51498M9678j5651
17120B58586J41841J47503B51684k9393l985L815d6170D33205o7203p38K2883
17109C88147L3803j36826K38464j70544A54265J95398j5874J59216j70441A49189
17098D06850k6537P014a39118D53510k22179B7697Q3494J96402K45944B23774
$$ plain form
17087 375474 351211 190005 410262 461151 825973 -30509 228183 382365 49732 865652
17077 865652 313140 264167 481585 571682 514749 289261 10838 385958 306712 204452
17067 204452 536658 259149 619007 334651 459717 690193 439919 717621 595361 574150
17057 574150 720783 660595 478580 517783 429025 373334 614490 477830 125297 493805
17047 493805 510026 93340 514312 520837 201122 319395 404321 330558 520902 441674 111334
17035 596410 664019 373914 830263 580994 586074 344830 705801 175790 484124 600515
17025 600515 444400 734106 420870 479455 686962 578922 741317 661576 688368 333727
17014 592253 371109 789020 687186 485451 289679 423424 504232 807066 917277 814661
$$ packed form
17087C75474k4263j61206K20257N0889L64822c0509B28183J54182D9732Q15920
17077H65652C13140m8973K17418R0097n6933k25488A0838L75120p9246j02260
17067B04452L32206B59149L59858k84356J25066K30476k50274K77702j22260k1211
17057E74150J46633o0188j82015L9203q8758n5691K41156j36660A25297L68508
17047D93805J6221I3340M20972O525B01122J18273Q4926p3763J90344p9228A11334
17035E96410O7609k90105M56349k49269N080k41244L60971A75790L08334J16391
17025F00515j56115K89706l13236N8585K07507j08040J62395p9741K6792C33727
17014E92253k21144M17911j01834k01735j95772J33745Q0808L02834J10211j02616
$$ plain form
17004 814661 679253 656591 471386 530622 496090 508476 752072 586753 562304 342258
16994 342258 732562 675882 572418 550612 743508 871215 591608 442657 545967 605633
16984 605633 718094 698924 801404 825278 907157 786497 923721 787283 610038 719027
16974 719027 655699 772966 531458 1145071 625791 673150 695299 899324 636318 796526
16964 796526 851964 901102 860281 910925 830677 1221697 728313 730269 856829 1039212 803907
16953 803907 1165100 1109846 971274 1024798 965039 831629 969951 903299 868773 885528 1002398
16942 1002398 938034 1123679 868313 705970 1079861 1084657 1217641 984473 1002628 713341
16932 713341 1035757 1166668 882422 1206393 1369386 1141704 1010325 951074 1306649 1085033
$$ packed form
17004H14661j35408k2662j85205N9236l4532J2386K43596j65319k4449k20046
16994C42258L90304n6680j03464k1806J92896J27707k79607j48951J03310N9666
16984F05633J12461j9170J02480K3874Q1879j20660J37224j36438j77245J08989
16974G19027o3328J17267k41508O13613n19280M7359K2149K04025k63006J60208
16964G96526N5438M9138m0821N0644q0248L91020m93384J956J26560J82383k35305
16953H03907L61193n5254j38572N3524n9759j33410J38322o6652l4526J6755J16870
16942A002398o4364J85645k55366j62343L73891M796J32984k33168J8155k89287
16932G13341L22416J30911k84246L23971J62993k27682j31379n9251L55575k21616
$$ plain form
16922 1085033 1302896 1167122 1077423 1453151 1263525 1240978 1066260 1034125 1483193 1298678
16912 1298678 1438898 1263739 1402135 1182023 1199459 1320302 1284063 1595314 1600476 1574400
16902 1574400 1407058 1537743 1704042 1538824 1361837 1506442 1473031 1569597 1533872 1495428
16892 1495428 1528102 1634267 1479209 1658984 1238824 1442226 1710277 1603283 1906964 1732921
16882 1732921 1694603 1691396 1598975 1627598 1960741 1839072 1804672 1883436 1949242 1937773 1626983
16871 1626983 2138683 1804139 1995074 2103509 2194822 1740877 2193471 2047775 1940324 1885032
16861 1885032 2140863 2261882 2131886 2614351 2444484 2217478 2097217 2607447 2257688
16852 2257688 2654446 2732440 2773600 2722826 2528175 2823928 2612818 2699939 2626278 2671844
$$ packed form
16922A085033K17863j35774q9699L75728j89626k2547j74718l2135M49068j84515
16912A298678J40220j75159J38396k20112J7436J20843l6239L11251N162k6076
16902A574400j67342J30685J66299j65218j76987J44605l3411R6566l5725l8444
16892A495428L2674J06165j55058J79775m20160K03402K68051j06994L03681j74043
16882A732921l8318l207r2421K8623L33143j21669l4400P8764O5806j1469l10790
16871A626983N11700l34544J90935J08435R1313m53945M52594j45696j07451n5292
16861A885032K55831J21019j29996M82465j69867k27006j20261N10230l49759
16852B257688L96758P7994M1160n0774j94651K95753k11110Q7121p3661M5566
$$ plain form
16842 2671844 2705973 2812626 2871555 2953531 3084722 3064661 2997260 3353132 3249294 3241289 3326212
16831 3326212 3420126 3297330 3569870 3452698 3434270 3998769 3925288 3945687 3781908 3901123
16821 3901123 4081897 3882687 4290195 4066828 4165168 4347088 4771966 4576577 4549448 4533033
16811 4533033 5080533 4694355 4567515 5223656 4715562 5031057 5129755 5265868 5462220 5537622
16801 5537622 6099237 5876091 6024343 6134240 5954081 6576624 6236229 6720766 6884620
16792 6884620 7221003 7039897 6916708 7179999 7339535 7940171 8100045 8048642 8068845 8766959
16782 8766959 8512851 8661811 9297806 9444989 9767639 10034809 10285729 10793377 10950987
16773 10950987 11186334 11470191 11838384 12058276 12367032 12575666 13203902 13587656 14042773
$$ packed form
16842B671844L4129J06653N8929Q1976J31191k0061o7401L55872j03838q005Q4923
16831C326212R3914j22796K72540j17172j8428N64499p3481K0399j63779J19215
16821C901123J80774j99210M07508k23367R8340J81920M24878j95389k7129j6415
16811D533033N47500l86178j26840O56141n08094L15495R8698J36113J96352P5402
16801E537622N61615k23146J48252J09897j80159O22543l40395M84537J63854
16792F884620L36383j81106j23189K63291J59536O00636J59874n1403K0203O98114
16782H766959k54108J48960O35995J47183L22650K67170K50920N07648J57610
16773A0950987K35347K83857L68193K19892L08756K08634O28236L83754M55117
$$ plain form
16764 14042773 14900033 14820257 15534705 15921194 16467328 16992214 17928436 18437437 18976963
16755 18976963 19784154 20509357 21217309 22035287 22823857 23835685 24723392 25470684 26896429
16746 26896429 27911803 29312023 30602868 31743875 32765862 34709254 36421119 38368716
16738 38368716 40252056 42130749 44623238 46787590 49241846 51781353 55002150 57550383
16730 57550383 61511598 64989881 68625298 73053170 77331497 82526886 87309847 92936287
16722 92936287 98945339 105350312 112126468 119035990 127120147 134835197 143090423 151378434
16714 151378434 159584094 168061324 176631546 184583878 191736811 198503628 203985603 208445965
16706 208445965 211203415 212509827 212566274 210654193 207600665 202938262 197215667 190198480
$$ packed form
16764A4042773Q57260p9776P14448L86489N46134N24886R36222N09001N39526
16755A8976963Q07191P25203P07952Q17978P88570J011828Q87707P47292J425745
16746B6896429J015374J400220J290845J141007J021987J943392J711865J947597
16738C8368716J883340J878693K492489K164352K454256K539507L220797K548233
16730E7550383L961215L478283L635417M427872M278327N195389M782961N626440
16722I2936287O009052O404973O776156O909522Q084157P715050Q255226Q288011
16714A51378434Q205660Q477230Q570222P952332P152933O766817N481975M460362
16706B08445965K757450J306412N6447j912081l053528m662403n722595p017187
$$ plain form
16698 190198480 182621626 174300988 165932710 157280366 148381902 140053828 131747427 123687080
16690 123687080 116236525 109295272 101947710 95593017 89283301 83770576 78458723 73918403
16682 73918403 69078939 64682707 60618168 57432106 54229639 51099520 48179654 45517929
16674 45517929 42843711 40811506 38417090 36718038 34759673 33372405 31571257 29959703
16666 29959703 28593956 27236096 26016144 24905678 24144682 22644998 22053152 20915561
16658 20915561 20091682 19568980 18652591 18112397 17469893 16728900 16227375 15460584 14770485
16649 14770485 14341407 13962793 13026320 13104301 12652358 12330094 11921500 11191519 10962059
16640 10962059 10564925 10284369 9641582 9749395 9495471 9045359 8800994 8752983 8552981
$$ packed form
16698A90198480p576854q320638q368278q652344q898464q328074q306401q060347
16690A23687080p450555o941253p347562o354693o309716n512725n311853m540320
16682G3918403m839464m396232m064539l186062l202467l130119k919866k661725
16674D5517929k674218k032205k394416j699052j958365j387268j801148j611554
16666B9959703j365747j357860j219952j110466p60996j499684n91846j137591
16658B0915561q23879n22702r16389n40194o42504p40993n01525p66791o90099
16649A4770485m29078l78614r36473P7981m51943l22264m08594p29981k29460
16640A0962059l97134k80556o42787J07813k53924m50112k44365m8011k00002
$$ plain form
16631 8552981 7853406 7800530 7258678 7553110 7302998 7253423 6688805 6874054 6689009 6283048
16621 6283048 5997644 6130463 5979151 5854605 5746195 5700132 5523511 5343106 5158208 5049084
16611 5049084 4990799 4829632 4805478 4654465 4511129 4426887 4464073 4161651 3962329 3857816
16601 3857816 4031028 3821506 3846303 3533537 3976172 3509123 3619141 3591588 3445098 3318715
16591 3318715 3249918 3120477 3226862 3304629 2991602 2988033 3049922 2905495 2807165 2723603 3231492
16580 3231492 2933345 2864704 2566389 2809699 2332993 2258858 2520266 2352705 2382831 2310078
16570 2310078 2071480 2395046 1986911 2122800 2040041 2059970 2289410 2160644 1749242 2008955
16560 2008955 1729966 1817506 1678354 1926159 1484005 1925746 1738659 1524734 1883011 1482243
$$ packed form
16631H552981o99575n2876n41852K94432k50112m9575n64618J85249j85045m05961
16621F283048k85404J32819j51312j24546j08410m6063j76621j80405j84898j09124
16611E049084n8285j61167k4154j51013j43336q4242L7186l02422j99322j04513
16601C857816J73212k09522K4797l12766M42635m67049J10018k7553j46490j26383
16591C318715o8797j29441J06385P7767l13027l569O1889j44427r8330q3562N07889
16580C231492k98147o8641k98315K43310m76706p4135K61408j67561L0126p2753
16570B310078k38598L23566m08135J35889q2759J9929K29440j28766m11402K59713
16560B008955k78989Q7540j39152K47805m42154M41741j87087k13925L58277m00768
$$ plain form
16550 1482243 2164156 1665108 1546050 1732482 1617754 1843377 1446103 1767533 1586407
16541 1586407 1359834 1639894 1398952 1593729 1516278 1292423 1468164 1329873 1567645 1180557
16531 1180557 1205820 1343115 1334892 1425660 1015952 1572018 1490608 1081452 1236935 1493374
16521 1493374 1164158 1040726 1213364 946540 1065163 1029270 956510 1187983 1160138 1212521
16511 1212521 487495 843567 1173789 1047296 1311085 786292 917284 746885 1100769
16502 1100769 976822 869432 1073329 734108 776830 708478 794827 845567 719254 734648
16492 734648 914309 922332 969168 929501 392944 913513 684102 814991 816821 745004 593372
16481 593372 744579 696206 660818 597829 878219 581989 882105 589102 392499 564716
$$ packed form
16550A482243O81913m99048j19058J86432j14728K25623l97274L21430j81126
16541A586407k26573K80060k40942J94777p7451k23855J75741j38291K37772l87088
16531A180557K5263J37295q223R0768m09708N56066q1410m09156J55483K56439
16521A493374l29216j23432J72638k66824J18623l5893p2760K31473k7845N2383
16511A212521D87495L56072L30222j26493K63789n24793J30992j70399L53884
16502A100769j23947j07390K03897l39221M2722o8352Q6349N0740j26313J5394
16492G34648J79661Q023M6836l9667C92944N20569k29411J30889J830p1817j51632
16481E93372J51207m8373l5388o2989K80390k96230L00116k93003j96603J72217
$$ plain form
16471 564716 557048 592834 948579 805491 688963 644749 609409 692565 537232 542855 415503
16460 415503 503695 653340 1028573 522459 771694 447770 442306 1026044 581019 455690
16450 455690 475139 277120 540121 588171 135522 437697 525833 628768 540081 407467
16440 407467 462331 401861 418479 189548 502333 615223 576289 327980 349289 656023
16430 656023 392216 295093 63539 200466 535896 422843 476611 592730 480666 496647
16420 496647 564158 284030 528067 407881 391311 318270 629989 177853 167190 399695
16410 399695 403924 437432 460438 315042 194963 476852 436434 381844 326885 197633 404267
16399 404267 420484 99171 42800 438834 468684 316106 -32180 232494 395003 283467
$$ packed form
16471E64716p668L5786L55745j43088j16528m4214l5340Q3156j55333N623j27352
16460D15503Q8192J49645L75233n06114K49235l23924n464N83738m45025j25329
16450D55690J9449j98019K63001M8050A35522L02175Q8136J02935q8687j32614
16440D07467N4864o0470J6618A89548L12785J12890l8934k48309K1309L06734
16430F56023k63807r7123F3539J36927L35430j13053N3768J16119j12064J5981
16420D96647O7511k80128K44037j20186j6570p3041L11719A77853j0663K32505
16410C99695M229L3508K3006j45396j20079K81889m0418n4590n4959j29252K06634
16399D04267J6217I9171D2800L96034K9850j52578c2180B32494J62509j11536
$$ plain form
16389 283467 291905 489223 375724 327762 197411 358403 147513 485089 279718 158139
16379 158139 421848 353542 151270 450983 196744 67999 463478 445063 519354 324547
16369 324547 244303 289029 410432 328215 585024 -143192 611739 189720 -9858 223156
16358 -6514 213919 229731 346000 194204 332847 -1334 36102 477713 528535 368006 102033
16346 194435 305432 529798 138325 135146 28079 199823 99217 215860 371655 181655
16335 113273 583 217737 -247076 29821 617 278314 304493 -6090 288232 94031 -34793 292441
16322 -78566 -222007 475357 134728 -23085 373120 -8947 340419 225963 -119186 305633
16311 -2045 443884 -66986 135135 23367 191462 254530 185953 -79449 -85456 212580 -27174
$$ packed form
16389B83467Q438J97318j13499m7962j30351J60992A47513L37576k05371j21579
16379A58139K63709o8306A51270K99713A96744F7999L95479j8415P4291j94807
16369C24547q0244M4726J21403q2217K56809a43192F11739A89720i858B23156
16358f514B13919J5812J16269j51796J38643a334C6102M41611N0822j60529A02033
16346A94435J10997K24366A38325l179B8079J71744I9217J16643J55795A81655
16335A13273E83K17154b47076B9821F17K77697K6179f090B88232I4031c4793B92441
16322g8566j43441D75357A34728b3085C73120h947C40419j14456a19186C05633
16311b045D43884f6986A35135B3367J68095O3068o8577g9449o007B12580b7174
$$ plain form
16299 -38442 102332 348056 366582 149401 310160 79605 -31924 151058 -215440 186250
16288 396854 -31821 -93707 103975 -26455 -86706 188590 347158 6838 479916 -13857 -154416
16277 -154416 43916 109148 348308 141042 392780 115987 317922 351610 78148 254838
16267 254838 -2933 36306 113835 277360 211903 365465 205203 136935 29708 236630 252934
16256 252934 290059 -30854 64184 186627 107455 448954 -34520 103006 -48957 256165 127474
16244 197372 -212866 135991 95670 107903 -1267 -123630 -219925 278122 50359 -74007 202065
16232 120689 -24443 28812 -62682 15583 219803 366216 244133 -168243 -6698 -352246 -130154
16220 136873 104548 -238302 88196 -170615 -222278 73167 332076 357651 149849 139321 154694
$$ packed form
16299c8442A02332K45724J8526A49401J60759G9605c1924A51058b15440A86250
16288C96854c1821o1886A03975b6455o0251A88590J58568F838M73078a3857j40559
16277a54416D3916O5232K39160A41042K51738A15987K01935L3688G8148J76690
16267B54838b933C6306P7529J63525o5457J53562j60262o8268B9708K06922J6304
16256B52934L7125c0854F4184J22443p9172L41499c4520A03006d8957B56165A27474
16244A97372b12866A35991m0321J2233a267j22363r6295B78122E0359g4007B02065
16232A20689b4443B8812f2682A5583K04220J46413j22083a68243f698l45548a30154
16220A36873l2325b38302H8196a70615n1663G3167K58909K5575A49849j0528J5373
$$ plain form
16209 154694 46344 -182169 266616 -37999 -120415 171060 28421 162640 207216 79405 77871
16198 77871 17802 121298 -18919 158939 -111133 -255198 -46064 -61168 -96734 46768 282575
16187 282575 271740 42755 98525 202238 -57905 -222804 -246253 185266 253054 -159824 -72841
16175 31421 -187120 -60963 -19035 198332 -263565 449100 96219 -152318 120951 -98040
16164 -67864 -2789 -13906 92699 160815 -11905 -134470 304791 248730 -91565 -74921 -92973
16153 -92973 369893 -1990 139385 289042 128526 18273 159838 171628 98452 83363 -235344
16141 -200713 354836 -56791 261887 -277652 63757 65451 -82242 157823 -130468 159605
16130 39196 -33239 -22061 1759 87148 -22066 179625 -16266 -236803 37768 250556 -127380
$$ packed form
16209A54694D6344a82169B66616c7999q2416A71060B8421J34219M4576G9405j534
16198G7871A7802J03496a8919A58939a11133j44065d6064j5104l5566D6768K35807
16187B82575j0835D2755N5770J03713e7905j64899k3449A85266O7788a59824g2841
16175C1421a87120f0963a9035A98332b63565D49100I6219a52318A20951i8040
16164f7864b789j1117I2699O8116a1905j22565C04791n6061i1565J6644j8052
16153i2973C69893a990A39385J49657A28526A8273J41565J1790p3176j5089b35344
16141b00713C54836e6791B61887b77652F3757J694h2242A57823a30468A59605
16130C9196c3239J1178A759Q5389b2066A79625a6266k20537C7768K12788a27380
$$ plain form
16118 28122 -174163 306941 78632 60027 -167006 251030 -54146 -122546 25632 335385 -117963
16106 -280941 183080 -270258 167834 -25810 -169919 236135 -198576 227128 -202554 -196156
16096 -196156 235677 -162874 -327522 -118899 57090 110741 -10564 -346193 32204 136613
16086 136613 110975 237765 6391 -134344 174411 -153466 -42561 -153848 -113930 815 -71763
16074 122157 -131835 -5477 -155928 -113508 -55526 382171 -99177 -120553 -89664 -42032 -252814
16063 -252814 129533 -83975 30513 218656 -179911 337983 -222559 121141 -457325 -32541
16052 146910 -85320 -4816 -111821 -94070 -39899 77281 212702 -304288 405441 -75607 56943
16040 -129507 -107337 -40593 -95221 -33670 -23687 -302402 -67853 -111871 134352 163563 119767
$$ packed form
16118B8122a74163C06941G8632j8605a67006B51030e4146o8400B5632L09753a17963
16106b80941A83080b70258A67834b5810j44109B36135a98576B27128b02554O398
16096a96156B35677a62874j64648a18899E7090N3651a0564l35629C2204J04409
16086A36613k5638J26790F391a34344A74411a53466d2561j11287L9918H15g1763
16074A22157a31835e477j50451M2420e5526C82171i9177k1376L0889d2032k10782
16063b52814A29533h3975C0513J88143a79911C37983b22559A21141d57325c2541
16052A46910h5320d816j07005J7751c9899G7281J35421c04288D05441g5607E6943
16040a29507K2170d0593n4628c3670R983k78715f7853m4018A34352K9211m3796
$$ plain form
16029 119767 -139494 -53509 3946 -7482 148536 34994 198386 -26167 -7592 64509 -188488
16017 -137503 117963 34895 -345516 19364 381902 -99571 -42155 -166472 -449848 106512
16006 -110172 -30482 45389 239287 106732 -28743 -247912 -19540 -234492 -187151 -321119
15996 -321119 58638 50807 -144342 109914 284357 -70907 -285523 269367 280558 -300343
15985 -117694 -238756 -70212 -377896 42234 145562 -182677 316973 -75690 268300 81177
15974 -94617 -186204 -25237 -240160 222544 -68501 46514 36791 423215 13701 15589 121131
15963 121131 298283 -18674 -223377 214754 167796 -107387 210727 288735 116196 -139697
15952 -5120 89615 -26532 227982 -93509 280780 119458 175787 -321515 19908 -274423 -347647
$$ packed form
16029A19767a39494e3509C946g482A48536C4994J63392b6167g592F4509a88488
16017a37503A17963C4895c45516A9364L62538i9571d2155j24317k83376A06512
16006a10172c0482D5389J93898A06732b8743k19169a9540k14952M7341j33968
15996c21119E8638p831a44342A09914J74443g0907k14616B69367J1191c00343
15985a17694j21062g0212l07684D2234J03328a82677C16973g5690B68300H1177
15974i4617r1587b5237k14923B22544f8501D6514r723L86424A3701J888J05542
15963A21131J77152a8674k04703B14754m6958a07387B10727P8008A16196a39697
15952e120H9615b6532B27982i3509B80780A19458N6329c21515A9908b74423p3224
$$ plain form
15941 -347647 61736 111866 -113595 -47977 -51487 -146308 -28264 -283262 150417 -189055 -47718
15929 -199227 175800 -129560 -334464 -100224 167343 103246 -413248 88125 119948 50721
15918 -90143 -166029 -119575 -132665 48638 -37805 156427 88763 -175383 -91458 -121781 -59073
15906 -17164 -229606 94573 -19706 -352986 119841 -24941 23724 -63614 175423 93755 -83587
15894 -129331 -218157 74712 -53265 -163778 295930 -264860 56612 -350333 169050 -161921
15883 -248988 -139064 -258473 12932 6111 15564 72161 119568 -51946 -239714 160181 6918
15871 -48529 -77360 -59458 28696 5914 -9841 357842 54904 56055 179358 -158486 -165357 -310971
15859 -310971 -223855 -51118 87884 53714 -52403 -143074 -18344 -68522 -289922 -23800 410238
$$ packed form
15941c47647F1736N0130a13595d7977l510r4821b8264k54998A50417a89055d7718
15929a99227A75800a29560k04904a00224A67343o4097d13248H8125L1823E0721
15918i0143p5886M6454j3090D8638c7805A56427o7664a75383Q3925l0323e9073
15906a7164k12442I4573a9706l33280A19841b4941B3724f3614A75423q1668h3587
15894a29331q8826G4712e3265j10513B95930b64860E6612c50333A69050a61921
15883b48988J09924j19409A2932F111R453N6597M7407e1946j87768A60181F918
15871d8529k8831J7902B8696E914i841C57842E4904J151J23303a58486o871j45614
15859c10971Q7116e1118H7884l4170e2403r0671a8344n0178k21400b3800D10238
$$ plain form
15847 -61970 121416 -208036 -377565 -372671 -232407 85882 240021 -203789 -105560 -8080 -45469
15836 -45469 -189150 -332086 96752 314184 -63858 -166698 -222869 -71255 169418 -17376 -243334
15825 -243334 -22732 -291005 -248018 245362 -326409 12743 91370 24024 -148967 -45910 -174218
15814 -174218 6904 -140770 11353 -124422 -222707 -90782 -89847 -139432 282435 210751 -93124
15802 -206718 -125475 -37359 75564 141318 -29867 -298924 -93313 -231596 15506 -79894 -46165
15791 -46165 -67610 -84652 -124251 26315 89057 -46368 136853 -78784 43064 -61561 -407917
15780 -407917 -62450 -268196 34140 122917 -160617 -98723 -72154 -70181 59661 84740 21627
15768 156577 -201880 -114477 -81402 -69978 -34442 -190515 193318 150379 77686 22025 -94985
$$ packed form
15847f1970A21416b08036j69529M894J40264H5882J54139b03789R8229h080l7389
15836d5469j43681j42936I6752K17432f3858j02840n6171g1255A69418a7376k25958
15825b43334b2732k68273M2987B45362c26409A2743P8627B4024a48967d5910j28308
15814a74218F904a40770A1353a24422r8285i0782R35m9585B82435p1684i3124
15802b06718Q1243c7359G5564O5754b9867k69057i3313j38283A5506g9894L3729
15791d6165k1445j7042l9599B6315O2742d6368A36853g8784D3064f1561l46356
15780d07917f2450k05746C4140Q8777a60617O1894K6569J973E9661K5079B1627
15768A56577b01880Q7403L3075J1424c4442j56073A93318m2939p2693B2025i4985
$$ plain form
15756 -133514 19574 19644 -19098 97448 129074 -187386 -369938 185926 -134640 112161 207873
15745 207873 -184745 -61108 235436 304906 -117519 89299 19449 139307 -68557 -85249 -74593
15734 -74593 -245520 214105 70945 -133050 -30955 197380 239053 -314935 178642 91523
15724 91523 234357 -9476 38991 201725 63716 143702 -569 -310326 -192085 -183572 -83417 70056
15711 -123938 -300378 -66592 7076 31156 -17407 -164310 -178736 -58034 102885 254641 -278377
15699 -13700 -46891 -206258 -99472 242624 232586 -67855 -71760 -138161 18263 174107 -326570
15687 116762 -133365 -233345 24660 -129386 -26124 93029 -229599 -86833 88260 13192 125718
15676 125718 73303 -148676 -48402 200368 -169268 -132927 -164639 -165264 164291 45417 50010
$$ packed form
15756a33514A9574P0a9098I7448L1626a87386j82552A85926a34640A12161R5712
15745B07873a84745f1108B35436O9470a17519H9299A9449J19858f8557j6692J0656
15734g4593j70927B14105G0945a33050c0955A97380M1673c14935A78642q7119
15724I1523J42834i476C8991J62734F3716P9986e69l09757J18241Q513h3417G0056
15711a23938j76440f6592G076K4080a7407j46903j4426e8034A02885J51756b78377
15699a3700l3191j59367i9472B42624j0038f7855l905o6401A8263J55844c26570
15687A16762a33365r9980B4660a29386b6124I3029b29599h6833H8260A3192J12526
15676A25718n2415a48676d8402B00368a69268L6341l1712o25A64291D5417M593
$$ plain form
15665 50010 4214 -30945 1019 -130515 -318185 27829 -95185 48548 -80878 -125546 -128276 -72188
15653 -72188 -151009 -8828 -252745 -20038 12915 -61938 -176788 60837 -60838 -235422 -41164
15641 -10773 -239356 -46540 181608 -21162 -315941 -45385 -91765 -35273 -118056 72403 -102421
15629 265157 -95578 69050 42616 -79969 103877 -215915 9374 16373 -8087 -322637 137088
15617 -108374 -209338 75973 -52412 162996 125737 3520 241017 256856 388027 -108257 119603
15605 -9644 338868 190559 36601 -114721 -49506 28783 -21224 78001 -214009 -21858 -133700
15594 -133700 -570030 -103184 -119519 -177177 56440 -45675 12531 -16744 135841 -23859 -30282
15583 -30282 -95434 17124 44933 -52577 -74504 182217 -175681 5557 343241 196912 -344639
$$ packed form
15665E0010D214c0945A019a30515j87670B7829i5185D8548h0878m4668k730N6088
15653g2188p8821h828k43917b0038A2915f1938j14850F0837f0838j74584d1164
15641a0773k28583d6540A81608b1162k94779d5385m6380c5273q2783G2403a02421
15629B65157i5578F9050k6434g9969A03877b15915I374O999h087l14550A37088
15617a08374j00964G5973e2412A62996l7259C520K37497J5839J31171a08257A19603
15605i644C38868j48309C6601a14721d9506B8783b1224G8001b14009b1858j11842
15594a33700m36330a03184j6335n7658E6440d5675A2531a6744A35841b3859o423
15583c0282o5152A7124K7809e2577k1927A82217a75681E557L37684j46329c44639
$$ plain form
15571 272025 -180539 61413 110706 -85135 95378 25735 -110639 -41604 152937 2316 6904
15560 6904 -4156 31525 -312964 -170781 64038 75427 179421 88284 127701 -108580 163469
15548 32200 -75454 -56426 37599 146277 -47903 -155528 -224903 -272179 -104437 41896 95883
15537 95883 59229 -204954 38629 -23085 -58640 422718 134211 -10405 -38295 -16309 22125
15525 -242072 66489 -89164 146369 167043 -45646 -9029 121439 315392 -78166 -280279 -156336
15514 -156336 42247 -111169 33516 -342823 -162576 78364 30545 186299 -34969 -38069 -5005
15502 71751 91028 170900 -62898 -256574 -85858 173147 61358 263350 -230836 -80768 17484
15490 454059 -89467 -247487 191719 29553 -148274 -128488 94954 68957 235812 -174094
$$ packed form
15571B72025a80539F1413M9293h5135I5378B5735a10639d1604A52937B316M588
15560F904d156C1525c12964J42183F4038J1389J03994H8284L9417a08580A63469
15548C2200g5454J9028C7599J08678d7903j07625o9375m7276a04437D1896N3987
15537I5883l6654b04954C8629b3085l5555D22718A34211a0405k7890a6309B2125
15525b42072F6489h9164A46369K0674d5646i029A21439J93953g8166k02113J23943
15514a56336D2247a11169C3516c42823a62576G8364C0545J55754c4969l100e005
15502G1751J9277P9872f2898j93676h5858A73147F1358K01992b30836h0768A7484
15490D54059h9467j58020A91719B9553a48274J9786I4954k5997J66855a74094
$$ plain form
15479 -117591 -322440 -249156 -190917 193347 -134626 -180623 -43210 134393 -180341 125435
15468 3964 -49907 124715 -110260 235135 85895 -78893 68068 69967 11701 -262205 -27781
15456 -164859 -37160 -298094 -206551 -25772 254051 -121194 36631 111771 -15488 -155668 209634
15444 -88165 114487 -79943 95950 208399 239976 70907 -35559 -173571 186132 35819 -145847
15432 -65603 194756 188356 -78527 4712 -314228 61567 -92661 -20176 -150311 164661 321855
15421 321855 -479798 -195967 -207667 204547 -88146 166744 193002 -115996 70959 96208
15411 96208 66625 123453 -81461 -59361 78076 283291 -17067 -206716 -142740 -390932 120602
15399 412021 -187774 -175066 144499 -33341 199824 255903 -114142 2821 -2756 -28547 -84395
$$ packed form
15479a17591k04849P3284N8239A93347a34626m5997d3210A34393a80341A25435
15468C964d9907A24715a10260B35135H5895g8893F8068J899A1701b62205b7781
15456a64859c7160k60934R1543b5772B54051a21194C6631P5140a5488j40180B09634
15444h8165A14487g9943I5950J12449L1577G0907c5559j38012A86132C5819a45847
15432f5603A94756o400g8527D712c14228F1567i2661b0176j30135A64661J57194
15421C21855d79798a95967j1700B04547h8146A66744K6258a15996G0959K5249
15411I6208k9583N6828h1461K2100G8076K05215a7067j89649O3976k48192A20602
15399D12021a87774J2708A44499c3341A99824N6079a14142B821b756k5791n5848
$$ plain form
15388 -84395 -380805 -334824 -36493 88411 -79293 -277800 -235051 -131289 5025 -26228 34017
15376 -93639 39615 -185931 -16790 44186 124442 57375 -5524 76659 -154476 480825 27243
15364 -418786 -168620 94922 -61843 -26432 -83471 73191 209392 -23568 60748 128477 -6458
15352 -203623 8851 -12772 -14906 63857 124305 -122827 -247222 34650 14013 3475 -321598
15340 -222854 -267031 67144 100346 -21490 -131306 -150724 -277663 -155468 90969 110724 -149244
15328 32909 111793 63519 -57609 428333 160138 -18351 236339 329569 -58166 -166276 -3032
15316 151135 -88591 150032 -151481 30593 15089 313055 48211 156581 -219349 177543
15305 -18988 89119 -100665 146188 -144299 -136579 -201160 -2019 -6993 38087 305612 -194226
$$ packed form
15388h4395k96410M5981c6493H8411g9293j98507M2749J03762E025b6228C4017
15376i3639C9615a85931a6790D4186Q0256E7375e524G6659a54476D80825B7243
15364d18786a68620I4922f1843b6432n7039G3191J36201b3568F0748O7729f458
15352b03623H851a2772k134F3857O0448a22827j24395C4650A4013C475c21598
15340b22854m4177F7144L3202b1490j09816j9418j26939J22195I0969J9755a49244
15328C2909P8884m8274e7609D28333A60138a8351B36339R3230e8166j08110c032
15316A51135h8591A50032a51481C0593A5089K97966D8211J08370b19349A77543
15305a8988H9119a00665A46188a44299P720o4581b019m974C8087K67525a94226
$$ plain form
15293 342520 297288 428532 214142 -67333 48521 -187186 -193903 19416 -158126 -305183 -2886
15281 -163038 395021 -120696 31392 -86725 -19566 115772 7886 93384 -77353 5979 -382840
15269 155006 -12744 -148588 -192753 -289762 -99397 -4086 47926 -37605 128286 -67387 191259
15257 352803 -98463 522400 -322254 395311 72687 -155914 92481 2149 112338 11640 8525
15246 8525 148702 341788 477449 53116 295095 194777 -15680 168747 22735 463356
15236 463356 234447 973194 867245 1162168 1459333 1413435 1364072 919932 410697 116062
15225 288985 352776 -82532 -12307 223533 256509 -25960 -95080 147073 -238692 213829 240365
15214 240365 322189 258044 256795 -88068 341457 6356 137381 251078 32111 116512 -5094
$$ packed form
15293C42520m5232J31244B14142f7333D8521a87186o717A9416a58126j47057b886
15281a63038C95021a20696C1392h6725a9566A15772G886Q5498g7353E979c82840
15269A55006a2744j35844m4165r7009i9397d086D7926c7605A28286f7387A91259
15257C52803i8463E22400c22254C95311G2687a55914I2481B149J10189A1640l115
15246H525J40177J93086J35661E3116K41979j00318a5680A68747B2735M40621
15236D63356k28909P38747j05949K94923K97165m5898m9363m44140D10697A16062
15225B88985O3791h2532a2307B23533L2976b5960o9120A47073b38692B13829K6536
15214B40365Q1824o4145j249h8068C41457F356J31025J13697C2111Q4401e094
$$ plain form
15202 449380 49822 152487 120680 -51216 -15791 -42005 55302 367916 -19282 -137574 139570
15190 5376 109656 78934 -224079 56105 97453 -53433 132754 79829 156200 136297 -1363
15178 13510 148709 52771 -55002 -165174 331934 223456 56290 37955 -281738 -105366
15167 165253 -92806 -116662 232143 413634 360607 11457 -163905 -74533 -109436 -154834 33858
15155 -134135 -471043 133236 -418546 338899 -63056 247763 160933 228484 -363177 71459
15144 360707 -81668 169755 269645 74985 16914 -24540 128522 -7866 -1949 -9273 598 103298
15132 103298 14419 -204392 121187 24634 -99909 41129 93596 297036 -22347 -21027 33837
15120 -28559 72925 -84780 269922 368511 -102529 382396 91656 14139 201501 -57388 153982
$$ packed form
15202D49380D9822J02665l1807e1216a5791k6214E5302L12614a9282j18292A39570
15190E376J04280l0722b24079E6105M1348e3433A32754n2925P6371j9903a363
15178A3510J35199E2771e5002j10172C31934j08478E6290j8335b81738a05366
15167A65253i2806k3856B32143J81491n3027A1457a63905g4533l4903m5398C3858
15155a34135l36908A33236d18546C38899f3056B47763q6830O7551c63177G1459
15144C60707h1668A69755R9890G4985A6914b4540A28522g866a949p324E98J02700
15132A03298A4419b04392A21187B4634i9909D1129N2467K03440b2347J320C3837
15120b8559G2925h4780B69922R8589a02529C82396I1656A4139J87362e7388A53982
$$ plain form
15108 260365 -197074 200618 168712 105982 54151 910 121781 406504 -254355 -17197 -3255
15096 -150395 -33298 354208 30013 -47239 240102 371501 314738 268467 167502 -3384 322968
15084 253575 29970 364666 -211313 -103396 17758 177803 -110244 16643 31552 145622
15074 145622 250478 276648 73352 172084 149854 -87459 198477 269688 246238 90565 396332
15063 396332 33083 402773 -5476 2773 283178 -62675 124768 123655 169750 32018 -192560
15051 17366 105719 297345 229482 -102460 194773 331305 15049 -218226 540558 393972
15041 393972 347248 125410 234590 74978 422531 447951 208349 222438 310609 -53361 259654
15029 326064 235385 231740 142830 179357 279530 341422 348709 -26723 221175 452086 312085
$$ packed form
15108B60365a97074B00618l1906o2730n1831I10J20871K84723b54355a7197c255
15096a50395c3298C54208C0013d7239B40102J31399n6763m6271j00965c384C22968
15084B53575B9970L34696b11313a03396A7758J60045a10244A6643J4909J14070
15074A45622J04856K6170G3352R8732k2230h7459A98477P1211k3450I0565L05767
15063C96332C3083L69690e476B773K80405f2675A24768j113M6095C2018a92560
15051A7366Q8353J91626o7863a02460A94773J36532A5049b18226E40558j46586
15041C93972m6724A25410J09180G4978L47553K5420B08349J4089Q8171e3361B59654
15029C26064r0679l645q8910L6527J00173O1892P287b6723B21175K30911j40001
$$ plain form
15018 312085 62180 212816 118710 -30757 375214 186931 391496 215856 313279 41670
15007 -113207 281216 71245 190784 100164 7061 290882 119679 53679 238930 171139 8373
14995 -28127 403181 361771 474971 146350 -132929 5778 80964 369028 169170 282174
14985 282174 -78571 211961 48484 115067 126764 121065 170295 114970 351453 436037 435006
14974 435006 235072 134836 57076 -59949 574775 -18426 137219 76414 66739 -100830 116029
14962 311661 240881 188137 181504 315947 401891 128811 152037 150675 98886 341774 143088
14950 413159 225256 456751 131129 275518 171525 161720 181373 470829 327157 438175
14940 438175 293110 518494 504253 127016 187506 556676 321124 313626 107780 498694
$$ packed form
15018C12085F2180J50636r4106c0757C75214A86931K04565j75640R7423D1670
15007a13207B81216G1245J19539r0620G061K83821A19679E3679J85251o7791H373
14995b8127D03181m1410J13200A46350a32929E778P5186K88064A69170J13004
14985B82174g8571B11961D8484O6583J1697n699M9230n5325K36483Q4584j031
14974D35006j99934j00236E7076e9949E74775a8426A37219o0805r675a00830A16029
14962C11661p0780n2744o633J34443Q5944A28811K3226j362n1789K42888A43088
14950D13159j87903K31495A31129J44389j03993r805J9653K89456j43672J11018
14940D38175j45065K25384j4241A27016O0490L69170k35552p498A07780L90914
$$ plain form
14930 498694 432709 566810 461530 404651 295183 287948 397524 296426 231466 269231 199922
14919 199922 247955 221542 264073 508911 424464 216207 495156 181150 304642 152369
14909 152369 344233 341822 297061 489864 274912 446049 297273 251988 518390 131508
14898 191761 -74037 285334 337120 291714 197821 -64183 298079 378475 510028 481503 233928
14886 87704 449587 291114 520290 249770 404890 625847 384879 525028 291821 546566
14876 546566 344844 363773 563391 515399 587304 373060 285023 413012 245395 111037
14865 246231 66024 231456 553289 254838 282815 243079 501590 471659 397328 194011
14854 889990 465163 618900 234002 471522 472190 355171 572900 543350 154189 363127
$$ packed form
14930D98694o5985J34101j05280n6879j09468p235J09576j01098o4960L7765o9309
14919A99922M8033k6413M2531K44838q4447k08257K78949A81150J23492j52273
14909A52369J91864k411m4761J92803k14952J71137j48776m5285K66402A31508
14898A91761g4037B85334N1786m5406r3893f4183B98079Q0396J31553k8525B33928
14886H7704L61883j58473K29176B49770J55120K20957k40968J40149k33207K54745
14876E46566k01722J8929J99618m7992P1905k14244q8037J27989j67617A11037
14865B46231F6024J65432L21833B54838K7977l9736K58511k9931p4331A94011
14854H89990m24827J53737B34002K37520O68j17019K17729k9550A54189K08938
$$ plain form
14844 363127 370893 270874 356095 514219 478061 602711 210719 530096 695946 468523
14834 468523 437287 318379 459962 452668 188744 300579 518415 437590 433300 730316 614500
14823 614500 582914 491712 371295 446401 303411 241619 456614 479825 369359 479912
14813 479912 457616 550215 332688 428213 490989 134469 595958 472128 565481 443455
14803 443455 437552 363517 224534 335027 575032 364247 635831 427617 674441 664692
14793 664692 481886 1104019 373708 648685 343951 532665 421242 663903 566288 278609
14782 397081 612637 442360 572018 400349 738514 304209 863744 581468 337819 744687
14772 744687 977879 567794 978792 675802 483643 747360 353994 368951 407995 536634
$$ packed form
14844C63127P766j00019Q5221J58124l6158J24650B10719L19377J65850k27423
14834D68523l1236j18908J41583p294A88744J11835K17836q0825m290K97016j15816
14823F14500l1586r1202j20417P5106j42990o1792K14995K3211j10466J10553
14813D79912k2296R2599k17527R5525O2776A34469M61489j23830R3353j22026
14803D43455n903p4035j38983J10493K40005k10785K71584k08214K46824r749
14793F64692j82806O22133C73708K74977l04734J88714j11423K42661r7615B78609
14782C97081K15556j70277J29658j71669L38165C04209N59535k82276k43649M06868
14772G44687K33192m10085M10998l02990j92159K63717C53994J4957L9044J28639
$$ plain form
14762 536634 669258 853932 586440 602745 313934 606147 563101 701852 628700 615904
14752 615904 697227 888453 703782 910440 583473 400236 415628 611400 511714 372252
14742 372252 451966 493463 507823 424788 699323 519964 771114 549213 660185 766467
14732 766467 546489 912899 420153 763775 712018 524597 673428 642164 859182 739914
14722 739914 808149 915780 944985 355486 865694 874599 905235 691786 937885 731607
14712 731607 495373 798128 1065498 907426 1097251 918780 699203 739787 994039 802328
14702 802328 906916 887831 777839 881006 682124 914798 709712 1049119 1176972 562458
14691 707212 1073088 715007 1023805 911313 733463 760678 1045548 917410 1082442 968625
$$ packed form
14762E36634J32624J84674k67492J6305k88811K92213m3046J38751p3152j2796
14752F15904Q1323J91226j84671K06658l26967j83237J5392J95772r9686j39462
14742C72252P9714M1497J4360q3035K74535j79359K51150k21901J10972J06282
14732G66467k19978L66410D20153L43622n1757j87421J48831l1264K17018j19268
14722G39914O8235J07631K9205C55486N10208Q905L0636k13449K46099k06278
14712G31607k36234L02755K67370j58072J89825j78471k19577M0584K54252j91711
14702H02328J04588j9085j09992J03167j98882K32674k05086L39407J27853E62458
14691G07212L65876l58081L08798j12492j77850K7215K84870j28138J65032j13817
$$ plain form
14681 968625 987188 873762 576301 970327 946686 1078219 931680 731481 1039311 906033
14671 906033 999014 827548 475322 793378 947205 1150896 1103440 665803 902333 1082556
14661 1082556 1170134 1028560 1152669 1235226 1158086 1101630 1127139 764999 1046769 955536
14651 955536 1159273 902061 929432 1167378 1099140 1096170 1022872 1028638 1400392 1008324 1340309
14640 1340309 882557 976405 1259151 997945 1131060 1120570 1134746 1311370 1354655 1498683
14630 1498683 1236759 1226225 1398940 1102232 1657102 992181 1400626 1106459 1325024 1361781
14620 1361781 1279019 1099283 1112771 1473711 1671929 1495331 1388773 1196007 1516905 1494802
14610 1494802 1587838 1424473 1606495 1665735 1307915 1577847 1563647 1564497 1877388 1786076 1469611
$$ packed form
14681I68625J8563j13426k97461L94026k3641J31533j46539k00199L07830j33278
14671I06033R2981j71466l52226L18056J53827K03691m7456m37637K36530J80223
14661A082556Q7578j41574J24109Q2557p7140n6456K5509l62140K81770r1233
14651I55536K03737k57212K7371K37946o8238k970p3298N766L71754l92068L31985
14640A340309m57752R3848K82746k61206J33115j0490J4176J76624M3285J44028
14630A498683k61924j0534J72715k96708N54870o64921M08445k94167K18565L6757
14620A361781q2762j79736J3488L60940J98218j76598j06558j92766L20898k2103
14610A494802R3036j63365J82022N9240l57820K69932j4200Q50L12891r1312l16465
$$ plain form
14599 1469611 1371982 1480949 1720400 1547602 1544240 1922870 1621749 1655707 1553030 1673178
14589 1673178 1841341 1830624 1371890 1567713 1731135 1814679 1469703 1701777 1824285 1924258
14579 1924258 2003988 1481073 1981778 1949186 1894089 1670452 2033780 1825823 1845951 1786279
14569 1786279 2226357 1914252 2058744 2139250 2143998 1802752 2059555 1930566 1946351 1828606
14559 1828606 2014130 2486145 2322523 2185548 2587446 2655025 2690013 2448187 2480213 2180891
14549 2180891 2669736 2659464 2855015 2791900 3048325 2800137 3422844 3282897 3713731 4168908
14539 4168908 4260681 4815169 5544720 6442514 8017294 10386342 14862938 21589396 31531208
14530 31531208 30819509 19641274 12137877 7897317 5655590 4143165 3531201 3047146
$$ packed form
14599A469611r7629J08967K39451j72798l362L78630l01121L3958j02677J20148
14589A673178J68163j0717m58734J95823J63422Q3544l44976K32074J22508R9973
14579A924258P9730n22915N00705l2592n5097k23637L63328k07957K0128n9672
14569A786279M40078l12105J44492Q0506M748l41246K56803j28989J5785j17745
14559A828606J85524M72015j63622j36975M01898O7579L4988k41826L2026k99322
14549B180891M88845j0272J95551o3115K56425k48188O22707j39947M30834M55177
14539D168908R1773N54488P29551Q97794J574780K369048M476596O726458R941812
14530C1531208p11699j1178235p503397m240560k241727j512425o11964m84055
$$ plain form
14522 3047146 2839470 2742621 2709020 2662136 2419414 2431907 2335519 2092974 2828818 2380471
14512 2380471 2525218 2448753 2331803 2445833 2640244 2395956 2389939 2610969 2443452 2510207
14502 2510207 2253544 2732707 2871305 2732860 2678254 2679399 3067596 2679821 2746025 2895811
14492 2895811 3584476 3181467 2894545 3023358 2978816 2920172 2979301 3284571 3392772 3261215
14482 3261215 3751215 3549663 3338207 3375946 3385116 3452390 3576502 3560330 3486518 4086850
14472 4086850 3722484 3737913 3906613 3723327 4141137 3977923 4274802 3900149 4145086 4461547
14462 4461547 4248901 4148941 4039877 4226663 4450620 4327498 4418522 4663444 4535094 4689008
14452 4689008 4676366 4969270 4825001 4389309 4887798 4823606 4895057 5034257 5179094 5276074
$$ packed form
14522C047146k07676r6849l3601m6884k42722J2493r6388k42545P35844m48347
14512B380471J44747p6465j16950J14030J94411k44288o017K21030j67517O6755
14502B510207k56663M79163J38598j38445n4606J145L88197l87775O6204J49786
14492B895811O88665m03009k86922J28813m4542n8644N9129L05270J08201j31557
14482C261215M90000k01552k11456L7739R170O7274J24112j6172p3812O00332
14472D086850l64366J5429J68700j83286M17810j63214K96879l74653K44937L16461
14462D461547k12646r9960j09064J86786K23957j23122R1024K44922j28350J53914
14452D689008j2642K92904j44269m35692M98489o4192P1451J39200J44837R6980
$$ plain form
14442 5276074 5065833 5291235 5342793 5412001 5025235 5607059 5694840 5590162 5846951 5914640
14432 5914640 6101651 6017124 5792691 6064264 6028600 6304480 6472987 6637492 6713179 6649882
14422 6649882 7113225 6817717 6485380 7159280 7008460 7288258 7039547 7695343 7515455
14413 7515455 7581839 7385553 7765296 8092623 7893431 8318858 8263898 8081870 8226424 8432959
14403 8432959 8651992 8759398 8924573 8728819 9277927 9064224 9226842 9311531 9698905 9524740
14393 9524740 9556568 9792462 10138861 10423546 10502987 10764834 10462815 11279804 11484786 11298000
14383 11298000 11825417 11955246 12226299 12037700 12018584 12652083 13001337 13025886 13213986 13495253
14373 13495253 13498861 13995644 14225725 14388553 14602184 14844894 15210158 15416815 16025706 15887831
$$ packed form
14442E276074k10241K25402N1558O9208l86766N81824Q7781j04678K56789O7689
14432E914640J87011q4527k24433K71573l5664K75880J68507J64505P5687o3297
14422F649882M63343k95508l32337O73900j50820K79798k48711O55796j79888
14413G515455O6384j96286L79743L27327j99192M25427n4960j82028J44554K06535
14403H432959K19033J07406J65175j95754N49108k13703J62618Q4689L87374j74165
14393I524740L1828K35894L46399K84685P9441K61847l02019Q16989K04982j86786
14383A1298000N27417J29829K71053j88599j9116O33499L49254K4549J88100K81267
14373A3495253L608M96783K30081J62828K13631K42710L65264K06657O08891j37875
$$ plain form
14363 15887831 16281654 16662427 16983143 17446936 17558078 17697820 18300423 18772821 18875438
14354 18875438 19510023 19928185 20483213 20775756 21100467 21536653 22076630 22623850 23001107
14345 23001107 23291717 24030477 24661872 25203536 26064240 26460042 27452448 28005359 28579855
14336 28579855 28892384 29706756 30423654 31561416 32546034 33024148 33513335 34894443 36007080
14327 36007080 36715661 37750878 38757779 39778302 41105251 42035861 43609005 44885924
14319 44885924 46293524 47126942 48784025 50784041 52230168 53963160 55559941 57874655
14311 57874655 59527698 61396161 63788988 65444321 68190886 70651077 73193247 75977531
14303 75977531 78583667 81838627 85052122 87834104 91691690 95175923 99036455 103102322
$$ packed form
14363A5887831L93823L80773L20716M63793J11142J39742O02603M72398J02617
14354A8875438O34585M18162N55028K92543L24711M36186N39977N47220L77257
14345B3001107K90610P38760O31395N41664Q60704L95802R92406N52911N74496
14336B8579855L12529Q14372P16898J137762R84618M78114M89187J381108J112637
14327C6007080P08581J035217J006901J020523J326949R30610J573144J276919
14319D4885924J407600Q33418J657083K000016J446127J732992J596781K314714
14311E7874655J653043J868463K392827J655333K746565K460191K542170K784284
14303G5977531K606136L254960L213495K781982L857586L484233L860532M065867
$$ plain form
14295 103102322 107509490 111927455 116555922 121977964 127325997 132714845 139010669 145369017
14287 145369017 151923333 159096290 166511949 174681085 182843908 192248243 201120179 211280624
14279 211280624 221805828 233105177 244501664 256377456 269428280 282785824 296480496
14272 296480496 310668818 325164303 339759353 354222013 368834315 382760781 395676769
14265 395676769 407769631 418974693 429945880 439432804 447853337 455669068 461344592
14258 461344592 463189317 462557651 462718259 462997170 459261931 450782974 442344985 434019661
14250 434019661 424583693 413326297 400772981 387701594 373833948 359479361 345525909
14243 345525909 331939214 318236633 304725315 290957169 278193172 265043087 252793219
$$ packed form
14295A03102322M407168M417965M628467N422042N348033N388848O295824O358348
14287A45369017O554316P172957P415659Q169136Q162823R404335Q871936J0160445
14279B11280624J0525204J1299349J1396487J1875792J3050824J3357544J3694672
14272B96480496J4188322J4495485J4595050J4462660J4612302J3926466J2915988
14265C95676769J2092862J1205062J0971187R486924Q420533P815731N675524
14258D61344592J844725o31666J60608K78911l735239q478957q437989q325324
14250D34019661r435968j1257396j2553316j3071387j3867646j4354587j3953452
14243C45525909j3586695j3702581j3511318j3768146j2763997j3150085j2249868
$$ plain form
14236 252793219 240516812 228869210 216962328 205695398 195429758 185159807 175983393
14229 175983393 167576662 159415893 152097670 144860443 138085840 131918028 126035838 120653122
14221 120653122 115504545 110225652 105823242 101411210 97362831 93613176 89884063 86282524
14213 86282524 83128135 79734162 76858974 74072151 71295580 68731396 66588334 64152598
14205 64152598 62116252 60052047 58278339 55845664 54467087 52364569 50892098 49745588
14197 49745588 48018572 46642549 45233067 44135082 42867037 41664314 40921206 39401573
14189 39401573 38214670 37176233 36365511 35694377 34564085 33454622 32964339 32071395 30846814
14180 30846814 30482018 29613224 28986323 28105788 27471358 26867431 25931130 25593007 24556622
$$ packed form
14236B52793219j2276407j1647602j1906882j1266930j0265640j0269951r176414
14229A75983393q406731q160769p318223p237227o774603o167812n882190n382716
14221A20653122n148577n278893m402410m412032m048379l749655l729113l601539
14213H6282524l154389l393973k875188k786823k776571k564184k143062k435736
14205F4152598k036346k064205j773708k432675j378577k102518j472471j146510
14197D9745588j727016j376023j409482j097985j268045j202723p43108j519633
14189C9401573j186903j038437q10722o71134j130292j109463m90283q92944j224581
14180C0846814l64796q68794o26901q80535o34430o03927r36301l38123j036385
$$ plain form
14171 24556622 24322749 23584668 23248403 22749563 22435295 21704069 21308133 20940850 20287918
14162 20287918 20316229 19605164 19273880 18884891 18876188 18270064 17573173 17513457 17193124 16569879
14152 16569879 16396264 16253474 16057993 15583473 15365594 14642562 14573838 14345894 14119952
14143 14119952 13726815 13559267 13482584 13129791 13095872 12993518 12708873 12321238 12205279 12200903
14133 12200903 12074405 11880515 11547757 11300703 11228640 10985168 10854400 10534463 10559484 10196485
14123 10196485 10175849 10204274 9657857 9594498 9619831 9236262 9405333 9319128 8815232 8881728
14113 8881728 8871704 8305022 8771332 8422713 8524414 8048084 8238130 8128611 7932699 7774411
14103 7774411 7802773 7472777 7597167 7555526 7136544 7076287 7375583 7214008 6971842 6983089
$$ packed form
14171B4556622k33873p38081l36265m98840l14268p31226l95936l67283o52932
14162B0287918K8311p11065l31284l88989q703o06124o96891n9716l20333o23245
14152A6569879j73615j42790j95481m74520k17879p23032o8724k27944k25942
14143A4119952l93137j67548p6683l52793l3919j02354k84645l87635j15959m376
14133A2200903j26498j93890l32758k47054p2063k43472j30768l19937K5021l62999
14123A0196485k0636K8425n46417o3359K5333l83569J69071q6205n03896O6496
14113H881728j0024n66682M66310l48619J01701m76330J90046j09519j95912j58288
14103G774411K8362l29996J24390m1641m18982o0257K99296j61575k42166J1247
$$ plain form
14093 6983089 6950783 6655619 6444473 6746847 6376894 6463389 6296986 6161837 6210312 6122263
14083 6122263 6278520 5728635 5609959 5439122 5547302 5524726 5596862 5457762 5508477 5556878
14073 5556878 5108420 5671130 5156568 5109780 4996502 5094505 5171407 4999109 4825243 5084457
14063 5084457 4764556 4940941 4784336 4474828 4412582 4721968 4574209 4395082 4648099 4741661
14053 4741661 4495108 4454347 4423010 4030016 4557634 4224754 4006988 4344587 3985096 4181576
14043 4181576 4041411 4028263 3714626 4132760 3979158 3388118 3903024 3679836 3909051 3730701
14033 3730701 3704110 3832370 3668018 3491576 3655455 3667302 3298514 3347759 3393575 3223199
14023 3223199 3288586 3191790 2946486 3156159 3244685 2885443 3321278 3150635 2687720 2961840
$$ packed form
14093F983089l2306k95164k11146L02374l69953Q6495j66403j35149M8475q8049
14083F122263J56257n49885j18676j70837J08180k2576P2136j39100N0715M8401
14073E556878m48458N62710n14562m6788j13278R8003P6902j72298j73866K59214
14063E084457l19901J76385j56605l09508o2246L09386j47759j79127K53017R3562
14053D741661k46553m0761l1337l92994N27618l32880k17766L37599l59491J96480
14043D181576j40165j3148l13637M18134j53602n91040N14906k23188K29215j78350
14033C730701k6591J28260j64352j76442J63879J1847l68788M9245M5816j70376
14023C223199O5387r6796k45304K09673Q8526l59242M35835j70643m62915K74120
$$ plain form
14013 2961840 2697315 3107598 3042208 2667647 2582881 3070524 3036576 2924294 3007074 3033529
14003 3033529 3063553 2744867 2780897 2476877 2703828 2618930 2661244 2278870 2267172 2679785
13993 2679785 2411920 2454644 2355231 2404939 2339356 2506561 2147069 2285170 2098062 2709813
13983 2709813 2580518 2445662 2224836 2484561 2798212 2899061 3604043 3401159 4484300
13974 4484300 6667956 10245120 16330854 26951967 31034561 21074345 14707395 10229689
13966 10229689 7794818 6399130 5238283 4439603 4174446 3637198 3621117 3279186 3361011
13957 3361011 3338014 2807721 2838008 2596680 2702335 2550191 2724447 2440495 2271988 2213148
13947 2213148 2331854 1975886 2066015 2189451 1968405 2203982 2271978 1816212 2199654 2149017
$$ packed form
14013B961840k64525M10283o5390l74561q4766M87643l3948j12282Q2780K6455
14003C033529L0024l18686L6030l04020K26951q4898M2314l82374j1698M12613
13993B679785k67865M2724r9413M9708o5583J67205l59492J38101j87108O11751
13983B709813j29295j34856k20826K59725L13651J00849P04982k02884J083141
13974D484300K183656L577164O085734J0621113M082594r960216o366950m477706
13966A0229689k434871j395688j160847p98680k65157n37248j6081l41931Q1825
13957C361011k2997n30293L0287k41328J05655j52144J74256k83952j68507n8840
13947B213148J18706l55968R0129J23436k21046K35577O7996m55766L83442n0637
$$ plain form
13937 2149017 2204933 1708441 2014887 1884189 2067944 1935973 2065247 1950531 1758454 1633416
13927 1633416 2017219 1717580 1498248 1628502 1903825 1875328 1538362 1703649 1782969 1536185
13917 1536185 1729618 1492990 1767780 1687743 1575430 1693698 1686102 1557715 1757829 1702160
13907 1702160 1690529 1414670 1689855 1451707 1439260 1424375 1464605 1571307 1529632 1410615
13897 1410615 1570335 2082511 1800216 1235668 1554027 1608089 1244913 1626771 1637323 1286078
13887 1286078 1460027 1416828 1109436 1422425 1407360 1516516 1241895 1279900 1248807 1364433
13877 1364433 1578361 1452630 1134119 1187702 1528325 1212380 1332936 1203157 1342959 1645464
13867 1645464 1227205 979332 1687563 1301026 1157349 984760 1360509 1131942 1124792 1270926
$$ packed form
13937B149017N5916m96492L06446j30698J83755j31971J29274j14716j92077j25038
13927A633416L83803k99639k19332J30254K75323k8497l36966J65287P9320k46784
13917A536185J93433k36628K74790q0037j12313J18268p596j28387K00114n5669
13907A702160j1631k75859K75185k38148j2447j4885M0230J06702m1675j19017
13897A410615J59720N12176k82295n64548L18359N4062l63176L81858J0552l51245
13887A286078J73949m3199l07392L12989j5065J09156k74621L8005l1093J15626
13877A364433K13928j25731l18511N3583L40623l15945J20556j29779J39802L02505
13867A645464m18259k47873P08231l86537j43677j72589L75749k28567p150J46134
$$ plain form
13857 1270926 1239444 1345845 1166282 1109404 867923 1361878 1137702 1367696 976670 1101554
13847 1101554 1199567 1150700 866488 1286584 1046891 1269845 1104611 1091519 1228440 1321811
13837 1321811 894013 995885 1317204 1205072 1099976 1057960 1268894 737994 892560 1047426
13827 1047426 840297 1239739 841722 1085824 1054465 1035558 1040296 768379 839208 1116946
13817 1116946 737535 926319 1000169 619094 771927 796165 879029 979679 723481 664839
13807 664839 1098528 739203 682389 1051233 963656 1137216 846521 731648 1080649 1025795
13797 1025795 1034784 1024706 1090733 976575 768380 799783 949452 658428 741635 695056 1047059
13786 1047059 1001110 846416 361295 586382 710512 736786 579312 807658 920147 956287
$$ packed form
13857A270926l1482J06401j79563n6878k41481M93955k24176K29994l91026J24884
13847A101554R8013m8867k84212M20096k39693K22954j65234j3092J36921R3371
13837A321811m27798J01872L21319j12132j05096m2016K10934n30900J54566J54866
13827A047426k07129L99442l98017K44102l1359j8907M738k71917P0829K77738
13817A116946l79411J88784P3850l81075J52833K4238Q2864J00650k56198n8642
13807F64839M33689l59325n6814L68844q7577J73560k90695j14873L49001n4854
13797A025795Q989j0078O6027j14158k08195L1403J49669k91024Q3207m6579L52003
13786A047059m5949j54694C61295K25087J24130K6274j57474K28346J12489L6140
$$ plain form
13776 956287 703287 688833 496134 616072 590653 488198 669340 983044 811225 513034
13766 513034 844186 628922 658361 1028681 735925 964197 850567 656269 443284 803229
13756 803229 835508 866035 640544 868209 777810 819722 689883 493890 661333 697826
13746 697826 950235 297944 844985 921854 572546 563076 658983 557876 531814 738974
13736 738974 378839 558209 727350 786515 405213 808618 582605 1096508 832165 293991
13725 405018 601498 562883 718132 397796 590073 584055 673122 602600 462616 677886
13715 677886 293926 966419 583909 416523 782960 1106718 442184 703868 801366 484040
13705 484040 766463 728833 966796 489335 551130 177274 763789 309024 765410 387966
$$ packed form
13776I56287k53000j4454j92699J19938k5419j02455J81142L13704j71819k98191
13766E13034L31152k15264K9439L70320k92756K28272j13630j94298k12985L59945
13756H03229L2279L0527k25491K27665r0399M1912j29839j95993J67443L6493
13746F97826K52409B97944N47041P6869l49308r470R5907j01107k6062K07160
13736G38974l60135J79370J69141N9165l81302M03405k26013N13903k64343B93991
13725D05018J96480l8615J55249l20336J92277o018Q9067p0522j39984K15270
13715F77886B93926O72493l82510j67386L66437L23758D42184K61684R7498l17326
13705D84040K82423l7630K37963m77461O1795A77274N86515C09024M56386l77444
$$ plain form
13695 387966 633562 588494 766708 398143 695036 610924 343901 484270 524842 333617
13685 333617 516903 483128 447650 290517 671623 463096 268267 587224 493806 676164
13675 676164 628071 614188 587314 513078 417026 477311 760451 745082 254695 417687 458715
13664 458715 453416 309133 650660 308516 182924 391385 688521 654673 367046 307259
13654 307259 410154 753319 200372 444506 172697 482027 684181 509056 347334 285530
13644 285530 601935 -30971 500297 621935 467863 404681 545774 538195 810471 280936
13633 352561 370782 526919 453454 368492 318306 301484 416175 507823 302320 277572 462873
13622 462873 322262 70386 659869 377269 364307 233528 583397 395245 453330 574833
$$ packed form
13695C87966K45596m5068J78214l68565K96893q4112k67023J40369M0572j91225
13685C33617J83286l3775l5478j57133L81106k08527j94829L18957r3418J82358
13675F76164m8093j3883k6874p4236r6052O0285K83140j5369B54695J62992M1028
13664D58715n299j44283L41527C08516j25592K08461K97136l3848k87627n9787
13654C07259J02895L43165B00372K44134A72697L09330K02154j75125j61722o1804
13644B85530L16405c0971E00297J21638j54072o3182J41093p579K72276B80936
13633C52561J8221J56137p3465q4962n0186j6822J14691R1648k05503k4748J85301
13622D62873j40611G0386N89483k82600j2962j30779L49869j88152N8085J21503
$$ plain form
13612 574833 549832 220001 325225 467858 344397 584573 492183 278124 401054 440266
13602 440266 624839 603766 296940 326015 102747 374282 388667 367294 285681 540421
13592 540421 535673 262708 298337 363474 20701 396539 387829 532480 389890 62919 360221
13581 360221 347940 182657 693270 259363 479234 701684 493534 406734 422243 95281
13570 450005 437517 264150 342193 399588 539194 668927 314722 429131 349566 446185
13560 446185 525795 118408 161974 395270 460387 11655 343520 319011 339314 67584 647688
13549 647688 569326 317370 545036 269097 297706 557207 517968 535661 338453 104463
13538 188479 546732 194735 423836 546952 95945 297906 67167 21124 230375 198666
$$ packed form
13612E74833k5001B20001J05224J42633j23461K40176r2390k14059J22930L9212
13602D40266J84573k1073B96940K9075A02747K71535J4385k1373q1613K54740
13592E40421m748B62708L5629O5137B0701L75838q710J44651j42590F2919K97302
13581C60221j2281j65283N10613B59363K19871K22450k08150q6800J5509I5281
13570D50005j2488j73367P8043N7395J39606J29733C14722J14409p9565R6619
13560D46185P9610A18408M3566K33296O5117A1655L31865k4509K0303F7584N80104
13549F47688p8362k51956K27666B69097K8609K59501l9239J7693j97208A04463
13538A88479L58253A94735K29101J23116I5945K01961F7167B1124K09251l1709
$$ plain form
13528 198666 88501 477260 103458 319789 408859 284137 317235 465493 670128 614911
13518 614911 750403 560529 242547 392465 126493 168345 274350 313068 216762 288922
13508 288922 44386 365648 266166 369598 260132 -110674 449429 510124 229213 143695
13498 143695 356392 248826 617826 263864 468118 409027 363092 217544 272670 202380
13488 202380 330899 277797 142467 429773 466078 95638 366614 327925 130096 31935
13477 249962 316601 300062 119933 304841 450208 166089 450345 5977 293882 172883
13467 172883 154617 410325 448793 260681 247960 339917 503246 221953 147900 322322
13457 322322 175846 458587 444755 67516 242830 254489 470071 244278 137878 270367
$$ packed form
13528A98666H8501L88759A03458K16331Q9070j24722L3098J48258K04635n5217
13518F14911J35492j89874B42547J49918A26493M1852J06005L8718r6306P2160
13508B88922D4386L21262r9482J03432j09466a10674D49429O0695B29213q5518
13498A43695K12697j07566L69000B63864K04254n9091m5935j45548N5126p0290
13488B02380J28519n3102j35330K87306L6305I5638K70976l8689A30096C1935
13477B49962O6639j6539A19933J84908J45367A66089K84256E977K87905j20999
13467A72883j8266K55708L8468j88112j2721R1957J63329B21953p4053J74422
13457C22322j46476K82741j3832F7516J75314J1659K15582k25793j06400J32489
$$ plain form
13447 270367 124743 21918 356875 23204 -83162 387473 45308 451977 405633 94753 -48203
13435 362877 304042 277468 235600 365204 221994 85504 365157 397303 261837 300417 345136
13424 345136 158336 62984 199703 232390 -50045 469421 -23233 78146 415170 125595
13413 96025 226352 317953 295318 -410165 449886 253637 362905 195178 -70733 319812
13402 422798 174251 62419 469755 487212 331680 22575 234117 1644 420328 594943
13392 594943 -188550 60382 229630 201844 380001 389373 65819 78253 -29682 255994 383763
13381 383763 246808 219003 133193 -40690 331098 261692 216995 204980 345698 12130 147395
13370 147395 17581 254150 489980 115230 174889 179485 191788 173328 439930 264799 501270
$$ packed form
13447B70367A24743B1918L34957B3204h3162C87473D5308M06669m6344I4753d8203
13435C62877n8835k6574m1868J29604j43210H5504K79653L2146j35466L8580M4719
13424C45136A58336F2984J36719L2687e0045D69421b3233G8146L37024A25595
13413I6025J30327R1601k2635d10165D49886j96249J09268j67727g0733C19812
13402D22798A74251F2419M07336J7457j55532B2575K11542A644M18684J74615
13392E94943a88550F0382J69248k7786J78157R372F5819J2434b9682B55994J27769
13381C83763j36955k7805q5810d0690C31098o9406m4697j2015J40718A2130J35265
13370A47395A7581K36569K35830A15230N9659M596J2303j8460K66602j75131K36471
$$ plain form
13359 501270 259727 4368 320562 551304 202580 171909 515742 151256 222748 63642
13348 243969 120446 290725 561812 199343 503036 182046 228713 7984 -66764 289390
13337 230325 283975 165757 149042 518155 337706 261602 217565 -93747 132581 -23115 701206
13325 300355 119367 163887 391699 178952 561081 -127109 73055 297283 195413 290777
13315 290777 -58072 177314 300933 267253 448459 500456 332348 -274052 134437 465075
13305 465075 360173 304200 299310 183494 262656 181124 -112620 -138658 231974 -55648 244452
13293 -174830 232371 230376 84201 11579 94985 365598 -18535 29707 23479 203286 101268
13281 41585 353924 240118 167070 152542 -80239 100698 176772 -108676 214551 221048 114760
$$ packed form
13359E01270k41543D368L16194K30742B02580l0671L43833A51256P1492F3642
13348B43969A20446J70279K71087A99343L03693A82046M6667G984f6764B89390
13337B30325N3650j18218j6715L69113j80449p6104m4037i3747A32581b3115G01206
13325C00355A19367M4520K27812A78952L82129a27109G3055K24228j01870R5364
13315B90777e8072A77314J23619l3680J81206N1997j68108b74052A34437L30638
13305D65075j04902n5973m890j15816P9162q1532a12620k6038B31974e5648B44452
13293a74830B32371j995H4201A1579Q3406K70613a8535B9707o228J79807A01268
13281D1585L12339j13806p3048j4528h0239A00698P6074a08676B14551O497j06288
$$ plain form
13270 114760 110939 -125808 291373 486069 115437 211466 -59360 -95700 189438 117201 -19340
13258 181316 -170203 -250381 -89545 -71230 23869 353766 -84002 428282 89592 60154 15304
13246 408392 123494 148347 20135 328415 62452 258891 11812 81546 -5886 -5767 181614
13234 251705 38986 -133122 134859 9816 193321 245802 156212 242389 127326 -21218 153038
13222 196900 124863 -159432 10422 106541 -140226 378387 67237 -15007 223372 43671 285657
13211 285657 -37233 34610 180333 94223 352787 28898 129308 45319 20318 264035 174140
13200 174140 129546 198917 -196616 204341 359147 -93854 64608 -4913 334986 126761 -39439
13188 -144974 53386 -134510 121607 309415 245831 201377 493347 -124079 84620 -43548
$$ packed form
13270A14760l821a25808B91373J94696A15437R6029e9360l6340A89438p2237a9340
13258A81316a70203q0178h9545J8315B3869L29897h4002D28282H9592k9438A5304
13246D08392A23494K4853B0135L08280F2452J96439A1812O9734e886J19A81614
13234B51705C8986a33122A34859I816J83505N2481q9590Q6177j15063b1218A53038
13222A96900p2037a59432A0422R6119a40226C78387F7237a5007B23372D3671K41986
13211B85657c7233C4610J45723q6110K58564B8898J00410D5319B0318K43717q9895
13200A74140m4594O9371a96616B04341J54806i3854F4608d913C34986A26761c9439
13188a44974E3386a34510A21607J87808o3584m4454K91970a24079H4620d3548
$$ plain form
13177 206934 -44415 35870 302644 453922 -170105 92284 -53159 7499 42291 304571 233726
13166 233726 258420 194319 153502 -198503 447251 -187236 -61997 366403 -116763 373592
13155 277421 -163657 175038 -11864 230766 -71619 -68339 -101010 23857 237719 278149 107501
13143 19913 34095 -186252 -203170 232734 262921 185237 327735 82748 72667 -103521 -14933
13131 7490 55453 158620 177874 70128 339290 223667 -237390 121640 186478 -27006 34166
13119 72826 358239 369571 18526 146222 254774 22011 -193764 397975 8291 288405 -92702
13107 231546 -42253 114068 -140394 392118 -253719 32842 -62233 85386 131128 134084 96420
13096 96420 180566 220113 38126 196692 -250825 -248943 55451 385674 127380 35557 230097
$$ packed form
13177B06934d4415C5870K66774J51278a70105I2284e3159G499L4792K62280p0845
13166B33726K4694o4101m0817a98503D47251a87236f1997C66403a16763C73592
13155B77421a63657A75038a1864B30766g1619L280l2671B3857K13862M0430A07501
13143A9913J4182a86252j6918B32734L0187p7684J42498H2748j0081a03521a4933
13131G490M7963J03167J9254G0128K69162j15623b37390A21640O4838b7006C4166
13119G2826K85413J1332A8526J27696J08552B2011a93764C97975H291K80114i2702
13107B31546d2253A14068a40394C92118b53719C2842f2233H5386M5742K956l7664
13096I6420Q4146L9547C8126J58566b50825J882E5451L30223A27380C5557J94540
$$ plain form
13085 230097 60718 -63377 -221975 188844 65708 132212 413051 56355 250611 -56905 -104122
13074 -104122 82970 -239771 106393 -105547 -257002 154158 -17009 -20979 223869 263578
13064 263578 369223 59231 168151 -85557 69937 -10083 194363 127524 97576 132843 256630
13053 256630 167113 378587 229492 3762 120848 -18863 66662 30562 -59659 593402 229443
13041 2879 6669 364526 254668 443 42290 87185 96718 -151602 13675 297542 -85298 419796
13028 277198 53563 6970 179097 203072 262432 155730 239383 155912 196003 -161113 -81050
13017 -81050 164650 169216 122594 138263 205165 -194635 257299 26374 26973 99226 -15456 -42282
13005 -42282 136182 339794 -56521 -147149 670049 169236 -58109 194821 253234 78489 381046
$$ packed form
13085B30097F0718f3377j58598A88844F5708O6504K80839E6355J94256e6905m7217
13074a04122H2970b39771A06393a05547j51455A54158a7009l970B23869L9709
13064B63578J05645E9231J08920h5557F9937a0083A94363o6839k9948L5267J23787
13053B56630q9517K11474j49095C762J17086a8863F6662C0562e9659E93402B29443
13041B879L790L57857j09858D43M1847M4895R533a51602A3675K83867h5298D19796
13028B77198E3563F970J72127K3975N9360j06702Q3653q3471M0091a61113Q0063
13017h1050A64650M566m6622J5669O6902a94635B57299B6374N99P2253a5456k6826
13005d2282A36182K03612e6521r0628F70049A69236e8109A94821N8413G8489L02557
$$ plain form
12994 381046 304796 179676 230885 52416 317112 270154 282443 75244 437700 23289 -172076
12982 240650 79149 233876 130055 52028 -123038 -224554 123590 97662 183584 -192149
12971 -156476 162170 -225257 -131655 19088 11002 162918 -49378 172462 61644 -205248 258570
12959 285637 -137234 -32941 143997 92389 383843 184455 -3868 52280 69571 -45074 282370
12947 -175870 -63564 -153314 118253 -140119 -57851 -155364 -191397 62153 137602 149613 69128
12935 -26701 85518 136682 -218198 -53551 12050 -138275 -1247 152666 256244 76486 271981
12924 271981 52536 -132700 231789 225572 -173977 155298 261722 -77535 77055 -383149
12913 62653 -180170 139334 307722 17882 73603 22594 13068 174513 204943 141769 -16018
$$ packed form
12994C81046p6250j25120N1209E2416K64696m6958J2289G5244L62456B3289a72076
12982B40650G9149J54727j03821E2028a23038j01516A23590k5928Q5922a92149
12971a56476A62170b25257R3602A9088q086J51916d9378A72462F1644b05248B58570
12959B85637a37234c2941A43997n1608K91454A84455c868E2280J7291d5074B82370
12947a75870f3564q9750A18253a40119e7851r7513l6033F2153P5449J2011F9128
12935b6701H5518N1164b18198e3551A2050a38275a247A52666J03578G6486J95495
12924B71981E2536a32700B31789o217a73977A55298J06424g7535G7055c83149
12913F2653a80170A39334J68388A7882N5721B2594r526J61445L0430o3174a6018
$$ plain form
12901 163811 295788 142975 -118602 76879 48653 -109127 -98195 10231 266240 356475
12891 356475 154536 124913 -56765 520950 25941 56072 164020 292188 -81618 -143939 223235
12879 98234 -148965 -180153 -210324 -109373 304255 -296405 91900 248112 -73100 62375 -6119
12867 24702 321454 -151188 -209740 124023 -265693 235292 -41494 -92301 -162771 425579
12856 -71829 116316 167272 4408 51320 -42031 -135476 146767 -86254 -86266 -163278 -228253 217498
12843 -305109 173312 113858 142665 -67312 -136249 -170361 120653 33649 -209727 -201591 -54204
12831 -48842 233449 247446 -89379 300711 17535 -34768 161625 83921 -158142 136892 35642
12819 138043 209814 134230 326473 -276365 163697 74160 -132043 78766 246002 -447 119417
$$ packed form
12901A63811J31977A42975a18602G6879k8226a09127J0932A0231K56009R0235
12891C56475A54536k9623e6765E20950B5941L0131J07948J28168h1618o2321B23235
12879I8234a48965l1188l0171J00951C04255b96405I1900J56212g3100F2375f119
12867B4702K96752a51188n8552A24023b65693B35292d1494n0807p0470D25579
12856g1829A16316N0956D408M6912d2031r3445A46767h6254j2p7012o4975B17498
12843c05109A73312n9454K8807f7312o8937l4112A20653C3649b09727Q136e4204
12831d8842B33449J3997h9379C00711A7535c4768A61625p7704a58142A36892C5642
12819A38043P1771p5584J92243b76365A63697G4160a32043G8766J67236d47A19417
$$ plain form
12807 210843 -128968 145475 -317575 -70840 302593 -156339 36708 189802 -5291 -95151
12797 -95151 -64474 102414 88470 -151940 -157545 -31706 86692 -127684 258961 -44852 -6100
12785 -329784 -11596 154110 152672 49497 16344 -176052 -23455 117293 138020 -319452 -28557
12773 -95190 -178888 -482874 -54852 237265 -97789 54740 -37029 -95959 -541409 129286 -190233
12761 194010 -42094 83096 -24972 232988 -33096 70009 -64518 590664 -19806 -42355 266895
12749 -119652 -50888 111108 43449 35384 -157554 81565 -91714 32739 302438 -73162 -176344
12738 -176344 -179111 117759 125445 29494 -140177 52583 -17723 -228312 -335122 57971 -339328
12726 96210 84882 -178738 -21239 -66250 -80285 221669 -155155 -89389 38754 -36177 255725
$$ packed form
12807B10843a28968A45475c17575g0840C02593a56339C6708J53094e291q9860
12797i5151L0677A02414j3944a51940n605c1706H6692a27684B58961d4852f100
12785c29784a1596A54110j438D9497A6344a76052b3455A17293K0727c19452b8557
12773i5190q3698l03986e4852B37265i7789E4740c7029n8930m45450A29286a90233
12761A94010d2094H3096b4972B32988c3096G0009f4518E90664a9806k2549B66895
12749a19652e0888A11108D3449q065a57554H1565i1714C2739K69699g3162j03182
12738a76344k767A17759P686B9494a40177E2583a7723k10589j06810E7971c39328
12726I6210j1328a78738b1239m5011j4035B21669a55155O5766C8754c6177B55725
$$ plain form
12714 -74083 67642 413326 72508 244880 327461 63637 -65271 -219342 149991 190082 292710
12703 292710 305020 44601 457307 -153723 -54566 351669 62262 16637 80176 -57373 394649
12691 313010 122876 286097 543363 263131 321559 383213 213351 85369 318952 -248824
12680 110685 340036 86276 153477 2462 116008 115855 43379 -105943 132653 123952 -103856
12668 -104857 178896 360459 143998 288853 240586 252937 69675 410841 -8714 136363
12657 157501 28167 240980 140985 267930 273950 183392 248276 253424 -26889 -20375 110180
12645 -9514 49959 93311 50587 161518 -68677 -93133 -21996 -100130 220622 126292 -28217
12633 -74883 26193 206563 180175 100872 -90179 54624 131536 -117295 426231 146734 60302
$$ packed form
12714g4083F7642L45684G2508J72372Q2581F3637f5271j54071A49991M0091J02628
12703B92710J2310D4601M12706a53723e4566C51669F2262A6637O3539e7373C94649
12691C13010A22876J63221K57266B63131N8428O1654j69862H5369K33583b48824
12680A10685K29351H6276O7201B462J13546j53D3379a05943A32653q701a03856
12668a04857A78896J81563A43998J44855m8267J2351F9675L41166h714A36363
12657A57501B8167K12813r9995J26945O020r0558O4884N148b6889O514A10180
12645i514D9959M3352m2724J10931f8677k4456b1996p8134B20622r4330b8217
12633g4883B6193J80370k6388p9303i0179E4624P6912a17295D26231A46734F0302
$$ plain form
12621 -72030 20693 88628 -113193 283444 -55371 71731 61585 388480 94046 109873 62741
12610 62741 193697 77311 9119 51591 -119544 30041 193470 -28330 285018 41872 -25863
12598 91583 -110130 -36805 113892 -155176 199840 79573 57136 147264 -123908 147930
12587 -89441 167649 161283 -90512 -53228 162892 212620 92597 5229 181670 157635 10217
12575 -6051 173129 87536 157720 81922 296044 375644 64117 138332 152706 173179 -17800
12563 -164141 -113030 19550 -24206 -76630 -1582 -8975 200415 -127517 107842 3970 82012
12552 82012 240650 248489 78952 -97236 83038 -11153 -27031 19469 124197 -103580 285011
12540 75580 62211 92809 39447 79619 30422 -52579 112791 32379 116093 -26261 -160788
$$ packed form
12621g2030B0693O7935a13193B83444e5371G1731j0146L26895I4046J5827m7132
12610F2741J30956G7311I119M2472a19544C0041J63429b8330B85018D1872b5863
12598I1583a10130c6805A13892a55176A99840G9573k2437R0128a23908A47930
12587h9441A67649o366i0512L7284A62892M9728I2597E229J76441k4035A0217
12575f051A73129q5593P0184p5798K14122P9600F4117P4215J4374K0473a7800
12563a64141N1111A9550b4206n2424a582p393B00415a27517A07842C970P8042
12552H2012J58638P839G8952i7236H3038a1153j5878A9469J04728a03580B85011
12540G5580j3369L0598C9447M0172C0422e2579A12791C2379Q3714b6261j34527
$$ plain form
12529 -160788 -3432 -66112 -52123 -30367 -101677 229307 -170344 -25273 -298526 -265053 -130796
12517 119772 86261 20054 -93840 328555 -44365 -430718 24378 175237 148084 116900 -294374
12505 295018 130193 -70719 -284671 -217228 -56425 124696 -207393 -65639 -146107 -113928 -52942
12493 398967 42102 251806 104105 -55417 -45486 105332 324402 -404132 382801 159014
12482 77437 491950 240204 -67569 344058 74801 514904 -13172 151683 -106548 216319
12471 -17557 -14567 225969 63450 -27432 -189155 67081 111143 137415 -332105 -47198 -21871
12459 -39880 -225468 186964 -8340 -266184 265352 -118565 -38458 388013 -340603 242079
12448 -163410 38472 -291984 78911 64144 182252 525119 -12901 46280 1247 -409845 -35987
$$ packed form
12529a60788c432o2680J3989K1756p1310B29307a70344b5273k73253L3473a30796
12517A19772l3511B0054i3840C28555d4365l86353B4378J50859k7153l1184b94374
12505B95018A30193g0719k13952O7443e6425A24696b07393f5639q0468L2179e2942
12493C98967D2102K09704A04105e5417R931A05332K19070d04132C82801A59014
12482G7437M14513B40204f7569C44058G4801M40103a3172A51683a06548B16319
12471a7557K990B25969F3450b7432j61723F7081M4062K6272c32105d7198b1871
12459c9880j85588A86964h340k57844B65352a18565c8458C88013c40603B42079
12448a63410C8472b91984G8911j4767J18108L42867a2901D6280A247d09845c5987
$$ plain form
12436 237252 -271839 -67732 -38690 114333 -180857 37304 29319 4429 27500 167006 -457323
12424 -82511 -23550 -186627 -120496 -264109 49423 170790 -1473 -33101 -260789 462217 -56042
12412 161522 75607 113326 78043 -100346 68841 -162821 -94091 -76513 115473 99204 416583
12401 416583 2569 -155781 -22139 165037 -128343 51081 -141673 -76665 -141424 288639 -20501
12389 -65549 10817 121546 -49786 27077 -244425 63488 87867 7389 -206808 126669 274574
12378 274574 82769 -173071 163632 25827 -361998 -276056 378626 282318 34364 -80224 -373737
12367 -373737 131100 71317 344778 91146 148513 24724 77540 -186054 -147316 197356 -465835
12355 258697 115539 -129696 77441 -206240 103099 87156 -20968 68061 14544 125533
$$ packed form
12436B37252b71839f7732K9042A14333a80857C7304p985D429K3071J39506d57323
12424h2511b3550j63077O6131j43613D9423J21367a473l1628k27688D62217e6042
12412A61522G5607L7719l5283a00346F8841a62821O8730J7578A15473j6269L17379
12401D16583B569a55781b2139A65037a28343E1081a41673O5008o4759B88639b0501
12389f5549A0817J10729d9786B7077b44425F3488K4379G389b06808A26669J47905
12378B74574H2769a73071A63632B5827c61998Q5942C78626r6308C4364h0224k93513
12367c73737A31100n9783K73461I1146N7367B4724N2816a86054L8738A97356d65835
12355B58697A15539a29696G7441b06240A03099j5943b0968F8061A4544J10989
$$ plain form
12345 125533 545 92865 -91191 -64461 127086 -127428 94768 -150361 -40413 -157 153408
12333 -170957 -54900 -266559 61375 125830 60749 163285 -71528 94930 -40985 61262 -2566
12321 99238 -26514 260198 103451 -134445 -168634 -81103 89022 -109026 158699 -213942
12310 447683 173652 67909 143450 -73257 187872 -178358 -18082 73714 268520 -35881 99745
12298 -109889 239039 -241225 149081 -125588 124444 70099 -11083 193139 -331440 -161590
12287 -29262 -343397 -15445 -141067 -218176 218691 -158842 34169 18358 37555 159781 -70699
12275 -347405 -108528 6951 314322 -127889 146677 92991 279727 -259235 32691 286007
12265 286007 71219 -64695 148301 27747 116826 -194690 278625 -9982 376106 43487 -243540
$$ packed form
12345A25533E45R2320i1191K6730A27086a27428I4768a50361d0413a57A53408
12333a70957e4900k11659F1375O4455F0749J02536g1528I4930d0985F1262b566
12321I9238b6514B60198A03451a34445l4189h1103H9022a09026A58699b13942
12310D47683A73652F7909P5541g3257A87872a78358a8082G3714J94806c5881I9745
12298a09889B39039b41225A49081a25588A24444n4345a1083A93139c31440a61590
12287b9262l14135a5445j25622p7109B18691a58842C4169j5811J9197J22226g0699
12275c47405a08528F951L07371a27889A46677n3686J86736b59235C2691K53316
12265B86007G1219f4695A48301B7747Q9079a94690B78625i982C76106D3487b43540
$$ plain form
12253 -18069 -209038 214665 -238120 202623 -95972 51342 142496 -168385 -7497 45509 17604
12241 -142158 70606 268412 281866 21510 335558 196599 27088 225293 645088 190 86494
12230 86494 81352 71904 367726 91096 183429 126698 -136155 134430 141204 -53338 311935
12218 139782 90736 201873 171429 274299 202994 17117 167351 364868 62437 276253
12208 276253 212604 293305 382184 234686 29478 294265 90960 73794 -16994 138145 84178
12197 84178 225373 -177157 58715 -30253 187354 24617 370662 157340 156082 -39963 -146412
12186 -146412 367330 232701 377828 214393 275940 238943 -137736 162632 125782 55795
12175 196084 102792 56483 -309159 138852 454990 121205 185065 2468 -243839 53089 259207
$$ packed form
12253a8069j90969B14665b38120B02623i5972E1342R1154a68385g497D5509A7604
12241a42158G0606J97806J3454B1510L14048j38959B7088J98205M19795A90Q6304
12230H6494n142r448K95822I1096R2333n6731a36155A34430O774e3338C11935
12218A39782m9046J11137l0444J02870p1305A7117J50234J97517F2437K13816
12208B76253o3649Q0701Q8879j47498B9478K64787I0960j7166a6994A38145n3967
12197H4178J41195a77157E8715c0253A87354B4617L46045A57340j258c9963j06449
12186a46412C67330j34629J45127j63435O1547l6997a37736A62632l6850E5795
12175A96084r3292m6309c09159A38852L16138A21205O3860B468b43839E3089K06118
$$ plain form
12164 259207 -97864 147229 171008 117931 290870 272254 386325 81534 -313713 102486
12153 140821 535349 84319 195829 408675 158695 30620 -15878 174827 61244 -439838
12142 -82675 -167387 327515 -382079 -83442 207774 -15043 -49677 220576 -39438 212851 264643
12131 264643 127770 -109041 12650 -111417 62332 -137255 95371 101314 -256109 13865 135413
12120 135413 -7378 27176 342844 116875 103407 -169270 -94162 138250 227031 68394 92403
12109 92403 -249596 -2035 -299489 59869 413134 -8839 -164215 178028 -9749 118288 100743
12098 100743 -13398 309634 268265 180836 63001 -54600 223871 -33589 -23802 107172 -158065
12086 168770 -205657 4455 -25395 31135 -44974 -66218 -27910 -60615 122557 165514 -71406
$$ packed form
12164B59207i7864A47229K3779n3077J72939j8616J14071H1534c13713A02486
12153A40821L94528H4319J11510K12846A58695C0620a5878A74827F1244d39838
12142h2675q4712C27515c82079h3442B07774a5043l4634B20576c9438B12851N1792
12131B64643A27770a09041A2650a11417F2332a37255I5371N943b56109A3865J21548
12120A35413g378B7176L15668A16875j3468a69270P5108A38250Q8781F8394K4009
12109I2403b49596b035k97454E9869L53265h839j55376A78028i749A18288j7545
12098A00743a3398C09634m1369q7429F3001e4600B23871c3589R787A07172a58065
12086A68770b05657D455b5395C1135d4974k1244b7910l2705A22557M2957g1406
$$ plain form
12074 22125 31524 149329 -206143 197451 -301196 -105767 -5277 -273103 -167704 420402
12063 117336 -207990 55154 -158695 280760 -24603 43924 -53842 -136277 363982 322127 297382
12052 297382 905866 807742 211984 90201 170294 157810 32141 -62983 9068 201604 -190931
12040 40278 -174038 70160 132526 239392 -69952 -117923 -247074 -97372 3063 -181436 25430
12028 -142675 99650 -401875 -167677 162841 -190697 -31607 140875 202661 -36219 134752
12017 -11522 -302267 4889 -608 -24687 -180069 -209936 -29192 -263841 199884 -69903 -405639
12006 -405639 -24917 114701 -110988 -197016 87643 9834 92675 291666 -4293 -184383 28860
11994 108633 61061 -29502 45321 123051 170626 31359 -180747 -135941 120867 -115718 21303
$$ packed form
12074B2125R399J17805b06143A97451c01196a05767e277k67826J05399D20402
12063A17336b07990E5154a58695B80760b4603D3924e3842q2435C63982m1855k4745
12052B97382O08484r8124B11984I0201Q0093j2484C2141f2983I068J92536a90931
12040D0278a74038G0160O2366J06866f9952m7971j29151i7372C063a81436B5430
12028a42675I9650d01875a67677A62841a90697c1607A40875O1786c6219A34752
12017a1522k90745D889f08k4079j55382k9867b9192k34649A99884f9903l35736
12006d05639b4917A14701a10988q6028H7643I834Q2841J98991d293j80090B8860
11994A08633m7572b9502D5321P7730M7575C1359a80747M4806A20867a15718B1303
$$ plain form
11982 -163310 -474825 20637 -129589 -109536 -245362 389948 138988 -42108 -88952 -230751
11972 -230751 -26140 -59865 137774 176794 99301 -97806 351961 284220 -9623 181521 -141062
11960 185462 -281559 113951 -18519 -113037 31193 72638 -228143 37831 343785 407516 -14976
11948 -110069 65947 -48877 -343115 -204371 -105709 -90572 -217964 162452 -29335 127105
11937 5711 339769 -140401 -357494 460946 -34959 -123940 -244686 -45510 37186 43744 -236370
11925 55766 -159549 -146285 -37419 192474 -118511 -289287 113489 -2525 -9546 118060 -203624
11913 200505 132269 -104596 -13379 95858 -140700 -174538 -254164 -519 104631 -156668 87212
11901 107001 -137632 -99194 111268 -40908 5595 137374 20606 18640 -64438 -86355 12935
$$ packed form
11982a63310l11515B0637a29589K0053j35826C89948A38988d2108m6844j41799
11972b30751b6140l3725A37774L9020p7493i7806C51961o7741i623A81521a41062
11960A85462b81559A13951a8519r4518C1193M1445b28143C7831L05954O3731a4976
11948a10069F5947d8877k94238J38744R8662J5137j27392A62452b9335A27105
11937E711L34058a40401k17093D60946c4959q8981j20746d5510C7186O558b36370
11925E5766a59549J3264c7419A92474a18511j70776A13489b525p021A18060b03624
11913B00505o8236a04596a3379I5858a40700l3838p9626e19A04631a56668H7212
11901A07001a37632L8438A11268d0908E595J31779B0606j966f4438k1917A2935
$$ plain form
11889 -30447 -22956 36503 -195018 41699 163382 128015 -131959 -95234 64889 76352 124555
11878 124555 -132466 91076 149997 -24958 -189026 148854 -132942 -142681 -38752 140107 -175229
11866 24988 179302 -153599 212235 36976 4884 -264354 -20132 -242108 211538 -69232 -80272
11855 -80272 146076 -324825 -232617 -255174 14363 -164068 -111046 -30907 270107 -322727 38915
11843 -265931 169570 59140 113118 99277 21116 123975 -124504 -133307 -91044 70271 -211543
11831 207911 17447 -11307 -276221 -167734 -155810 -251914 -254175 291950 58615 -39538 20722
11819 13353 -166392 -207499 33863 -226713 -149765 -138103 29478 201385 -46706 -100768 29150
11807 126920 47149 -89896 -192620 -15961 -22219 -202140 -64866 72124 8330 -18124 1089 -38523
$$ packed form
11889c0447P491C6503a95018D1699J21683l5367a31959L6725F4889J1463M8203
11878A24555a32466I1076N8921b4958j64068A48854a32942r739c8752A40107a75229
11866B4988J54314a53599B12235C6976D884b64354b0132k21976B11538f9232j1040
11855h0272A46076c24825R2208k2557A4363a64068N3022c0907B70107c22727C8915
11843b65931A69570E9140N3978j3841B1116J02859a24504q803M2263G0271b11543
11831B07911A7447a1307k64914J08487J1924r6104k261B91950E8615c9538B0722
11819A3353a66392m1107C3863b26713P6948J1662B9478J71907d6706n4062B9150
11807A26920D7149h9896j02724a5961o258j79921f4866G2124H330a8124A089c8523
$$ plain form
11794 71060 7772 63406 86012 -53766 -343353 -86027 106615 136623 54402 103907 129127
11783 129127 -9618 19155 154958 -76327 72510 -163521 -337346 283948 39679 -225893 -118495
11772 -118495 52073 201749 289184 -71533 -28967 127961 -78399 96848 329118 -58216 -123664
11761 -123664 -9802 255242 -356926 -202822 81558 -18552 -211813 180233 35060 -67529 67556
11749 188966 124578 -11882 -23575 87087 212123 -125924 -75638 179531 116463 -593957 -56881
11737 152804 -406160 -150988 -147004 263360 -95239 -99616 -26824 -478371 63575 -169954 -30196
11725 52738 82419 229038 76696 79194 233818 118343 155651 146345 20682 -203679 30192
11713 -65758 -130583 68000 224989 -208415 -47767 140357 182946 -57949 51889 -15216 114253
$$ packed form
11794G1060G772N5634K2606e3766k89587h6027A06615L0008E4402M9505K5220
11783A29127i618A9155J35803g6327G2510a63521j73825B83948C9679b25893J07398
11772a18495E2073J49676Q7435g1533b8967A27961g8399I6848K32270e8216o5448
11761a23664i802B55242c56926J54104H1558a8552j93261A80233C5060f7529F7556
11749A88966o4388a1882j1693H7087J25036a25924N0286A79531o3068e93957e6881
11737A52804d06160a50988L984B63360i5239m377b6824m51547F3575a69954c0196
11725E2738K9681J46619G6696K498J54624j15475L7308r306B0682b03679C0192
11713f5758o4825F8000J56989b08415d7767A40357M2589e7949E1889a5216A14253
$$ plain form
11701 283282 -177542 -74971 -27738 -16225 209393 -68886 -38665 16508 19467 44691 142410
11690 142410 -3755 -109655 39539 415614 -13152 -71715 -29503 -19187 106075 -38973 -150551
11679 -150551 -421345 114094 218216 368972 139144 -221702 109978 149740 -35710 250595
11668 -247677 -78593 198963 37750 172613 233797 -51686 238529 -16763 61561 244202 -192972
11656 -234628 136375 29330 109829 33470 147499 -180076 261878 -57703 -151769 179420
11645 20774 -12496 -24010 -175755 376554 -96652 -13268 73558 180030 -7143 178004 -154577
11633 -134427 -98539 237546 89551 -53515 -109452 35687 477037 -218904 -222409 30787 105654
11622 105654 -250520 -115948 146444 192186 136118 -21205 50750 -261230 74249 -80969 40763
$$ packed form
11701B83282a77542g4971b7738J1513B09393f8886L0221A6508K959K5224R7719
11690A42410c755j05900C9539L76075a3152n8563b9503J0316A06075c8973j11578
11679a50551k70794A14094J04122J50756A39144b21702A09978L9762c5710B50595
11668b47677g8593A98963C7750J34863O1184e1686B38529a6763F1561J82641a92972
11656b34628A36375B9330Q0499C3470J14029a80076B61878e7703r4066A79420
11645B0774a2496j1514j51745C76554i6652a3268G3558J06472g143A78004a54577
11633a34427L5888B37546H9551e3515n5937C5687M41350b18904l505C0787P4867
11622A05654b50520a15948A46444M5742n6068b1205E0750b61230G4249h0969D0763
$$ plain form
11610 -168529 174400 61218 -69618 186081 171544 -54164 89886 165533 67025 -178093 -157261
11599 -157261 -196659 288427 -127507 237726 -227883 13131 -229104 -82468 391 122486 -140331
11587 338356 131911 230925 351317 81773 -10158 410001 -95018 -86514 -137376 -61820 21878
11575 -117271 -58147 228871 265869 271550 -140804 117402 40645 -53254 150640 -22838 25685
11563 122161 132347 24824 188522 -22594 157738 -246308 458757 226345 188896 468744
11553 468744 54627 -18971 -17771 106429 369092 7099 300284 256910 213257 91040 241979
11542 241979 79811 123624 227548 99030 -361438 120375 48411 25738 143675 4779 318541
11531 318541 331231 54657 -43434 6529 -24889 183505 -201963 221166 -27608 292888 306528
$$ packed form
11610a68529A74400F1218f9618A86081j4537e4164H9886P5647F7025a78093K0832
11599a57261l9398B88427a27507B37726b27883A3131b29104h2468C91J22095a40331
11587C38356A31911R9014J20392H1773a0158D10001i5018Q504n0862f1820B1878
11575a17271e8147B28871L6998N681a40804A17402D0645e3254A50640b2838B5685
11563A22161J0186B4824J63698b2594A57738b46308D58757B26345l7449K79848
11553D68744E4627a8971J200A06429K62663G099K93185m3374m3653I1040J50939
11542B41979G9811M3813J03924I9030c61438A20375D8411k2673J17937D779L13762
11531C18541J2690E4657d3434F529b4889A83505b01963B21166b7608B92888J3640
$$ plain form
11520 306528 85863 84454 -25989 4057 154259 384328 235510 134581 180653 21483 324586
11509 324586 214336 67260 -30305 -23576 -25052 213661 117121 -23794 -277552 512720 -68166
11497 88802 495690 118853 90761 285673 12817 254234 18850 363357 153450 57056
11486 123018 53231 26070 -16035 96368 177339 265361 30143 296951 23024 70022 -6043
11474 135061 -46578 -49128 48016 -102158 121474 -18068 317354 386306 302320 282022 407764
11463 407764 364952 167818 257625 359587 257189 186778 -150424 98973 -121382 66746
11452 234931 32558 229190 -43817 196203 81147 -15972 73449 114527 8907 66617 207556
11441 207556 261044 71003 -354798 260260 131662 -138132 378695 76504 94789 60626
$$ packed form
11520C06528H5863j409b5989D057J50202K30069j48818j00929M6072B1483L03103
11509C24586j10250F7260c0305O729j476B13661r6540b3794k53758E12720f8166
11497H8802M06888A18853k8092J94912A2817K41417A8850L44507A53450E7056
11486A23018E3231B6070a6035I6368Q0971Q8022C0143K66808B3024M6998f043
11474A35061d6578k550D8016a02158A21474a8068C17354O8952q3986k0298J25742
11463D07764m2812A67818Q9807J01962j02398p0411a50424I8973a21382F6746
11452B34931C2558J96632d3817A96203H1147a5972G3449M1078H907N7710J40939
11441B07556N3488G1003c54798B60260j28598a38132C78695G6504J8285l4163
$$ plain form
11431 60626 -187433 179635 285831 27558 -120997 -199753 248373 -48725 260811 132343
11421 132343 -67699 -14144 114129 -238830 15865 48398 14440 136251 -252578 -75603 259830
11409 100326 8029 94904 134087 -144873 20004 -314564 -53131 231182 -282186 -181967 41249
11397 -168017 -58016 17990 130720 -119821 144628 -163370 -30435 43586 33561 -8066 -293655
11386 -293655 -156899 -50047 -9166 380859 -171448 -243683 293436 -93793 -130603 -39351 210053
11374 -122587 268344 -163117 -88237 168338 283857 -95963 -24286 -113948 -141587 11975 -231507
11362 232540 147375 -187268 -322204 59502 115964 74730 -289388 289927 250245 -268680
11351 95743 -31334 -253056 37981 186330 -167233 141351 -135198 -274795 4217 -189815
$$ packed form
11431F0626a87433A79635J06196B7558a20997p8756B48373d8725B60811j28468
11421A32343f7699a4144A14129b38830A5865L2533A4440J21811b52578g5603B59830
11409A00326H029Q6875L9183a44873B0004c14564e3131B31182b82186J00219D1249
11397a68017e8016A7990J12730a19821A44628a63370c0435D3586j0025h066k85589
11386b93655J36756e0047i166C80859a71448p2235B93436i3793l6810c9351B10053
11374a22587B68344a63117P4880A68338J15519i5963b4286q9662k7639A1975b31507
11362B32540q5165a87268j34936E9502N6462m1234b89388B89927l9682b68680
11351I5743c1334k21722C7981J48349a67233A41351a35198j39597D217a89815
$$ plain form
11340 -208349 -131745 -115360 78726 88731 246698 132014 -247581 26193 -80643 -93546 32999
11328 206494 -54889 98322 57422 -111247 -307778 228058 248852 -35164 19878 -82454 123978
11316 25083 74734 -322009 -67173 -110723 -219843 26238 112542 -67096 -120752 -387377 -117255
11304 -246419 -9174 89483 105349 74160 -106881 -132124 178175 7922 21206 155234 -36758
11292 262321 -89906 -95687 9583 105926 -205881 -170910 141151 64698 58015 -207720 133641
11280 22827 -42312 -184621 -291897 -175657 -89555 -89450 2220 -146206 -202431 5386 317498
11269 317498 112951 -335995 115436 103566 242963 318206 -84086 -7800 -51566 -66990 148118
11257 -164489 52378 -193719 95420 -204117 96827 -69659 -3715 -483779 -47127 143458 -240857
$$ packed form
11340b08349P6604J6385G8726J0005J57967j14684b47581B6193h0643j2903C2999
11328B06494e4889I8322m0900a11247j96531B28058K0794c5164A9878h2454A23978
11316B5083M9651c22009f7173m3550j09120B6238Q6304f7096n3656k66625a17255
11304b46419i174H9483J5866l1189a06881k5243A78175G922J3284J34028c6758
11292B62321h9906n781I583R6343b05881L4971A41151F4698o683b07720A33641
11280B2827d2312j42309j07276J16240Q6102J05B220a46206n6225E386L12112
11269C17498A12951c35995A15436j1870J39397P5243h4086g800m3766j5424A48118
11257a64489E2378a93719I5420b04117I6827f9659c715m80064d7127A43458b40857
$$ plain form
11245 -148919 -79955 354333 -10245 -93144 -222356 56851 -243956 -28384 -136819 -75014 -23429
11233 -56486 -168286 -182017 -267183 123409 -38730 -87977 -288530 -39803 -22270 -26453 -44488
11222 -44488 -156563 -274287 55515 -117348 82478 189528 94190 -384879 123973 -135034
11211 -137030 -86236 336166 306056 -36647 -205438 -158127 -24596 -223871 -18949 17771 44013
11200 44013 543237 -32230 -39640 -44267 141539 -292944 66536 -118456 305091 -38081 -304030
11189 -304030 34055 -133018 114975 -131524 11461 -330039 82404 146241 -487502 156354
11178 -125451 76770 14982 -44632 18234 -90904 -158288 264173 -489546 14311 154553 20033
11166 -484559 -251843 234404 109426 87409 111360 -117948 211394 -367371 -139484 -375658
$$ packed form
11245a48919O8964C54333a0245q2899j29212E6851b43956b8384j08435O1805b3429
11233e6486j11800j3731q5166A23409c8730m9247k00553c9803J7533m183j8035
11222d4488j12075j17724E5515a17348H2478J07050I4190c84879A23973a35034
11211a37030N0794C36166l0110c6647j68791M7311b4596j99275a8949A7771K6242
11200D4013M99224c2230p410m627A41539b92944F6536a18456C05091c8081k65949
11189c04030C4055a33018A14975a31524A1461c30039H2404O3837d87502A56354
11178a25451G6770A4982d4632A8234i0904o7384B64173d89546A4311J40242B0033
11166d84559K32716B34404A09426k2017K3951a17948B11394c67371a39484k36174
$$ plain form
11156 -375658 -10756 -91734 -28423 -159977 -196202 7987 -123028 -77773 -37448 -269195 38543
11144 108371 82810 -129291 -295327 247641 70491 -163009 117977 5542 -49326 292368
11133 200182 -142329 -115281 91798 -35099 -34888 88222 -31059 -105879 213910 -14940 186527
11121 -90478 142770 96410 157224 -23109 106192 -30720 -65313 -89878 36486 -190123 299116
11109 232720 7988 162053 -32105 423525 133388 -56052 -185080 51029 104292 115556 216740
11098 216740 -70538 4061 141527 194906 158026 129144 251165 214161 -76381 227823 -28493
11086 -48990 148020 159264 303881 226197 23878 87523 103688 178666 328082 400500 13917
11074 436512 241217 530734 194791 344805 243303 -43070 337843 299110 378666 112116
$$ packed form
11156c75658a0756q0978b8423j31554l6225G987a23028M5255c7448k31747C8543
11144A08371k5561a29291j66036B47641G0491a63009A17977E542d9326B92368
11133B00182a42329K7048I1798c5099K11H8222c1059p4820B13910a4940A86527
11121i0478A42770m6360O0814b3109A06192c0720l4593k4565C6486a90123B99116
11109B32720G988J54065c2105D23525A33388e6052j29028E1029N3263J1264J01184
11098B16740g0538D061J37466N3379l6880k8882J22021l7004g6381B27823b8493
11086d8990A48020J1244J44617p7684B3878O3645J6165P4978J49416P2418A3917
11074D36512j95295K89517A94791J50014j01502d3070C37843l8733P9556A12116
$$ plain form
11063 288259 287517 68521 448351 111115 452705 540441 446369 466137 491604 264746 287643
11052 287643 250206 523846 452240 275148 468438 397234 603345 628819 640068 713405 502438
11041 502438 699783 663797 681209 406044 726380 632251 761562 728814 859281 840518
11031 840518 1198915 660415 858764 758301 665930 1055751 1045678 724590 1005239 676193
11021 676193 590405 945166 513807 337779 901192 832528 558423 979394 891981 831810
11011 831810 660537 861472 669710 720698 814227 1062943 792374 407768 812537 870601
11001 870601 344862 478970 562315 660821 713982 349223 686619 680575 803131 419332
10991 419332 728729 931289 678711 511542 456905 635827 683744 512159 597964 508746
$$ packed form
11063B88259p42F8521L79830A11115L41590Q7736r4072J9768K5467k26858K2897
11052B87643l7437K73640p1606j77092J93290p1204K06111K5474J1249P3337k10967
11041E02438J97345l5986J7412k75165L20336r4129J29311l2748J30467j8763
11031H40518L58397n38500J98349j00463r2371L89821j0073l21088K80649l29046
11021F76193q5788L54761m31359j76028N63413o8664k74105M20971q7413o0171
11011H31810j71273K00935j91762N0988R3529K48716k70569l84606M04769N8064
11001H70601C44862J34108Q3345R8506N3161C49223L37396o044J22556l83799
10991D19332L09397K02560k52578j67169n4637J78922M7917j71585Q5805q9218
$$ plain form
10981 508746 882097 708596 841566 962198 809491 772759 739196 807091 693361 1064851
10971 1064851 1046846 897556 969232 1376939 1097712 1321601 1306929 1461350 1881704 1983760
10961 1983760 1677739 2187763 2866417 2928446 2878251 2679823 2928089 2538031 2669139 2713380
10951 2713380 2431099 2439879 2170664 2062604 1924369 2065806 1850009 2027233 2197200 1965829
10941 1965829 1827425 1989613 1789277 1216906 1672122 1211153 1112581 1127236 696284 702216
10931 702216 889744 322593 707855 154236 483614 388596 411203 123915 354152 415704
10921 415704 331051 -138602 282132 347232 -2397 -15895 224246 -17186 152334 74305 38271
10910 38271 -91203 150589 26887 56127 56312 -20856 -231107 -51558 -159447 135400 213841
$$ packed form
10981E08746L73351j73501J32970J20632j52707l6732l3563O7895j13730L71490
10971A064851j8005j49290P1676M07707k79227K23889j4672J54421M20354J02056
10961A983760l06021N10024O78654O2029n0195j98428K48266l90058J31108M4241
10951B713380k82281Q780k69215j08060j38235J41437k15797J77224J69967k31371
10941A965829j38404J62188k00336n72371M55216m60969r8572J4655m30952N932
10931G02216J87528C22593L85262A54236L29378r5018K2607A23915K30237O1552
10921D15704q4653a38602B82132O5100b397j3498B24246a7186A52334G4305l6034
10910C8271i1203A50589B6887K9240J85b0856k10251e1558j07889A35400P8441
$$ plain form
10899 213841 -76665 82256 -90702 141239 9479 92210 15423 -81270 -62695 47145 97299
10888 97299 136876 -131531 -27782 -148514 207746 317088 139157 -132879 333262 -86157
10877 148268 -12002 171791 159288 -66189 -47407 12266 -158542 -52433 166364 223501 -15886
10865 -72454 -289559 198186 -135708 122410 257675 18639 -115231 169703 62800 -52756
10854 309757 258968 -200995 105876 -141776 118560 62258 -227854 34581 122319 -83175
10843 29948 13403 318358 -48257 54359 -60103 179426 -117102 -80209 -83995 410130 235675
10832 235675 84139 13175 102897 95761 209511 -58844 -133268 242739 74165 100349 -130467
10820 -12628 42878 191075 8058 -114670 85744 -148367 8982 -230584 240351 -119556 209542
$$ packed form
10899B13841g6665H2256i0702A41239I479Q2731A5423h1270J8575D7145N0154
10888I7299L9577a31531b7782j20732B07746J09342A39157a32879C33262h6157
10877A48268a2002A71791j2503f6189J8782A2266a58542e2433A66364N7137a5886
10865g2454k17105A98186a35708A22410J35265A8639a15231A69703F2800e2756
10854C09757n0789b00995A05876a41776A18560n6302b27854C4581Q7738h3175
10843B9948A3403L04955d8257E4359f0103A79426a17102L6893l786D10130j74455
10832B35675H4139A3175Q9722p136J13750e8844p4424B42739G4165K6184a30467
10820a2628D2878J48197H058a14670H5744a48367H982b30584B40351a19556B09542
$$ plain form
10808 78557 -76790 -1537 -254158 -93025 -308973 99029 -134048 -73128 4118 276787 114317
10796 -283746 31217 -229556 -57055 -46121 -173563 -151633 -330133 -244946 46842 -186782 -67558
10784 -157695 -50737 -54495 -32421 186306 -111369 -46981 -33425 229633 -205747 -160580 159083
10772 -271536 -380932 71356 -63761 -105442 89429 29190 -185056 40704 123763 -205314 324503
10760 -128145 11006 203662 115512 323186 176229 182877 6404 -215415 -146637 109921 -2611
10748 63350 -139471 125119 -43938 -116221 -126737 20899 -13996 -78308 -335974 -216691 -250234
10737 -250234 -292799 138938 -58654 -244349 16976 -167753 45624 131558 -143509 77285 -360
10725 259474 -271471 67158 -40835 -87892 100955 -108081 79071 -237575 109503 -29893
$$ packed form
10808G8557g6790a537k52621i3025k15948I9029a34048O0920D118K72669A14317
10796b83746C1217b29556e7055J0934j27442K1930j78500Q5187D6842a86782f7558
10784a57695e0737l758K2074A86306a11369d6981J3556B29633b05747M5167A59083
10772b71536j09396G1356f3761m1681H9429B9190a85056D0704Q3059b05314C24503
10760a28145A1006J92656q8150K07674j46957O648F404b15415O8778A09921b611
10748F3350a39471A25119d3938p2283j0516B0899a3996o4312k57666J19283l3543
10737b50234m2565A38938e8654j85695A6976a67753D5624Q5934a43509G7285c60
10725B59474b71471F7158d0835m7057A00955a08081G9071b37575A09503b9893
$$ plain form
10714 -196370 61964 -285912 -611 322521 126 -277335 -285418 273018 4619 -157142 -20268 -151384
10702 -151384 -146475 -94164 141976 -402713 -262228 15171 -49688 -118722 -510298 -172963 -187719
10691 -187719 -172358 71657 21269 -63614 111148 -25588 -133955 -216358 -63929 151502 -230369
10679 -83019 -70583 -36639 -210776 -227492 -156498 -154505 55061 596379 35768 275359 59576
10667 49352 -63678 -174874 -531948 267287 -13928 -136425 -3887 5309 -120858 235507 93493
10655 -166612 54131 -137951 130737 -327343 -63690 -51051 -107676 17359 -327022 183118
10644 -24375 -76971 -479322 11982 -97805 -180425 -334406 -1632 29563 83936 -93121 -100460 -291012
10632 -291012 -373139 -28417 214731 -294562 43393 164075 -903 20625 -6375 -234003 197723
$$ packed form
10714a96370F1964b85912f11C22521A26b77335q083B73018D619a57142b0268j31116
10702a51384M909N2311A41976d02713J40485A5171d9688o9034l91576a72963j4756
10691a87719J5361G1657B1269f3614A11148b5588j08367q2403f3929A51502b30369
10679h3019J2436L3944j74137j6716P0994J993E5061N41318C5768K39591E9576
10667D9352f3678j11196l57074B67287a3928j22497c887E309a20858B35507I3493
10655a66612E4131a37951A30737c27343f3690J2639n6625A7359c27022A83118
10644b4375n2596m02351A1982i7805q2620j53981a632B9563N4373i3121p339j90552
10632b91012q2127b8417B14731b94562D3393J20682i03B0625f375k27628A97723
$$ plain form
10620 -158512 156180 374524 99383 104662 -307098 -220511 107605 55396 56534 257154 -107679
10608 39424 -148262 228919 52263 -123145 -357555 -50384 -87136 109202 -273863 -155621
10598 -155621 -51688 -92046 -86429 -259478 -53844 101233 348970 -154767 -96844 -81312 138229
10586 143885 34520 -36307 -16503 -129217 814 15469 -125007 35913 139763 -17404 -171445
10575 -171445 101392 -28384 -105349 17199 -14848 -244936 466688 128085 -224104 44240
10564 352997 -17052 2173 25660 11836 -151734 -64055 939 316566 -175358 -96605 -67249
10553 -67249 82050 172926 -442805 -101505 -98085 -58979 -85813 -19580 56148 -73874 83327
10541 135606 50296 52122 -5732 35656 46339 -31946 -86077 -117051 -52385 -172240 126402
$$ packed form
10620a58512A56180K18344I9383N279c07098Q6587A07605n2209J138K00620a07679
10608C9424a48262B28919E2263a23145k34410e0384l6752A09202b73863J18242
10598a55621e1688m0358N617j73049e3844A01233K47737a54767N7923J5532A38229
10586A43885C4520c6307a6503j12714H14J4655a25007C5913J03850a7404j54041
10575a71445A01392b8384p6965A7199a4848k30088D66688A28085b24104D4240
10564C52997a7052B173K3487A1836a51734f4055I39L15627a75358P8753K9356
10553f7249H2050R0876d42805a01505L420L9106k6834a9580E6148g3874H3327
10541A35606E0296J826e732C5656J0683c1946n4131l0974e2385j19855A26402
$$ plain form
10529 -267993 -18578 105275 -189705 118516 -165391 -149294 72256 -206588 -196473 -222905
10519 -222905 16217 -257741 -69054 70308 132230 225383 -249579 -70889 -102337 -79402 -86503
10508 -86503 12111 106498 47279 -42753 -166231 53461 -219410 -125046 -116687 -181174 99512
10496 -32180 -34603 88827 -282012 259892 126775 -442373 206528 -345481 -58702 26046 285950
10485 285950 -12283 -229106 51042 -105719 -113467 -103650 48906 -142734 -129038 37436 -209592
10473 125062 -218145 -7473 -44325 33852 201768 -57046 -42942 453995 68006 218283 292737
10462 292737 170420 -98422 -118321 374019 -74421 118421 -68861 62470 -256331 -165343 363089
10450 236625 100930 132905 -50298 54584 -106888 -145845 -25943 -19954 129993 -142412 86869
$$ packed form
10529b67993a8578A05275a89705A18516a65391J6097G2256b06588J0115k6432
10519b22905A6217b57741f9054G0308O1922R3153b49579g0889l1448K2935p101
10508h6503A2111R4387D7279d2753j23478E3461b19410R4364Q359o4487I9512
10496c2180k423H8827b82012B59892A26775d42373B06528c45481e8702B6046K59904
10485B85950a2283k16823E1042a05719p748R817D8906a42734J3696C7436b09592
10473A25062b18145g473l6852C3852J67916e7046J4104D53995F8006J50277P4454
10462B92737j22317i8422j9899C74019g4421A18421f8861F2470b56331R0988C63089
10450B36625A00930L1975e0298E4584a06888l8957b5943N989A29993a42412H6869
$$ plain form
10438 389027 -39780 172823 122891 360695 -50762 65329 319562 18020 104059 -110717 32317
10426 -39742 -232511 -154513 -260661 -239774 -294275 -163558 297972 315156 68377 119711 -489470
10414 183298 -188719 105713 -5963 -47488 -121656 124106 -58794 184410 -264232 -173103 97616
10402 -108794 -45048 -31486 29547 -73953 39703 -108704 -241402 -304299 -467173 -120793 -144653
10391 -144653 101728 -145745 -202926 99535 224544 94091 -74567 -73013 332356 -30760 58134
10379 173373 174489 -124532 48247 129628 -66282 149854 10271 148344 564564 88650 149977
10368 149977 76044 398092 112007 131320 232001 380199 253786 50995 478692 295974
10358 295974 183943 300388 512021 -102951 319289 342421 310074 213288 483187 472881
$$ packed form
10438C89027c9780A72823m9932K37804e0762F5329K54233A8020Q6039a10717C2317
10426c9742j92769P7998j06148K0887n4501J30717B97972J7184F8377N1334d89470
10414A83298a88719A05713e963m1525p4168A24106e8794A84410b64232R1129I7616
10402a08794d5048J3562B9547g3953C9703a08704j32698o2897j62874a20793k3860
10391a44653A01728a45745n7181I9535J25009I4091g4567J554C32356c0760E8134
10379A73373J116a24532D8247Q1381f6282A49854A0271J38073M16220H8650O1327
10368A49977p3933L22048A12007J9313J00681J48198j26413E0995M27697j82718
10358B95974j12031J16445K11633a02951C19289K3132l2347r6786K69899j0306
$$ plain form
10348 472881 373228 229875 466891 287901 487548 279664 179162 154893 258468 446316
10338 446316 339324 356423 333505 610611 381471 578437 418587 367984 197168 104836
10328 104836 482116 467992 395739 170387 22835 388924 46834 380360 -213300 193727
10317 377001 -17284 -318898 316900 193402 42508 -2255 -322031 181926 455079 115067
10306 172593 223469 -236597 -345932 -100870 407506 55652 188162 125393 -17946 -107028
10296 -107028 238146 -159415 80811 -303617 205283 -513194 51433 -95003 124329 -118005
10285 86928 -129826 163832 81975 152833 14105 126422 80332 -172919 13767 -120596 197876
10273 -238601 -77184 64693 172693 -142927 -21385 103799 97143 -26841 -34569 -212901 163193
$$ packed form
10348D72881r9653j43353K37016j78990J99647k07884j00502k4269J03575J87848
10338D46316j06992J7099k2918K77106k29140J96966j59850n0603j70816r2332
10328A04836L77280j4124p2253A70387B2835L66089D6834L33526b13300A93727
10317C77001a7284l01614C16900j23498D2508b255l19776A81926K73153A15067
10306A72593N0876b36597j09335a00870D07506E5652J32510o2769a7946q9082
10296a07028B38146a59415H0811c03617B05283e13194E1433i5003A24329a18005
10285H6928a29826A63832q1857P0858A4105J12317m6090a72919A3767a20596A97876
10273b38601g7184F4693J08000a42927b1385A03799o656b6841p728j78332A63193
$$ plain form
10261 -283356 -95391 209974 242023 -120371 315284 -54950 -110896 4500 50802 -2378 -54294
10250 -54294 129333 234936 -125142 222500 405284 362155 632152 380775 380159 397259 198034
10238 130368 -95238 161081 -173387 118975 -234789 76086 103435 144660 -117264 -515447
10228 -515447 -177353 -116600 -182536 -28212 -403335 -432579 85376 -312425 181093 28355 66011
10217 66011 -95472 53320 -40508 -89260 -34298 -53484 -174935 -10762 64861 -243800 27190
10205 -116165 -179909 237058 159739 -106868 -9386 -162348 -262680 2570 -327210 -64206 -72835
10194 -72835 -127341 -6175 250715 -107081 -23032 101820 41093 -113993 -312625 28939 -354033
10182 -24089 -148908 -21127 -25029 90744 299782 -143503 107107 42736 -36045 133255 70382
$$ packed form
10261b83356i5391B09974L2049a20371C15284e4950n5946D500M6302b378n1916
10250e4294A29333J05603a25142B22500J82784m3129K69997k51377o16J7100A98034
10238A30368i5238A61081a73387A18975b34789G6086K7349M1225a17264l98183
10228e15447a77353O0753o5936b8212l75123k9244H5376c12425A81093B8355L7656
10217F6011i5472E3320d0508m8752c4298j9186j21451a0762F4861b43800B7190
10205a16165o3744B37058p7319a06868i386j52962j00332B570c27210f4206q629
10194g2835n4506f175B50715a07081b3032A01820D1093a13993j98632B8939c54033
10182b4089j24819b1127l902I0744K09038a43503A07107D2736c6045A33255o2873
$$ plain form
10171 70382 -381198 432562 64080 317654 -159626 -521228 -221035 292718 61102 -57528
10160 -194848 -164008 -47355 -96576 -106089 58577 158319 -117320 -17015 -48624 -146351 -391987
10149 -391987 -247733 -148397 -40864 38277 -72209 20542 -17667 -258135 -549 308223 44684
10137 -44798 -435487 149984 -94607 86179 15146 -118360 191530 69501 97583 -6227 -46110
10126 -46110 64689 107910 10694 -118241 130921 -212190 -285791 112931 92081 388915 277964
10115 277964 -449885 63573 16913 -181674 -76707 52732 -21100 -51894 -131059 -239472 113571
10103 -102983 -218676 -222312 115541 -82168 -49628 -31297 -108533 -177341 -55712 -525149 -165049
10091 -223877 -349745 -249117 -83079 -219170 -345078 220798 164653 -384237 181756 -166759
$$ packed form
10171G0382c81198D32562F4080K53574a59626l61602b21035B92718F1102e7528
10160a94848L0840d7355m9221r513E8577R9742a17320a7015l1609r7727k45636
10149c91987J44254R9336d0864C8277g2209B0542a7667k40468e49C08223D4684
10137d4798l90689A49984i4607H6179A5146a18360A91530F9501K8082f227l9883
10126d6110F4689M3221A0694a18241A30921b12190p3601A12931k0850K96834j10951
10115B77964d49885F3573A6913a81674g6707E2732b1100l0794p9165j08413A13571
10103a02983j15693l636A15541h2168L2540J8331p7236o8808e5712m69437a65049
10091b23877j25868J00628h3079j36091j25908B20798n6145c84237A81756a66759
$$ plain form
10080 -91518 -84384 -276659 8303 -262474 -135072 223732 -69539 -284521 69010 -78423 236334
10068 -210343 -161826 151302 -108901 195709 -362401 -145310 -54420 -62459 122615 149034
10058 149034 3498 -93617 -254424 -120535 47146 -8555 197004 -146933 18434 -68062 179564
10046 -292737 -227304 -124953 130995 -5314 -69798 14999 -175759 -180198 -37270 -21334 16193
10034 18409 -237491 -41629 39778 296283 -210144 -10167 -158569 -239966 -521480 -96619 -143787
10023 -143787 -1866 74770 30737 200053 88467 -231341 -114764 -109245 87875 -46398 163185
10011 -311358 -122025 -193554 96737 -160051 -70619 -58413 -175410 -429597 -277909 93546
10000 -186508 -61284 -59389 15665 233323 265494 38743 -223461 122507 -117173 -203074 -136586
$$ packed form
10080i1518P134j92275H303b62474J27402B23732f9539k14982F9010g8423B36334
10068b10343M8517A51302a08901A95709c62401a45310e4420q039A22615K6419
10058A49034C498i3617j60807a20535D7146h555A97004a46933A8434f8062A79564
10046b92737O5433J02351A30995e314o4484A4999a75759m439c7270J5936A6193
10034A8409b37491d1629C9778K56505b10144a0167j48402q1397k81514i6619m7168
10023a43787a866G4770C0737J69316H8467b31341a14764N519H7875d6398A63185
10011c11358a22025p1529I6737a60051g0619J2206j16997k54187J51688I3546
10000a86508f1284J895A5665K17658L2171C8743b23461A22507a17173q5901O6488
$$ plain form
9989 -136586 -63432 -11318 -79658 26546 -81678 -403846 -50669 -285060 -145149 -255587 -125234
9977 -56822 -152656 -139887 -113955 -25939 -116895 -215304 97478 -191831 -231062 55558 -94139 234944
9964 -149260 4966 -183528 -205017 -373462 -158273 -12509 301885 -73398 180383 -58581 -128452
9953 -128452 -155120 -179685 -104250 -135256 128003 275754 150585 -234372 -65425 91306 102768
9942 102768 -173412 1676 100740 -301058 28258 30748 28900 106888 -15930 -194143 -514900
9931 -514900 -426101 -136739 147829 179199 -84615 -303398 -185639 142536 -145543 -220200
9921 -220200 -162911 -13881 -303710 4669 -28401 -6406 -67968 -385794 45750 -37629 131826
9909 226131 153695 -135542 -17019 10058 123687 -300568 314714 135437 -208824 175133
$$ packed form
9989a36586f3432a1318o8340B6546h1678l22168e0669k34391J39911j10438a25234
9977e6822r5834J2769K5932b5939r0956r8409I7478a91831l9231E5558i4139B34944
9964a49260D966a83528k1489j68445a58273a2509C01885g3398A80383e8581o9871
9953a28452k6668k4565P5435l1006A28003J47751j25169b34372f5425I1306J1462
9942A02768a73412A676R9064c01058B8258K490j848P7988a5930j78213l20757
9931e14900Q8799a36739A47829L1370h4615k18783J17759A42536a45543p4657
9921b20200N7289a3881k89829D669b8401f406o1562l17826D5750c7629A31826
9909B26131p2436a35542a7019A0058J13629c00568C14714A35437b08824A75133
$$ plain form
9898 -76423 -28695 -77046 262477 -148519 -197459 -100294 -112282 -357498 218236 -301012 -112389
9886 -20606 -58810 -216630 -91270 -151632 34017 -51122 -84842 -299219 168590 -316730 183815
9874 -269520 31427 172447 -14642 -1332 -55969 -298884 -58288 -94151 100261 -282256 -179638
9863 -179638 -80059 -135746 203456 -207225 -207594 -125694 -86428 -73567 408425 -132882 -251776
9852 -251776 120367 -279799 -9565 -66121 -28308 -248305 -71408 -219897 -55987 -88050 6638
9840 -195984 83256 104319 58747 -144898 -85796 -167553 -163066 -327347 57633 -185953 -266230
9829 -266230 -57776 278561 141095 111593 -238152 -165164 -41238 112828 44261 -208557 201959
9817 -348230 278689 -158108 -119588 153325 -302647 74075 -109618 -63683 -105929 -47917 -150579
$$ packed form
9898g6423b8695m8351B62477a48519m8940R7165j1988k45216B18236c01012a12389
9886b0606l8204j57820i1270o0362C4017e1122l3720k14377A68590c16730A83815
9874b69520C1427J41020a4642a332n4637k42915e8288l5863A00261b82256J02618
9863a79638h0059n5687B03456b07225l69Q1900L9266J2861D08425a32882j18894
9852b51776A20367b79799i565n6556b8308k19997g1408j48489e5987l2063F638
9840a95984H3256K1063m5572a44898N9102q1757M487j64281E7633a85953q0277
9829b66230e7776B78561j37466k9502b38152P2988d1238A12828D4261b08557B01959
9817c48230B78689a58108L8520A53325c02647G4075a09618M5935m2246d7917j02662
$$ plain form
9806 -150579 120010 -14364 -177176 -240066 -243238 -298776 -136545 258717 -213737 -138221 287818
9794 -42659 -60761 -52166 -299479 -112013 -170856 43259 -244803 -132988 122822 218119 -284140
9782 -56517 3673 113604 -97767 -54881 -168878 -96047 -48700 72696 -209744 -30312 -47042
9771 -47042 -28632 -135344 -57213 -162968 28731 133971 97808 -95231 -172026 -34759 -155978
9760 -155978 152708 83857 -98522 -126502 -2180 -287983 -381660 -87304 -62492 -72918 -104882
9749 -104882 -95177 -84268 -170000 -1937 17261 -77230 171028 -268327 -244251 -137385 -203592
9738 -203592 -20701 102511 -1473 -69618 -270703 175498 19350 29343 -178031 -62723 -289094
9727 -289094 -194176 -11313 -42628 -367750 43576 35161 -83403 -105242 -288598 69260 369338
$$ packed form
9806a50579A20010a4364j62812o2890l172n5538a36545B58717b13737P5516B87818
9794d2659j8102Q595k47313a12013n8843D3259b44803J11815A22822R5297b84140
9782e6517C673J09931i7767M2886j13997P2831M7347G2696b09744c0312j6730
9771d7042J8410j06712e7213j05755B8731J05240l6163i5231p6795c4759j21219
9760a55978A52708o8851i8522k7980b180k85803r3677h7304K4812j0426l1964
9749a04882R705J0909q5732a937A7261g7230A71028b68327K4076J06866o6207
9738b03592b0701A02511a473o8145k01085A75498A9350R993a78031f2723k26371
9727b89094R4918a1313l1315l25122D3576q415h3403k1839j83356F9260L00078
$$ plain form
9716 369338 -170211 143154 -133734 66248 79581 -12666 -150535 -138587 -313740 -270094 -60384
9704 -75787 -157228 -364239 -9833 -311981 -6317 -57653 -52905 -316777 48298 -32500 -230333 -190577
9692 -190577 24173 127990 -38321 -271964 18214 -568376 210445 -166021 -67747 52980 -305870
9680 -99607 -197456 67963 147667 -259530 168600 -173451 -308417 -168602 -220252 206507 -213589
9668 117847 -170668 -220531 -309274 119188 -40371 -404159 -115153 73693 -173453 -70333 -387864
9657 -387864 38871 -85958 -127352 -100688 -245937 -229207 127604 -156989 -130419 -332057 -1475
9645 -69931 -203616 -185464 -277047 135616 -157911 -127277 110766 -149321 103853 -155712
9634 184157 -126347 7181 72859 77250 104392 -143029 92871 -81199 -13967 168354 -197173
$$ packed form
9716C69338a70211A43154a33734F6248J3333a2666j37869J1948j75153M3646f0384
9704g5787q1441k07011i833l02148f317n1336M748k63872D8298c2500j97833L9756
9692a90577B4173J03817c8321k33643A8214e68376B10445a66021f7747E2980c05870
9680i9607r7849F7963P9704b59530A68600a73451j34966J39815n1650B06507b13589
9668A17847a70668m9863q8743A19188d0371l63788a15153G3693a73453g0333l17531
9657c87864C8871h5958m1394K6664j45249J6730A27604a56989K6570k01638a475
9645f9931j33685J8152r1583A35616a57911L0634A10766a49321A03853a55712
9634A84157a26347G181O5678M391K7142a43029I2871h1199a3967A68354a97173
$$ plain form
9622 -288091 132625 -116259 -268707 125577 -75573 -214380 -152338 -118395 -130406 -3447 -177831
9611 -177831 -213432 -302239 -363905 -117228 -163963 -118087 124705 125994 -152120 95022 251364
9600 251364 -321357 -325380 -214906 -134667 -174746 244524 70890 -228507 -395176 -108987 -171390
9589 -171390 -80519 75310 92577 32062 31522 -273413 55163 -188476 552285 -76420 56333
9577 -38066 147079 -51709 -120179 -234513 -335808 -201968 298733 -283718 -290624 -166775 -96705
9566 -96705 82157 76386 209640 -215093 -85505 -262519 -224804 -28409 -383577 -61510 31135
9554 -124553 -305376 -70598 36703 216096 12878 -118033 -98483 -171872 19115 -14946 68922
9542 -18082 -74931 -526 -329750 -38675 -308810 30798 96501 18913 106837 155269 -235653 61525
$$ packed form
9622b88091A32625a16259j52448A25577g5573j38807O2042L3943j2011c447j74384
9611a77831l5601q8807o1666a17228m6735M5876A24705J289a52120I5022J56342
9600B51364c21357m023J10474Q0239m0079B44524G0890b28507j66669a08987o2403
9589a71390h0519G5310J7267C2062n40b73413E5163a88476E52285g6420E6333
9577c8066A47079e1709o8470j14334j01295J33840B98733b83718o906J23849P0070
9566i6705H2157n771J33254b15093h5505j77014L7715b8409l55168f1510C1135
9554a24553j80823g0598C6703J79393A2878a18033J9550p3389A9115a4946F8922
9542a8082n6849e26l29224c8675k70135C0798O5703A8913Q7924M8432b35653F1525
$$ plain form
9529 -170579 -47247 -345026 108819 -88661 -154185 -97764 -130064 -254116 32891 64569 -243356
9517 -72365 92267 55546 -323713 -327249 -86497 -68050 -353155 -77436 -44272 -161279 101725
9505 -511303 -153042 253435 -33526 -221155 -41767 103825 -14550 153954 91804 -240428
9494 18046 -31874 -115338 143040 125203 -151340 -32063 177183 -26724 84683 -220321 -18494
9482 -194189 -366790 -49902 -524139 -256706 -83594 -120752 -157950 22051 20197 2214 37838
9471 37838 166196 -261844 47490 163207 173862 -165363 -11348 -83897 -209701 524375 84360
9459 -33529 -90266 -442638 -277278 -223667 -196392 67740 127709 -96040 -117135 -16962 -115573
9448 -115573 -140978 -11507 -90035 -332971 -214183 -68556 124996 879 171176 64470 256789
$$ packed form
9529a70579d7247k97779A08819h8661o5524N6421l2300j24052C2891L1678b43356
9517g2365I2267l6721c23713l536h6497J8447k85105g7436L3164j17007A01725
9505e11303a53042B53435c3526j87629d1767A03825a4550A53954o2150b40428
9494A8046c1874q3464A43040j7837a51340c2063A77183b6724H4683b20321a8494
9482a94189j72601d9902m74237b56706h3594l7158l7198B2051j854B214L5624
9471C7838J28358b61844D7490J15717J0655a65363a1348p2549j25804E24375H4360
9459c3529n6737l52372J65360N3611K7275F7740N9969i6040k1095a6962r8611
9448a15573k5405a1507p8528k42936J18788f8556A24996H79J70297F4470J92319
$$ plain form
9437 256789 -222889 296143 219629 7823 188487 67870 -186091 -51248 -241631 -405438 -216786
9426 -216786 -54967 41700 -59117 -218484 -32295 -49869 65701 13502 149734 72079 -118227
9414 -114500 250164 -102181 113539 -54078 192445 -120047 -11416 34880 118952 128398 97735
9403 97735 -254831 -30377 12693 50182 221779 36446 44188 -60560 -96339 -392797 -155773
9391 73433 76604 -244387 -58780 -210009 30558 27033 -10279 -30017 -81206 -68248 -87086 -219634
9379 -219634 22741 -309708 -154931 -426352 181563 -105688 80935 -278035 -58682 -112846
9369 -112846 -225391 -133722 36104 -356763 -532457 -213399 85738 81559 -291581 -321777 45908
9357 -58141 -105749 151266 -319229 33737 -62210 -56569 -511140 -374681 -280916 19166 -37776
$$ packed form
9437B56789b22889B96143p6514G823J80664F7870a86091e1248j90383j63807J88652
9426b16786e4967D1700e9117j59367c2295j7574F5701A3502J36232G2079a18227
9414a14500B50164a02181A13539e4078A92445a20047a1416C4880Q4072R446l0663
9403I7735b54831c0377A2693L7489J71597C6446P742f0560l5779k96458a55773
9391G3433L171b44387e8780j51229C0558l525a0279j9738n1189J2958j8838j32548
9379b19634B2741c09708J54777k71421A81563a05688H0935b78035e8682n4164
9369a12846j12545R1669C6104c56763j75694b13399H5738m179b91581l0196D5908
9357e8141m7608A51266c19229C3737f2210N641m54571J36459R3765A9166c7776
$$ plain form
9345 -52868 -89691 19029 -179366 -285764 -230405 -11379 -180434 70086 175780 51611 -236725
9333 -241662 -250833 -121806 -43186 -32833 -174605 -77592 -769 14789 -118436 251243 122288
9321 220979 -201809 40229 128389 63097 -313553 -213030 -256415 104423 -65875 -11386 144918
9309 111007 -92482 -76836 -58575 86820 111859 36779 -123956 46139 -49388 -19743 104496
9297 332863 -20951 -41756 -128216 67817 62548 162140 89319 91086 41698 110168 -41517 -234552
9285 -234552 229355 94401 -182729 -11036 129660 88649 -54768 6167 -141443 -263582 34346
9273 -53863 -152919 40387 -418133 -9052 -52226 -12852 -376347 -132419 -174121 209419 62099
9261 47841 -51843 -195427 -131985 63918 -52253 -27696 1645 -231348 112435 98308 -165800
$$ packed form
9345e2868l6823A9029a79366j06398N5359a1379j69055G0086J05694E1611b36725
9333b41662r171a21806d3186J0353j41772g7592g69A4789a18436B51243A22288
9321B20979b01809D0229Q8160F3097c13553J00523m3385A04423f5875a1386A44918
9309A11007i2482J5646J8261H6820K5039C6779a23956D6139d9388a9743A04496
9297C32863b0951k0805q6460F7817n269R9592p2821J767D1698O8470d1517j93035
9285b34552B29355I4401a82729a1036A29660m1011e4768F167a41443j22139C4346
9273e3863r9056D0387d18133i052m3174a2852l63495a32419m1702B09419F2099
9261D7841e1843j43584O3442F3918e2253K4557A645b31348A12435j4127a65800
$$ plain form
9249 -121191 -259191 47436 -18807 -202295 -172972 -296160 39089 69716 343228 -51520 141819
9237 19679 95754 -221723 -6727 -60605 105340 -105647 -93808 -41301 19261 5703 -125144
9225 -68264 200330 -371868 -126111 -63891 -109279 -147387 90918 -69710 303449 270364 -60650
9213 -180416 58003 249118 207186 -28244 -207403 -238258 302778 -482207 -330015 -9020 -384051
9202 -384051 -222099 -112215 -191986 221223 -73904 228913 -55447 -132617 78101 -51140 276493
9190 160330 -13910 -67908 -417064 -336300 -46943 70903 130488 -58513 236603 -235585 -150534
9179 -150534 -65103 128943 19013 -45470 -323089 -228688 -108094 -101479 -181943 -17693 -224573
9168 -224573 172969 -171694 -235593 58685 1718 -40623 26288 600 112004 -138316 -65814
$$ packed form
9249a21191j38000D7436a8807j83488K9323j23188C9089L0627K73512e1520A41819
9237A9679P6075b21723f727n3878A05340a05647J1839d1301A9261E703a25144
9225f8264B00330c71868a26111O2220m5388l8108I0918f9710C03449l3085f0650
9213a80416E8003J91115m1932b8244j79159l0855C02778d82207J52192i020l75031
9202c84051J61952J09884p9771B21223g3904B28913e5447p7170G8101e1140B76493
9190A60330a3910n3998l49156Q0764d6943G0903N9585e8513B36603b35585Q5051
9179a50534f5103A28943A9013d5470k77619R4401a08094O615q0464a7693k06880
9168b24573A72969a71694o3899E8685A718d0623B6288F00J11404a38316f5814
$$ plain form
9156 -181925 -8138 -96755 57560 -39488 -18984 -117463 157943 44559 345290 -376507 176525
9144 -90811 70551 -72254 -326722 -14431 -9537 -84975 -180778 14830 -58076 -180819 6681 -136616
9131 211383 -136253 -94754 60533 -352948 -149540 -311039 42306 120554 116485 -77229 -106055
9120 -106055 66836 291173 145255 -331528 -296942 46624 15765 -10511 -122726 -125179 368811
9108 101524 -54138 28499 -140795 -119424 45720 -105097 -32670 391442 -321719 85011 -66998
9096 243828 -227801 -9721 -82357 131059 132201 119190 -74392 -9704 71056 -164689 60840 37487
9084 37487 -501893 237296 -1762 170831 -200250 -338483 60030 -286203 -210332 -4680 -330924
9073 -330924 -42954 -67211 -194413 6561 85751 15895 168174 -160399 -106723 -76981 98368
$$ packed form
9156a81925h138q8617E7560c9488a8984r8479A57943D4559L00731c76507A76525
9144i0811G0551g2254k54468a4431M894p5438r5803A4830e8076j22743F681a36616
9131B11383a36253M1499F0533c52948a49540j61499D2306P8248m069g7229k8826
9120a06055F6836K24337A45255c31528L4586D6624A5765a0511j12215k453C68811
9108A01524e4138B8499a40795K1371D5720a05097c2670C91442c21719H5011f6998
9096B43828b27801i721p2636A31059J142j3011g4392i704G1056a64689F0840k3353
9084C7487e01893B37296a762A70831b00250j38233F0030b86203P5871d680l26244
9073c30924d2954k4257j27202F561P9190A5895J52279a60399N3676K9742I8368
$$ plain form
9061 -276895 -265237 -281284 -237119 -71420 -19265 -466419 -220672 -270269 -29149 -80920 187577
9049 -16696 -113064 218437 -154900 -203565 -159035 64624 -284740 -398800 -280758 143038 -67806
9037 -87159 93022 -139001 -427318 -313451 69553 -125980 160447 -312757 -5061 16224 104040
9026 104040 40744 -308920 81584 -75386 48044 117565 -283360 -251646 -175829 -134661 -40916
9014 -209182 -347874 -868 39330 86863 250376 218919 93069 41164 -265988 -214744 -76113
9002 -77689 -111705 -107609 -218744 -111354 232245 31049 -276074 -67400 -338086 69027 -176136
8990 33064 -104604 -285476 -28620 -232010 -188852 109741 3992 -17749 -73195 52198 235487
8979 235487 -254142 207022 -165395 10804 -76246 224073 251031 82792 98826 26487 -110861
$$ packed form
9061b76895J1658j6047M4165g1420a9265m47154b20672m9597b9149n1771A87577
9049a6696r6368B18437a54900m8665M4530F4624b84740j14060J18042A43038f7806
9037h7159I3022a39001k88317J13867F9553a25980A60447c12757e061A6224Q7816
9026A04040D0744c08920H1584g5386D8044O9521b83360L1714P5817M1168d0916
9014b09182j38692h68C9330M7533J63513l1457I3069D1164b65988N1244g6113
9002g7689l4016M096j11135J07390B32245C1049b76074f7400k70686F9027a76136
8990C3064a04604j80872b8620k03390M3158A09741C992a7749n5446E2198J83289
8979B35487b54142B07022a65395A0804g6246B24073K6958H2792J6034B6487a10861
$$ plain form
8967 139306 192418 12610 222402 -6027 72977 -279045 -206752 -362112 -160376 -102363 -196243
8956 -196243 -221329 39991 -51351 64793 202315 92267 -238851 50327 106569 -115615 -255526
8945 -255526 52080 -70546 -94612 -3118 60023 -106323 -233414 19836 -158648 289511 216896
8934 216896 -248125 -110768 -256428 232790 151690 3677 81600 369080 -127616 -19047 -249636
8923 -249636 -72142 -5497 -174325 -69868 193014 269155 256657 630098 454360 88840 233862
8912 233862 180342 398271 983976 1312109 2488821 4296543 9782341 6566715 3130969
8902 1830825 1209263 776172 268897 198375 77788 -43199 468337 -126149 221329 -22826
8891 105607 -3669 25816 20357 46224 -39943 295275 82303 -241650 91322 119470 -255664
$$ packed form
8967A39306N3112A2610K09792f027G2977b79045P2293j55360a60376N8013r3880
8956a96243k5086C9991e1351F4793J37522I2267b38851E0327N6242a15615j39911
8945b55526E2080g0546k4066c118F0023a06323j27091A9836a58648B89511p2615
8934B16896b48125a10768j45660B32790q1100C677P7923K87480a27616a9047k30589
8923b49636g2142e497j68828f9868A93014P6141j2498L73441j75738H8840J45022
8912B33862n3520K17929N85705L28133J176712J807722N485798l215626C130969
8902A830825o21562m33091B68897p0522G7788d3199D68337a26149B21329b2826
8891A05607c669B5816n459K5867c9943B95275H2303b41650I1322K8148b55664
$$ plain form
8879 -49733 140950 -215335 163352 74395 -213422 -161323 -219248 -261124 -343699 45803 -8461
8867 25372 -100859 -123536 -261726 -14 -212827 60664 31972 58457 -188316 16086 -57962 -254488
8855 -254488 -7030 -160780 -119705 -14545 110395 -87483 -343084 -238580 -370404 192684 221584
8844 221584 -267954 211335 145639 -365438 -23015 198778 15291 -132939 -324097 61139
$$ packed form
8879d9733A40950b15335A63352G4395b13422N2099n7925m1876q2575D5803h461
8867B5372a00859k2677j38190a4k12813F0664k8692K6485a88316A6086e7962j96526
8855b54488g030j53750M1075a4545A10395h7483k55601J04504j31824A92684K8900
8844B21584b67954B11335o5696c65438b3015A98778A5291a32939j91158F1139
$$ [...]
##END NTUPLES=NMR SPECTRUM
##END=
