
##TITLE=UV1140_M5-1005-1002_6279251_OJ9zw3KIJ4
##JCAMPDX= 6.0         $$ Bruker NMR JCAMP-DX V2.0
##DATA TYPE= NMR SPECTRUM
##DATA CLASS= NTUPLES
##ORIGIN= BRUKER
##OWNER= Administrator
$$ 1.72 TOPSPIN		Version 2.1
$$ 2012-06-03 18:19:45.031 -0500  Administrator@TOPSPIN
$$ Compression mode = diff/dup
##.OBSERVE FREQUENCY= 400.13188235
##.OBSERVE NUCLEUS= ^1H
##.ACQUISITION MODE= SIMULTANEOUS (DQD)
##.ACQUISITION SCHEME= undefined
##.AVERAGES= 8
##.DIGITISER RES= 22
##SPECTROMETER/DATA SYSTEM= spect
##.PULSE SEQUENCE= zg30
##.SOLVENT NAME= COFFEE_meoh
##.SHIFT REFERENCE= INTERNAL, COFFEE_meoh, 1, 14.98061
##AUDIT TRAIL= $$ (NUMBER, WHEN, WHO, WHERE, PROCESS, VERSION, WHAT)
$$ ##TITLE= Audit trail, TOPSPIN		Version 2.1
$$ ##JCAMPDX= 5.01
$$ ##ORIGIN= Bruker BioSpin GmbH
$$ ##OWNER= Administrator
$$ $$ C:\Bruker\TOPSPIN/data/COFFEE/nmr/UV1140_M5-1005-1002_6279251_OJ9zw3KIJ4/10/pdata/1/auditp.txt
$$ ##AUDIT TRAIL=  $$ (NUMBER, WHEN, WHO, WHERE, PROCESS, VERSION, WHAT)
(   1,<2012-06-03 18:19:37.609 -0500>,<Administrator>,<TOPSPIN>,<go>,<TOPSPIN 2.1>,
      <created by zg
	started at 2012-06-03 18:18:31.000 -0500,
	POWCHK enabled, PULCHK disabled,
       configuration hash MD5:
       D5 CA 7A 23 FE 6B EE E2 50 67 74 61 24 F7 5E 3B
       data hash MD5: 64K
       C7 E9 D3 04 20 E2 50 23 D9 2C 9F 01 4F BC FC 0B>)
(   2,<2012-06-03 18:19:40.796 -0500>,<Administrator>,<TOPSPIN>,<proc1d>,<TOPSPIN 2.1>,
      <Start of raw data processing
       efp LB = 0 FT_mod = 6 PKNL = 1 PHC0 = 0 PHC1 = 0 SI = 32K 
       data hash MD5: 32K
       13 62 E1 43 15 4B A2 BA 88 2A AB EB 5A B5 6C 57>)
(   3,<2012-06-03 18:19:41.171 -0500>,<Administrator>,<TOPSPIN>,<proc1d>,<TOPSPIN 2.1>,
      <pk PHC0 = 210.8221 PHC1 = 0 
       data hash MD5: 32K
       3C D2 59 C4 06 2F 12 C6 CF 61 F0 71 0A 62 37 13>)
(   4,<2012-06-03 18:19:41.234 -0500>,<Administrator>,<TOPSPIN>,<proc1d>,<TOPSPIN 2.1>,
      <abs ABSG = 1 
       data hash MD5: 32K
       FD DD C6 13 FE FA B1 B6 BA C1 1E 86 E3 38 2A 4D>)
(   5,<2012-06-03 18:19:41.265 -0500>,<Administrator>,<TOPSPIN>,<proc1d>,<TOPSPIN 2.1>,
      <abs ABSG = 2 
       data hash MD5: 32K
       E7 D4 EE 88 ED 0B 92 65 8F DA AF 09 F8 35 5B D0>)
(   6,<2012-06-03 18:19:41.296 -0500>,<Administrator>,<TOPSPIN>,<proc1d>,<TOPSPIN 2.1>,
      <abs ABSG = 3 
       data hash MD5: 32K
       13 04 9D A3 57 3C 9E 11 5E DD AC 50 52 F7 0B 5B>)
(   7,<2012-06-03 18:19:41.328 -0500>,<Administrator>,<TOPSPIN>,<proc1d>,<TOPSPIN 2.1>,
      <abs ABSG = 4 
       data hash MD5: 32K
       8D C0 3B 87 35 F7 FB 21 ED 2D 80 20 86 BA 63 9D>)
(   8,<2012-06-03 18:19:41.359 -0500>,<Administrator>,<TOPSPIN>,<proc1d>,<TOPSPIN 2.1>,
      <abs ABSG = 5 
       data hash MD5: 32K
       6A 44 24 C6 31 09 F6 DC 81 84 13 2F 7E 98 80 93>)
$$ ##END=
$$ 
$$ $$ hash MD5
$$ $$ 57 AA 0A FC B0 32 39 BA 13 4C 3D 54 43 43 15 B0
##$RELAX= 
##$RELAX= 
##$RELAX= 
##$RELAX= 
##$RELAX= 
##$RELAX= 
##$RELAX= 
$$ Bruker specific parameters
$$ --------------------------
$$ [...]
150 150 150 150 150 150 150 150
##$TP07= 0
##$TPNAME0= <>
##$TPNAME1= <>
##$TPNAME2= <>
##$TPNAME3= <>
##$TPNAME4= <>
##$TPNAME5= <>
##$TPNAME6= <>
##$TPNAME7= <>
##$TPOAL= (0..7)
0.5 0.5 0.5 0.5 0.5 0.5 0.5 0.5
##$TPOFFS= (0..7)
0 0 0 0 0 0 0 0
##$TUNHIN= 0
##$TUNHOUT= 0
##$TUNXOUT= 0
##$USERA1= <user>
##$USERA2= <user>
##$USERA3= <user>
##$USERA4= <user>
##$USERA5= <user>
##$V9= 5
##$VALIST= <valist>
##$VCLIST= <CCCCCCCCCCCCCCC>
##$VD= 0
##$VDLIST= <DDDDDDDDDDDDDDD>
##$VPLIST= <PPPPPPPPPPPPPPP>
##$VTLIST= <TTTTTTTTTTTTTTT>
##$WBST= 2048
##$WBSW= 25
##$XGAIN= (0..3)
0 0 0 0
##$XL= 0
##$YL= 0
##$YMAX_a= 537536
##$YMIN_a= -648601
##$ZGOPTNS= <>
##$ZL1= 120
##$ZL2= 120
##$ZL3= 120
##$ZL4= 120
##$ABSF1= 14.98061
##$ABSF2= -5.57192
##$ABSG= 5
##$ABSL= 3
##$ALPHA= 0
##$AQORDER= 0
##$ASSFAC= 0
##$ASSFACI= 0
##$ASSFACX= 0
##$ASSWID= 0
##$AUNMP= <proc_prof1d_extract_pilot.lims>
##$AXLEFT= 0
##$AXNAME= <>
##$AXNUC= <1H>
##$AXRIGHT= 0
##$AXTYPE= 0
##$AXUNIT= <>
##$AZFE= 0.1
##$AZFW= 0.1
##$BCFW= 0
##$BC_mod= 0
##$BYTORDP= 0
##$COROFFS= 0
##$CY= 15
##$DATMOD= 1
##$DC= 0
##$DFILT= <>
##$DTYPP= 0
##$F1P= 0
##$F2P= 0
##$FCOR= 0.5
##$FTSIZE= 32768
##$FT_mod= 6
##$GAMMA= 0
##$GB= 0
##$INTBC= 1
##$INTSCL= 1
##$ISEN= 128
##$LB= 0
##$LEV0= 0
##$LPBIN= 0
##$MAXI= 10000
##$MC2= 0
##$MEAN= 0
##$ME_mod= 0
##$MI= 0
##$NCOEF= 0
##$NC_proc= -8
##$NLEV= 6
##$NOISF1= 0
##$NOISF2= 0
##$NSP= 0
##$NTH_PI= 0
##$NZP= 0
##$OFFSET= 14.98061
##$PC= 1
##$PHC0= 210.8221
##$PHC1= 0
##$PH_mod= 1
##$PKNL= yes
##$PPARMOD= 0
##$PPDIAG= 0
##$PPIPTYP= 0
##$PPMPNUM= 2147483647
##$PPRESOL= 1
##$PSCAL= 4
##$PSIGN= 0
##$PYNMP= <proc.py>
##$REVERSE= no
##$SF= 400.13
##$SI= 32768
##$SIGF1= 0
##$SIGF2= 0
##$SINO= 400
##$SIOLD= 32768
##$SPECTYP= <>
##$SREGLST= <1H.CDCl3>
##$SSB= 0
##$STSI= 32768
##$STSR= 0
##$SW_p= 8223.68421052632
##$SYMM= 0
##$S_DEV= 0
##$TDeff= 65536
##$TDoff= 0
##$TI= <>
##$TILT= no
##$TM1= 0
##$TM2= 0
##$TOPLEV= 0
##$USERP1= <user>
##$USERP2= <user>
##$USERP3= <user>
##$USERP4= <user>
##$USERP5= <user>
##$WDW= 1
##$XDIM= 32768
##$YMAX_p= 459836084
##$YMIN_p= -696742
##$CURPLOT= <Network HP LaserJet P1505>
##$CURPRIN= <$Network HP LaserJet P1505>
##$DFORMAT= <normdp>
##$LAYOUT= <+/1D_H.xwp>
##$LFORMAT= <normlp>
##$PFORMAT= <normpl>
##$SURQMSG= 1
$$ End of Bruker specific parameters
$$ ---------------------------------
##NTUPLES= NMR SPECTRUM
##VAR_NAME=  FREQUENCY,     SPECTRUM/REAL,   SPECTRUM/IMAG
##SYMBOL=    X,             R,               I
##VAR_TYPE=  INDEPENDENT,   DEPENDENT,       DEPENDENT
##VAR_FORM=  AFFN,          ASDF,            ASDF
##VAR_DIM=   32768,         32768,           32768
##UNITS=     HZ,            ARBITRARY UNITS, ARBITRARY UNITS
##FACTOR=    0.250966925370066, 1,           1
##FIRST=     8223.43324360095, -9574,        -32442
##LAST=      0,             -195848,         -352260
##MIN=       0,             -696742,         0
##MAX=       8223.43324360095, 459836084,    0
$$ Real data points
##PAGE= N=1
##DATA TABLE= (X++(R..R)), XYDATA
$$ [...]
23831 245492 92478 -328915 -218241 56336 -18990 113222 -2066 -191742 -19733 -371581 85133
23819 -243538 101779 -29181 -43810 -37032 -189719 -102114 -275275 -79387 44203 55675 -88476
23807 -132036 -287891 -333877 -48484 313494 50581 -202665 -289535 234165 64909 -315115
23796 55812 57184 -85667 -103535 -21045 200237 -259199 -121243 -154227 172019 -128199 294471
23784 28248 167418 -134740 195771 -166916 172015 -46397 64345 345257 168315 32075
23773 -250328 -198532 -9110 -256185 174876 -60810 337626 191591 -159462 129729 -90609
23762 -64301 192793 -100265 -33722 126877 107340 188281 63652 84373 98559 184851 -112902
23750 339358 -221606 -37136 170163 137670 -11591 -20837 -49442 127812 -154668 24738 -120679
23738 -234856 -18821 245561 33634 -53795 -62194 91512 -149443 184489 -58647 22860 143427
23727 143427 -267307 -84840 165654 -63689 143515 -150782 337123 -60438 37308 -33451
23716 -73842 24047 -37440 -316388 109915 -160871 81631 -41048 284548 71447 -70122 -277069
23705 -277069 97357 -407325 37168 43788 43045 -66487 222418 -197722 9820 -340743 -387220
23694 -387220 311901 -241803 -72582 48520 -175737 -107096 -94223 -126246 215383 137188 -53798
23682 180578 -75616 -289687 255481 429600 55864 170866 312484 -151313 310966 30183
23671 -285018 14300 -16696 71737 -266856 -29990 -10004 84107 -8603 260574 -267540 -85650
23659 216987 -53764 29960 47542 -33286 -191351 108281 41716 -107496 153545 159800 -89080
23647 104407 307260 -232841 -305128 44730 67274 -115267 204322 318974 48912 -18963
23636 -136801 -326581 -66190 37433 -300883 328382 -384469 -269659 -44823 74772 -1739 27535
23624 164040 83749 182692 -178800 -177020 -98383 72360 137422 -127261 -92436 208217 -204868
23612 -225086 113835 -272981 -217640 308711 -226402 -63464 213057 -141399 -84674 -113064
23602 -113064 -35891 -197954 -42379 -41979 40416 -30338 473 242694 217907 336671 -194333
23590 307185 -41449 37193 96418 83812 72415 -204597 -3240 139029 -34600 -212490 -67414
23578 120343 -112026 -103157 140704 116308 -356340 85278 309734 -61399 -155503 9980 128886
23567 128886 -21822 -127265 -43040 -188705 -166780 -83468 -99078 317998 12318 -307857 -111287
23555 -54994 -18986 -33900 -113194 -131639 -114239 -163093 58590 14822 220738 -139890 101819
23543 69361 -3307 91560 -207137 65105 -130946 33631 -214077 -4481 -2312 -64678 -195978
23532 -195978 28393 182502 160116 -14137 218252 51266 -120030 -151806 -93209 106870 196756
23521 196756 -125791 47618 20076 58469 -123293 118817 -75659 -190352 -286130 -4356 -105258
23510 -105258 199811 -216432 204684 3576 -158694 33705 -82532 -86306 92995 47998 -36518
23498 267423 202128 -50815 118451 16740 -285296 -166094 47574 -196472 -128470 -187125 -273740
23487 -273740 300299 54350 -244495 -196644 137166 278321 -183842 -198994 -12579 124166
23476 -24480 -52633 334969 43267 1179 100457 -225096 -325548 79956 39536 190685 23923
23464 16391 -21848 126182 189440 82079 70180 -172324 269224 447367 -269601 -122421
23453 49054 -98802 749 29645 19499 -409332 53206 152512 -130904 188778 -243150 -144543
23442 -144543 211639 63158 77979 127282 17800 -6932 -209286 246403 48639 -57423 155972
23430 -193945 -57885 264394 -258904 56091 -105446 206468 -237257 -344068 -180985 -143494
23420 -143494 72322 194386 -321591 -55230 -13505 198149 129210 525451 99299 153383 33577
23408 171084 -10451 226358 -414091 141275 -5812 -25776 -346801 157355 139857 -93989 -149321
23397 -149321 -85998 -150459 80576 258110 49590 -35923 16408 -241169 -73318 -24860 -331501
23386 -331501 -45072 -183587 -154821 -317155 -373809 -301014 96668 -10197 -165811 123904 195881
23375 195881 -154181 -33491 121167 53696 -353382 -4268 340251 130811 -325561 -73550
23364 -165496 28777 100132 -49619 174623 -152280 -154120 166932 31124 -60457 -223363 268420
23352 -1314 57683 117346 152810 -186086 -164573 -299270 -11459 -318951 308142 -151554 -13364
23340 -139440 -53426 -60729 -98005 65251 27520 82506 17040 -259770 -203122 -194132 302121
23328 350713 -190076 -134769 199831 49795 172805 -68050 8144 -195426 317998 62094 -21083
23316 -150596 -42271 -31589 -156649 109338 -69191 87614 -308982 -253298 104734 100563 -77692
23304 -118739 281409 -7441 -66363 410323 206761 337142 183480 60748 19389 -244573
23293 -50842 -146106 -207385 -32082 14128 288152 -221014 -254286 217466 145545 193840 36366
23281 -90729 70851 476364 -169136 -93820 167627 -235086 -130691 -44867 11162 85764 -159456
23269 60907 -109099 -104774 179362 14146 -230904 -34824 111286 301248 -17359 64551 152012
23258 152012 -137891 230573 145366 196455 376552 -222257 -48177 -63394 -241133 -302217
23248 -302217 91225 100822 64776 -229222 31557 -183610 -36016 -19937 77462 -312913 -45693
23236 -72596 257862 -41383 -233526 205662 65431 -41900 -114811 -242567 -72401 40149 -3132
23224 -18698 71464 -40890 -243746 142253 -374846 251285 66414 -218922 -527824 -160705
23213 131869 -161964 -147509 -26514 262871 280410 311460 -75684 163683 -65259 38137 -218855
23201 -107723 97073 33111 214538 -254061 3926 65378 -33446 -138923 -117148 19776 138860
23190 138860 -110738 67490 171013 -256580 90566 57032 -275649 -116067 -211073 -17645
23179 -218906 18274 -22408 -27380 177916 -207924 -51375 136282 -73771 52923 -10037 -30125
23168 -30125 -19722 72683 61190 -161008 -212871 -147868 -104289 -47737 -42005 514 8453 -183444
23155 12938 -73428 312799 356760 -335125 2562 -248083 82550 -98075 188235 -29176 -321778
23144 -321778 174025 155338 106748 7034 55484 -35718 312354 -119675 88008 84725 195066
23133 195066 -22858 60453 -272285 6935 12427 87599 168477 -70691 140191 -212514 -163572
23122 -163572 68980 -189087 10807 164215 -172563 45423 324958 77476 9077 -217007 174455
23110 1727 120338 -14789 -61581 -30769 10543 -69191 91311 -146879 122734 -183076 302341
23098 33462 47750 126437 -12049 10001 -89365 81756 -86064 14945 30176 -292195 -19945
23086 84182 -21737 204966 128984 -201925 195124 -66075 -325230 -132277 -77516 -33857 -39959
23075 -39959 -172207 -28274 -4545 136691 8203 76783 -422409 135244 -203375 -260905 -240636
23064 -240636 140638 -187374 -223104 91695 -114327 7546 119255 -193751 -289954 257823
23053 279 -17993 -154572 -40633 -148533 -38988 8152 100059 90666 10526 -224127 183565 -107176
23040 22744 -55169 -47486 147644 -311677 272402 136919 56685 -415414 258454 103774
23029 -214945 42233 -64542 151569 -152507 164623 119042 -218982 -387 -179173 94601 -125674
23017 112560 -394545 -168954 -272459 179909 61569 -168355 -26242 -54896 -269361 -34700
23006 73730 8630 -225887 250619 20059 -110352 -55895 307645 -80796 -55560 -80578 51894
22994 -51447 168687 -56514 -200445 -73897 -650 282572 -182287 -118990 169646 54347 308013
22983 308013 -226 7965 34634 -155901 -114180 287115 -248879 -124515 149808 -341686 -124383
22971 -60250 -143634 -7808 -267965 -91672 -340289 171499 172271 30687 -178022 201010 -303144
22959 29815 -68753 -240102 25257 -277727 13348 45719 -125941 60031 -94103 -147685 -101093
22948 -101093 140454 -132386 -15394 -190967 -164157 -91935 -72655 105988 -190959 34610
22937 -242685 -28945 209572 -111222 -56995 -144955 -60893 -77144 -44930 235944 586005 515541
22926 515541 -180915 -34572 -32407 -43593 -88808 221296 -122489 189327 -150753 423753
22915 29529 66964 195278 -63504 206792 -100635 -74752 223418 -235940 16697 139758
22905 139758 -28537 48801 -1380 -137353 62883 -5277 -76294 -240792 -333636 -253652 -63600
22893 201198 -143821 221390 -155598 269741 -411053 -21592 -38071 -230872 -185212 13991
22882 -5480 156217 208583 151151 -71305 -49154 -182761 -264606 257555 121783 -53540 71828
22870 7905 -37259 35388 -332616 45021 -253064 -109513 -221551 59390 -23804 139099 74819
22859 74819 -57038 -153380 -205846 -155825 36026 20705 90657 5449 7668 -311969 179249 153032
22847 153032 234442 -13395 -55295 -105600 -11247 -173634 -293985 238788 -51914 -275524 141232
22835 -70292 -42114 -67507 -100193 -593977 78750 -67900 -39893 200157 -298296 380248 -84543
22823 -214291 78814 7115 -29156 -407488 -135591 160870 128259 -265418 152357 167903 141870
22812 141870 -284707 -236390 4952 157207 50637 83441 -234793 -30093 -31654 -175352 -75910
22800 121373 50585 59535 109132 58507 -35425 -148830 297499 114641 -101280 182025 69826
22788 -273911 -326330 -89486 42140 -217420 219409 -117442 -122267 -61042 -135126 -121815 138058
22776 -45427 -116442 66561 -210637 -5989 9706 -81209 27832 62111 -234694 159766 282877
22765 282877 -16622 -27782 101631 -117730 -269479 196210 -291616 -261505 97343 335851
22755 335851 81783 -106530 -2200 -51218 -52884 -75657 9940 169101 -223028 101115 48449
22743 -45302 -24520 63901 -313607 178634 112378 242991 -19895 -181561 -61068 -25483 33183
22731 181929 -192412 62516 92115 -415979 268669 -157999 -167891 -104889 125492 -124034
22720 -182014 195052 -338987 -320047 -189788 345038 -14715 -4751 22407 -403557 35261 167675
22709 167675 -173051 -112319 153694 -60787 -184970 -12604 226970 43469 -82200 -104942 -89937
22698 -89937 3848 -226369 83672 -193425 -94110 -196489 53716 -10170 -31796 -252981 79758
22686 182810 -62069 -109228 126959 -239642 125612 -178445 -53133 259980 172217 266639
22676 266639 -80970 -15183 36425 -175242 -108238 -2061 89114 178341 66144 -157574 -321720
22665 -321720 -127300 -112888 -273739 -234895 -292299 108953 -93955 83242 167720 82272 14599
22653 -264044 -123488 -141645 63140 -107318 -216458 41207 69900 -251207 123788 318303
22643 318303 135122 -157284 -202327 101429 -1419 239080 154755 44222 -60669 -131714 -212467
22632 -212467 -330120 38967 33147 111759 -29578 24869 293464 -52909 141272 -199211 -130644
22621 -130644 -213046 193592 281382 -118477 -170721 105853 197841 59381 119765 -735 86088
22609 217871 -142344 171185 -56363 -107371 -374399 171160 -123004 -171246 -322902 -22954
22598 -161864 -233370 83 -13022 -3482 38099 -160584 100706 243441 -151799 13923 -40646
22586 -116990 63607 123842 -45160 155315 -102528 -189717 52211 -232364 122863 -10715 225728
22574 -206028 32746 15068 -187083 167653 16552 54606 -63779 -82604 248687 -81366 -23529
22562 -56282 -63633 -22758 113289 318086 155113 -228660 -199255 -78497 56211 -134764 -452268
22551 -452268 -147220 15493 122658 100532 243989 23178 95883 17076 -261382 29022 -54207
22539 15765 -194344 9663 -47113 -61145 -97007 135296 -163241 208943 123432 -156465 -137164
22528 -137164 -143152 -291784 -19412 -15499 -153940 -304830 -144121 -251038 46440 354258 -157254
22516 -342687 -86437 27879 3724 158536 -120592 69062 -75177 155590 88049 29035 -24677
22504 -91482 -143905 114156 -113178 -166232 -288885 29178 -213767 -62116 -223989 -43077 -252773
22493 -252773 104292 -148655 69998 -102791 -374430 -125676 -90843 100565 -245998 -22579
22482 -117740 47083 95857 -50479 -96112 29881 -212518 102547 23542 121764 -190176 39900
22470 -36925 134269 211295 -69785 183655 181129 -222839 112747 -68730 -356060 -139669 157031
22458 -105646 -104540 -131987 -600127 155090 -109687 246516 -144054 17480 198892 -44251
22447 13865 -93659 340433 -59892 93126 63467 -41309 -248742 4994 73774 -264329 -16831
22435 -116417 49615 -190919 23375 52056 31874 88075 185004 167351 -93816 -275416 -32995
22423 187175 -148271 -209924 -58204 111856 -78202 -19914 270789 23876 137268 7342 -27711
22411 61192 227800 -81149 223610 232604 43086 -82913 68445 -157752 -130894 93292 -213232
22399 -67364 -217519 -121134 58199 31225 -161436 105904 134534 -250596 -50696 171824 24631
22387 -283124 -123137 -53223 220760 130844 38504 55360 46008 -98441 172892 -122300 -56932
22375 410569 -174625 -121255 51212 -204820 8760 -203482 16224 -67437 31110 155209 134237
22364 134237 -200597 26186 117946 -93972 -138740 -7242 192163 -31602 -137931 -126422 -61098
22352 -156021 -65930 -169761 -94039 -110053 -98040 -581119 1301 -53816 -181657 328493 177957
22341 177957 -173397 -51901 -226506 70709 144466 -125504 168398 -274643 -180047 -43918
22330 135233 -201784 418759 -347515 17585 3900 -25280 -139390 -112465 -89983 88415 49341
22319 49341 -141540 93029 -26310 -51343 94409 -147317 73762 -226410 -77578 -165128 163207
22307 258240 101221 -91408 175019 127703 67885 92764 -168734 -16974 95165 327621 -239736
22295 156423 -19403 66345 216692 333890 -236687 153401 367485 -69247 122969 -400331
22284 102527 -37478 -199556 83604 60741 57922 -212472 107129 -83765 -47304 313830 -47559
22272 157981 -367901 61665 70918 95171 -328100 -65331 183279 -109220 -148394 -41250 -2198
22260 -240081 -88461 179001 -193237 -138394 -235501 -87932 -376541 41718 129200 113186 -275577
22248 266695 -11318 -261800 -26315 -122405 -75195 28553 -10098 -57556 17001 -178255 -55045
22236 -37004 -110663 3207 -134866 332050 -7922 29866 -200268 -52404 -270521 -111291 -55131
22224 232940 -106223 -49304 -388225 28191 229320 -53712 -220585 -86094 127940 51520
22213 -22414 76313 68107 42045 19832 -183098 -53306 18982 21342 71206 -42867 -182728 -80164
22200 186228 -333878 146991 48020 -129627 167494 25448 196707 -65619 22561 110114
22190 110114 137772 -68176 189996 -243352 38188 143232 -83281 -219465 -14580 101577
22179 -39885 -84433 285247 -130406 -1574 -95972 -221494 -46330 -297046 -110896 -195992 58724
22167 190565 -78685 -218946 13446 33998 -454324 -196429 -210165 35850 40529 32438 66091
22156 66091 -135177 -23435 -291979 89346 100219 -23987 87881 210646 -3259 103927 -162010
22144 -145041 243066 -60933 -42667 101559 -61805 -69350 109686 -164163 -170067 -282216 133720
22132 -132689 78982 -145262 -119641 122797 -146566 -331855 202451 -276114 346845 78631
22121 -211404 -239448 -102024 32524 -41788 -110251 67058 -176266 34802 -194787 -48572 -167279
22110 -167279 118967 -251572 -22365 -230325 138512 37505 -250824 -109146 176107 61886
22099 145473 22666 -36374 -88429 308211 191473 51559 99493 -97628 -34438 -324570 239907
22087 57315 10083 140750 204703 123123 166647 -156582 -208345 139250 302914 -232411 143168
22075 -433425 -307004 61786 -160384 -179359 32331 -239804 -27787 173007 20620 -18668 -91851
22064 -91851 -80484 -88525 91929 339787 141665 -186080 76825 100199 -476323 -53472 41056
22052 -135387 -435820 -54441 -44351 219035 -74791 -76331 -108169 -189953 396381 -166954 -73969
22040 -165580 -396222 101466 -387928 -161586 -151129 9504 17434 -344196 -56939 61078 12275
22028 -145531 -102626 156764 -54982 269158 49081 -159996 -68837 101939 165128 -148711
22017 49881 411721 20779 239551 -23479 -19494 108277 315818 -254610 -269690 88143 184619
22006 184619 -84135 -203346 -153814 -35840 -116881 -257718 -76473 19363 87862 -132362 -98080
21995 -98080 -352560 174407 -159488 -121760 -283944 97900 152516 -210981 55994 62881 341856
21984 341856 -170380 -14305 -107737 258112 -104768 -114479 -62491 -338975 -73541 -217921 -19092
21972 86668 -90904 -134009 14068 146105 -119245 44340 248867 -12968 415380 76281 -95716
21960 -98470 -211457 227196 -59811 335900 137319 -273507 93051 -43184 134531 -43514
21949 -18112 -98261 -51183 -452395 150154 -29125 -176485 151681 200096 -46511 -21213 -208277
21938 -208277 -49298 282195 -118590 -125130 -119256 -72044 81302 -64670 -103963 262831 71600
21926 84810 211662 -25753 -139248 95036 -112518 -63300 188075 -52862 -189262 -298187
21916 -298187 -292335 15307 217270 66421 240090 -86123 -99260 69649 -10900 365600 -321043
21904 175161 250519 -150384 17245 172223 -1617 -125023 -55714 -142668 -50885 -228688 -212530
21893 -212530 167830 178552 57731 -174196 -59906 -178117 -170729 -89626 61735 -102311 -282605
21882 -282605 -40948 -219772 -113067 -146831 -268654 109896 82592 190574 -129628 32215
21871 210965 -215792 337597 -125867 8457 184947 -116282 289252 -184746 -480868 -244441
21861 -244441 94580 59350 123713 -117366 66179 103436 -54787 -14537 31892 -139262 56220
21849 -178934 -353114 -30544 -115492 -59713 -96518 -167782 -46777 45858 466073 -229275 -112291
21837 113615 28720 411134 281324 142110 -182013 -194646 -183729 -6062 -556257 -106948
21826 -85695 -215757 -155035 -144054 57743 85522 -4150 12720 -34034 -293956 229783 98429
21814 -234227 -355595 3400 -101546 -333706 94865 123346 -61985 24660 95980 375613 -104551
21802 275307 -231634 259784 -83977 -65663 32037 -36720 -61751 -283213 212121 -67270 -144020
21791 -144020 435192 -66823 5342 -93433 -84438 246478 186788 -106462 -63476 -80000 37926
21779 -17295 -47725 273413 180470 65912 49566 -9338 2056 80847 161596 -294562 -74025 133299
21766 515195 100484 256099 51354 -140234 -120580 -294351 -45 -67889 53638 209397 -51996
21754 -297206 -342548 -105930 133043 4928 60948 195763 124167 -110579 -254422 -180224 -280598
21743 -280598 112244 238546 -212200 -91165 -113942 41031 -304325 -216958 40506 2774 63474
21732 63474 -207567 -455800 131563 138216 63480 -166088 -278076 -78106 -188384 311119
21721 148831 279923 155042 -114216 -145529 -118879 124561 210841 -201416 -55104 -225055
21711 -225055 24759 29548 -49645 -175236 -17757 203573 203177 215624 26196 165148 -216971
21699 80540 -178067 -297232 222174 -155928 201813 22310 -210907 139678 58991 -1793
21688 240 124265 -68760 -193059 -218568 -157069 -28751 -139911 -330860 -159439 -93199 -108061
21677 -108061 100116 -90852 72956 22778 10442 -200031 122214 -12483 -210195 -249487 -56528
21665 104765 303867 -252202 -157960 -167931 215671 -518510 241068 -229264 -254060 202203
21654 -19590 -109973 -33433 6658 -132038 500563 -117474 -162730 243622 -328311 -190872 -65410
21642 142390 2121 -283542 72994 96406 -230754 -102708 3623 25066 -86659 44407 17183
21630 231472 -186837 -117291 -188879 23864 -22755 -421413 3711 69662 -321250 -561634 -239220
21618 281569 74901 66708 143051 204895 24359 -303406 -60783 -54056 204307 -219495 -23837
21606 177089 -206223 -46075 -120598 -40633 -42576 -157447 -113485 7455 101636 -344382 46710
21594 88932 -94931 -487 7775 -51124 -311250 -7726 -177723 -100161 -35873 -218726 75659 100803
21582 100803 65002 96888 -162220 70084 104255 -132856 -1462 -43422 -218566 -112562 -314552
21571 -314552 -276889 -152415 -189351 -77417 21256 16378 193482 -99354 -96779 -93072 154227
21559 1941 -235630 -158456 -51888 -269435 263994 -75839 -18988 -78694 111251 -41336 91589
21547 -202580 -194748 -69263 -186863 12063 -51868 -66568 -73445 -364573 7958 126109 92688
21536 92688 -166003 -218745 161876 -221737 1801 -11501 -400608 160006 30754 132475 -26859
21524 -208954 -178114 -55285 -107960 -77087 54682 -45429 143901 904 -195936 -12724 -75614
21513 -75614 -59873 76353 24929 -21734 20986 -49311 64199 288499 -333853 29257 -85999
21501 83571 -21172 -164425 9391 -211661 -181982 67934 -122872 271253 -83105 -42291 -191764
21490 -191764 65540 -95649 131352 10006 8892 130862 -102066 39986 -256340 132405 -184183
21478 -186368 54469 84450 -307821 -239006 183021 -99138 239 -69817 83924 -250727 88233
21466 -25428 156376 28833 242920 233193 -258620 12088 -56150 -309647 -125644 -71500 -233471
21455 -233471 -153952 -133472 71680 -182338 -22240 -312099 -211232 -242449 134440 127167 -70713
21443 81342 225928 115090 179843 85232 -7148 -93917 -22439 -21941 -86880 75256 -294444 -47397
21430 -188351 489036 -74580 50965 165790 444733 168165 211599 301703 -17538 -67175 15158
21418 -134497 264647 -462648 -74857 -132596 -234934 -101251 -215703 -72246 284454 162709
21408 162709 86919 -232016 -65540 -92512 31380 46825 -105863 97839 -129038 123945 -32010
21396 175357 291870 193337 -322905 -101904 -59077 122085 231649 51156 8310 -60451 -110395
21385 -110395 69029 118626 3684 -122059 12011 -7000 175921 -89594 -201806 -161132 -268747
21374 -268747 -24236 79858 178629 426482 40161 190595 72571 117612 314375 -358694 106485
21362 -61462 11139 -176940 -81522 228732 114393 55687 96711 -90231 -116555 -317133 -76840
21350 -241539 73454 -45348 336782 -129126 -128555 -134191 148288 -105148 244692 145951 326686
21339 326686 -461018 -101460 154222 141680 -23305 -60803 -412880 -332644 29296 -179104
21328 -77278 286095 123562 -259780 -30653 176926 -54820 -10967 -49039 -194896 -530682
21318 -530682 -4648 -94054 24821 333477 56262 -171678 -71597 -270898 205660 -146976 -80045
21307 -80045 -51513 25556 175437 87882 253496 -26700 -454028 -185877 -288810 6127 -56946
21295 -170631 137850 105808 -71429 -283050 -130002 -171148 -70593 -240830 -64228 -56019 228108
21283 -405620 125389 -367602 -154210 -51196 -133426 32835 -200226 -83912 -106099 -21656 -341142
21272 -341142 -297291 46917 1443 -79070 -313990 -357404 -107954 348510 -36193 -198867 -4588
21260 -71158 -354312 85333 -56277 -132394 -85329 134341 -188684 113856 6189 96710 297951
21249 297951 234400 -143835 -181035 -42415 125576 -54401 189919 36948 -70266 125626 321984
21238 321984 158382 -206645 106656 -71901 264093 29856 -3643 82519 49280 -160331 -75040
21226 -269958 2478 997 -342189 -56561 -183836 -94465 77468 -181546 181633 93016 38694
21214 136412 -164841 -45177 128181 -109402 45916 -276775 62213 -159391 -74145 -224191
21204 -224191 -106457 -55844 -1412 122904 -180940 126344 -269535 -93259 93551 -216230
21193 -103511 106128 139126 -90217 -195571 38589 38411 16828 -100779 -193784 -49279 29921
21181 -93926 -216658 240067 -235072 286083 309018 154477 73821 38173 -54704 231853
21170 -176865 24633 19322 -78461 -19014 -68170 -343109 -138431 214271 220672 134042 -203977
21158 -122000 118618 213411 -34406 -84047 -95015 239203 17167 151488 104121 126344 376799
21147 376799 224393 70210 -16796 -130246 -97235 -251721 121689 -375334 -86902 -386540
21137 -386540 -266150 -257305 -95233 -197971 -21409 35639 124589 -153249 151539 -4033 54345
21125 -96403 -181178 176017 -64699 422453 -208270 -113187 43795 -219853 -228724 -267630 -381298
21114 -381298 -46061 -206286 -96066 -64560 -108185 223943 100308 -68085 -476255 67945 325921
21103 325921 64320 -638738 -40365 44481 -150623 -327258 -344374 -146532 -44887 195234
21092 -91711 -346968 -157837 119027 140905 -63659 -45362 -45335 -68826 252501 -36741 -58673
21081 -58673 8319 235648 -496844 -423510 75665 -94154 106229 -63069 -239905 -254341 218762
21069 58572 -269457 246810 -130064 -375972 -38108 -177615 120811 7233 -65837 305353
21058 -311572 1420 67624 -108451 234121 -183607 146388 271191 -5322 -55673 -341109 105004
21046 383664 -111724 133294 -55661 -74308 -51456 150883 -186959 -301991 -205216 112930
21035 17271 -10427 -181387 -43588 342777 126562 -84727 -284857 -115528 -227684 -135306
21025 -135306 -30991 41283 16629 211080 -134412 -392536 84196 -480697 200403 -11112
21014 206574 7754 162697 318952 -10628 -201046 -293743 46685 -84916 195900 -63065 -209521
21003 -209521 168585 30410 -15313 119013 -262819 336383 125025 -287820 -151293 167038
20992 -126185 113256 -108831 -164482 77473 -149170 2373 -257816 -17790 -78035 78516 -163473
20980 -56462 83231 -84273 155310 27876 -10974 75699 -42693 -100886 103680 -108030 -231705
20969 -231705 13158 -33437 -252888 -189498 274107 -2891 -32184 -34663 180931 -422272 -103259
20957 240293 -135108 -70658 -120971 110402 -76481 -101784 -145011 16304 -21716 65869 -494765
20945 -44832 51911 268183 -326483 -9424 -184102 -203075 -77275 23645 -478340 233869 260847
20934 260847 -126298 -395366 164867 9913 -19622 29185 -238255 -30844 81291 49369 -67851
20922 205413 -61023 62020 202953 -85553 -226134 -147266 183675 40836 -27133 -146055 151570
20910 -86814 -105409 62256 -132655 -25570 -300846 215 -234851 -277561 76782 -327682 -118967
20898 -147219 -137376 -27144 -93915 -87650 -122220 74351 243863 -282191 92002 238007 86384
20886 -329046 -91144 293439 57010 -79722 -68323 275074 -282123 -82486 -247111 21830 34961
20875 34961 -71984 28980 44837 -145506 61968 692 -202709 -99515 -172699 815 -39873 -54032
20863 -54032 112386 132038 165248 -349784 -145670 -190953 23545 -94826 -316439 21784 21796
20852 21796 192270 41041 110541 40137 -61103 50586 -201455 -28031 -273742 -105107 26845
20840 55023 250080 120878 -313041 273225 -221654 392278 81398 -60118 -185596 97567
20829 380549 -410056 242260 -64028 -138459 79420 -77605 -108802 142203 -103254 432824
20818 318469 -160425 -216732 54050 3787 -20607 153975 154841 237987 11475 -379561 26634
20806 -303066 -317553 166408 -110567 -149488 -258013 -136192 -187847 47395 -239378 -110223
20795 -79551 -211962 -40683 -214057 -22134 -132193 -115216 -16545 -110123 37230 27650 -142305
20783 173783 -65711 136878 -98725 -97310 -45825 -39320 -146245 -193094 99361 -11234 -170576
20772 -170576 -166390 -51198 54839 63141 193024 -419413 -96567 27477 -82859 -174549 43131
20760 -93480 10177 -15979 -102590 -34007 -198524 -272619 232188 -360617 -56799 -106697 -76046
20749 -76046 217610 -384863 193331 4726 77887 195748 118675 -169748 -180709 -351929 -300865
20738 -300865 -169634 235252 -44957 80766 93836 -107470 -98217 -255079 239480 -222430
20727 124262 163234 -112724 186793 -78549 -217382 272022 -310064 -492378 134182 -401005
20716 76258 58210 -77568 -50727 -94850 -8013 -51303 -69375 -268592 4292 42486 26107 -104868
20703 22656 -136981 -4219 -63149 18208 84168 -52111 126678 -204810 -433822 -150886 -89855
20692 -89855 288822 -141011 -86277 73932 -130112 313221 -144220 -663 279559 -85289 146641
20680 201469 -142090 202301 6271 36758 -49479 -47516 4054 -6527 149390 92906 -178174
20668 -85552 -265493 -388896 -163960 -109897 59913 70120 300242 157186 -230630 -182051
20658 -182051 -95920 49635 93554 47803 69853 -37358 -91944 -203956 145993 3957 5395
20647 5395 -65009 68059 226934 213858 -435788 -97817 155613 -269202 -164570 -175260 444205
20635 -346939 -143255 -640732 -181004 -54895 -143708 48103 -442680 -92416 -107305 152593
20624 -170606 -267686 -105196 -74089 -40243 158284 115778 70684 207749 -142169 156299
20613 -113293 -47739 -11472 59501 -252181 12619 66294 -80154 -254720 -122765 -110623 -165278
20602 -165278 209761 44117 71171 -152369 -524736 -189829 -294086 -187454 26060 142469
20592 142469 156434 30207 -98194 -227600 -443820 14857 35662 195762 84921 238276 -225304
20580 199613 127398 259590 57226 -129089 -354081 12911 -265895 128388 194257 -24940
20569 -186684 106737 69949 -108010 395086 -100290 -86774 28550 -63570 -178516 -218609
20559 -218609 192557 362495 -81740 -280737 39921 -293121 -105086 69168 -82887 -11796
20548 -50437 -169796 169408 340708 -50962 -135502 -21769 112711 -113456 -125426 69454 -159621
20536 -394248 -358154 -122606 -233043 210522 -15438 80855 -69360 202728 -229666 93740
20525 -344175 -278991 106022 9778 -186929 120870 137905 -46791 -88179 294536 -199711 -57635
20513 -30228 -203215 -128095 -289313 -59141 -128589 79661 35906 217058 -130602 245661 163970
20502 163970 -308993 -31478 186280 -61198 -45696 303203 35105 -133851 189743 -181638
20491 -229194 -91908 -137367 -66207 229192 -26175 -389556 192767 -73057 27484 -100927 -94736
20480 -94736 -275610 -47416 -139058 -195650 163252 105349 -6329 -222175 99257 142443 -175703
20468 184899 -1926 -247712 -104882 11842 -13432 -189228 109755 -5493 -20405 192476 -260772
20456 94218 -124688 -88132 89786 107243 -301347 -106262 -96222 -26845 106991 -61966 82024
20444 -258871 225743 73897 -20000 175645 -122992 -92172 153137 -17739 461355 -140002
20433 588139 -145881 -371297 73264 -186403 31681 -224739 15059 56725 17128 190787
20423 190787 -336067 -162955 -42364 -1254 -67497 42782 -416950 -57910 -224104 326785 65981
20411 -225694 -244866 148065 21830 -185061 214444 -53379 -129200 -94677 -582477 -389782
20401 -389782 185211 -56510 -34821 -135541 -197047 -33470 226640 -404546 -71817 -296408
20391 -296408 -53884 -172322 173226 -54324 -101039 -26951 173530 143283 -242542 -567740
20381 -567740 -369254 -50674 -131506 -242009 -301415 99053 -130690 -89105 -8464 -350608 127275
20369 329776 -438767 67291 -249978 -70924 -51228 -279273 -136911 -48450 48672 -117916
20358 -137412 -212357 -195096 -143415 -86844 -365923 13355 99328 298672 -258314 -54999 65005
20346 -57960 -164114 -199098 -111867 -106884 135399 303331 -199805 -451274 13838 -137456 -262147
20335 -262147 -181117 -15788 142176 -116717 -13758 -75991 -123753 338414 -83109 135876 -148363
20323 36193 -6913 40553 359605 128365 -97568 10132 -157057 46235 -234812 -133396 -52094
20311 6663 -19234 -249213 -236821 175051 53132 -53959 -306843 -228381 -218550 -5921 63536 -18429
20298 138275 -99486 -258036 -52285 63217 -282512 -227406 57638 534193 34218 -140353 -237953
20287 -237953 -55028 312678 -210987 53820 50260 33346 180057 20303 122790 -32307 -170869
20276 -170869 -267574 -223758 -144826 86689 -97249 -10776 110788 -264641 -100488 65680 -237518
20264 -40660 270025 -172284 -315818 -60140 -61416 102240 40078 576 41488 -249586 -113217
20252 -155444 66552 -124585 -138752 -167918 161715 -171050 -33695 131697 -199856 32743
20241 -281816 -113181 -114866 -173658 -194729 -262198 -8667 -9877 -72135 -146295 87950 -313399 169066
20228 57245 -104855 -235676 -295985 152869 -302651 -265767 33685 -122156 -62344 -146109 -191978
20217 -191978 7746 -307587 -19240 66674 -135347 -181277 -83826 80191 -137339 53192 -290732
20205 -41387 -91546 24874 100409 -227624 172286 -80149 159966 -146553 -82309 -2482 -34712
20194 -34712 -53630 256299 -55991 334972 -81374 75195 -33288 32707 -111103 -67235 241486
20182 -41323 -213857 -121019 -317820 -183723 -186446 -163346 82555 -58081 94864 -59925 -214755
20171 -214755 -174764 -364721 189289 -131416 65673 -94894 211714 99153 295269 -96138
20160 -197987 -63062 -63526 -17373 189788 -175085 -104236 -85993 24124 -64608 121956 -141628
20148 -486 -249389 -204821 32444 11954 -85928 82141 -35761 -84502 61048 128838 118485 37045
20135 -329859 -72298 131890 58667 60350 -162680 -6265 -71272 -131417 -36416 -307539 12870
20123 330676 -337174 94476 26023 131988 -58083 -219755 -20878 -23422 -421176 -103369 9827
20111 234149 -14929 -9576 -15622 229346 -404450 -322765 -9207 -328067 -192649 39742 210379
20100 210379 -167168 94935 -98204 -313235 -108670 -101150 25799 -75417 -83348 -89882 134274
20088 138606 -158003 2779 -63641 130014 -12789 173787 -294717 -34730 -196843 124124
20077 -85583 43780 -57498 -167806 145427 -264395 32651 118409 -97943 -63506 -130280 85063
20065 73846 -254532 -79116 39153 -265514 347500 -14696 237378 -119330 -61684 -193872
20055 -193872 -294492 -173886 -236815 -166093 189599 -50718 56065 -74589 155385 61297 172653
20044 172653 136969 -440467 326570 158155 -194870 -53183 -574721 208356 -272462 213239
20033 -17597 94069 4846 -128153 265310 144650 -153870 -53643 -238548 -46747 -35841 -57140
20022 -57140 38438 -129140 2865 43684 31094 27185 40696 -202008 -149889 150802 -186936
20010 141964 -222774 -246786 61357 17259 -12217 406993 -166038 -236505 -113171 -12867 -422190
19999 -422190 -402170 -314542 -312020 -247373 -23297 20079 -131122 -136790 201531 -71776 -35482
19987 -55048 -89677 73119 -211510 126673 191077 122802 57668 290808 -165203 244994 -97901
19975 -21335 73818 -237372 -29165 261214 -214381 -241339 -126767 66020 -300446 -173026
19965 -173026 -214801 -48122 -158524 310664 -15250 -37579 203740 -208025 -80094 43543 -55867
19953 -40640 -237133 -65619 -44673 95945 84572 219816 -110343 -54743 -162410 -85728 -395872
19942 -395872 -133205 185615 -248692 -94235 -63195 58215 -206781 274683 -167926 -79420
19931 -213956 -306285 -9800 -71173 187930 45513 135788 -30360 -146210 91518 -420635 8520
19919 10398 124841 108432 -83757 -197965 -28494 -83772 -97665 -188090 -32484 -139007 -85583
19908 -85583 231299 -345205 38635 2024 -212880 -65092 -226314 -251055 -18387 -144346 -243361
19897 -243361 -132667 -227460 -273255 -156771 126901 -201952 -212038 30425 -96956 -57619 -29977
19886 -29977 -52942 233295 -138577 17442 -84955 -19439 -272699 -192055 -181975 132850 93028
19875 93028 -245624 -48429 -77443 65152 -19322 571263 -29035 29189 269116 -94012 -205206
19864 -205206 231952 64284 -95907 -138165 -25554 -353471 -60436 175314 119471 -30608 -67185
19853 -67185 -12365 23630 263869 -208844 -298669 -144137 279336 -88397 -23758 239047 -272718
19841 -382479 -246171 191277 126462 201759 -11520 -4237 -215532 -48699 -266010 -111980 107466
19829 -215039 107565 275998 73372 35443 58068 -84856 10305 116086 31197 -34544 303757
19817 -363251 -53282 159490 -54493 -79265 -115432 -70025 -106929 -237162 -70934 80930 -97301
19805 -150834 123897 53764 -75674 -66103 393155 -166363 20526 50334 -319439 -33595 18423
19793 122253 -202308 -398239 -77500 -27092 19428 -81441 93162 -65134 -76887 120774 129021
19782 129021 140724 -169936 -266051 -205883 91220 -87232 -94862 -66722 -413690 -154183 -377328
19771 -377328 -37436 -167119 -54109 9139 -127181 -192870 -187953 356 -143090 -33664 -52969 -102163
19759 -102163 -19215 19091 62374 -70200 -107727 -5695 222313 -47163 -25420 -175115 -150909
19748 -150909 144580 65985 17131 -32944 51299 -87668 -155648 195360 -407815 139929 -220292
19736 -99611 -154764 127871 -192397 13526 -152507 -187584 134923 105573 -77222 -186443 -271704
19725 -271704 -124784 -111612 -224517 -29949 -267716 114606 9032 6363 -2765 354769 117538
19713 -394686 284080 -48416 813 -70273 -22342 36645 -102491 -126673 -488336 -81495 197894
19701 -54529 -22050 30234 102881 267719 -173098 -231267 -84376 -124176 171347 217990 -21446
19689 32237 -164046 90971 -50642 -169219 -96419 125190 151855 241911 -188724 -353284 -251026
19678 -251026 99987 -296912 84776 -392445 -267001 -86556 27133 222121 -97400 -253925
19668 -253925 143256 -237524 -256378 -337636 -44285 -405134 -184886 -297749 -146520 -34943
19657 -80104 52394 -237214 -15255 -72923 -278310 33168 -151864 113431 -9728 -219845 -12208
19645 -45830 -196108 -91172 -66184 -221445 -259121 -215766 -34408 -99038 -168419 -260020 101758
19633 -85892 -19257 79350 -52243 130204 108584 14314 -119197 -10331 -92495 73024 -319780
19621 64607 -76324 81511 -11079 114313 221523 -44906 -145473 -217005 -63060 75319 46195
19610 46195 51508 -160386 97273 278943 132255 -116266 36304 43949 -267741 -87757 -77764
19599 -77764 72398 -187481 -379301 269481 -381111 -36282 47508 -137464 177520 -28248
19588 163780 -146688 39542 255420 168287 262331 144880 -153506 38993 -107925 102687
19577 193275 -293026 157214 -57170 -110 -124938 -114046 116969 -118084 -217267 -19667 26085
19565 -292210 16797 -102079 -276107 -81014 -250195 -66318 3836 -225328 -127573 -8417 -56741
19554 -56741 164272 98961 -34669 -90695 28135 89829 -272107 -144723 -297182 115626 -18361
19542 -146807 -291844 -85235 95111 78461 160515 -60926 -184048 -69171 151816 -190964 43472
19530 236878 -52493 36785 -60548 16646 -42740 71235 -317637 -23194 -171436 77286 -38384
19518 -133225 163641 -212793 -181841 -174278 233993 31262 104265 -20810 -166758 -326114 -81135
19506 -208260 195804 -264874 57151 140557 -64168 185965 -183128 110346 -52383 205648
19495 -4212 -158153 -8929 -119420 39867 -601704 -23539 -138273 -83628 -27518 67975 111582
19484 111582 8175 -47686 -52965 180555 57395 82084 -30412 -317504 -78167 -49132 -51029 -117013
19472 -117013 85517 -193555 -176160 -123903 -245743 2534 -52008 288589 2287 -174585 -47954
19460 95778 -74287 -291834 -52333 -107716 -343612 -243646 -211648 -18301 -47936 -314304 33251
19448 -157911 -43245 -11363 -192150 322998 151400 -175364 -29095 -185962 -203761 -215791
19438 -215791 -173284 -278370 -238205 74171 8276 257597 -197269 -201778 -24283 37621 63090
19427 63090 -123266 -237474 -91564 58223 -178420 -44566 193147 129046 -77005 -99349 -77763
19416 -77763 42865 73791 183237 -90146 -190603 214851 -335445 230678 70306 208330
19406 208330 -306676 285416 -5184 153526 110559 -134139 -18626 -80744 -441256 203192
19395 96517 90937 317378 -394080 61830 -60973 -128550 -68950 121111 -164866 70519 -214130
19383 -13535 95904 -85701 -10155 -94688 66647 85860 -13262 33743 -172819 -219472 -280635
19372 -280635 -27082 236388 156419 -199338 46808 -79306 -99886 3979 -113774 98740 38402
19360 19551 -49536 -131311 99249 -136431 -147779 -495107 -84197 -67142 191711 -211437 78941
19348 41648 -354326 -76817 -11949 -115801 -266598 -195948 -117019 211722 -19144 -313453 -318813
19337 -318813 88010 -233469 -169650 33299 -388227 -209743 102804 -429491 50922 227265
19327 227265 -63441 80825 29916 56293 277677 -112856 26446 -100971 -186841 -12464 184453
19315 15722 29139 -212909 -124900 5169 -45560 142570 -38281 -168495 -254370 59585 -77658
19303 255968 -60768 -557039 -201040 -147889 117932 51695 -9999 96531 150949 -30587 -152015
19292 -152015 82284 228891 -38535 251132 63611 -128240 -133542 98427 -59683 -200370 455936
19280 -57816 -48281 -131887 195241 184742 -184715 -150271 -920 -13761 -71870 -89487 -112275 -126968
19268 -126968 -13869 -149776 -296696 118787 176356 -218491 52216 -447236 81776 -52930
19257 -212798 -117544 -42596 -1399 135372 34445 -235538 109816 228479 -138701 133380
19246 -102268 51087 -76031 -152034 -152563 -43617 -28837 157719 -84454 65103 -174502 95466
19234 -73130 -52739 -243426 -28851 -289694 376110 -52671 84940 112102 -93685 -315144 -163733
19223 -163733 -83839 114199 98943 -312401 31518 72796 220897 -152369 21102 -48794 -256669
19212 -256669 -54420 -214850 -122389 -120575 -210595 47428 -45337 -172102 -382054 189033 -132729
19200 52674 82416 5754 -80737 -67296 112816 370 -403759 46252 -249936 -106440 -279689
19189 -279689 -177413 -109591 -73941 327436 21236 9246 -270154 -183680 -116974 132624 -163261
19177 -346747 170387 174066 -92503 270148 50211 83399 11746 3933 -95456 -223972 -270104
19166 -270104 107849 57990 -70194 -3506 66751 -270883 -134810 -118887 -289748 -28460 -163590
19155 -163590 -199855 -267034 -27878 -405907 93863 77475 119935 -130366 41006 150069 -117701
19143 -194598 -80869 -75321 -120338 -96378 -15630 359859 -154072 183705 181928 -113960 128652
19131 -25896 -195258 -268890 -131487 -272045 -148430 95443 92332 -79441 254105 54466 -11448
19119 -310454 -48587 -40791 -7968 -164029 -55999 -79760 44190 -294614 24800 -5657 91380 262043
19107 262043 7793 46723 -183451 228117 -184054 -504793 -145148 14364 -154758 -147537 344905
19095 56404 -469761 -117353 -39999 48984 -246119 288419 -271333 189862 -161417 -446316
19085 -446316 35883 -64704 -145136 -235949 -41485 -185640 41607 -371752 128476 128688 98068
19074 98068 -10319 187669 33931 -78705 -269882 -258832 -171714 78811 -146301 -184816 -294811
19063 -294811 -258257 23855 -250954 58998 -52602 104298 -116732 -53255 106558 232714
19053 232714 -141001 -416495 51649 314409 77103 -46756 5628 -189779 -137508 -349664 -68001
19041 -614092 -308294 51259 -139609 229701 -247397 63509 -298596 -57453 22667 -147938
19030 -103947 86190 -298099 157665 -35639 238976 -228300 -80392 231400 -11123 92178
19019 82735 -17201 -74016 267324 158096 242271 109361 192384 -289847 -29811 -66531 -247896
19008 -247896 23090 -5775 270810 101056 286413 -304344 111196 194943 360718 332862
18998 332862 -108117 -122166 149666 -205740 -78825 77304 63218 -211524 -98686 132834
18987 -333238 -41940 110027 -86273 -68831 -361945 -12513 -164397 30370 343625 -96456 -74635
18976 -74635 -73472 -143145 136166 -148309 77740 29527 -39500 -101307 -424541 -317666 -252723
18965 -252723 -238423 182323 -432973 -203694 -187896 -62672 177731 190905 -54840 22291 312261
18954 312261 233775 -140569 -105378 133832 27008 48455 -95707 -37560 -286 -139930 33979
18942 -135430 393415 202341 -147348 -7681 -231829 -43204 -50085 90927 -177923 -14871 197004
18930 -156242 -85384 -348737 -369875 9320 -262018 -48272 44803 50414 65557 232291 -122866
18918 -96913 241136 -109621 -272344 -7313 -56326 36424 -124588 5386 -289039 -40365 45624
18906 -129755 -334954 -381426 -50739 59983 55594 -86252 185905 -23606 52686 93214 -1765
18894 57439 84997 -137552 -275402 -292867 -181544 -158231 71251 -44836 -384785 -144137 59536
18882 -274288 -88444 178281 24604 -146401 -7364 110835 25789 316673 127200 -271122
18871 -203986 193716 208840 30187 -123219 210817 107656 -134843 -113440 -244026 -124276
18861 -124276 -93883 195254 180246 82221 -269345 96384 -210847 113488 -286423 -49045
18850 -84291 202703 -441174 -53194 -128265 -166002 267640 171833 -186668 156386 -113406
18839 -176919 -195417 -324851 41207 -261029 274940 114642 257289 -187178 -230653 430562
18828 359868 135270 -191342 -163440 -106943 -185078 -108316 -111231 121387 -176593 -69265 224576
18816 -170926 -225065 -18239 82133 28936 48332 -223199 472749 137984 96515 81214 53469
18805 53469 -125421 455374 -67498 101822 17334 7197 145014 -55129 51845 -175093 -122804
18794 -122804 73079 -95431 -350648 308925 -278715 -32875 -315653 -298103 -65433 -21917 -74718
18783 -74718 -200827 50583 -175066 -114321 128948 -114337 -27103 -230707 227306 -64454
18772 192968 -213879 -163654 -394091 -78273 -42006 296983 -286299 -391984 -115151 -55499
18761 -212410 162013 -104620 -16432 -236675 103298 -308914 274329 -72427 69863 -404968
18750 144403 -127005 -205827 -36225 100729 -342596 69482 -126864 -532 -13417 -19337 -48650
18739 -48650 -42395 -260886 -106011 -311202 -112766 -145189 -235662 855 -117795 -64259 -329 -213808
18727 -213808 -223449 -57815 -243256 -29156 -128500 -24673 48585 189855 -36580 -41588 32319
18715 -87067 -109284 -182797 7046 -379189 -55485 -52834 69743 121930 121384 -37931 -39409 96575
18702 -166308 63139 -137977 -76443 -90924 -23429 72141 -142768 -154396 269662 420973 85512
18690 -13951 -190982 23549 209456 -218686 67938 -185380 -7327 -43291 -9492 164255 236089
18679 236089 -298391 82058 386430 -312869 -196440 -179652 -62715 157866 -44564 -34897 -146314
18668 -146314 -227741 -20270 -64944 -326160 33439 27586 76594 -70712 -60846 -28723 -178945
18657 -178945 -651684 2527 202727 -199509 89655 -208171 138685 -205608 -53513 -335787
18647 -335787 57655 -140684 88962 29798 219252 -174962 37679 134344 87177 225537 84343
18635 103156 -203338 -21356 40242 -197114 83835 -309406 -270694 139071 -88212 -323769
18625 -323769 -101463 182892 -193673 -585636 -334647 -120360 44482 57296 -198297 -48098
18614 147476 -2051 -150314 -44205 -56094 -126159 5064 36206 -67631 -156173 105344 -362020
18602 17277 -221102 -183962 8290 -5580 120996 47983 42510 95096 -139772 226001 -136566
18590 -1329 -204004 -125717 57201 -103598 83521 -332807 -217844 -273042 -195589 -26985 100799
18578 -261961 -288161 154106 175978 38439 -375277 -19325 -129038 55250 -58527 -137738 -157542
18567 -157542 2442 -184654 -276783 134934 -140579 -106693 70896 -269056 61679 -94642 60290
18555 -1289 -217042 -169271 107857 38945 -298883 397529 -7372 279764 -214519 -346278 -71155
18543 -483489 205213 -28318 68259 -9249 -496615 -466797 -62283 209413 -174881 -136218 -40858
18531 117893 -84839 -33368 -113121 -26722 130850 35544 316010 -167835 -100230 -139234 -54728
18519 -203248 -168395 -238681 -9699 143020 -42754 122181 -69977 -72915 14511 -78659 -127332
18508 -127332 44098 107584 108813 134101 -444100 -98444 176711 -31031 -205304 -53379 123071
18496 -7956 -96154 31408 187445 65614 179689 -199213 -52904 122019 -231467 -201843 -30310
18484 1535 -163353 24630 -214463 27265 50497 -278597 127671 -206554 -229661 -13111 221767
18472 -240642 84983 -133344 -65609 409790 -47137 -59013 -124263 -84695 -350835 23558 54983
18461 54983 -343801 -340131 -58182 -227659 -128016 -247272 182143 31797 8053 -142379 -43242
18449 69011 -55546 -219608 -220076 -127247 13909 -160774 65235 -214212 196117 29878 96596
18438 96596 -389516 -100027 41427 -132873 167614 -289606 -97940 -28627 124859 132821 -32655
18426 -301985 164023 -234843 -49613 48770 13025 380269 -95192 -225137 231468 -16782
18415 -110961 30944 -50246 -234015 115594 -148795 198923 -62209 -128512 13504 -621024
18404 -35312 207864 -265714 166328 137318 54818 29372 94403 248487 -165955 40726 -8689
18392 287218 -308954 -207211 -26951 -155117 106646 -11292 -145245 236996 -68497 -58651
18382 -58651 197077 -97263 -25497 -356644 -302062 82271 135298 -135729 53695 23672 -344469
18370 56261 191492 -50923 -110400 179082 177870 -197980 -166547 145900 178556 25488 -176967
18358 -4734 -45388 43147 -165955 59129 390720 12293 -36497 146791 -32357 -177072 145397
18346 -433193 379379 -195773 -246653 -173813 632 87041 248887 -82363 -278077 -177447 289577
18334 -347902 -157192 96207 -42476 -290883 -341461 91146 -181399 78288 -74511 -97256 -115821
18323 -115821 130379 329616 -230719 112313 -8906 -294898 -284994 138603 -136 -147317 -142694
18312 -142694 105609 -471295 252436 234442 -91953 37711 30410 -11778 155753 -226918 -273594
18301 -273594 -114362 -113472 -146059 36849 -174407 -265497 37557 -188881 -161983 -139731 -148208
18290 -148208 115078 -222613 -252964 55854 65106 -139800 77210 -323147 100258 -63118 140105
18278 -3689 152787 138007 -94877 -90996 149587 242754 -217557 200943 -408420 136608 -105898
18266 -222901 88731 -37835 90097 105058 -93664 351088 -63017 10046 -49897 -42550 111142
18254 139955 101707 -179893 -378252 208337 -92955 -34965 -331764 39649 -238145 -49912
18243 126324 33561 131630 244089 223091 -298853 196602 -220244 -93110 -238719 -39145
18232 -71935 -102809 74670 -38065 -21980 -211728 -135225 -127454 -195328 199754 78737 -319484
18220 35355 -207632 87594 117254 -117961 49392 -48806 161996 -398245 -204164 -105632 -350868
18209 -350868 75308 -197206 -22312 -59281 -49790 -161018 -39993 -48015 -12802 -95441 93247
18197 -77854 339345 -18111 -73233 -112337 32425 -85506 67145 37109 74883 133653 -187330
18185 -69515 132255 -186962 -278348 41403 97737 97590 10500 194659 186922 25462 141874
18174 141874 73152 -64942 167332 125017 305784 -48178 456258 -72364 245964 302701 78457
18162 35335 -52086 -192568 -212987 34019 -181311 -153074 30170 -302982 67555 -1000 114650
18150 31208 141181 -98511 330232 106862 109539 -186047 -75343 114792 -119494 -381794
18140 -381794 -212428 171983 71254 -84965 -130468 110595 -10818 -203420 -130639 -112466 -202357
18129 -202357 -104635 -222082 278022 -275350 -177710 101784 101327 -77837 130632 -244393 42120
18117 -37695 -294741 364780 -372707 80136 132061 145243 -264004 29579 -248783 -136438
18107 -136438 73813 80998 158240 -165539 -49154 -66769 -54499 -109566 -369127 -216465 161764
18095 -74137 97946 -216101 -13003 110289 -218757 31136 -178184 -169750 -103801 161579 165701
18084 165701 -48224 -186877 -50354 -81994 212235 -258665 73920 13908 -48798 -206987 -283859
18073 -283859 37272 149136 -200159 -180748 -456002 119133 -109542 -60600 291164 19301
18062 154859 -1907 -157441 70924 48846 115100 -227147 -8148 -148004 59674 62845 -90577
18050 -159108 55729 138612 -295690 -88508 124093 -311673 -68646 -77958 173673 -70463 46433
18038 -250571 -178787 -271350 -69697 -124143 -242831 1809 -123113 73965 146696 76648 402165
18027 402165 52457 16303 242847 154364 52929 56822 9975 144259 3868 -43764 -177391
18016 -177391 105416 -158173 119878 207823 51598 -190549 141769 47472 -60479 -127673
18006 -127673 -388288 -200659 -289879 -160879 -138313 301336 -126267 -184942 -177894 -310618
17996 -310618 14499 -82725 -302620 -184778 -48750 29712 176522 -112354 -258624 -98641
17985 -143197 74187 -90818 -37332 -82166 -7095 381349 -55518 -69578 -99893 -284345 -337487
17974 -337487 79859 35716 16 36653 128115 -68989 -48517 47885 118247 -8516 77089 -149740
17961 339596 23819 462564 15203 190340 26443 8687 -131654 -186532 39141 290759 -189785
17949 -269153 -361804 -287045 -8262 -26061 118214 90474 -24041 142896 -230141 210937 333252
17938 333252 -213295 135622 -233450 -127768 -419078 -133749 -124643 57320 -14417 -263203
17928 -263203 -148409 -195494 171028 -132356 -6500 88765 39775 48977 -385590 367192 129842
17916 -120350 -303134 -180031 156700 237839 -52005 -180294 50198 178143 54832 -14578
17905 -35227 209779 -305876 94858 -59465 36142 -15463 -722 -28880 42908 -80849 -32399 20699
17892 -10996 54393 -291976 279263 -68460 44839 -205612 64036 -322870 52895 228256 42184
17880 306510 135745 -64854 -165056 5448 -131967 129722 -61178 80040 45519 228358 286915
17869 286915 9409 33199 12694 81759 17392 170546 226209 623805 143658 341394 -91170
17857 -242555 -126803 -107541 -180873 -137869 -329109 106077 14382 -224040 -165123 -187817 73266
17845 -28059 20762 23969 -87051 96142 221747 -303296 -199975 -22861 -18687 99946 -37851
17833 58741 -186458 66244 -44194 -47419 -65873 36899 172190 181870 -91813 -5232 119315 75525
17821 75525 -140713 -164207 113514 -91979 127026 135343 172229 50945 -43730 -78578 150824
17809 165048 -246213 194750 -8161 -172034 49635 148840 191869 -93898 -43876 -286397 110857
17797 -58294 28801 -179681 303212 -309495 22897 -286501 -232631 14853 -52598 -144105 -189683
17786 -189683 -326650 163599 64599 77738 -77596 403280 -18674 -107593 129967 -408165
17775 -104213 255828 -65182 45962 -313469 -58996 -70472 -104574 -23029 -206947 -48245 12176
17763 364152 -95238 -168958 -149639 57970 11795 -173068 179412 179337 175426 16895 -88647 220669
17750 -7148 -2555 -26816 -128183 268743 344990 75141 -57349 131080 -948 41799 -49890 182116
17737 -93272 -60075 84477 -282965 47334 -48361 118753 101015 257239 -55277 128228 -167990
17725 174727 -198942 -199109 135343 -230845 239551 -193292 260058 -333000 293557 257464
17715 257464 73317 -34399 208239 -340479 -10920 -62330 9790 378220 -50557 118211 -133498
17703 -438172 92339 60274 90060 -386097 -342348 89487 -4105 84678 191786 -193211 228791
17691 137453 8724 78518 284317 56685 -76383 114286 -22722 -107652 229263 336157 136659
17679 -47839 -13054 -46801 103659 134928 359390 -133212 -46912 -126465 -193692 -115202 408102
17667 -10859 234101 107776 149078 -270118 -180753 65389 -249436 -38664 46662 -167842 9753
17655 -29630 271662 159367 -13650 -276272 -31922 37602 15254 89840 -238623 57715 -303521
17643 172430 236604 -131875 -82598 38061 -318971 261578 -207214 26934 -21026 -19091 313639
17631 11997 -131599 -349965 214375 -31899 337230 20949 30098 -147922 110371 105010 52708
17620 52708 3785 8737 317512 -18897 -178472 188104 -31230 78442 231342 173238 438816
17609 438816 -14912 -241089 184517 -104708 95830 382172 9384 94689 57716 -150963 -50219
17597 -273765 -49213 -427794 106419 209914 -77936 111401 -139423 -246181 -129568 179597
17586 -23351 -150060 90908 -478980 -178562 146361 -5629 302397 -166318 -91097 724 91700
17575 91700 -93210 150597 -6043 254608 -113599 82333 432696 -303599 -191610 -85918 135134
17563 -81214 -14711 80552 -269920 -158115 130258 -160987 -154013 -59260 -121621 -99542 233112
17551 -317566 79871 -86971 -203142 241418 -325832 187226 -151348 22663 -75168 169331
17540 -113118 199328 -136716 38712 163037 140697 -335614 107811 -14113 340530 95095
17529 357420 186005 153474 -7394 29407 16095 -88743 96569 67278 103117 -121837 29862
17517 62602 114695 261335 141581 43976 185738 -279866 152852 337079 185594 263187
17507 263187 193065 66987 12514 -59920 -101629 356000 146718 170612 256935 145574 208631
17496 208631 -52260 -318013 -257650 -19047 13298 73294 359640 186962 -134876 -55881 -53915
17485 -53915 153299 21731 262202 -126488 117648 144712 325450 -267962 -60070 31557
17474 164468 138040 26932 -115166 -6105 122009 107799 279082 33137 -96570 40989 11656
17462 -148345 134317 108639 121343 -122489 311741 -183974 -258566 98646 49487 301207
17452 301207 -86220 115785 126316 -137408 -16111 173559 42554 1322 172548 -13278 292816
17440 4757 -43243 103799 133166 2625 370122 131456 266518 225035 -2194 118093 -11508
17428 245421 231842 214789 26841 84413 78581 -114075 -13320 -9540 20305 284289 79589
17416 267087 793268 301826 50633 -2388 235894 212229 169055 247944 59124 84659 438939
17405 438939 314749 249683 -72682 83510 380759 385761 371610 346796 249358 380231 138093
17393 410569 200958 217932 5754 -132975 30436 76996 177564 -168863 93949 159022 393390
17382 393390 89023 159657 178952 50140 475475 317718 88741 49686 -88124 51524 22566
17370 435399 50578 423811 68193 306742 231869 152122 78905 223791 -205214 -129880 228284
17358 -8760 118426 207527 219868 214346 239591 -114352 233913 -6444 313194 62490 -109864
17346 135661 165876 56036 21689 -151367 224030 7891 439383 392073 -382731 -17811 -133329
17335 -133329 91056 152220 102008 284804 295191 -58881 349250 -121054 104864 16627 175967
17324 175967 289907 105382 104084 -255231 59049 -79734 358288 326157 220782 94087 129858
17313 129858 -29118 112411 239647 121625 -100097 3102 149289 462103 113222 146230
17303 146230 135261 207988 95413 192668 257617 227713 277696 -8761 -34690 -5616 -57944 140606
17290 301081 225267 -234767 -28075 -1261 236359 89528 -54737 432544 477630 -27880 -78714
17279 -78714 172154 430228 270782 -16377 199758 -101595 250070 263102 15228 -51324
17268 65072 105592 102668 205818 -17722 216589 208969 343023 -65299 74063 297906 237808
17257 237808 216507 44345 59341 44792 45673 -46470 136156 99227 44656 -152310 312079
17245 -8965 295858 337149 4666 -30915 147504 -68026 573603 365258 -125013 361477 45093
17233 182763 108329 186756 377570 236146 179514 241514 232573 290500 26495 386420 73107
17221 317376 135030 282446 59247 -29986 -76 276455 123904 359417 46919 81132 -173497
17209 225129 34955 407163 -12384 203208 313051 190565 179105 53252 293000 381822
17199 381822 186325 9513 420242 538323 120467 198983 421699 142742 -180797 -60041
17188 169490 -26948 539207 53706 373222 177035 119035 287728 365124 185518 -3743 -179655
17177 -179655 240905 118806 87875 187431 247051 296178 152004 40238 309967 43409 22616
17166 22616 314062 315389 53733 192982 291029 152303 518870 294547 129072 6667 192751
17155 192751 379783 -19087 437180 138356 364127 329624 236223 300242 297342 194600 382531
17144 382531 322620 225438 116210 59010 317933 364881 159607 318142 88446 393473
17134 393473 251018 267283 247498 27147 204761 -55281 333973 360742 186679 151706 496058
17123 496058 166151 188157 69752 52833 66336 67894 462177 908 483166 340939 127068
17111 149933 163043 358893 151340 349146 264610 386545 353310 237715 297153 437906
17101 437906 310282 -176541 256607 745665 438763 283861 480895 457742 141744 145215
17091 145215 441051 362504 60885 5060 321087 400189 259032 109906 63200 319985 280275
17080 280275 640402 255942 450196 232589 535285 511703 94827 447201 227514 236757
17070 236757 249784 205832 643708 360753 470478 128768 385810 197249 -9124 413508
17059 252905 353362 404544 237280 525349 274795 440232 495833 415394 271388 466874
17049 466874 340576 436150 803865 391730 466335 451952 428084 193546 341466 348828 427704
17038 427704 546481 450679 393244 441615 588987 591136 219434 456200 496651 760474 735915
17027 735915 235837 432053 828879 218399 496007 348251 581318 760794 329340 500326
17017 500326 394634 132959 462797 579639 678243 733170 451900 260140 383249 664119
17007 664119 682169 537660 496854 593339 718242 853831 491388 541665 345864 897242
16997 897242 591134 610744 550989 840759 751728 456698 423990 722498 370976 754161
16987 754161 543025 601678 464244 513145 760552 399450 953074 767595 846612 376681
16976 865191 997176 984221 799253 742413 355032 652992 669657 1117403 586523 801828
16966 801828 730384 630537 568485 753563 796682 1102953 919364 593289 603595 496514
16956 496514 921456 813288 886154 813594 827571 1017122 868479 1247863 780596 926968
16946 926968 913284 1563398 738741 976453 851198 619750 845582 771352 892868 1071983
16936 1071983 519471 916969 1049359 958543 905809 1133363 941243 1407477 1033095 771875
16926 771875 1223800 1116813 703138 980782 1460664 917143 938903 1187120 1058553 1248787
16916 1248787 1383705 1317265 1119675 1062765 1170632 1171719 1107612 1300985 963310 1371133
16906 1371133 1065638 856623 1305680 1247401 1213918 1592334 1441045 1343111 1201624 1627200
16896 1627200 1328080 1213531 1496273 1745493 1418207 1389083 1660888 1395311 1543341 1412049
16886 1412049 1748535 1817148 1682969 1676349 1562355 1544799 1712788 1709261 1669098 1654933 1700966
16875 1700966 2243046 1720278 1806474 1888927 1652211 1636595 1980011 1925990 1853804 1874253
16865 1874253 1941138 1819255 2069784 2179993 2326195 2219415 2232681 2133690 2008377 2213544
16855 2213544 2435728 2243027 2153760 2198033 2193732 2508053 2294702 2521997 2794934 2783675
16845 2783675 2645863 2509392 2926446 3010514 2874578 2895409 2981290 2911161 3320029 2965705
16835 2965705 2934735 3039755 2746257 3189883 3344032 3386181 3712021 3204641 3552074 3485811
16825 3485811 3452824 3593338 3582971 3697360 3734758 3913754 4081501 4028057 4190134 4231614
16815 4231614 4337019 4355091 4735324 4161841 4258628 4356833 5062470 4578600 5274175 5150420
16805 5150420 5444282 5028833 5431842 5240358 5363908 5905460 6044053 6015867 5823610 6167424
16795 6167424 6131118 6945707 6699809 6810869 7083774 7265576 7575077 7236317 7805955 7924356
16785 7924356 8110619 8529680 8139597 8603184 9055814 9252391 9167861 9243244 9784531 10119133
16775 10119133 10603941 10823581 11062488 11332865 11641300 11641915 12490498 12575940 13070063 13703253
16765 13703253 14164162 14256479 14728361 15426298 16160608 16307402 16814916 17927445 18187745
16756 18187745 18900980 19819856 20365609 21345008 22282437 23120622 23735556 25095860 25862307
16747 25862307 26863065 28313150 29644375 30721036 32157924 34051959 35542048 37411039
16739 37411039 39221598 41220900 43056620 45154633 47793506 50513286 53513168 56532443
16731 56532443 59572684 63214458 67076050 70840681 75451067 80205990 85009558 90590229
16723 90590229 96082160 102371661 108925335 116023123 123012785 130287992 138650151 146686296
16715 146686296 154689131 162749470 170985296 178410123 185904858 192537045 198385276 202737913
16707 202737913 206484512 208575454 209283907 208001313 205701925 201925096 197005014 191112825
16699 191112825 183917191 176606548 168356432 160339734 151961795 143531714 135782194 127699577
16691 127699577 120139111 113114492 106291387 99744696 93797779 87858337 82865132 77755943
16683 77755943 72990532 68721657 64515424 60610740 57436071 54214592 51114706 48191034
16675 48191034 45995752 43329886 41192025 38825397 37039791 35551262 33549629 31996981
16667 31996981 30456340 28685942 27910959 26553499 25608824 24099499 23522594 22246094
16659 22246094 21363017 20124264 19705140 18858318 17994416 17726664 16688883 16355626 15880903
16650 15880903 15337258 14652044 14155804 13586742 13368318 12961874 12241669 12028402 11592146
16641 11592146 11529195 10907569 10939485 10318283 9939866 9605781 9406173 8909301 9330085 8688399
16631 8688399 8504928 8588515 8001208 7757891 7755496 7403480 7502540 7131584 6952189 6825411
16621 6825411 6493972 6337812 6224521 6302853 5926896 5756558 5813635 5554507 5352763 5447979
16611 5447979 5380681 5199201 4861772 4935621 4633860 4612168 4700443 4771612 4186716 4669817
16601 4669817 4211421 3740553 3994329 3844948 3807667 3964332 3781912 3777147 3215781 3415001
16591 3415001 3437020 3349600 3529902 3251653 3446475 3144888 3489896 2720860 3084350 3015811
16581 3015811 2609862 2955647 2787238 2753151 2905297 2836290 2700107 2416349 2626710 2689632
16571 2689632 2487059 2472942 2288666 2278668 2343481 2233686 2203885 2037313 1933887 1986828
16561 1986828 2261363 2145893 2224386 1967559 1797166 1956325 1916722 1843496 1914324 1873714
16551 1873714 1470629 1668110 1592703 1526453 1696325 1797687 1560060 1833955 1602430 1424110
16541 1424110 1525436 1513650 1594253 1542036 1243289 1573801 1112421 1316522 1650795 1673149
16531 1673149 1334104 1556445 1398134 1139954 1305784 1073579 1484124 1317821 1306945 915915
16521 915915 1409084 1252179 1455035 982475 990496 1336010 1086085 948943 1140646 882636
16511 882636 925923 1204078 1301213 1157600 924471 1054154 924948 808162 1079920 737231
16501 737231 1369711 985078 780860 1083136 1035528 599832 994838 869802 973629 756615
16491 756615 1240558 490017 748027 1192237 687542 1160422 976383 945361 1100502 557908
16481 557908 358383 960185 887491 642922 766598 881579 836138 917504 301763 933329
16471 933329 729745 483500 805558 573986 773529 864123 778232 770154 616803 1273973
16461 1273973 627372 786525 799480 636447 838168 481346 673278 846212 206917 432289
16451 432289 370480 365250 376989 670387 619399 670422 485588 475427 584771 712968 760057
16440 760057 290764 833492 610289 237029 785780 479117 432405 572941 541570 635637
16430 635637 378472 250201 390573 553021 465249 342992 541873 473766 97301 177215
16420 177215 501982 398582 589950 573675 443661 369115 327570 444628 183596 352356
16410 352356 441248 401926 607571 241419 231147 281145 203906 416510 378808 321505 598967
16399 598967 399201 289197 281888 628628 337651 221744 740272 409750 315166 310618
16389 310618 343931 256859 311765 185316 318287 374734 715341 117532 373999 257027
16379 257027 397703 612758 333947 330686 532200 244577 295854 375338 559919 -46920
16368 289664 -94348 39480 95663 310907 536255 198367 120493 637914 247511 208972
16358 208972 308268 263484 366795 412074 139307 454099 263108 92637 226302 292642
16348 292642 178881 229403 446546 -23906 341975 358124 526697 -78440 -344713 211982
16337 334017 218288 641267 179304 198412 -229911 254737 390933 357604 357968 519421
16327 519421 59256 398038 281820 313982 -46708 40625 244245 240278 226812 234801 320325
16316 320325 229166 225010 180718 -15179 140376 511407 341885 207048 -107237 308325
16305 62791 525840 -121205 -150038 -38952 243912 226842 -255257 177921 138326 70564 529603
16294 529603 264993 56301 519377 -151941 -47266 31776 116461 175505 -30954 436963 -92937
16282 310341 233450 106796 103363 445326 386913 208170 344806 255103 242887 -54137 -443283
16271 -443283 506134 306014 -9110 7083 -24924 136245 51034 259262 -315745 108683 41143
16259 22641 12631 -33902 186587 113535 -126524 166066 119239 410593 358482 246509 126663
16248 126663 251467 218104 417103 181477 205404 458417 171561 100183 384235 47070
16237 -30248 369916 161325 71096 -71452 -20447 -84067 193209 83656 62913 99978 43386
16225 -12026 213191 -41618 233511 2348 -111670 55213 1815 84724 334482 -229066 354601
16213 127106 -54090 263475 -23530 -165559 -57528 140564 73048 184507 219357 272076 220577
16202 220577 82318 179695 -83412 49973 353824 24493 257010 -340447 -13789 123606 -63418
16190 569672 115711 135698 270900 -13775 -56440 -28504 36438 9457 109924 259012 -18957
16178 29621 32194 -67261 -76512 94284 -209492 207054 -452609 -140038 -60243 82536 41588
16167 41588 222576 121933 -20370 -58921 50631 32375 255055 -55356 84704 78876 66314
16156 66314 -273712 -305516 141186 -97741 -159605 -197550 194082 202666 166011 34788 16965
16144 -108174 -86346 -25636 -74966 -266841 127240 129704 100376 21591 -112118 155861 -31031
16132 119018 62297 338538 -13989 -58168 -145826 145037 -47330 -150350 311625 -146805
16121 70688 241551 235250 -123928 -111342 -100982 161963 -54374 323960 250854 276626 275055
16110 275055 168063 -66318 -76137 -54053 64032 85645 188441 257531 461527 35239 81599
16099 81599 -251560 189500 21944 113891 114551 -70609 963 111013 -109640 -95217 -321606
16088 -321606 -127042 58554 -117488 -297723 -44113 -344954 144126 -144063 -13245 320038
16077 -214165 75486 -300065 212414 -106664 -41681 300324 -81468 -342345 -14354 232138
16066 -154782 -81215 -248633 278568 98322 65674 -12134 49991 -31661 -330945 105483 11067
16054 -150376 -25255 -225407 37170 107510 -231009 48866 209746 -47435 -123774 47590 256858
16043 256858 194393 -193125 98254 -457148 -50673 195696 17897 64663 154728 25552 662
16031 -283034 25897 23935 -257876 -102904 -68473 -69213 88170 -207834 8510 156549 37105
16019 186853 -166500 130570 16979 21726 -364378 -59780 -54103 40073 -18036 17619 -54019
16007 94308 -179495 -191992 19752 -156046 60619 -81585 -147554 -108574 -262861 78821 98767
15996 98767 -13313 219740 -190523 -123527 84817 -79171 -225539 106434 254341 -41751 -223377
15985 -223377 -226729 -104736 350271 109772 -212213 69846 -60550 -117100 -95705 55530 -159038
15973 10479 -117104 178938 63723 178929 -270397 -105492 73765 279231 -113444 280824
15962 313138 -140444 99840 26848 17527 -244351 5746 -29906 -49331 -78055 78450 -81808
15950 -94519 82188 210438 66023 -258134 -37834 244170 -62882 -248375 33175 233931 134853
15939 134853 -101412 -219495 -370593 -214746 -190072 -166752 110697 25766 -181135 67065
15928 -161276 -98109 156830 -361849 203438 -111578 288501 -79081 -178972 -402175 -234521
15918 -234521 -37510 -111297 92311 -170748 127198 -121843 -85411 66833 -283469 -311801 81692
15906 -149534 -368467 -220267 93883 79268 -66087 93966 -121335 329132 -114833 -169865
15896 -169865 212572 332675 230208 110663 -74287 82214 -34375 -253360 -71217 58483
15885 -50870 -152826 -92745 115816 72619 16467 -217303 89459 -337 -51176 142871 -284845
15873 -128748 -340024 40777 79860 -243514 402517 90726 227838 310715 -193022 141077
15862 -63270 69818 220387 -207910 -40529 -45826 -62010 157906 15697 -268152 -85269 -172278
15851 -172278 92634 -264559 -119689 -287378 -241211 -276150 -153689 -284583 -49306 245679
15840 -111034 9254 -90928 59233 -202666 28590 -309200 -161583 175660 -194498 -301820
15830 -301820 -83665 16145 191460 141103 -289675 42471 -139282 -2345 -132021 262371 62141
15818 -14598 -58443 -8763 37599 -42123 -361239 -118972 279281 55149 -345200 142971 6821
15806 -44873 -222420 -86721 -194387 -280265 145204 -258866 -143179 98141 -193767 -124098
15796 -124098 5605 -269370 -177404 49856 -99165 101981 37338 -111732 59938 67710 -68098
15784 -44052 97812 -73460 -368487 10423 287879 365880 -96149 24876 -13253 -26966 -386022
15773 -386022 36951 -175606 112288 161932 -30541 216274 -178703 321597 -55196 -94954
15763 -94954 -160248 -307975 258810 251159 11864 110903 -182765 225740 82657 -139569 -163654
15752 -163654 -225661 85630 -105538 47025 -102632 -74838 36234 -53944 -63502 143894 -193142
15740 104766 -164417 31330 -46046 181763 -107437 -31486 -88300 -8812 -266769 277379 105048
15728 -346333 295592 40351 -11237 -19576 -28916 -19231 70270 -47058 84037 -102448 126100
15716 -95437 -55383 74091 172607 -350624 -135112 -144832 -262565 94875 -85077 324149 -356093
15704 -301017 -117408 -96318 -102733 -162527 27541 -14799 65640 124783 -203383 -46542 -34489
15693 -34489 -143788 -281945 -319123 -210723 -139590 -270999 -113663 27111 -24056 -208535
15683 -208535 -213901 -57506 74970 428868 -79210 -28014 -97494 -28683 83413 -262866 13564
15671 245743 -185609 -135889 -179778 -95712 -448187 36764 2084 -100766 -70184 117602 86998
15660 86998 168485 50453 87137 107543 -65617 1002 -42723 -210934 132185 -115775 -115982 -198252
15648 -198252 114551 25528 2530 32919 -124894 -244871 -123913 73469 -201149 18038 -235371
15636 -106456 182554 -123793 64714 -118589 -237037 137633 86103 -203841 83951 57051
15626 57051 358663 418402 34121 -12659 -40627 -348889 135177 -47293 -60153 -233603 201570
15614 343941 -261707 -175144 84666 -164040 -175247 -42349 -216766 -112757 -115123 152105 -79684
15602 69995 23675 -21364 -63593 -121236 -126369 48034 -279112 -120497 -254830 -28891 -93944
15591 -93944 -609145 285429 151995 139208 -72494 -285016 -62198 -119078 150054 -435275
15580 -43792 -112930 76118 -233021 -269546 -8075 -180762 -23208 99298 185378 141211 -91922
15568 54440 -44099 162454 -88285 118613 -133456 109020 -169083 -332673 -94491 153728
15557 -127067 12688 -194097 45672 -253477 162155 -272748 241149 -220558 -178587 -97124
15547 -97124 -201532 -196807 -130365 175523 -10930 38180 33789 189139 -259151 -258526 -163967 199010
15534 -85531 -98976 33542 -94050 -359611 103444 173772 -99444 -375617 -179846 255080 -50284
15522 -148954 219090 143412 -88385 84384 -108008 -277999 130730 -26919 58107 -250035
15511 -44884 -120133 -187598 -137503 14048 -363489 -31348 19194 80941 131965 83034 -267518
15499 -134160 211738 151905 84567 109154 5900 28803 -302012 120337 -331862 -76957 -184536
15488 -184536 -14904 187637 -140755 152549 87234 -325631 -32389 123822 -56865 -15389
15477 -142324 -165593 111990 52501 -320726 -243214 -54061 -119437 -66057 -351424 -103166 -163291
15466 -163291 2258 -176358 -184565 17935 15972 -31518 -68553 -139132 -255507 -203682 -8935 -30607
15454 -30607 -101697 123921 9178 -40612 -222679 86493 312692 -96001 57937 -208741 -261575
15443 -261575 244862 -154498 -237595 196898 192872 252733 69661 257566 96650 426547 -55928
15431 -9252 -270090 7891 286281 237928 -158949 350981 -130549 -204997 124299 149541 -384175
15419 -59456 -53324 -312038 164462 116276 -88919 181955 89015 -77119 -254195 -186036 104071
15407 -42370 232405 151550 198959 -169989 -34766 -251287 -69415 -23558 31040 44104 -197215
15395 237011 242615 -38228 -106658 -230519 263124 -10820 -278045 377412 28766 -121306 -6415
15383 123168 -49547 -94498 9363 -341865 37964 -321576 271960 162271 -55343 200532 -33796
15371 -264177 -284478 224128 -274336 -370609 217815 126065 -146664 -64738 -54571 -25704 107127
15359 -77727 229449 218119 -68960 -104568 106817 -167645 -266331 14785 -143259 -211617 221310
15347 40683 -28742 -717 -86721 38563 66477 -104377 33898 -181352 -26183 251852 30215
15335 117588 58509 -149874 -111030 -24243 -260770 -10550 93468 -42555 -141561 29883 -290413
15323 -161959 205477 -109606 -181747 -107 35475 -21109 -267974 -70968 -144084 -374546 -37318
15311 474239 -92834 214497 -332524 206337 80678 314799 385517 19653 27600 53762 -171259
15299 -122603 254164 199772 167167 311210 109369 78352 -55637 28934 -90701 51627 63369
15288 63369 79309 59992 -94454 -229949 -150076 -49391 -7448 248863 41141 -53993 -148991
15277 -148991 -49592 431236 -145460 81453 -125678 164245 166947 70864 68544 -131618 -256449
15266 -256449 -17529 52394 182714 -174808 237487 214757 225915 103222 112658 -15525 -137354
15255 -137354 50536 137484 7872 56046 -105372 61760 -166276 -179215 110175 270837 -237833
15243 -308842 -114939 242902 374162 -190335 109348 323929 635855 371354 600542 1402724
15233 1402724 1038134 882663 773032 616340 382639 404123 113064 133694 -49473 64070
15222 -93448 211653 41008 1028 -61668 74678 210588 260802 77159 -198493 50929 106802
15211 106802 -13858 -140709 -166136 -102732 124745 85545 -72619 75763 86168 -23264 74795
15199 210596 116215 212665 219514 645 -153159 83915 118295 386278 -61090 485389 134023
15187 -50349 69545 -36397 237229 -65724 -254851 -139198 -35630 154633 228519 33804 -182219
15175 -302192 180749 278674 -84623 35610 162293 79382 -99801 407470 61692 54112 73554
15164 73554 -90324 48234 -125043 -204993 -66068 260676 -111459 240161 -11666 112564 -80706
15152 -3817 15895 -44679 287233 309496 201262 112199 194998 -27446 93691 155722 5236 126747
15140 126747 -144365 -168336 158422 338220 360790 -10719 2945 -147988 106267 -215540
15129 217005 -30906 48058 254796 112493 18535 -313009 222448 -68661 87941 -4895 37578
15117 37843 171265 -99676 12193 269094 124876 33658 -296085 48212 -46564 -81248 110971
15105 491685 113154 -157784 235234 98253 385587 15828 271736 -112579 151445 214200
15095 214200 46953 70045 97283 138886 768870 -64642 142653 205722 -4919 28075 67448
15084 67448 -48304 113434 261150 183841 83264 33910 -216545 278192 177107 -61769 255535
15072 -65743 -233706 349456 407408 78303 319726 423124 -24841 320987 257250 -222220
15061 170010 -89325 364909 244383 392421 -201493 232918 212917 -19802 -100178 -221889
15051 -221889 102784 344134 -137173 -139844 205783 -218944 436588 183579 131265 347276
15041 347276 31818 -24698 183777 -20739 140567 296496 35040 236492 336566 269853
15031 269853 336084 224477 76668 186885 177558 63524 -16976 214905 249603 -59925 -249048
15020 -249048 301869 239633 -130449 93078 15044 362674 79143 -20236 360102 403179 229872
15009 229872 -91751 237297 118320 192329 124292 226469 -102668 -26824 161926 51682
14998 12625 12015 47638 194618 -43386 233343 109978 77171 27243 91014 -66101 122206
14986 409835 337489 209814 265891 -93653 39948 88706 396450 342926 -46440 249248 202635
14975 202635 169007 218645 309084 310030 217704 488124 2708 101109 66926 156222 355759 -30554
14962 -40563 384905 255252 67368 164354 32530 114382 344463 51448 180871 314793 331130
14951 331130 203502 325105 85142 266220 239445 -322953 158442 -145219 349121 104211
14940 126076 395853 198151 381906 213515 240814 738224 250223 233226 87923 -34484
14929 265041 58569 288868 265939 244606 40110 -43893 412990 368401 190419 333661 401058
14918 401058 -242618 711962 241018 179522 294818 358309 370652 269287 435395 52589
14907 -67326 234884 138146 243781 -48165 161666 568547 -90223 180980 275650 204802 201669
14896 201669 207476 304271 173640 300870 286079 149374 567129 198256 437869 351146
14886 351146 148262 157580 334904 202705 339371 175015 274393 554639 254986 198115
14876 198115 125066 -29143 254772 107606 480061 433139 482627 308690 206317 287429
14866 287429 296786 239466 277598 318849 344370 401281 503185 476224 167861 386369 283921
14855 283921 373889 305125 302304 135366 96618 342425 367304 10447 166409 134805 371948
14844 371948 534997 555809 196555 463677 559866 217708 363628 571439 248446 584545
14834 584545 709784 232619 361224 506859 158914 393669 417895 533204 492928 446999
14824 446999 367536 584422 104736 709585 673341 332503 498927 768661 182235 444844
14814 444844 100746 474271 250273 817994 433247 207887 390816 626320 476206 318829
14804 318829 623663 327769 653067 557497 493930 403060 285568 725660 513143 411449
14794 411449 578329 82397 616779 84335 678473 751237 517794 333539 293000 691492
14784 691492 486032 257580 681620 697438 389984 322463 177955 606697 476776 307152
14774 307152 493386 574961 776966 621500 530747 733404 790911 659540 436085 680756
14764 680756 616875 417631 525705 296565 181506 316579 664956 634603 573998 482877
14754 482877 374295 978038 749229 539512 818773 413453 488620 541447 1013897 327765
14743 833830 447746 511767 395301 346380 531239 474867 327359 527470 689104 625085
14733 625085 630853 602381 499076 996565 815840 865921 364070 646015 1150224 686855
14723 686855 759690 682399 851198 740835 528052 568140 847611 586917 609290 385694
14713 385694 609425 635865 358876 730937 972387 676911 1199502 850707 723188 755876
14703 755876 854224 763062 353196 806158 869272 591346 676464 557964 1000192 942879
14693 942879 677533 754442 441558 772080 929437 1089972 647858 783778 560828 771499
14683 771499 540861 1058236 822518 1050087 1037811 1148816 963685 1147875 956735 1083932
14673 1083932 1235278 1209971 873074 844553 1050377 957235 1163721 1071120 997800 753978
14663 753978 1061415 876019 895918 736942 918022 701371 944559 822328 909965 1176119
14653 1176119 1077377 894721 1122591 1177772 1052984 1509889 1134533 1021300 832843 1543882
14643 1543882 1154137 1167364 876092 1137114 1217810 1030826 942025 1487964 1272926 1254063
14633 1254063 1170870 1286680 1321493 666589 1226068 1091503 1215819 867258 1035581 1184945
14623 1184945 1433338 1515776 1201704 1239721 1109132 1014910 1093088 1306196 1324355 1210123
14613 1210123 1335115 1361085 1605835 1268189 1478737 1279571 1622890 1405337 1585607 996269
14603 996269 1366169 1600804 1375949 1200084 1162450 1711358 1203793 1377655 1471398 1739664
14593 1739664 1647870 1646361 1550232 1441574 1635017 1618824 1494866 1620607 1764898 1789666
14583 1789666 1515401 1433088 1717767 1718822 1669401 1517965 2127907 1727375 1760881 1834639
14573 1834639 2104716 1868159 1683410 1792937 1980000 2289402 1835354 2017968 2009336 2018310
14563 2018310 1859405 1775906 2298547 2274341 2014457 1988696 2002847 2127850 2042695 2263227
14553 2263227 2654668 2045087 2369604 2552950 2607657 2508042 2925514 2773257 3029844 2901166
14543 2901166 3349974 3591433 3697757 4284984 4291618 4953321 5501657 6367070 7973615 11154999
14533 11154999 15173989 21676840 31382771 29169959 18210745 11177514 7019824 5554153
14525 5554153 3818916 3254827 3285238 2845670 2829021 2440736 2221819 2314856 2152357 2379730
14515 2379730 2284264 2314662 2662088 2614473 2424955 2670121 2639158 2252386 2682523 2447565
14505 2447565 2312497 2404778 2630741 2545544 3084678 2837552 2843710 2564978 2697877 2920279
14495 2920279 2889364 3065945 2808782 3253298 2759337 2651167 3176031 2959225 3206314 3151013
14485 3151013 3319352 3311361 3038576 3300020 3468264 3118902 3320032 3444766 3383964 3807637
14475 3807637 3524689 3245133 3787774 3497791 3719082 3805716 3892629 3945429 3705234 3893749
14465 3893749 3815966 3823857 4097049 4177605 4008132 4119946 4201598 4157020 4183314 4398833 4134270
14454 4134270 4365518 4499833 4556049 4366408 4544352 4772159 4673059 4730109 4552577 4878374
14444 4878374 5162041 4945859 5052884 5161279 5049592 5403152 5640303 5579343 5334514 5620070
14434 5620070 5626110 5988125 5698685 5731688 5816461 6014713 5847835 5973852 6333996 6320033
14424 6320033 6236247 6611560 6707889 6604985 6705921 7014966 6693113 7000052 6785250 7053147
14414 7053147 7025905 7456454 7338905 7672901 7141197 7833882 7957479 7907323 8119722 8223464
14404 8223464 8245783 8421277 8923116 8797925 9039712 8901568 9366525 9131829 9447608 9630902
14394 9630902 9598670 9567543 9867634 10022261 10061274 10153403 10392784 10752855 10995501 10621991
14384 10621991 11022996 11414021 11538722 11634575 11925256 12089671 12583492 12626975 12612831 12950030
14374 12950030 13168734 13396679 13683900 13801082 14447696 14437904 14506527 14954699 15273031 15707425
14364 15707425 16028074 16159375 16400292 16674551 17090072 16902885 17719635 18033199 18498050
14355 18498050 18788159 18784558 19550826 20264164 20469243 20812650 20933069 21404071 22032608 22563046
14345 22563046 23180783 23563851 24591712 24765820 25727962 26277803 26394035 27488617 27908019
14336 27908019 28431635 29393379 29987214 30584831 31482465 32256408 33250843 33930914 34843118
14327 34843118 35897144 36880834 37918857 38770658 40133638 41392927 42559934 43472969
14319 43472969 45076231 46272462 47697121 49290628 50730058 51972741 53896258 55706205
14311 55706205 57621527 59826987 62081879 63903494 65920561 68440544 71214502 73975450
14303 73975450 76278554 79100753 82236245 85635740 88712492 92547586 96223562 100307933
14295 100307933 104220220 108504355 113358003 118339667 123286376 128901320 134916044 141092017
14287 141092017 147905717 154515117 161927148 169591884 178098123 187047461 196088642 205980058
14279 205980058 216241351 227037550 238700536 250710603 263074893 276203305 289670497
14272 289670497 304248885 318687668 332747476 346911473 360533807 373698598 386023859
14265 386023859 397783355 408791981 418959343 428467649 437184914 445281915 452591885
14258 452591885 456671348 458090390 458738337 459836084 456944709 450548736 445491950 437412451
14250 437412451 427080726 416889611 405000954 392383133 379248369 365914678 351873930
14243 351873930 338166212 324251192 310873165 297457148 284230076 271444491 259115699
14236 259115699 247397901 235811496 224953778 213991894 204222964 194685237 185562365
14229 185562365 177164536 168560848 160395454 153038747 145750628 139000688 133059695 127138536
14221 127138536 121539790 115881898 110982394 106375587 102249304 98292244 94451658 90603677
14213 90603677 87054393 83733433 80463083 77552714 74895967 72107251 69331313 67457559
14205 67457559 65108793 62765402 60722950 58531022 56835292 54889319 53166584 51980375
14197 51980375 50176901 48863924 47325072 46040861 45019248 43829345 42321492 41245862
14189 41245862 39921833 38840336 37672314 37070563 36250994 34891134 34169505 33259541 32255364
14180 32255364 31489672 30715632 30295282 29520493 28152291 28021456 27214323 26395910 25647515
14171 25647515 25420859 25031833 24353182 23790436 23217815 22801979 22452459 21950658 21333629
14162 21333629 20873403 20735451 20195648 19879591 19180723 18684602 18877057 18392465 18093222
14153 18093222 17541128 17278520 16811200 16518202 16270959 15862314 15622454 15382729 15263234
14144 15263234 15006457 14803075 14463172 14085748 13634330 13855320 13869279 12998743 12740764
14135 12740764 12832142 12603436 12446531 12367549 11975431 11830126 11397528 11459921 11559223 10998000
14125 10998000 10702985 10691144 10620969 10293377 10330753 9830122 10286524 10134212 9773162 9525750
14115 9525750 9244531 9342594 9284770 9042426 9068944 8919705 8769135 8482046 8343377 8192083
14105 8192083 8014959 7845651 8031949 8279320 7795854 7567303 7746744 7429008 7302277
14096 7302277 7104767 7247900 7176242 7349762 7104766 6691852 7009021 6422207 6914354 6449974
14086 6449974 6666598 6525213 6285573 6230400 5915013 6114327 6107793 6422309 5922677 5763984
14076 5763984 6077059 5660950 5689899 5742209 5605713 5670394 5236892 5291445 5250877 5152933
14066 5152933 5193693 5086812 5008364 5183772 4777828 4794315 4880325 4740720 4906973 4890331
14056 4890331 5031514 4283513 4553205 4413826 4303123 4405707 4461962 4613421 4358431 4174898
14046 4174898 4141591 4161883 4353927 4200463 4419762 4278064 4238863 3907136 4061409 3594646
14036 3594646 4131106 3717228 3781740 3697873 3898820 3227352 3632103 3701635 3332643 3379312
14026 3379312 3316907 3321456 3723282 3509326 2855367 3238713 3222431 3495722 3381372 3266898
14016 3266898 3430869 3121376 3408425 3032361 3189908 2696232 3085692 3028018 3057924 2921686
14006 2921686 2875702 3131532 2748009 2600223 2789283 2943504 2707430 2840439 2727033 2624294
13996 2624294 2322643 2610194 2489189 2401234 2165839 2588281 2479254 2583164 2646639 2706691
13986 2706691 2405962 2224123 2403868 2671219 2716413 3069779 2939265 2980396 3234662 3702871
13976 3702871 4129546 5081099 6959341 10813861 16846369 26624213 29128283 21121674
13968 21121674 14555254 10372748 7822934 6196396 5316483 4913631 4282584 3878246 4030090
13959 4030090 3578140 3273831 3264641 2990671 3198566 3092081 2796349 2614011 2549413 2429481
13949 2429481 2458529 2229300 2154309 2164186 2398490 2269755 2404567 2628086 1946535 2150742
13939 2150742 2449752 2037685 2367793 2217343 2119490 2238534 2049193 1981173 1884016 2015723
13929 2015723 2055690 1752513 1584354 2061846 2214510 1781081 1698844 1985126 2003348 1758738
13919 1758738 1775013 1897005 1471960 2081842 1880386 1700194 1910340 1532792 1965711 1761436
13909 1761436 1588387 1742800 1759660 1433412 1769846 2034065 1573080 1799764 1345119 1528719
13899 1528719 1526664 1700489 1446006 1307493 1805307 1519867 1431634 1824072 1305743 1739517
13889 1739517 1390322 1527183 1535913 1444067 1563431 1430065 1443886 1228127 1741236 1573557
13879 1573557 1188768 1418264 1091241 1669703 1420088 1450268 1019184 1270841 1540692 1462194
13869 1462194 1558415 1342904 1456103 1227032 1185558 1173186 1468541 1524939 1057292 1276749
13859 1276749 1145095 1474021 1447975 1324207 1152712 1283813 1208454 1482629 1433199 1248024
13849 1248024 1511269 1195389 1200474 1242796 1219862 1458283 1009575 941518 1273592 1092093
13839 1092093 750078 1032836 1361805 1145872 1031941 1100187 1003758 1187263 1147357 1075865
13829 1075865 1038565 1027579 1056865 1414977 1201810 1226000 1247241 924734 1088488 1216526
13819 1216526 877560 1334799 965680 966765 942837 815928 1005903 882037 759161 1018760
13809 1018760 648583 1149056 651589 817107 774356 1086049 1062669 1049580 903298 1005140
13799 1005140 1035120 992924 1200877 1114556 1206127 592696 891224 989136 1048286 742915
13789 742915 990024 998294 1085271 1211659 674248 837473 828351 918927 947702 629588 994795
13778 994795 697664 467833 628090 730100 1077351 770194 430084 883848 686817 533816
13768 533816 639070 949871 706420 873828 728490 971061 850109 715284 740577 793564
13758 793564 877753 817261 764373 1138868 902621 927461 931458 644071 686803 766488 924469
13747 924469 721468 725039 697381 901449 659409 1101727 305922 821595 635673 452260
13737 452260 672718 839114 1037338 868135 931811 879470 810981 490176 745055 675678
13727 675678 1283999 793846 755574 703920 733502 705777 628276 751307 974591 559397
13717 559397 553034 744939 725501 918948 547034 441341 700607 599245 339333 575380
13707 575380 615401 658872 509248 809538 683801 508962 812494 635806 686784 497262
13697 497262 362150 521582 430781 771015 790775 739449 859718 276979 786479 774747
13687 774747 500028 441746 557725 495554 669499 702669 472038 453569 903843 876910
13677 876910 356724 501396 717686 711479 579071 457958 493971 634373 461007 335083
13667 335083 617368 518139 340259 565164 640498 432242 588353 320390 475406 697102
13657 697102 444513 495591 291194 701880 396746 331897 417493 457829 196858 617790
13647 617790 431067 496356 911015 321065 316644 307904 407172 521405 305750 151094 573771
13636 573771 567039 343395 536398 217431 166187 754686 532957 583499 520070 484078 183974
13624 550094 538643 724055 464545 704786 378228 538403 554567 747522 447527 297286
13614 297286 447660 347817 720454 387715 256334 545792 495956 654283 230536 94669
13603 585745 540608 581191 456980 395284 238406 577149 170654 454644 532159 28451
13592 529641 158969 213888 253180 354761 365960 313603 297566 276835 296604 220330 489386
13581 489386 145493 476364 468852 376919 351005 266546 541625 728572 149538 155358 557487
13570 557487 453903 142100 439108 371291 306144 450666 294034 284062 443507 411462
13560 411462 592275 362430 385643 510145 424263 411224 281264 472243 286347 347055
13550 347055 322690 353967 306207 472878 176104 423701 242491 386575 36963 507769
13540 507769 396876 460341 663628 19260 315623 704770 420968 378385 310774 397404
13530 397404 485958 265272 342205 427579 514994 739612 227517 220682 394634 525816 434577
13519 434577 323036 318703 573630 356816 320182 366379 320756 158332 188681 192987 151596
13508 151596 418463 401490 115131 743406 404124 434902 269757 412507 156146 389579
13498 389579 389302 149272 -76590 318757 528977 366542 369069 139464 441661 400569 413582
13487 413582 231483 273204 191466 553512 632017 217519 420897 210407 238964 163809
13477 163809 196788 311564 466398 347888 326923 425469 15438 141490 512011 137579
13466 650164 169956 276270 277982 327516 438687 128975 452099 320759 424862 236570
13456 236570 340690 470718 437378 126759 205959 335282 429374 356970 104377 302983
13446 302983 152974 232636 434328 272327 407999 43660 322071 331067 395020 388752 298622
13435 298622 -108738 509055 138262 571690 241568 117602 182779 483364 498612 188663
13424 270529 369348 3577 345815 614371 -60969 90814 104211 371109 724229 109339 142111
13413 142111 315214 478695 55849 300512 284540 222793 -108986 246987 182043 34294
13402 271577 297130 147388 188192 275606 272216 464722 218006 88792 266794 181633 309521
13391 309521 422572 187595 167215 263412 248142 73973 388987 286161 324667 176893
13381 176893 388976 33653 -66176 198025 405366 226352 181599 -20324 312560 -214240
13370 465059 43116 204369 -34383 441209 20347 167977 240687 205433 574219 264693
13359 224171 264332 514559 244961 102515 41427 419327 468544 368954 319385 -99310 74597
13347 445602 501449 210060 229321 -14440 242597 516855 275323 35940 -31702 37987 3477
13335 372049 176511 238340 -234281 434267 136274 254708 328224 238358 194446 367251
13325 367251 182049 348162 380742 182668 118106 447191 377431 107979 240930 -88515
13314 74830 52472 26068 379644 216507 166354 203376 140248 240851 562323 386643 93139
13302 9568 153970 -41262 37160 -32229 -10591 262220 318891 365418 220895 211262 105564
13290 -62773 275380 112990 258554 275801 696927 123664 290382 -115504 314698 131086
13279 365593 71478 33995 551971 260848 512019 284999 468833 1890 193237 120000
13269 120000 209686 384348 67677 323323 96297 188542 275720 21319 216731 -598794 112828
13257 273472 -55686 357607 297962 230391 437857 -1619 7463 88660 165861 329156 133813
13245 -11969 81693 237081 207500 343108 333045 273143 356168 71801 418938 47360 151431
13234 151431 157642 -283701 -130641 95892 102859 179964 -198506 137872 96235 258213 10423
13222 97191 21009 -147350 -13745 -206222 109773 -151771 114878 40988 159765 541595
13212 541595 141915 245835 99568 -59696 577557 110393 184735 308823 94516 154404
13202 154404 200102 287735 317939 385412 226883 218084 150349 126855 -14521 231991 85075
13190 94214 227234 343487 -28725 49356 93656 205578 -230825 -203434 401400 216090
13180 216090 -213925 162986 75301 -40634 39043 118754 198273 242578 -97347 21546 -159425
13168 297412 359431 416444 24055 433618 284232 59590 -79882 269887 43686 70371 298063
13157 298063 -287820 224667 177620 114524 -91724 -73476 257618 331550 56418 65330 191324
13146 191324 317202 -57101 27152 -10878 162503 101880 106383 283792 19279 112832 -115382
13134 31221 42083 174616 164847 -74746 85693 46668 -179048 106906 -119609 205529 117707
13123 117707 -302736 311973 345578 166373 411803 89405 -219631 -23896 -2481 163694
13112 59244 -256065 -94190 -41289 158586 7718 86993 298571 259484 39238 81994 -22834
13100 196081 -270472 274883 138436 39756 191999 -194684 510877 98962 -82169 -68359
13090 -68359 39881 73612 96277 -16853 -206034 -62074 331431 -220016 147024 172573 55384
13078 299411 193132 -149973 -96523 331461 -196675 -132002 154970 -23621 46748 452111
13068 452111 144819 -149509 85466 146298 107033 86727 -107500 57714 -127831 380977
13057 148321 60236 123300 121005 608573 -79199 169391 141698 134899 414086 360089 188196
13046 188196 173753 296429 95654 104320 -30471 291440 -69224 -57291 153974 279922 -93295
13034 254714 179471 394309 -172807 302244 321675 -105719 -105404 232610 329623 -58661 261426
13022 726 13907 276605 163641 -273347 186099 40677 -146861 69903 392613 110553 406743
13011 406743 -79267 461964 -66125 -20808 42127 86187 340251 140448 -71852 -4708 21834
12999 523075 234200 -1716 -31301 173475 269993 65178 73513 -11449 195861 263593 368528
12988 368528 -23000 203964 -38464 302186 -199503 237593 295374 256437 25568 -60653 28613
12976 -52861 95092 -15459 11879 -104790 299195 246937 219803 174474 252078 -170386 205473
12964 -136563 -25403 17866 30962 87397 388508 -178008 -50120 74325 160265 108456 -48840
12952 -18045 16207 44213 80127 -80804 1143 41611 -12918 -112775 322702 143909 278506
12941 278506 87987 -34375 19144 -74951 172848 -257188 -92638 237194 125714 13776 -119413
12929 42898 224055 203598 -24600 25903 60137 44377 -132807 39319 104678 75031 -173245
12917 116207 443763 310132 252194 189382 -82601 -47416 137134 98641 55003 121900 198134
12906 198134 198560 186826 369 -191893 50144 -121466 -52592 1463 169924 194970 253402 45385
12893 188950 -49747 293755 -39913 -82232 -45230 73215 456248 155481 116723 75555 -173987
12881 -142993 -338351 93022 52008 64226 58265 -480 -3526 121977 -285668 47114 11227 143024
12869 143024 -69277 194948 12924 342036 -333878 -168832 25457 475115 -141886 47872
12858 212423 69702 -24882 343758 118644 131338 -167334 -222854 -282593 79399 -143939 -136939
12847 -136939 -93543 8576 229649 -37982 -86391 -410385 -97618 343404 341012 334760 -146645
12835 140957 172922 -7861 -105661 -105873 -62209 402599 30651 -118949 -165321 2658 59705 -272355
12822 64356 -37080 -308227 182148 177765 333147 342299 -84973 -28507 -595169 -33854 -127218
12811 -127218 4272 37378 330485 117765 22830 -401447 20508 -800 23981 -80396 97563
12799 30632 26434 416205 213186 -31409 -357951 336 168937 344687 -129595 113677 -53826
12787 -62300 -207273 301361 -89925 40820 53475 159423 -29333 -120329 -28206 -177404 276097
12775 91280 24232 252075 42286 54393 -50413 -47020 206892 141805 43469 90556 -224516
12763 110020 654558 -84867 -278998 -175580 -186293 9683 180837 -249223 6908 32995 433974
12752 433974 183854 57112 -140077 153640 78583 85297 145351 417397 79962 -180401 -61133
12740 204444 78943 -31276 -66083 334237 -27808 293925 -200528 -104650 -271085 266988
12729 -636 -8092 13705 320789 54342 59794 -223637 -110137 -116027 146315 -160701 180213
12717 23844 114344 -133747 16510 -32222 234126 -208585 133927 123413 6927 350228 308436
12706 308436 -17506 -42385 -110567 416545 170740 104065 -96198 205396 236660 230031 257416
12695 257416 303455 -6951 -205655 81881 65667 276068 458153 103832 187735 263226 278425
12684 278425 76747 367376 207022 80865 -258339 -164213 -271239 -100998 -118948 166700
12673 303792 -130426 200833 49797 -87286 285547 133881 87501 101262 -12413 169289
12662 46181 409661 206895 -82475 27452 45147 67825 -45045 221608 218250 -46300 230043
12650 -172064 -11530 -48444 103521 147578 35076 -32008 305516 130608 331888 283421 -20384
12638 85750 -39779 -352720 -91103 357849 258304 49542 373363 -188431 271306 117012
12627 204625 114722 57960 69565 -16597 -52095 369712 142827 38853 1122 -62139 67645
12615 19916 642854 -191166 340464 196800 133278 -158640 477875 81036 -69212 -13010
12604 489218 -18959 381003 123626 -16713 319620 -17575 -14324 -8925 39699 58996 -69784
12592 41951 37928 33212 171504 311430 3299 -86535 22460 291273 -63725 96979 48791 -101676
12579 130078 252906 237424 100813 210602 13928 -11592 -157641 407492 -96790 234401
12568 -56607 -154612 -41584 45680 288318 83858 264165 332259 -12366 -75239 -444 212589
12556 110846 -117150 -235368 -108493 150291 -6602 163159 -286910 204136 -94509 -267675
12546 -267675 -124123 -404660 47070 -58956 34292 -49833 -228614 -227078 -128152 259693 30929
12534 301381 -10965 138452 -229776 22378 98800 -68461 -29762 -251912 12123 95950 95848
12523 95848 -81691 90073 131154 96460 159282 37581 104487 -12931 242504 274345 229405
12512 229405 178671 -13021 153331 -13257 73233 133867 -75370 249188 93245 -28506 485488
12500 151552 25362 -126578 263820 31130 87890 -167779 224275 60507 175406 404966
12490 404966 -499977 243883 -20319 29594 -141014 203577 125945 9334 -8005 256968 129366
12479 129366 -145038 282123 -216932 -226363 41583 -154945 -22363 201629 282904 21521 23769
12468 23769 149897 -116966 94796 -11598 487503 -56787 -150246 -198382 -184279 -38715 137297
12456 161464 15206 -28301 -159326 181917 -109223 -276373 55380 -188072 -64449 -4302 -277316
12445 -277316 116514 204546 -135850 -84507 29931 26930 -79380 14569 110755 -240673 381532
12433 -192014 104595 2681 -94464 201542 285367 -207277 -105412 -142696 -153550 -139618 46422
12421 200348 -175550 -137405 219836 146217 -279201 294775 239453 2156 -131037 -151400 158476
12409 334473 163696 -207275 256277 93749 127413 -211996 28422 51375 192864 -30217
12398 -207358 -87781 164439 -4270 -49665 -10252 146030 192012 -68788 -72043 -18391 41585
12386 -31337 -74780 151262 282364 -157864 -205495 -317426 230736 206922 -317924 383935
12375 71679 134005 -117944 -178453 102765 172889 -152639 -290637 -388968 45863 46596 102598
12364 102598 274950 -222525 -438147 48904 94344 217858 -19934 243222 -124525 -37455
12353 44455 -1060 21481 -253258 -175882 464494 -89916 48700 48240 -154917 -329754 78275
12341 -77618 -52387 -64885 249154 423126 -10793 -264102 -14551 -205016 -130459 -44800 27192
12329 -526151 2048 64037 142850 -7415 23788 194106 -167403 124192 -35997 -156427 259015
12317 -191293 -135847 -210239 -4522 124158 89070 -204231 -198757 -253316 14444 -182819 -31790
12305 -138191 -45396 -210046 168201 -125053 133356 36117 -100303 322963 -46054 -45984 236616
12293 -48031 29611 -54862 -138897 45431 32278 -393530 46443 90227 -159011 6480 51534
12282 51534 -453639 208864 -43605 244292 -93784 43396 338624 101836 51880 176703
12272 176703 487569 125166 59987 -87811 111758 -183151 113465 187082 162572 -8770 24269
12260 -39806 -128145 34315 411802 155844 -59792 105960 168463 63040 385746 339351 113321
12248 -128217 -82978 306964 242297 382722 -36473 -106185 325066 -360485 1297 557572 243621
12236 52538 -140821 206479 -96905 229583 138473 -23798 175984 -64149 192601 49743 226145
12225 226145 150451 -86446 -27805 11784 -86982 191859 174805 37573 -72336 165513 -30217
12213 249348 74255 300330 206301 365640 384972 320340 344583 231549 131553 33551 328131
12202 328131 453716 30813 223226 342810 204547 -50685 90553 -8745 37264 -18585 184143
12190 309732 -296471 204803 437832 -33720 222926 142727 10445 416864 68316 290749
12180 290749 307971 -23308 115992 170601 180177 224238 28424 72274 385234 -223665 121795
12168 11076 172728 -106271 -14095 371503 324970 208281 -88882 140822 267031 144354
12158 144354 260108 73492 -191831 98821 187335 395901 -62045 -211669 95140 215048
12148 215048 -19654 -23973 -68271 347378 -201331 142632 -297644 6717 155190 214720 141314
12137 141314 -40174 -59864 -193114 135340 125016 128959 126421 -122599 4164 -111663 130596
12125 -397786 331010 4041 183654 -52756 103549 38407 82539 -201641 -58989 29862 190710
12114 190710 272633 126828 -31097 -3319 247432 -7944 143472 -58143 -122420 78680 -39224
12102 -107326 85654 -133386 -100681 4179 -166764 597110 -165333 13273 -60781 42274 2851
12090 -200959 181605 108067 -364721 -37047 70853 -255883 -191814 -16741 46235 107188 33928
12078 86436 -160404 -197364 223173 235125 -322337 242621 176225 -53656 148299 88239 -377232
12066 17753 -63788 147368 55287 -65781 164417 10793 51789 -12604 142994 3989 53159
12055 53159 1141 -7259 246983 179680 917706 828033 349819 106172 34395 -165542 -82226
12043 66133 62051 394339 -144434 30388 143681 32684 -178357 -510258 -219380 61168 240733
12032 240733 160595 -85216 61102 96350 113607 19770 -84908 279479 310625 -402735 182423
12020 -49240 252919 94840 -222003 -129087 -107306 25331 261042 -1362 131705 180435 -370718
12008 -18449 19291 -18624 103605 297032 7745 -252026 1813 -16090 9108 -241702 178442
11996 50435 -109445 -17760 134053 219996 48715 -226604 -30696 104003 -123575 414933
11985 34178 -154582 -142081 -156588 -301632 -33084 -234529 33349 33517 128909 -215795 -7051
11973 -8703 107158 -58692 337723 18388 373985 112625 17672 -135429 -28259 94622 -179468
11961 51850 -221287 74614 294677 47174 -230193 -119869 40544 134081 129090 -202099 231898
11949 -82861 -71162 157243 -130122 -60829 -22147 103395 122123 -159461 294276 -158626
11938 -43996 250125 76202 262300 139757 418039 6962 -415991 212793 -248540 252756
11927 -47654 -26212 -254293 -140665 -95538 207555 104358 54633 185149 92359 185384 386158
11916 386158 52345 -18942 -173658 -184381 179304 48646 369751 -47668 48873 -41015 -157405
11905 -157405 -166193 100724 257356 -54569 -109341 256303 121786 -20903 -163129 -102280 87385
11893 235880 26268 240385 61405 -109622 -143004 12678 49315 142110 -169836 -22201 183396
11881 71760 -26423 200805 -306749 14115 99973 11207 261154 -93355 -45629 -84809 -195503
11870 -195503 -51871 -16143 -31239 -73228 -459411 -393926 -163053 344924 178270 26298 -57098
11858 256501 -161593 -35139 220401 -171443 -332378 44426 -289417 -115498 111069 -168604
11847 -81362 38752 43384 -213252 -45184 -153224 -140947 127858 14902 -361618 -388986 -171681
11835 -16773 -20735 37793 62434 544705 -22036 -135372 -115964 73921 92227 5531 -57497 76549
11822 -190299 -350634 -34233 1113 325169 91562 268277 149741 21412 106136 -46900 113035
11810 -370148 130326 -34815 -122523 192962 -249506 -191863 -117529 -159603 20231 -20434 63306
11798 -37491 -141354 -98140 266043 47039 -62405 -93929 -198122 170282 179975 -143431 -300869
11787 -300869 52133 -269957 -116616 -115017 179464 340303 -89964 354114 18477 210317
11777 210317 -55489 222260 -24222 -397210 130692 -43445 150560 -137522 -39795 108320
11766 -139889 167423 -236702 -125192 -22332 -29649 314031 -236939 -12885 -125596 -14067
11755 -28073 -156973 -205818 23696 -24513 9416 2930 127558 -410958 11914 110001 256272
11744 256272 -289314 -128499 188094 -26328 -204049 224749 -47262 -152658 203370 36019
11733 45674 114539 -83929 -30543 -104830 22577 -1703 29459 78128 -197013 -77635 26808 -30283
11720 -108852 186332 -205104 -59329 92291 108288 -4858 154552 198115 91610 163500 224715
11709 224715 -293542 -239292 -149329 14526 340119 -238416 -58190 127118 181938 136251 58989
11697 68431 1564 -7981 -289552 82671 -106169 -172497 243896 -126001 -443565 151122 89359
11686 89359 -31947 -55457 265198 -133974 71954 272118 270717 -126389 -141575 185331 138605
11675 138605 -119553 138763 211318 -86525 -262851 248524 165154 18565 67089 115635 -102901
11663 -4045 -32226 -514206 -364479 503218 15798 3100 189558 -53377 175423 50203 104364
11652 104364 167021 99802 -29988 -46125 185341 -67771 -403197 -29388 159055 -1711 42677
11640 -105061 171214 465727 29565 148802 -13928 -227945 -88696 -13036 124691 109759
11630 109759 -193 143326 158323 16394 -147906 147842 -208492 61379 -6367 -73468 214085
11618 67652 3994 -169835 23220 196254 -9478 146701 28451 -4762 -431505 334343 -182028
11606 62228 72798 -1850 133119 297075 -118517 276460 47734 1464 65935 -130471 249273
11594 393336 117536 -154434 227818 40569 -246363 287050 234844 -164312 66217 375549
11584 375549 -210848 -229529 357067 272286 109445 -146870 -404815 -73083 -254926 44303
11573 -55302 -13923 -4144 38723 182930 -104730 184050 60840 237391 -110675 214150 39654
11561 32981 310680 -65903 73194 -113295 292824 111788 -392 278984 -103336 182035 329681
11550 329681 40218 448708 -19832 106536 361872 115810 51807 70189 183313 50044
11539 76576 23307 229281 -228002 -202179 -66085 122432 40667 67335 -2986 200647 88543
11527 227364 -4120 -26999 -153280 62062 286503 257730 29616 -103393 330040 -21624 143875
11515 -6743 -142112 -176572 347794 -14006 364309 47926 -23926 529727 -45404 286622 221390
11504 221390 137721 65695 -33298 41009 32219 70453 -5235 33903 211409 76162 10364 60724
11492 60724 -29692 234690 -3814 -134232 -7357 308114 -274573 134435 171531 196884 48320
11480 -20693 220016 3439 300611 112048 144213 547438 222058 444645 124150 292115
11470 292115 323348 115377 182379 489837 210040 220686 39427 20201 237524 348340
11460 348340 144777 97774 45440 406820 11634 363452 87496 307696 235056 305753 -169983
11448 -85622 83901 230532 378827 145998 84191 -62149 103255 118344 -45417 -90828 -111493
11437 -111493 141344 -190490 -41914 62544 -179037 126133 -109373 194981 -228971 382643
11426 110137 168287 58300 194642 -150694 149061 -183671 23629 -73968 -90854 101036
11415 101396 -36644 230112 -101852 -341159 105264 -101930 42092 323978 -8312 81754
11404 11524 -179090 74222 79618 88571 260105 2838 66865 189279 -206636 -185868 81510
11392 90885 107635 213967 138618 12857 -1318 -46937 259444 242225 357415 229134 -142051
11380 -208251 -122731 35447 175667 -42693 -77491 119491 116686 -17534 -141260 260303 -165200
11368 216658 72800 -193198 60130 -26824 53593 206282 172645 90561 152489 -110299 -33973
11356 142145 -12268 -247342 -235895 110236 120072 -70583 181997 143674 -219012 -90635 -236946
11345 -236946 130460 92118 90666 95093 833 58987 -225962 164768 205936 218264 -90397 -241398
11333 -241398 222442 -7664 33682 91589 320537 -348840 -356899 208772 -218064 202713 -127202
11321 -65077 53446 65520 -161915 334598 81913 -78872 -338282 38731 46056 26020 -78238
11309 -92594 30245 55288 4330 13351 352769 -22196 4607 -168786 -114449 56731 -344850 5692
11296 222631 -43051 -438465 148549 61396 29682 55357 311244 356107 -295894 37774 -132645
11284 -68742 273767 6103 98017 75991 -87129 -284899 101876 -81831 -148811 2091 191282
11273 191282 -211886 -11063 262682 -223182 -500272 280806 -152777 -270675 -1370 -289007
11263 -289007 -81997 144913 -45834 153907 -101016 -154295 -216105 43418 23207 -35174 17457
11251 390513 -15152 369995 -44465 -108903 23797 67745 -87877 -79942 -207687 -122059 -6326
11239 -250725 353384 13502 -218382 69793 374161 105363 230474 -214830 468086 99992
11228 71966 -281365 -290903 -248962 -84572 -173104 -177448 5629 169629 50132 16351 -386724 134946
11215 86141 -19033 -14467 67635 -241996 -11264 -44575 -81868 63451 225657 -73946 53857
11203 -11559 -246768 -231614 -294456 26640 20579 -52457 -131227 -248824 -442687 134006 -218240
11191 -91308 4105 10809 -229049 -148690 -317435 -9202 93761 -239544 -190690 -131337 -198483 -385916
11179 -385916 -215620 98388 30 181141 227000 82511 -210144 -124833 -12787 242362 -131158
11167 -81491 231141 425819 -136585 -195028 374566 -152895 232887 -213619 96023 -280974
11156 -5190 33509 92765 -91051 299649 21011 -219928 21536 16671 -199252 196603 -85859
11144 28814 205955 -285231 -100151 -49812 -174698 -108809 38021 37550 -486274 -277065 119236
11132 44829 423034 182795 10518 86563 181414 -38236 -327015 24755 247245 37390 49666
11121 49666 -112988 -321982 179881 196803 -524418 63371 -122993 80952 -29527 41846 -57590
11109 -254610 288054 245390 221656 35066 243748 77044 60783 -22603 269143 -196222 442991
11097 117210 -185787 140161 177002 232573 210227 -38115 66555 293373 -55688 259528 43586
11085 229955 101666 269776 269897 217505 -46663 185454 254438 277955 20670 55023 261542
11074 261542 193433 4183 -2522 329859 273524 -10562 140365 282304 -120220 53765 140311
11063 140311 98806 306055 193585 355820 177375 -10925 566120 279019 220418 48522
11052 308051 555954 97539 445505 467870 327244 679293 424477 454123 555153 841750
11042 841750 299407 568117 659441 754124 588470 394334 551500 415385 980425 891145
11032 891145 669905 600204 649785 384271 702873 808429 982962 753080 490451 575619
11022 575619 603816 608796 608519 832418 588615 551038 663130 528215 776234 274383 496157
11011 496157 832488 836192 665514 418825 586829 1051288 567612 933816 366880 625287
11001 625287 694672 790241 589182 508587 746501 799416 562039 507680 583887 915681 672962
10990 672962 591753 568061 902591 446814 525322 587765 785076 551643 662201 388089
10980 388089 523468 1145495 1037735 350436 822720 924897 758451 998621 1105011 998766
10970 998766 1144384 1186540 1325249 1185338 1561508 1563891 1372059 1644525 1782906 1892081
10960 1892081 1970718 2356232 2783968 2397155 2751831 2651058 2924848 2196684 1962345 2004225
10950 2004225 1871502 2016176 1819039 1769695 1824331 1403158 1700769 1870127 1648617 1465963
10940 1465963 1518845 1219575 1177717 1038693 899882 944405 475247 545673 228506 456448
10930 456448 184188 446477 407901 178465 55004 203162 93684 98875 322682 218346
10920 218346 167923 40279 245769 9790 58339 224013 176660 -12617 -425499 -85326 88828
10908 189958 298305 210551 35368 30673 76537 9469 -25591 -82187 46595 173018 -58993
10896 -173922 299992 12038 132557 7675 253189 19048 -71167 -291485 -50874 -37351 -330871
10885 -330871 430187 -29103 86220 -399016 328189 -441576 -34877 -110137 40916 95074 67024
10874 67024 -32149 135719 -33697 -79871 -153166 -268120 -222717 27808 46511 202008 -37304
10862 -26771 -146493 80636 131008 -43588 144078 337659 -341868 -38735 286860 116131
10851 -144420 4541 -181524 -276363 -43671 30389 -204999 -265349 -278815 -215978 -80139 -480575
10840 -480575 -194062 -268223 153161 286443 62648 33328 116106 -165606 -42741 -117727 213544
10828 -200551 258985 -121974 -16170 173623 -154946 -69378 77361 472837 240374 -4013
10817 -93242 -292859 194282 -22463 -2614 -63188 167757 -211629 252567 -45258 91507 143810
10806 143810 -95105 -28300 43306 198154 -107004 121092 -137732 67998 137705 -64865 -137796
10795 -137796 43135 -126055 -364824 72159 -113655 -97681 -180037 -299157 330689 -16909
10784 -26768 404143 191599 100210 282647 -73033 130609 -166064 -94724 -240989 82677
10773 113224 66504 40677 -91968 -61259 -283085 4232 192006 -163773 246040 -10096 -184611
10762 -184611 -116961 -267645 -115319 -435125 -148123 -80823 -133209 -339686 -11219 548 -212562
10750 -6784 266519 -159248 99631 100728 -141781 -46493 -218589 -219558 -154756 -279933 114322
10738 -237899 -143757 77023 -6035 90325 199044 -261410 211822 -162815 -15324 163818 54193
10726 -149368 158297 -73063 58338 95220 -132698 -66831 -18571 -149765 -76741 175675 -177784
10714 -6796 -224868 -123227 83396 61360 83310 -504372 -209081 -40404 16485 47869 -66445
10702 207547 -22764 237462 -374594 168166 138023 -98821 23181 193479 49282 -134732
10691 -97162 154152 -27746 -138901 -43870 -316631 -127213 -34116 -127041 54218 -45352 -348278
10680 -348278 -298230 -148955 -148046 134898 -297118 136705 -44822 4999 130144 -2883 207330
10668 -129823 -6802 50232 -227566 4249 -88409 393975 67110 -55434 172870 -57504 152164
10656 -127345 98360 -40623 -116500 -419111 -350073 -249073 169741 321664 -125627 -125397 -121628
10645 -121628 -229147 -85540 -274862 -273901 -50954 189631 1425 88945 117061 -387039 -26099
10633 -149980 -97215 -26076 270226 -142691 -108830 -204263 -220387 -70725 36488 213693 -117500
10621 80210 -170084 157190 -141874 306686 4339 -64465 13248 -125127 -45507 -80227 -148080
10610 -148080 300384 -134309 205485 -193894 -84823 33120 -55971 -143445 -171417 78753 78772
10599 78772 -287846 -37112 -109707 103253 30713 -84734 -280886 -218816 -226229 -280905 164490
10587 -180538 182432 -161886 -349865 114473 -52121 -93456 -89520 -206799 108544 152020
10577 152020 154629 79159 -139840 -111444 278424 117098 -148406 -43541 -45217 -8128 -125282
10566 -125282 -306202 -8398 208511 345978 -125277 -341858 71888 -225992 243595 -270172
10555 163450 11147 200210 -574161 185447 61885 -49929 -133705 -238645 224785 -103310
10544 346910 240949 69100 -94143 66528 -96204 -34927 236367 -93384 -83068 191864 35473
10532 -101073 -72235 76395 -267141 -243000 935 473651 13035 -132844 180311 16666 136166
10521 136166 -219716 -277667 276195 -138582 2802 -56195 -80816 -35912 -3565 -5317 149290
10509 -84905 79833 -341014 208083 -149483 -104245 214315 206032 -84582 69195 29057 -495231
10497 -23889 -123369 -78682 -131653 -118810 -40368 67816 -222275 -185078 333320 11926 165033
10486 165033 -18602 24496 170802 -18489 -15030 -111765 -121360 25704 134962 -168527 -79554
10474 -101572 -94329 -221306 39938 292940 -108688 -78676 -5090 290377 -41878 439251 92766
10462 210291 31507 150920 -126841 9496 -20263 89944 251720 -26337 118393 719 135335
10451 135335 75908 -322941 -118378 -55327 188718 -30019 -132194 84449 -265603 -126756
10440 435693 -145620 45023 -156934 -224375 -85467 -106065 -43950 174830 -37269 -229256 183447
10428 289901 -139710 53658 -110929 306644 -128269 22725 80402 13966 -219050 -136498
10418 -136498 48300 -73684 -293190 -77999 -57309 -281994 -116552 51963 -78744 -219498 -95350
10406 232603 -43080 -245469 137432 110978 70473 -65785 65662 50101 -209527 -148835 65545
10394 63123 316439 -128909 -40173 -247557 -36564 173993 -79230 108317 -100383 20741
10383 -202530 104934 55633 -102319 174610 249288 -41560 286963 226917 -99207 -501519
10373 -501519 169374 -53031 -47968 286978 122128 402018 -132231 159421 286675 -17072
10362 236823 -57580 661853 273480 87018 248600 326694 64879 318915 -38781 781500
10351 384465 465719 498402 343080 57031 270187 128627 197379 287496 443623 262439
10341 262439 3504 166411 273366 501515 496430 713484 516789 242387 288584 35947 226879
10330 226879 175834 263542 582217 189192 283805 -23424 244931 109 97525 289578 237875
10319 237875 125640 -159378 163731 5470 48573 48645 252983 -367602 244396 -82044 -47232
10308 -47232 -4165 81758 82751 303647 -14255 219853 320299 -77750 401078 92557 153209
10297 153209 81835 25217 171386 -34249 236583 -69838 247640 -102372 -24384 87166 -17054
10285 198120 -221566 -232310 -20677 168002 40290 -271468 -68522 16866 134212 146770 -344576
10273 -12981 159191 7575 -130460 -143549 17443 -14913 79792 49787 82676 -61313 234770
10261 -22341 225275 -287998 48028 87096 244391 -106219 -292693 108014 103995 -286475
10250 -182962 -27034 109865 -82759 216064 56069 -32363 48082 429399 33181 410893 -1904
10238 152954 323029 1592 65905 299825 -143086 -201140 -105211 -58507 -283939 202731 295601
10227 295601 -39362 -393163 73577 -67969 -18890 -185237 182737 -139143 -221732 8288 -62003
10215 67943 -114150 -315830 -138453 -436218 255240 261850 -370533 255549 -68772 -192480
10205 -192480 159280 -318840 -137984 299159 60833 211532 -52160 357536 -134410 312196
10194 -324243 138167 -92978 -123254 -513301 66228 33915 129500 10624 27855 -217334 -145523
10183 -145523 90439 -23557 105841 -32464 76231 210979 362034 -256578 109248 45281
10172 -185609 -188702 16538 372170 -117981 64268 135131 -177148 75927 41215 -4006 -471304
10161 -471304 105311 -147969 -23456 -21655 52447 -234813 -34370 -118614 37259 -174166 42577
10149 -58938 -195889 -149977 -185825 50176 -219083 -46612 3665 141989 -70099 -144039 -271223
10138 -271223 20892 -45413 -121829 -19140 131780 154912 -66717 102093 105581 -20889 186896
10126 -166297 -228163 108660 82169 -202569 -77627 -174791 38152 58970 149637 -26549 147097
10114 20316 -292181 -210418 -265443 -142096 163935 187442 26975 -216527 -206006 -60196 -75725
10103 -75725 13259 -96509 -264636 -58934 -6367 116728 -304323 -254899 180570 -481340 -346253
10092 -346253 241736 186994 -10090 93261 -135287 -147221 143119 -28979 -122239 89960 -120215
10080 -224554 -36617 -94617 213104 -92425 158783 93793 70701 322671 -340829 -37947 -129295
10069 -129295 -262578 -214147 -44851 -201384 -98468 -261270 -155003 -51341 -48309 -94080 -19830
10057 52466 -21964 282912 49483 -67099 163199 -212912 330827 23493 -131955 96248 -247613
10045 -322367 -456858 -94136 -75709 -258410 -482848 277696 -253793 -31621 -186030 172756
10034 -314152 -96790 71157 -123690 -188473 -220766 -315721 354007 124103 -160636 62318 141082
10023 141082 -164558 -52390 24511 -178375 34594 -81426 230571 -151362 -70887 -20798 -94104
10012 -94104 -1237 37218 -5881 -126619 53743 198533 -49474 -185852 -348034 -11571 -85994
10001 -85994 -279138 11450 -128372 -222382 276306 -3544 -113923 -356840 -186220 -246054 2601
9989 99596 41909 -191837 -105671 85056 -21538 139927 -203429 52321 309038 -170816 -269357
9978 -269357 -88723 -14620 -267034 14871 370707 -182529 -22161 -10574 -120070 -326119 -15413
9966 -74376 -58428 -143226 -154708 -75639 366377 -112150 -228345 46686 -482941 69739 -130647
9954 -107528 -281342 -70731 -183022 134880 -296694 -56141 -161327 22707 -111120 -185118
9944 -185118 -91762 -93389 -112694 -148911 -134514 -196819 -180583 -44501 32241 -389829 -104234
9932 289650 -48935 309938 23649 118200 -159772 -64979 34311 71842 121310 88743 -39494
9920 -211099 32660 -194282 -276282 -335133 275066 203577 150168 -201726 119546 -68097 -169678
9909 -169678 -129202 -102411 -92200 -57550 -224415 -355696 -150923 -210932 -237765 -110309 -298641
9898 -298641 -262437 353288 -181343 -28973 127900 -306662 -156106 155453 131445 -272944
9887 175428 -144804 -201554 -34410 -229312 -42312 -158633 35310 -73313 -43821 -186622 148860
9875 -31952 -106478 -142016 221360 -229513 -59447 51960 37005 96367 -150226 -112698 -262398
9864 -262398 -280781 -176349 -190680 14256 40147 -69716 -54304 -274092 -20481 -77086 146231
9852 -165682 348194 -122632 152277 310225 -45057 -321798 -184738 -380673 48066 -351890
9841 81009 -14261 26967 31138 169738 -252686 -49912 -235373 -305847 331179 152378 -214759
9829 -224540 -160619 -194461 -22752 45902 296432 72657 -116620 -35596 -231617 -31824 -148493
9818 -148493 3697 -55925 -59836 -148188 -29732 -91791 -66887 159016 -20022 -125217 -229987
9807 -229987 -215744 -65040 -328289 22723 88588 -60021 -55447 252412 -64186 295521 -196353
9795 281699 -24346 286440 -324489 15993 -393101 -355352 142386 -205338 -226936 168719
9784 203003 65376 52122 215756 -158159 44669 -301895 151909 -79484 -79267 -79560 -166919 55231
9771 -26946 90565 -231064 -244599 -238047 -83569 -190655 -138850 64360 -236416 -43707 -101288
9760 -101288 109773 37096 -264152 -136837 -245238 -70636 -147610 37356 -215419 -121608 -16211
9748 203633 -226729 -198056 -205658 171531 -259596 -353942 -1653 -56173 6734 -95586 -149136 -298121
9736 -298121 -73377 64643 114762 -161528 73503 -265773 163450 243657 -205190 -112875 332006
9724 -269338 -96187 -27760 -7238 -83499 -302360 319175 40548 -106547 -175068 60657 34638
9713 34638 -96287 2834 177323 -15771 66768 295074 144596 -161531 129552 -202224 293397
9701 -47397 -132925 330576 -141023 13618 -142532 103523 219516 141842 169978 -311095 -25378
9689 7742 -123281 -44555 -329937 -16858 131 -103442 -142122 -128674 18724 -467958 171580
9677 381241 -242995 34137 22805 -114754 -346254 242152 409242 -74343 -27421 21068 -213724
9665 -154322 -33985 -257532 93868 183759 7942 -10704 95572 -17929 107352 -107676 -100655
9654 -100655 -297233 140190 166817 173531 -36794 35223 -115061 -57142 -9833 53849 -94166
9642 16684 172256 -70161 -84469 116146 -156836 -237377 -146653 -55932 -43083 -139044 -174795
9631 -174795 -322501 213095 -265438 -276230 145344 -281314 156521 43536 133884 -135964
9620 -440270 313489 -402379 -203192 -2959 -293980 -32056 -124913 5632 -270325 -28405 -444063
9609 -444063 105080 -381495 -190282 289781 -81688 -379483 -36128 -58894 78722 -199174
9598 -139099 -171755 185421 -224993 -244416 -119261 -113425 -126325 296854 -520724 125600 -43504
9586 -188528 -73828 -70755 318226 -32689 -434374 121617 -187635 -106561 -179872 -6939 59525
9574 -155560 -71843 8895 -27241 23814 139346 -126232 172102 2951 -293465 -141162 238508
9562 3053 121551 12892 -6261 -508438 68594 -204614 -97904 1395 192244 -275107 -39760
9550 -168114 -120875 -108365 157805 19426 135366 -383606 -122765 -136013 -135516 -170932 -78073
9538 168482 -156193 116019 -53019 -320969 -88403 98063 -137072 -131588 -210642 202618 -193429
9526 222269 -210256 -299453 29461 -37345 -66208 -398075 -6248 -244369 117263 70259 -195519
9514 -87031 555994 -69130 60157 -228910 157803 247243 -97467 -150212 220023 -240711 121604
9502 108767 -18794 -488747 281624 -161168 -140807 -56629 -179732 -244607 141157 50817 -157986
9490 -403013 89911 -35818 87711 57164 -399081 24616 -38351 -318119 104012 -69955 -55271
9479 -55271 -259459 23175 40921 -52727 -76336 -44852 -309840 37894 -310753 48477 -365693
9467 -69982 44849 112347 -269009 -129033 -183890 -27931 -280989 -179927 -192365 -176260 277660
9455 226619 -213814 -71751 -28933 -177050 -158541 236660 -160806 -160786 -57313 -40683 -14424
9443 100410 15688 57976 128499 -177497 504845 -8482 -191711 -96334 60601 -243613 -181424
9432 -181424 -464194 -97089 -252146 -111868 -299588 -310668 -141533 27447 5457 -13444 -207518
9421 -207518 62025 125922 -34276 -140045 39321 14795 152538 54891 -88813 -239896 -246514
9410 -246514 75237 153213 -44449 165556 -291323 -196946 -65298 -51117 -397047 131223 226215
9399 226215 123117 -396719 -282840 24891 -286264 -285140 -55546 -152991 56598 -196098 -194580
9388 -194580 16877 37649 -121443 318158 -238791 -122766 -81348 -372972 -171486 -285838
9378 -285838 23615 33078 203323 -13452 -186183 41570 148276 8818 185533 -12155 382313
9366 -275033 -121395 70512 -259764 274544 -172408 -102942 75233 -184337 41354 -97963 -89282
9355 -89282 -14668 -113961 -192885 -180092 -111554 121523 176109 -167841 33406 -87274 -31737
9343 122043 270197 -190461 98399 -37109 -199756 -352657 -39301 -9304 -65193 -127151 -72586
9332 -72586 -27786 -334428 16215 -223083 -27627 269850 -355098 -175527 -46998 -45852 -54007
9321 -54007 -105024 28348 153691 9587 36568 -143805 -45665 217330 14426 -18415 -98285
9310 -98285 161347 244006 -14054 160952 -2889 44182 5830 23056 38665 228569 -249307
9298 -261654 -318417 98921 -415469 37257 4170 -64963 -148841 -186516 -134954 -40052 139274
9286 -121369 135721 -190323 552961 11739 -112709 192795 10706 -3053 11852 -8432 142168
9274 136023 61233 175273 57107 -104635 -446429 -254125 -218438 81851 319842 127864
9263 -280594 -364114 -89429 287324 202702 -257506 -361284 -83707 185549 94271 -59009 -355388
9252 -355388 -97079 -25724 143644 11219 161701 -84652 269801 285240 -177531 340082 -177759
9240 -53425 106240 -39072 -155365 -374760 -229444 -489668 -77029 99927 104912 -163422 -48082
9228 -137877 -73306 57572 61834 137509 124517 -3788 38691 -69936 -40949 -111681 -164819 -12240
9215 146468 -147013 126843 -333701 -309628 31652 21039 -10685 -342659 -79965 -243208 -344885
9204 -344885 69956 27829 322498 -98582 -165071 -162912 -230145 -272779 -98566 -79029 -353839
9193 -353839 233788 19149 -154188 -94619 -123851 -89376 155728 39519 -61317 -274061 66928
9181 -38230 34212 -116594 238971 -274221 -16430 -79957 87326 -157844 22425 184194 6131
9169 -100915 -101659 -21547 -49789 -109460 -183917 -182139 -252584 -234838 -7009 97641 -10329 -172005
9157 -172005 50814 -313825 -318437 137672 -154786 -154457 -394550 -71593 -159455 3129 -177048
9145 150003 96206 105464 80072 -22519 -50518 32621 58838 -45045 -167922 -158616 -159164 332087
9132 -160496 -60525 -135921 104516 -177923 51881 91969 -279872 -187826 42535 -263336 137218
9120 -406596 110622 -153428 -627739 -439324 65961 -32968 -29601 167330 144386 192672 -258065
9108 -456452 86710 105047 -164641 130054 -11919 -14830 -151857 -65974 -51076 -151704 162000
9096 -239106 158074 -479281 -206248 -10043 -168805 -18627 -309786 -122191 -63932 -59621 -162593
9085 -162593 -151695 75765 -105679 -288750 -46854 167690 119493 58739 -35841 -290721 -166448
9074 -166448 -343247 -43860 35542 -68111 -91588 -117083 -66195 106144 -185339 -121011 -303579
9063 -303579 -195208 -167997 -158160 -126573 -67033 -159239 -199379 -35927 -98714 -181674 261471
9051 -83086 -170728 -109407 143756 -92012 109204 -27869 -265855 156423 -13597 -101096 19277
9039 212949 -76266 -16966 -373119 110100 415505 -56526 -325339 -305222 38355 68658 -133118
9027 -17 220091 15604 -67053 9898 -286818 69347 -205461 327162 396018 83281 55556 -76396
9014 -61948 -465401 -381871 -321059 78388 153955 -32721 -141541 101315 -207709 -177825 -70655
9002 110454 -45292 172091 -103113 -27941 -81298 32460 -67938 -114620 -5607 27257 -133321
8990 -125545 -287379 -48000 -117344 -92118 -31157 -114005 -112830 13651 -224876 -206742 -156697
8979 -156697 86221 -147699 -78206 -156545 97134 -301531 -135147 185029 -176876 -150421 9045
8967 -31805 -275197 14957 -304615 -20285 -100674 -154205 -52636 19719 273062 263757 83229
8955 -369026 78120 115102 -233474 -297372 2885 119494 38106 -119778 -330101 -31927 -226337
8944 -226337 -118752 -111626 207975 52638 27083 -118235 -127059 365750 128986 -283646 182684
8932 -212967 -367263 -146032 -125887 13320 239148 112236 -24705 -100211 77376 37591 122647
8921 122647 155366 170391 378109 25136 -85120 -217685 573523 393297 173455 352484
8911 352484 538508 1118587 1704059 3011384 4921077 11599844 6113991 3205171 1474165
8901 1077473 704841 334330 73446 269248 162452 -39855 270476 358476 -81728 37367
8890 131176 28424 -164385 39276 -16992 -104615 -47143 216398 -136651 7786 143882 -75679
8878 -170067 22285 -10636 -148794 -364757 -45712 14166 -254751 -263079 -89652 -186843 -208580
8867 -208580 -270862 -63641 -253378 -134973 138028 281264 46778 -8092 -31209 54726 -298425
8855 -301190 -120018 -317621 355195 -214308 40297 56496 58216 -14810 277594 -454932 -289083
8844 -289083 -158314 -112250 -210584 -48300 32262 -96017 158703 -45846 44855 -78391 -222245
8833 -222245 106204 100168 104212 94739 229586 56439 46893 -130153 125420 201848 24946 87029
8821 87029 57645 -248825 -233096 -53106 166386 -12892 33027 94043 -175087 157277 111626
8810 111626 -62230 -68319 -80758 -155614 229888 127136 13669 -171401 -166106 117193 -334684
8798 -111781 221442 308575 -155946 -203845 -162431 -73518 -157903 -109899 -101458 270921 97186
8786 140660 -18385 -229743 -120755 -58628 -159893 7242 -140017 129401 -102291 88346 49545
8775 49545 -388739 -246536 -279947 28027 35658 -443733 -220115 189283 13060 -284564 -155504
8764 -155504 -92480 297617 57335 -173545 -93577 -59761 -103706 -6752 73143 -68539 -376187
8753 -376187 -526360 -101030 -81176 14504 -271751 -232517 -38556 76674 -60500 -97126 230430
8741 -11014 -189054 55194 114687 -7805 -13859 7538 -126818 -122056 -200898 -79957 -381024 892
8728 170944 179832 74545 164521 312317 -252595 -372199 36178 29099 100545 93844 -172798
8716 74915 -79431 -257206 43140 301894 31782 40128 8965 -167283 47058 142200 -163515
8704 67786 -161252 211536 -252490 107484 143630 -17913 -329704 -121217 210707 -19194
8693 18794 -70103 -304383 -113350 -244605 101893 -46026 -79989 -340974 203801 -305668
8682 -207066 -20064 -132892 -218226 -129482 -165450 61553 374444 127591 51726 -408470 133425
8670 72805 39401 -296543 -38472 -168523 46457 24680 -96597 59828 73241 -212940 -160960
8659 -160960 -312273 -206948 94437 -284271 -129460 -218943 -179851 -11488 26074 189670 -90002
8647 -43082 290894 -144009 59140 -107864 -63331 -248894 208429 -293420 -256661 73974 85496
8636 85496 -69950 -143759 -72655 320263 -206968 -96799 2142 -276920 238293 105855 67560
8625 67560 -27847 -300638 -288747 -157490 -83308 -128901 35704 -274653 -18917 -116310 -14660
8613 159467 -258399 -389008 132464 -146666 -151152 287376 -332392 -194703 59123 34385
8603 34385 -12732 61216 225857 -25465 -100158 -98182 -346513 138374 -24569 -191924 -15547
8591 40543 -77391 133487 -266965 -122035 -124475 22730 -104255 9510 -156985 9746 72964
8580 72964 -57678 25140 87436 -432600 -278700 55752 -106301 -132483 -207555 -2301 -254463
8569 -254463 62596 -411788 -87797 -1648 199257 28830 -30724 -211372 122478 -41998 49391
8557 34743 140653 124437 -83071 112049 159652 9445 -212514 -1460 -302699 325509 148666
8545 55118 -86471 82778 -129075 29159 115751 -3823 -105396 -29086 88722 -59618 -96840 103953
8532 -202764 -256687 163705 223374 24587 59208 -30683 190053 -76867 -4211 210710 -1347
8520 164102 -170766 -72101 11282 63873 -246422 16574 -70235 -149329 22315 -297076 -197298
8509 -197298 97328 -69609 -249169 -91008 -144020 173316 -6855 -187690 -157428 30637 -172624
8497 383076 -83407 -217457 139994 -208930 158620 322674 337300 -152179 -12918 -25469
8487 -25469 -113324 -300002 211264 -327421 454966 370512 122172 -408104 212600 17154
8476 -89355 -168888 29794 29850 -89376 -122006 -35498 -69709 64182 -116223 -71029 -209930 126797
8463 2344 -34437 90068 -107952 126758 84769 38159 103072 41222 -281569 -458907 -63731
8451 -169744 -95316 -139939 96646 54292 -91418 198119 127758 -152542 -115147 -306844 -147885
8439 111596 -171077 -50616 -93593 18402 -21315 -8362 -34397 -371393 -66778 -116704 64380
8427 -344721 -7990 62810 236336 37850 60807 53318 -103502 -75747 -34036 -127032 -4482 26772
8414 -856 68795 -14335 -36249 -314111 -27371 80719 -22169 -113898 -20019 82201 -391521 -38345
8401 153587 100330 278882 103286 12481 35484 -137737 71313 34725 -111555 11175 -94294
8389 -230402 281194 -134027 -32941 213169 -133884 -151343 -77420 43391 -73250 142990 -63745
8377 140513 121991 -146444 -139893 103826 143466 -418169 3210 -113833 -43037 14769 -229015
8365 -130472 -73775 74767 -32984 -154490 -354258 77330 -158758 125658 75982 -20498 3860
8353 25340 -2757 167321 -36461 -30147 -345525 -372906 -288100 -44985 444362 213023 -175466
8341 -124297 36240 -243220 39746 -1300 -140604 -443366 115201 -250844 -289115 132688 -40206
8329 200106 -115208 51006 -239282 66859 61845 -149011 -87731 43302 -56550 -305877 -75235
8317 -76251 -18332 -288467 -19845 -104593 -291588 -11014 -276197 209912 309403 145812 -513663
8305 -214465 -185189 -127390 -323196 -11477 163956 -170993 -282986 -47587 -261214 54103 -141482
8293 -47689 110986 -116492 140197 -113259 139174 -176179 -149639 -75056 -24942 -171483
8283 -171483 -344565 -144018 289180 -69448 -80666 143094 23346 45824 -88165 -60716 79736
8271 -518454 -171294 32505 232039 -11968 -208688 160670 -70740 -230310 -297305 -161958
8261 -161958 -39646 72373 -162071 -833 48125 16057 77999 -123368 80068 2516 -75774 11311
8248 22431 116212 1850 -291324 -235871 304994 -191080 -72616 -143468 12942 27797 -36266
8236 237991 209400 64580 -328825 228635 169006 48957 -136711 -32413 125844 72188 -177658
8224 133432 -1038 -122502 193241 -242180 -188428 72928 -53215 42498 -367544 68391 13055
8212 203036 173844 -284797 -72308 -95713 -352168 134145 -57574 18862 -173638 16319 -25606
8200 -18222 396176 266855 -146062 -44840 -309152 86158 69132 62651 -150257 -59401 -80717
8189 -80717 -255125 -324431 -223757 -13450 -65022 -125722 99392 -145057 -372999 -223604 109951
8177 -174542 197315 -30692 -112798 104391 14238 209600 -306950 -137615 -173842 -126061 -22551
8165 126782 67377 203477 384063 -123712 -51761 -243170 -121375 -538946 -272688 -256959
8155 -256959 91774 62929 -109075 158039 -279926 -95721 -33277 -97885 -154544 2148 -175542
8143 150458 -23663 183143 -78050 -55317 24602 215094 -25982 298742 140862 202523 -35096
8131 230259 -489429 -118808 172701 -242097 122069 -58422 -65300 -125881 263166 -74373 -227668
8120 -227668 -297133 171299 -181640 -224933 -109605 -237280 -17758 -8338 -39467 -302196 -480959
8109 -480959 -120381 -33387 -66537 -1448 -24698 80910 21745 8752 -162388 279474 -38682
8097 -126004 86594 -77392 -66098 -340829 123931 56432 12805 -232332 373660 -54132 -191966
8086 -191966 -93526 -163588 338053 -20930 252320 82181 -38847 -132987 141033 -113840 -209879
8075 -209879 104717 -96523 -178177 -57792 -88946 -262122 -43800 146960 229050 -146007 -94745
8064 -94745 -30501 85755 -129842 44281 -66088 16656 -19055 273316 90549 58214 -125541
8052 -27426 96629 145605 -13805 -36451 -83960 100597 -49331 50756 71765 284469 -199396
8040 -24538 -96502 70247 42591 57873 -78902 92049 55720 117101 -253406 171288 -109208
8028 183693 -11445 -79658 -6027 259913 8163 -189868 -56901 -88667 64220 -181811 -28012
8016 -81725 -90509 -130447 -74756 -30850 41807 -105960 -61658 129538 262253 -89934 -176241
8005 -176241 126827 23258 -26607 -102385 50415 -46452 -262523 -89715 -93976 89496 -342609
7993 -182354 -178917 24188 -213136 154727 -302524 -128555 52765 -18497 141777 -18720 -133026
7982 -133026 -2062 -38502 -39069 -99702 174661 107573 -65763 -199206 203966 -209242 191239
7970 288728 -108644 366 -166478 263283 10190 220987 -96745 -81725 -363732 -18331 -86444
7959 -86444 -167626 -28798 -176351 7289 -120244 -214598 -195491 -364575 -206674 126294 -125787
7947 -55939 -95256 145383 229055 -106919 1866 -67081 -215873 -37029 -236856 -131512 -151011
7936 -151011 45087 -186266 17027 55316 -334407 26763 -37785 -18678 -284158 22602 -86643
7924 -255720 -89100 54345 141780 108978 -22153 -381043 54482 -21016 144257 -136496 -296464
7913 -296464 -171600 -125810 -172787 -114166 36552 -35270 141389 48974 -10433 65115 153297
7902 153297 282209 -132048 -86473 185291 77322 27284 -358931 -139014 -6374 -237918 -83246
7890 -71043 -283140 -311902 8583 85566 -221102 -262997 -367256 -16807 44219 -132192 68809
7878 246180 -22541 115932 334551 -75058 -138079 38512 -191798 82096 10601 -202997 -364658
7867 -364658 -199594 172581 58359 253029 -258243 -299035 129219 232821 94046 -219095
7856 -166728 -53302 -92625 -187339 -181155 82755 -169371 -300424 -59349 10343 -56432 -159860
7845 -159860 36578 148756 -17892 249282 -3991 128933 -53850 -242055 177579 -31219 30602
7833 -146289 -66157 87230 393732 144001 226903 -436235 -5589 45276 236615 -220658 50619
7821 -164130 -375418 88463 162702 34613 18646 263553 -34834 322649 -36406 263116 -6601
7809 -153308 -107375 -159027 147162 -7568 313230 179952 -153845 -193351 81794 49638 31834
7798 31834 269800 -184175 -164235 -54792 -369814 80478 21904 9581 112461 -420643 102014
7786 -75657 -143774 -323210 238511 -32297 -314849 -214745 -150213 -310439 165202 164095 -21394
7774 -110909 -3771 123348 -202592 336921 -295682 22874 -276109 -203063 -90667 89768 -12307
7762 -124875 -168653 204472 163776 37321 -326204 -133587 -69943 114700 194732 228367 -244488
7750 43602 72876 -244318 93536 90455 -14469 -5487 -54795 -134439 183892 -19889 -282975 -71038
7737 -30866 -219883 -253633 277812 147949 12363 -54672 -416834 -178589 -68700 -25406 -96316
7726 -96316 -53525 134497 -288561 76447 -491814 198777 -235656 32965 -36952 -244814 100090
7714 -72327 202197 -74992 -41233 194983 -264620 340147 122855 -76619 161910 2397 77534
7703 77534 -281537 146905 184582 206625 -62426 -83418 -272602 120862 52720 255771 -25757
7691 2112 -1054 -252546 120516 -112488 -160412 226351 84579 -71134 42955 23681 -163613
7679 265945 -133180 -100249 97372 -104345 -204437 -4697 67650 83320 -96413 140366 27030
7667 -82078 346696 -460936 209765 -10713 -39384 -136884 -261689 -176986 -98353 -59845 -21026
7655 412344 -47615 34227 -104653 -178890 -10789 -114572 232437 12393 -154737 -167067 -241801
7644 -241801 279461 62502 -334166 -158413 250265 192724 -108884 -53956 182048 62867
7633 284777 4898 -31229 87685 159876 -229405 141683 -99153 -171050 -148969 37129 39075 56010
7621 56010 -176029 -136633 -593348 -36802 -366385 -94021 -75466 -118306 88875 -20529 153890
7609 -8735 -204355 -24553 -77214 34104 -70069 -173133 -296008 -154602 -89120 -348502 -55577
7597 -102374 238214 -29772 211247 143775 -78752 133380 -84376 -265218 -318918 -83902 -372032
7586 -372032 235063 268447 204058 -142271 127150 109143 -363281 -328994 347924 -119063
7575 178237 -138089 175657 -34496 248765 206193 -173110 -226547 -97857 4399 72964 149834
7564 149834 -82234 -225464 -190378 -22153 -10360 121021 -89525 -282573 -82739 57472 192179
7553 192179 -308521 -165289 73207 -25574 -205453 -26993 91370 -514798 -174043 -17814 155429
7541 -127164 -76932 3196 -101165 -77569 164748 135937 197602 -303856 -254685 -24985 259875
7529 235884 249346 87895 -154380 -148985 -149055 -245229 -64140 -92921 152715 251916 4039 -279045
7516 -314801 -3683 -71755 -170864 -236802 138759 -175766 90525 -403724 -38026 66894 137105
7505 137105 168420 -286 -405109 -178232 -176627 -211192 45194 -177746 -34063 -105898 -81887 -145820
7493 -145820 -238221 123143 -235871 37401 -45690 64067 165472 -254610 -31073 -224652 -445863
7482 -445863 78403 112130 -45163 71985 -65690 20933 -186616 -105369 13356 -200027 -66809
7470 196799 -241833 -58706 167435 -46693 -123025 366835 -26072 -225293 -129728 158877 -171874
7458 -176796 -242213 237171 145959 -138517 145509 -219540 281809 -68242 -45623 -21736 5627
7446 173258 -83639 -133525 -145416 37237 -4223 -5694 -200479 -189084 232293 -80138 -447373
7435 -447373 -27528 -379624 127942 -59880 245892 126498 -123153 17456 -131491 -239748
7425 -239748 276633 244003 -414856 -15816 -36313 -383407 -130358 -69624 306853 4393 138688
7414 138688 123087 -112649 -111200 -73374 -63471 -207601 -75843 -157607 -76537 -236189 109623
7402 162592 -75734 98607 3726 -409936 -105204 19920 102041 -136781 -64483 -74207 70975
7390 -111541 -55460 142126 220306 129400 -19855 191085 62452 -2162 -153634 -45479 -169940
7379 -169940 267039 -271935 -25206 -189317 1938 -156272 -20707 36914 -78465 -325007 -26540
7367 131334 118307 -111915 -51422 -241894 -127256 -268053 -221245 -60040 98454 -211024 109455
7355 113309 -81256 -205018 168633 -24325 -194127 84153 408796 149216 -116724 -42338
7344 35685 -238634 121012 -85785 91266 -41479 -165582 283695 -163678 17805 117572 -18032
7332 -92207 97765 172091 -40466 -20277 99501 11881 -152947 -86000 -47073 191443 -199536
7320 112671 -22328 -51293 -315374 -78209 -151968 24747 62976 -55185 -101980 -46769 -240225
7309 -240225 -190317 -30586 24445 15413 -50405 -140620 7037 -194000 -195955 -5558 -73491 -311384
7297 -311384 61456 106262 -318977 -128941 304491 198771 -284482 -138043 -146621 132832
7286 134106 -216192 104714 36262 -47712 123195 56871 153596 -214994 -129745 74356 -29845
7274 -74544 -14389 135522 -219330 -234821 90589 -250175 170459 -105510 5992 58096 -23060
7262 225790 13755 -189081 48785 196756 -273325 -829 198395 -55368 125732 172296 254040
7251 254040 -40066 -264534 -24331 -214271 169693 -267078 -311900 -107981 100584 90878 177665
7240 177665 187380 16813 212235 -141874 -232431 81241 91790 282463 122987 460 -134029
7228 30484 -4913 32335 212253 -141043 319782 138626 222598 -189380 -240164 -152313 1589
7216 93976 -173752 -225782 -121290 -92898 -451087 16657 43932 -108109 -98089 187653 -24139
7204 359695 207527 405878 -7618 -111351 64235 11653 63074 76325 -11060 -235750 149940
7192 -51322 -275263 -69993 -9137 -69198 46373 -7418 -320288 123481 19737 115267 -88831 -345074
7180 -345074 -136430 -79389 14992 52031 77417 -257711 -73632 388193 244732 -31353 -199531
7169 -199531 285712 -221015 -151989 103429 164321 -119832 40072 -44736 79601 -72461 -175338
7158 -175338 296 -108323 -410708 -207968 -181452 -73392 114474 25601 15116 -125479 -290871
7147 -290871 -486135 46157 36800 239189 -20307 124666 -279405 -10128 19951 80167 -282406
7135 165508 119019 -43977 -182702 13019 -34267 188300 -61624 -266046 128684 -70924 -93029
7124 -93029 230393 -224581 -465824 -37465 -204259 -60722 -283567 -81310 -49416 -214695 -82591
7112 -126469 -135057 30455 309987 -29970 -79432 236584 -131837 128354 -198686 -78126 -171317
7101 -171317 -73343 42155 -13911 -32037 70495 -210065 -274372 -170332 57133 32356 79551
7090 79551 -276049 -121878 260662 229426 -27655 70555 41197 -73946 90332 359762 -206577
7078 58908 -324646 -193755 -413104 320545 90670 78098 94485 426077 -375983 -22488 96397
7066 159807 16333 38794 442024 53530 115059 218099 -95426 46599 -235931 -249657 -278624
7055 -278624 -80127 -157872 -35470 -186694 10103 -44842 365320 -374953 209537 17395 -141755
7043 93159 -319467 4667 -189259 59663 37865 152223 -47606 -29333 -144190 204535 -167968
7031 194143 244755 -126482 88908 -275130 -8368 -132922 -211801 140276 179595 -356813 -251082
7020 -251082 -144647 5399 -217812 -374628 31125 -98199 -182880 238093 245278 241720 111168
7008 259325 -137793 272471 -16238 63061 125513 -64088 -182518 -83402 220486 12025 21375
6997 21375 -253876 69648 -284510 -116235 41481 196371 236315 -224011 -271196 39359 -137296
6985 229727 -67245 38127 112982 24622 55597 -369371 68523 -22216 68438 95074 146202
6974 146202 44627 -251093 36916 -129064 94339 -256766 -167099 -164752 80525 -74427 -114040
6963 -114040 -138306 10753 -80103 343312 -142853 -112468 68649 -24570 -189876 -153817 -67875
6951 76645 -270919 46062 -192264 -156311 266526 -252685 -405594 27368 -44043 110295 59502
6940 59502 -171258 45847 -83503 36026 -18329 -133855 -179825 85799 -96029 253640 159000
6929 159000 46618 143425 45958 148632 -145644 -134051 -146831 74050 138890 -151878 50011
6917 -354293 16740 21278 195455 -95729 -273159 -141137 -18194 164323 153956 -31713 58606
6905 -306218 -178600 28752 136232 190921 -12551 161242 67372 -325639 -483145 -115727
6894 -87049 -114276 -220616 141229 -107427 -98268 124658 -122219 68926 89485 -226455 -188702
6883 -188702 -144092 -9601 236156 -42079 165597 -135520 129149 51646 -464982 -209179 129107
6871 -110632 56946 -76000 -94707 -44063 169051 -47126 -27815 4985 253622 -66281 -81515
6860 -81515 -110651 133950 81275 -19056 -175477 -9756 -96818 -10229 -80069 -254371 -265551
6849 -265551 -172088 -235781 -46638 -91786 -76507 326302 -66001 -270632 263386 11857 -54606
6837 -22572 12659 -180177 -77280 -361893 64900 53231 -100246 -71111 107586 151350 180448
6826 180448 81625 -110655 28786 -198341 -134663 7182 67447 -314813 -149349 -48704 38858
6814 -40040 -52494 151590 -100881 133192 126793 7632 59656 -228233 80074 149477 -129971
6802 182206 -103500 88367 136406 42820 178842 212679 64478 -271001 -235171 -99534 -164540
6791 -164540 -13881 -66727 150009 128200 -37081 -238212 -153806 -167519 -84435 -50964 -198100
6780 -198100 -117573 -99199 -199934 -33894 188138 -691656 62854 -65810 142625 -191508 186023
6768 81489 -148193 -308791 -40979 -225405 -9501 22440 -193778 -24931 -31473 63902 234750
6757 234750 130380 -4846 -53178 -92958 -46350 -210372 203273 176955 -119860 -26009 104679
6745 -35158 -136155 -84119 -227392 361328 -51796 54965 -98422 -191442 245070 -70364 -130270
6734 -130270 -222065 -114643 237594 -60962 -286467 152642 -75469 1086 337586 586250 151188
6722 -80848 -257599 200087 -362458 162084 42620 -28846 -184057 306345 -56367 28092 19235
6711 19235 -175538 -268107 -275346 70177 133754 126543 68380 -92132 -146118 67711 -185805 -103735
6699 -103735 331031 -249566 129374 -266871 37087 190807 186224 75804 -305039 39135 7296
6687 117808 431850 -360797 147229 -45845 -208316 -240430 53434 175732 -108873 -9556 -136718
6676 -136718 124274 183098 675 -171966 -217801 -129988 -35494 -65288 66864 -419469 280897
6664 -50895 -52774 -91261 -216374 -225363 24713 111279 -2670 -186005 -332301 25440 -200811 -253159
6652 -253159 -342460 -240225 289690 19827 71038 -189932 -83545 -162146 -273459 16526 -84593
6640 9272 148874 348427 -70905 229745 -113875 155111 -252134 15863 -13159 28882 -180066
6628 -22685 -143597 193406 -196482 102960 -221688 202714 195986 -100517 -408594 -83903
6617 192510 -47046 14845 -123208 10970 6309 -359261 -113309 -18265 359589 -120509 -126263
6606 -126263 -277447 -244247 -22269 -101772 -134576 -83270 -8698 -109921 37338 161807 28890
6594 -53360 -146619 -75455 -127375 100021 287075 85432 -118913 -3831 112165 169825 -159258
6582 134179 -116687 -207228 -67642 -66904 -125623 121418 -44389 -54222 303673 -155149 272973
6570 -125166 -285338 -114120 -56954 38896 -86007 -50383 -14599 -266727 343251 -222449 -116811
6559 -116811 -149779 -150564 94534 -199953 6471 68662 -22694 244037 82094 -60854 131430 56667
6546 101537 -516914 209812 180232 -115255 -68901 -91247 10198 -112996 -338758 -96167 193059
6534 93933 -110282 -34998 -207939 -255796 -185857 -221797 -160775 -96312 162258 9871 -24288
6522 -303762 16150 -263626 7242 -46322 -209204 -236249 208718 54061 44003 -225424 189712
6510 104043 -93823 -77914 140983 -63903 92208 228191 -166518 26830 -246679 37755 95056
6499 95056 -171045 -162311 285339 195862 193277 55394 -58746 16587 -66273 -161818 -156345 72493
6486 151619 -41391 -139314 -15475 -222090 -207469 -420570 290348 -15230 -179343 -11540 -151333
6475 -151333 48762 90411 -44720 -36034 -301369 106228 -84191 -314327 -197805 269917 184547
6464 184547 -60421 156371 -816 -26256 9746 -243253 74603 436633 -196593 -263395 -175733
6453 -175733 -153035 359697 -14711 -9656 78372 4845 42117 182038 -25993 227556 286304
6442 286304 -70706 -141692 -28409 -180543 -454461 -2914 -11595 29746 -4268 154450 -252354
6430 25487 314160 2149 185029 -83125 -442 -166161 150445 -70061 -89927 270783 101629
6418 19538 217190 -262689 54352 -293474 72806 -316743 -106519 -18835 -63579 157844 73272
6406 18311 -89074 -48671 -180576 -69141 -281087 71981 -82016 -289818 -33154 -209197 181169
6394 194984 -254755 -141322 -137002 -9774 277345 386468 -37134 159665 -193176 -32062 -193277
6383 -193277 49947 47474 -182233 47050 167549 122393 -144644 260080 87929 -208347 298442
6371 143320 -116318 -7213 338402 137974 192275 172363 -189432 -43593 -72914 -183613 231195
6359 35839 -338261 46056 -346 -300069 53859 -117879 135914 -3254 173864 17588 -16825
6347 -47564 -92360 -233364 179275 -195790 123327 125312 205383 54391 103910 -125446 7355
6335 -126051 76412 21196 56043 16712 -139341 -72975 -86351 9100 -275952 109792 -107102
6323 43078 -258159 159177 -72540 -190009 131073 9297 30060 95422 -177663 167147 -172076
6311 107972 48440 332579 -262807 -342498 97308 142580 -176200 -157851 279426 17438 -203078
6299 -146355 252314 -176375 70716 -295962 -123590 83060 105020 -66094 240050 -99478 278637
6287 40682 -239758 -60831 -84252 138817 -12978 300519 -125502 276846 -70453 -5471 -167553
6276 -167553 196652 75202 -267309 -267445 -147563 37835 -125173 98586 292283 -134957 27606
6264 -133866 -14051 15522 -226827 -447435 46222 115950 -8200 99044 28303 -58678 96107
6252 -137376 -58533 37530 80496 160373 144205 55087 -95463 29998 -314492 -62079 216788
6240 128293 59448 121257 136467 -475466 -74708 -185238 181880 183123 -147286 146166 40336
6228 59901 -19118 157100 37219 93513 132342 256887 -305754 -45665 333065 300 -57985
6216 -4775 124811 131431 -72341 215130 17882 179024 327559 263785 -156895 -157644 -158793 197454
6203 -501336 -182862 -435301 -99539 46706 355058 -66813 92689 -88410 -215439 -36271 134477
6191 247991 63840 -156533 230155 79970 62180 200369 -85891 -153171 -161350 -21931 48223
6179 -240841 -137545 -60890 -214900 172595 -1942 113397 -47138 -138626 163552 -35531 15660
6167 -55211 13426 159498 -33233 101093 126730 -188750 203136 -100418 180101 120155 -70054
6155 -91628 204286 75984 -243826 64755 -49797 -170914 -112090 158432 92746 195210 -29561
6143 -60430 -145337 157750 -52423 237820 -164803 -61998 -285716 84254 38015 11125 98215
6132 98215 204295 -475706 3929 -68022 -44569 -93670 -138754 -119168 73376 -426 206793 226494
6120 226494 29749 154562 203605 -36054 -226018 -216708 -24355 -229949 28758 66695 64749
6109 64749 98082 96649 -130388 -252102 13041 -99488 38859 -250051 -227232 -172886 151695
6097 55750 242286 18059 19968 50920 332848 -54730 -27399 34024 -67327 65669 95057 -54912
6084 154786 -183430 153966 -118838 240422 -458833 58581 6010 42374 342771 45721 58528
6073 58528 72589 -383641 16232 205589 261750 213218 79331 -157156 46716 125926 -53640
6061 127036 2732 -26711 -12750 7770 147937 220319 -202002 -40842 11835 -341780 -26453
6049 -57409 71060 126910 228863 4572 249112 169407 -222603 12515 68776 266659 -101331
6037 328875 98972 61322 163604 -366858 119484 116186 -329373 219933 98402 478179 -101541
6025 171345 -185336 -246420 -302581 -75760 166302 -126726 -175046 102654 -112968 -45176 58503
6013 -11418 118859 136758 286312 -35068 -350107 -76107 -115110 -84513 -152721 218520 8725
6001 105296 29233 117200 -230016 -20185 272530 126839 -128745 38448 72074 -204821 97302
5989 113216 183340 94052 166022 121546 -95201 -97277 -147804 -218659 247346 55543 -4482 -132982
5977 -132982 -126064 106229 -69213 -50377 -55804 -313236 264468 -2559 -55319 122032 -10121
5965 -242375 332145 -188862 -275502 143917 93167 146592 230043 -223414 143035 316762
5955 316762 468535 -31078 81292 -146342 -166449 193170 138611 -51892 165458 -339379 57853
5943 67844 59117 29434 70280 1923 18216 -445108 -245415 125276 -141754 122988 -188759
5931 -124534 -47109 -136281 -94098 55128 -7190 -89317 -106293 -88987 9805 -79276 226762 1065
5918 -131455 94610 -70748 132603 -295505 283114 -13811 -110636 -270074 15957 42322 -120990
5906 45420 -238613 6266 97487 -422255 -109423 253264 -54623 -163897 280172 86453 69942
5895 69942 -46418 -66236 29189 -26334 192184 -172255 -17391 229541 270784 -52619 116018
5883 -72187 70224 -70005 110032 -92255 67566 -64825 97171 -208782 336403 -205982 96715
5871 115955 -111668 -241299 188646 -241447 21919 128973 190299 262065 -71434 -5492 -146867
5860 -146867 -179340 -7874 -39302 -72208 -77771 -35662 263677 -1278 -395334 -124387 58911 287911
5848 287911 -469763 -49832 -59823 42738 237726 -480454 -5609 93234 -43373 116098 454714
5837 454714 -5503 -327371 -89221 79399 319438 -79547 -290155 -90845 50725 80823 -199514
5825 -374798 -191150 -293915 124330 107485 -13514 119689 -22785 74330 6782 400216 -301724
5813 54357 -158473 148606 80993 -85296 -48421 15392 162579 -238394 -12857 235962 200983
5802 200983 -90493 57967 16546 117063 -142221 236568 -166851 234836 351078 -31463
5791 -173499 -219559 -89620 -12730 6793 -104691 59713 -241510 -119345 40819 -180719 179475
5779 -61252 -226127 122155 -60003 126953 1132 -249108 -36149 -215262 55802 295669 92630
5767 152215 252619 -126094 -73990 -10067 61939 -73269 23677 -118954 -332510 32231 2845
5755 -226254 -180920 -50383 110636 18303 38013 332831 -108578 49823 -248655 -83434 -10725
5743 -120835 6803 -161453 25066 190170 155718 155245 -245180 -179451 86985 57711 208027
5732 208027 -262892 -94891 -281869 -181750 -137239 -284575 -48039 -173934 -158426 -255179 106955
5720 -103778 100301 -178392 -133902 -212259 52684 -27547 323000 -183771 -251974 -27383 -6244
5708 133521 55152 88729 92231 111417 -316289 -193158 -23589 -4050 39217 -43510 -306900
5697 -306900 4822 -46964 204854 -288105 46540 275801 75 -129988 -50126 47496 -9161 -89012
5685 -89012 156306 -12145 48018 -243795 126856 -176227 -77145 -216470 -135346 58344 17707
5673 -78454 61520 106839 -274805 29915 -145455 36295 138673 -165208 64522 109231 -184786
5661 82324 -92460 -240606 70618 -428060 -119190 -373315 -178008 -50415 -104396 -426991 146521
5649 124543 -165078 -60591 188833 307984 -187483 185432 187083 205784 96393 -98192 125458
5637 241121 157226 -17912 559 260356 -84864 218248 9720 -106471 106856 119021 113840 -432657
5624 52603 -317840 78129 -151797 23537 14428 30391 -146285 129011 -201687 62364 -106545
5612 -149065 311445 65733 -169843 379300 281115 -103725 46051 -111456 -229716 117865
5601 -137973 -108125 261596 -133568 168041 -47187 -25082 31300 -230238 -113407 -91997 -2777
5589 -196581 -67847 -118267 64067 -185013 -75749 -58389 35749 -88791 45077 236628 -165082
5577 -163239 33195 114388 -49494 216984 -178096 -85462 344767 -212261 253562 180139 366859
5566 366859 220364 -158356 477940 137026 -22392 223025 -367795 255644 136952 90845
5556 90845 94658 -125631 106177 57186 -40253 33112 -259368 5558 75136 -30564 -119276 -113249
5544 -113249 19623 -266275 112505 -250623 87 -49698 20516 231575 -137791 383812 -44658
5532 91060 23552 -324929 181410 -239247 99281 -239186 106661 -162568 337049 -89182
5521 484648 -286261 -173086 9298 239426 -251933 91031 -132162 -84101 68337 293392 132472
5509 -48343 -66168 457829 -213459 -179871 -69345 50141 303909 135953 -258964 402864 -93681
5497 316819 170385 178395 4487 -317783 78588 12498 458449 253368 165182 126871 236485
5486 236485 298948 42366 -176265 81104 181712 100005 -61226 8337 -35920 177491 144945
5475 144945 139143 -79762 -121536 -47437 -215590 -213296 131129 156369 248503 -182159 -102320
5464 -102320 318963 199139 214325 54431 -10813 95858 10059 -159573 35111 -94884 94668
5452 -162554 28763 270192 -149588 -16114 96849 -74982 65626 -121608 -51906 160199 -48027
5440 -158553 61243 -360634 -147921 -44342 182684 -294282 -149258 207617 129978 -76152
5429 2518 -75518 -26673 70228 118219 -25565 -84177 -131943 -211550 8016 -691 77722 308224
5417 308224 -330485 -94444 -422731 -241752 -909 236706 -99969 -49252 -25545 20432 105387
5406 105387 61673 68915 -410603 -176031 -100877 -132508 -292450 -199833 -309053 125788 -309012
5394 146516 112666 -575940 -280912 -85733 9185 -24982 -172763 -172579 203737 63971 243095
5383 243095 -33632 -84280 -162117 -133822 -31315 90139 -118308 60483 179300 -35717 209361
5371 45777 -127929 -86865 1150 105798 -7983 31880 363408 -246036 1915 151872 -131437
5359 63398 -70559 -158649 150052 93913 -161864 184426 287741 44574 -360236 -124175 104796
5347 -11109 121787 -65838 50359 217298 -66364 14974 -6483 3933 -207866 -51538 -193827
5336 -193827 -207030 106361 535943 -340461 -38831 204818 -229400 -113859 237486 128104
5326 128104 74555 -1769 6779 24985 38827 -139447 42808 -137898 231766 230501 98249 -158077
5313 142973 83560 60671 95768 169628 -121690 -206123 148746 143446 35691 275912 -155749
5301 -59258 -149944 -184238 -311573 -45579 255838 494432 46517 15427 50772 188645 141833
5290 141833 -87369 328174 -225653 -167666 36069 119203 -70705 -60571 -4582 -94145 225204
5278 -34789 214211 143794 -61858 -211217 121627 191400 -281624 55680 271764 -233435 -105034
5266 -14982 -154790 168505 -242637 -72808 -71938 -65523 229075 21790 -247021 -66829 -17141
5254 -129864 112830 -124704 93144 78012 142969 -219759 -155007 154124 -206637 -47174 -183865
5243 -183865 -114483 -33710 -77135 -3186 162045 112937 89346 -232238 80828 23451 -96564
5231 -57626 -62382 -57630 -334430 -111416 50473 105479 -50694 204268 87589 -169075 74907
5219 -24328 2007 -202003 -1274 -100616 -94446 109312 65609 -212039 66165 -625695 76377 38459
5207 38459 123492 147802 -127877 347194 74586 -139938 -44438 51291 -45273 -252738 -170764
5196 -170764 -128366 -20374 144581 -106487 -307628 383108 212009 132305 -141921 -33446
5185 -272059 179790 -8698 -454702 76693 -109972 -275415 7920 51639 182223 68692 -19600
5173 -7228 -175475 230864 142278 50128 245535 -270746 -373001 -314825 351219 -36353 47171
5161 122597 72715 -101898 -33792 16698 56567 87212 -96891 118846 7131 12646 -39299 152298
5148 82665 -187726 -263609 -171857 29464 113803 58670 -220542 97073 350324 158718 332544
5137 332544 -131467 92212 32604 120901 -298331 71931 79304 62936 106159 -15164 -32505
5126 -32505 -14582 -70388 -114019 124729 -6506 100584 37503 -67961 37434 -156697 -19710
5114 52587 -110713 -226376 175654 -104654 -45097 -125491 -130821 -110751 -174821 -243112 -28092
5102 -193035 320289 -26461 62031 -150116 319175 164854 27663 141009 60365 -166258
5091 235147 -71324 -94407 189449 121003 212282 66188 261128 98660 -74527 136217 -100220
5079 65248 -86630 118521 202254 -233039 -44234 91889 -231918 -49931 -170000 -69164 135562
5067 89826 69564 11235 139754 303004 -75026 -139922 -169958 66638 87718 -131160 12953
5055 105486 189158 -56165 -20187 295579 -306829 39360 79696 -161529 -384547 -53410 151825
5043 82985 89047 123197 147523 156480 102915 -100931 -257896 342217 341042 -269850 45067 -93166
5030 75340 115852 -253875 -165314 204634 -45254 -34870 91000 -62492 -11318 33926 41406 53452
5018 53452 -9103 -25575 141599 170230 138535 93538 152592 -33825 6610 -189479 -58937 -119232
5006 -119232 -70454 -353703 87080 166105 274154 177512 250960 -151094 -134595 -184020 -117056
4995 -117056 25558 93133 138057 -122429 -245284 64139 47569 -1819 -44039 29167 -1115 -14025
4983 -14025 -74584 109942 -16583 194113 -13842 -88120 209199 -186511 72894 107247 133787
4972 133787 119725 66421 24878 -33061 222674 200391 119356 -117517 -73017 -22215 -170344
4961 -170344 130689 236093 -68377 139829 192064 26591 -83585 11097 42943 144011 -76614
4949 288880 79027 -23380 -276278 -31059 -24412 74950 184447 -24117 -78531 -165273 164762
4937 139107 240474 -138933 195035 -73982 -78218 107937 -83535 64324 -182545 -56526 -70490
4926 -70490 38665 -388495 264833 315473 -179663 135089 -126863 203907 5765 -16628 -201121
4915 -201121 -205884 -83711 -30020 238868 -124631 -297067 -17949 288569 -69260 -120138 -89113
4904 -89113 410222 -177074 287274 -17688 104483 -149634 -48100 -38462 -43106 -370233 12234
4892 119874 -11482 315760 95510 185161 -49340 -71875 62430 -44413 -37568 -454165 170451
4880 -83721 264281 103718 -2888 135742 -136103 -72616 -282034 -112622 216903 -2346 220805
4868 -217430 142647 168844 76478 -215418 -37135 150325 -152202 -212266 48413 262776 -380602
4856 90258 91564 254495 -59766 -21402 324235 352710 45800 -10912 -279734 -149870 -7270
4844 52920 -24800 107559 63319 233894 20147 -118952 171547 -142332 -361791 76487 118468
4833 118468 73891 106079 -30504 -113432 136746 -7545 158216 130848 142530 50022 24917
4821 81762 118976 273389 200106 33843 126604 -90139 109586 198713 -297813 491910 -400208
4809 126339 165270 -217235 -4614 422449 57165 -281830 -29794 -100718 -100542 -185757 18333 -29408
4796 -42134 243916 -166386 475187 -43921 -986 -155900 -189702 -156662 207044 -103209 -53856
4785 -53856 113663 81335 238673 107526 -280286 34266 121673 295140 -282422 16408 -98238
4773 -236040 75579 5225 263086 -116437 197880 15442 -354051 -15944 349762 -80574 -188773
4762 -188773 421932 43340 213573 226799 267888 5779 -277848 -207561 -181111 123730 349413
4751 349413 5446 -19644 45163 -20988 31301 97676 4485 283758 -154384 -101283 3201 -63071
4738 55382 178022 -32931 -426023 328178 122718 -120916 -154972 -95356 -58044 -360784 125900
4726 197502 63566 253230 -98380 31342 258418 -14476 35925 -240229 -45566 70128 -21100
4714 -83621 -57951 -47155 -192620 -180460 -60064 -18915 -117127 -125355 32194 -108617 185114
4702 6393 98700 113935 21011 38654 344428 -165569 156367 51117 -46019 -112945 -13992
4690 150097 -181831 -56906 -227702 -340 -294566 -99503 -209072 393838 -80269 26042 310286
4679 310286 231588 39819 -144275 -95303 -68764 147873 382705 31377 83475 24507 93418
4668 93418 -148126 15265 -151440 111377 -276119 -41021 -48067 151090 -24769 75127 -109018
4656 296353 -62883 -135453 -29957 56122 166306 -47917 71885 33144 34419 63770 -58615 182665
4643 -90833 204109 405646 217169 -89325 -254027 -365905 -22626 96414 -157466 -272315
4633 -272315 -43816 70705 -30600 -213010 -167697 -321127 132678 110190 -197651 -114667 340737
4621 73113 169593 -90179 -57573 -154474 118116 -165109 -205484 231020 70497 -30103 29912
4609 131395 34807 111070 41720 310378 -107891 85943 -113098 -8876 182356 222689 123838
4598 123838 -52908 217396 27973 -163927 -44250 -105110 136396 -57084 -132164 135356 74958
4587 74958 251745 -118023 49010 248488 -59581 -9720 -86463 141333 126487 87524 -206428
4575 -86202 -110107 -165841 79216 293646 89104 -201525 75494 9176 297933 -91186 -60619
4564 -60619 128271 -75812 -231997 -187546 -205504 -49915 -50076 18207 -164560 57945 220153
4553 220153 -197280 40678 121808 205812 17407 217159 67197 -88921 -278237 -225153 -448520
4542 -448520 237316 -184580 -253207 137615 137730 85208 -115947 50222 148637 369004 71634
4530 -74306 -179148 189785 -21517 -146917 -26034 -241773 234952 201926 106001 -149881 -237112
4519 -237112 48308 222386 109339 81305 361452 -85564 59551 143756 -224868 30917 -39975
4507 -185537 -70046 -199728 31944 3642 108316 -296078 -202377 -196375 -141046 -51421 166770
4495 -493283 -55283 282004 -287066 121516 44893 188979 10221 134110 105864 254965
4485 254965 37404 95770 -63039 6858 -242037 -50328 7618 32702 -162037 18864 -304367
4473 146167 -302053 -144873 -104040 -332066 219133 215963 -209801 67150 190745 -33480 177714
$$ [...]
##END NTUPLES=NMR SPECTRUM
##END=
