
##TITLE=UV1140_M5-1005-1002_6279251_OJ9zw3KIJ4
##JCAMPDX= 6.0         $$ Bruker NMR JCAMP-DX V2.0
##DATA TYPE= NMR SPECTRUM
##DATA CLASS= NTUPLES
##ORIGIN= BRUKER
##OWNER= Administrator
$$ 1.72 TOPSPIN		Version 2.1
$$ 2012-06-03 18:32:48.578 -0500  Administrator@TOPSPIN
$$ Compression mode = diff/dup
##.OBSERVE FREQUENCY= 400.13188235
##.OBSERVE NUCLEUS= ^1H
##.ACQUISITION MODE= SIMULTANEOUS (DQD)
##.ACQUISITION SCHEME= undefined
##.AVERAGES= 64
##.DIGITISER RES= 22
##SPECTROMETER/DATA SYSTEM= spect
##.PULSE SEQUENCE= noesygpps1d.comp
##.SOLVENT NAME= COFFEE_meoh
##.SHIFT REFERENCE= INTERNAL, COFFEE_meoh, 1, 14.96656
##AUDIT TRAIL= $$ (NUMBER, WHEN, WHO, WHERE, PROCESS, VERSION, WHAT)
$$ ##TITLE= Audit trail, TOPSPIN		Version 2.1
$$ ##JCAMPDX= 5.01
$$ ##ORIGIN= Bruker BioSpin GmbH
$$ ##OWNER= Administrator
$$ $$ C:\Bruker\TOPSPIN/data/COFFEE/nmr/UV1140_M5-1005-1002_6279251_OJ9zw3KIJ4/12/pdata/1/auditp.txt
$$ ##AUDIT TRAIL=  $$ (NUMBER, WHEN, WHO, WHERE, PROCESS, VERSION, WHAT)
(   1,<2012-06-03 18:32:43.421 -0500>,<Administrator>,<TOPSPIN>,<go>,<TOPSPIN 2.1>,
      <created by zg
	started at 2012-06-03 18:21:13.312 -0500,
	POWCHK enabled, PULCHK disabled,
       configuration hash MD5:
       D5 CA 7A 23 FE 6B EE E2 50 67 74 61 24 F7 5E 3B
       data hash MD5: 64K
       1E A3 1F DC 25 6F FB 9F 90 7B A9 4D 60 A3 6D 04>)
(   2,<2012-06-03 18:32:46.328 -0500>,<Administrator>,<TOPSPIN>,<proc1d>,<TOPSPIN 2.1>,
      <Start of raw data processing
       efp LB = 0.3 FT_mod = 6 PKNL = 1 PHC0 = 0 PHC1 = 0 SI = 128K 
       data hash MD5: 128K
       E3 FA 8D 2F A7 22 9D AF 6F 8D 5B EE B7 66 A1 4B>)
(   3,<2012-06-03 18:32:47.515 -0500>,<Administrator>,<TOPSPIN>,<proc1d>,<TOPSPIN 2.1>,
      <pk PHC0 = 33.37646 PHC1 = 0 
       data hash MD5: 128K
       19 C2 F9 F2 82 16 CD 92 36 13 03 B0 74 AD C2 E5>)
(   4,<2012-06-03 18:32:48.218 -0500>,<Administrator>,<TOPSPIN>,<proc1d>,<TOPSPIN 2.1>,
      <abs ABSG = 1 
       data hash MD5: 128K
       DD F1 48 4D E2 06 BA 68 21 27 25 85 2A E9 9C E7>)
(   5,<2012-06-03 18:32:48.296 -0500>,<Administrator>,<TOPSPIN>,<proc1d>,<TOPSPIN 2.1>,
      <abs ABSG = 2 
       data hash MD5: 128K
       F4 FF 04 95 40 DF 83 F7 F8 CA 0D 38 BD A9 D3 C1>)
(   6,<2012-06-03 18:32:48.343 -0500>,<Administrator>,<TOPSPIN>,<proc1d>,<TOPSPIN 2.1>,
      <abs ABSG = 3 
       data hash MD5: 128K
       DE E7 EE 13 EB 79 33 DE 3D B0 9C E2 53 88 04 29>)
(   7,<2012-06-03 18:32:48.421 -0500>,<Administrator>,<TOPSPIN>,<proc1d>,<TOPSPIN 2.1>,
      <abs ABSG = 4 
       data hash MD5: 128K
       E6 A3 FB 88 77 20 9E 85 7A 66 5A 66 ED 54 3F 17>)
(   8,<2012-06-03 18:32:48.484 -0500>,<Administrator>,<TOPSPIN>,<proc1d>,<TOPSPIN 2.1>,
      <abs ABSG = 5 
       data hash MD5: 128K
       8D 81 BB 88 86 96 BA 02 F6 EE A5 85 D2 FD CF 8B>)
$$ ##END=
$$ 
$$ $$ hash MD5
$$ $$ 00 93 15 3C 5E 8E B7 A0 32 25 00 CE 8A 0D 29 BA
##$RELAX= 
##$RELAX= 
##$RELAX= 
##$RELAX= 
##$RELAX= 
##$RELAX= 
##$RELAX= 
##$RELAX= 
$$ Bruker specific parameters
$$ [...]
##$TP07= 0
##$TPNAME0= <>
##$TPNAME1= <>
##$TPNAME2= <>
##$TPNAME3= <>
##$TPNAME4= <>
##$TPNAME5= <>
##$TPNAME6= <>
##$TPNAME7= <>
##$TPOAL= (0..7)
0.5 0.5 0.5 0.5 0.5 0.5 0.5 0.5
##$TPOFFS= (0..7)
0 0 0 0 0 0 0 0
##$TUNHIN= 0
##$TUNHOUT= 0
##$TUNXOUT= 0
##$USERA1= <user>
##$USERA2= <user>
##$USERA3= <user>
##$USERA4= <user>
##$USERA5= <user>
##$V9= 5
##$VALIST= <valist>
##$VCLIST= <CCCCCCCCCCCCCCC>
##$VD= 0
##$VDLIST= <DDDDDDDDDDDDDDD>
##$VPLIST= <PPPPPPPPPPPPPPP>
##$VTLIST= <TTTTTTTTTTTTTTT>
##$WBST= 2048
##$WBSW= 25
##$XGAIN= (0..3)
0 0 0 0
##$XL= 0
##$YL= 0
##$YMAX_a= 10535847
##$YMIN_a= -6371114
##$ZGOPTNS= <>
##$ZL1= 120
##$ZL2= 120
##$ZL3= 120
##$ZL4= 120
##$ABSF1= 14.96656
##$ABSF2= -5.58597
##$ABSG= 5
##$ABSL= 3
##$ALPHA= 0
##$AQORDER= 0
##$ASSFAC= 0
##$ASSFACI= 0
##$ASSFACX= 0
##$ASSWID= 0
##$AUNMP= <proc_prof1d_extract.lims>
##$AXLEFT= 0
##$AXNAME= <>
##$AXNUC= <1H>
##$AXRIGHT= 0
##$AXTYPE= 0
##$AXUNIT= <>
##$AZFE= 0.1
##$AZFW= 0.1
##$BCFW= 0
##$BC_mod= 0
##$BYTORDP= 0
##$COROFFS= 0
##$CY= 15
##$DATMOD= 1
##$DC= 0
##$DFILT= <>
##$DTYPP= 0
##$F1P= 0
##$F2P= 0
##$FCOR= 0.5
##$FTSIZE= 131072
##$FT_mod= 6
##$GAMMA= 0
##$GB= 0
##$INTBC= 1
##$INTSCL= 1
##$ISEN= 128
##$LB= 0.3
##$LEV0= 0
##$LPBIN= 0
##$MAXI= 10000
##$MC2= 0
##$MEAN= 0
##$ME_mod= 0
##$MI= 0
##$NCOEF= 0
##$NC_proc= -3
##$NLEV= 6
##$NOISF1= 0
##$NOISF2= 0
##$NSP= 0
##$NTH_PI= 0
##$NZP= 0
##$OFFSET= 14.96656
##$PC= 1
##$PHC0= 33.37646
##$PHC1= 0
##$PH_mod= 1
##$PKNL= yes
##$PPARMOD= 0
##$PPDIAG= 0
##$PPIPTYP= 0
##$PPMPNUM= 2147483647
##$PPRESOL= 1
##$PSCAL= 4
##$PSIGN= 0
##$PYNMP= <proc.py>
##$REVERSE= no
##$SF= 400.130005621878
##$SI= 131072
##$SIGF1= 0
##$SIGF2= 0
##$SINO= 400
##$SIOLD= 131072
##$SPECTYP= <>
##$SREGLST= <1H.CDCl3>
##$SSB= 0
##$STSI= 131072
##$STSR= 0
##$SW_p= 8223.68421052632
##$SYMM= 0
##$S_DEV= 0
##$TDeff= 65536
##$TDoff= 0
##$TI= <>
##$TILT= no
##$TM1= 0
##$TM2= 0
##$TOPLEV= 0
##$USERP1= <user>
##$USERP2= <user>
##$USERP3= <user>
##$USERP4= <user>
##$USERP5= <user>
##$WDW= 1
##$XDIM= 131072
##$YMAX_p= 474507985
##$YMIN_p= -299916362
##$CURPLOT= <Network HP LaserJet P1505>
##$CURPRIN= <$Network HP LaserJet P1505>
##$DFORMAT= <normdp>
##$LAYOUT= <+/1D_H.xwp>
##$LFORMAT= <normlp>
##$PFORMAT= <normpl>
##$SURQMSG= 1
$$ End of Bruker specific parameters
$$ ---------------------------------
##NTUPLES= NMR SPECTRUM
##VAR_NAME=  FREQUENCY,     SPECTRUM/REAL,   SPECTRUM/IMAG
##SYMBOL=    X,             R,               I
##VAR_TYPE=  INDEPENDENT,   DEPENDENT,       DEPENDENT
##VAR_FORM=  AFFN,          ASDF,            ASDF
##VAR_DIM=   131072,        131072,          131072
##UNITS=     HZ,            ARBITRARY UNITS, ARBITRARY UNITS
##FACTOR=    0.0627417313425165, 1,          1
##FIRST=     8223.62146879498, 2534,         -102978
##LAST=      0,             4858,            -103761
##MIN=       0,             -299916362,      0
##MAX=       8223.62146879498, 474507985,    0
$$ Real data points
##PAGE= N=1
##DATA TABLE= (X++(R..R)), XYDATA
$$ [...]
63654D57265K355L126L102J946M98l64q88j856l222m107l921k871j386J86J299
63639D51162J367M74n67j024o71M47J995L147L285L005L492M757N548N347N145
63624D86909N690O262O018N346M750L657J746L36P06J736J174j063k737k382p63
63609E17385Q80K205K970K608J393N84N70P2j866m187n175m691m013l958m151
63594E00626m000l575l413l761m088l445j592M38J442J472J486J846K124K264
63580D87824K784L717M526N243O420P771Q270Q010Q437J0034J1427J1746J2253
63567E88462J4213J6578J7601J7745J8898K1162K2592K2320K2115K4061K7946
63556H13693L1757L4053L5098L6032L7583L9623M1726M3745M5718M7417M8526
$$ y = [457265, 459620, 462746, 465848, 467794, 468292, 467928, 467040, 465184, 461962, 457855, 453934, 451063, 449677, 449863, 451162, 452529, 453003, 452436, 451412, 450741, 451188, 453183, 456330, 459615, 462620, 466112, 470869, 476417, 481764, 486909, 492599, 498861, 504879, 510225, 514975, 518632, 520378, 520714, 521420, 523156, 524330, 523267, 520530, 518148, 517385, 518265, 520470, 523440, 526048, 527441, 528025, 528595, 528667, 526801, 522614, 517439, 512748, 508735, 504777, 500626, 496626, 493051, 489638, 485877, 481789, 478344, 476752, 477190, 478632, 480104, 481590, 483436, 485560, 487824, 490608, 494325, 498851, 504094, 510514, 518285, 526555, 534565, 543002, 553036, 564463, 576209, 588462, 602675, 619253, 636854, 654599, 673497, 694659, 717251, 739571, 761686, 785747, 813693, 845450, 879503, 914601, 950633, 988216, 1027839, 1069565, 1113310, 1159028, 1206445, 1254971]
63545A254971M9149M9364M8286M4517L7929L0115K2614J5569Q705K500k374n961
63533A555384q452r624r821j0585j3108j6765k0361k4073k8720l3789l7763m0097
63521A302226m1303m1209l8854l4343k9449k5928k4061k3032k1741j9249j5239
63510I87818j0300n248m67L527N789O331P056R668J3201J5377J6052J7219J9693
63497A085716K2089K3517K5024K7525L0282L2560L5063L8427M1819M4320M6556
63486A452898M9562N2960N5330N5422N2112M4508L3492K2066J2723N221j739p781
63474A826774j1458j2791j3416j4541j6361j9105k2916k6923l0114l3175l7705
63463A588269m3436m7991m9981n0660n1697n2770n2557n1042m9352m7836m5595
$$ y = [1254971, 1304120, 1353484, 1401770, 1446287, 1484216, 1514331, 1536945, 1552514, 1561219, 1563719, 1561345, 1555384, 1546932, 1537308, 1527487, 1516902, 1503794, 1487029, 1466668, 1442595, 1413875, 1380086, 1342323, 1302226, 1260923, 1219714, 1180860, 1146517, 1117068, 1091140, 1067079, 1044047, 1022306, 1003057, 987818, 977518, 972270, 971803, 975330, 981119, 987450, 994506, 1004174, 1017375, 1032752, 1048804, 1066023, 1085716, 1107805, 1131322, 1156346, 1183871, 1214153, 1246713, 1281776, 1320203, 1362022, 1406342, 1452898, 1502460, 1555420, 1610750, 1666172, 1718284, 1762792, 1796284, 1818350, 1831073, 1836294, 1834555, 1826774, 1815316, 1802525, 1789109, 1774568, 1758207, 1739102, 1716186, 1689263, 1659149, 1625974, 1588269, 1544833, 1496842, 1446861, 1396201, 1344504, 1291734, 1239177, 1188135, 1138783, 1090947, 1045352]
63452A045352m1887l7178l2646k9267k7327k6272k4949k2475j9123j6113j4403
63441G53712j3830j3537j2951j2074j0894r054o421l724k058j718k051k522l356
63428F59522m653n526m896k932q95M32J451K602L373L086K218K137L388M889N167
63413F69363L947K054O8k124m325n514n001l625k890l028k910j987j288j943l338
63398F37459l651k031M49K069K309K159K854M488O148P272Q397J0139J1926J2707
63384G02694J2770J3753J6430J9583K1756K3272K5554K8976L2531L5370L7678
63373I70367L9887M1886M3131M3077M1352L8103L4204L0700K7975K6040K5426
63362A362148K7025L0729L5051L8626M1705M5489N0242N4745N7608N8442N7370
$$ y = [1045352, 1003465, 966287, 933641, 904374, 877047, 850775, 825826, 803351, 784228, 768115, 753712, 739882, 726345, 713394, 701320, 690426, 681372, 674951, 671227, 669169, 667451, 665400, 662878, 659522, 654869, 649343, 644447, 641515, 640620, 641052, 642503, 645105, 648478, 651564, 653782, 655919, 659307, 664196, 669363, 673310, 675364, 675432, 673308, 668983, 663469, 658468, 654843, 651953, 648925, 646015, 644028, 642740, 640797, 637459, 633808, 631777, 632226, 634295, 636604, 638763, 641617, 646105, 652253, 659525, 667922, 678061, 689987, 702694, 715464, 729217, 745647, 765230, 786986, 810258, 835812, 864788, 897319, 932689, 970367, 1010254, 1052140, 1095271, 1138348, 1179700, 1217803, 1252007, 1282707, 1310682, 1336722, 1362148, 1389173, 1419902, 1454953, 1493579, 1535284, 1580773, 1631015, 1685760, 1743368, 1801810, 1859180]
63351A859180N3917M7205L7398K6307J6141P970J664l209p164j1019j5228j9038
63339A994124k1415k3152k6783l3622m1774m8173n1892n4322n6488n7613n6471
63328A522419n3052m8493m4131m0886l8819l6841l3461k8295k2499j7501j3728
63317A144713j0755q052n134j528K692O676R721J2333J5599J9504K2716K4423
63305A232908K5630K7904L1257L4309L6540L9216M3470M8367N1970N3797N5044
63294A680412N6351N6679N4862N1210M6669M1122L3568K3922J3726M824k081p397
63282B053867j1687j5231j8355k1597k5210k8776l1917l5326m0341m7034n3432
63271A724961n7396n8724n8561n7281n4407n0369m6679m3922m1030l7134l2765
$$ y = [1859180, 1913097, 1960302, 1997700, 2024007, 2040148, 2048118, 2049782, 2046573, 2039409, 2028390, 2013162, 1994124, 1972709, 1949557, 1922774, 1889152, 1847378, 1799205, 1747313, 1692991, 1636503, 1578890, 1522419, 1469367, 1420874, 1376743, 1335857, 1297038, 1260197, 1226736, 1198441, 1175942, 1158441, 1144713, 1133958, 1125906, 1120772, 1119244, 1121936, 1128612, 1138333, 1150666, 1166265, 1185769, 1208485, 1232908, 1258538, 1286442, 1317699, 1352008, 1388548, 1427764, 1471234, 1519601, 1571571, 1625368, 1680412, 1736763, 1793442, 1848304, 1899514, 1946183, 1987305, 2020873, 2044795, 2058521, 2063345, 2061264, 2053867, 2042180, 2026949, 2008594, 1986997, 1961787, 1933011, 1901094, 1865768, 1825427, 1778393, 1724961, 1667565, 1608841, 1550280, 1492999, 1438592, 1388223, 1341544, 1297622, 1256592, 1219458, 1186693]
63260A186693k8508k3979j9384j6768j7988k2052k5910k7608k7506k6807k6125
63249I24058k5414k4236k2183j9761j8309j8213j7842j5645j2657j1349j2194
63238G26255j3113j2413j0630r029p835o696n772n519n957o677p120o738n567
63225F23189m536m404m520l690k135j333j819k547k660k436k043r67N53J022l20
63210E91354k132k740k268j877j746j111K47J747K832L118K201M58m54Q89L762
63195E94280N953O360N981O218P178Q093Q709R556J0931J2182J2413J1846J1948
63182G11648J3674J6136J7799J8722K0231K2472K3831K3426K2678K3283K4857
63171I38757K5823K5717K5148K4342K3351K3190K4948K7768K9417K9072K8160
$$ y = [1186693, 1158185, 1134206, 1114822, 1098054, 1080066, 1058014, 1032104, 1004496, 976990, 950183, 924058, 898644, 874408, 852225, 832464, 814155, 795942, 778100, 762455, 749798, 738449, 726255, 713142, 700729, 690099, 681070, 673235, 666539, 660767, 655248, 649291, 642614, 635494, 628756, 623189, 618653, 614249, 609729, 606039, 603904, 602571, 600752, 598205, 595545, 593109, 591066, 590099, 590652, 591674, 591354, 589222, 586482, 584214, 582337, 580591, 579480, 579727, 581474, 584306, 587424, 589625, 590083, 589629, 590518, 594280, 600233, 606593, 612574, 618792, 625970, 634063, 642772, 652328, 663259, 675441, 687854, 699700, 711648, 725322, 741458, 759257, 777979, 798210, 820682, 844513, 867939, 890617, 913900, 938757, 964580, 990297, 1015445, 1039787, 1063138, 1086328, 1111276, 1139044, 1168461, 1197533, 1225693]
63160A225693K8130K8764K9047K8401K6424K2676J7590J2599Q463M192j433p910
63148A422636j3588j7695k0800k3383k5014k5031k3371k0539j7264j4327j2143
63137A209481j0319p984m802j237K249N841R925J4438J9021K3407K7175K9553
63125A316748L0208L0139L0920L2941L5047L6038L5836L4887L3427L1825L0797
63114A678813L0397K9466K7055K3793K0764J7587J2964O778J57o588j4280k2798
63102A804108l0404l6052m0892m6260n1289n4090n4572n4535n4971n4579n1450
63091A275014m5608l9484l5955l5709l6526l5507l2077k8114k5125k2492j9139
63080I19278j5690j3637j3026j2408j0912r169q106p796p648o986n383l021p98
$$ y = [1225693, 1253823, 1282587, 1311634, 1340035, 1366459, 1389135, 1406725, 1419324, 1427787, 1431979, 1430546, 1422636, 1409048, 1391353, 1370553, 1347170, 1322156, 1297125, 1273754, 1253215, 1235951, 1221624, 1209481, 1199162, 1191178, 1186376, 1185139, 1187388, 1193229, 1203154, 1217592, 1236613, 1260020, 1287195, 1316748, 1346956, 1377095, 1408015, 1440956, 1476003, 1512041, 1547877, 1582764, 1616191, 1648016, 1678813, 1709210, 1738676, 1765731, 1789524, 1810288, 1827875, 1840839, 1847617, 1847774, 1841186, 1826906, 1804108, 1773704, 1737652, 1696760, 1650500, 1599211, 1545121, 1490549, 1436014, 1381043, 1326464, 1275014, 1229406, 1189922, 1153967, 1118258, 1081732, 1046225, 1014148, 986034, 960909, 938417, 919278, 903588, 889951, 876925, 864517, 853605, 844436, 836330, 828534, 820886, 813900, 808517, 805496, 804698]
63067H04698M24O96P61J171J984K998L746L667K932K647L507M750N316N478O149
63052H50924O988O685N201M240N034O733P650P241O273N658N707O070N992M973
63038I35369L511K803L474M852N689N322M120L093L032L677L864K912J583J186
63024I84487J969L159M256N380O374O693O425O491P389Q567R375R976J0919J2408
63010A083868J4282J6272J8000J9239K0453K2416K5160K7830K9819L1380L2966
62999A341685L4709L6760L9427M2616M5750M8623N1617N4803N7620N9813O1875
62988A875298O4030O5592O6013O5836O5840O5926O5752O5842O6890O8234O8238
62977B603491O6404O4019O2209O0061N5533M7966L8911L0125K1407J1206p89j2734
$$ y = [804698, 805122, 805818, 806579, 807750, 809734, 812732, 816478, 820145, 823077, 825724, 829231, 833981, 839297, 844775, 850924, 857912, 864597, 869798, 874038, 879072, 885805, 893455, 900696, 906969, 912627, 918334, 924404, 930396, 935369, 938880, 941683, 945157, 950009, 955698, 961020, 965140, 968233, 971265, 974942, 978806, 981718, 983301, 984487, 986456, 989615, 993871, 999251, 1005625, 1012318, 1018743, 1025234, 1032623, 1041190, 1050565, 1060541, 1071460, 1083868, 1098150, 1114422, 1132422, 1151661, 1172114, 1194530, 1219690, 1247520, 1277339, 1308719, 1341685, 1376394, 1413154, 1452581, 1495197, 1540947, 1589570, 1641187, 1695990, 1753610, 1813423, 1875298, 1939328, 2004920, 2070933, 2136769, 2202609, 2268535, 2334287, 2400129, 2467019, 2535253, 2603491, 2669895, 2733914, 2796123, 2856184, 2911717, 2959683, 2998594, 3028719, 3050126, 3061332, 3060543, 3047809]
62965C047809k2810l1245l9169m6274n1144n3665n5205n6100n4652m9657m2585
62954B545303l6032l0825k5743j9450j1562k416P067J5568K2488K8683L5266M2022
62942B570369M7971N3084N8033O2374O4454O3680O1796O1125O2155O3432O3263
62931C231736O0964N6788N1349M5028L7573K8370J7403N681n763j7212k9995m4646
62919C437276n9812p3499q4994r5003j03967j11134j15453j16596j14715j10065
62909B452038j03651r7445r2730q8627q3350p6652o9837o3763n8350n4002n1505
62898A612126n0002m7053m1801l6610l4163l4141l4130l2774l0552k8315k6723
62887A215862k6493k7497k7937k6172k3101k1120k0820k0519j9149j7677j7015
$$ y = [3047809, 3024999, 2993754, 2954585, 2908311, 2857167, 2803502, 2748297, 2692197, 2637545, 2587888, 2545303, 2509271, 2478446, 2452703, 2433253, 2421691, 2419275, 2426342, 2441910, 2464398, 2493081, 2528347, 2570369, 2618340, 2671424, 2729457, 2791831, 2856285, 2919965, 2981761, 3042886, 3105041, 3168473, 3231736, 3292700, 3349488, 3400837, 3445865, 3483438, 3511808, 3529211, 3534892, 3529129, 3511917, 3481922, 3437276, 3377464, 3303965, 3218971, 3123968, 3020001, 2908867, 2793414, 2676818, 2562103, 2452038, 2348387, 2250942, 2158212, 2069585, 1986235, 1909583, 1839746, 1775983, 1717633, 1663631, 1612126, 1562124, 1515071, 1473270, 1436660, 1402497, 1368356, 1334226, 1301452, 1270900, 1242585, 1215862, 1189369, 1161872, 1133935, 1107763, 1084662, 1063542, 1042722, 1022203, 1003054, 985377, 968362]
62876I68362j6349j4636j2512j1366j1367j1447j0769r258p138m918l566l775
62864H51261m953n623n019l887l574m532n986o889o936o479n650m270k649j838
62850G82976k424l584m028l624l260l391l621l595l291k459q92O03Q29J54M88
62835G50881K510M201L439J138J73J507L045K713J161M88J202J681N83j263j890
62820G71569p35O02K10j967m216n015m335l054j799q31n13j096k079k401j565
62805G42775k27O21P48M94k13j860m012m894l255l89R16k80j908j660O7J067M88
62788G28478l16P1J433K592K710J554n55k539l062j850KJ378K192K731K803K244
62772G39866J669J795K360K522K146J844J864J729J135N49O30J450K559L512M158
$$ y = [968362, 952013, 937377, 924865, 913499, 902132, 890685, 879916, 870658, 863520, 858602, 855036, 851261, 846308, 840685, 835666, 831779, 828205, 823673, 817687, 810798, 803862, 797383, 791733, 787463, 784814, 782976, 780552, 776968, 772940, 769316, 766056, 762665, 759044, 755449, 752158, 749699, 748807, 749410, 750239, 750393, 750881, 753391, 757592, 761031, 762169, 762342, 763849, 766894, 769607, 770768, 771256, 772458, 774139, 774722, 773459, 771569, 770834, 771436, 771646, 769679, 765463, 760448, 756113, 753059, 751260, 750429, 749916, 748820, 746741, 744340, 742775, 742548, 743169, 743917, 744411, 744198, 742338, 738326, 733432, 730177, 729788, 730704, 730424, 728516, 726856, 726923, 727990, 728478, 728162, 728233, 729666, 732258, 734968, 736522, 735967, 733428, 730366, 728516, 728518, 729896, 732088, 734819, 737622, 739866, 741535, 743330, 745690, 748212, 750358, 752202, 754066, 755795, 756930, 757479, 758109, 759559, 762118, 765630, 769788]
62757G69788M707N577O905Q047P953O403M752N029P997J2077J4524J3869J1329
62744H78957R638J0455J3025J5344J6284J6376J6859J8377K0649K2945K4684K5755
62732A089348K6572K7903L0488L4518L9423M4310M8819N3392N8507O3771O8312
62721A585363P2096P6191Q1252Q6134Q8792Q8566Q6878Q5294Q3413P9232P1431
62710B484642O0759M9038L7303K5192J1892k780j8155l3220m7048n8832o7869
62699B440922p3923p7820q1129q4569q6774q5652q1323p6676p4123p2701o9711
62688A576521o4579n9315n5298n1599m7105m2443l8677l5617l2684l0137k7945
62677A091122k4684j9363j3493r433p298n543l990l795m384l227M40M032N063
$$ y = [769788, 774495, 780072, 786977, 795024, 802977, 809380, 814132, 819161, 827158, 839235, 853759, 867628, 878957, 888595, 899050, 912075, 927419, 943703, 960079, 976938, 995315, 1015964, 1038909, 1063593, 1089348, 1115920, 1143823, 1174311, 1208829, 1248252, 1292562, 1341381, 1394773, 1453280, 1517051, 1585363, 1657459, 1733650, 1814902, 1901036, 1989828, 2078394, 2165272, 2250566, 2333979, 2413211, 2484642, 2545401, 2594439, 2631742, 2656934, 2668826, 2666046, 2647891, 2614671, 2567623, 2508791, 2440922, 2366999, 2289179, 2208050, 2123481, 2036707, 1951055, 1869732, 1793056, 1718933, 1646232, 1576521, 1511942, 1452627, 1397329, 1345730, 1298625, 1256182, 1217505, 1181888, 1149204, 1119067, 1091122, 1066438, 1047075, 1033582, 1024149, 1016851, 1011308, 1007318, 1003523, 999139, 995912, 996352, 1000384, 1005447]
62664A005447M365M524O669J0301J4801J9293K2126K2501K2106K3451K6908L0945
62652A213437L4838L9321M4558M9386N3141N6872O1901O8164P4631Q0720Q6672
62641A863641R2956R9785J06808J13040J17451J19929J21304J22099J21474J17677
62631B996164J09489R7252Q2582O6879N0057L1066R907j1525l1268m9385o7164
62620C284054q4446r9098j09433j16001j20323j22939j23541j22376j20151j16769
62610B148977j11327j03792r5850q9438q4783q0380p4856o8389o2236n7185n2876
62599A267865m8541m4081m0089l6967l4357l1687k8980k6763k5146k3407k0906
62588I06941j8077j6043j5203j4760j3801j2353j1016j0040r241q446p521o199
$$ y = [1005447, 1009812, 1014336, 1021005, 1031306, 1046107, 1065400, 1087526, 1110027, 1132133, 1155584, 1182492, 1213437, 1248275, 1287596, 1332154, 1381540, 1434681, 1491553, 1553454, 1621618, 1696249, 1776969, 1863641, 1956597, 2056382, 2163190, 2276230, 2393681, 2513610, 2634914, 2757013, 2878487, 2996164, 3105653, 3202905, 3285487, 3352366, 3402423, 3433489, 3443396, 3431871, 3400603, 3351218, 3284054, 3199608, 3100510, 2991077, 2875076, 2754753, 2631814, 2508273, 2385897, 2265746, 2148977, 2037650, 1933858, 1838008, 1748570, 1663787, 1583407, 1508551, 1440162, 1377926, 1320741, 1267865, 1219324, 1175243, 1135154, 1098187, 1063830, 1032143, 1003163, 976400, 951254, 927847, 906941, 888864, 872821, 857618, 842858, 829057, 816704, 805688, 795648, 786407, 777961, 770440, 764241]
62576G64241m447k766j643r82o21r36k048k900k331r12l51r86j298l21Q45Q53
62560G43397J83L78J964M041N316M987L306J992L079O584J0279J2545J4179J6284
62546H28514J7814J7205J5409J5037J6920J9710K2788K6996L2097L5918L7315
62535A085723L8106M0431M3489M4625M2951M0106L7535L4608L0066K4298J9033
62524A480971J4786R673J673q338j7118k2915k7321l2422l7475m0219m0497m0355
62512A240443m0727m0389l8597l6558l5268l3776l0921k7433k4793k3048k1116
62501H87817j8671j6463j5088j4346j3564j2012r555p310o657p142o468l550l78
62488G56613N02o59j522j067l41k1Q65L266O436Q752R419Q866P991P506P746Q714
$$ y = [764241, 759794, 757028, 755385, 754403, 753782, 752846, 750798, 747898, 745567, 744655, 744304, 743318, 742020, 741699, 742544, 743397, 743580, 743958, 745922, 749963, 755279, 760266, 763572, 765564, 768643, 775227, 785506, 798051, 812230, 828514, 846328, 863533, 878942, 893979, 910899, 930609, 953397, 980393, 1012490, 1048408, 1085723, 1123829, 1164260, 1207749, 1252374, 1295325, 1335431, 1372966, 1407574, 1437640, 1461938, 1480971, 1495757, 1505430, 1507103, 1498765, 1481647, 1458732, 1431411, 1398989, 1361514, 1321295, 1280798, 1240443, 1199716, 1159327, 1120730, 1084172, 1048904, 1015128, 984207, 956774, 931981, 908933, 887817, 869146, 852683, 837595, 823249, 809685, 797673, 788118, 780808, 774151, 767009, 760541, 756991, 756613, 757115, 756456, 754934, 753867, 753526, 753505, 754370, 757636, 764072, 772824, 782243, 791109, 799100, 806606, 814352, 823066]
62472H23066J0198J1739J2655J2651J2574J3948J7318K1667K5775K9402L2735
62461A023728L5767L8981M3483M9283N4458N7446N9322O2157O5905O8840P0494
62450A629864P1806P2353P0048O4258N6983M9733M1251K9887J6723M436n946j5299
62438B086097k3869l0414l4095l5842l7223l8669l9339l8407l6066l3143k9927
62427A709103k5661j9653j2488n464J070P729J4347J9519K2480K4331K6412K8432
62415A790157K9265K8757K7361K4582J9363J1888L721l989j1236j8119k4409l0455
62403A846886l7109m4148m9907n3336n5395n7399n8887n8436n6069n3361n1155
62392A271684m8586m4762m0205l5940l2101k8393k5262k3452k2544k0971j7768
$$ y = [823066, 833264, 845003, 857658, 870309, 882883, 896831, 914149, 935816, 961591, 990993, 1023728, 1059495, 1098476, 1141959, 1191242, 1245700, 1303146, 1362468, 1424625, 1490530, 1559370, 1629864, 1701670, 1774023, 1844071, 1908329, 1965312, 2015045, 2056296, 2086183, 2102906, 2107342, 2101396, 2086097, 2062228, 2031814, 1997719, 1961877, 1924654, 1885985, 1846646, 1808239, 1772173, 1739030, 1709103, 1683442, 1663789, 1651301, 1645837, 1646907, 1654636, 1668983, 1688502, 1710982, 1735313, 1761725, 1790157, 1819422, 1848179, 1875540, 1900122, 1919485, 1931373, 1935094, 1931105, 1919869, 1901750, 1877341, 1846886, 1809777, 1765629, 1715722, 1662386, 1606991, 1549592, 1490705, 1432269, 1376200, 1322839, 1271684, 1223098, 1178336, 1138131, 1102191, 1070090, 1041697, 1016435, 992983, 970439, 949468, 931700]
62381I31700j3552r661o866n242m514m131l500k660k305k722l240l253l293m294
62367H62467o101p641q394q924r816j0840j1351j0925r511p560o094o093p498
62354G51719r261j0343j0195q546n641k774j514k043l033l441l475l514l207k277
62340F82455j172j51J262L139M504M809N007N883O505N933N426O749Q915R187
62326G48451P403O674Q876J1903J2848J2013J1784J2915J4135J4819J5790J7419
62314H95030J8766J9201J9632K1403K4722K8677L2266L5029L7193L9482M2530
62303A213931M6259N0134N4002N8265O3177O8490P3839P8975Q3510Q6933Q9202
62292A966717R0734R1388Q9857Q4614P5403O3430N0242L6803K3569J0955o87j1463
$$ y = [931700, 918148, 908487, 901621, 896379, 891865, 887734, 884234, 881574, 879269, 876547, 873307, 870054, 866761, 862467, 856366, 848725, 840331, 831407, 821591, 810751, 799400, 788475, 778964, 771404, 765310, 759217, 751719, 742458, 732115, 721920, 713374, 707733, 704959, 703445, 701402, 698369, 694928, 691453, 687939, 684732, 682455, 681283, 681132, 682394, 685533, 690037, 694846, 699853, 705736, 712241, 718174, 723600, 730349, 739264, 748451, 755854, 762528, 771404, 783307, 796155, 808168, 819952, 832867, 847002, 861821, 877611, 895030, 913796, 932997, 952629, 974032, 998754, 1027431, 1059697, 1094726, 1131919, 1171401, 1213931, 1260190, 1310324, 1364326, 1422591, 1485768, 1554258, 1628097, 1707072, 1790582, 1877515, 1966717, 2057451, 2148839, 2238696, 2323310, 2398713, 2462143, 2512385, 2549188, 2572757, 2583712, 2583025, 2571562]
62280B571562k2022l3029m4410n5176o4128p0808p5583p8793q0059p8798p5266
62269A893490p0716o6270o1938n7020n1418m6179m2621m1085m0679m0073l8433
62258A337058l5850l3244l1716l1620l2069l1691k9960k7617k5685k4392k3280
62247A009934k1971k0445j8703j6553j3960j1344r389q460q168p590o171m313
62235H62867k896k206j719r08L16K045M439O806P498N773L348K885M982P783R694
62220I10707J1160J3135J5037J5442J4288J3130J3292J4681J6558J8577K0736
62209A076743K2908K5022K7395L0472L4252L8257M2026M5466M8808N2425N6768
62198A500542O2204O8684P5544Q1860Q7067R1064R3748R4707R3516Q9891Q3371
$$ y = [2571562, 2549540, 2516511, 2472101, 2416925, 2352797, 2281989, 2206406, 2127613, 2047554, 1968756, 1893490, 1822774, 1756504, 1694566, 1637546, 1586128, 1539949, 1497328, 1456243, 1415564, 1375491, 1337058, 1301208, 1267964, 1236248, 1204628, 1172559, 1140868, 1110908, 1083291, 1057606, 1033214, 1009934, 987963, 967518, 948815, 932262, 918302, 906958, 897569, 889109, 880941, 873351, 867180, 862867, 859971, 857765, 856046, 855138, 855454, 857499, 861938, 868744, 876242, 882015, 885363, 888248, 893230, 901013, 910707, 921867, 935002, 950039, 965481, 979769, 992899, 1006191, 1020872, 1037430, 1056007, 1076743, 1099651, 1124673, 1152068, 1182540, 1216792, 1255049, 1297075, 1342541, 1391349, 1443774, 1500542, 1562746, 1631430, 1706974, 1788834, 1875901, 1966965, 2060713, 2155420, 2248936, 2338827, 2422198]
62187B422198P3359O0121M5408L1287J8335N658p413k0528l3273m5685n7456o7600
62175B424411p5708q2578q8732r3125r4470r3244r1047q8232q3629p6835o9374
62164A487437o3009n7809n2621m6988m1734l7856l5242l2754k9511k5977k3416
62153A040520k2092k0705j8144j5196j3551j3383j3082j1382q709o271m704l852
62141H89449l066j535R31L351M721N567P207R486J0846J0974J1611J3953J6904
62128I80399J9041K0655K2437K3666K3601K3449K4744K6572K6700K5227K4749
62117A241240K6732K9777L1885L2587L2346L1755L2095L4946M0133M5402M9136
62106A628034N2145N5796N9731O2793O5001O6946O7767O5525N9595N1426M2749
$$ y = [2422198, 2495557, 2555678, 2601086, 2632373, 2650708, 2656366, 2648953, 2628425, 2595152, 2549467, 2492011, 2424411, 2348703, 2266125, 2177393, 2084268, 1989798, 1896554, 1805507, 1717275, 1633646, 1556811, 1487437, 1424428, 1366619, 1313998, 1267010, 1225276, 1187420, 1152178, 1119424, 1089913, 1063936, 1040520, 1018428, 997723, 979579, 964383, 950832, 937449, 924367, 912985, 904276, 898005, 893301, 889449, 886383, 884848, 885779, 889130, 893851, 899418, 906625, 916111, 926957, 937931, 949542, 963495, 980399, 999440, 1020095, 1042532, 1066198, 1089799, 1113248, 1137992, 1164564, 1191264, 1216491, 1241240, 1267972, 1297749, 1329634, 1362221, 1394567, 1426322, 1458417, 1493363, 1533496, 1578898, 1628034, 1680179, 1735975, 1795706, 1858499, 1923500, 1990446, 2058213, 2123738, 2183333, 2234759, 2277508]
62095B277508L3974K4535J4132L363o632j5137k2801l1203m1032n0928n8521o2465
62083B064793o3134o1890o0169n8847n7702n5665n2137m7711m3171l8288l2482
62072A493597k6340k1428j8520j6753j4743j1912q692n886l977k671j211N94J884
62059A363942J773M21j481l800o498q391p910n397l380l807n898p529p903p886
62045A296256q263q831r165r230q917p726n464k852q88L02J601L737O327Q225
62031A255112Q803Q643Q953J0451J2833J5266J7239J8947K0785K2631K3885K4494
62019A448042K5524K8137L2073L5841L8454M0252M1795M2881M3253M3430M3967
62008A863649M4509M4581M4775M6075M8268N0194N1375N2209N2554N1502M8748
$$ y = [2277508, 2311482, 2336017, 2350149, 2353512, 2346880, 2331743, 2308942, 2277739, 2236707, 2185779, 2127258, 2064793, 2001659, 1939769, 1879600, 1820753, 1763051, 1707386, 1655249, 1607538, 1564367, 1526079, 1493597, 1467257, 1445829, 1427309, 1410556, 1395813, 1383901, 1375209, 1369323, 1365346, 1362675, 1361464, 1362058, 1363942, 1365715, 1366136, 1364655, 1360855, 1354357, 1345966, 1338056, 1332659, 1329279, 1325472, 1319574, 1312045, 1304142, 1296256, 1287993, 1279162, 1269997, 1260767, 1251850, 1244124, 1238660, 1235808, 1234920, 1235222, 1236823, 1240560, 1246887, 1255112, 1263915, 1272558, 1281511, 1291962, 1304795, 1320061, 1337300, 1356247, 1377032, 1399663, 1423548, 1448042, 1473566, 1501703, 1533776, 1569617, 1608071, 1648323, 1690118, 1732999, 1776252, 1819682, 1863649, 1908158, 1952739, 1997514, 2043589, 2091857, 2142051, 2193426, 2245635, 2298189, 2349691, 2398439]
61997B398439M4867L9926L3183K4803J6417Q937J071q674j9488k9309l7683m5848
61985B426641n4131o1125o5842o9074p1815p3545p3331p1881p1039p1218p0424
61974A673216o6421n9385n1831m6093m2367l9312l6007l2808l0433k8887k7532
61963A212140k5894k4018k2218k0691j9328j7703j5525j3203j1705j1571j2374
61952A017910j3317j4038j4376j3837j1999r463p593p069p088o312m349k053n02
61939I05914N8L00R47J829J926M59k180m678n945n821m919m110m114n129o759
61924H67778q425r783j0684j0968j0706j0452j0791j1545j1923j1481j0452r043
61912G41525p096m818l255l245m047l827j793O35J312j70k039k452j517p18o30
$$ y = [2398439, 2443306, 2483232, 2516415, 2541218, 2557635, 2566572, 2567643, 2558969, 2539481, 2510172, 2472489, 2426641, 2372510, 2311385, 2245543, 2176469, 2104654, 2031109, 1957778, 1885897, 1814858, 1743640, 1673216, 1606795, 1547410, 1495579, 1449486, 1407119, 1367807, 1331800, 1298992, 1268559, 1239672, 1212140, 1186246, 1162228, 1140010, 1119319, 1099991, 1082288, 1066763, 1053560, 1041855, 1030284, 1017910, 1004593, 990555, 976179, 962342, 950343, 940880, 933287, 926218, 919130, 912818, 908469, 906416, 905914, 905972, 906272, 907219, 909048, 910974, 911433, 909253, 904575, 898630, 892809, 887890, 883780, 879666, 874537, 867778, 859353, 849570, 838886, 827918, 817212, 806760, 795969, 784424, 772501, 761020, 750568, 741525, 734429, 729611, 726356, 723111, 719064, 715237, 713444, 714079, 715391, 715221, 713182, 710730, 709213, 708495, 707865]
61897G07865j05J954M704O085N299L929M332P274J1266J3958J4124J2640J1782
61884H05107J3337J7183K1699K5358K7729K9144K9963L0412L0656L0623K9997
61873A091208K8701K7247K6371K6290K6517K6220K4741K1934J8259J4460J0929
61862A342877P395L349j266n762r207j1122j1743j1511j0291p487l106J592N182
61849A288900P589R994J3117J6204J7953J7881J6579J5099J4245J3826J2418Q621
61837A452426K970k179n319p510j0608j4547j7641j9093j9757k0458k0912k0685
61825A296687k0043j9331j8507j7737j7588j8068j8337j7972j7681j8021j8106
61814A095296j6601j3520j0291q240p740q332q930q225n824k820n78Q32K300M225
$$ y = [707865, 707760, 709714, 714418, 720503, 725802, 729731, 734063, 741337, 752603, 766561, 780685, 793325, 805107, 818444, 835627, 857326, 882684, 910413, 939557, 969520, 999932, 1030588, 1061211, 1091208, 1119909, 1147156, 1173527, 1199817, 1226334, 1252554, 1277295, 1299229, 1317488, 1331948, 1342877, 1350272, 1353621, 1352355, 1346593, 1337386, 1326264, 1314521, 1303010, 1292719, 1285232, 1282126, 1283718, 1288900, 1296489, 1306483, 1319600, 1335804, 1353757, 1371638, 1388217, 1403316, 1417561, 1431387, 1443805, 1452426, 1455396, 1453217, 1447898, 1440388, 1429780, 1415233, 1397592, 1378499, 1358742, 1338284, 1317372, 1296687, 1276644, 1257313, 1238806, 1221069, 1203481, 1185413, 1167076, 1149104, 1131423, 1113402, 1095296, 1078695, 1065175, 1054884, 1046644, 1038904, 1030572, 1021642, 1013417, 1007593, 1004773, 1004195, 1005027, 1007327, 1011552]
61800A011552O429R088J2596J6418J9386K1414K3838K7657L2251L6292L9097M0716
61788A296734M1498M2098M3106M4226M4385M3066M0711L7487L2694K6082J8718
61777A710805J1721M986j803p775j1731j3712j4536j4213j2216q890n215j415
61765A636006K822O955R815J1237J1915J1643R443N670K085r36n346j2413k0341
61752A668555k6362l0083l3167l6552l9730m2268m4287m5334m4304m0948l6576
61741A248944l2850l0392k8677k6905k4926k3404k2732k1784j8846j4355j1370
61730I92703j1928j3997j3900j1149q703q505r206q894p908p513p501o860n825
61717H70814n486n821n610m287k642j545r49m48q2j52o04q85l78R76K444L174
$$ y = [1011552, 1017981, 1027069, 1039665, 1056083, 1075469, 1096883, 1120721, 1148378, 1180629, 1216921, 1256018, 1296734, 1338232, 1380330, 1423436, 1467662, 1512047, 1555113, 1595824, 1633311, 1666005, 1692087, 1710805, 1722526, 1727512, 1725709, 1717934, 1706203, 1692491, 1677955, 1663742, 1651526, 1642636, 1637421, 1636006, 1638828, 1645783, 1655598, 1666835, 1678750, 1690393, 1699836, 1705506, 1707591, 1706655, 1701309, 1688896, 1668555, 1642193, 1612110, 1578943, 1542391, 1502661, 1460393, 1416106, 1370772, 1326468, 1285520, 1248944, 1216094, 1185702, 1157025, 1130120, 1105194, 1081790, 1059058, 1037274, 1018428, 1004073, 992703, 980775, 966778, 952878, 941729, 933026, 924521, 915315, 906421, 898513, 891000, 883499, 876639, 870814, 865328, 859507, 853897, 849610, 846968, 845423, 844474, 844026, 843944, 843792, 843188, 842303, 841925, 842901, 845345, 848519]
61701H48519L109K963L124L180K825K542K784L014K380J052J9k67k94n34r03j305
61685H72208j932k755l331l480l640m147m555m217l263k562k601k900k723k132
61671H27970j955k576l181k516m04J966L315L468L109K842K867L220L717L846
61657H45688L224K183J451J254J137P01O4m42o86p65r35j584k836m129m581m020
61641H35724l238l058l521m238n142o346p581q230p979p089o084n350m944m486
61627G58438l378j574j16k55j837l114k684j211n62j410k572k829k483k455k595
61612G29363j970o32J54j69l53J025L370M519L377J187j5M01J449K088K316K722
61596G48832L403L697K915J126q59k106k165j235J8Q99J177J197J358J660J955
$$ y = [848519, 851628, 854591, 857715, 860895, 863720, 866262, 869046, 872060, 874440, 875492, 875511, 875244, 874950, 874416, 873513, 872208, 870276, 867521, 864190, 860710, 857070, 852923, 848368, 844151, 840888, 838326, 835725, 832825, 830102, 827970, 826015, 823439, 820258, 817742, 817338, 819304, 822619, 826087, 829196, 832038, 834905, 838125, 841842, 845688, 848912, 851095, 852546, 853800, 854937, 855638, 855702, 855260, 854574, 853809, 852874, 851290, 848454, 844325, 839744, 835724, 832486, 829428, 825907, 821669, 816527, 810181, 802600, 794370, 786391, 779302, 773218, 767868, 762924, 758438, 755060, 753486, 753370, 753115, 751278, 748164, 745480, 744269, 743707, 742297, 739725, 736896, 734413, 731958, 729363, 727393, 726761, 726915, 726746, 726393, 727418, 730788, 735307, 738684, 739871, 739856, 740257, 741706, 743794, 746110, 748832, 752235, 755932, 758847, 759973, 759114, 757008, 754843, 753608, 753626, 754525, 755702, 756899, 758257, 759917, 761872]
61581G61872K390L116L642L228K069J288J374J326M5k009l432l757l747m000m260
61566G59145m284m370m643m689m274l769l412k955k524l021m725o148n462k988
61552G01881j062j310l008m446m994n280o019p350q942j0070r890q387o771o259
61538F18093o575o431n464m729m985n428m915l759l374m367n888o854p092p032
61524E41200o853o276m919k770n75M07m79k359l650l822l705l892l728k377k51
61509D95951J320J510N60o85j334r55p6K14l60p74k12N45K04j006j540o44Q44
61492D93562J890K272J975P20j284k919l150j939P4K162L439L101J467J62N14
61477E02046K116L502L759K941J422k19j102o76N07J314J179K16j377l178m130
$$ y = [761872, 764262, 767378, 771020, 774248, 776317, 777605, 778979, 780305, 780350, 778341, 774909, 771152, 767405, 763405, 759145, 754861, 750491, 745848, 741159, 736885, 733116, 729704, 726749, 724225, 721204, 716479, 710331, 704869, 701881, 700819, 699509, 696501, 692055, 687061, 681781, 675762, 668412, 659470, 649400, 639510, 631123, 624352, 618093, 611518, 605087, 599623, 594894, 589909, 584481, 579566, 575807, 572433, 568066, 562178, 555324, 548232, 541200, 534347, 528071, 523152, 520382, 519807, 520214, 519735, 517376, 513726, 509904, 506199, 502307, 498579, 496202, 495951, 497271, 498781, 499341, 498656, 497322, 496367, 496291, 496505, 496145, 495371, 495159, 495704, 495908, 494902, 493362, 492718, 493562, 495452, 497724, 499699, 500419, 499135, 496216, 493066, 491127, 491201, 493363, 496802, 499903, 501370, 501532, 502046, 504162, 507664, 511423, 514364, 515786, 515567, 514465, 513789, 514296, 515610, 516789, 517005, 515628, 512450, 508320]
61462E08320l374j663q75j734k918k968k178j794j965j676o15J15l83j241p99
61447D84252J118K688K207J28j499j474o64o09j529k212j701m26M65M54J0j97
61431D81011o1Q1N4J27N99J280J565J097K44j94K11J033J381Q21l0MJ423L314
61413D93960M077L002R96l93m32L75J182J618J719J368M12o74q70J07R78K38j685
61396E05978k615j503kj49j276q88J626L877L633J521k97r12q71n38K47J212J731
61379E10774J904K430L331L814L571L327L762M611N144M909L870K469J637K001
61365E57554K840K719J467N47R83J979K444K868M286N999N932L448M36q87k83
61350E92332R29J682J794J425Q42M75M21nj617m053n753n454l420j157j64q70
$$ y = [508320, 504946, 503283, 502408, 500674, 497756, 494788, 492610, 490816, 488851, 487175, 486560, 486675, 486292, 485051, 484252, 485370, 488058, 490265, 490393, 488894, 487420, 486756, 486147, 484618, 482406, 480705, 480279, 480744, 481198, 481208, 481011, 480950, 481031, 481085, 481212, 481811, 483091, 484656, 485753, 485997, 485803, 486014, 487047, 488428, 489249, 489219, 489223, 490646, 493960, 498037, 501039, 502035, 501642, 501210, 501585, 502767, 504385, 506104, 507472, 507884, 507210, 506340, 506447, 507425, 507663, 505978, 503363, 501860, 501858, 501709, 500433, 499545, 501171, 505048, 508681, 510202, 509905, 508993, 508122, 507584, 507831, 509043, 510774, 512678, 515108, 518439, 522253, 525824, 529151, 532913, 537524, 542668, 547577, 551447, 553916, 555553, 557554, 560394, 563113, 564580, 565127, 566110, 568089, 570533, 573401, 577687, 583686, 589618, 593066, 593502, 592615, 592332, 593261, 594943, 596737, 598162, 599004, 599479, 599900, 599895, 598278, 594225, 588472, 583018, 579598, 578441, 578277, 577407]
61334E77407k353k940j672O08K012J706Q20Q86J952K771K593J969J823K317K767
61319E92666K330Q13q51j102P10L366M901M676L754L365L833M878N987O286N145
61304F40757L353K642L412L995K992J323Q68J853K880L020K596K188K181L125
61290F77185N269P676Q977R087R152R723J0122R783R067Q453P863P196O629O166
61276G92348N683N484N902O363O026N366N595O340N631K871M5j023j022j474k294
61261H41841k556k433k611k763k301j750j572n19K696O705Q730Q299P475P419
61247H66660P219O594P196J0028J3439J5102J4690J3389J1904J0134P815M668
61235I88838P04k924m495l973l403m155n091m720l804m067n308n739m797l714
$$ y = [577407, 575054, 572114, 570442, 571050, 573062, 574768, 575588, 576474, 578426, 581197, 583790, 585759, 587582, 589899, 592666, 594996, 595809, 594958, 593856, 594566, 597932, 602833, 607509, 611263, 614628, 618461, 623339, 629326, 635612, 640757, 644110, 646752, 650164, 654159, 657151, 658474, 659342, 661195, 664075, 667095, 669691, 671879, 674060, 677185, 682454, 690130, 699107, 708194, 717346, 727069, 737191, 746974, 756041, 764494, 772357, 779553, 786182, 792348, 798031, 803515, 809417, 815780, 821806, 827172, 832767, 839107, 844738, 847609, 847654, 846631, 845609, 844135, 841841, 839285, 836852, 834241, 831478, 829177, 827427, 825855, 825336, 828032, 834737, 843467, 851766, 859241, 866660, 873879, 880473, 887669, 897697, 911136, 926238, 940928, 954317, 966221, 976355, 984170, 988838, 989542, 986618, 982123, 978150, 974747, 970592, 965501, 960781, 956977, 952910, 947602, 941863, 937066, 933352]
61221I33352l396l375l116k850k757k345j105Q66L031M546M456K660N85m7Q74
61206I31379K117L043M138N569O595O842O983P513P853P407O818P312R038J0647
61192A023254J0445P886M276J917K075L698M658M107K888J842P74o83k344l997
61178A060796n698p053p179n949m430l532l071k780l136m218m718l366q00J241
61164A006107K350L727N981P873P738N590L343L099N195P870Q960Q050O600N941
61150A088424N945O052O622Q127R613R302O933M496M186O107Q325R008Q277P886
61136A189303Q929J0417J0670R908J0073J1901J3686J3751J2643J1572J0173P644
61124A320670M995L869L666K255n08k386k276j713k101k701k634k886m544o571
$$ y = [933352, 929956, 926581, 923465, 920615, 917858, 915513, 914408, 915274, 918305, 922851, 927307, 929967, 930552, 930505, 931379, 933496, 936539, 940677, 946246, 952841, 959683, 966666, 974179, 982032, 989439, 996257, 1003569, 1012607, 1023254, 1033699, 1041585, 1045861, 1047778, 1049853, 1053551, 1058209, 1062316, 1065204, 1067046, 1067820, 1067137, 1064793, 1060796, 1055098, 1048045, 1040866, 1034917, 1030487, 1026955, 1023884, 1021104, 1017968, 1013750, 1009032, 1005666, 1004866, 1006107, 1008457, 1012184, 1018165, 1026038, 1033776, 1039366, 1042709, 1045808, 1051003, 1058873, 1067833, 1075883, 1082483, 1088424, 1094369, 1100421, 1107043, 1115170, 1124783, 1134085, 1141018, 1145514, 1149700, 1155807, 1164132, 1173140, 1181417, 1189303, 1198232, 1208649, 1219319, 1229227, 1239300, 1251201, 1264887, 1278638, 1291281, 1302853, 1313026, 1320670, 1325665, 1329534, 1333200, 1335455, 1334947, 1332561, 1330285, 1328572, 1326471, 1323770, 1321136, 1318250, 1313706, 1307135]
61110A307135p199o633o504p206p597p186p015q157j0394j2691j4169j4538j4236
61097A183610j4194j4847j5525j5290j4186j2981j1933j0606q887p291o166n283
61085A046421m486m159m721o096p842r464j0345r886q166o284n517n915o047m510
61071I52983j575J004J897J474R75J087J936L804O768R753J1305J1614J2711J6021
61057A031757K0550K4143K5867K6400K6677K7086K7704K8487K9129K9229K8629
61046A325658K7491K6260K5596K5875K6422K5822K3318J9487J5247J0818O201
61035A558195K019r76k905m716p169j0273j3421j5774j6913j7468j8624k0627
61023A431348k2319k2657k2113k1872k2101k1852k0474j8372j6395j5023j4125
$$ y = [1307135, 1299936, 1293303, 1286799, 1279593, 1271996, 1264810, 1257795, 1249638, 1239244, 1226553, 1212384, 1197846, 1183610, 1169416, 1154569, 1139044, 1123754, 1109568, 1096587, 1084654, 1074048, 1065161, 1057870, 1051704, 1046421, 1041935, 1037776, 1033055, 1026959, 1019117, 1009653, 999308, 989422, 981256, 974972, 969455, 963540, 957493, 952983, 951408, 952412, 954309, 955783, 956758, 957845, 959781, 963585, 970353, 980106, 991411, 1003025, 1015736, 1031757, 1052307, 1076450, 1102317, 1128717, 1155394, 1182480, 1210184, 1238671, 1267800, 1297029, 1325658, 1353149, 1379409, 1405005, 1430880, 1457302, 1483124, 1506442, 1525929, 1541176, 1551994, 1558195, 1560214, 1559238, 1556333, 1551617, 1544448, 1534175, 1520754, 1504980, 1488067, 1470599, 1451975, 1431348, 1409029, 1386372, 1364259, 1342387, 1320286, 1298434, 1277960, 1259588, 1243193, 1228170, 1214045]
61012A214045j3162j1544q997n692k221L42R41q2l96K288P410J1984J4043J4493
60998A223452J5282J7204K0114K3759K7438L0157L2172L5098L9466M3479M5456
60987A553077M6306M8217N2049N7333O3579P0063P5549P9867Q4721R1243R8036
60976B320040J03455J08527J15410J24015J32443J39810J46319J51580J55549
60967C497148J60515J69448J82665J98431K15915K34919K53953K71995K91689
60958E476678L17260L49903L88944M36746M97744N72635O58298P53530Q59566
60949A0311304R75096J097898J232536J388167J566334J761066J973375K204278
60941B2510054K410373K477173K278253J791393J150377N61370J62629l1405o9437
$$ y = [1214045, 1200883, 1189339, 1180342, 1174650, 1172429, 1172771, 1173712, 1173630, 1173234, 1175522, 1182932, 1194916, 1208959, 1223452, 1238734, 1255938, 1276052, 1299811, 1327249, 1357406, 1389578, 1424676, 1464142, 1507621, 1553077, 1599383, 1647600, 1699649, 1756982, 1820561, 1890624, 1966173, 2046040, 2130761, 2222004, 2320040, 2423495, 2532022, 2647432, 2771447, 2903890, 3043700, 3190019, 3341599, 3497148, 3657663, 3827111, 4009776, 4208207, 4424122, 4659041, 4912994, 5184989, 5476678, 5793938, 6143841, 6532785, 6969531, 7467275, 8039910, 8698208, 9451738, 10311304, 11286400, 12384298, 13616834, 15005001, 16571335, 18332401, 20305776, 22510054, 24920427, 27397600, 29675853, 31467246, 32617623, 33178993, 33341622, 33310217, 33240780]
60932C3240780P368J50771K49798J50328k31802q22806j435010j901275k164549
60923B7243603k258000k236547k141814k006348j856280j702364j541902j374593
60915A2125755j209559j055997r16141p90545o82920n95368n24064m63789m13050
60906E474322l71504l36162l03770k74393k49357k27641k07147j87692j70212
60897C146444j54465j39863j27194j17324j09337j01821r4871q9127q3986p8461
60887B049995p2819o7746o2823n7392n1955m7382m3521l9904l6933l4992l3305
60876A501223l0955k8390k6804k6587k7274k8182k8400k7221k5288k4036k3314
60865A204772k1306j7800j5482j6174j7830j7527j5753j4877j4679j2818r438
$$ y = [33240780, 33248148, 33398919, 33648717, 33799045, 33567243, 32744437, 31309427, 29408152, 27243603, 24985603, 22749056, 20607242, 18600894, 16744614, 15042250, 13500348, 12125755, 10916196, 9860199, 8944058, 8153513, 7470593, 6875225, 6351161, 5887372, 5474322, 5102818, 4766656, 4462886, 4188493, 3939136, 3711495, 3504348, 3316656, 3146444, 2991979, 2852116, 2724922, 2607598, 2498261, 2396440, 2301569, 2212442, 2128456, 2049995, 1977176, 1909430, 1846607, 1789215, 1737260, 1689878, 1646357, 1606453, 1569520, 1534528, 1501223, 1470268, 1441878, 1415074, 1388487, 1361213, 1333031, 1304631, 1277410, 1252122, 1228086, 1204772, 1183466, 1165666, 1150184, 1134010, 1116180, 1098653, 1082900, 1068023, 1053344, 1040526, 1031088]
60854A031088p791r519j2129j2533j0921r567r398r373q447o710m947l955m018
60841I21780m440m032k505r89o10j053j167o60l95r50j618j277J05J374J658J352
60825I06573J339J658J621J069O79R85J824K955M388N793O519O701P451R175J0595
60810I69325J0594J0334J1956J5364J7934J7879J6560J6485J7880J8634J7428
60799A140373J5626J5529J7568K0089K1561K1897K1694K1273K1029K1682K3242
60788A361563K4418K4165K3281K3260K3887K3454K1370J9060J7895J7563J6914
60777A596830J5218J2111P614K797q25l344o598j1326j5634j7580j8125j9828
60765A541310k3341k7027k9697l1859l4061l5611l5666l4567l3222l1771k9640
$$ y = [1031088, 1023297, 1013778, 1001649, 989116, 978195, 968628, 959230, 949857, 941410, 934700, 929753, 925798, 921780, 917340, 913308, 910803, 909814, 909204, 908151, 906984, 906324, 905929, 904979, 903361, 902084, 902189, 903563, 905221, 906573, 907912, 909570, 911191, 912260, 912939, 913924, 915748, 918703, 923091, 928884, 935403, 942104, 949555, 958730, 969325, 979919, 990253, 1002209, 1017573, 1035507, 1053386, 1069946, 1086431, 1104311, 1122945, 1140373, 1155999, 1171528, 1189096, 1209185, 1230746, 1252643, 1274337, 1295610, 1316639, 1338321, 1361563, 1385981, 1410146, 1433427, 1456687, 1480574, 1504028, 1525398, 1544458, 1562353, 1579916, 1596830, 1612048, 1624159, 1631773, 1634570, 1633745, 1630401, 1623803, 1612477, 1596843, 1579263, 1561138, 1541310, 1517969, 1490942, 1461245, 1429386, 1395325, 1359714, 1324048, 1289481, 1256259, 1224488, 1194848]
60754A194848k6821k4435k3567k3839k3718k2529k1274k0674j9385j5812j1270
60743I61524r052r878j0620q771n972n222o326o617n282m208m685n747o195o238
60729H66711o401o368n734m830m086l470l001l008l387l397k721k066k341l635
60715H12266n261o373o458n743n143n328n838n768n182n148o200p558q095p596
60701G26575o691o013n715n700o049o929p923p860o122m036l753n416o616n390
60687F42362k465L40K536M379N188M249K605K009K408K307J231o9j480l381m762
60672F57457l820r49J200J214M20J36l17j557k308j461m58j493m177n927n356
60657F32604l755l159m127n624o462o517o675p407p803o703m616l227l021k847
$$ y = [1194848, 1168027, 1143592, 1120025, 1096186, 1072468, 1049939, 1028665, 1007991, 988606, 972794, 961524, 952472, 942594, 931974, 923203, 917231, 912009, 905683, 899066, 893784, 889576, 884891, 879144, 872949, 866711, 860310, 853942, 848208, 843378, 839292, 835822, 832821, 829813, 826426, 823029, 820308, 818242, 815901, 812266, 807005, 800632, 794174, 788431, 783288, 777960, 772122, 766354, 761172, 756024, 749824, 742266, 734171, 726575, 719884, 713871, 708156, 702456, 696407, 689478, 681555, 673695, 667573, 663537, 659784, 654368, 647752, 642362, 639897, 640237, 642773, 647152, 652340, 656589, 659194, 661203, 663611, 665918, 667149, 667080, 665600, 662219, 657457, 653637, 652688, 653888, 655102, 655522, 655658, 655341, 653784, 651476, 650015, 649557, 648064, 643887, 637960, 632604, 628849, 625690, 621563, 615939, 609477, 602960, 596285, 588878, 581075, 574372, 569756, 566529, 563508, 560661]
60643E60661k220k259l486m412l710k371j987k083j114O56J343L64p73p86j38
60628E37685J94J37J52M46J024J829K480K549K364K892M425O039O624O046N032
60613E79918M284M043M058L811K988J951J444J649J973J981K167L278M985N939
60599F24469N424M399M284M980N020L817K788L458N260O288N811M861M404M227
60585F89490L808L061J774o22l976o868p940p327o267n744n945o548p036p036
60571F32824o650o195n656m927m455m699m955l935j807l81o76j615j818j439j229
60556E82387j039m62O5J98P65K438L998L663J805O22J109J911J451o1j235j214
60540E96401k52Q27J408J567J717J744J037k23p37J47J170Q22n30j436j620j757
$$ y = [560661, 558441, 556182, 552696, 548284, 544574, 542203, 540216, 538133, 537019, 537675, 539018, 539382, 538609, 537823, 537685, 537879, 538016, 538168, 538614, 539638, 541467, 543947, 546496, 548860, 551752, 556177, 562216, 568840, 574886, 579918, 584202, 588245, 592303, 596114, 599102, 601053, 602497, 604146, 606119, 608100, 610267, 613545, 618530, 624469, 629893, 634292, 638576, 643556, 648576, 652393, 655181, 658639, 663899, 670187, 675998, 680859, 685263, 689490, 693298, 696359, 698133, 697511, 693535, 686667, 678727, 671400, 665133, 659389, 653444, 646896, 639860, 632824, 626174, 619979, 614323, 609396, 604941, 600242, 595287, 591352, 589545, 589164, 588488, 586873, 585055, 583616, 582387, 581348, 580886, 580951, 581149, 581914, 584352, 588350, 592013, 593818, 594440, 595549, 597460, 598911, 598850, 597615, 596401, 596149, 596976, 598384, 599951, 601668, 603412, 604449, 604226, 603489, 603636, 604806, 605628, 605098, 603662, 602042, 600285]
60524F00285j534J37K879M750M902M650N260O121O072N398N426O868R332J1939
60510F72485J3768J4388J4427J5023J6183J6396J4500J1266Q411O584N031K992
60498H11454O13j403k568k892k701k154j036Q81L389O126R043J2092J4633J6003
60484H61480J6702J8139K0935K4135K6365K7002K6086K3895K1052J8194J4967
60473A098952J0080L088m338r652j1661j1054r238p310n959n556n947o409o076
60460A028920m687l024k338k937l571k787o30J745L946O701J0256J3606J5971
60447A061171J8023K0921K4865K9379L4354L9886M5491N0350N4145N7058N9159
60436A494802O0410O0989O0984N9843N6744N1333M3720L3921K1842P793p359k2488
$$ y = [600285, 598751, 598888, 601767, 606517, 611419, 616069, 621329, 627450, 633522, 638920, 644346, 651214, 660546, 672485, 686253, 700641, 715068, 730091, 746274, 762670, 777170, 788436, 796847, 803431, 808462, 811454, 812067, 810664, 808096, 805204, 802503, 800349, 799313, 800194, 803583, 809709, 818752, 830844, 845477, 861480, 878182, 896321, 917256, 941391, 967756, 994758, 1020844, 1044739, 1065791, 1083985, 1098952, 1109032, 1112120, 1107782, 1098130, 1086469, 1075415, 1066177, 1058867, 1052908, 1047352, 1041405, 1034996, 1028920, 1024233, 1021209, 1018871, 1015934, 1012363, 1009576, 1008946, 1010691, 1014637, 1021338, 1031594, 1045200, 1061171, 1079194, 1100115, 1124980, 1154359, 1188713, 1228599, 1274090, 1324440, 1378585, 1435643, 1494802, 1555212, 1616201, 1677185, 1737028, 1793772, 1845105, 1888825, 1922746, 1944588, 1952381, 1945022, 1922534]
60424A922534l6532m8703n8686o6448p1719p4011p3360p0641o6981o3141n9443
60413A232869n5646n0876m4563l7848l2993l0782k9396k6775k3265k0812k0224
60402H59689k0431k0095j8703j6319j3407j0953r667r054q135o917o201o082n910
60389G07815n751o472q040r080q701p582o472m822k047O62J245n84k709k833q10
60374F43819J459K022O35j279k310k501k832l578l920l349k475k008j721j185
60360F20777p90r79j013J87K135K974J871N3q76n85N11K281M285N066L513P39
60344F40149p90j77J067J392J306K176L928N108M931M148L837M181M754N204N288
60329F86502M726L609K637K419K680K533J595N84O73K283M558O092O236N505M646
$$ y = [1922534, 1886002, 1837299, 1778613, 1712165, 1640446, 1566435, 1493075, 1422434, 1355453, 1292312, 1232869, 1177223, 1126347, 1081784, 1043936, 1010943, 980161, 950765, 923990, 900725, 879913, 859689, 839258, 819163, 800460, 784141, 770734, 759781, 750114, 741060, 732925, 726008, 719807, 713725, 707815, 702064, 695592, 687552, 678472, 669771, 662189, 655717, 650895, 648848, 649510, 650755, 650171, 647462, 644629, 643819, 645278, 647300, 647935, 646656, 644346, 641845, 639013, 635435, 631515, 628166, 625691, 623683, 621962, 620777, 619987, 619008, 617995, 618182, 620317, 623291, 625162, 625215, 624339, 623754, 624265, 626546, 630831, 635897, 639410, 640149, 639359, 639182, 640249, 641641, 642947, 645123, 649051, 654159, 659090, 663238, 667075, 671256, 676010, 681214, 686502, 691228, 694837, 697474, 699893, 702573, 705106, 706701, 707285, 707958, 710241, 714799, 720891, 727127, 732632, 737278]
60314G37278L688K450J597K238M231N736N134K883R42O75J868L515M725M965M146
60299G86071K854K078K411L514M520M922N125O078Q163J0389J1131R859P772O415
60285H71302O051N875N344M567L539J846o77l508n813p003p019o452o248o741
60271H55063p063o130m213k867l159m627o129o975o869n646l658j916j116q23
60257G93872j75R73K145L112L935M412M425M774O654J0048J3630J6693K0118K4422
60243I09038K7671K7027K2396J7005J3536J0941O232j352r512j5874k0171k3175
60231I63762k4950k5085k3705k1363j8544j5917j4308j3615j2508j0103p300n388
60219G70976m080k399q78j110l077m758m840m272m371m760m207k588r85m63j339
$$ y = [737278, 740966, 743416, 745013, 747251, 751482, 757218, 762352, 765235, 766177, 766852, 768720, 772235, 776960, 781925, 786071, 788925, 791003, 793414, 796928, 801448, 806370, 811495, 817573, 825736, 836125, 847256, 857115, 864887, 871302, 877353, 883228, 888572, 893139, 896678, 898524, 897847, 894339, 888526, 881523, 874504, 868052, 861804, 855063, 848000, 841870, 837657, 834790, 831631, 827004, 820875, 813900, 807031, 801385, 797727, 795811, 794695, 793872, 793697, 794670, 796815, 799927, 803862, 808274, 812699, 817473, 824127, 834175, 847805, 864498, 884616, 909038, 936709, 963736, 986132, 1003137, 1016673, 1027614, 1033846, 1032494, 1022982, 1007108, 986937, 963762, 938812, 913727, 890022, 868659, 850115, 834198, 819890, 806275, 793767, 783664, 776364, 770976, 766896, 764497, 763619, 762509, 759432, 754674, 749834, 745562, 741191, 736431, 732224, 729636, 728651, 728188, 726849]
60204G26849l051m169l393j234J57m92k019k583k059j572j533j461j273j394j696
60189F99077j548q87k29L04J020J782K072J916J882K127K312K404K650K842K541
60174G20265K111K408L310L626K757J597J298J944K741K856J825p5j569j288O60
60159G44466K698L557L507L561M247N391O389O516N728N222O251Q271R420Q943
60145H24167P863O905N566L941L592N229P033P081O131O206P370Q042P835P753
60131I14714P811O785M687L221L124K969J494n71k051l178m535n459n068m067
60117I19876l968m875n375m588l145k125j941k376k939l050k523j944k062k818
60103H76147l468l636l600l546l280k856k715k746j942K58K714L604K643J517
$$ y = [726849, 723798, 719629, 716236, 715002, 715159, 714667, 712648, 710065, 708006, 706434, 704901, 703440, 702167, 700773, 699077, 697529, 696642, 696413, 696717, 697737, 699519, 701591, 703507, 705389, 707516, 709828, 712232, 714882, 717724, 720265, 722376, 724784, 728094, 731720, 734477, 736074, 737372, 739316, 742057, 744913, 746738, 746663, 745094, 743806, 744466, 747164, 750721, 754228, 757789, 762036, 767427, 773816, 780332, 786060, 791282, 797533, 805804, 815224, 824167, 832030, 838935, 844501, 848442, 852034, 857263, 864296, 871377, 877508, 883714, 891084, 899126, 906961, 914714, 922525, 929310, 933997, 937218, 940342, 943311, 944805, 944234, 942183, 939005, 934470, 929011, 923943, 919876, 915908, 911033, 905658, 901070, 897925, 895800, 893859, 891483, 888544, 885494, 882971, 881027, 878965, 876147, 872679, 869043, 865443, 861897, 858617, 855761, 853046, 850300, 848358, 848616, 851330, 854934, 857577, 859094]
60089H59094J883L718N908P631Q408P534M762J492j3R47K781L737L752L567L133
60074I18334K138J367J976L493M019K653O23l69R5J371K723L489L212K305J965
60059I49394K752L815M137L962M263N215O048O239O087O037N950N246L666J866
60045A014677J074J734K600K006P0j342j287j198k700m882n274l122k83J250J343
60030A004666R46N40P5l60n99p97j162j508j575j510j589j672j446j170j603l001
60014I88235m634n693o381p500q979r632q767p450p319q604j0134j1110j1639
60001H80393j1532j0064p548n830o083p096p054o210o209p210p420n748l315j775
59987G87299j336j140o65N3R96K128L148L782M125M294M137L514K556J396J03
$$ y = [859094, 860977, 864695, 870603, 878234, 886642, 894176, 898938, 900430, 900417, 901364, 904145, 907882, 911634, 915201, 918334, 920472, 921839, 923815, 927308, 931327, 933980, 934603, 934234, 934329, 935700, 938423, 941912, 945124, 947429, 949394, 952146, 955961, 960098, 964060, 968323, 973538, 979586, 985825, 991912, 997949, 1003899, 1009145, 1012811, 1014677, 1015751, 1017485, 1020085, 1022091, 1022161, 1020819, 1019532, 1018334, 1015634, 1010752, 1005478, 1002356, 1002073, 1003323, 1004666, 1005612, 1006152, 1006227, 1005867, 1005268, 1004471, 1003309, 1001801, 1000226, 998716, 997127, 995455, 994009, 992839, 991236, 988235, 983601, 977908, 971527, 964027, 955048, 945416, 936649, 929199, 921880, 913276, 903142, 892032, 880393, 868861, 858797, 851249, 845419, 839336, 832240, 825186, 818976, 812767, 805557, 798137, 792389, 789074, 787299, 785963, 784823, 784158, 784211, 785207, 787335, 790483, 794265, 798390, 802684, 806821, 810335, 812891, 814287, 814390]
59972H14390r09r86j07Q43J151J033Q49J90j450l495m718m792m648n185o272p225
59956G78669p604p291o339n055l928l071k147j157q05j494k305j902m35L87n24
59941G34999k255l344l727m308n091n075l894k251n94J301L024L212J503l25l38
59926G12837J186K532K962L104L403L726M163M873N065L645J098o09m77L36K61
59911G48105o92j309p22Q34K269K364R72l90m9J627K631K063J113Q67P64J69k9
59894G60587J165K856L281K274J271J253J957K867L735M156L770K924K310J966
59880G96372J495R21M21m62k154l783l931k690j687j724j798r25K56O54M03L53
59864G81721N43M28L02J215L166M470L708J755J024K605N089O557O968P564Q491
$$ y = [814390, 813481, 812495, 812388, 813231, 814382, 815415, 816264, 816454, 815004, 811509, 806791, 801999, 797351, 792166, 785894, 778669, 771065, 763774, 757435, 752380, 748452, 745381, 743234, 742077, 741272, 739778, 737473, 735571, 735136, 735523, 734999, 732744, 729400, 725673, 721365, 716274, 711199, 707305, 705054, 704460, 705761, 708785, 711997, 713500, 713175, 712837, 714023, 716555, 719517, 722621, 726024, 729750, 733913, 738786, 743851, 747496, 748594, 747985, 747508, 747844, 748105, 747413, 746104, 745382, 746216, 748485, 750849, 751821, 751431, 751382, 753009, 755640, 757703, 758816, 759683, 760447, 760616, 760587, 761752, 764608, 767889, 770163, 771434, 772687, 774644, 777511, 781246, 785402, 789172, 792096, 794406, 796372, 797867, 798788, 799209, 798747, 796593, 792810, 788879, 786189, 784502, 782778, 780980, 780055, 780311, 780965, 781368, 781721, 782264, 782692, 782994, 784209, 787375, 791845, 795553, 797308, 798332, 800937, 806026, 812583, 819551, 827115, 835606]
59849H35606Q455P047N724N717O124N455M109L607L917L338J278o32q07J57N18
59834H89613l74j695k376j977p62M51Q40M35K14J066K904M916O224O195M770K827
59818I13271J688J792K243K018J182N65P13J470K175J996M96j703l282l601l265
59803I17758k999k573j452N0J032J314J769L235N469P339Q011P878Q048Q710Q466
59788I72055O140K868J129J556K122J087o71j365j069j376l051n614q654j1959
59774I53198j4533j5089j3649j1429r159o922n519o128q057q701o731l900k537
59761H40844k522k307j786k174l381l582j826M67J422R41J26o36j641k320j330
59746H20295J243K934J472k084m187l047p82m51k076l114k362j436k018l416l982
$$ y = [835606, 844061, 851108, 856832, 862549, 868673, 874128, 878237, 881844, 885761, 889099, 890377, 889745, 888938, 889095, 889613, 889239, 887544, 885168, 883191, 882429, 882880, 883720, 884155, 884369, 885435, 888339, 893255, 899479, 905674, 910444, 913271, 914959, 916751, 918994, 921012, 922194, 922759, 923472, 924942, 927117, 929113, 929609, 927906, 924624, 921023, 917758, 914759, 912186, 910734, 910784, 911816, 913130, 914899, 918134, 923603, 930942, 938953, 946831, 954879, 963589, 972055, 978195, 981063, 982192, 983748, 985870, 986957, 986286, 984921, 983852, 982476, 979425, 973811, 965157, 953198, 938665, 923576, 909927, 898498, 889339, 882417, 876898, 870770, 862713, 854012, 847281, 843381, 840844, 838322, 836015, 834229, 832055, 828674, 825092, 823266, 823733, 825155, 826096, 826222, 825586, 823945, 821625, 820295, 821538, 824472, 825944, 823860, 819673, 816626, 815844, 815393, 813317, 810203, 807841, 806405, 804387, 800971, 796989]
59731G96989l798m417o309p934p545n110k242o83r18j983k627k673k850l259k953
59716G41688j597n12r09j853j518j05L76o25j053P37L449M572L657K345J846J732
59700G52230J209L82M7Q90K806M611M853L604K892M235O259O265M065K549L884
59685H00781O758Q296P475N479L630K491K416L464M720M954M101L257L140L384
59671H64346L370K825J638J49l64J191L812N015L943K419K029J787K08j731j876
59656H88761m04L53m43j025l0J571K510L157M106M564L742K584K296K312J572
59641I15626Q78J821L903N070M911M938N573N422M164L603M537M985L273R23K41
59626I69868O38k8j498j386P61K551K302J047R9j041k890m063l122j286j304l939
$$ y = [796989, 793191, 788774, 782465, 774531, 766986, 761876, 759634, 758951, 758033, 756050, 753423, 750750, 747900, 744641, 741688, 740091, 739579, 738670, 736817, 735299, 735194, 735570, 734945, 733892, 734629, 738078, 742650, 746307, 748652, 750498, 752230, 753439, 753821, 753868, 754758, 757564, 762175, 767028, 770632, 773524, 777759, 784018, 790283, 794348, 796897, 800781, 807539, 815835, 823310, 828789, 832419, 834910, 837326, 840790, 845510, 850464, 854565, 857822, 860962, 864346, 867716, 870541, 872179, 872328, 871964, 873155, 876967, 881982, 885925, 888344, 890373, 892160, 892368, 890637, 888761, 888357, 888710, 888267, 887242, 887212, 888783, 891293, 894450, 898556, 903120, 906862, 909446, 911742, 914054, 915626, 916504, 918325, 922228, 927298, 932209, 937147, 942720, 948142, 952306, 955909, 960446, 965431, 968704, 969627, 969868, 970506, 970478, 968980, 967594, 968355, 970906, 973208, 974255, 974354, 973313, 970423, 966360, 963238, 961952, 960648, 956709]
59610I56709p233r191r688r483q779p437n752m277l217k470j986j644j114k99
59596H84139L23K83r6q0M05P27Q51J745L862N760N395K709j21j266j203j558k905
59579H98970m416n151m933m276m024m642n384m805k807j379k256m464n517m677
59565H40239l445k991k824k413k346l107m009m246l995l714l352l201m235o486
59551G89875p940o601l160k94M07l95j398k113k484k292j423k07Q09J116M48q19
59535G63529j660j420o22k14l47n67q13j225j323m92P00R04j58j343j824j952
59519G51173k030j552m93j47j494l466m151l354k673l119l850l562k116l08J135
59504G19993J790J334Mj146j129j81O62J069J769L212M644N139M914M849N097
$$ y = [956709, 949476, 940285, 930597, 921114, 912335, 904898, 899146, 894869, 891652, 889182, 887196, 885552, 884438, 884139, 884462, 884745, 884649, 884569, 884974, 885701, 886552, 888297, 892159, 897919, 903314, 906023, 905902, 904636, 903433, 901875, 898970, 894554, 889403, 884470, 880194, 876170, 871528, 866144, 861339, 858532, 857153, 854897, 850433, 844916, 840239, 836794, 833803, 830979, 828566, 826220, 823113, 819104, 814858, 810863, 807149, 803797, 800596, 796361, 789875, 781935, 775334, 772174, 771880, 772287, 771892, 770494, 768381, 765897, 763605, 762182, 761975, 762784, 763900, 764348, 763529, 761869, 760449, 759827, 759613, 759266, 758699, 757886, 756661, 755338, 754846, 755546, 756450, 756292, 754949, 753125, 751173, 749143, 747591, 747098, 746951, 745457, 741991, 737840, 734486, 731813, 728694, 724844, 721282, 719166, 718858, 719993, 721783, 723117, 723121, 721975, 720846, 720665, 721327, 722396, 724165, 727377, 732021, 737160, 742074, 746923, 752020]
59489G52020N041M610M647N760P541R193J0264J0615J0390J0372J1527J3821J6272
59476H72073J8480K0794K2168J9485J1017j2p566q903o875n737o335o557n144
59463I16888l291k655l208l535k641r22N26J094R36J90j377l596n343n651n188
59448H82227n591p189q401p892o451n972o988q120p798n955l912l036l540m441
59434G96941m617l916l029k400j683n15P02J256J170J268K133L426M361M663M782
59419H04542N199N824O283O619P209P962Q142P329O088N173M465L331J817O95
59405H80678L29K49j0k43Q3J243L112N137O409O338N413M807N198O440Q272J0467
59389I43922J2247J2562J1456J0288R961R630P974N250L084K303J774k00l767
$$ y = [752020, 757061, 761671, 766318, 772078, 779619, 788812, 799076, 809691, 820081, 830453, 841980, 855801, 872073, 890553, 911347, 933515, 953000, 964017, 964005, 956439, 947536, 940661, 934924, 928589, 922032, 916888, 913597, 910942, 907734, 904199, 901558, 900636, 901162, 902256, 903192, 903382, 902005, 898409, 893066, 887415, 882227, 876636, 869447, 861046, 853154, 846703, 840731, 833743, 825623, 817825, 811870, 807958, 804922, 801382, 796941, 792324, 788408, 785379, 782979, 781296, 780781, 781483, 782739, 783909, 785177, 787310, 790736, 795097, 799760, 804542, 809741, 815565, 821848, 828467, 835676, 843638, 851780, 859109, 865197, 870370, 874835, 878166, 879983, 880678, 881007, 881256, 881246, 881003, 881086, 882329, 885441, 890578, 896987, 903325, 908738, 913545, 918743, 925183, 933455, 943922, 956169, 968731, 980187, 990475, 1000436, 1010066, 1018040, 1023290, 1026374, 1028677, 1030451, 1030251, 1026484]
59376A026484p267r035r118q763q493p554n670m318n029o900p270m924j384J307
59362I42066K748L770N092P132J0130J3543J6163J7501J8451K0158K3232K8179
59350A108165L4715L9601L7395K5843R657l426j0022j2514j3859j3917j1479p094
59338A183065k298K060M946L995k582j3284k4030l1539l5077l5360l3253k9751
59326I86892k6003k2693j9788j7112j4670j2380j0047p828o076m604k777o53P13
59313H42974Q16Q30K170M248N015L851K590L058M756N982O272O382O531O316O133
59298I07924O960Q532R370R162R434J1123J3043J3953J4641J6333J8266J8779
59286A057520J8169J8413K0100K1544K1213J9529J7831J6891J6818J7210J6939
$$ y = [1026484, 1019217, 1010182, 1001064, 992301, 983808, 976254, 970584, 966266, 961237, 954337, 947067, 942143, 940759, 942066, 944814, 948584, 953676, 960808, 970938, 984481, 1000644, 1018145, 1036596, 1056754, 1079986, 1108165, 1142880, 1182481, 1219876, 1245719, 1255376, 1251950, 1241928, 1229414, 1215555, 1201638, 1190159, 1183065, 1180767, 1182827, 1187773, 1191768, 1189186, 1175902, 1151872, 1120333, 1085256, 1049896, 1016643, 986892, 960889, 938196, 918408, 901296, 886626, 874246, 864199, 856371, 850295, 845691, 842914, 842261, 842974, 843790, 844620, 846790, 851038, 856053, 859904, 862494, 865552, 870308, 876290, 882562, 888944, 895475, 901791, 907924, 914884, 923416, 932786, 941948, 951382, 962505, 975548, 989501, 1004142, 1020475, 1038741, 1057520, 1075689, 1094102, 1114202, 1135746, 1156959, 1176488, 1194319, 1211210, 1228028, 1245238, 1262177]
59275A262177J4930J1709R139Q097P415N683K989K16k426n175p887j0386j3003
59262A283478j5797j7691j7493j5531j3436j2334j2019j1759j1158j0119q655
59251A137486o978n465m331l462k469p95J988N693R363J1780J1998R604M911r08
59237A168415o352j0501j3171j4273j3893j3015j3044j3916j3622j0641o135k687
59225A037165j438j498j758j906j832j309m95J53O42J338K218L029M033N523O799
59210A050664O870O144O021O678O890O334O262P095P181N272K629J119L53j413
59196A118099m421p309r304j0653j1281j0897j0306j0665j1453j1048r494q667
59184A002601r173r177p368n149m502n161n490n065m594l958k230M59K553K917
$$ y = [1262177, 1277107, 1288816, 1297955, 1306052, 1313467, 1319150, 1322139, 1322355, 1319929, 1314754, 1306867, 1296481, 1283478, 1267681, 1249990, 1232497, 1216966, 1203530, 1191196, 1179177, 1167418, 1156260, 1146141, 1137486, 1130508, 1125043, 1120712, 1117250, 1114781, 1113986, 1115974, 1121667, 1131030, 1142810, 1154808, 1164412, 1169323, 1168415, 1162063, 1151562, 1138391, 1124118, 1110225, 1097210, 1084166, 1070250, 1056628, 1045987, 1039852, 1037165, 1035727, 1034229, 1032471, 1030565, 1028733, 1027424, 1026929, 1027082, 1027724, 1029062, 1031280, 1034309, 1038342, 1043865, 1050664, 1057534, 1063678, 1069699, 1076377, 1083267, 1089601, 1095863, 1102958, 1110139, 1115411, 1118040, 1119159, 1119512, 1118099, 1113678, 1106369, 1097065, 1086412, 1075131, 1064234, 1053928, 1043263, 1031810, 1020762, 1011268, 1002601, 993428, 984251, 976883, 971734, 967232, 962071, 956581, 951516, 946922, 942964, 940734, 941193, 943746, 946663]
59170I46663K101J422J353J100l61k815m563m247k807k546m074n543n500m950
59156I15233n456o576o788n902m788l522j692l6K36m49m59N77J581K202L212M515
59140H91888M814L756K539J850J104L53R46L255N530O310O288O557O670N974N365
59125I53199N872O694O500N779O003P099P553O702N296M202L880M626N787N405
59111A034597K509p24j070J588M210M713L958L375K904K254K206L325M620M798
59097A073263L945K938K071J188M05k54j265k774m027m384m298m484m853n079
59083A052392n437o081o151m909l249k775l534m024l391k357j771j547j367j336
59069A004463j291o34M49O16p48k088j422Q89K582K660K658M212O682Q192Q228
$$ y = [946663, 948764, 950186, 951539, 952639, 952278, 949463, 944900, 940653, 937846, 935300, 931226, 925683, 920183, 915233, 909777, 903201, 896413, 890511, 885723, 882201, 880509, 880473, 880709, 880260, 879801, 880378, 881959, 884161, 887373, 891888, 896702, 900458, 902997, 904847, 905951, 906304, 907250, 910505, 916035, 922345, 928633, 935190, 941860, 947834, 953199, 959071, 965765, 972265, 978044, 984047, 991146, 998699, 1005401, 1010697, 1014899, 1018779, 1023405, 1029192, 1034597, 1037106, 1036382, 1035312, 1036900, 1041110, 1045823, 1049781, 1053156, 1056060, 1058314, 1060520, 1063845, 1068465, 1073263, 1077208, 1080146, 1082217, 1083405, 1083810, 1083556, 1082291, 1079517, 1075490, 1071106, 1066808, 1062324, 1057471, 1052392, 1046955, 1040874, 1034723, 1029814, 1026565, 1023790, 1020256, 1016232, 1012841, 1010484, 1008713, 1007166, 1005799, 1004463, 1003172, 1002538, 1002987, 1003603, 1002855, 1000767, 999345, 1000234, 1002816, 1005476, 1008134, 1012346, 1019028, 1027220, 1035448]
59054A035448P931Q112Q261P782P188P415Q377Q812P620N024K391J022J021J342
59040A117746Q64n12j908k373j691m63L95L71l03j059j860l140m780n744n400
59025A090143m589m521m967m705l627l122m062n584o474o746p110p781q610r724
59011A008521j1028j1632j0763r073q056q194q510q095p264o865o985o864n989
58998H99203m857m360m619m775m091k797j569o38o2l16j648l050l081j790o60
58983H60890m97n54q1N73R94J507K179K224J353O81J156K084K301J954J930K282
58967H80976K579L180M739O858Q510R493J0244J0698J0550J0348J0899J1771J1681
58954I92526J0298Q518P056O005N537N703N507L703P72j166r19M27J170J059J154
$$ y = [1035448, 1043379, 1051491, 1059752, 1067534, 1074722, 1082137, 1090514, 1099326, 1106946, 1111970, 1114361, 1115383, 1116404, 1117746, 1118610, 1118098, 1116190, 1113817, 1112126, 1111663, 1112058, 1112429, 1112126, 1111067, 1109207, 1106067, 1101287, 1095543, 1090143, 1085554, 1081033, 1076066, 1071361, 1067734, 1064612, 1060550, 1054966, 1048492, 1041746, 1034636, 1026855, 1018245, 1008521, 997493, 985861, 975098, 966025, 957969, 949775, 941265, 933170, 925906, 919041, 912056, 905192, 899203, 894346, 889986, 885367, 880592, 876501, 873704, 872135, 871497, 871435, 871119, 869471, 866421, 863340, 861550, 860890, 860393, 859839, 859758, 860331, 861325, 862832, 865011, 867235, 868588, 869269, 870425, 872509, 874810, 876764, 878694, 880976, 883555, 886735, 891474, 898332, 906842, 916335, 926579, 937277, 947827, 958175, 969074, 980845, 992526, 1002824, 1011342, 1018398, 1024403, 1029940, 1035643, 1041150, 1044853, 1045625, 1044459, 1043540, 1043967, 1045137, 1046196, 1047350]
58939A047350K368M608O832P725O797N040M066M489N434N521M020J361r70j510
58925A103131m00N10k86k274l959m717m701l819k146p20l60j61J413M183O536
58910A092230P760Q597R699J1091J2874J4777J5349J3546J1022J0612J2314J3068
58898A232939J1135Q301O696N589K971j193n055p342q419r464j1496j4504j7005
58885A193153j7267j5535j3960j3786j3851j2747j1169j0825j1825j2443j1276
58874A048469q703o469o133p552q685p562m564j979j227j658k149k438k367j419
58860I85564J23P95j96j649j873o68R74K339L312L927M355M853N379N859O844
58845A019938Q805J0794J1267J0531J0634J2248J3540J3101J2157J2511J3894
$$ y = [1047350, 1049718, 1054326, 1061158, 1068883, 1075680, 1080720, 1084786, 1089275, 1094709, 1100230, 1104250, 1105611, 1104641, 1103131, 1102731, 1103241, 1102955, 1100681, 1096722, 1092005, 1087304, 1083485, 1081339, 1080619, 1080259, 1080098, 1081511, 1085694, 1092230, 1099990, 1108587, 1118286, 1129377, 1142251, 1157028, 1172377, 1185923, 1196945, 1207557, 1219871, 1232939, 1244074, 1252375, 1259071, 1264660, 1267631, 1266438, 1261383, 1254041, 1245622, 1236158, 1224662, 1210158, 1193153, 1175886, 1160351, 1146391, 1132605, 1118754, 1106007, 1094838, 1084013, 1072188, 1059745, 1048469, 1039766, 1033297, 1027164, 1019612, 1010927, 1003365, 998801, 996822, 995595, 993937, 991788, 989350, 986983, 985564, 985687, 986482, 986286, 984637, 982764, 982096, 983070, 985409, 988721, 992648, 997003, 1001856, 1007235, 1013094, 1019938, 1028743, 1039537, 1050804, 1061335, 1071969, 1084217, 1097757, 1110858, 1123015, 1135526, 1149420]
58834A149420J4856J5039J4956J4632J4027J3900J4865J6284J7323J8198J9172
58823A322672J9488J8591J7368J6747J6159J4897J3638J2815J0749N877n9l674
58811A465268m587n782r092j2837j4666j4691j4542j4829j4955j4570j4046j3743
58799A316928j3583j3326j2939j2766j3207j4163j5017j5394j5520j5605j5399
58788A160009j4806j4292j4075j3565j2373j1267j1181j1738j1755j0914j0059
58777A023984r852r915r386p944o312n828p031q639q658o676m154k337j102j99
58763I35951q6o95q11J66J174J346J583K875M341M636M209M307M612L808K015
58748I69431P70P88J364J743J648O72j223k928l267k721k680l345l846m112m876
$$ y = [1149420, 1164276, 1179315, 1194271, 1208903, 1222930, 1236830, 1251695, 1267979, 1285302, 1303500, 1322672, 1342160, 1360751, 1378119, 1394866, 1411025, 1425922, 1439560, 1452375, 1463124, 1469001, 1468942, 1465268, 1460681, 1454899, 1445807, 1432970, 1418304, 1403613, 1389071, 1374242, 1359287, 1344717, 1330671, 1316928, 1303345, 1290019, 1277080, 1264314, 1251107, 1236944, 1221927, 1206533, 1191013, 1175408, 1160009, 1145203, 1130911, 1116836, 1103271, 1090898, 1079631, 1068450, 1056712, 1044957, 1034043, 1023984, 1014132, 1004217, 994831, 986887, 980575, 974747, 967716, 959077, 950419, 943743, 939589, 937252, 936150, 935951, 935865, 935170, 934359, 934525, 935699, 937045, 938628, 941503, 945844, 950480, 954689, 958996, 963608, 967416, 969431, 970201, 970989, 972353, 974096, 975744, 976416, 975193, 972265, 968998, 966277, 963597, 960252, 956406, 952294, 947418]
58733I47418n955o173n281m405m356m678m622l970k741j102K91Q27Q47J212K047
58718I09359K746L018L042K912K796L254M338M777L160k14l612n718o393o111
58704I17354n640n785o468o660n952n285n129m315k107j80m25j852j860k5J677
58689H67348K030J731J565J559J979L089L964L511K642L393N866Q060Q811Q847
58675I24395Q735Q082P129O959P496P312O007N023N393O511P561Q458Q805P845
58661A025711O093N185N375N046L498K368L238N355O869P037O235N074M279M363
58647A095726M668L836J712n33k444m876p989j0336j0831j0171r612r709j0940
58634A028501j3819j7437j9469j8825j7054j6054j5746j5095j4077j3274j2537
$$ y = [947418, 941463, 935290, 930009, 925604, 921248, 916570, 911948, 907978, 905237, 904135, 904426, 905253, 906100, 907312, 909359, 912105, 915123, 918165, 921077, 923873, 927127, 931465, 936242, 939402, 939188, 935576, 929858, 923465, 917354, 911714, 905929, 899461, 892801, 886849, 881564, 876435, 872120, 870013, 869833, 869408, 867556, 865696, 865671, 867348, 869378, 871109, 872674, 874233, 876212, 879301, 883265, 886776, 889418, 892811, 898677, 906737, 915548, 924395, 933130, 941212, 948341, 955300, 962796, 970108, 976115, 981138, 986531, 993042, 1000603, 1009061, 1017866, 1025711, 1031804, 1036989, 1042364, 1047410, 1050908, 1053276, 1056514, 1061869, 1068738, 1075775, 1082010, 1087084, 1091363, 1095726, 1100394, 1104230, 1105942, 1105409, 1102965, 1098089, 1090100, 1079764, 1068933, 1058762, 1049150, 1039441, 1028501, 1014682, 997245, 977776, 958951, 941897, 925843, 910097, 895002, 880925, 867651, 855114]
58623H55114j1307r608p781n940m519m442n879p515p897o823m874k475q4J525
58609G77495K011J897J852K140K985M517O015O305N308M214L742L287K224R15
58595H24907n1n90o16J37J289J755R17q78k989m675m857l114q35J51J10P71K216
58578H13648K474O33j805l300l924l935k791o52J086J801K389L015K240j75j766
58563H08938m84K272L672L188K408K199K047J618J340J622K564M090N649O395
58549H47518O263O076O130N748M702L705K983J848M28J23J326K375J914P55J20
58534H92014l60j367k060j248N86J982K485K647K861L378M620O488Q128R198J0255
58519I39607J1252J1096R759R171J0604J2585J2947J1772J0788J0900J1829J3185
$$ y = [855114, 843807, 834199, 826418, 820478, 815959, 811517, 805638, 798123, 790226, 783403, 778529, 776054, 775970, 777495, 779506, 781403, 783255, 785395, 788380, 792897, 798912, 805217, 810525, 814739, 818481, 821768, 823992, 824907, 824856, 824266, 823650, 823787, 825076, 826831, 827748, 826870, 823881, 819206, 814349, 811235, 810400, 810551, 810661, 811432, 813648, 816122, 816755, 814950, 811650, 807726, 803791, 801000, 800348, 801434, 803235, 805624, 808639, 810879, 810704, 808938, 808454, 810726, 814398, 817586, 819994, 822193, 824240, 825858, 827198, 828820, 831384, 835474, 841123, 847518, 853781, 859857, 865987, 871735, 876437, 880142, 883125, 884973, 885401, 885524, 886850, 889225, 891139, 891894, 892014, 891654, 890287, 888227, 886979, 887565, 889547, 892032, 894679, 897540, 900918, 905538, 912026, 920154, 929352, 939607, 950859, 961955, 971714, 980885, 991489, 1004074, 1017021, 1028793, 1039581, 1050481, 1062310, 1075495]
58507A075495J4546J5260J5528J6742J9523K2413K3692K3508K3055K2785K2708
58496A295255K3301K4630K5456K4543K1993J8410J3894Q898M757J975o98m142
58484A458272p206q649r329j0700j2403j3170j3268j4065j5899j7954j9706k1043
58472A294880k1535k0904j9724j8666j7738j6888j6294j5384j3020r581p110o404
58460A111632n823m266l102l451l783k467q31j078k693l521l171k851k875k941
58446A068779l733n631o656m552m85J997J567K43K8P43J298J151J98j173j843
58431A051931j099J99P55P03J084K052L032L969N047N875O301P221R195J1172
58417A107437J2057J2538J3775J5322J6051J6091J6003J5129J2660R428O696M086
$$ y = [1075495, 1090041, 1105301, 1120829, 1137571, 1157094, 1179507, 1203199, 1226707, 1249762, 1272547, 1295255, 1318556, 1343186, 1368642, 1393185, 1415178, 1433588, 1447482, 1456380, 1461137, 1463112, 1462414, 1458272, 1451066, 1442417, 1433088, 1422388, 1409985, 1396815, 1383547, 1369482, 1353583, 1335629, 1315923, 1294880, 1273345, 1252441, 1232717, 1214051, 1196313, 1179425, 1163131, 1147747, 1134727, 1125146, 1118036, 1111632, 1105809, 1101543, 1098441, 1094990, 1091207, 1088740, 1087909, 1086831, 1084138, 1080617, 1077446, 1074595, 1071720, 1068779, 1065046, 1059415, 1052759, 1048207, 1047722, 1049719, 1051286, 1051529, 1051557, 1052300, 1053598, 1054749, 1054947, 1053774, 1051931, 1050832, 1051031, 1051786, 1052489, 1053573, 1055625, 1058657, 1062626, 1067673, 1073548, 1079849, 1087070, 1096265, 1107437, 1119494, 1132032, 1145807, 1161129, 1177180, 1193271, 1209274, 1224403, 1237063, 1246491, 1253187, 1257273]
58405A257273O97k611m125l812l117k775k613k701k947k367m36J646K598K917
58391A237627L603M304M521N107O586P415O059L403J025j331m174n945n136l390
58377A259674l446n064n834n010l666k123j57J142Q52O65K845O451Q704R234R822
58362A274089J0632J0245Q983Q738R540R547Q355P179N828K857j148l672m006
58349A347167m033m936n866o199o404o487o091o161p847r709q890n347k095q56
58335A266246j67J613L885N178N009L923L172M248P108R352Q882O763N549N790
58321A336551O360P066Q329R274Q843P897P672P299N678M434N785Q604J0101J0286
58307A444179J1224J2826J3294J2992J3943J5874J6556J5745J5156J5027J4331
$$ y = [1257273, 1257970, 1255359, 1251234, 1247422, 1244305, 1241530, 1238917, 1236216, 1233269, 1230902, 1230466, 1232112, 1234710, 1237627, 1241230, 1245534, 1250055, 1255162, 1261748, 1269163, 1275222, 1278625, 1279650, 1278319, 1274145, 1268200, 1263064, 1259674, 1256228, 1251164, 1245330, 1240320, 1236654, 1234531, 1234374, 1235516, 1236368, 1237033, 1239878, 1246329, 1255033, 1264267, 1274089, 1284721, 1294966, 1303949, 1312687, 1322227, 1331774, 1340129, 1347308, 1353136, 1355993, 1354845, 1351173, 1347167, 1343134, 1338198, 1332332, 1326133, 1319729, 1313242, 1307151, 1300990, 1293143, 1283434, 1274544, 1269197, 1267102, 1266246, 1266079, 1267692, 1271577, 1276755, 1281764, 1285687, 1288859, 1293107, 1300215, 1309567, 1318449, 1325212, 1330761, 1336551, 1342911, 1349977, 1358306, 1367580, 1376423, 1384320, 1391992, 1399291, 1404969, 1409403, 1415188, 1423792, 1433893, 1444179, 1455403, 1468229, 1481523, 1494515, 1508458, 1524332, 1540888, 1556633, 1571789, 1586816, 1601147]
58296A601147J3852J5136J7021J7065J5877J5920J6687J5482J2532J0811J0852
58285A762382J0412R230R503J1406J2644J2847J4076J6582J8288J8763J9526K0319
58273A935978J9406J7697J8060K0559K2710K4317K7085K9736K8905K5293K3389
58262B193135K4403K4806K2707K0314J9016J7381J5424J5742J8898K2222K4272
58251B418320K5986K6972K5665K3657K4600K8149L0424L0825L2564L5889L7301
58240B740352L6553L7737M1873M4975M5290M5934M8345M9672M8957M9418N2047
58229C241153N3400N2401N2930N6676N9760N9685N9667O2667O6752O9607P2295
58218C906993P5645P8222Q0500Q5498R2810R7815R9242J01560J07358J13678J18462
$$ y = [1601147, 1614999, 1630135, 1647156, 1664221, 1680098, 1696018, 1712705, 1728187, 1740719, 1751530, 1762382, 1772794, 1782024, 1791527, 1802933, 1815577, 1828424, 1842500, 1859082, 1877370, 1896133, 1915659, 1935978, 1955384, 1973081, 1991141, 2011700, 2034410, 2058727, 2085812, 2115548, 2144453, 2169746, 2193135, 2217538, 2242344, 2265051, 2285365, 2304381, 2321762, 2337186, 2352928, 2371826, 2394048, 2418320, 2444306, 2471278, 2496943, 2520600, 2545200, 2573349, 2603773, 2634598, 2667162, 2703051, 2740352, 2776905, 2814642, 2856515, 2901490, 2946780, 2992714, 3041059, 3090731, 3139688, 3189106, 3241153, 3294553, 3346954, 3399884, 3456560, 3516320, 3576005, 3635672, 3698339, 3765091, 3834698, 3906993, 3982638, 4060860, 4141360, 4226858, 4319668, 4417483, 4516725, 4618285, 4725643, 4839321, 4957783]
58207D957783J24079J31601J37979J41968J46710J53698J60493J66810J76020
58198F297141J88214J98896K07109K17430K31347K44523K55503K68843K86374
58189H395380L03645L18558L35290L56167L77802L98701M22244M48994M74876
58180A1831657M99863N29208N63472N97597O32194O74248P23475P70581Q12844
58171A7635139Q58316R10205R61223J008878J061761J124070J188485J251567
58163B5999644J321396J402415J487798J574864J672315J783993J901914K024076
58155C9168415K161726K319844K489208K667833K870230L104398L361067L638001
58147F1780722L952528M317493M730408N201899N768374O459545P280764Q242608
$$ y = [4957783, 5081862, 5213463, 5351442, 5493410, 5640120, 5793818, 5954311, 6121121, 6297141, 6485355, 6684251, 6891360, 7108790, 7340137, 7584660, 7840163, 8109006, 8395380, 8699025, 9017583, 9352873, 9709040, 10086842, 10485543, 10907787, 11356781, 11831657, 12331520, 12860728, 13424200, 14021797, 14653991, 15328239, 16051714, 16822295, 17635139, 18493455, 19403660, 20364883, 21373761, 22435522, 23559592, 24748077, 25999644, 27321040, 28723455, 30211253, 31786117, 33458432, 35242425, 37144339, 39168415, 41330141, 43649985, 46139193, 48807026, 51677256, 54781654, 58142721, 61780722, 65733250, 70050743, 74781151, 79983050, 85751424, 92210969, 99491733, 107734341]
58139A07734341R372630J0676164J2122971J3697651J5422246J7301477J9293101
58132B05620581K1361967K3503348K5680509K7821078K9889981L1736891L2626467
58125C98240822L1058901K5540737J5891764L775761q200797j7966849k4729432
58118D23610907k8687611l0428259l0590666k9749928k8318608k6511537k4441189
58111B24883109k2221616j9970062j7774796j5710051j3848911j2227824j0825925
58104A12303924r605637q550312p646048o859200o158119n535952m992060m510944
58096E8445652m077318l692750l359854l066420k800169k563318k358781k177031
58088C4350011k009337j859267j729035j608836j491503j383834j291863j208210
$$ y = [107734341, 117106971, 127783135, 139906106, 153603757, 169026003, 186327480, 205620581, 226982548, 250485896, 276166405, 303987483, 333877464, 365614355, 398240822, 429299723, 454840460, 470732224, 474507985, 466307188, 448340339, 423610907, 394923296, 364495037, 333904371, 304154443, 275835835, 249324298, 224883109, 202661493, 182691431, 164916635, 149206584, 135357673, 123129849, 112303924, 102698287, 94147975, 86501927, 79642727, 73484608, 67948656, 62956596, 58445652, 54368334, 50675584, 47315730, 44249310, 41449141, 38885823, 36527042, 34350011, 32340674, 30481407, 28752372, 27143536, 25652033, 24268199, 22976336, 21768126]
58080B1768126j125251j047833r81592r20807q59211q01567p53439p09883o64859
58071A3903684o21954n85761n52174n17070m85227m60877m38278m11419l84720
58062I446204l64708l48814l31634l14688l01078k87731k71733k57381k48413
58053F720024k39905k26409k11590k01446j94193j85230j76157j70363j65152
58044D949579j56574j47153j40906j35603j27645j19823j16344j14635j09924
58035C780972j04007j01578j01420r8945r4522r1904r0805q7889q3110p9025p5750
58024B772017p1999o8954o7975o6927o3614o0167n9352n9338n7030n3615n1867
58013B091179n0787m7938m4557m3316m3262m1617l8545l6010l4006l1774l0398
$$ y = [21768126, 20642875, 19595042, 18613450, 17692643, 16833432, 16031865, 15278426, 14568543, 13903684, 13281730, 12695969, 12143795, 11626725, 11141498, 10680621, 10242343, 9830924, 9446204, 9081496, 8732682, 8401048, 8086360, 7785282, 7497551, 7225818, 6968437, 6720024, 6480119, 6253710, 6042120, 5840674, 5646481, 5461251, 5285094, 5114731, 4949579, 4793005, 4645852, 4504946, 4369343, 4241698, 4121875, 4005531, 3890896, 3780972, 3676965, 3575387, 3473967, 3375022, 3280500, 3188596, 3097791, 3009902, 2926792, 2847767, 2772017, 2700018, 2631064, 2563089, 2496162, 2432548, 2372381, 2313029, 2253691, 2196661, 2143046, 2091179, 2040392, 1992454, 1947897, 1904581, 1861319, 1819702, 1781157, 1745147, 1711141, 1679367, 1648969]
58002A648969l0546l0203k8029k6135k6261k6502k5231k4531k5936k6649k4296
57991A354650k1585k1710k2703k1268j8765j8296j8911j7927j6204j6017j6113
57980A145151j4081j1445j1376j3190j3848j3118j2824j2830j2105j1861j3460
57969A005013j5097j4674j3881j5308j7635j7964j6743j6143j5787j4380j3357
57958H34044j4325j5065j2836r539q773r787r349p773p791q937q502o882o731
57945G07754p593o623m119l170m006l721j670m72j301k461k928l356l265j184
57931F61885K116M009L880L326K562K30l223n324n059l668k118o67m70k440m792
57916F50247m879l169k342k929l125k460k234k494k034j241j639k690k334o99
$$ y = [1648969, 1618423, 1588220, 1560191, 1534056, 1507795, 1481293, 1456062, 1431531, 1405595, 1378946, 1354650, 1333065, 1311355, 1288652, 1267384, 1248619, 1230323, 1211412, 1193485, 1177281, 1161264, 1145151, 1131070, 1119625, 1108249, 1095059, 1081211, 1068093, 1055269, 1042439, 1030334, 1018473, 1005013, 989916, 975242, 961361, 946053, 928418, 910454, 893711, 877568, 861781, 847401, 834044, 819719, 804654, 791818, 782279, 773506, 763719, 754370, 746597, 738806, 729869, 721367, 714485, 707754, 700161, 693538, 689419, 686249, 682243, 678522, 676852, 676380, 675079, 672618, 669690, 666334, 663069, 661885, 664001, 668010, 671890, 675216, 677778, 678008, 674785, 669461, 664402, 660734, 658616, 657949, 657479, 655039, 650247, 645368, 642199, 639857, 636928, 633803, 631343, 629109, 626615, 624581, 623340, 621701, 619011, 616677, 615978]
57902F15978l8q86j547j459j869k896l102k377k385l624m692m748m256l251j417
57887E77431J42r2j266r67J145L155M214N275O611P265P207P348P381O212M534
57872F35595M259N292N546M277K758J539k56k555l895l797l406l494l926n023
57858F32914p143r020q967p672p418q676r846j0103r908r029o915m819m586n355
57844E23457m530k095p46j464k274j993j943k895l364k286q88n21p60o94k87L90
57828D97107J498K403K163J281J121J517J081o1l17L96L11j177k661l362m086
57813D97214n025n157m409m072m481m674m609n094n254l206J11J067j478m287
57799D46646m426k916k069j937j482q31l31P60K740M319M616M616N160N310M259
$$ y = [615978, 615940, 615054, 613507, 612048, 610179, 607283, 604181, 601804, 599419, 595795, 591103, 586355, 582099, 578848, 577431, 577573, 577481, 576215, 575248, 576393, 579548, 583762, 589037, 595648, 602913, 610120, 617468, 624849, 631061, 635595, 639854, 645146, 650692, 654969, 657727, 659266, 659010, 656455, 652560, 648763, 645357, 641863, 637937, 632914, 625771, 616751, 607784, 600112, 592694, 584018, 574172, 564069, 554161, 545132, 538217, 533398, 528812, 523457, 518927, 516832, 516086, 514622, 512348, 510355, 508412, 505517, 502153, 499867, 498979, 498458, 497698, 497004, 496717, 497107, 498605, 501008, 503171, 504452, 505573, 507090, 508171, 508110, 507793, 508189, 508500, 507323, 504662, 501300, 497214, 492189, 487032, 482623, 478551, 474070, 469396, 464787, 459693, 454439, 451233, 451344, 452411, 450933, 446646, 442220, 439304, 437235, 435298, 433816, 432985, 432654, 433414, 436154, 440473, 445089, 449705, 454865, 460175, 464434]
57784D64434L063K770K508J139n79j212p41o2M19M25n72k138k768k235k462m635
57768D57354o999p138n035k327Q1J998K896K830L304N257P071O464L700J072k61
57753D70267j027j793k062j615j174j263j511j491j475j826k182j780n66M13J21
57738D51036j030j564j111j261l273n810o487n128l677l144k734k225k753m412
57724D06427n119l261J5K492L540L801L454K378J371J661L436N665P177P292O007
57709D46336M168K927K504K005R26j2p1J95l47j870l421l916k977j165K37J42
57693D45661j347l056l882l515k334j150p80j185j402j021j051k197l139k217
57679D17385l42j23k038l586k825q55N6o85j888k171r16J243K477J381j040k132
$$ y = [464434, 467497, 470267, 472775, 473914, 473335, 472123, 471382, 471320, 471739, 472164, 471592, 469454, 466686, 464451, 461989, 457354, 450355, 443217, 438182, 435855, 435936, 437934, 440830, 443660, 446964, 452221, 459292, 465756, 469456, 470528, 470267, 469240, 467447, 465385, 463770, 462596, 461333, 459822, 458331, 456856, 455030, 452848, 451068, 450502, 450915, 451036, 450006, 448442, 447331, 446070, 442797, 436987, 430500, 425372, 421695, 418551, 415817, 413592, 410839, 406427, 401308, 398047, 398062, 400554, 404094, 407895, 411349, 413727, 415098, 416759, 420195, 425860, 433037, 440329, 446336, 450504, 453431, 455935, 457940, 458866, 458854, 458783, 458978, 458631, 456761, 453340, 449424, 446447, 445282, 445519, 445661, 444314, 441258, 437376, 433861, 431527, 430377, 429597, 428412, 427010, 425989, 424938, 422741, 419602, 417385, 417043, 416920, 414882, 411296, 408471, 407616, 407672, 406987, 405099, 402928, 402012, 403255, 405732, 407113, 406073, 403941]
57663D03941p16J664K854K166J25k319l882l583j940m19M22J020J086l20k704
57648C97395m098l744l038l008k732j293M09R36K23q73j729j865r54L45P43J46
57632C76863j86K35M57P5R6R45J464R05J64N0J17L93K279O213J0252J2631J4111
57615D27064J6105J8160J9367K0808K4252K9309L4149L8357M2759M6578M6777
57604G63685M0752K8643J3009k821j6284k6476l3708l8082l9328l8159l6391l4881
57592E79959l2627k8890k4793k1595j8722j5124j1487r314q593q072p285o688
57580C86769o212n290m077l301k947k352j470j050j485k203k207r54Q97J587o4
57565C55641k828m019k733p35K37M02M06k65j942l457l683l164k812k403j759
$$ y = [403941, 403225, 404889, 407743, 409909, 410034, 407715, 403833, 400250, 398310, 397891, 398313, 399333, 400419, 400099, 397395, 393297, 389553, 386515, 383507, 380775, 379482, 379891, 380827, 381050, 380177, 378448, 376583, 375629, 375974, 376717, 376863, 376677, 376912, 377369, 377444, 377540, 378485, 379949, 380854, 381018, 381068, 381185, 381578, 383857, 390070, 400322, 412953, 427064, 443169, 461329, 480696, 501504, 525756, 555065, 589214, 627571, 670330, 716908, 763685, 804437, 833080, 846089, 843268, 826984, 800508, 766800, 728718, 689390, 651231, 614840, 579959, 547332, 518442, 493649, 472054, 453332, 438208, 426721, 417407, 408814, 400742, 393457, 386769, 380557, 375267, 371190, 367889, 364942, 362590, 361120, 360070, 358585, 356382, 354175, 353221, 354118, 355705, 355641, 352813, 348794, 346061, 345326, 345563, 345965, 346371, 346106, 344164, 340707, 337024, 333860, 331048, 328645, 326886]
57550C26886j873l069l601k077k8J65j267k276k244k003j488K9J833K375J766
57535C13128J331R26r40m238p012p966p483o077m020k553l121n007n835m964m173
57520B51996m542m843l883k351j282m91K63K53q37j917k114k244l298m626m849
57505B15235l911k942k623k668k590k143j359o66n80q83o61M52J725K418K588
57490B01392K352J340l08j237l57J476K420K048J697K356L347L616L353L446L754
57475B30695L162J471K08P31K207K545J143n46j221j200j134o13Q86K570L073
57460B43977K279J200M58l4j64L53J034Q65k10r85n61M88R21K96p69j468j576
57443B46104j367j049m99K83P37K34j055k374l435m441n095m704l638l378m405
$$ y = [326886, 325013, 321944, 318343, 316266, 316238, 316403, 315136, 312860, 310616, 308613, 307125, 307154, 308987, 311362, 313128, 314459, 315385, 314445, 310207, 303195, 295229, 287746, 281669, 277649, 275096, 271975, 266968, 261133, 256169, 251996, 247454, 242611, 238728, 236377, 235095, 234604, 234867, 235120, 234283, 232366, 230252, 228008, 224710, 220084, 215235, 211324, 208382, 205759, 203091, 200501, 198358, 196999, 196333, 195753, 194870, 194209, 194661, 196386, 198804, 201392, 203744, 205084, 204776, 203539, 203182, 204658, 207078, 209126, 210823, 213179, 216526, 220142, 223495, 226941, 230695, 233857, 235328, 235536, 236267, 238474, 241019, 242162, 241616, 240395, 239195, 238061, 237448, 238334, 240904, 243977, 246256, 247456, 247914, 247880, 247716, 248069, 249103, 249968, 249758, 248773, 248212, 248700, 249621, 249917, 249148, 247680, 246104, 244737, 243688, 243189, 243472, 244209, 244443, 243388, 241014, 237579, 233138, 228043, 223339, 219701, 216323, 211918]
57428B11918n199m281k205m34P21J732K364K118J548J545J743J134J3j98R82K528
57412B16029L379L322K595J799J952L271M222L217J033r5L12N14n64j900k272
57397B36814j848j167k08O60L09j448l023l032k100j540j293m67P23J085K27r43
57381B22749j503j340p02K23J129J662J859K047K161J692N82j73N80K683M480
57366B38129M462K801Q87m24j359j939j268J132L986N309M626L250K419K067J563
57351B65641Q27L06L79J108K312L526M153L784K436N84r57j460r22j12K79M03
57335B82287P89J395J520P56k63k26J541M072N493N179M612N343O713O933N984
57320C32128N524N902N516L905L069M280N688N130L575L350M279M289L139K727
$$ y = [211918, 206719, 202438, 200233, 199799, 200520, 202252, 204616, 206734, 208282, 209827, 211570, 212704, 212717, 212519, 213501, 216029, 219408, 222730, 225325, 227124, 229076, 232347, 236569, 239786, 240819, 240724, 241036, 241550, 240986, 239086, 236814, 234966, 233799, 233591, 234251, 234560, 233112, 230089, 227057, 224957, 223417, 222124, 221657, 222380, 223465, 223692, 222749, 221246, 219906, 219204, 219427, 220556, 222218, 224077, 226124, 228285, 229977, 230559, 230386, 230966, 233649, 238129, 242591, 245392, 246279, 245855, 244496, 242557, 241289, 242421, 246407, 251716, 256342, 259592, 262011, 264078, 265641, 266468, 266774, 267153, 268261, 270573, 274099, 278252, 282036, 284472, 285056, 284099, 282639, 281717, 281605, 281884, 282287, 283076, 284471, 285991, 286747, 286484, 286258, 287799, 291871, 297364, 302543, 307155, 312498, 319211, 326144, 332128, 337652, 343554, 349070, 352975, 356044, 360324, 366012, 371142, 374717, 378067, 382346, 386635, 389774, 392501]
57306C92501L801M919M912M214L460K811K906M409O191O062L912K229K742M468
57292D49537N770O468O829O276M669L362L506M217L961L011L082M874P120Q044
57278E20726P032M965L392L282M389N933P664R626J1168J1312J0111Q521O918
57265F15039N058L687M370O973Q957Q452O834O861R106J1655J2867J2850J2371
57252G25080J1654J0665R799R649J0378J1523J2501J3202J3912J4530J4362J3092
57240H70347J1538J0743J0633J0499J0374J0786J1452J1667J1942J3567J6219
57229I99767J7822J7505J7125J8622K1299K3033K3171K2772K2664K2728K2776
57218A229284K2935K3180K3251K2909K1865J9934J7831J7067J8310K0352K1491
$$ y = [392501, 396302, 401221, 406133, 410347, 413807, 416618, 419524, 423933, 430124, 436186, 440098, 442327, 445069, 449537, 455307, 461775, 468604, 474880, 479549, 482911, 486417, 490634, 494595, 497606, 500688, 505562, 512682, 520726, 527758, 532723, 536115, 539397, 543786, 549719, 557383, 567009, 578177, 589489, 599600, 608121, 615039, 620097, 623784, 628154, 635127, 644084, 652536, 659370, 666231, 675337, 686992, 699859, 712709, 725080, 736734, 747399, 757198, 766847, 777225, 788748, 801249, 814451, 828363, 842893, 857255, 870347, 881885, 892628, 903261, 913760, 924134, 934920, 946372, 958039, 969981, 983548, 999767, 1017589, 1035094, 1052219, 1070841, 1092140, 1115173, 1138344, 1161116, 1183780, 1206508, 1229284, 1252219, 1275399, 1298650, 1321559, 1343424, 1363358, 1381189, 1398256, 1416566, 1436918, 1458409]
57207A458409K1388K0836K0491K0728K1983K3986K5198K4404K2600K1847K2394
57196A704264K2540K1499K0618K1012K1532K0567J8814J8499K0037K1238K0356
57185A930976J8548J8262K0079K2498K4391K6032K7532K7936K6812K5576K5904
57174B194546K7452K8419K7973K6843K5690K4302K2557K0979J9920J9130J8560
57163B456371J8732J9864K1286K2247K2778K3450K4688K6552K8942L1887L5771
57152B732568M0847M6168M9661N0214M9157M8565M8627M8159M7080M6468M6219
57141C253733M4816M1962L9203L7236L4659L0600K6608K4295K2895K0975J9094
57130C596076J8422J7892J5312J0926P411O179N918N240M655M901N063L760J239
$$ y = [1458409, 1479797, 1500633, 1521124, 1541852, 1563835, 1587821, 1613019, 1637423, 1660023, 1681870, 1704264, 1726804, 1748303, 1768921, 1789933, 1811465, 1832032, 1850846, 1869345, 1889382, 1910620, 1930976, 1949524, 1967786, 1987865, 2010363, 2034754, 2060786, 2088318, 2116254, 2143066, 2168642, 2194546, 2221998, 2250417, 2278390, 2305233, 2330923, 2355225, 2377782, 2398761, 2418681, 2437811, 2456371, 2475103, 2494967, 2516253, 2538500, 2561278, 2584728, 2609416, 2635968, 2664910, 2696797, 2732568, 2773415, 2819583, 2869244, 2919458, 2968615, 3017180, 3065807, 3113966, 3161046, 3207514, 3253733, 3298549, 3340511, 3379714, 3416950, 3451609, 3482209, 3508817, 3533112, 3556007, 3576982, 3596076, 3614498, 3632390, 3647702, 3658628, 3666039, 3672218, 3678136, 3683376, 3688031, 3692932, 3697995, 3701755, 3702994]
57117C702994j057k486l704n270o820p753q207q974j0600j2758j4641j5936j7103
57104C587685j8460j9375j9010j7817j7537j9287k2176k4417k5412k5954k6477
57093C351763k6029k3575j9567j5433j1869q525n384l421l549n762r826j6089
57081C202734k4715l4589m4018n2590o1576p2172q3783r4455j03019j10565j19523
57070B401729j31245j45159j60861j80247k06030k38055k72774l07126l41723
57061D18509C9201c82001m66503n13897n63188o15485o73032p38364q12767q95969
57051e661206r87964j090346j205189j333839j478089j641755j829878k046836
57043a7275102k296279k582596k912177l294207l740342m262262m869516n571684
$$ y = [3702994, 3701937, 3699451, 3695747, 3690477, 3683657, 3675904, 3667697, 3658723, 3648123, 3635365, 3620724, 3604788, 3587685, 3569225, 3549850, 3530840, 3513023, 3495486, 3476199, 3454023, 3429606, 3404194, 3378240, 3351763, 3325734, 3302159, 3282592, 3267159, 3255290, 3246765, 3241381, 3237960, 3234411, 3228649, 3218823, 3202734, 3178019, 3143430, 3099412, 3046822, 2985246, 2913074, 2829291, 2734836, 2631817, 2521252, 2401729, 2270484, 2125325, 1964464, 1784217, 1578187, 1340132, 1067358, 760232, 418509, 39201, -382001, -848504, -1362401, -1925589, -2541074, -3214106, -3952470, -4765237, -5661206, -6649170, -7739516, -8944705, -10278544, -11756633, -13398388, -15228266, -17275102, -19571381, -22153977, -25066154, -28360361, -32100703, -36362965, -41232481, -46804165]
57035d6804165o382058p314548q373581r547081j0808024j2118394j3431505j4696354
57027a29475710j5862117j6875457j7678680j8224384j8485693j8410123j7826429
57020b52838593j6422267j3896076j0203703n675612q80111L645466P570156J0764865
57012b77935875J3213077J4953157J6067860J6674638J6895597J6824971J6514703
57005a66791872J5983562J5242869J4321208J3269439J2146081J1001891R876422
56998g4950400Q800268P794613O871025O035392N291010M636738M065684L568774
56990b7886896L138287K766668K445006K165558J924065J717143J538904J382460
56982a0808805J243502J120286J011103R13771Q26822P49216O79391O16102N59733
$$ y = [-46804165, -53186223, -60500771, -68874352, -78421433, -89229457, -101347851, -114779356, -129475710, -145337827, -162213284, -179891964, -198116348, -216602041, -235012164, -252838593, -269260860, -283156936, -293360639, -299036251, -299916362, -296270896, -288700740, -277935875, -264722798, -249769641, -233701781, -217027143, -200131546, -183306575, -166791872, -150808310, -135565441, -121244233, -107974794, -95828713, -84826822, -74950400, -66150132, -58355519, -51484494, -45449102, -40158092, -35521354, -31455670, -27886896, -24748609, -21981941, -19536935, -17371377, -15447312, -13730169, -12191265, -10808805, -9565303, -8445017, -7433914, -6520143, -5693321, -4944105, -4264714, -3648612, -3088879]
56973c088879N11335M70546M35462M03974L74195L44208b36276D4724K50674K23436
56963E18834J99577J79061J62331J49720J40316J31993J23147J14301J07226J02195
56953A928701R7117R0125Q1851P3885O6111N7539M9111M3231M0182L7105L1430
56942B596388K3713J6148R590L160m021j1654j8442k3098k5512k7025k9078l1753
56930B478416l4359l6932l9929m2828m4555m5427m7101n0233n3662n6390n9042
56919A967958o2612o6863p0846p4191p7117p9590q0919q0143p6974p2723o9697
56908A156283o8631o7315o3191n6896n1532m8391m5404m0372l3971k8516k5072
56897F26992k2919k1063j9343j8421j9204k1771k4771k6522k6761k6529k6312
$$ y = [-3088879, -2577544, -2106998, -1671536, -1267562, -893367, -549159, -236276, 44724, 295398, 518834, 718411, 897472, 1059803, 1209523, 1349839, 1481832, 1604979, 1719280, 1826506, 1928701, 2025818, 2115943, 2197794, 2271679, 2337790, 2395329, 2444440, 2487671, 2527853, 2564958, 2596388, 2620101, 2636249, 2645839, 2648999, 2644978, 2633324, 2614882, 2591784, 2566272, 2539247, 2510169, 2478416, 2444057, 2407125, 2367196, 2324368, 2279813, 2234386, 2187285, 2137052, 2083390, 2027000, 1967958, 1905346, 1838483, 1767637, 1693446, 1616329, 1536739, 1455820, 1375677, 1298703, 1225980, 1156283, 1087652, 1020337, 957146, 900250, 848718, 800327, 754923, 714551, 680580, 652064, 626992, 604073, 583010, 563667, 545246, 526042, 504271, 479500, 452978, 426217, 399688, 373376]
56886C73376k5338k2839j9111j5072j1601r312q024o496l694k35K438M152N945
56873B64189Q104R857J0950J1768J1690R154L987j867o667j0343j3022j3811j2282
56860B71707r957q951r744j1212j2209j2373j1799j0674r039o830m358k473j592
56847A60496j132p07j106k722l822k484K91J675J130Q67J950K754K156J502K054
56832A62902K877K980L446N493Q107R517R725R682R133P223M390J908J02j536
56818B35949l067m167m839m905l552n97K612M752O239Q344J1249J4148J6588J8585
56804B97339K0079K1361K3343K6380K9362L0883L0586K8534K4236J7453R279J348
56792E60183n369j0202j2240j1337q910o582m692k879j094J017M572R877J5324
$$ y = [373376, 348038, 325199, 306088, 291016, 279415, 270103, 262079, 255583, 251889, 251654, 254092, 258244, 264189, 272293, 282150, 293100, 304868, 316558, 325712, 329699, 327832, 321165, 310822, 297800, 283989, 271707, 261750, 252799, 243055, 231843, 219634, 207261, 195462, 184788, 175749, 168919, 164561, 162088, 160496, 159364, 158657, 157551, 154829, 151007, 148523, 148814, 150489, 151619, 152486, 154436, 157190, 159346, 160848, 162902, 165779, 168759, 172205, 177698, 185805, 195322, 205047, 214729, 223862, 231085, 235475, 237383, 237485, 235949, 232882, 228715, 223876, 218971, 215419, 214822, 217434, 222186, 228425, 236769, 248018, 262166, 278754, 297339, 317418, 338779, 362122, 388502, 417864, 448747, 479333, 507867, 532103, 549556, 558835, 560183, 554814, 544612, 532372, 521035, 512125, 505543, 500851, 497972, 496878, 497895, 502467, 512344, 527668]
56779E27668J9232K2054K5416K9723L4007L7328L8886L7456L2308K4244J4513
56768H42835L370q857k0080k7672l1197l2398l2616l1571k8660k4172j9079j4404
56756E75499j0619p108k701K657P616J1455J5149J9318K2479K2937K1266J8953
56744F96901J5554R417Q01p893j4855k0108k4106k6951k8881k9842k8741k4842
56732E16454j9782j6221j4521j2661r567o409m151j959J090M452P204R192J0152
56719D63273R061N541R27l128o436r835j3588j6954j9024j9463j8819j8191j8182
56706C35182j8175j7189j5357j3657j2316j0625q509p066o945p308p052o299n842
56693A98842n757n421m688m211m441m907m851m376m352m979n139l965k424k068
$$ y = [527668, 546900, 568954, 594370, 624093, 658100, 695428, 734314, 771770, 804078, 828322, 842835, 846205, 837348, 817268, 789596, 758399, 726001, 693385, 661814, 633154, 608982, 589903, 575499, 564880, 557772, 555071, 557728, 565344, 576799, 591948, 611266, 633745, 656682, 677948, 696901, 712455, 721872, 722673, 714780, 699925, 679817, 655711, 628760, 599879, 570037, 541296, 516454, 496672, 480451, 465930, 453269, 443702, 437293, 433142, 431183, 432273, 436725, 443929, 453121, 463273, 472334, 477875, 478802, 475674, 469238, 459403, 445815, 428861, 409837, 390374, 371555, 353364, 335182, 317007, 299818, 284461, 270804, 258488, 247863, 239354, 232288, 225343, 218035, 210983, 204684, 198842, 193085, 187664, 182976, 178765, 174324, 169417, 164566, 160190, 155838, 150859, 145720, 141755, 139331, 137263]
56679A37263k453j715N6L22j880l713k452J85L21k505m994m920l386k027p72P41
56663A08071J868K207K491L186L630L339K788K200R43j048k574k729j985j100
56649A21287j91M89L01m89n16O36J593J299N63M16L67k62o57O4P94k08k441l527
56631A19518k370l40Q65J048R96J282J983K652K393Q01r40q53J427L755L647R58
56615A36822k067l180k090j14J467K322K589K228J291L61J01L53M40L49Q67K239
56599A43978L396L098J403n71j917k410k039q62O57J778K272K634L365M273M723
56584A63778M373L412K215J081K51j58l26n21n04L72K083L397L130J635K39n84
56568A83873j411k219j997n07Q77J051P06Q59R02l45k285l026k005n96k4j28m39
$$ y = [137263, 134810, 133095, 133151, 133473, 131593, 127880, 125428, 125613, 125934, 123429, 118435, 113515, 110129, 108102, 107330, 108071, 109939, 112146, 114637, 117823, 121453, 124792, 127580, 129780, 130723, 129675, 127101, 124372, 122387, 121287, 121096, 121585, 121886, 121397, 120881, 121517, 123110, 124409, 124972, 125388, 125755, 125493, 124836, 124900, 125694, 125486, 123045, 119518, 117148, 116808, 117673, 118721, 119717, 120999, 122982, 125634, 128027, 128828, 127888, 127035, 128462, 132217, 135864, 136822, 134755, 131575, 129485, 129371, 130838, 133160, 135749, 137977, 139268, 139629, 139730, 140083, 140523, 140872, 141739, 143978, 147374, 150472, 151875, 151304, 149387, 146977, 144938, 144076, 144733, 146511, 148783, 151417, 154782, 159055, 163778, 168151, 171563, 173778, 174859, 175110, 174952, 174626, 174105, 173601, 173973, 176056, 179453, 182583, 184218, 184457, 183873, 182462, 180243, 178246, 177739, 178616, 179667, 180373, 181232, 182134, 181789, 179504, 176478, 174473, 173877, 173853, 173725, 173286]
56551A73286j083k079k773k629j853q20L70J397J528M65j083k136k295j677n04
56536A58114R00K061K736L147L624M109M065K898O67j524k228j097P08J878K301
56521A82359K673L295L751L400J808p47k852k913j119N54J002J439L135N129N886
56506B06800N972O911Q196P953O299N459O315P239O978O383O446O634O341O166
56492C00092O533O551N598M720M999N644N087L224J191m73k055l397l658k468
56478C31588n81P28N48j179l644n580o044m970l287k508l603n764o999o583o099
56463B76023o920p758o445l488j606j906k802k941k857l069k810j784j223j852
56449B28562k429j657j02J038J712K202J882K93j486k049j509q21j12J074K498
$$ y = [173286, 172203, 170124, 167351, 164722, 162869, 162049, 162419, 163816, 165344, 165809, 164726, 162590, 160295, 158618, 158114, 159014, 161075, 163811, 166958, 170582, 174691, 178756, 181654, 182321, 180797, 178569, 177472, 178180, 180058, 182359, 185032, 188327, 192078, 195478, 197286, 196539, 193687, 190774, 189655, 190209, 191211, 192650, 195785, 200914, 206800, 212772, 219683, 227879, 235832, 242131, 247590, 253905, 261144, 268122, 274505, 280951, 287585, 293926, 300092, 306625, 313176, 318774, 323494, 328493, 334137, 339224, 342448, 343639, 343166, 341111, 337714, 334056, 331588, 331007, 331735, 332283, 331104, 327460, 321880, 315836, 310866, 307579, 305071, 301468, 295704, 288705, 282122, 276023, 269103, 261345, 254900, 251412, 249806, 247900, 245098, 242157, 239300, 236231, 233421, 231637, 230414, 228562, 226133, 224476, 224374, 225412, 227124, 229326, 231208, 231501, 230015, 227966, 226457, 225636, 225524, 226598, 229096]
56434B29096L433L677L348K205J92j768k375j084J657M672O286N341K534j30j573
56419B55511k296k612j999p51n05j927l428l357k014m23J254K718K789J376N95
56404B44931K000M089M561L719L322L311K297N60k06K11L72j59l66n5k37r13o92
56387B66745P61J921J759J231J550K476L177L643M188M450L791K276O76k04r0
56372B98350N82J003R15R15J455J876J187n65k275k871j862N28L095M095K906
56357C09334P18j029k130k742k348r25o6j093k750k583k86K117L075K716J523
56342C03531k38j705j834r72m98p27o50R3N79K77j88k77k41j70L28J067J219P19
56324C00313N68J257K070K416K677L204L477K961K023J451J512J805J677P73m31
$$ y = [229096, 232529, 236206, 239554, 241759, 241951, 240183, 237808, 236724, 238381, 243053, 249339, 254680, 257214, 257084, 255511, 253215, 250603, 248604, 247853, 247348, 245421, 241993, 238636, 236622, 236199, 237453, 240171, 242960, 244336, 244931, 246931, 251020, 255581, 259300, 262622, 265933, 268230, 268790, 268584, 268795, 269167, 269008, 268642, 268587, 268350, 267437, 266745, 267506, 269427, 271186, 272417, 273967, 276443, 279620, 283263, 287451, 291901, 295692, 297968, 298644, 298440, 298350, 298932, 299935, 300850, 301765, 303220, 305096, 306283, 305718, 303443, 300572, 298710, 299238, 302333, 306428, 309334, 310052, 309023, 306893, 304151, 301803, 300878, 300812, 299719, 296969, 294386, 294100, 296217, 299292, 302008, 303531, 303293, 301588, 299754, 298782, 298284, 297557, 296907, 297000, 297579, 297856, 297668, 297391, 297150, 296980, 297308, 298375, 299594, 300313, 300881, 302138, 304208, 306624, 309301, 312505, 315982, 318943, 320966, 322417, 323929, 325734, 327411, 328184, 327753]
56309C27753q72j84O76P51L93L73M98K61J39Q14J754K024J779J395N7k640m566
56292C30405l214L11K299J545N65J228K213J873R50Q29J347J874K630L476L192
56277C51523J571M44J010J831J198o6r5J076K160L042M502O227P119P115O947
56262C95604O595N741N303O460Q259Q162N296J647m45o20J33J085J980K545K752
56247D50497L162M226N398N498M156K517K187L614N793P521Q400Q495P793O597
56233E25854N849O082O514O104N139M669M787M879N228O658Q603R447R195R870
56219F18878J2369J4834J5372J4820J5207J6630J7470J7069J6539J7017J8368
56208G94573J9851K1132K2399K3947K5821K7866L0157L3146L6860M0278M2382
$$ y = [327753, 326881, 326697, 327373, 328124, 328517, 328890, 329388, 329649, 329788, 330602, 332356, 334380, 336159, 337554, 337611, 334971, 330405, 327191, 327502, 329801, 331346, 331911, 333139, 335352, 337225, 338175, 339004, 340351, 342225, 344855, 348331, 351523, 353094, 353538, 354548, 356379, 357577, 357511, 357416, 358492, 360652, 363694, 368196, 374423, 381542, 388657, 395604, 402199, 407940, 413243, 419703, 427962, 436124, 441420, 443067, 442622, 442002, 442135, 443220, 445200, 447745, 450497, 453659, 457885, 463283, 468781, 472937, 475454, 477641, 481255, 487048, 494569, 502969, 511464, 519257, 525854, 531703, 537785, 544299, 550403, 555542, 560211, 564998, 569877, 575105, 581763, 590366, 599813, 609008, 618878, 631247, 646081, 661453, 676273, 691480, 708110, 725580, 742649, 759188, 776205, 794573, 814424, 835556, 857955, 881902, 907723, 935589, 965746, 998892, 1035752, 1076030, 1118412]
56197A118412M3677M5638M8728N2324N6555O2467O9901P6957Q2523Q7796R4138
56186A839116J00846J06462J11059J15662J20092J23088J24136J23750J21988
56177B886199J17921J10729J00472Q7605P2282N4380L4163J2894p355k5047m0297
56166C403946n4175o7203p9236r0308j00261j07784j11370j11489j10239j08698
56156B463183j06260j02811r9461r6458r2402q6671q0719p5758p0975o5477o0360
56145A525831n6934n4302n0569m5568m0744l7013l4275l2332l0897k9186k6643
56134A087368k3621k0604j7716j5487j4786j5043j4137j1260q266o828n923l961
56122I29736j806j483k935m295m588m206l341j906n87j94l38j14M94J152K178
$$ y = [1118412, 1162089, 1207727, 1256455, 1308779, 1365334, 1427801, 1497702, 1574659, 1657182, 1744978, 1839116, 1939962, 2046424, 2157483, 2273145, 2393237, 2516325, 2640461, 2764211, 2886199, 3004120, 3114849, 3215321, 3302926, 3375208, 3429588, 3463751, 3476645, 3469290, 3444243, 3403946, 3349771, 3282568, 3203332, 3113024, 3012763, 2904979, 2793609, 2682120, 2571881, 2463183, 2356923, 2254112, 2154651, 2058193, 1965791, 1879120, 1798401, 1722643, 1651668, 1586191, 1525831, 1468897, 1414595, 1364026, 1318458, 1277714, 1240701, 1206426, 1174094, 1143197, 1114011, 1087368, 1063747, 1043143, 1025427, 1009940, 995154, 980111, 965974, 954714, 946448, 939620, 933697, 929736, 927930, 926447, 923512, 919217, 914629, 910423, 907082, 905176, 904589, 904395, 904057, 903943, 904437, 905589, 907767]
56107I07767L629M532M509M978O933Q863Q914P930Q097R650J1216J2494J4153
56094A013665J5849J6941J8410K1407K4527K5436K4824K5719K9002L2594L5379
56083A283753L8890M4350N0727N6747O2609O8679P4344P8972Q2447Q4082Q2662
56072B008262P8088P1650O4432N6870M9877M4631M0978L7556L3535K8625K1902
56061B536406J2762L046m225q483j1978j6367k1235k6369l2920m1361n0247n7853
56049B281176o3469o6572o6621o4164o0458n5592m8797m0900l4255k9706k5701
56038A724941k1138j6979j4182j2066r696p162m584j516J824M316N644O797Q313
56025A664512R611J0503J1674J3116J3814J3506J3145J3193J3234J3487J4797
$$ y = [907767, 911396, 915928, 920437, 925415, 932348, 941211, 950125, 958055, 966152, 975802, 987018, 999512, 1013665, 1029514, 1046455, 1064865, 1086272, 1110799, 1136235, 1161059, 1186778, 1215780, 1248374, 1283753, 1322643, 1366993, 1417720, 1474467, 1537076, 1605755, 1680099, 1759071, 1841518, 1925600, 2008262, 2086350, 2158000, 2222432, 2279302, 2329179, 2373810, 2414788, 2452344, 2485879, 2514504, 2536406, 2549168, 2552214, 2547989, 2539506, 2527528, 2511161, 2489926, 2463557, 2430637, 2389276, 2339029, 2281176, 2217707, 2151135, 2084514, 2020350, 1959892, 1904300, 1855503, 1814603, 1780348, 1750642, 1724941, 1703803, 1686824, 1672642, 1660576, 1650880, 1643718, 1639134, 1637618, 1639442, 1643758, 1649402, 1656199, 1664512, 1674123, 1684626, 1696300, 1709416, 1723230, 1736736, 1749881, 1763074, 1776308, 1789795, 1804592]
56014A804592J6863J8435J9590K1541K3920K4716K3522K2349K2479K3071K3774
56003B044852K6046L0379L4695L6973L7720L8404L9331M0362M1916M4003M5661
55992B460342M6403M6846M7331M7574M8063M9731N1743N1985N0525N0181N2617
55981C003341N6131N8339N8988N9230O0169O2903O7820P3141P6469P8429Q2215
55970C737175Q8824R5509R9840J02641J05839J10057J15351J21714J27981J32781
55960D837712J37223J43946J53097J62403J71455J82257J95036K07483K18913
55951F409525K31148K44551K57545K70878K87491L07016L25691L43017L62829
55942I039691L85874M07603M26160M46555M73195N03767N34343N65316N98260
$$ y = [1804592, 1821455, 1839890, 1859480, 1881021, 1904941, 1929657, 1953179, 1975528, 1998007, 2021078, 2044852, 2070898, 2101277, 2135972, 2172945, 2210665, 2249069, 2288400, 2328762, 2370678, 2414681, 2460342, 2506745, 2553591, 2600922, 2648496, 2696559, 2746290, 2798033, 2850018, 2900543, 2950724, 3003341, 3059472, 3117811, 3176799, 3236029, 3296198, 3359101, 3426921, 3500062, 3576531, 3654960, 3737175, 3825999, 3921508, 4021348, 4123989, 4229828, 4339885, 4455236, 4576950, 4704931, 4837712, 4974935, 5118881, 5271978, 5434381, 5605836, 5788093, 5983129, 6190612, 6409525, 6640673, 6885224, 7142769, 7413647, 7701138, 8008154, 8333845, 8676862, 9039691, 9425565, 9833168, 10259328, 10705883, 11179078, 11682845, 12217188, 12782504, 13380764]
55933A3380764O32011O66010P02829P43382P84372Q24251Q66835R15243R67518
55924B0483215J021971J081087J146092J213754J283087J359022J444941J538116
55916C0571285J637125J746438J868760K001111K144384K308109K498950K713358
55908D7489520K948907L213705L517260L863135M260336M731328N298460N972656
55900H1295307O764059P688731Q751970R940540J1247131J2688063J4283124J6037732
55892A68696657J7959475K0059033K2300704K4567935K6673004K8289998K8765718
55885C37312524K7092219K2371353J4566662M830310n012908j3398229j9582251
55878C68179680k3552347k5647512k6297136k5921048k4865481k3363172k1564653
$$ y = [13380764, 14012775, 14678785, 15381614, 16124996, 16909368, 17733619, 18600454, 19515697, 20483215, 21505186, 22586273, 23732365, 24946119, 26229206, 27588228, 29033169, 30571285, 32208410, 33954848, 35823608, 37824719, 39969103, 42277212, 44776162, 47489520, 50438427, 53652132, 57169392, 61032527, 65292863, 70024191, 75322651, 81295307, 88059366, 95748097, 104500067, 114440607, 125687738, 138375801, 152658925, 168696657, 186656132, 206715165, 229015869, 253583804, 280256808, 308546806, 337312524, 364404743, 386776096, 401342758, 406173068, 401160160, 387761931, 368179680, 344627333, 318979821, 292682685, 266761637, 241896156, 218532984, 196968331]
55871A96968331j9598004j7584029j5619533j3777849j2117553j0669838r425825
55864I8175700q355114p432882o640161n951992n344086m805793m333270l915641
55856E1396761l539840l203053k908157k651040k423002k221268k046604j893833
55848C0509964j754442j626006j510574j406139j307803j215171j131035j054463
55840A9504331r81940r13606q52075p96610p44102o94365o49247o08219n69636
55831A2694531n34433n03911m75794m47070m18821l93888l71862l50670l30988
55822H867094l14520k99767k83950k67598k53257k41228k30427k21710k16359
55813F538278k12768k08338k03347j99596j96742j93116j88527j83295j76475
$$ y = [196968331, 177370327, 159786298, 144166765, 130388916, 118271363, 107601525, 98175700, 89820586, 82387704, 75747543, 69795551, 64451465, 59645672, 55312402, 51396761, 47856921, 44653868, 41745711, 39094671, 36671669, 34450401, 32403797, 30509964, 28755522, 27129516, 25618942, 24212803, 22905000, 21689829, 20558794, 19504331, 18522391, 17608785, 16756710, 15960100, 15215998, 14521633, 13872386, 13264167, 12694531, 12160098, 11656187, 11180393, 10733323, 10314502, 9920614, 9548752, 9198082, 8867094, 8552574, 8252807, 7968857, 7701259, 7448002, 7206774, 6976347, 6754637, 6538278, 6325510, 6117172, 5913825, 5714229, 5517487, 5324371, 5135844, 4952549, 4776074]
55804D776074j67939j59917j53478j46141j36325j27204j22104j18878j13434
55795C530654j06383j01327r8328r4399q9300q5846q4850q4215q2760q0949p8265
55784B544032p3807o9170o6979o6684o5342o2261n9365n7315n4870n1867m9382
55773A866990m6940m3011l8342l5547l5171l5133l4225l3343l2961l2253l0933
55762A469131k9621k8332k6731k5593k5761k6145k5154k3434k2671k2427k0988
55751A192274j8715j7560j7678j7475j6646j6175j5677j3801j1058r334q746p952
55739A021457p145p573q301p010l983j983j909k039j783k547m175m310k427j124
55725I65148k035l536m048m662o777r623j1834j3408j4595j4798j3992j3411j3575
$$ y = [4776074, 4608135, 4448218, 4294740, 4148599, 4012274, 3885070, 3762966, 3644088, 3530654, 3424271, 3322944, 3224616, 3130217, 3040917, 2955071, 2870221, 2786006, 2703246, 2622297, 2544032, 2470225, 2401055, 2334076, 2267392, 2202050, 2139789, 2080424, 2023109, 1968239, 1916372, 1866990, 1820050, 1777039, 1738697, 1703150, 1667979, 1632846, 1598621, 1565278, 1532317, 1500064, 1469131, 1439510, 1411178, 1384447, 1358854, 1333093, 1306948, 1281794, 1258360, 1235689, 1213262, 1192274, 1173559, 1155999, 1138321, 1120846, 1104200, 1088025, 1072348, 1058547, 1047489, 1038155, 1029409, 1021457, 1014312, 1006739, 998438, 991428, 987445, 985462, 983553, 981514, 979731, 977184, 973009, 968699, 966272, 965148, 963113, 959577, 955529, 950867, 944090, 934467, 922633, 909225, 894630, 879832, 865840, 852429, 838854]
55712H38854j3351j1958j0233r017q078p503q212j0151j1811j2378j2608j2898
55700G10656j2478j1300j0513j0176q772o098m285m573n294m769l990m530n603
55687F18275n554m866n259o596o939n664m596n633q220r786q458n288l479m918
55673E33019p931r311q147o372n852o632p881q764q357o511n008n834q111q917
55659D29391p447n936n822n682m150k326j618j324k26J283K470L886N793O500
55645D14792M511J081j462k957m769o674o866m968k973k798m355o314p659q044
55631C60545p504o274m752l464k969l317l539k466k84J510J992J778J767J895
55617C34918J661J011J72o50j104j032j140k267l841m282l237k005j349m77J155
$$ y = [838854, 825503, 813545, 803312, 794295, 786217, 778714, 770502, 760351, 748540, 736162, 723554, 710656, 698178, 686878, 676365, 666189, 657417, 651319, 647034, 642461, 637167, 632398, 628408, 623878, 618275, 612721, 607855, 602596, 596000, 589061, 583397, 578801, 573168, 564948, 555162, 546704, 541416, 537937, 533019, 525088, 515777, 507630, 501258, 495406, 488774, 480893, 472129, 463772, 457261, 452253, 446419, 438308, 429391, 421944, 416008, 410186, 404504, 400354, 398028, 396410, 395086, 394860, 396143, 398613, 402499, 408292, 414792, 419303, 420384, 418922, 415965, 411196, 404522, 397656, 392688, 389715, 386917, 382562, 376248, 368589, 360545, 353041, 346767, 342015, 338551, 335582, 332265, 328726, 326260, 325976, 327486, 329478, 331256, 333023, 334918, 336579, 337590, 337762, 337112, 336008, 334976, 333836, 331569, 327728, 323446, 320209, 318204, 316855, 316378, 317533]
55602C17533K604K915K489K088J693J170P97L36r56k603k753q38J187J498Q05
55587C27965P06J064P82j1l76l94r05j900k584k622k164j204r8j9j670m034n484
55570C07052n715n708o285p510q818r143p714n364l961l849l279j216Q11J029
55556B40330m9r01j472k478l451l409k621j921j013O51K113J850J6j964l506m798
55540B17377n334m410k715j602j118l72N62R59J117J811K390J452o61k083k091
55525B05282j656j320n27P78J784K327L046L725L390K377K403M012N761O647P542
55510B45571R279J0887J0850Q995O176L116L88j381k102k447l000l855n082o546
55496B70849p206n933l501k339l660n998p240o878n641m225l220l113l386k720
$$ y = [317533, 320137, 323052, 325541, 327629, 329322, 330492, 331289, 331625, 330669, 328066, 325313, 324475, 325662, 327160, 327965, 328671, 329735, 330517, 330506, 330130, 329736, 328831, 326931, 324347, 321725, 319561, 318357, 318259, 318240, 316570, 312536, 307052, 301337, 295629, 289344, 281834, 273016, 263873, 256159, 250795, 246834, 242985, 239706, 238490, 239301, 240330, 240281, 239380, 237908, 235430, 231979, 228570, 225949, 224028, 223015, 223666, 225779, 227629, 227645, 225681, 222175, 217377, 212043, 207633, 204918, 203316, 202198, 201826, 202388, 203347, 204464, 206275, 208665, 210117, 209456, 207373, 205282, 203626, 202306, 201779, 202557, 204341, 206668, 209714, 213439, 216829, 219206, 221609, 225621, 231382, 238029, 245571, 254850, 265737, 276587, 285582, 291758, 294874, 295262, 293881, 291779, 289332, 286332, 282477, 277395, 270849, 263643, 257710, 254209, 251870, 248210, 242212, 234972, 228094, 222453, 218228, 215008, 211895, 208509, 205789]
55482B05789j090l82j744l534l478j926j104j665k015j108n1k48j387k158k006
55467A81893j282l79M27O77J42o30r39q85j093j572j690j314j142j553j951j828
55451A66881j662k076k694k790k536k533k479j585k64M3j046k236k392j800j139
55436A39692m17M42J044J318J780K411K298J095k75j044j514j830j343j76J48
55421A43629r60j748p59N81J03j539j840k56J341J737J469J002P5r05r48k80k23
55404A40479j039j716k102l123m486m345k078N29J822K184K509K522J876J333
55390A34365J543J919J877J921K213J579n21k244j580M69J001p77k639k639j467
55375A35020q53j049j047m75q3l79p47l11Q47J867K331K612K964K991K505K176
$$ y = [205789, 204699, 204317, 202573, 199039, 195561, 193635, 192531, 190866, 188851, 187743, 187692, 187444, 186057, 183899, 181893, 180611, 180232, 180659, 181336, 181478, 180848, 179909, 179024, 177931, 176359, 174669, 173355, 172213, 170660, 168709, 166881, 165219, 163143, 160449, 157659, 155123, 152590, 150111, 148526, 148262, 148305, 147259, 145023, 142631, 140831, 139692, 139275, 139717, 140761, 142079, 143859, 146270, 148568, 149663, 149388, 148344, 146830, 145000, 143657, 143481, 143629, 142669, 140921, 140162, 140743, 140846, 139307, 137467, 137211, 138552, 140289, 141758, 142760, 142835, 141930, 140982, 140702, 140479, 139440, 137724, 135622, 132499, 128013, 123668, 121590, 122119, 123941, 126125, 128634, 131156, 133032, 134365, 135908, 137827, 139704, 141625, 143838, 145417, 144896, 142652, 141072, 141541, 142542, 141765, 139126, 136487, 135020, 134167, 133118, 132071, 131596, 131513, 131134, 130387, 130076, 130923, 132790, 135121, 137733, 140697, 143688, 146193, 148369]
55359A48369K573L067K683J729J483K231K783K172Q32k60p99j092j555k634m474
55344A57108o113n841l073N26K376J385j312l656m258l014p95J229K209J993J179
55329A39943O27M83j78k107m316m638k275J045L027L119K254J306O73M93K91p34
55313A39013k167k229m47R95L04q70N6K085J779j337l836l530k364k782l884l283
55297A17503q65J496K710L038K590J106q86k060j576J31J694J822N35m65L84K271
55281A29428K673N53k398m092m233l602k562j250j37N27R57J019K30r41j155j69
55265A14848P18R38J684L569M949M031J357j299l249m568m663l076r23K40M32
55250A14988P02J169J246J201J755K474K297J385Q46O96p8j377j606KK073K840
$$ y = [148369, 150942, 154009, 156692, 158421, 159904, 162135, 164918, 167090, 167922, 167662, 166863, 165771, 164216, 161582, 157108, 150995, 145154, 142081, 142607, 144983, 146368, 145056, 141400, 137142, 134128, 133333, 134562, 136771, 138764, 139943, 140570, 141053, 140875, 138768, 134452, 129814, 127539, 128584, 131611, 134730, 136984, 138290, 138963, 139456, 139747, 139013, 136846, 134617, 134170, 135165, 135469, 134599, 134655, 136740, 138519, 137182, 133346, 129816, 127452, 124670, 120786, 117503, 116638, 118134, 120844, 123882, 126472, 127578, 126692, 124632, 123056, 123187, 124881, 126703, 127238, 126773, 127157, 129428, 132101, 132654, 130256, 126164, 121931, 118329, 115767, 114517, 114380, 114907, 115864, 116883, 117113, 116172, 115017, 114848, 115566, 116504, 118188, 121757, 126706, 130737, 132094, 130795, 127546, 122978, 118315, 115239, 114316, 114556, 114988, 115690, 116859, 118105, 119306, 121061, 123535, 125832, 127217, 128063, 128759, 128681, 127304, 125698, 125700, 127773, 130613]
55234A30613K252J581J577J670Q40j039k814l099j810k74M23O51J364K596L515
55219A38046L558K771J342m90k164l020k839j849m79P23J268J062L09q82k192
55204A35164k672j584K86J365J392J437J670R60o82j320j7J324P48p34q79K82
55188A36740P72k05j604k511k794k138l79J296J332L2p75l43L30N13P23J360J776
55171A34125J300J53j056j926k117j494n27N8On73j601k573k341m98J510J907
55155A24353R23K34N38J040J136J024O98r1p43j96J339K330J905P02m59j442k034
55138A31257j692n52L30K83k16l68oM93N58k31j461j903j043j01l67j066n10J135
55120A24540K086J844J685K038J617Lj061j96J400J795J028M65M51K13l65n17
$$ y = [130613, 132865, 134446, 136023, 137693, 138533, 137494, 134680, 131581, 129771, 129497, 129920, 130571, 131935, 134531, 138046, 141604, 144375, 145717, 145227, 143063, 140043, 137204, 135355, 134876, 135599, 136867, 137929, 138238, 137356, 135164, 132492, 130908, 131194, 132559, 133951, 135388, 137058, 138018, 137336, 136016, 135999, 137323, 138071, 137337, 136458, 136740, 137512, 137307, 135703, 133192, 130398, 128260, 127881, 129177, 130509, 130541, 129766, 129423, 129753, 130266, 130989, 132349, 134125, 135425, 135578, 134522, 132596, 130479, 128985, 128458, 128516, 128522, 127949, 126348, 123775, 121434, 120936, 122446, 124353, 125276, 125510, 126048, 127088, 128224, 129248, 129946, 129855, 129112, 128916, 130255, 132585, 134490, 135192, 134733, 133291, 131257, 129565, 129013, 129343, 129626, 129410, 129042, 129036, 129529, 130087, 129856, 128395, 126492, 125449, 125348, 124981, 123915, 123405, 124540, 126626, 128470, 130155, 132193, 133810, 133813, 132752, 132556, 133956, 135751, 136779, 137244, 137695, 137908, 137543, 137026]
55104A37026p6O4p14j703j665m48O99N61m37o73M89J747J618L40q58j530j936
55087A32504j852r98p4J02J08Q54J438K21k028k404J05L030L727K374P19l48q27
55070A36651o91j44K56N32J218J864J214n12j345m74N50O60J089K753L879K601
55054A50101J92q49o79j354k909l208j588j4l6p89p85j4N98O73N09N97J407K869
55036A44721L938L453J524n24j585j427l30R63J282K00j023q31M87J353J350J411
55020A54962J635P98j323k939k587j119k53k22q5M66R26J068J050P41n5r19j271
55003A50873j247j275j097k35P17N79m61o67P85K221J377j589m064l921j583R27
54987A41340K209K336K079J929J780J229J22j078j662j530j390j906k803l140
$$ y = [137026, 136950, 137014, 136300, 134597, 132932, 132484, 133183, 133744, 133307, 132634, 133123, 134870, 136488, 136828, 135970, 134440, 132504, 130652, 129654, 129580, 129682, 129790, 130644, 132082, 132303, 130275, 127871, 127976, 131006, 134733, 137107, 137826, 137478, 136651, 135960, 135816, 136072, 136604, 137822, 139686, 140900, 140388, 139043, 138569, 139119, 139779, 140868, 143621, 147500, 150101, 150293, 149444, 148765, 147411, 144502, 141294, 139706, 139692, 139656, 138867, 138082, 138068, 138666, 139339, 139848, 140445, 141852, 144721, 148659, 152112, 153636, 153112, 151527, 150100, 149770, 150733, 152015, 152215, 151192, 150361, 150848, 152201, 153551, 154962, 156597, 157395, 156072, 153133, 150546, 149427, 149174, 148952, 148867, 149333, 150259, 151327, 152377, 153118, 153063, 152144, 150873, 149626, 148351, 147254, 147019, 147736, 148315, 147854, 147187, 147972, 150193, 151570, 149981, 145917, 141996, 140413, 141340, 143549, 145885, 147964, 149893, 151673, 152902, 153024, 151946, 150284, 148754, 147364, 145458, 142655, 139515]
54973A39515k392r66K92R11J075J271J695K087K219K306K560K479J369l85j376
54958A52660q64L51J248J763J947J049j222l246k965o45J349J588R51P47J025
54943A55736J301J537J575P35j030k431k253r27J04J12n15j080j138o49n7J04
54927A51124Q7Q66K713M394M334K259o34k683k628l92K401L418J905l90j200j32
54911A65442J432K256K198J731J321J217J246R48K42m31q34j273j747j564m41
54896A71743O68O85k11j034j345j263p13K46P10k78k267l615l258j590L48J830
54880A60656K721L446M519N544N041K215j491l631l473k388j578p82M71J554J586
54865A74410Q88P21J783L460M471M011K499J256J260K200L100L701M630O164P554
$$ y = [139515, 137123, 136157, 136449, 137360, 138435, 139706, 141401, 143488, 145707, 148013, 150573, 153052, 154421, 154036, 152660, 151796, 152147, 153395, 155158, 157105, 158154, 156932, 153686, 150721, 150076, 151425, 153013, 153964, 154711, 155736, 157037, 158574, 160149, 160884, 159854, 157423, 155170, 154243, 154347, 154459, 153944, 152864, 151726, 151077, 151020, 151124, 151211, 152077, 154790, 159184, 163518, 165777, 165143, 162460, 159832, 159440, 161841, 165259, 167164, 166774, 165574, 165442, 166874, 169130, 171328, 173059, 174380, 175597, 176843, 177791, 178033, 177602, 176768, 175495, 173748, 172184, 171743, 172411, 173096, 172885, 171851, 170506, 169243, 168530, 168776, 169486, 169208, 166941, 163326, 160068, 158478, 158826, 160656, 163377, 166823, 171342, 176886, 181927, 184142, 182651, 179020, 175547, 173159, 171581, 170799, 171270, 172824, 174410, 175298, 176019, 177802, 181262, 185733, 189744, 192243, 193499, 194759, 196959, 200059, 203760, 208390, 214554, 222108]
54850B22108P948P466O925O770O610N636L342N4l096n054n876o524p476q011p228
54835B23594n441l875l161k740j906q16m2M10J015J715J737N83j083k007j552
54820B06431j94J005J279P94M93J079K039K274J788J876L194M612M929M783N469
54805B41851O489O052L833J475J13r59k603m413n597n915n104k927o41p12l737
54790B27205o994p567n789m000l158k559k137k642l745m028l106j974j062K74
54776A78718J899K384J200j06m9N96R8j582k777k589j969k050k402j794k64N11
54760A69824p15l019m324l784k265o28J144K820L361K480J676K327L522L252J321
54745A76992m03n75J88O69N65K95K58O52J241J276L13q47j015l84l09j236k026
$$ y = [222108, 230056, 237522, 244447, 251217, 257827, 263463, 266805, 266859, 263763, 258709, 252833, 246309, 238833, 230822, 223594, 218153, 214278, 211117, 208377, 206471, 205655, 205613, 206023, 207038, 208753, 210490, 211073, 209990, 207983, 206431, 206237, 207242, 208521, 209315, 209808, 210887, 212926, 215200, 216988, 218864, 222058, 226670, 231599, 236382, 241851, 248340, 254392, 258225, 259700, 259813, 258854, 256251, 251838, 246241, 240326, 235222, 232295, 231654, 230942, 227205, 220211, 212644, 206855, 202855, 199697, 197138, 195001, 192359, 188614, 184586, 181480, 179506, 178444, 178718, 180617, 183001, 184201, 184095, 184046, 184642, 184740, 183158, 180381, 177792, 175823, 173773, 171371, 169577, 169313, 169824, 169109, 166090, 161766, 157982, 155717, 155089, 156233, 159053, 162414, 164894, 166570, 168897, 172419, 175671, 176992, 176589, 176014, 176202, 176871, 177436, 177731, 177989, 178641, 179882, 181158, 181471, 180624, 179609, 179225, 178916, 177680, 175654]
54728A75654j751q27K07J708L765N114M555K733J250M15p29k179k462r53O47L90
54712A87537j041j070J138L427L755L178M172O739Q216P038M715L321K873K564
54698B36562K988N165Q097R383Q192N920L862J854m25k454l705m382m699m512
54684B61846m212m856o580p754o796m270k278k033k832l312k920k005j034j34
54670B10830O86J249J369J149P95K81l76n04O80K725M001L672K719K269J965J115
54654B34625N41J527L469M415L961L655M201M091J955j159l129l459l500m463
54640B46730o126p356p343o355n481n365n311m119j872j12j06j542l041l355k088
54625A87158k9J122K77j647k633j973q67n06o57n39m0M05L95l65j748k721k164
$$ y = [175654, 173903, 173076, 173283, 174991, 178756, 183870, 188425, 191158, 192408, 192823, 192094, 189915, 187453, 186500, 187147, 187537, 186496, 185426, 186564, 189991, 193746, 196924, 201096, 207835, 216051, 223089, 227804, 231125, 233998, 236562, 239550, 244715, 252812, 262195, 270387, 276307, 280169, 282023, 281598, 279144, 275439, 271057, 266358, 261846, 257634, 252778, 246198, 238444, 231648, 227378, 225100, 223067, 220235, 216923, 214003, 211998, 210964, 210830, 211516, 212765, 214134, 215283, 216078, 216359, 215983, 215479, 216159, 218884, 222885, 226557, 229276, 231545, 233510, 234625, 235166, 236693, 240162, 244577, 248538, 252193, 256394, 260485, 262440, 261281, 258152, 254693, 251193, 246730, 240604, 233248, 225905, 219550, 214069, 208704, 203393, 199274, 197402, 197290, 197184, 195642, 192601, 189246, 187158, 187129, 188251, 188528, 186881, 184248, 182275, 181408, 180902, 180245, 179706, 179666, 180071, 180466, 180101, 178353, 175632, 173468]
54608A73468m33R09J137J015J058O69m03j166r38n71r97j643j430m85K81N90P55
54591A71816R07J192J885K515J866q7j446r33k5p55k426k654j114J27J4l12j05
54574A70465m60k047l323k595n92O48O66Q00J877L095L268K132J86j794k816j997
54558A67513L96K662L034J480l51r34k42P64J449J747J606R74K97K90J039J928
54542A83652K481K613J991J39k308l445k098N54K211J996R67M32N78P58M45k08
54526A90758m95J43J296J866J351L99l25j043k030k680k354j572j198r20J18J402
54510A84716J386p4j208p76L32P87Q35J469K434K455J148n21j608k025j916j164
54494A86270J36J476K560L614M709N229M552K934J318M09L77J066J974K139R04
$$ y = [173468, 173035, 173944, 175081, 176096, 177154, 177823, 177420, 176254, 175316, 174745, 173748, 172105, 170675, 170190, 170471, 171061, 171816, 172723, 173915, 175800, 178315, 180181, 180094, 178648, 177715, 177690, 176935, 174509, 171855, 170741, 170868, 170882, 170570, 170465, 170005, 167958, 164635, 162040, 161448, 162096, 162762, 163562, 165439, 168534, 171802, 173934, 174120, 172326, 169510, 167513, 167909, 170571, 173605, 175085, 174734, 173800, 173558, 174322, 175771, 177518, 179124, 180098, 180395, 180685, 181724, 183652, 186133, 188746, 190737, 190876, 188568, 185123, 183025, 183579, 185790, 187786, 188753, 189185, 189763, 190521, 190966, 190758, 190263, 190406, 191702, 193568, 194919, 195318, 194993, 193950, 191920, 189240, 186886, 185314, 184116, 183196, 183314, 184716, 186102, 186028, 184820, 184044, 184376, 185163, 185998, 187467, 189901, 192356, 193504, 192983, 191375, 189350, 187434, 186270, 186406, 187882, 190442, 194056, 198765, 203994, 208546, 211480, 212798, 213207, 213584, 214650, 216624, 218763, 219667]
54479B19667j052k093j399J52J252J708K092K436K220J488J026J147J126K97q90
54464B29177j402r54k92k20p58j319j499j469j547j593j187m50j87q21j537j113
54448B12829O01K497L423L085J867L89q11j591k197k600k155o21Q87R57k56j252
54432B15052j356j452k207k745j839L41K408L274K938K165J783J941J936J176
54418B23415L14O35K121L104K191j11k095k421q05J933M053M122K600J367J175
54403B41598P74p24j883p22K220M181L366P27j520k224j849j288o93L91J772K206
54387B46332R22r14j461p66n37j303j621p26j8p67j940j892r23m65p23p22q9P62
54369B33149J593K200J948P50k50k10Q7k47n00J11M17r72k857k867j125Q0K1K10
$$ y = [219667, 218615, 216522, 215123, 215275, 216527, 218235, 220327, 222763, 224983, 226471, 227497, 228644, 229770, 230067, 229177, 227775, 226821, 226529, 226309, 225551, 224232, 222733, 221264, 219717, 218124, 216937, 216487, 216300, 215479, 213942, 212829, 213430, 215927, 219350, 222435, 224302, 224691, 223880, 222289, 220092, 217492, 215337, 214716, 215603, 216560, 216304, 215052, 213696, 212244, 210037, 207292, 205453, 205794, 208202, 211476, 214414, 216579, 218362, 220303, 222239, 223415, 223729, 224364, 226485, 229589, 231780, 231669, 229574, 227153, 226348, 228281, 232334, 236456, 239056, 240423, 241598, 242372, 241648, 239765, 239043, 241263, 245444, 248810, 249537, 248017, 245793, 243944, 242656, 241963, 242354, 244126, 246332, 247254, 246340, 244879, 244113, 243576, 242273, 240652, 239926, 239908, 239141, 237201, 235309, 234386, 233921, 233198, 232476, 232387, 233149, 234742, 236942, 238890, 239640, 239390, 239180, 239267, 239020, 238520, 238631, 239048, 238076, 235219, 232352, 231227, 231307, 231328, 231538]
54351B31538J141J263j15j367j135k31J66L37R09J538J809J966J862P97o48m94
54335B39336J660L319K430M96L50K011K974K020N50K8K7o17j914k677j863L12
54319B48442K421L018K085R22M79M32K04O0M26Q73P16J72k0J85J77k79p75r52
54301B58586p98l59K92Q87J154J110Q65M86K65O49J460J750R37l32j034r96o83
54284B64239k63M19J194J638J630J425J353J760K665L170J971q13l115l251k166
54269B71856k084l352m112l118j354m28p03j584k580l202k790j456n65j173k333
54254B41022k119k00J725K209J542N85o25k076k600j048J586K731J255j267k689
54239B40031k570j675m72P55J155J12j559k387k026j236l63Q82K229K727K070
$$ y = [231538, 232679, 233942, 233827, 232460, 231325, 231094, 231260, 231597, 232506, 234044, 235853, 237819, 239681, 240478, 239830, 239336, 240996, 244315, 246745, 247241, 247591, 249602, 252576, 254596, 255146, 255174, 255201, 254584, 252670, 249993, 248130, 248442, 250863, 253881, 255966, 256888, 257367, 257799, 258003, 258063, 258489, 259362, 260078, 260250, 260230, 260415, 260592, 260313, 259538, 258586, 257788, 257429, 257721, 258608, 259762, 260872, 261737, 262223, 262488, 263137, 264597, 266347, 267284, 266952, 265918, 264922, 264239, 263976, 264395, 265589, 267227, 268857, 270282, 271635, 273395, 276060, 279230, 281201, 280388, 277273, 274022, 271856, 269772, 266420, 262308, 259190, 257836, 257408, 256705, 255121, 252541, 249339, 246549, 245093, 244528, 243355, 241022, 238903, 238703, 240428, 242637, 244179, 244764, 244139, 242063, 239463, 238415, 240001, 242732, 243987, 242720, 240031, 237461, 235786, 235314, 236069, 237224, 237336, 235777, 233390, 231364, 230128, 229765, 230647, 232876, 235603, 237673]
54224B37673J010K37j69j66K73N19j61j266j643j448j905k774k114M24K249J357
54208B32096m89k48J909L059J947L85Q3M42K33k80p6Q92J738J822J137O1p56o72
54190B43283K64J201J353P32m6l53j6L95j53j888l403l034j105K32k24j288j361
54173B34589p85j024k253l176l085k659k505k105r48K29L29l35k46J269L027L452
54157B23774K473J390J081J106P22J06P0P23J150N37p80j840k301k570k728k105
54141B20808m21J213J278j54j292p73O44J098o5j680k256j501k08Q01J267J253
54125B20012Q24J79j25M81J742K486J818K58r44j440j925k647k851k117j182p47
54109B13822l21P83K086K589K284J930J742J374Q51M99J80l61p24m50pr4l82k46
$$ y = [237673, 238683, 238920, 238751, 238585, 238858, 239377, 239216, 237950, 236307, 234859, 232954, 230180, 228066, 228490, 230739, 232096, 231607, 231359, 233268, 236327, 238274, 238659, 238742, 239184, 239417, 239137, 239061, 239953, 241691, 243513, 244650, 244711, 243955, 243283, 243547, 244748, 246101, 246833, 246787, 246434, 246418, 246813, 246660, 244772, 241369, 238335, 237230, 237462, 237238, 235950, 234589, 233804, 232780, 230527, 227351, 224266, 221607, 219102, 216997, 216049, 216278, 216607, 216272, 216026, 217295, 220322, 223774, 226247, 227637, 228718, 229824, 230546, 230652, 230722, 231445, 232595, 233132, 232352, 230512, 228211, 225641, 222913, 220808, 220387, 221600, 222878, 222724, 221432, 220659, 221303, 222401, 222336, 220656, 218400, 216899, 216691, 217492, 218759, 220012, 220836, 221015, 220890, 221371, 223113, 225599, 227417, 227675, 226731, 225291, 223366, 220719, 217868, 215751, 214569, 213822, 213501, 214284, 216370, 218959, 221243, 223173, 224915, 226289, 227140, 227639, 227819, 227458, 226734, 226284, 226277, 226183, 225801, 225555]
54091B25555k25j086j911j075Q73J591N51J1J459L325L485K227J111L61p78k075
54075B33399k455j652l88P03J310J197P04Q34J918K895K792K128J760J302o3j814
54059B44570k542j720m2J457J749K06k183k932q36K136L084J560p08k443l293
54044B38063k622k07K258K642J320M56M50m05k500l771k876j205m49k25N82J758
54028B33269K591L289M054M025K671J262J277K114J976N22q23q89J64J621K774
54013B59897K940K030J167J656L312M626M645L860L136K633J986R73l05j462j946
53998B89148j484m34O22J600K738L872M482M563M801N558O151N731M709M589O220
53983C42866Q544R612Q733P129O372O747P639Q879J0855J3374J5386J6148J5897
$$ y = [225555, 225330, 224244, 222333, 221258, 222131, 223722, 224273, 224284, 225743, 229068, 232553, 234780, 235891, 236252, 235474, 233399, 230944, 229292, 228904, 229607, 230917, 232114, 232818, 233652, 235570, 238465, 241257, 243385, 245145, 246447, 246384, 244570, 242028, 240308, 240266, 241723, 243472, 243678, 241495, 238563, 237727, 239863, 242947, 244507, 243799, 241356, 238063, 235441, 235234, 237492, 240134, 241454, 241910, 242360, 241955, 239455, 235684, 232808, 231603, 231154, 230929, 231511, 233269, 235860, 239149, 243203, 247228, 249899, 251161, 252438, 254552, 256528, 257050, 256227, 255338, 255502, 257123, 259897, 262837, 264867, 266034, 267690, 271002, 275628, 280273, 284133, 287269, 289902, 291888, 292861, 292556, 291094, 289148, 287664, 287230, 287852, 289452, 292190, 296062, 300544, 305107, 309908, 315466, 321617, 327348, 332057, 336646, 342866, 351410, 361022, 369755, 376884, 383256, 390003, 397642, 406521, 417376, 430750, 446136, 462284, 478181]
53970D78181J5037J3409J0949Q401O499M731J915j851m717n080l544k257k441
53957E19232l329l628l391l766n307p280q688r224r065q466q000q365r334r491
53943D21898p889n447l849l495l557l663m175m902m986m394m131m469m246k699
53929C59996r19m41j236k100k407k379k179j833j772k343k883k387j108m38r90
53914C34581j758j632q85n65r69j430j306n17O83J905K568K280J451J098J708
53899C37212K667L152L208L413L786L859L783M399N784O630N907M398L735M264
53885C96197M915M904M486M067L760L940N084O692P434O971O688P856R900J1175
53871D84069J0918R645Q205P242P135P617P725O940O059O253P452Q441Q385P579
$$ y = [478181, 493218, 506627, 517576, 525977, 532476, 537207, 539122, 537271, 532554, 527474, 523930, 521673, 519232, 515903, 512275, 508884, 505118, 499811, 492531, 483843, 474619, 465554, 457088, 449088, 440723, 431389, 421898, 414009, 408562, 404713, 401218, 397661, 393998, 389823, 384921, 379935, 375541, 371410, 366941, 362695, 359996, 359077, 358636, 357400, 355300, 352893, 350514, 348335, 346502, 344730, 342387, 339504, 337117, 336009, 335571, 334581, 332823, 331191, 330306, 329741, 328772, 327342, 326036, 325519, 326202, 328107, 330675, 332955, 334406, 335504, 337212, 339879, 343031, 346239, 349652, 353438, 357297, 361080, 365479, 371263, 377893, 383800, 388198, 391933, 396197, 401112, 406016, 410502, 414569, 418329, 422269, 427353, 434045, 441479, 448450, 455138, 462994, 472894, 484069, 494987, 504632, 512837, 520079, 527214, 534831, 542556, 549496, 555555, 561808, 569260, 577701, 586086, 593665]
53857E93665O902P195Q917J1598J3724J4022J2853J1584J0644R204O913M788L802
53844G15811L442K494Q32l09J84J978L432K934L57k688m324m227l647l662m140
53829G08467m620n254o102o224m645j936L15J662L221N591P445O857L286k450
53815G05613r343j6295k1632k3902k3387k1878k0793k0233j9807j9307j8224j5837
53803D74975j2520r995r278r239q241o574n845o340o579n693m645m439m450l555
53789C77582j997j048j234j885k209j952j231n17o59k107m006m772l784j981o96
53774C47504l88o30q12o05j98k42j056j769j009J181K796K104p0j247l27J366
53758C46598K294K731L799N396O261N881N144M930N043N030N188O016P093P418
$$ y = [593665, 600567, 607762, 616679, 628277, 642001, 656023, 668876, 680460, 691104, 700308, 707221, 712009, 715811, 719253, 721747, 722579, 722270, 722454, 724432, 727864, 730798, 731155, 728467, 724143, 719916, 716269, 712607, 708467, 703847, 698593, 692491, 686267, 681622, 679686, 680001, 681663, 684884, 690475, 697920, 704777, 708063, 705613, 696270, 679975, 658343, 634441, 611054, 589176, 568383, 548150, 528343, 509036, 490812, 474975, 462455, 452460, 443182, 433943, 425702, 419128, 413283, 406943, 400364, 394671, 390026, 385587, 381137, 377582, 375585, 374537, 373303, 371418, 369209, 367257, 366026, 365509, 364850, 362743, 358737, 353965, 350181, 348200, 347504, 347116, 346486, 345674, 345069, 344871, 344629, 343573, 341804, 340795, 341976, 344772, 346876, 346806, 345559, 345232, 346598, 348892, 351623, 355422, 360818, 367079, 372960, 378104, 383034, 388077, 393107, 398295, 404311, 411404, 418822]
53744D18822O808O232O516P338P750P436O936O768O679O016M651L204K426K532
53730E00114L322M529N707O048M946K747M35j465l085m358m832m622m693n527
53716D99266o334o350o204o857p713p222n363m088m722o121o345n351m828n668
53702D16100o698o365m918m125m912o054n708l760j903j410j735j734j323j191
53688C64264j482j765j990k426k699j954k16J313J638R83J66l56m75l7R00J768
53672C57632J867J138L85O79K223L740L492J445k42L25K311L374K959K791L951
53657C88070N189M896L418K265K033K207K358K493K679L114M115N331N710M997
53643D38875M516N286O193N563M003L759N152N731L857J380J278L575N360M596
$$ y = [418822, 425630, 431862, 438378, 445716, 453466, 460902, 467838, 474606, 481285, 487301, 491952, 495156, 497582, 500114, 503436, 507965, 513672, 519720, 524666, 527413, 527848, 526383, 523298, 518940, 514108, 509486, 504793, 499266, 492932, 486582, 480378, 473521, 465808, 458586, 453223, 449135, 444413, 438292, 431947, 426596, 421768, 416100, 409402, 403037, 398119, 393994, 389082, 383028, 377320, 373560, 371657, 370247, 368512, 366778, 365455, 364264, 362782, 361017, 359027, 356601, 353902, 351948, 351732, 353045, 354683, 355666, 355832, 355476, 355001, 354964, 355864, 357632, 359499, 360637, 361022, 361701, 363924, 367664, 371156, 372601, 372359, 372684, 374995, 378369, 381328, 384119, 388070, 393259, 398155, 401573, 403838, 405871, 408078, 410436, 412929, 415608, 418722, 422837, 428168, 433878, 438875, 443391, 448677, 454870, 460433, 464436, 468195, 473347, 479078, 482935, 484315, 485593, 489168, 494528, 499124]
53629D99124K347R21J024J498J115k62j986l271l576k928k013j578j755k261k963
53614D83436l664l550j933L47J405P24r7L00J073P71k51o36m34q18j712j780q80
53597D72301m83j110j401n74L6p08j483l68K072L334K231O2j226q13J040L471
53581D76381N239N326L783J663Q4m63j28O24J459K457L652M439M154L265L015
53566E14950L671M216M196M497N597O373N852M875M764N279N428N392N996O883
53552E87969O983O429O203O201N403M054L841N402P147P172N274K720R59Q42K089
53537F58688L285L206K244J589J227R5j824k978k192J28K926N187N513K853j522
53522F78425m408m204k736k392k742j740O21J821N2l555o342o813n569m169l572
$$ y = [499124, 501471, 502392, 503416, 504914, 506029, 505767, 503781, 500510, 496934, 494006, 491993, 490415, 488660, 486399, 483436, 479772, 476222, 474289, 474636, 476041, 476765, 476668, 476968, 478041, 478812, 478561, 477925, 477491, 476673, 474961, 473181, 472301, 471818, 470708, 469307, 468733, 468769, 468061, 466578, 466210, 468282, 471616, 473847, 473909, 472683, 471870, 472910, 476381, 481620, 486946, 490729, 492392, 492476, 492013, 491885, 492509, 493968, 496425, 500077, 504516, 508670, 511935, 514950, 518621, 522837, 527033, 531530, 537127, 543500, 549352, 554227, 558991, 564270, 569698, 575090, 581086, 587969, 594952, 601381, 607584, 613785, 619188, 623242, 627083, 632485, 639632, 646804, 652078, 654798, 655757, 656599, 658688, 661973, 665179, 667423, 669012, 670239, 670334, 668510, 665532, 663340, 663468, 666394, 671581, 677094, 679947, 678425, 674017, 669813, 667077, 664685, 661943, 660203, 660824, 662645, 662697, 659142, 652800, 645987, 640418, 636249, 632677]
53507F32677l446k810j276N51J836K244J856R02o7k72O22K175L706M799N165M669
53491F53331L812L610M424N421N685N507O012P730R994J1641J2013J1465J1136
53478G51781J1946J3658J5224J6115J6788J7699J8541J8928J9243K0227K1986
53467I42136K3921K5385K6141K6451K6947K8061K9396L0182L0542L1636L4079
53456A254877L6933L8899L9902M0712M1563M2023M2007M2031M2442M3165M4107
53445A708661M5143M5700M5043M3142M0793L8789L7367L6502L6064L5595L4489
53434B147288L2743L1127L0231K9760K9164K8670K8956K9843L0051K8763K6854
53423B473450K5709K5145K3593K0501J7300J5211J3261R783N187J532m67k322
$$ y = [632677, 629231, 626421, 625145, 625696, 627532, 629776, 631632, 632534, 632467, 632195, 632817, 634992, 638698, 643497, 648662, 653331, 657143, 660753, 665177, 670598, 676283, 681790, 687802, 695532, 705526, 717167, 729180, 740645, 751781, 763727, 777385, 792609, 808724, 825512, 843211, 861752, 880680, 899923, 920150, 942136, 966057, 991442, 1017583, 1044034, 1070981, 1099042, 1128438, 1158620, 1189162, 1220798, 1254877, 1291810, 1330709, 1370611, 1411323, 1452886, 1494909, 1536916, 1578947, 1621389, 1664554, 1708661, 1753804, 1799504, 1844547, 1887689, 1928482, 1967271, 2004638, 2041140, 2077204, 2112799, 2147288, 2180031, 2211158, 2241389, 2271149, 2300313, 2328983, 2357939, 2387782, 2417833, 2446596, 2473450, 2499159, 2524304, 2547897, 2568398, 2585698, 2600909, 2614170, 2623953, 2629140, 2630672, 2630205, 2627883]
53411B627883n390r193j2808j6391k0223k3384k4811k5032k5597k6971k8165k8382
53399B381536k8196k8884l1060l3968l5936l5839l4314l3103l2967l2987l2214
53388B022068l0949k9699k7926k4965k1438j8470j6089j3636j1279r665q411o451
53376A803090l764j284Q81L587O822R388J0862J2429J5067J8224K0962K3240K5280
53363A944784K6948K8626L1532L5980M0387M3153M4726M6563M8887N0981N3014
53352B395581N5859N9247O1839O3410O5467O9208P3972P8297Q1561Q3931Q5598
53341C173970Q6895Q8592R1096R3600R4668R3879R2449R2077R3201R4401R3650
53330D188478R0232Q5381Q0893P7404P4327P0999O7152O2468N6614M9980M3523
$$ y = [2627883, 2622493, 2613300, 2600492, 2584101, 2563878, 2540494, 2515683, 2490651, 2465054, 2438083, 2409918, 2381536, 2353340, 2324456, 2293396, 2259428, 2223492, 2187653, 2153339, 2120236, 2087269, 2054282, 2022068, 1991119, 1961420, 1933494, 1908529, 1887091, 1868621, 1852532, 1838896, 1827617, 1817952, 1809541, 1803090, 1799326, 1798042, 1798923, 1802510, 1809332, 1818720, 1829582, 1842011, 1857078, 1875302, 1896264, 1919504, 1944784, 1971732, 2000358, 2031890, 2067870, 2108257, 2151410, 2196136, 2242699, 2291586, 2342567, 2395581, 2451440, 2510687, 2572526, 2635936, 2701403, 2770611, 2844583, 2922880, 3004441, 3088372, 3173970, 3260865, 3349457, 3440553, 3534153, 3628821, 3722700, 3815149, 3907226, 4000427, 4094828, 4188478, 4278710, 4364091, 4444984, 4522388, 4596715, 4667714, 4734866, 4797334, 4853948, 4903928, 4947451]
53319D947451L7521L1066K3230J4223N128l096j0060j6149k2726l1375m2237n3463
53307D879513o3005p0486p6783q2313q6678q9615r1430r2541r3255r3850r4145
53296C945412r3226r0509q6933q4213q2909q2093q0950p9709p8744p7641p5660
53285C032825p2637o9098o5839o3444o1676n9515n6393n3068n0386m7594m3300
53274B389875l8005l3916l1920l0517k8464k6721k6496k6956k6426k4740k2790
53263B072924k0685j8062j5497j3803j2326r653n797k127O83L026M918N917O673
53250A996191Q814J2766J7052K0162K1951K2896K3359K4088K6126K9484L2894
53239B235783L5394L7258L8934M0115M0559M0787M1298M1810M1833M1280M0143
$$ y = [4947451, 4984972, 5016038, 5039268, 5053491, 5058619, 5055523, 5045463, 5029314, 5006588, 4975213, 4932976, 4879513, 4816508, 4746022, 4669239, 4586926, 4500248, 4410633, 4319203, 4226662, 4133407, 4039557, 3945412, 3852186, 3761677, 3674744, 3590531, 3507622, 3425529, 3344579, 3264870, 3186126, 3108485, 3032825, 2960188, 2891090, 2825251, 2761807, 2700131, 2640616, 2584223, 2531155, 2480769, 2433175, 2389875, 2351870, 2317954, 2286034, 2255517, 2227053, 2200332, 2173836, 2146880, 2120454, 2095714, 2072924, 2052239, 2034177, 2018680, 2004877, 1992551, 1982898, 1977101, 1974974, 1975657, 1978683, 1983601, 1989518, 1996191, 2005005, 2017771, 2034823, 2054985, 2076936, 2099832, 2123191, 2147279, 2173405, 2202889, 2235783, 2271177, 2308435, 2347369, 2387484, 2428043, 2468830, 2510128, 2551938, 2593771, 2635051, 2675194]
53228B675194L8293L5958L3510L0531K6139K0615J5432J1247P079K188k600o403
53216B887183r854j4005j8552k2489k5749k9017l2374l5248l7410l9121m0698
53205B582666m2514m4832m7014m7861m7442m7554m9275n1205n1511n0688n0511
53194B052259n0960n0256m7830m5328m4298m4444m4635m4416m4025m3832m4082
53183A548153m4448m3832m1492l8363l6165l5158l3943l1617k8950k7046k5892
53172A161247k4831k3543k2097k0746k0026k0317k0991k0714j9162j7604j7352
53161I33864j8244j9250j9962k0722k1585k1817k0705j8586j6829j6435j6693
53150G23036j5895j3719j2018j2328j3432j2847j0364q306q168q844q795q335
$$ y = [2675194, 2713487, 2749445, 2782955, 2813486, 2839625, 2860240, 2875672, 2886919, 2893998, 2896186, 2893586, 2887183, 2877329, 2863324, 2844772, 2822283, 2796534, 2767517, 2735143, 2699895, 2662485, 2623364, 2582666, 2540152, 2495320, 2448306, 2400445, 2353003, 2305449, 2256174, 2204969, 2153458, 2102770, 2052259, 2001299, 1951043, 1903213, 1857885, 1813587, 1769143, 1724508, 1680092, 1636067, 1592235, 1548153, 1503705, 1459873, 1418381, 1380018, 1343853, 1308695, 1274752, 1243135, 1214185, 1187139, 1161247, 1136416, 1112873, 1090776, 1070030, 1050004, 1029687, 1008696, 987982, 968820, 951216, 933864, 915620, 896370, 876408, 855686, 834101, 812284, 791579, 772993, 756164, 739729, 723036, 707141, 693422, 681404, 669076, 655644, 642797, 632433, 624127, 615959, 607115, 598320, 589985]
53138E89985q601r540j0204j0263r950r070p303n237m065m190m954n641o085o351
53124D88531o471o532o537o103m835k988j401o35m46k29K48O60N98L0p98j791
53108D51301k923l628l011j214mr51l270m580l873k510k012k141j805p95K76R00
53092D19760P73l20j828k438j724j110j953l253k784l19J852J922O90L1L86P50
53076D10435M55j67o70j038j157n76P27J804J592J56j462k573l286l533k678p85
53060C97244O91O00p4M39J934K505J592O50L41o47k670l297o94K741K980j26k818
53043D01391k836j968k403l343k839j047L21O18N40M74K00j59k27l15j094k459
53027C84854l604m051l797k690o62J580K973L224K706J556k26j950k637k346j988
$$ y = [589985, 581384, 571844, 561640, 551377, 541427, 532357, 525054, 519817, 515752, 511562, 506608, 500967, 494882, 488531, 482060, 475528, 468991, 462888, 458053, 455065, 453664, 453029, 452583, 452354, 452602, 453262, 453860, 453890, 453092, 451301, 448378, 444750, 441739, 440525, 440521, 439570, 436300, 431720, 427847, 425337, 423325, 421184, 419379, 418584, 418860, 419760, 420533, 420213, 418385, 415947, 414223, 413113, 411160, 407907, 405123, 404804, 406656, 408578, 409268, 409299, 409685, 410435, 410890, 410723, 410053, 409015, 407858, 407282, 408009, 409813, 411405, 411561, 410099, 407526, 404240, 400707, 398029, 397244, 397935, 398535, 398461, 398900, 400834, 403339, 404931, 405581, 405922, 405275, 402605, 399308, 398614, 401355, 404335, 404209, 401391, 398555, 396587, 394184, 390841, 388002, 386955, 387276, 387894, 388434, 388908, 389108, 388949, 388722, 388407, 387313, 384854, 381250, 377199, 373402, 370712, 370050, 371630, 374603, 377827, 380533, 382089, 381863, 379913, 377276, 374930, 372942]
53012C72942j780j053K43J109J072R21J177J063Or90q01j97p85k364k974j621
52996C65968M91J729J793J296Q19Q34J576K359J994O03q0Q38J644J10l230n418
52980C73326m704k436r92j083j742k142k366k711k983k672j490K87J910K609K098
52965C54909O75j028k255k311j010J041K825L743L816L180J863J63j195j766j932
52950C60718k368k981k783j100J383L097L149K078R13m0r29j317m01J571L118
52935C64108L247K534J825Q61q01k253k156q17J56L11Q33K295L523L440K641K115
52919C81862J613M98o64p91k5N00M18L81O59O95L04K75J285K922M134M272L425
52902D01763K088Q68K08K37P31J184R47j93j477j787j126q18j761l194l972m221
$$ y = [372942, 371162, 370109, 370352, 371461, 372533, 373454, 374631, 375694, 375700, 374710, 373909, 373712, 372927, 370563, 367589, 365968, 366459, 368188, 369981, 371277, 372096, 372930, 374506, 376865, 378859, 379462, 379382, 380220, 381864, 381974, 378744, 373326, 368622, 366186, 365194, 364111, 362369, 360227, 357861, 355150, 352167, 349495, 348005, 348292, 350202, 352811, 354909, 355584, 354556, 352301, 349990, 348980, 350021, 352846, 356589, 360405, 363585, 365448, 365611, 364416, 362650, 360718, 358350, 355369, 352586, 351486, 352869, 355966, 359115, 361193, 362106, 362066, 361137, 359820, 359419, 360990, 364108, 367355, 369889, 371714, 372575, 371774, 369521, 367365, 366548, 366704, 367015, 367848, 370143, 373666, 377106, 379747, 381862, 383475, 383973, 383309, 382518, 382493, 382993, 383411, 383792, 384451, 385146, 385450, 385725, 387010, 389932, 394066, 398338, 401763, 403851, 404719, 404927, 405164, 405895, 407079, 408026, 407833, 406356, 404569, 403443, 402625, 400864, 397670, 393698, 389477]
52886C89477m587m520k938m17J032O95N8L53P46kj345j736q91Q9M42L19j80j287
52868C75308k705l466l048k014j161o03l9L65n6j489k912k749n45K194L335K306
52852C62721M49q37j553k314l022l135k592j643k12J575K680K207R79P55J710
52837C57768K157J072m50r84o89m22q4Q66J862J818R19L98N54L24r08k278k709
52820C59214k188j306m03K27J17o05q97MJ535K637L044K984K249P54l75J88J834
52803C69013K311O71j349j692n88L59P27J382K310K052j11k691l651k863j893
52788C63987j757j882j478r64j358k667l642l326k214j563j785k051j494l03O59
52773C38162R55R33J009J096Q05M3p88j116p80k58k66r71j730j756j015k29p7
$$ y = [389477, 384890, 380370, 377432, 377015, 378047, 378742, 378800, 379153, 379899, 379897, 378552, 376816, 375925, 376014, 376456, 376775, 376595, 375308, 372603, 369137, 366089, 364075, 362914, 362311, 362272, 362637, 362581, 361092, 358180, 355431, 354886, 357080, 360415, 362721, 363170, 362333, 360780, 358466, 355444, 352309, 349717, 348074, 347862, 349437, 352117, 354324, 355303, 356058, 357768, 359925, 360997, 360547, 359563, 358874, 358452, 358368, 359234, 361096, 362914, 363833, 364231, 364785, 365109, 364201, 361923, 359214, 357026, 355720, 355317, 355544, 355661, 355056, 354159, 354163, 355698, 358335, 361379, 364363, 366612, 367366, 366991, 367179, 369013, 371324, 371995, 370646, 368954, 368366, 368725, 369452, 370834, 373144, 375196, 375085, 372394, 368743, 365880, 363987, 362230, 360348, 358870, 357906, 356548, 353881, 350239, 346913, 344699, 343136, 341351, 339300, 337806, 337503, 338162, 339117, 340050, 341059, 342155, 342960, 343003, 342215, 341099, 340319, 340061, 339795, 338824, 337094, 335338, 334323, 334094, 334017]
52756C34017n66j147j150k50J160K093J880J028P44J465K312K230J273M12L74
52741C45875R49J212K40k038m345m908l254q91L32J93j12J64N19K38n88j241j039
52724C31306K37J917K508J021j504k689j463O78J601R78O8k61k64l50m36m50o54
52707C32243j099j299p83K72J206J544J301P38m6j062k001k070p61J270K599K503
52691C34555J633J014Q89Q45O00K16j61l05r6J27j50n64N7J985L661L380J412
52674C49098m54j017l77Q82K096K491K027J939L176M561M058J738k16o08m96r03
52658C67995j104k34R33J079J74q57j409j312n42L41L68m62j001p79p90j548j895
52641C58957j030k01o70j394q19K26o7r59l5K478L311R01k114k554p62O59O30
$$ y = [334017, 333451, 332304, 331154, 330904, 332064, 334157, 336037, 337065, 337809, 339274, 341586, 343816, 345089, 345501, 345875, 346824, 348036, 348276, 346238, 341893, 336985, 333731, 332840, 333172, 333365, 333253, 333417, 333936, 334174, 333586, 332345, 331306, 331543, 333460, 335968, 336989, 335485, 332796, 331333, 332011, 333612, 334590, 334658, 334397, 334133, 333783, 333347, 332897, 332243, 331144, 329845, 329062, 329334, 330540, 332084, 333385, 334123, 334077, 333015, 331014, 328944, 328183, 329453, 332052, 334555, 336188, 337202, 338091, 338936, 339536, 339752, 339591, 339286, 339190, 339317, 339167, 338603, 338660, 340645, 344306, 347686, 349098, 348644, 347627, 347250, 348132, 350228, 352719, 354746, 356685, 359861, 364422, 368480, 370218, 370002, 369394, 368898, 367995, 366891, 366657, 367590, 368669, 368843, 367986, 366577, 365265, 364723, 365064, 365432, 364970, 363969, 363190, 362400, 360852, 358957, 357927, 357726, 357056, 355662, 354843, 355069, 355002, 354043, 354008, 356486, 359797, 360698, 358584, 356030, 355268, 355927, 356557]
52624C56557K25M34J080J641J804J322K92m97m01N0k99j583k636k441j303k86
52608C53959Q7J60K45O3o02r98QK262L985L722K100R82J315K555L788M406M027
52591C82064K769J544J171J209O35l97p49k27j04j330l336n056o040o082m871
52576C61200k749r45k67j40M17J462K345K637K289J421M94J66N18Q70P70O19R45
52559C72052J696K522L173L303K605J483P62M54k19j220j380l76K76o39k033j947
52543C80512k61J448K190K301K238K043J958K364K964K989K287J361L61r86k414
52528D01355k957k004L1K126L229K631O16j356j880j084k21P5K63O17N18n57k056
52511C99346k903k666j826j173j122j442j494r46j69K91M09M68L98j21q31q38
$$ y = [356557, 356782, 357216, 358296, 359937, 361741, 363063, 363355, 362858, 362457, 362507, 362208, 360625, 357989, 355548, 354245, 353959, 354046, 354206, 354451, 354514, 353912, 352914, 352922, 355184, 359169, 362891, 364991, 365973, 367288, 369843, 373631, 378037, 382064, 384833, 386377, 387548, 388757, 389392, 388995, 388246, 388019, 387915, 386585, 383249, 378193, 372153, 366071, 361200, 358451, 357506, 357239, 357099, 357516, 358978, 361323, 363960, 366249, 367670, 368164, 368330, 368848, 369718, 370488, 371107, 372052, 373748, 376270, 379443, 382746, 385351, 386834, 387596, 388050, 387831, 386611, 385231, 384855, 385131, 384492, 382459, 380512, 380251, 381699, 383889, 386190, 388428, 390471, 392429, 394793, 397757, 400746, 403033, 404394, 404755, 403769, 401355, 398398, 396394, 396425, 398551, 401780, 404411, 405027, 403671, 401791, 400707, 400486, 400561, 400824, 401441, 401959, 401402, 399346, 396443, 393777, 391951, 390778, 389656, 388214, 386720, 385774, 385605, 385896, 386305, 386773, 387171, 387050, 386219, 385381]
52495C85381K46J465J298n63k508k499m68J319R13p60j092O33K302K127J063R14
52479C89771J413Q44r96k363k041p17L03N19Q2o83j200r51k12K06J21Q7K59Q9
52461C84531n78j020p23j46J30L64J069J992K401K148J805J713J516R61P47J915
52445C98825M194N619M563J888Q1K65J137J191N71pp65k036k984k688j822j662
52429D06370k030j846j201j008r99j64Q96M48j166j286J123L536L303J212j17
52414D07071Q3N98P73J111J706J839J219L96j22j54N47K071L780M769M815M232
52398D34734L145J722P41Q58J464J201l39k270l663m343m350l568k171p70J60
52383D22551N55M61j5m16k28L61N05k84j584k573k697j825l39P97O98m02j222
$$ y = [385381, 385627, 387092, 388390, 387827, 385319, 382820, 382352, 383671, 384584, 383824, 382732, 383365, 385667, 387794, 388857, 389771, 391184, 392028, 391032, 388669, 386628, 385911, 386214, 386733, 386815, 386132, 384932, 383981, 383769, 383975, 384096, 384183, 384442, 384531, 383953, 382933, 382210, 382064, 382194, 382558, 383627, 385619, 388020, 390168, 391973, 393686, 395202, 396163, 396910, 398825, 403019, 408638, 413201, 415089, 415170, 415435, 416572, 417763, 418334, 418327, 417562, 415526, 412542, 409854, 408032, 406370, 404340, 402494, 401293, 400285, 399286, 399122, 400018, 400466, 399300, 398014, 399137, 402673, 405976, 407188, 407071, 407154, 407752, 408525, 409636, 411342, 413181, 414400, 414796, 414674, 414520, 415067, 417138, 420918, 425687, 430502, 434734, 437879, 439601, 440342, 441200, 442664, 443865, 443526, 441256, 437593, 433250, 428900, 425332, 423161, 422391, 422551, 423106, 423567, 423552, 423136, 422908, 423269, 423774, 423490, 421906, 419333, 416636, 414811, 414472, 415269, 415967, 415565, 414343]
52366D14343q90R0P06Q25J156K053L013L460L455L362L242K941K615K625K908
52351D45904K973K710K783L812N480O884P599P891Q003P788P075N846L982J367
52337E20097j495l595m471m713n030n229m603l063j336k41j42r44k008k195o72
52322D80360K045M327M995M361L515L010K761K759L087L240K422R81N59K100M322
52307E24844N343N337O029P625Q028N918L057K250L880N787N993M406K283J194
52293E91974K045M023M933L782K447L332N940P695P759P821Q858R574R076Q876
52279F78135J0593J3231J4559J4296J4237J5658J8018K0061K1108K1411K1867
52268H63174K3174K4750K5099K3839K2673K3551K6441K9734L2181L3493L3589
$$ y = [414343, 413453, 413543, 414249, 415074, 416230, 418283, 421296, 424756, 428211, 431573, 434815, 437756, 440371, 442996, 445904, 448877, 451587, 454370, 458182, 463662, 470546, 478145, 486036, 494039, 501827, 508902, 514748, 518730, 520097, 518602, 515007, 510536, 505823, 500793, 495564, 490961, 487898, 486562, 486321, 486179, 485235, 483227, 481032, 480360, 482405, 486732, 491727, 496088, 499603, 502613, 505374, 508133, 511220, 514460, 516882, 517863, 518422, 520522, 524844, 530187, 535524, 541553, 549178, 557206, 563124, 566181, 568431, 572311, 578098, 584091, 588497, 590780, 591974, 594019, 598042, 602975, 606757, 609204, 612536, 618476, 626171, 633930, 641751, 650609, 660183, 669259, 678135, 688728, 701959, 716518, 730814, 745051, 760709, 778727, 798788, 819896, 841307, 863174, 886348, 911098, 936197, 960036, 982709, 1006260, 1032701, 1062435, 1094616, 1128109, 1161698]
$$ [...]
##END NTUPLES=NMR SPECTRUM
##END=
