
##TITLE=UV1141_M5-1005-1002_6279411_JqRdcW4n4n
##JCAMPDX= 6.0         $$ Bruker NMR JCAMP-DX V2.0
##DATA TYPE= NMR SPECTRUM
##DATA CLASS= NTUPLES
##ORIGIN= BRUKER
##OWNER= Administrator
$$ 1.72 TOPSPIN		Version 2.1
$$ 2012-06-03 17:44:11.156 -0500  Administrator@TOPSPIN
$$ Compression mode = diff/dup
##.OBSERVE FREQUENCY= 400.13188235
##.OBSERVE NUCLEUS= ^1H
##.ACQUISITION MODE= SIMULTANEOUS (DQD)
##.ACQUISITION SCHEME= undefined
##.AVERAGES= 8
##.DIGITISER RES= 22
##SPECTROMETER/DATA SYSTEM= spect
##.PULSE SEQUENCE= zg30
##.SOLVENT NAME= COFFEE_meoh
##.SHIFT REFERENCE= INTERNAL, COFFEE_meoh, 1, 14.98061
##AUDIT TRAIL= $$ (NUMBER, WHEN, WHO, WHERE, PROCESS, VERSION, WHAT)
$$ ##TITLE= Audit trail, TOPSPIN		Version 2.1
$$ ##JCAMPDX= 5.01
$$ ##ORIGIN= Bruker BioSpin GmbH
$$ ##OWNER= Administrator
$$ $$ C:\Bruker\TOPSPIN/data/COFFEE/nmr/UV1141_M5-1005-1002_6279411_JqRdcW4n4n/10/pdata/1/auditp.txt
$$ ##AUDIT TRAIL=  $$ (NUMBER, WHEN, WHO, WHERE, PROCESS, VERSION, WHAT)
(   1,<2012-06-03 17:44:04.015 -0500>,<Administrator>,<TOPSPIN>,<go>,<TOPSPIN 2.1>,
      <created by zg
	started at 2012-06-03 17:42:57.125 -0500,
	POWCHK enabled, PULCHK disabled,
       configuration hash MD5:
       D5 CA 7A 23 FE 6B EE E2 50 67 74 61 24 F7 5E 3B
       data hash MD5: 64K
       36 29 ED F8 63 87 05 E3 14 02 AB D1 40 97 61 9E>)
(   2,<2012-06-03 17:44:06.890 -0500>,<Administrator>,<TOPSPIN>,<proc1d>,<TOPSPIN 2.1>,
      <Start of raw data processing
       efp LB = 0 FT_mod = 6 PKNL = 1 PHC0 = 0 PHC1 = 0 SI = 32K 
       data hash MD5: 32K
       B0 CE 69 E1 8D 38 BD 7A 6B 5E FE 2A FB 37 58 AC>)
(   3,<2012-06-03 17:44:07.281 -0500>,<Administrator>,<TOPSPIN>,<proc1d>,<TOPSPIN 2.1>,
      <pk PHC0 = 208.6798 PHC1 = 0 
       data hash MD5: 32K
       CA 44 E3 F7 B5 6D 2C 0B 9A 86 0B E5 22 A4 3D 86>)
(   4,<2012-06-03 17:44:07.343 -0500>,<Administrator>,<TOPSPIN>,<proc1d>,<TOPSPIN 2.1>,
      <abs ABSG = 1 
       data hash MD5: 32K
       0C 45 E4 23 BD E7 E2 43 5C D8 0C D6 9F B1 29 3C>)
(   5,<2012-06-03 17:44:07.375 -0500>,<Administrator>,<TOPSPIN>,<proc1d>,<TOPSPIN 2.1>,
      <abs ABSG = 2 
       data hash MD5: 32K
       07 26 97 A6 4F 7E 3B 4C B5 CD E2 FC B4 CE EB 0C>)
(   6,<2012-06-03 17:44:07.406 -0500>,<Administrator>,<TOPSPIN>,<proc1d>,<TOPSPIN 2.1>,
      <abs ABSG = 3 
       data hash MD5: 32K
       DB 9B 02 F9 28 95 6D 9E FC DC AF 9B 7F 5B 03 04>)
(   7,<2012-06-03 17:44:07.500 -0500>,<Administrator>,<TOPSPIN>,<proc1d>,<TOPSPIN 2.1>,
      <abs ABSG = 4 
       data hash MD5: 32K
       65 68 18 ED 0E 4B C6 9A 29 44 3D 5C 5C 58 AD 82>)
(   8,<2012-06-03 17:44:07.671 -0500>,<Administrator>,<TOPSPIN>,<proc1d>,<TOPSPIN 2.1>,
      <abs ABSG = 5 
       data hash MD5: 32K
       60 1E 68 91 C4 41 F7 16 1B A0 DB 76 47 D2 03 42>)
$$ ##END=
$$ 
$$ $$ hash MD5
$$ $$ 18 9E 4C FA 32 FA 46 25 9E 35 C6 0D C7 15 96 25
##$RELAX= 
##$RELAX= 
##$RELAX= 
##$RELAX= 
##$RELAX= 
##$RELAX= 
##$RELAX= 
$$ Bruker specific parameters
$$ --------------------------
$$ [...]
##$TP= (0..7)
150 150 150 150 150 150 150 150
##$TP07= 0
##$TPNAME0= <>
##$TPNAME1= <>
##$TPNAME2= <>
##$TPNAME3= <>
##$TPNAME4= <>
##$TPNAME5= <>
##$TPNAME6= <>
##$TPNAME7= <>
##$TPOAL= (0..7)
0.5 0.5 0.5 0.5 0.5 0.5 0.5 0.5
##$TPOFFS= (0..7)
0 0 0 0 0 0 0 0
##$TUNHIN= 0
##$TUNHOUT= 0
##$TUNXOUT= 0
##$USERA1= <user>
##$USERA2= <user>
##$USERA3= <user>
##$USERA4= <user>
##$USERA5= <user>
##$V9= 5
##$VALIST= <valist>
##$VCLIST= <CCCCCCCCCCCCCCC>
##$VD= 0
##$VDLIST= <DDDDDDDDDDDDDDD>
##$VPLIST= <PPPPPPPPPPPPPPP>
##$VTLIST= <TTTTTTTTTTTTTTT>
##$WBST= 2048
##$WBSW= 25
##$XGAIN= (0..3)
0 0 0 0
##$XL= 0
##$YL= 0
##$YMAX_a= 534384
##$YMIN_a= -653214
##$ZGOPTNS= <>
##$ZL1= 120
##$ZL2= 120
##$ZL3= 120
##$ZL4= 120
##$ABSF1= 14.98061
##$ABSF2= -5.57192
##$ABSG= 5
##$ABSL= 3
##$ALPHA= 0
##$AQORDER= 0
##$ASSFAC= 0
##$ASSFACI= 0
##$ASSFACX= 0
##$ASSWID= 0
##$AUNMP= <proc_prof1d_extract_pilot.lims>
##$AXLEFT= 0
##$AXNAME= <>
##$AXNUC= <1H>
##$AXRIGHT= 0
##$AXTYPE= 0
##$AXUNIT= <>
##$AZFE= 0.1
##$AZFW= 0.1
##$BCFW= 0
##$BC_mod= 0
##$BYTORDP= 0
##$COROFFS= 0
##$CY= 15
##$DATMOD= 1
##$DC= 0
##$DFILT= <>
##$DTYPP= 0
##$F1P= 0
##$F2P= 0
##$FCOR= 0.5
##$FTSIZE= 32768
##$FT_mod= 6
##$GAMMA= 0
##$GB= 0
##$INTBC= 1
##$INTSCL= 1
##$ISEN= 128
##$LB= 0
##$LEV0= 0
##$LPBIN= 0
##$MAXI= 10000
##$MC2= 0
##$MEAN= 0
##$ME_mod= 0
##$MI= 0
##$NCOEF= 0
##$NC_proc= -8
##$NLEV= 6
##$NOISF1= 0
##$NOISF2= 0
##$NSP= 0
##$NTH_PI= 0
##$NZP= 0
##$OFFSET= 14.98061
##$PC= 1
##$PHC0= 208.6798
##$PHC1= 0
##$PH_mod= 1
##$PKNL= yes
##$PPARMOD= 0
##$PPDIAG= 0
##$PPIPTYP= 0
##$PPMPNUM= 2147483647
##$PPRESOL= 1
##$PSCAL= 4
##$PSIGN= 0
##$PYNMP= <proc.py>
##$REVERSE= no
##$SF= 400.13
##$SI= 32768
##$SIGF1= 0
##$SIGF2= 0
##$SINO= 400
##$SIOLD= 32768
##$SPECTYP= <>
##$SREGLST= <1H.CDCl3>
##$SSB= 0
##$STSI= 32768
##$STSR= 0
##$SW_p= 8223.68421052632
##$SYMM= 0
##$S_DEV= 0
##$TDeff= 65536
##$TDoff= 0
##$TI= <>
##$TILT= no
##$TM1= 0
##$TM2= 0
##$TOPLEV= 0
##$USERP1= <user>
##$USERP2= <user>
##$USERP3= <user>
##$USERP4= <user>
##$USERP5= <user>
##$WDW= 1
##$XDIM= 32768
##$YMAX_p= 459536721
##$YMIN_p= -709249
##$CURPLOT= <Network HP LaserJet P1505>
##$CURPRIN= <$Network HP LaserJet P1505>
##$DFORMAT= <normdp>
##$LAYOUT= <+/1D_H.xwp>
##$LFORMAT= <normlp>
##$PFORMAT= <normpl>
##$SURQMSG= 1
$$ End of Bruker specific parameters
$$ ---------------------------------
##NTUPLES= NMR SPECTRUM
##VAR_NAME=  FREQUENCY,     SPECTRUM/REAL,   SPECTRUM/IMAG
##SYMBOL=    X,             R,               I
##VAR_TYPE=  INDEPENDENT,   DEPENDENT,       DEPENDENT
##VAR_FORM=  AFFN,          ASDF,            ASDF
##VAR_DIM=   32768,         32768,           32768
##UNITS=     HZ,            ARBITRARY UNITS, ARBITRARY UNITS
##FACTOR=    0.250966925370066, 1,           1
##FIRST=     8223.43324360095, -296759,      66386
##LAST=      0,             -97546,          -237238
##MIN=       0,             -709249,         0
##MAX=       8223.43324360095, 459536721,    0
$$ Real data points
##PAGE= N=1
##DATA TABLE= (X++(R..R)), XYDATA
$$ [...]
19539G6590b7510j0558l2230J4788l6907F7808k1125d40031A11920a02968j06771
19528b09739A12501B5197c63936a9546n5842C43555b55293a24492j3519G9785
19517C92606i3494j14922Q5503b8293k07043d128l191j50546E9084a63900E131
19505a6517l8056j13926C7517c82513a85010C3256Q7978J91134b144p609A28177
19493a71122A1741a77090A2273c5103j08460l8519B09090d32654a34084I3163
19482A17479d6349r8497f0576l3605B8951b32266h6376D6925f4548B1105g5936
19470b69522J08428n8415g4435j0473j78710d6980H0121C5354N46894a01439j69223
19459b70662m8816h2684A66108e4825j6858C61418F9981L0748A2420c151k50597
$$ y = [76590, -27510, -38068, -70298, -55510, -92417, 67808, 46683, -440031, 111920, -102968, -209739, 112501, 25197, -363936, -19546, -75388, 343555, -255293, -124492, -138011, 79785, 392606, -93494, -208416, -122913, -28293, -235336, -4128, -7319, -157865, 59084, -163900, 5131, -16517, -54573, -168499, 37517, -382513, -185010, 33256, 121234, 312368, -2144, -9753, 128177, -171122, 11741, -177090, 12273, -35103, -143563, -182082, 209090, -432654, -134084, 93163, 117479, -46349, -144846, -60576, -94181, 28951, -232266, -86376, 46925, -64548, 21105, -75936, -269522, -161094, -219509, -74435, -84908, -263618, -46980, 80121, 35354, 582248, -101439, -270662, -319478, -82684, 166108, -54825, -71683, 361418, 69981, 100729, 12420, -3151, -253748]
19448b53748m2159a17998G8950J81163B6797a85989K2528e2919B74083a54836
19437h7878H796a49253c821A29584J25203a18238A2849J0706J08198f8186E5363
19425A89648b83062B98721b55246L0341D25412d9539j67202j77014D08029E786
19414B7796e7829A35259b75292B6174a07316l11842B1596e940j74234l9573R0403
19403a29344n8334K0599B00633e9453J6595A25028c28316J53538D3917b14327
19392G0579O4822D7125K54819p5126f3223j31528N6551H4931b79117P5622j25261
19381c28756a30864A52072a5897k03840f6604A33195d8560k8475j28527A22350
19370G9709a95514K2252n3204N8708P5745o7149D3011a37361c6510D49350a50142
$$ y = [-253748, -295907, -117998, 78950, 260113, 26797, -185989, -163461, -52919, 274083, -154836, -87878, 8796, -149253, -3821, 129584, 254787, -118238, 12849, 23555, 131753, -68186, 55363, 189648, -283062, 298721, -255246, -224905, 425412, -49539, -216741, -393755, 408029, 5786, 27796, -57829, 135259, -275292, 26174, -107316, -419158, 21596, -5940, -180174, -219747, -129344, -187678, -167079, 200633, -59453, -42858, 125028, -328316, -174778, 43917, -214327, 70579, 135401, 47125, 301944, 226818, -63223, -194751, -138200, 84931, -279117, -203495, -328756, -130864, 152072, -15897, -219737, -66604, 133195, -48560, -77035, -205562, 122350, 79709, -195514, -173262, -226466, -167758, -92013, -159162, 43011, -137361, -36510, 449350, -150142]
19358B36643a84722K0549a3503r4393A57774d23667b7762A40399b08159p1258
19348b79417e3309q1634c3693j50913j79081B71343d6425l07446A78095l9965
19338A38130R5029D0844a43053C2181a70906r8326K7323A34029b77672a04746
19327a20548o2480B9501g3592D1865f5478h903j31286m4171f5735j50244l1963
19316b47942D8698P1668a6852j00638A15310b08218A35902c6307k2296j57259
19306b15862i8918l18500b7976D7061I441c15092g5081c7316j5954m7315A19421
19294e3996G1470e7307d144j04841j85697R1318j94524m5405c3736l04205A32714
19282d1496m38121c2690j87035A63640J91761f7583J6359o7147r5095a0194k31342
$$ y = [236643, -184722, -164173, -13503, -107896, 157774, -423667, -27762, 140399, -208159, -279417, -53309, -134943, -33693, -184606, -363687, 271343, -46425, -353871, 178095, 138130, 233159, 40844, -143053, 32181, -170906, -269232, -241909, 134029, -277672, -104746, -120548, -183028, 29501, -73592, 41865, -65478, -8903, -140189, -184360, -65735, -215979, -247942, 48698, 120366, -16852, -117490, 115310, -208218, 135902, -36307, -58603, -215862, -98918, -417418, -27976, 47061, 9441, -315092, -75081, -37316, -53270, -100585, 119421, -53996, 71470, -57307, -4144, -108985, -294682, -203364, -397888, -443293, -33736, -337941, 132714, -41496, -479617, -32690, -219725, 163640, 355401, -67583, -51224, -118371, -213466, -10194, -241536]
19271b41536A83249b66761p5474a11100j62621a35693B93229c9900j10293N6764
19261i3429j9579k9343p004N447D6006b27461f936A52732b95692J9875a18004
19249A43874F4242j7305g4423j61790A37728g783C3749a41758B53499i9357G5062
19237b65324i8955A49458b34285C76007j67972a23255j25139G1045c02325I4810
19226F9052c04238a19270B58821a24885N6474E419a75945a8632k63111E1365L4263
19215H5628C2516Q2460b77624g9516k026B31745K2807b2191l00672A17962l9812
19204G8150J2899J03312c1000k79837A84429a52668c4541A73119J3474H960O2819
19193G1779a38207k29258b9538j68286f9998j5416m41635A11775J51806g7244
$$ y = [-241536, 183249, -266761, -342235, -111100, -273721, -135693, 293229, -39900, -150193, -93429, -113008, -142351, -149355, -143908, 46006, -227461, -6936, 152732, -295692, -275817, -118004, 143874, 64242, 46937, -74423, -236213, 137728, -7783, 33749, -141758, 253499, -99357, 75062, -265324, -98955, 149458, -234285, 376007, 208035, -123255, -248394, 71045, -302325, 94810, 69052, -304238, -119270, 258821, -124885, -68411, 5419, -175945, -18632, -281743, 51365, 85628, 32516, 114976, -277624, -79516, -81542, 231745, 254552, -22191, -322863, 117962, 78150, 91049, 194361, -31000, -310837, 184429, -152668, -34541, 173119, 186593, 8960, 71779, -138207, -367465, -29538, -197824, -69998, -85414, -527049, 111775, 263581, -77244]
19182A54088a93815h1743E3832B1525b69820B4909J49406h2607B9172G036b90600
19170D0552a73332A79361J65216a73016c0989q8957D7316b87602B4367a72137
19159A60766a52390d0641j9412r001j62945Q0256A62059a41937B08183b62063
19148H3944b72253A80d9640k28366A56251a04210L2046E3187j6739K2160a54233
19136a40686A29435H081c28138b9979m46331i4725p1053d7293B1073K3991c12375
19124a24528B71338b2381j25860p5769B35130a16802C2057J68289O584D3704c06338
19112D8563a04519m21851J49047A83456A4404b04134C6512R1300o0475g3301B7020
19100a08111d1876r8255J4249H1471c44545R405q6353A45582d2096l27639J25198
$$ y = [154088, -193815, -81743, 53832, 21525, -269820, 24909, 174315, -82607, 29172, 7036, -290600, 40552, -173332, 179361, 344577, -173016, -30989, -119946, 47316, -287602, 24367, -172137, 160766, -152390, -40641, -60053, -69054, -231999, -151743, 162059, -141937, 208183, -262063, 83944, -272253, 180, -49640, -278006, 156251, -104210, -72164, 53187, 36448, 58608, -154233, -140686, 129435, 8081, -328138, -29979, -476310, -94725, -165778, -47293, 21073, 45064, -312375, -124528, 271338, -22381, -148241, -224010, 235130, -116802, 32057, 200346, 206930, 43704, -306338, 48563, -104519, -526370, -377323, 183456, 14404, -204134, 36512, 127812, 67337, -73301, 27020, -108111, -41876, -140131, -125882, 81471, -344545, -335140, -421493, 145582, -42096, -369735, -244537]
19089b44537N3000g1324k62478C6587K42492a14799j92538g7271C1988c85427
19078F57789B8555b98503F041b55285k21830B40123d32393a69626Q1790k13026
19068c00862b2682j16754e9335A08335e0262a9430o2583C24713A59583b77440
19057f7858C8922R8320b28848k2421B91743F5586i1735b4227k62086A93835b1607
19045a50638E4362b07152k4893G7321h9640D6204e9273A29767f5538j53420c8587
19033D9947a1935n4707A92983f2987A32263i4297c1353j41322A18277a08806m0656
19022a49462g0511C8458A8101b16727C10439b7308j39502A55847p5222K22165
19012C02790E3975R212f7349L1251k00070A1545P6696b3019k14198B31306b3088
$$ y = [-244537, -191537, -71324, -333802, 36587, 279079, -114799, -307337, -77271, 31988, -385427, 657789, 28555, -298503, 6041, -255285, -477115, 240123, -432393, -169626, -87836, -300862, -22682, -139436, -59335, 108335, -50262, -19430, -82013, 324713, 159583, -277440, -67858, 38922, 137242, -228848, -251269, 291743, 65586, -91735, -24227, -286313, 193835, -21607, -150638, 54362, -207152, -232045, 77321, -89640, 46204, -59273, 129767, -65538, -218958, -38587, 49947, -11935, -66642, 192983, -62987, 132263, -94297, -31353, -172675, 118277, -108806, -149462, -70511, 38458, 18101, -216727, 310439, -27308, -166810, 155847, 80625, 302790, 53975, 63187, -67349, -36098, -236168, 11545, 88241, -23019, -237217, 231306, -23088]
19000b65803Q8874m288M2989g580A99797o8663J9544j0578a62412G274e37548
18988B25582g8340p5471n6850g7673a1043k44864A06026a98403A7559d64461a02362
18976c84728d2141A6861b77421b8834r7852A66913J72076f7618A9828c00413J16614
18965a83799j46325G0292a99782i2760K5164D4849j3066a57362B04020b9785B7786
18953f6230j43350A53342R4164D6586Q9874f4596j65520o3433a16409j80914A8374
18941i4007A12427e910J199B09970l0117a35187e0647k58204d7762F9461Q5451
18930A54912a38991j4303O4246C3081g0626a1653C3124b1782A50603C0499f5236
18918A06378a20576l05848I1020J15922j4750j2865c18370B76977a15861H9727
$$ y = [-265803, -176929, -181217, -138228, -7580, 199797, 131134, 150678, 140100, -162412, 7274, -537548, 225582, -78340, -153811, -210661, -77673, -11043, -255907, 106026, -198403, 17559, -464461, -102362, -384728, -42141, 16861, -277421, -28834, -126686, 166913, 338989, -67618, 19828, -300413, -183799, -330124, 70292, -199782, -92760, -67596, 44849, 31783, -157362, 204020, -29785, 27786, -66230, -209580, 153342, 247506, 46586, 136460, -64596, -230116, -293549, -116409, -297323, 18374, -94007, 112427, -5910, -4711, 209970, 179853, -135187, -50647, -308851, -47762, 69461, 154912, -138991, -153294, -89048, 33081, -70626, -11653, 33124, -21782, 150603, 30499, -65236, 106378, -120576, -426424, 91020, 206942, 192192, 179327, -318370, 276977, -115861, 89727]
18907B3136O7879f9182G9572a36916A6955c4603k48845F1164g0870C3822K255
18896C6077a56387a5433H201b05088A79949k4460L8716b27390K0015c1783B88107
18884b88769B70825E6184a84325j12655B3187c00246j07115A17066a5110k85336
18874c00446K6997a29987q2883d6662k56709A06363b16233A46044a44487K9675
18864a14812n9036D2844N8045B5035a25842m4583L1998n3027E3394g6831j85051
18853b61882O7860N1281B2867L07330A39349d4001A37365b22963L8788k34397
18843d18572J71211h3405j2663B61770a12726H3519J55982N4735j00555e25140
18832C88932b26248i5605A20676a7891j26687d7195C8686K1714N2306A1547K21204
$$ y = [23136, 91015, -69182, 79572, -136916, 16955, -34603, -283448, 61164, -70870, 33822, 36077, -156387, -15433, 8201, -205088, 179949, 155489, 194205, -227390, -207375, -31783, 288107, -288769, 270825, 56184, -184325, -296980, 23187, -300246, -407361, 117066, -15110, -300446, -273449, -129987, -212870, -46662, -303371, 106363, -216233, 146044, -144487, -114812, -173848, 42844, 100889, 25035, -125842, -170425, -138427, -191454, 53394, -76831, -261882, -194022, -142741, 22867, 330197, 139349, -44001, 137365, -222963, -184175, -418572, -247361, -83405, -96068, 261770, -112726, 83519, 239501, 294236, 193681, -525140, 388932, -226248, -95605, 120676, -17891, -144578, -47195, 38686, 60400, 112706, 11547, 232751]
18821B32751j14984A3052d14631g5190B39808D7952h5843k56449A1672b56770
18810c18628A37982K644I520J33423j8832a29128B5389a1229o9781B78985A29349
18798a7435C06564F0482L0401a14541B30742H2626J01408q1291B1770J09561D9374
18786b8289j44635i90B61147f1832j26654J6570a7377B48931j21623a86553q395
18775a94948c2315a3106j50010p0645C8220N4445d2851G4336D439K61126o9561
18764A96004a31064o4167C6868K12461c08326H6293b5232A57658c6227r8513e1538
18752E9479e6047A32643R5222F1960h0546P708k78133i9039A41457a38358G3186
18740a29779j99694A23157M8243c46757a48438j79459F4138a76135A83645b33086
$$ y = [232751, 117767, 13052, -414631, -75190, 239808, 47952, -85843, -342292, 11672, -256770, -318628, 137982, 140626, 9520, 142943, 124111, -129128, 25389, -11229, -81010, 278985, 129349, -17435, 306564, 60482, 90883, -114541, 230742, 82626, 184034, 102743, 21770, 131331, 49374, -28289, -172924, -990, 261147, -61832, -188486, -171916, -17377, 248931, 127308, -186553, -194948, -32315, -13106, -163116, -233761, 38220, 92665, -42851, 74336, 4439, 265565, 196004, -131064, -195231, 36868, 249329, -308326, 86293, -25232, 157658, -36227, -134740, -51538, 59479, -56047, 132643, 227865, 61960, -80546, -72838, -350971, -99039, 141457, -138358, 73186, -129779, -329473, 123157, 171400, -346757, -148438, -327897, 64138, -176135, 183645, -233086]
18729A15050b58943g3111A09075d83756B6481c42635A07069h7427o8252A1075
18718F528R9216d5559c313p9028a7656j96298h4349o3851b1779k2549j66666B4337
18705H929g2614m6152A71196a43833B7086b96734K1601m8860J21499Q3276l8890
18694a58108n6417C233a55383O9984M0466j4499E7070a62018r6478e1214j46012
18683a97226g3396C69669E1862P1408i5914L9884H2402c2991k58313J38800n7332
18672b09836d604A0099b67464f5469C89452h9766j01324o0248B94880F1392a02216
18660c8233a5742A33435b10832N1660F7241K47697C4925a53672N389B76583B5768
18648E7943B6158a18948J776A02775c9706A11205Q84a73794d0637k15555B084
$$ y = [115050, -258943, -73111, 109075, -483756, 26481, -342635, 107069, -87427, -155679, 11075, 6528, 105744, -45559, -3313, -82341, -17656, -213954, -84349, -148200, -21779, -44328, -210994, 24337, 8929, -72614, -118766, 171196, -143833, 27086, -296734, -275133, -323993, -202494, -119218, -158108, -214525, 3233, -155383, -85399, -44933, -59432, 57070, -162018, -258496, -51214, -197226, -73396, 369669, 51862, 123270, -95914, -56030, 82402, -32991, -291304, -152504, -209836, -4604, 10099, -267464, -65469, 389452, -89766, -191090, -251338, 294880, 61392, -102216, -38233, -15742, 133435, -210832, -159172, 67241, 314938, 34925, -153672, -148283, 276583, 25768, 57943, 26158, -118948, -117172, 102775, -39706, 111205, 112089, -173794, -40637, -256192, 2084]
18636B37429c56203k191A17983a12226A83119b62072a7383C5266L2054b27148
18625c294A37023a39690m22860A04339h8342j603j5758c0635B8455a25985A89992
18613A09275n3225c485A4636l826a13463k66077e880k97900a36590c5014l4394
18602f9408B36668c85370J55037A72371i4032p343B42774G9014h305q0236j10265
18591a98806L4182G0402O1857i82D6508h496j82588C0146a96391A25813b6719
18579f8282M898A10612h0444A13278f4492j11619C1084i8675m6302k06870g7467
18567g4329b8054j05402j5224A38752a43940k15991A0911c72356a41979J0058
18557a31921b1139k56841A85658e2663A135a02496p4163P1352M8249j40745B105
$$ y = [237429, -356203, -358394, 117983, -112226, 183119, -262072, -17383, 35266, 67320, -227148, -3294, 137023, -139690, -562550, 104339, -88342, -89945, -105703, -30635, 28455, -125985, 189992, 109275, 56050, -3485, 14636, 10810, -113463, -379540, -5880, -303780, -136590, -35014, -69408, 236668, -385370, -230333, 172371, -94032, -101375, 242774, 79014, -8305, -88541, -198806, -164624, 70402, 132259, -982, 46508, -8496, -191084, 30146, -196391, 125813, -26719, -68282, -63384, 110612, -80444, 113278, -64492, -176111, 31084, -98675, -144977, -351847, -77467, -74329, -28054, -133456, -148680, 138752, -143940, -359931, 10911, -372356, -141979, -131921, -21139, -277980, 185658, -52663, 1135, -102496, -176659, -105307, -57058, -197803, 2105]
18545b4607C06192h5061j11762A13266E2719J29145b05329i5473b5419A49080
18534A3611c7075n64259b88387B89201p552j35703P9463a35134B99323c94273
18523f676p6752B38484M7059d0535j65523M2197A13652f0407j71010a09540B89422
18511a82091h1947j37373d1248e455k72284J12905C52470I7599J00a49884e5188
18499B00870B6468b65729F0858J44120m2756a47376k54358f5284p3158c4537l0130
18488f4667p7206A54013C0683a7555j34357H415d4344A24359Q696D7032d1533
18476b03551M8837p7719d5314G4574b5131k05331I9296b44983M2561i2842r0219
18465a83061D1075P1056b83882J9674a27036A81094I48c83311i4551A29609g4080
$$ y = [-24607, 306192, -85061, -196823, 113266, 52719, 181864, -205329, -95473, -25419, 149080, 13611, -37075, -601334, -288387, 289201, 281649, 145946, 225409, -135134, 299323, -394273, -6676, -83428, 238484, 285543, -40535, -206058, -163861, 113652, -60407, -231417, -109540, 289422, -182091, -81947, -219320, -41248, -5455, -277739, -164834, 352470, 97599, 97699, -149884, -55188, 200870, 26468, -265729, 60858, 204978, 162222, -147376, -401734, -65284, -138442, -34537, -64667, -141873, 154013, 30683, -17555, -151912, 8415, -44344, 124359, 133055, 47032, -41533, -203551, -154714, -232433, -45314, 74574, -25131, -230462, 99296, -244983, -202422, -92842, -183061, 41075, 112131, -283882, -264208, -127036, 181094, 948, -383311, -94551, 129609, -74080]
18453B67553g4698j42699b8191H6243b94232A62631a00103M819D3343J242Q7539
18442A32124b18872l4922b0918D4922H884a48584l008A26673b05608A12644a29082
18430a79964F6872a84124A37882b94034B98020d00007J55409g4601j3590F4858
18419F2370a12689I5981a96384A37705c18277D3432Q1422C2800K50835G3178B8990
18407B68431j00162a53119a2073H1461j4107J32464a68896L5068B33044a47892
18396A86904c08096e4426A65911a01953a0841k2880k57779B21574b24631E6408
18385a6766A72488a55818f2159j32921i3163H3843J72341b76752a10600A11735
18374b48115E5902M2547c61572h75H722d06976a59742a7182q5329j49276M2059
$$ y = [267553, -74698, -217397, -28191, 86243, -294232, 162631, -100103, -95284, 43343, 44585, 132124, -218872, -253794, -20918, 44922, 8884, -148584, -151592, 126673, -205608, 112644, -129082, -179964, 66872, -184124, 137882, -294034, 298020, -400007, -244598, -74601, -88191, 64858, 62370, -112689, 95981, -196384, 137705, -318277, 43432, 124854, 32800, 283635, 73178, 28990, 268431, 168269, -153119, -12073, 81461, 67354, 199818, -168896, -133828, 233044, -147892, 186904, -308096, -54426, 165911, -101953, -10841, -33721, -291500, 221574, -224631, 56408, -16766, 172488, -155818, -62159, -195080, -93163, 83843, 256184, -276752, -110600, 111735, -248115, 55902, 98449, -361572, -875, 8722, -406976, -159742, -17182, -102511, -251787, -209728]
18363b09728O4702f1684k90643e1140E6555e4025O919o7940e3666J6026j06272
18352a43912J0902C52330F243f7777E1263k4178b93919A14927e4227j79629m2920
18341b76776D2555K11142b75113H5570a3252k7872n8459K9287p2039J9335B63930
18329B6472b37552O7200K1418A1575b67433o9790g1621q2430B09157a11791j55916
18318b67707N2948i5205r0554L6190h393C5264j5459J85945r0887f7131B92899
18306c6968A14276a04530K5303B60890A03271E0360c15446D07763j17284B7879
18295A01598e7603j08740A04027g2810B20921K09054a25139A0560g8594c937A7816
18283B49873A23067a94476c2265C8914L4724c12084J25024A22215m4354k2734
$$ y = [-209728, -145026, -61684, -352327, -51140, 56555, -54025, -47106, -115046, -53666, -37640, -143912, -133010, 352330, 6243, -67777, 51263, 27085, -293919, 114927, -54227, -233856, -276776, 42555, 253697, -275113, 85570, -13252, -41124, -99583, -70296, -142335, -123000, 263930, 26472, -237552, -170352, -148934, 11575, -267433, -337223, -71621, -154051, 209157, -111791, -267707, -214759, -95205, -185759, -149569, -8393, 35264, 19805, 205750, 114863, -67131, 292899, -36968, 114276, -104530, -79227, 260890, 103271, 50360, -315446, 407763, 290479, 27879, 101598, -57603, -166343, 104027, -72810, 220921, 429975, -125139, 10560, -78594, -3937, 17816, 249873, 123067, -194476, -32265, 38914, 73638, -312084, -187060, 122215, 77861, 55127]
18273E5127c37556C101Q7839K7005b67675d224j62915F6032f6217F284h0485n2962
18261a33447m1642B09497E3235n333i413A17562m0998c32591A05637l2399J38611
18250B11849B0817f203n2658A07987J0722c44608c7987H0445a24134j57303J31141
18239a50296A9029J03869a29574N0631K3855p6474j11443B07979H2272a81028
18228a20059E9986J67145g375C2618b37821j06871K9351D5495a93278M3169A00665
18216c35206f9265b889A4198b68323A41954c88614A59285b16273h0314B71086
18205a50557o8209l6133E2852M8898f4017j714b7909C5664R6918j2792c13704
18193a89889h3352j29061G2165a19600F8621K7969d6283j24481k02572A45067
$$ y = [55127, -337556, 3101, 90940, 117945, -267675, -4224, -167139, 66032, -66217, 6284, -80485, -133447, -175089, 209497, 53235, 47902, -9413, 117562, 76564, -332591, 105637, 73238, 211849, 20817, -6203, -58861, 107987, 118709, -344608, -37987, 80445, -124134, -281437, -150296, 19029, 122898, -129574, -78943, -55088, -131562, -243005, 207979, 82272, -181028, -120059, 59986, 227131, -7375, 32618, -237821, -344692, -315341, 45495, -193278, -150109, 100665, -335206, -69265, -2889, 14198, -268323, 141954, -388614, 159285, -216273, -80314, 271086, -150557, -218766, -254899, 52852, 101750, -64017, -65731, -27909, 35664, 132582, 119790, -313704, -189889, -83352, -212413, 72165, -119600, 68621, 96590, -46283, -170764, -373336, 145067]
18182d8486j55399I9841k5067a68362N3107j0592K9217c7470A74922p5091K2216
18171A22047n0082K18323j12095O7508a21316k9995a1824E9045N6763a96078P8112
18160a17966B5098e1771C8525J84035e4526a7968A84752E2147a33146A30095a75071
18148d11204M7863l1359a48579d1552n4121B3547d8125H3940f5641J3655l01092
18137c53078a07184N3315j0641m9496p2609E9874b57792e8259D0261i8216A09800
18125b4094A6890d04072a07029C04795c66801a31849B37343f1234G2908b9308
18114c6551j7668m2036l3713l1992D56016a69128k17442J06341f9234G6016B0488
18102a62495B62703A104a34017l39522J95461H2490i5794j24074E0242b76295
$$ y = [-48486, -203885, 99841, 74774, -168362, -115255, -125847, -96630, -37470, 174922, 99831, 122047, 71965, 290288, 178193, 245701, -121316, -151311, -11824, 59045, 115808, -196078, -117966, 25098, -51771, 38525, 222560, -54526, -17968, 184752, 52147, -133146, 130095, -175071, -411204, -363341, -394700, -148579, -41552, -95673, 23547, -48125, 83940, -65641, -51986, -353078, -107184, -53869, -64510, -114006, -186615, 59874, -257792, -58259, 40261, -98216, 109800, -24094, 16890, -404072, -107029, 304795, -366801, -131849, 237343, -61234, 72908, -29308, -36551, -54219, -96255, -129968, -161960, 456016, -169128, -386570, -280229, -69234, 76016, 20488, -162495, 262703, 1104, -134017, -473539, -278078, 82490, -95794, -219868, 50242, -276295]
18091d5099C4907K92750c9458k29743Q8106n7599R5867k63419A99200P9136a21532
18079B0494f4260A5453a47978E8977B5079M4997B6613c5953A41111a87903D8202
18067b02889M9170N4367o7867a8000l6163j02431I8208c10695F232a92891g1010
18055i1115A78649k3658a43608k70535a72423D7295b09738i2789C33081g0295
18044b6241A91922J1326L5529d28087d3823E2134J41520a41853n3165B4421J2843
18033C7264J01663B2110L6760J13401J2234M9538h4698A37849n0989a07463l0356
18022a37819k98858d881A86011H7221c50783D5973a7936A71684a80765j15301
18012b96066M9841A7268K4809a16558G9775L13132j70300g3908j00162c3194o8898
$$ y = [-45099, 34907, 327657, -39458, -269201, -181095, -238694, -142827, -406246, 199200, 278336, -121532, 20494, -64260, 15453, -147978, 58977, 25079, 70076, 26613, -35953, 141111, -187903, 48202, -202889, -153719, -99352, -167219, -18000, -54163, -156594, 98208, -310695, 6232, -192891, -71010, -91115, 178649, 154991, -143608, -414143, -172423, 47295, -209738, -92789, 333081, -70295, -26241, 191922, 203248, 238777, -428087, -43823, 52134, 193654, -141853, -195018, 24421, 37264, 138927, 22110, 58870, 172271, 184505, 234043, -84698, 137849, 86860, -107463, -137819, -436677, -4881, 186011, 87221, -350783, 45973, -17936, 171684, -180765, -296066, -246225, 17268, 42077, -116558, 79775, 392907, 222607, -73908, -174070, -33194, -102092]
18001a02092j3675E388a42432j93565D4953K20143q5641H034P1344P889a3934
17989D23056B0463i7637J3170c9543F0061B0665L5992J59647i5515j21786k8047
17978b45348h5867n2980o4119E6832a88825M6592c9968K721A39626A9072j747
17967A7325J66034r0213h3148j00802A14531b8657m3042F2088a2847G7678k5506
17956E2172b21521E1750J02787e542C66403A7611a35543l83681f1637A0356K17324
17945B27680k1816A01793J49248b74638B83328b17009A02849a52092A68184D7763
17934A13281J56909g3670k49504G159J43613B9120L2911a06083c6782j77854I381
17922a32501M2446r3327Q8548E5850L8395b3273j67628j70089a50466b5887F6423
$$ y = [-102092, -115767, 5388, -142432, -335997, 44953, 265096, 179455, 8034, 79378, 87267, -13934, 423056, 20463, -97637, -84467, -39543, 60061, 20665, 56657, 216304, -95515, -217301, -245348, -85867, -138847, -202966, 56832, -188825, -142233, -39968, -37247, 139626, 19072, 17325, 183359, 93146, -83148, -183950, 114531, -28657, -71699, 62088, -12847, 77678, 52172, -221521, 51750, 154537, -5542, 366403, 17611, -135543, -519224, -61637, 10356, 227680, 205864, 101793, 251041, -274638, 283328, -217009, 102849, -152092, 168184, 47763, 113281, 270190, -73670, -323174, 7159, 150772, 29120, 62031, -106083, -36782, -214636, 9381, -132501, -90055, -183382, -94834, 55850, 94245, -23273, -190901, -360990, -150466, -25887, 66423]
17910C33266b78870A81110E1938J17813a0099j39315M0704i244k82812c9241B62410
17898a132A48432M7380c63304J79565e4184C45020a16785A28710O531k4289O8113
17887A79065q3979J8649i1426c5773n9760B24662h5034J422A04638D6007a21244
17875b76472A47068E0811M24905a65809O9796k37900b1649E0749d5857n9077A87207
17863b1594B53646A20512K09715g0618C85049a28747k67859a65700A38738a10932
17852a16455l2419M3509G3962j16i4617m8622A67900e7356j02558j02069B54556
17840A10781b1664I2285c5725A93500b86581J05165A80704p6283k6337a69146
17829C7a63198r264B03944p8840b92968a24401d7339C93111a44316h215A4332
$$ y = [333266, -278870, 181110, 51938, 169751, -10099, -149414, -108710, -9244, -292056, -39241, 262410, -1132, 148432, 195812, -363304, -183739, -54184, 345020, -116785, 128710, 135241, 110952, 179065, 95086, 113735, -91426, -35773, -95533, 224662, -85034, -83612, 104638, 46007, -121244, -276472, 147068, 50811, 475716, -165809, -96013, -333913, -21649, 50749, -45857, -104934, 187207, -21594, 253646, 120512, 330227, -70618, 385049, -128747, -396606, -165700, 138738, -110932, -116455, -148874, -105365, 73962, 73846, -94617, -143239, 167900, -57356, -159914, -261983, 254556, 110781, -21664, 92285, -35725, 193500, -286581, -181416, 180704, 104421, 78084, -169146, 37, -163198, -172462, 203944, 125104, -292968, -124401, -47339, 393111, -144316, -8215, 14332]
17817F6024f0966p8765E2096J653b92373g9900o826D6290c399j41177p3873C901
17804C8065i4637H0965g731j40751E7735H477J93866a65191K8243C49713j53915
17793A95798a15590l9571A98462N3825j21493E7425N0494L2025i4475B20762j09285
17782A11477a29022j212j40986B30742f944l1784j11533A16316i6685L3452A7646
17770G4169H711K60469b78025D27565A30128a00661D2911J0324D510c1913F195
17758G2127d8200A0887a29147n1729A00564a68265N1350F9282N1043a18249A0832
17746B1726b23254B16132G7853g876j72342e3811R921C16797e3079B47728A01927
17734F7562l2430e0615j21746A22906N119M4577c58526b9068G8408a29604D56188
$$ y = [66024, -60966, -139731, 52096, 53749, -292373, -79900, -86726, 46290, -3399, -144576, -218449, 3901, 38065, -94637, 80965, -7731, -148482, 57735, 8477, 202343, -165191, -136948, 349713, 195798, -115590, -155161, 198462, 252287, 130794, 57425, 107919, 139944, -94475, 220762, 111477, -129022, -130234, -271220, 230742, -6944, -38728, -150261, 116316, -96685, -63233, 17646, 74169, 8711, 269180, -278025, 427565, 130128, -100661, 42911, 53235, 4510, -31913, 6195, 72127, -48200, 10887, -129147, -180876, 100564, -168265, -116915, 69282, 120325, -118249, 10832, 21726, -223254, 216132, 77853, -7876, -180218, -53811, -43890, 316797, -53079, 247728, 101927, 67562, 35132, -50615, -172361, 122906, 128025, 172602, -358526, -29068, 78408, -129604, 456188]
17722A68250a04709E4730K8726K51799d3427J3831j39148H4381K97921d516A52546
17710A97447o0354c11387a26446D77842f7206B8159N5664k1224a0237C5065Q9587
17699A24652J1025a42529B43204O1691d4046p989j54138G9941M4329Q6616N426
17688B16312b29338A55780C669L8933b58863J08644B5791K9660g6968C07947d6563
17676a24177B8288a92596G0462L5622a46798e2691j73269A0407b32279B34342
17665C8734R4016d5867A65621f3662D7900b78726a8325E6227L54389a49709A9878
17653G4353J87516a35118C313b27662j0394g1023B27425c1769A68129n7870C4130
17641E9730J38973j8107a95371p1663g5397B59850i016G9727J76143M2402j3114
$$ y = [168250, -104709, 54730, 83456, 335255, -43427, -29596, -168744, 84381, 382302, -4516, 152546, 197447, 137093, -311387, -126446, 477842, -67206, 28159, 83823, 62599, -10237, 35065, 124652, 135677, -142529, 243204, 304895, -44046, -52035, -206173, 79941, 124270, 210886, 216312, -229338, 155780, 3669, 42602, -258863, -150219, 25791, 55451, -76968, 307947, -46563, -124177, 28288, -192596, 70462, 106084, -146798, -52691, -225960, 10407, -232279, 234342, 38734, 132750, -45867, 165621, -63662, 47900, -278726, -18325, 56227, 410616, -149709, 19878, 74353, 261869, -135118, 3313, -227662, -238056, -71023, 227425, -31769, 168129, 110259, 34130, 59730, 198703, 180596, -195371, -267034, -75397, 259850, -9016, 79727, 255870, 298272, 285158]
17630B85158A24219g9807a4820k15945c3888F5205J60383a28772j71662B39285
17619a49212g740B87003b75522B40527a4600C4824J35611e1897C08246A00207
17608h0086m306j1873n9242j3344j7800j22771d7998k699C7205b42289A09266
17596e7706e71j39308f8250b7703m1889A10256K63099j36990A7960J37653l1420
17585A24193n2699g4261F7820J80380G4192h473F4031f0096k9716G836K31814
17574B39650d3303a2495j27993n889e8555j0294l49530B57611G5556a557A37955
17562I6865a52555C28872a39962A14356j244n0647K2662J97834D4727j0867K1715
17551E5575h8299J5263C33445i519A98558F2752b9934l9041O069k7356A51840
$$ y = [285158, 124219, -79807, -14820, -230765, -33888, 65205, 225588, -128772, -300434, 239285, -149212, -7740, 287003, -275522, 240527, -14600, 34824, 170435, -51897, 308246, 100207, -80086, -84392, -96265, -155507, -168851, -186651, -309422, -47998, -50697, 37205, -242289, 109266, -57706, -571, -139879, -68250, -27703, -69592, 110256, 373355, 236365, 17960, 155613, 124193, 71494, -74261, 67820, 248200, 74192, -8473, 64031, -60096, -89812, 7836, 239650, -43303, -12495, -140488, -146377, -58555, -68849, -418379, 257611, 75556, -1557, 137955, 96865, -152555, 328872, -139962, 114356, 113112, 62465, 85127, 282961, 44727, 33860, 55575, -88299, -73036, 333445, -9519, 198558, 62752, -29934, -68975, -62906, -90262, 151840]
17539C09998b17734C29353K5797A08421O7466r613i560j65721d1352D4396J22969
17528A67365K0435E3667H660J25218F2568M02623I9889Q995B7827b01777e2052
17516B6796K8220K52268a01549A08599l2538O9698P3014b714B227J28039J23644
17505B53910E5229L5660J49755l27J15504p5175A34132K56332f016j38867A52520
17493a1310H4287O1981e5845B584d7828H8595d4617B88043B5400P4718g7067A58195
17480C24783q5589j15425K99841E6758J825J09803p2409c53399G6693a58666A54288
17468a67794B16290M2908q295g5962B07245M3053G4740e6662C05892A24799d9354
17456B42964K2225h8457A55906p1352j3087J97591C2496b70131C12957A09353
$$ y = [309998, -217734, 329353, 355150, 108421, 175887, 166274, -9560, -175281, -41352, 44396, 167365, 187800, 53667, 8660, 133878, 62568, 465191, 99889, 108884, 27827, -201777, -52052, 26796, 55016, 307284, -101549, 108599, 76061, 145759, 218773, -2714, 2227, 130266, 253910, 55229, 90889, 240644, 240317, 355821, 280646, 134132, 390464, -6016, -144883, 152520, -11310, 84287, 146268, -55845, 2584, -47828, 88595, -44617, 288043, 25400, 100118, -77067, 158195, 324783, 239194, 123769, 423610, 56758, 58583, 168386, 95977, -353399, 76693, -158666, 154288, -167794, 216290, 259198, 250903, -75962, 207245, 250298, 74740, -56662, 305892, 124799, -49354, 242964, 265189, -88457, 155906, 84554, 71467, 269058, 32496, -270131, 312957, 109353]
17445a36311j3708b0955G9272M25702A32379b11779A43799O8962J3785A6387J67697
17434A84084J74189a0808B24299r3204L5542K12296A36637Q1387p1178J68422
17424C15268D2063M097O1350K35953N823j18344J33930a2792B92216G1171K22197
17413B93368E9157k6404J13731B6864K88992k9107J40972j8367N2338k06332N3419
17402C08779A40483M94463B70411O2257K074d6275A36229f0663B97975J32435
17392D30410j59036J95870F3547j4621d1179D37136G440C526J53071L2720B3115
17380c75552C54587A75939J61629J02813A0926J40208J8557J87551j08747h3225
17369a69726D6648R7878A5214M359K87227k3623j28316p0867k1670K41996K2451
$$ y = [-136311, -150019, -20955, 79272, 504974, 132379, -211779, 143799, 212761, 226546, 16387, 184084, 358273, -10808, 224299, 131095, 166637, 378933, 136637, 218024, 146846, 315268, 42063, 46160, 107510, 343463, 349286, 230942, 364872, -12792, 292216, 71171, 293368, 59157, 32753, 146484, 26864, 315856, 286749, 427721, 409354, 461692, 255360, 308779, 140483, 634946, 270411, 332668, 334742, -46275, 136229, -60663, 297975, 430410, 271374, 467244, 63547, 48926, -41179, 437136, 7440, 3526, 156597, 189317, 23115, -375552, 354587, 175939, 337568, 440381, 10926, 151134, 169691, 357242, 248495, -83225, -169726, 46648, 144526, 15214, 19573, 306800, 283177, 154861, 83994, 62324, 304320, 326771]
17358C26771L1859B0378J25472A4916J98506E0839L1160K37110n3250j15613L1587
17347A81833J08360g8082D19728F9214i2827C41505j62625J57138r54c2265A58777
17335g5070B38436R858l5590q9653Q6004G3591J41775E2407a49267N1217A35448
17323B51973J49691n2355b76792C56809j76957c32149B22378o0468K60532A40230
17312c7881C3316J93119J14793n3245A2763M8375M55620c27611E20636A11448
17301c54442a513n0350B19728m4978c0612j86809C94210g9225D53318B26118q9549
17290A36569J27034J19989j42701L9214a90827E3083J69278k0028J42565b43398
17279B81939j03927m2295O668a2362C60909C656K61526j27072h9240F8174A4697
$$ y = [326771, 358630, 20378, 145850, 14916, 213422, 50839, 81999, 319109, 265859, 150246, 181833, 290193, -78082, 419728, 69214, -92827, 341505, 178880, 336018, 335064, -32265, 158777, -75070, 238436, 248294, 212704, 123051, 209055, 73591, 215366, 52407, -149267, -98050, 135448, 251973, 401664, 349309, -276792, 356809, 179852, -332149, 222378, 161910, 422442, 140230, -37881, 33316, 226435, 341228, 287983, 12763, 61138, 516758, -327611, 520636, 111448, -354442, -1513, -51863, 219728, 174750, -30612, -217421, 394210, -79225, 453318, 226118, 136569, 263603, 383592, 240891, 280105, -190827, 53083, 222361, 202333, 344898, -243398, 281939, 178012, 135717, 142385, -12362, 360909, 3656, 265182, 138110, -89240, 68174, 14697]
17267C35069A67517i4917B20368a09265B27465e6184E03251B07521J25563E9673
17256H6180K1936c267H9279l6308B178M7434J00846F1453K58302A08363Q6945
17245A95308H9115K98171A78134J94177F198a8570k16020E86405b4560A02542
17234A40575Q9838D1985J96171e5798A41026B8927L67582j76962K8630O2721b42337
17222D26619j63823a8955C7819b867A72900l4864L56940A91099K6090J92871A23316
17210g139C47298b2103j24240D99561B04473k2550R3962R9393A03098L9432C0577
17198A19656J60034K05252j01052A80239L02772A66835l9276j2622L13237j13155
17188C15019n094p195J66992F2340K286J40947J40191f1864J1456A35069L6450
$$ y = [335069, 167517, -94917, 220368, -109265, 227465, -56184, 503251, 207521, 333084, 59673, 86180, 108116, -3267, 89279, 52971, 2178, 49612, 150458, 61453, 319755, 108363, 195308, 89115, 387286, 178134, 372311, 6198, -18570, -234590, 586405, -24560, 102542, 140575, 230413, 41985, 238156, -55798, 141026, 28927, 396509, 219547, 248177, 310898, -242337, 426619, 262796, -18955, 37819, -2867, 172900, 138036, 494976, 191099, 217189, 410060, 123316, -7139, 347298, -22103, -146343, 499561, 204473, 181923, 275885, 375278, 103098, 142530, 30577, 119656, 279690, 484942, 383890, 180239, 483011, 166835, 127559, 114937, 428174, 315019, 309925, 302730, 469722, 62340, 64626, 205573, 345764, -61864, -50408, 135069, 171519]
17177A71519a28715A92560G0835O8046f281A42242J03376O8569L5414j7871h16
17165D74054j23045A02339m4051L12719l2661a4567A3543L65791j15257J97369
17155D61446d5886A92605r4925a83267C82184A72425k2950K9820P4985R7748A4339
17143B15749r6190K8997m5242M83882G1435K04055K35501B54769r7130K15483
17133C73122n547A65655J53084j31029J61908A60985b08354F68683B78287m4887
17123B33400I5251J44346H0638K83118L5225j29350K16856l0781J26105A07922
17112A77321I568M6890J09635L43666B27284J91586A66690J64266E0238L01251
17102C51489K75989G6678L22620J39647B66174J55867p7084J7129N41o5344K18697
$$ y = [171519, -128715, 192560, 70835, 138881, -6281, 142242, 245618, 314187, 349601, 331730, -816, 474054, 351009, 102339, 58288, 371007, 338346, -14567, 13543, 379334, 264077, 461446, -45886, 192605, 97680, -183267, 382184, 172425, 149475, 179295, 254280, 352028, 14339, 215749, 119559, 148556, 103314, 587196, 71435, 275490, 510991, 254769, 157639, 373122, 367575, 165655, 318739, 187710, 349618, 160985, -208354, 668683, 278287, 233400, 95251, 239597, 80638, 363756, 398981, 269631, 486487, 455706, 581811, 107922, 177321, 9568, 56458, 166093, 509759, 227284, 418870, 166690, 330956, 50238, 351489, 627478, 76678, 399298, 538945, 266174, 422041, 344957, 362086, 362627, 297283, 515980]
17091E15980j6461G5257J24187J65849K83609k36232q9867E2104J50849Q518M85256
17080F96727k70313k02819K20752j14533j0935K02583K3020B63270K14862M0069
17070E18201j74224j28893J99248J90920k54374J88677r6529A79037K52174L1955
17060D63166A38550M27461k21001l574K36965j37453j88246J23626J4882j18491
17050B72719j11779K83735A90815J57235O3915K98131C04141L46800P8819C40853
17039D04474q2795K62408j04549N5109J65927j10975J35075k71461Q5933B26349
17028H21461j41871j8750r1044n4321k1397K25062k34250k04954N38835r7427
17018G21344j16621k68858Q4336P2280Q0298p9691L40413m0986j74547j05479
$$ y = [515980, 499519, 75257, 199444, 365293, 648902, 412670, 322803, 52104, 202953, 211471, 696727, 426414, 223595, 444347, 329814, 318879, 521462, 544482, 263270, 478132, 518201, 343977, 215084, 414332, 605252, 350878, 539555, 443026, 179037, 431211, 463166, 138550, 566011, 345010, 341436, 578401, 440948, 252702, 376328, 391210, 272719, 160940, 444675, 190815, 348050, 411965, 710096, 304141, 650941, 729760, 340853, 404474, 321679, 584087, 479538, 534647, 700574, 589599, 724674, 453213, 539146, 226349, 821461, 679590, 660840, 569796, 515475, 494078, 719140, 484890, 279936, 818771, 721344, 604723, 335865, 420201, 492481, 572779, 493088, 833501, 792515, 617968, 512489]
17008E12489B48407L80265o1191K20956p296j56081K5666N6016j7866K2262B92202
16996C40639L18816k48435J5235j4317N23557j97989p8583J90521C75066O49265
16986A024331l83604J25370m4558J69980m314k78603o2224p1773L30452p4866
16976G30191k27570M63488l26683M92636j45724k22747K08526P6198l94759J68657
16966H22213j08584k06613N45277j80773P999K50197l92364J36949p1061R9681
16956I02921q2702Q3048j97807K02153l94590N49666j56994Q5823k59882Q9868
16946H21504K25717j67137K7251K91641j63510J48784m08835l9309K60358k26155
16936G70309L12230n5794J959M47489m21998Q4353j04007J87696k80310J74684
$$ y = [512489, 248407, 628672, 567481, 788437, 781141, 625060, 650726, 706742, 688876, 711138, 292202, 340639, 659455, 411020, 426255, 411938, 935495, 737506, 658923, 849444, 375066, 1024331, 640727, 766097, 721539, 891519, 887205, 608602, 546378, 474605, 805057, 730191, 502621, 966109, 639426, 1132062, 986338, 763591, 972117, 1048315, 653556, 822213, 713629, 507016, 1052293, 871520, 879519, 1129716, 737352, 874301, 803240, 902921, 820219, 903267, 705460, 907613, 513023, 1062689, 905695, 991518, 731636, 821504, 1047221, 880084, 907335, 1198976, 1035466, 1184250, 775415, 736106, 996464, 770309, 1082539, 1026745, 1028704, 1476193, 1054195, 1138548, 1034541, 1222237, 941927, 1116611]
16926A116611k45868K92778J93952k30661j81989L47317k93267K07893j02972
16917A103794j49703L05922J22793k61537J11688R7678J28395J6022K05376l23589
16907A356839k39568J89730m4816K50546j16553r7384J59961k30024K66679k49023
16897A246387K58529q0637k46871K37206r1756L33420j38426m2855R1044M27468
16887A993509k25654l92502K17151m74238M22213J60821J43465j00498K30706
16878A974973P8099m42335L05308K15251m57941J81111n0802P7129O5960j32748
16868A814005J15245Q4545K82849l21458L86475m23681j53872N52195l87320j73312
16858A775671N02427j19437J77534p1950J39654j6479R3258j79773R5827L94421
$$ y = [1116611, 870743, 1163521, 1357473, 1126812, 944823, 1292140, 998873, 1206766, 1103794, 954091, 1260013, 1382806, 1121269, 1232957, 1330635, 1459030, 1475052, 1680428, 1356839, 1117271, 1307001, 1262185, 1512731, 1396178, 1298794, 1458755, 1228731, 1495410, 1246387, 1504916, 1424279, 1177408, 1414614, 1322858, 1656278, 1517852, 1474997, 1566041, 1993509, 1767855, 1375353, 1592504, 1118266, 1540479, 1701300, 1844765, 1744267, 1974973, 2053072, 1610737, 1916045, 2131296, 1673355, 1854466, 1803664, 1880793, 1946753, 1814005, 1929250, 2013795, 2296644, 1975186, 2361661, 1937980, 1784108, 2336303, 1948983, 1775671, 2278098, 2158661, 2336195, 2264245, 2403899, 2387420, 2480678, 2300905, 2396732, 2791153]
16848B791153m25523m6566N31879l23188K88985l0816L6700k81821J02906K15621
16838B859330q1082L40919L7563k14521Q3167j06566K22312L39793o9593n6496
16828C354826M7978J86978K27898l51912n1586K43033J32611r2639J69485J88102
16818D054774J39977j05898M07580l48279K25878R3350O7467K2774M89714m2312
16808E005025j19562J70456j90897L01998K36162K65160j64723K16157j1998R4330
16798E802108K22887J53732R2395j74572M64484J88572K14173Q4065N6226M66786
16788G570856r4210M57144R5460K69406L3994N5809M56344K0018L41504L29689
16778I536014l00838O18758M54762J58553L35842K10602N73154J52802M75362
$$ y = [2791153, 2365630, 2319064, 2850943, 2527755, 2816740, 2785924, 2822624, 2540803, 2643709, 2859330, 2778248, 3119167, 3156730, 2942209, 3025376, 2918810, 3141122, 3480915, 3411322, 3354826, 3402804, 3589782, 3817680, 3465768, 3414182, 3657215, 3789826, 3697187, 3866672, 4054774, 4194751, 4088853, 4496433, 4148154, 4374032, 4467382, 4534849, 4557623, 5047337, 5005025, 4885463, 5055919, 4865022, 5167020, 5403182, 5668342, 5503619, 5719776, 5707778, 5802108, 6024995, 6178727, 6271122, 6096550, 6561034, 6749606, 6963779, 7047844, 7104070, 7570856, 7476646, 7933790, 8029250, 8298656, 8332650, 8388459, 8844803, 8864821, 9206325, 9536014, 9235176, 9853934, 10308696, 10467249, 10803091, 11013693, 11586847, 11739649, 12215011]
16769A2215011L56457J67196M40665J68673N61974N50471M04160O88828L80264
16760A5933699M49969P89172Q40776L69605O81580M10244N92023J261024O74578
16751B2002670R17837Q97152J084697J012382J135946J247512J114999J080946
16743C0494141J567195J431118J517724J995992J858502J836485K343870K001896
16735D5046923K682203K414927K678530L300288L098421L429742L703092L996558
16727G0350684M365453M701166M832584N761942N665791O038530O758323P094077
16719A15568550O907388P772692Q122225Q129438Q502847Q381043Q673394P752448
16711A79810025P773830P048420N875286N016942L774363K468899M73812q81258
$$ y = [12215011, 12571468, 12738664, 13179329, 13348002, 13909976, 14460447, 14864607, 15553435, 15933699, 16383668, 17172840, 18013616, 18383221, 19064801, 19475045, 20067068, 21328092, 22002670, 22920507, 23817659, 24902356, 25914738, 27050684, 28298196, 29413195, 30494141, 32061336, 33492454, 35010178, 37006170, 38864672, 40701157, 43045027, 45046923, 47729126, 50144053, 52822583, 56122871, 59221292, 62651034, 66354126, 70350684, 74716137, 79417303, 84249887, 90011829, 95677620, 101716150, 108474473, 115568550, 122475938, 130248630, 138370855, 146500293, 155003140, 163384183, 172057577, 179810025, 187583855, 194632275, 200507561, 205524503, 209298866, 211767765, 212241577, 211360319]
16703B11360319k076046m080563n173926o229850p214617p595477q491234q676237
16695A61822369q284940q447734q845919p927678p618839p531723p307288o562759
16687I9295489n949455n967860n559841n081450m776737m052107m374628l798487
16679E9734924l358161l388674l188688k476075k831441k169351k227467k165698
16671C7929369k154733j957126j417488j237699j928181j246921j199949j084275
16663B5702997j109633j194737j067959q57310o71811j125393r69618o52539k68158
16654A7785839p44390o78960p37809n25223l30994m12106m19498q06520m00241
16645A2730098n14848m69392k70923o11003n2338n01739k88516l16978j11389
$$ y = [211360319, 209284273, 205203710, 200029784, 193799934, 186585317, 178989840, 170498606, 161822369, 153537429, 145089695, 136243776, 128316098, 120697259, 113165536, 105858248, 99295489, 93346034, 87378174, 81818333, 76736883, 71960146, 67908039, 63533411, 59734924, 56376763, 52988089, 49799401, 47323326, 44491885, 42322534, 40095067, 37929369, 35774636, 33817510, 32400022, 31162323, 29234142, 27987221, 26787272, 25702997, 24593364, 23398627, 22330668, 21473358, 20801547, 19676154, 18706536, 18053997, 17785839, 17041449, 16362489, 15624680, 15099457, 14768463, 14356357, 13936859, 13130339, 12730098, 12215250, 11745858, 11474935, 10863932, 10811594, 10309855, 10021339, 9704361, 9592972]
16636I592972k34821k90725o40566p4420j0822l42995l78757K25438p72485k16062
16626F856757P3745m6151o86753J73158l35130J34097j42894j9844l17624N7408
16616E746769m40652O9667J61690l93856j26365N3333k82055J50243m39366j75888
16606D323520j71976L28787l17828l30925J13426K02591j50370m1056m0937l5992
16596C879240n76081L76231j50193K40732l30716n035k44047k91353O45931k72708
16586C272001m61120j49536L7431P9194J59028J4490j05692J17707l30910R4299
16576B726892m51931J58200k96618L20156L10198m07683j61857K54101k52436
16567B199022J50822l73255L18749k59153L55655n53327K76255m10606J82397
$$ y = [9592972, 9358151, 9067426, 8426860, 8352440, 8341618, 7998623, 7619866, 7845304, 7072819, 6856757, 6930502, 6884351, 6197598, 6370756, 6035626, 6169723, 6026829, 6006985, 5689361, 5746769, 5306117, 5375784, 5537474, 5143618, 5017253, 5070586, 4788531, 4938774, 4499408, 4323520, 4151544, 4480331, 4162503, 3831578, 3945004, 4147595, 3997225, 3956169, 3915232, 3879240, 3303159, 3679390, 3529197, 3769929, 3439213, 3434178, 3190131, 2898778, 3544709, 3272001, 2810881, 2661345, 2698776, 2777970, 2936998, 2951488, 2845796, 2963503, 2632593, 2726892, 2274961, 2433161, 2136543, 2456699, 2766897, 2359214, 2197357, 2451458, 2199022, 2349844, 1976589, 2295338, 2036185, 2391840, 1838513, 2114768, 1704162, 1886559]
16558A886559j19406K62974l60169L59495m9654m45188L95539j24808L5737l07411
16548A533668L48317k72389L0668k68187R9713o4838O0807J6639J81675k9999
16538A636074l14112K06871K34261n22229K62543J05560m43549J72240O0970j0203
16528A388426l1716j38231K04765l88172L50875l97265K77787l52376R8179R6943
16518A109215J77372j45064J35757k52472K17367k64244k24229P3417Q914J22330
16508I58363j31669K34828k02720k40063M48705j16977J46031l42662L7133j47074
16498F43895j4066K65078j12412R4502r630m1195j19311K65588l28778j35030
16488E08641K53113J3095O6822K8793m23847J35161L5515L00713l7336l10046
$$ y = [1886559, 1767153, 2030127, 1669958, 2029453, 1979799, 1534611, 1930150, 1805342, 1841079, 1533668, 1881985, 1609596, 1640264, 1372077, 1471790, 1406952, 1467759, 1484398, 1666073, 1636074, 1321962, 1528833, 1763094, 1240865, 1503408, 1608968, 1165419, 1337659, 1398629, 1388426, 1356710, 1218479, 1423244, 1035072, 1385947, 988682, 1266469, 914093, 1012272, 1109215, 1286587, 1141523, 1277280, 1024808, 1242175, 977931, 753702, 827119, 836033, 958363, 826694, 1061522, 858802, 618739, 1067444, 950467, 1096498, 753836, 790969, 643895, 629829, 894907, 782495, 876997, 867367, 826172, 706861, 972449, 643671, 508641, 761754, 774849, 841671, 870464, 446617, 581778, 617293, 918006, 880670, 570624]
16478E70624o8257J48986J84911k73787J43588K53443k76932k9002L01821k10440
16468G44955j18073J28309j28300Q895R1654j99367l6573K1079l0011m3444K71363
16457G10487k78005k7518J84180k41448l2972O79688k57159N516k89947P0677
16447E23499A69808K91260l7471j07611K43599j0526J97410l66631J71121j81274
16437C69685j74342F7789K85175l95J01231K44316C46484k3100L0314j54972L00896
16426D99622A72216J38229L26140k19158j7548L70537A80951J90812q0835J79884
16416D70812B10643J74157K09276j36624o9835A75076K22201j07693J90513J21579
16406F01676J02256A20850J80191J16570J1735j33075A5241L31436j8981K5993
$$ y = [570624, 502367, 651353, 836264, 562477, 706065, 959508, 682576, 653574, 955395, 744955, 626882, 755191, 626891, 635786, 727440, 528073, 491500, 512579, 482568, 439124, 710487, 432482, 404964, 589144, 347696, 314724, 994412, 737253, 742769, 452822, 523499, 169808, 461068, 423597, 315986, 559585, 549059, 746469, 379838, 550959, 369685, 195343, 67789, 352964, 352569, 453800, 698116, 346484, 323384, 353698, 198726, 499622, 172216, 310445, 636585, 417427, 399879, 770416, 180951, 371763, 290928, 470812, 210643, 384800, 594076, 457452, 387617, 175076, 397277, 289584, 480097, 601676, 703932, 120850, 301041, 417611, 429346, 296271, 15241, 346677, 327696, 353689]
16396C53689q4977A34099N01080d5837C56631J890m0483E3780M88842j25165j32136
16385B85321k3412L94001A90111K22869j35395k456F5917c977G8879Q2981K76664
16374D38524l9739A10617J04676o969J98327A07745L64281i3584A9888K47158
16364B67046r4505J65849A20271M68206H6183R0068l1856K31970H5392k9703K7205
16353H2894M34536A76140J24244H1092J30937L7849J88698r8847r9246a55746
16342A90097O2322A20297J55017r0354a51519A21842K03196A19442M76679E091
16331B85268J70151F9823L00799g4560A80550g3221B93387J20043A33256J86277
16321C19533p7470r682M3525p6955J62676J71503g4344I0560K88125E705K11053
$$ y = [353689, 268712, 134099, 635179, -45837, 356631, 358521, 318038, 53780, 542622, 417457, 285321, 261909, 655910, 190111, 412980, 277585, 275129, 65917, -3977, 78879, 161860, 438524, 398785, 110617, 215293, 208324, 406651, 107745, 472026, -93584, 19888, 267046, 172541, 338390, 120271, 588477, 86183, 176251, 144395, 376365, 85392, 55689, 82894, 517430, 176140, 300384, 81092, 212029, 249878, 438576, 339729, 240483, -155746, 190097, 252419, 120297, 275314, 184960, -151519, 121842, 325038, 119442, 596121, 5091, 285268, 455419, 69823, 370622, -74560, 180550, -73221, 293387, 413430, 133256, 319533, 242063, 232381, 275906, 198951, 361627, 533130, -74344, 90560, 378685, 5705, 216758]
16310B16758l0389B637J90945B624L654L78879A35017N8971m8481j2828J02728
16299B35407r1795K17171j66888c9547I1226a02307b6230B30091F8109K2432D351
16287a5171j65298A10231R7047m3422M2246k4909H6495O1453n676M6028j6393
16276A71907q4111J43842K9819k9955i3055A38887J17781B2195M389M8242c58
16264F4610b74437a2635A32873d1796B25491J80155A01312i501G5129a3587A98353
16252C7458J6120O1614a4612j10866B9069O302J59378I0960C0500J16385I453
16240B69384A25190J38852E3694J4433B8142J47505J54749A63144g1458C0553
16229a73888A25676d8291B0280j191J8274N6305N3560Q4366m743l9392a9618B6698
$$ y = [216758, 186369, 2637, 193582, 2624, 6278, 385157, 135017, 193988, 145507, 132679, 235407, 143612, 360783, 193895, -39547, 91226, -102307, -26230, 230091, 68109, 90541, 4351, -15171, -180469, 110231, 207278, 163856, 206102, 181193, 86495, 147948, 142272, 188300, 171907, 87796, 231638, 261457, 231502, -93055, 138887, 256668, 22195, 26584, 74826, -358, 64610, -274437, -12635, 132873, -41796, 225491, 405646, 101312, -9501, 75129, -13587, 198353, 37458, 53578, 115192, -14612, -125478, 29069, 35371, 194749, 90960, 30500, 146885, 9453, 269384, 125190, 264042, 53694, 68127, 28142, 175647, 330396, 163144, -71458, 30553, -173888, 125676, -48291, 20280, 19089, 37363, 93668, 147228, 231594, 226851, 187459, -19618, 26698]
16216h01E8704b1391m1885j10872G9530L50254A9391J9034N4062d9936C8376a23447
16203a69988A14870A26J56830b09702B10332d153A26170n8437J26429J14564j52233
16192A56493a09129B17157a16905o671B03822n1287b9034k0170H1793k3929B0711
16180d7231I9234k0401B6732j40a53208F2562J15848H1595K1141L0633P085C0184
16167I9778c85513I606a17686A05946C680b50869D0393M1824a82795D4287J12870
16156A57157a97289E3179K19121b20814a05570j22856b0367B9911a05277c8786
16145a49350K5179A65655o7793b41705D4823R0647d4277f888A87277c9249F1281
16133A0494b59657i381k0932q3297j23499M0632n6090A14047B2073c75068K5496
$$ y = [-801, 58704, -21391, -63276, -174148, 79530, 429784, 19391, 38425, 92487, -49936, 38376, -123447, -169988, 114870, 126, 156956, -209702, 210332, -4153, 126170, 67733, 194162, 308726, 156493, -109129, 217157, -116905, -123576, 203822, 152535, -29034, -49204, 81793, 57864, 20711, -47231, 99234, 78833, 26732, 26592, -153208, 62562, 178410, 81595, 102736, 133369, 140454, 30184, 99778, -385513, 9606, -117686, 105946, 3680, -250869, 40393, 82217, -182795, 44287, 157157, -197289, 53179, 272300, -220814, -105570, -228426, -20367, 29911, -105277, -38786, -149350, -124171, 165655, 97862, -241705, 44823, 135470, -44277, -6888, 187277, -39249, 61281, 10494, -259657, -9381, -30313, -113610, -237109, -196477, -252567, 114047, 22073, -375068, -349572]
16122c49572B2822K07659a36013C30357f5095F9042J49055c32013C4691J0019
16112D4710a68038k06516h5076A52572n3192i7380k91760J82855i2662B9569J05209
16101A34778I207Q9935e9091b1894A70887b26244B32577q4800a25012j33453K9073
16090b29392B97985j33662P531b89292I1015a10960F7209f9181E0291k3076d2485
16078a38166k15218c5725j30061G406i8566l4118E7344K23122A22640n2756c25285
16066a92872A19366Q5819a80434h1176b106F0098f340G0990a32955N6910A58467
16054A18621i6605l1309A43600a76804M0251k16460A61308f2697j33834F202L443
16043I645P6573b87452f2914j02213a6752j44457g4638k27150h0783r268A3703
$$ y = [-349572, 22822, 230481, -136013, 330357, -65095, 69042, 218097, -332013, 34691, 44710, -168038, -374554, -85076, 152572, 99380, -97380, -389140, -206285, -92662, 29569, 134778, 9207, 99142, -59091, -21894, 170887, -226244, 232577, 147777, -125012, -258465, -229392, 297985, 164323, 171854, -289292, 91015, -110960, 67209, -69181, 50291, 27215, -42485, -138166, -353384, -35725, -165786, 7406, -98566, -132684, 57344, 280466, 122640, 69884, -325285, -192872, 119366, 205185, -180434, -81176, -2106, 60098, -6340, 70990, -132955, -76045, 158467, 118621, -96605, -127914, 143600, -176804, -136553, -353013, 161308, -62697, -196531, 6202, 9645, 86218, -287452, -62914, -165127, -16752, -161209, -74638, -301788, -80783, -90051, 13703]
16031a40395A01552D1527J7633d5168C1156d21294B8462b6258A30158B5653b33960
16019A60881a84030O3366F0497g489l4355A70160N4968q6597J5485b67464J19201
16008a48263I7320l366j6640h8015j61925a8691h199k62184r1016A26082G213
15996E8316J7645J77623G6150H698a84956H8450D4049Q4271B5917a27544L8379
15985h9165G1526a23387J1808B8353H267j9J36992b05977j25459P7042G3110b2340
15972F8876Q4774c16000A41920b31610C73450J54345A84787k009k2458a64186
15961C61985a67957F5674M443c1202l1012j32650P4775L198E1991K65519d3721
15949i8796F5500a47472f1653k22140J14416f4925l1427A09890b3804q0515j40253
$$ y = [-140395, 101552, 41527, 59160, -45168, 31156, -421294, 28462, -26258, 130158, 25653, -233960, 160881, -184030, -120664, 60497, -7489, -41844, 170160, 225128, 138531, 154016, -267464, -148263, 97320, 93954, 77314, -88015, -249940, -18691, -8199, -270383, -361399, 126082, 7213, 58316, 75961, 253584, 76150, 8698, -184956, 88450, 44049, 128320, 25917, -127544, -89165, 71526, -123387, -111579, 28353, 8267, 8248, 145240, -205977, -331436, -254394, 73110, -22340, 68876, 153650, -316000, 141920, -231610, 373450, 527795, 184787, 182778, 160320, -164186, 361985, -167957, 65674, 70117, -31202, -62214, -194864, -120089, -116891, 51991, 317510, -43721, -98796, 65500, -147472, -61653, -283793, -169377, -64925, -96352, 109890, -23804, -104319, -244572]
15938b44572A44206D3725J47668a56833l32582a55579P0560C2158g6194k06057
15928b82251G1448j1118B2166a66328b1688r7287H6487P9279b48411P3277L7522
15917a37612j2529j24225C99927h8058j58791a9339A9366J90143I5616J08964
15907B04580a68312O5037j47556a02747B6373f5704j02496B66875h8407l9542
15897a27949A31123h2932B51515G3042b87431G2643g6296j01617j05336b2632
15886a79929E0701A4945K53708a6048A89490a54447A74763A340a57596O8764C31
15874a66097A0553e3907r5184A53823J67050a02234j70957B46546a29465A47554
15863B14846F909b04867N1195j12335H8707b50375a06491H3885J74550d34206
$$ y = [-244572, 144206, 43725, 191393, -156833, -489415, -155579, -85019, 32158, -76194, -282251, 71448, 60330, 22166, -166328, -21688, -118975, 86487, 165766, -248411, -175134, -137612, -150141, -274366, 399927, -88058, -246849, -19339, 19366, 209509, 95616, 204580, -168312, -103275, -250831, -102747, 26373, -65704, -168200, 266875, -88407, -127949, 131123, -82932, 251515, 73042, -287431, 72643, -76296, -177913, -283249, -22632, -179929, 50701, 14945, 268653, -16048, 189490, -154447, 174763, 1340, -157596, -88832, 331, -166097, 10553, -53907, -149091, 153823, 320873, -102234, -273191, 246546, -129465, 147554, 214846, 6909, -204867, -153672, -266007, 88707, -250375, -106491, 83885, 258435, -434206]
15852h7215C3517h6614K0007j24056A57018M3813g0277D30872H7062a24393J9501
15841a04892C22850A3344b3902B61596N1711a67382J8459G0906D664a82225A42382
15829A05372A2225K94407d30035a09306C9826J04409l9330l7895b160B82198B7944
15817B96251A04750R9062a50162n9914D20278d2799j43887g3796O841B36553a61937
15805f5839B16302a0732j79260A09039D9161a9518j75670A4375c28986C3589h8170
15793C150a907k85658C0368c12689J46012m768A91054b36433J03568m5996K0378
15782a58483L8182A58911c27679A98846a12521j53463d5053k94344l7230h9978
15771a82902B41640H7938h7299j32453a04510c5385a130k32571B25383A11716
$$ y = [-87215, 33517, -86614, -66607, -190663, 157018, 200831, -70277, 430872, 87062, -124393, -104892, 322850, 13344, -23902, 261596, 313307, -167382, -148923, 70906, 4664, -182225, 142382, 105372, 12225, 306632, -430035, -109306, 39826, 144235, 104905, 67010, -2160, 282198, 27944, 296251, 104750, 203812, -150162, -210076, 420278, -42799, -186686, -73796, -66955, 236553, -161937, -65839, 216302, -10732, -189992, 109039, 49161, -19518, -195188, 14375, -328986, 33589, -88170, 3150, -1907, -287565, 30368, -312689, -166677, -171445, 191054, -236433, -132865, -178861, -158483, -120301, 158911, -327679, 198846, -112521, -265984, -45053, -339397, -376627, -89978, -182902, 241640, 87938, -87299, -219752, -104510, -35385, -1130, -233701, 225383, 111716]
15760B12557d9669j36471J4820C9095O9703N0462h9201B76931b41610H9189L57583
15749D46772A98155H7942A8280b15376C59274G2293Q117a18394B30167B5716C43
15737a49309o0614d8950k09040A72790a05118q2007A86554a1857q7007K7067K7343
15726d4454l6791I0600b88160G972a28337r7494E6650q566k1515b32428H7413
15714A16182b99040C11471i1621c4272q1766L2109l7556A20409a90491m1131q3530
15703c15152e0333B38353F7206P7112n8303e7820F2781b09416e5772p0818B22193
15691a10591J7273K5911J0469j5329k21619J13241h6956D2303a81374g9985j65965
15680b45950M6620B00431M6278B7816L6018f2608a4391A91423b75158D03883a11417
$$ y = [212557, -49669, -186140, -171320, 39095, 108798, 159260, -89201, 276931, -241610, 89189, 446772, 198155, 87942, 18280, -215376, 359274, 72293, 80410, -118394, 230167, 25716, 343, -149309, -209923, -48950, -257990, 172790, -105118, -187125, 186554, -11857, -98864, -71797, -44454, -81245, 90600, -288160, 7972, -128337, -225831, 56650, 48084, 26569, -232428, 87413, 116182, -299040, 311471, -91621, -34272, -116038, -83929, -121485, 120409, -190491, -231622, -315152, -50333, 238353, 67206, 144318, 86015, -57820, 62781, -209416, -55772, -126590, 222193, -110591, -93318, -67407, -56938, -72267, -293886, -180645, -86956, 42303, -181374, -79985, -245950, -199330, 200431, 246709, 27816, 63834, -62608, -14391, 191423, -275158, 403883, -111417]
15668h1047b2346A4230N6142N4625A2825b22933J1194B15417a904C13208A21797
15656H902K56420r1650h8538A34332J6660b46871i8693d7826A66232n8949b14191
15644F9078l245a09385A47603D4948a61932k85698b5247A49584b19281e85q6846
15633h7431k11395A37687o1256a76694b557A14620j412P6085B2229a13806A11062
15621H4042b90846J39298c3223j62584L9641k65915j27372f9510A5723a85806
15610B67336M5474c71364E4482J85257j07707e5595j04698C17327A7209a31668
15599a00225A53659N5056c03406p9236a53403B91730b37259J08446C0025e8589
15588A71522a27143B1321a04616A80611a70201d4569F7896P0190J17688b15304
$$ y = [-81047, -22346, 14230, 70372, 124997, 12825, -222933, -211739, 215417, -1904, 313208, 121797, 8902, 265322, 173672, -88538, 134332, 150992, -246871, -98693, -47826, 166232, 107283, -214191, 69078, 65833, -109385, 147603, 44948, -161932, -447630, -25247, 149584, -219281, -585, -87431, -298826, 137687, 76431, -176694, -2557, 114620, 113208, 189293, 22229, -113806, 111062, 84042, -290846, -151548, -33223, -195807, -156166, -422081, -549453, -69510, 15723, -185806, 267336, 312810, -371364, 54482, 239739, 132032, -55595, -160293, 317327, 17209, -131668, -100225, 153659, 208715, -303406, -382642, -153403, 291730, -237259, -128813, 30025, -58589, 171522, -127143, 21321, -104616, 180611, -170201, -44569, 67896, 138086, 255774, -215304]
15577h8125A58201b97123A83511D3392P6898b38136f0791B77505a51469A24315
15566b30370B03820a78900A34841A7636J84640d29319P8723A14734b22535h4110
15555H6591l6477J84892g5479B5334b0011j88565A77456b19608Q6052k33398f4499
15543A39094J20462o5023D8477f1667G2230f1103A11886e5496A39219a12720k04698
15532c17418B10577M3233D1337e3521q2897A00506b797j35609A72741G7769R9062
15521A76831e7529j1480E3999N2936L3518J0209G1535N7432k9618g255k89768
15510b97023C62712m1272j02576J417F396a0631q6107J0778I9552c39513a39600
15498C0943i0265j46392C9146K41975a02578d6694A59579B9289L7198f5819B7430
$$ y = [-88125, 158201, -297123, 183511, 43392, 120290, -238136, -60791, 277505, -151469, 124315, -230370, 203820, -178900, 134841, 17636, 202276, -429319, -350596, 114734, -222535, -84110, 86591, 50114, 235006, -75479, 25334, -20011, -208576, 177456, -219608, -133556, -366954, -64499, 139094, 259556, 194533, 48477, -61667, 72230, -61103, 111886, -55496, 139219, -112720, -317418, 210577, 253810, 41337, -53521, -136418, 100506, -2797, -138406, 172741, 77769, 176831, -57529, -69009, 53999, 106935, 140453, 150662, 71535, 128967, 99349, -7255, -297023, 362712, 321440, 218864, 220281, 6396, -10631, -96738, -85960, 99552, -339513, -139600, 30943, -90265, -236657, 39146, 281121, -102578, -46694, 159579, 29289, 66487, -65819, 27430]
15486A84719b8114j24964j89003b5665A4101e1323B44515H5962j1218b96951a8301
15474g0148B14750e2514B4745a14278e4144l04429h755p6792D3560a33575C9396
15462A34133F1729q008M6577R3115J15636g3172B55309g739D39124I5362O5816
15451A61178A1311f5438j60923B5380i9205l4511A56926C0464a6821j42332A82654
15439A09107a53652g107B8275K1821a64574B41490c11223K7449H126c6614A86385
15427A60216m8892G590d9803k76773g2632B80533j17253a52077C7861f5611r0747
15416a56358A4196L2850O5150K38549j43841h9075c8526M843n5881G2586a99424
15404f2145F5953J39499b94475B05608n3209j5568n440k7379J34500G566f5828
$$ y = [184719, -28114, -153078, -342081, -25665, 14101, -51323, 244515, 85962, 74744, -296951, -18301, -70148, 214750, -52514, 24745, -114278, -54144, -358573, -8755, -85547, 43560, -133575, 39396, 134133, 61729, 53721, 100298, 193413, 309049, -73172, 255309, -7739, 439124, 95362, 161178, 11311, -65438, -226361, 25380, -99205, -133716, 156926, 30464, -16821, -159153, 182654, 109107, -153652, -7107, 28275, 50096, -164574, 241490, -311223, -283774, 8126, -36614, 186385, 160216, 111324, 7590, -49803, -326576, -72632, 280533, 163280, -152077, 37861, -65611, -156358, 14196, 47046, 112196, 350745, 206904, -89075, -38526, -33683, -89564, 72586, -199424, -62145, 65953, 205452, -294475, 205608, 152399, 136831, 131391, 104012, 238512, 7566, -65828]
15392f3924C09894I1680g6054j2094A61404A4490e5036k8217G4475a9784A8846
15380A28750a76610F3369a3095j04526C5117d6545C4635L4557E805J78871D0826
15368B85060l0937C0326b51200A45654G1751h3679p7973L6482E3257q699Q2208
15357A26766a04405D6078b98471L1402B83912a93152i4680B44797G1094c726l35445
15346c39171j4947b1426k885A39498B9342f3288j45598B54347H4675k7645a49546
15334c1080D44880B01303G195a93820q8249J23726j53235j33224D77369A06760
15323a01345C5836R206B003b50404A42112i9338r8790B67057a07444e1066C8968
15311B18375h1313j20601M8678G4732d4077k09015B92633A30174i7129g527I3023
$$ y = [-63924, 309894, 91680, -76054, -88148, 161404, 14490, -55036, -83253, 74475, -19784, 18846, 128750, -176610, 63369, -13095, -117621, 35117, -46545, 34635, 69192, 5805, 184676, 40826, 285060, 254123, 30326, -251200, 145654, 71751, -83679, -161652, -125170, 53257, 44558, 126766, -104405, 46078, -298471, -267069, 283912, -193152, -94680, 244797, 71094, -3726, -339171, -354118, -21426, -24311, 139498, 29342, -63288, -208886, 254347, 84675, 57030, -149546, -31080, 444880, 201303, 7195, -193820, -282069, -158343, -311578, -444802, 477369, 106760, -101345, 35836, 45042, 2003, -250404, 142112, -99338, -198128, 267057, -107444, -51066, 38968, 218375, -81313, -201914, -153236, 74732, -44077, -253092, 292633, 130174, -97129, -7527, 93023]
15299C4938J12151A1748J09722K41626o0986j0368a44110B1797J18113J12595
15289B52505h260j26334B36713a22023M2189r2665O7877k11171A61856G2370a98030
15277I0652L158J42304f5105A77730G9226b39441a3756A32829g0167A35912L8900
15266A74812K27572E0319J65334H2839A6220b80866A0183J34277d0101l8217j836
15255h0154B21052h2659A03152j7567B3983J84560m2744B0103J58002a83957N2293
15244a31664G0909B032J06468l5390k1658M1565L21866k05371L84594j84010N95319
15233A005415J59094k39928R9535m30795B06653a4761H4599J01535a526j74131
15223a75657A01354R4087K801i8260A04769D9206J9131J08698d2993l7446A71673
$$ y = [34938, 147089, 11748, 121470, 363096, 302110, 291742, -144110, 21797, 139910, 252505, -8260, -134594, 236713, -122023, -79834, -172499, -104622, -315793, 161856, 72370, -198030, 90652, 93810, 236114, -65105, 177730, 79226, -239441, -13756, 132829, -70167, 135912, 174812, 402384, 50319, 215653, 82839, 16220, -280866, 10183, 144460, -40101, -78318, -80154, 221052, -82659, 103152, 85585, 23983, 208543, 165799, 20103, 178105, -183957, -131664, 70909, 2032, 108500, 73110, 51452, 93017, 414883, 209512, 594106, 410096, 1005415, 1164509, 924581, 1024116, 593321, 206653, -14761, 84599, 186134, -1526, -175657, 101354, 195441, 198242, -98260, 104769, 49206, 68337, 177035, -42993, -80439, 171673]
15211A27836J33842k1226l7487M4192F9676a58381B41609b19823B81228A9914
15200C1733P4717e3957j4052B06927p3020l9014c390C62581o1891P915b014B00209
15187E1403N3683i9520I2450i2347B08057N9203D4167J98406e5925J8979b442
15175F507K59808c2389k7613p4337B35693C176L70K22911k5511a94806A92139
15163b77430B89727K6784H5751l4763h4410A65874f0711B09792a06258j8342A14158
15151A88547p0627b04352B5282J90607L7490b76386b7367C0812f850F4010b07764
15139I2634Q1340o9774j3870O2349f9921m6655H5669Q7698L48613g326k8973l2521
15127f8820C14399j08035g4406A58771d9383D86937A70034N6118c0772H1417J81247
$$ y = [127836, 261678, 240452, 202965, 247157, 69676, -158381, 241609, -219823, 281228, 19914, 31733, 106450, -53957, -68009, 206927, 133907, 94893, -3390, 362581, 300690, 308605, -2014, 200209, 51403, 105086, -99520, 92450, -92347, 208057, 267260, 44167, 242573, -55925, -36946, -2442, 6507, 266315, -32389, -60002, -134339, 235693, 3176, 3546, 226457, 200946, -194806, 192139, -277430, 289727, 316511, 85751, 50988, -84410, 165874, -60711, 209792, -106258, -124600, 114158, 188547, 117920, -204352, 25282, 215889, 253379, -276386, -27367, 30812, -6850, 64010, -207764, 92634, 173974, 104200, 90330, 152679, -69921, -116576, 85669, 173367, 521980, -7326, -36299, -68820, 314399, 206364, -74406, 158771, -49383, 486937, 170034, 226152, -30772, 81417, 262664]
15116B62664j4780c7587a998A50804R465o7590m2466J96375M4260B3288H233J0238
15104A8471Q4629j9555a07827D56839I0614O5714m3851N7363g20A38506M6081
15093A84587f779k7638B40845o4810N414a4239H1511p150P4980p4574J73339L7778
15081B85884P723j34592B7835J28348E2027B361g376A30773n3840J87482J33731
15070C98146l6638E1642K3913L61168A92989n701c4197I8719M7535J77443N5619
15059C79316J1232a09058C05857G6057K55715J82437k14489r7961b9398k42917
15049b72315B43927a05650r7616f766I2567J25631F6457K04591b5655D32910A32856
15037E09508i373D04493A34665n0914a37877D6790M12024P8591E7077l419A2504
$$ y = [262664, 247884, -37587, -1998, 150804, 160269, 92679, 50213, 246588, 290848, 23288, 8233, 18471, 103100, 83545, -107827, 456839, 90614, 156328, 112477, 169840, -720, 138506, 184587, -6779, -34417, 240845, 176035, 181449, -14239, 81511, 74361, 149341, 74767, 248106, 285884, 293607, 159015, 27835, 156183, 52027, 2361, -7376, 130773, 76933, 264415, 398146, 361508, 51642, 75555, 436723, 192989, 187288, -34197, 98719, 146254, 323697, 379316, 390548, -109058, 305857, 76057, 331772, 514209, 299720, 201759, -29398, -272315, 243927, -105650, -203266, -6766, 92567, 218198, 66457, 271048, -25655, 432910, 132856, 509508, -9373, 404493, 134665, 83751, -137877, 46790, 458814, 537405, 57077, 53658, 12504]
15025B61832L95579k70513L3080j89717o0663j5909g5026a5106j21558D19664
15014a57766B74414c2535F7103M06623J8831B40044F9326L19080A93727K0210
15004B13937m7660J30270R8351A37378M64323A27929H355L31457a54307G0086
14993B55595J21872A57797P3548Q094r7165P5884C9607K76387o4045L3434A25958
14981g1938B68599L2071A01597M23879n9414A38136K1889K95541A46062I334M58610
14970D67944A22354m9170O041G558N9886J02226m9297L06119B3310L36909A09132
14958b37185E9489L33408A31408K82747j14278O6538A31898O3015b195D06982
14947A85532M74727l22136Q3469G5871K3489L8390J591K25637o5402j45698J84624
$$ y = [261832, 657411, 386898, 419978, 230261, 169598, 153689, -75026, -15106, -136664, 419664, -157766, 274414, -32535, 67103, 473726, 492557, 240044, 69326, 388406, 193727, 213937, 166277, 296547, 394898, 137378, 601701, 127929, 8355, 339812, -154307, 70086, 255595, 377467, 157797, 231345, 239439, 142274, 218158, 39607, 315994, 251949, 285383, 125958, -71938, 268599, 300670, 101597, 525476, 466062, 138136, 160025, 455566, 146062, 9334, 467944, 122354, 73184, 79225, 7558, 67444, 169670, 120373, 426492, 23310, 360219, 109132, -237185, 59489, 392897, 131408, 414155, 299877, 366415, 131898, 194913, -2195, 406982, 185532, 660259, 338123, 421592, 75871, 99360, 137750, 139341, 364978, 299576, 153878, 338502]
14936C38502P258J7542J84634J7489k45454r8963K57176A91924L0731j4618p0290
14925A37747J36652H9577J61204L32286j98730A29702J73254j10231K0572J88954
14915D02251q2745o777I7422N37143A38687P6042K80471k9056C2692M51995j6815
14904D67872j67880N2860J8703L817j63044r00j4402R4086J6731M184p0732p1462
14892A69833J57011A44652R9113R5410A55397K96262j75407L3246J16379Q6619
14882E12496k39065J4413b0296C55124J18666o2938j51473q7945J86853j31996
14872B26291l1675e276B20374M84687l44157l2268K64578B94966J8956O1506Q0575
14861D56003j0253J56245B53113a222C73833L671L3351o265N1941j27389J29071
$$ y = [338502, 345760, 363302, 547936, 565425, 319971, 221008, 478184, 191924, 222655, 208037, 137747, 274399, 89577, 250781, 583067, 384337, 129702, 302956, 192725, 213297, 402251, 319506, 312729, 97422, 634565, 138687, 214729, 495200, 466144, 32692, 484687, 467872, 299992, 352852, 371555, 375372, 212328, 211428, 197026, 291112, 307843, 312027, 241295, 169833, 326844, 144652, 243765, 339175, 155397, 451659, 276252, 309498, 425877, 512496, 273431, 287844, -20296, 355124, 473790, 410852, 259379, 171434, 358287, 226291, 194616, -5276, 220374, 705061, 360904, 328636, 593214, 294966, 313922, 375428, 456003, 445750, 601995, 253113, -1222, 373833, 377504, 410855, 404590, 456531, 329142, 458213]
14850D58213j4934j08791j1141j52763J53235J9437L16313j72723Q9331k11001
14840C65176j09985j24426K78189j19672J83789A70445N21394k3973j70317A98266
14829D22636J64670J6001q1202j24524q5423J8566J40100N4136p2601P3223r4258
14818D31324J10411k6971K63483A58679K06868Q3212Q2615k20691J44226N8904
14808E13813J7598J35826A14788M37189L4194r1853k30873K13298P4087J72013
14798G22843j22608o9408n531L799J88672j32795p601O2842j25661j26722j90066
14787A97764O61440B67258N40062j87744O9863m6893k55062L72656l01677J35198
14777E93661K16444C96761K2248r4275L76891j2044j50156J43968n8699K89956
$$ y = [458213, 443279, 334488, 323347, 170584, 323819, 343256, 659569, 486846, 576177, 365176, 255191, 130765, 408954, 289282, 473071, 170445, 691839, 667866, 497549, 198266, 422636, 587306, 603307, 522105, 397581, 312158, 330724, 470824, 524960, 452359, 525582, 431324, 541735, 514764, 778247, 158679, 365547, 448759, 531374, 310683, 454909, 513813, 531411, 667237, 114788, 551977, 586171, 494318, 263445, 476743, 550830, 722843, 600235, 530827, 525296, 529095, 717767, 584972, 577371, 640213, 514552, 387830, 197764, 859204, 267258, 807320, 619576, 689439, 642546, 387484, 760140, 458463, 593661, 810105, 396761, 419009, 324734, 701625, 689581, 539425, 683393, 624694, 914650]
14767I14650l47617A83210O45984l86036J59296M17700m22299q1847K21229m4942
14757F92295k42779M39929D03038r966J99674k3069Q3841p764K3330o7199J87181
14746G89066J14281k08758j45340o3203K52903p5608K24897l10490L37929k78360
14736F37317J76935M2108j74915K02939L9662j68373l4600k17438M37989k06574
14726G35050j32122J10981L02122k89410m698j2431R9600J27512k90624J3413
14716F59393K96917m29570M02272j63304K36781j96317k44983L07614j99700j75210
14706D93893N2164K96079J01729o2590R3348m51820K18019k78224J00066L87566
14696I50230j01411M96425n41417Q8128k23780K07435M9805j20742K3624j78014
$$ y = [914650, 567033, 183210, 829194, 443158, 602454, 1020154, 597855, 516008, 737237, 692295, 449516, 889445, 403038, 393072, 592746, 569677, 653518, 645754, 669084, 601885, 789066, 903347, 694589, 549249, 486046, 738949, 663341, 888238, 577748, 915677, 637317, 814252, 856360, 681445, 884384, 924046, 755673, 721073, 503635, 941624, 735050, 602928, 713909, 1016031, 726621, 721923, 709492, 809092, 936604, 645980, 659393, 956310, 526740, 929012, 765708, 1002489, 806172, 561189, 868803, 669103, 493893, 546057, 842136, 943865, 881275, 974623, 522803, 740822, 462598, 562664, 950230, 848819, 1345244, 803827, 891955, 668175, 875610, 925415, 804673, 828297, 650283]
14686F50283L44629k81462j51776M47916l38833K46168j99408R8273K56057k14816
14676H57031J89852j69987P4416j8928M6974n1489n0348J64272j64019J98954
14666A076728j70040L78928l48383K7876N7827L1316k21978J87230l88404N14443
14656A145543l57871K71485J99081m8759l8996p7788n144l4860r3522J20414k0684
14645A058899j804Q5397r0196l15355O32555j08274j78038k6727M08299k64664
14635A200092L1193P5838p6989O8160k2949k68216L9838L74250q3235J706l66430
14624I73258R7784L1392K58600k73819j47370M92305p3454J19534R0680l20966
14614A247944K05348K7798j53957k26589L96139k9316J20117k15716K67211l04347
$$ y = [650283, 994912, 713450, 561674, 1009590, 670757, 916925, 717517, 815790, 1071847, 857031, 1046883, 876896, 951312, 932384, 979358, 927869, 877521, 1041793, 877774, 1076728, 906688, 1285616, 937233, 965109, 1022936, 1054252, 832274, 1019504, 631100, 1145543, 787672, 1059157, 1258238, 1209479, 1170483, 1092695, 1087551, 1052691, 959169, 1079583, 1058899, 1057095, 1142492, 1052296, 736941, 1369496, 1261222, 1083184, 1056457, 1464756, 1200092, 1231285, 1307123, 1230134, 1298294, 1275345, 1007129, 1046967, 1421217, 1337982, 1339688, 973258, 1071042, 1102434, 1361034, 1087215, 939845, 1432150, 1358696, 1478230, 1568910, 1247944, 1453292, 1481090, 1327133, 1100544, 1496683, 1467367, 1587484, 1371768, 1638979, 1334632]
14604A334632K27255l12973M12386l12055M63595l90251j32225m4525K30213J81214
14594A657266k31860K74919N4199k49469K39715k00197L45634r8884k04830r3282
14584A493211j05675M60811m13978N38991O6917p50213N73523l42954M82956l7032
14574A966557K36817J5727o33926N24874j06158j13491J4311J5549J67369n6444
14564B031185L38535k00413K8898O3360r4712M30881n22969M71l59903N18879
14554B234212K96324k54179L59384L7650k0972j97034J08400M91892J30428k06349
14544B979756L96760N1599K93322K38216L74206J11887M96212R31746R45666J233530
14534H052900K444064M344547O917232Q981947j597339j0904090o606520m046955
$$ y = [1334632, 1561887, 1248914, 1661300, 1349245, 1812840, 1422589, 1290364, 1245839, 1476052, 1657266, 1425406, 1700325, 1754524, 1505055, 1744770, 1544573, 1890207, 1791323, 1586493, 1493211, 1387536, 1848347, 1434369, 1973360, 2040277, 1290064, 1863587, 1520633, 2003589, 1966557, 2203374, 2219101, 1585175, 2110049, 2003891, 1890400, 1904711, 1920260, 2087629, 2031185, 2369720, 2169307, 2198205, 2261565, 2166853, 2597734, 2074765, 2075236, 1715333, 2234212, 2530536, 2276357, 2635741, 2673391, 2652419, 2455385, 2563785, 3055677, 3186105, 2979756, 3376516, 3428115, 3721437, 3959653, 4333859, 4445746, 4941958, 5873704, 6819370, 8052900, 10496964, 14841511, 21758743, 30740690, 29143351, 18239261, 11632741, 7585786]
14526G585786k072102j189413n53779m74480j82775l20635k80187n0141j15630
14517B346644k334K22414L00596m51412j11872K10804J70251j77485K66428j71249
14507B602785k18690L24117L0500j02017q1390r8227L32048l7400L25914p9065
14497B998575l75121M24049n2129J31429j74274M75537k44715o5867j52210M40960
14487C406234l18072L46442j03467j9087J44983o4532l6798J25266J65966j67671
14477C479264J72777R4171O5903l05678M23857R5709j37227M1242P3793p6898
14467C926913O5355L79672m34566K25648k04036K22445L4220n197J6979L18680
14457D546113o1413j50688p8938N80859j31583M2614J18785j13029k04909O71823
$$ y = [7585786, 5513684, 4324271, 3770492, 3296012, 3113237, 2792602, 2512415, 2462274, 2346644, 2344310, 2566724, 2867320, 2415908, 2304036, 2514840, 2685091, 2507606, 2774034, 2602785, 2384095, 2708212, 2738712, 2636695, 2555305, 2457078, 2789126, 2751726, 3077640, 2998575, 2623454, 3047503, 2995374, 3126803, 2952529, 3428066, 3183351, 3117484, 2965274, 3406234, 3088162, 3434604, 3331137, 3312050, 3457033, 3392501, 3355703, 3480969, 3646935, 3479264, 3652041, 3746212, 3812115, 3506437, 3930294, 4026003, 3888776, 3930018, 4003811, 3926913, 3992268, 4371940, 3937374, 4163022, 3958986, 4181431, 4215651, 4210454, 4227433, 4546113, 4484700, 4334012, 4255074, 4835933, 4704350, 4746964, 4865749, 4752720, 4547811, 5219634]
14447E219634l88269J30356k73684L32347J19517J69019j56489M513n3601M51368
14437E554711j37819M01509j50285j48113J70540J88518M00994k54661L44697
14428F370091l53505L38181J07470Q4039j4213l97093P95288j64692N4396K26610
14418G046572L92672j03548l87587K44632K08004K20912n1047K51554r9424J49639
14408G872379l43898O55792j58150K72037K51405L7702M1750N6426N21649q5843
14398I121249k62372L95998J82405P9924P6224N72319n0330N4778J08558K16690
14388A0495443K99657j3690J61617K95077J90111K20588L74167k87166P5169M17023
14378A2227996J59916L82242J9416K69073J62797N09818K89467J73010J47876
$$ y = [5219634, 4831365, 4961721, 4688037, 5020384, 5139901, 5308920, 5152431, 5156944, 5103343, 5554711, 5416892, 5818401, 5668116, 5520003, 5690543, 5879061, 6280055, 6025394, 6370091, 6016586, 6354767, 6462237, 6546276, 6532063, 6134970, 6930258, 6765566, 6819962, 7046572, 7439244, 7335696, 6948109, 7192741, 7400745, 7621657, 7570610, 7822164, 7722740, 7872379, 7528481, 8184273, 8026123, 8298160, 8549565, 8587267, 8629017, 8685443, 9207092, 9121249, 8858877, 9254875, 9437280, 9517204, 9593428, 10165747, 10115417, 10170195, 10278753, 10495443, 10795100, 10781410, 10943027, 11238104, 11428215, 11648803, 12022970, 11735804, 11810973, 12227996, 12387912, 12770154, 12789570, 13058643, 13221440, 13731258, 14020725, 14193735, 14341611]
14369A4341611K44414J92324L18960O21118L10289k28674M94930O54796L5260
14360A6985028K68744M34430L13772K6368M07032P10946L06212K42294N09231
14351B0204057O46406M98730L40942N74637M01287M66337O70005M12027N26843
14342B4741271P63832J17193R36086L12571P40896Q86443L35564J113928N86145
14333C0533929O27382Q29861J164107O63708P78741J354883Q91155R68734J133458
14324C8945958Q45244J235605J067829J482463J345221R27120J533049J684407
14316D9066896J312129J621634J669720J328607K340093J819613K032294J881882
14308F3072868K472823K003843K373473K757241K833973K968697K567620L158353
$$ y = [14341611, 14586025, 14778349, 15097309, 15718427, 16028716, 15800042, 16294972, 16949768, 16985028, 17253772, 17688202, 18001974, 18028342, 18435374, 19146320, 19452532, 19694826, 20204057, 20850463, 21349193, 21690135, 22264772, 22666059, 23132396, 23802401, 24214428, 24741271, 25505103, 25622296, 26558382, 26870953, 27611849, 28498292, 28833856, 29947784, 30533929, 31161311, 31991172, 33155279, 33818987, 34597728, 35952611, 36843766, 37812500, 38945958, 39791202, 41026807, 42094636, 43577099, 44922320, 45849440, 47382489, 49066896, 50379025, 52000659, 53670379, 54998986, 57339079, 59158692, 61190986, 63072868, 65545691, 67549534, 69923007, 72680248, 75514221, 78482918, 81050538, 84208891]
14300H4208891L357373L420301L599131L997636L961886M639428M105636M781987
14292A16072269N322976N403611N452231O143709O422727O837069O962238P589139
14284A66205969P964452Q545130Q830835R665653J0008407J0533997J1364963
14277B33119406J1489298J2632853J2906621J3458726J3767422J4497321J4404844
14270C26276491J4473367J4415270J4142020J3075128J2265921J1639026J0793965
14263D17081188R904742Q458628P377847O834866N233005L781894Q64551n73476
14255D58963245J07962l721383p877363p614932r602550j0044325j1370601j0675816
14247C98164237j3132690j3436239j3782762j4000224j3629218j3740150j3361246
$$ y = [84208891, 87566264, 90986565, 94585696, 98583332, 102545218, 107184646, 111290282, 116072269, 121395245, 126798856, 132251087, 138394796, 144817523, 151654592, 158616830, 166205969, 174170421, 182715551, 191546386, 201212039, 211220446, 221754443, 233119406, 244608704, 257241557, 270148178, 283606904, 297374326, 311871647, 326276491, 340749858, 355165128, 369307148, 382382276, 394648197, 406287223, 417081188, 426985930, 435444558, 442822405, 449657271, 454890276, 458672170, 459536721, 458963245, 459071207, 455349824, 447472461, 439857529, 430254979, 420210654, 408840053, 398164237, 385031547, 371595308, 357812546, 343812322, 330183104, 316442954, 303081708]
14240C03081708j3003032j2198716j2215459j2192604j1981727j1137706j1112642
14233B19239822j0563306j0353165r864724r414711q841955q632125p600390p538799
14225A46430647o678558o519248n922380n490192n562176m932928m728300m426648
14217A02170217l812519m007773l840073l645137l531237k799408l375896k772920
14209G4385254k915431k604082j987405k456845j885196k427100j928623k049426
14201E6131146j566004j748267j414763j737837j349586j472155j421811j420750
14193D3999973j222719o31668j636952j139514j321036r45294l56953j111062
14185C5634775p51904j092679j212930m95997r37067j038728m51654r33534o10894
$$ y = [303081708, 290078676, 277879960, 265664501, 253471897, 241490170, 230352464, 219239822, 208676516, 198323351, 188458627, 179043916, 170201961, 161569836, 153969446, 146430647, 139752089, 133232841, 127310461, 121820269, 116258093, 111325165, 106596865, 102170217, 98357698, 94349925, 90509852, 86864715, 83333478, 80534070, 77158174, 74385254, 71469823, 68865741, 66878336, 64421491, 62536295, 60109195, 58180572, 56131146, 54565142, 52816875, 51402112, 49664275, 48314689, 46842534, 45420723, 43999973, 42777254, 42145586, 40508634, 39369120, 38048084, 37102790, 36745837, 35634775, 34882871, 33790192, 32577262, 32081265, 31144198, 30105470, 29653816, 28720282, 28109388]
14176B8109388o98756m21626n71513r62490n37511m61436m66613n54994l12088
14167B3122361j056667j22870m37926m90481k46974m87884n47589m50610l65987
14158A8915373m06733k74354j83840n68757l0816n20736n31768k13486k16142
14149A5968741j67868j58103o06867j23232k2356m48652m32412L8078o27235m2079
14139A3378015K7948m15163k58332k98502J5805L3376p05303m166k59322J79972
14129A1694328m96770l69822j09546J16614k68236J6744l35857Q1573n47423J47261
14119I928866k56091m5484m42383p5534k67190J8718K1282j59086k21236N1505
14109H553367j07017j49763J88053k93177k17127q4135J24548n39287o2515j44914
$$ y = [28109388, 27410632, 26989006, 26417493, 25455003, 24917492, 24456056, 23989443, 23434449, 23122361, 22065694, 21942824, 21504898, 21014417, 20767443, 20279559, 19731970, 19281360, 18915373, 18508640, 18234286, 18050446, 17481689, 17450873, 16930137, 16398369, 16184883, 15968741, 15800873, 15642770, 15035903, 14912671, 14890315, 14441663, 14009251, 14047329, 13420094, 13378015, 13405963, 12990800, 12732468, 12433966, 12449771, 12483147, 11777844, 11773678, 11514356, 11694328, 11197558, 10827736, 10718190, 10834804, 10566568, 10583312, 10247455, 10329028, 9781605, 9928866, 9672775, 9627291, 9184908, 9109374, 8842184, 8860902, 8882184, 8723098, 8501862, 8553367, 8446350, 8296587, 8484640, 8191463, 7974336, 7890201, 8014749, 7475462, 7412947, 7268033]
14099G268033L64351m39243N249N5017k61451m6121K26643m94286N1899m57245
14089F272846K55251R5224k68547j8657k13819m36653M17463j09338m6414j55057
14079E792299R5333q9853k19493R2493k08844j60310J48606k35918p8854j2413
14069E123046P4168j27007L1336l6467L3729j4092l32031k99648K62807j85588
14059D530253M4280J98285j97555j65271j60152K82172j46206k02621M08904k12420
14049D379669o08546K81470M8225J16225n3233r9290K09035L186k56053Q5972
14039D106660l30397k63960k2328L20025N3215l34606K13043j50516K11570m19423
14029C383283N7304J97482r7793k61697j91740M6357L33784n04453K5481P2127
$$ y = [7268033, 7632384, 7193141, 7198390, 7253407, 6991956, 6945835, 7172478, 6678192, 6730091, 6272846, 6528097, 6623321, 6354774, 6336117, 6122298, 5685645, 6103108, 5993770, 5947356, 5792299, 5887632, 5797779, 5578286, 5670779, 5461935, 5301625, 5450231, 5214313, 5135459, 5123046, 5197214, 5070207, 5101543, 5065076, 5098805, 5084713, 4752682, 4453034, 4715841, 4530253, 4574533, 4772818, 4575263, 4409992, 4249840, 4532012, 4385806, 4183185, 4592089, 4379669, 3771123, 4052593, 4100818, 4217043, 4163810, 4064520, 4273555, 4276741, 4020688, 4106660, 3776263, 3512303, 3489975, 3810000, 3863215, 3528609, 3741652, 3591136, 3802706, 3383283, 3440587, 3638069, 3540276, 3278579, 3086839, 3133196, 3466980, 2962527, 2988008, 3060135]
14019C060135J27163j87273J28350k6031l85798L78255J6098j02689k5592j76286
14009B806332K9183l7444m5285k9100J45826r8856j11787j1143K59294k52713
13999B654307k99089J97252k44192M73658l45984L6827K20531k91261J5104L09911
13989B727064l64254L0904j6721k18869K36245N9853J70038m8578l80437M84087
13979B679332J15198N87115K20232P00645J145720J551275L543622O199281R415094
13970B6157514K458803q394874o396251l743462k087093j911960q54867p83324
13962D444486k07934n42884m6251n87211K59006k86123O1778j68390l05745O5423
13952B686155r6478k13239o051n2826k13720K70677k57608J1419J82821j44752
$$ y = [3060135, 3187298, 3000025, 3128375, 3102344, 2716546, 3094801, 3110899, 3008210, 2982618, 2806332, 2835515, 2798071, 2752786, 2723686, 2869512, 2770656, 2658869, 2647726, 2907020, 2654307, 2355218, 2552470, 2308278, 2781936, 2435952, 2472779, 2693310, 2402049, 2417153, 2727064, 2362810, 2393714, 2376993, 2158124, 2394369, 2454222, 2624260, 2575682, 2195245, 2679332, 2794530, 3381645, 3601877, 4302522, 5448242, 6999517, 10543139, 16742420, 26157514, 28616317, 20221443, 13825192, 10081730, 7994637, 6082677, 5227810, 4444486, 4236552, 3693668, 3647417, 3060206, 3319212, 3033089, 3094867, 2926477, 2620732, 2686155, 2589677, 2376438, 2370387, 2317561, 2103841, 2374518, 2116910, 2128329, 2311150, 2166398]
13942B166398P0035j86468J26640N6378l20969l16724K50457M89278l65205p5818
13932A894002J45732j94013J19075j83503j00260K37563k045p4270m9708J54118
13922A946691K9508k74005k85756L06773j6415j55843j62773O1004K68712l06114
13912A411782K83921j90076N2716J8091q7004J73308o1731n0817p1949J54555
13902A632796j80799r847k1342L0886l9994j6341K28291l80564L52415l15531
13892A279970K95769L9686J92176l94744j07782L31647r7285J17990k59069j18329
13882A280029L809j92823J38108n5771J63159k64351J66899r9063J22168m4366
13872A217798m7348Q2680L5462j7723l14158M08308k13272J84685p1078j19366
$$ y = [2166398, 2236433, 2049965, 2176605, 2232983, 1912014, 1595290, 1845747, 2335025, 1969820, 1894002, 2039734, 1845721, 1964796, 1781293, 1681033, 1918596, 1916551, 1842281, 1792573, 1946691, 1976199, 1702194, 1416438, 1723211, 1706796, 1550953, 1388180, 1449184, 1717896, 1411782, 1695703, 1505627, 1558343, 1576434, 1489430, 1662738, 1601007, 1550190, 1478241, 1632796, 1451997, 1442150, 1420808, 1451694, 1411700, 1395359, 1623650, 1243086, 1595501, 1279970, 1575739, 1615425, 1807601, 1412857, 1305075, 1636722, 1539437, 1657427, 1398358, 1280029, 1283838, 1091015, 1229123, 1173352, 1336511, 1072160, 1239059, 1139996, 1262164, 1217798, 1170450, 1253130, 1288592, 1270869, 956711, 1365019, 1151747, 1336432, 1265354, 1145988]
13862A145988P4624k88320M66193p1353L75p5503n01250O03941k15967j22215
13852A016513p980J09170O284J28295j37596j55294L56033m34087J90945K96002
13842A368285j80328j37012L9140J33849r7777M5779J52298k57181l031N7072
13832A121094j58856P2639l81537N12374k45418M42548k95151O4023m18197K20876
13822I34395o9199K8902J41983j83409O3487J49509j00816j7375m5453k28252
13812F73772M23404j71902J87127j16990k63274R0682J22939L19663l95610q4580
13802G85231n6829N13673n33313q3952R3283J84643p263K80849k62003o2532N05254
13791A357041F16861L67715j69394J59201j9028m20323K05458k41957L07301K73000
$$ y = [1145988, 1220612, 932292, 1398485, 1327132, 1327507, 1252004, 750754, 1354695, 1138728, 1016513, 1008533, 1117703, 1123987, 1252282, 1114686, 959392, 1315425, 881338, 1072283, 1368285, 1187957, 1050945, 1090085, 1223934, 1126157, 1171936, 1324234, 1067053, 1064022, 1121094, 962238, 1034877, 653340, 1165714, 920296, 1362844, 1067693, 1131716, 713519, 934395, 865196, 894098, 1036081, 852672, 916159, 1065668, 964852, 947477, 902024, 673772, 1097176, 925274, 1112401, 995411, 732137, 822819, 945758, 1265421, 869811, 785231, 728402, 1242075, 708762, 624810, 718093, 902736, 895473, 1176322, 914319, 851787, 1357041, 616861, 984576, 815182, 974383, 955355, 535032, 740490, 498533, 805834, 1078834]
13781A078834n26371J9032M10235j32384M8141r5808P0885k45304K54922K0131
13771I02313l02643M8276P2811M14862D55338M79886j04532M3675k16322L10987
13761I69032j83853J24928j09829j8036k68415K14111J5769j34174K37816l08185
13751E39164j1233R9296N40065D90608L08436l34802L12262J57606k61173k22068
13741D50869N16063k15515N9338K3860j83630J1550o6244j06731K16956J53193
13731H59709J75096n16154J65976o2451Q7230L1795k17735N3210K97045k022k60247
13720F11452k8500P0661k68439J18062L2817r2518J70627J05651J599B76569O60893
13709I37462D33670K06636J3661J54575J06521l14273B30024K44013J2769L92394
$$ y = [1078834, 552463, 571495, 981730, 849346, 897487, 801679, 872564, 627260, 882182, 902313, 599670, 647946, 720757, 1135619, 455338, 935224, 830692, 874367, 658045, 969032, 785179, 910107, 800278, 782242, 513827, 727938, 743707, 609533, 847349, 539164, 527931, 627227, 1167292, 490608, 799044, 464242, 776504, 934110, 672937, 450869, 966932, 751417, 810755, 834615, 650985, 662535, 596291, 489560, 706516, 859709, 1034805, 518651, 684627, 622176, 709406, 741201, 523466, 576676, 873721, 871699, 611452, 582952, 653613, 385174, 503236, 536053, 443535, 614162, 719813, 721412, 276569, 937462, 433670, 640306, 653967, 808542, 915063, 600790, 230024, 474037, 486806, 879200]
13699H79200k54223K46548B07243M46941J71443D08191N76631C05430J05380J81782
13689E92592r2029l4405J06051R9439k36373J04265B48326Q8135M23281K8598
13679G88340l71209L58616k66995m3979j34422Q4740L67700L4628C83652o033
13669C77619L80151j60004q2009B0497M10777k8560Q0308J60459B94531l2624
13659B61907J5148J79232J38981k77238J25063J90838B28686K13736J40002m8578
13649E33846J48968j35253n1724k8573j2707R8025j83354N73J803j9365J5444
13638C67683N8824A48041K79845l6285A47104K38024j63191L92458k56117M2024
13628D00302G4984L68583R0129n7648j86662p487K74438A19526K68075O5209K060
$$ y = [879200, 624977, 871525, 207243, 654184, 825627, 408191, 984822, 305430, 410810, 592592, 500563, 466158, 572209, 671648, 435275, 539540, 248326, 336461, 759742, 788340, 417131, 775747, 508752, 464773, 330351, 415091, 782791, 817419, 383652, 377619, 757770, 597766, 515757, 20497, 431274, 402714, 483022, 643481, 294531, 261907, 277055, 456287, 595268, 318030, 443093, 633931, 228686, 442422, 582424, 533846, 682814, 547561, 495837, 467264, 454557, 552582, 369228, 369801, 371604, 352239, 367683, 426507, 148041, 427886, 391601, 147104, 385128, 221937, 614395, 358278, 400302, 74984, 443567, 533696, 476048, 289386, 281899, 556337, 119526, 387601, 452810, 454870]
13617D54870D7605M71719j09058j45208L78549B65250K73927B01091K75788j61074
13607C15805j00764J29113N9388A78477J96914J46116j99543J33669G1090L93121
13597D64211j38647J72439k19710j7319L82123A96897d137A56837J91647K77129
13587F25613F5107M61302k04796J62092j52307J32203f7726C21422K123J78980
13577E02525k26160A22817d3882E30767r5726j60485L00163N7281B14187J47330
13567C61517N8706j21984K53044j81051L1364q9319k2340J52039j87233L53944
13557F08687j66143A20999J50649P9119L7217J46482A83156F0410M31708j22246
13547C69872j78016r2332J03045L14705B57548K23109K42831j96593A29394R4390
$$ y = [454870, 47605, 519324, 410266, 265058, 643607, 265250, 539177, 201091, 476879, 315805, 215041, 344154, 403542, 178477, 375391, 521507, 321964, 455633, 71090, 464211, 325564, 498003, 278293, 260974, 643097, 196897, -4137, 156837, 348484, 625613, 65107, 526409, 321613, 483705, 331398, 463601, -67726, 321422, 323545, 502525, 276365, 122817, -43882, 530767, 435041, 274556, 574719, 632000, 214187, 361517, 420223, 298239, 551283, 370232, 401596, 312277, 289937, 441976, 254743, 608687, 442544, 120999, 271648, 350767, 387984, 534466, 183156, 60410, 492118, 369872, 191856, 99524, 202569, 517274, 257548, 480657, 723488, 526895, 129394, 223784]
13537B23784J7020A03050K32113n4243A03419L01218j60266p1039L37061A00038
13526A66214F7577J68453k6938M55341E0100N6551K36239A68638Q0373n3845Q6534
13515B81700L1624p4126R6422E6018K11826J87581j45012A14786K58617p2672
13505C00731m4201J44215I7875K36759K79002k40387j8596A46449J99933M9816
13495C96198H3010K33158j47879b5275B74105K57654B54755K08483e8883D74622
13484D31056q6195A22854N58K26959K10780k36585J82755A91885J16940D2501
13473G2316K23288j08014m2054J71328j3522J21514A73696B5766A1598J09892
13463A21490J22186J93471B2710L84426B01552K5479P0435J77696a22830B52814
$$ y = [223784, 240804, 103050, 335163, 280920, 103419, 404637, 244371, 173332, 510393, 100038, 166214, 67577, 236030, 209092, 664433, 50100, 106651, 342890, 168638, 249011, 195166, 281700, 313324, 239198, 335620, 56018, 267844, 455425, 310413, 114786, 373403, 300731, 256530, 400745, 97875, 334634, 613636, 373249, 354653, 146449, 346382, 396198, 83010, 316168, 168289, -25275, 274105, 531759, 254755, 463238, -58883, 474622, 431056, 344861, 122854, 123412, 350371, 561151, 324566, 507321, 191885, 308825, 42501, 72316, 295604, 187590, 145536, 316864, 303342, 424856, 173696, 25766, 11598, 121490, 243676, 437147, 22710, 407136, 201552, 227031, 297466, 475162, -122830, 252814]
13452I9300M57208B33829m4993m9988C6003b0135D22576B2631L48257A36866J05171
13441B42037J99554B05276F9935J34300o5421M07134c8691A13008C7454J35583
13431A73037J41569A3863R5119K24743J24762C6615K30998j11260M53058d8901
13420A34884B4147K16878k1487l692P851J73069o6585A01886K54436j42595P2901
13409B86628Q2971b26624A88455l8819P6711j1663H9969K82436n441a18782F8755
13397E1637K68300R6566J00947B10576J29324G6817P2486K00908d7823k51745
13387b99568D06646j13598N1019j55020m3952n005R9094K02009j88247J25118
13377C78064j87825p5183P6021m5571K97258j34810p5630a16557B95643L71486
$$ y = [99300, 556508, 233829, 188836, 138848, 36003, -20135, 422576, 22631, 370888, 136866, 242037, 441591, 205276, 69935, 204235, 138814, 545948, -38691, 113008, 37454, 173037, 314606, 13863, 108982, 333725, 458487, 36615, 267613, 156353, 609411, -48901, 134884, 24147, 241025, 219538, 215846, 223697, 396766, 330181, 101886, 356322, 213727, 286628, 369599, -226624, 188455, 149636, 226347, 214684, 89969, 372405, 366964, -118782, 68755, 51637, 319937, 416503, 517450, 210576, 339900, 76817, 149303, 350211, -47823, -299568, 406646, 293048, 344067, 189047, 145095, 140090, 239184, 441193, 252946, 378064, 190239, 115056, 191077, 145506, 442764, 307954, 232324, -116557, 295643, 667129]
13367F67129G6998a17837j33434C21966A03876B4397M59566B22587N8207p4930
13357B05864o9932N03685B32767G3096K31669J29766j31818r3023K6361n1840
13347A84211J61870a65637A70064L0586P3396f1315a5980B58957J07176A62362
13336D08700a0214B31502L52128j45905M0702j33685r4657p5839G1597K41803
13326C13400F3710O4219O3918F8006J95152L29816A04885O6541m2202J72591a32876
13314A87938O6913N2961k2218j2190A19760N5195j8540M9137J23414M1319b1986
13302B16875F1943e01488A16655E7532L6654R8123N2224A20018J42239b884D39414
13290B73589J54609a5122C9861R6747A6338J24403C8787J60656K5942b8131B8232
$$ y = [667129, 76998, -117837, -251271, 321966, 103876, 24397, 483963, 222587, 280794, 205864, 135932, 639617, 232767, 73096, 304765, 434531, 302713, 209690, 236051, 184211, 346081, -165637, 170064, 200650, 274046, -61315, -15980, 258957, 366133, 162362, 408700, -10214, 231502, 583630, 437725, 478427, 344742, 250085, 174246, 71597, 313400, 63710, 127929, 191847, 68006, 263158, 592974, 104885, 171426, 129224, 301815, -132876, 187938, 254851, 307812, 285594, 273404, 119760, 174955, 156415, 205552, 328966, 370285, -21986, 216875, 61943, -501488, 116655, 57532, 94186, 192309, 244533, 120018, 262257, -2884, 439414, 273589, 428198, -15122, 39861, 136608, 16338, 140741, 38787, 199443, 225385, -28131, 28232]
13278B01203n5569J43742o3746F2917f8370C36014A30165R6850m1836b49871A18868
13266A67308F2480K1505J35605c36420b9016B96207I1709K77790a8768F9703A5913
13254B26766b13175f4746I3086a20623A26377o1274J20224J94853j59932j5918
13244B04330h50C52331a08855A20127k0198D7612K86998k9701d9526E5545a5073
13232D93040b5969J372D631a3876H6011J71826J04902j10477o2191d4941C66013
13220a3120k76756A46077K13660H5589N5616A4571b23927C54690q7271o2248a1277
13208C32020J05073a03652B61495E4013J32542q3258c7838A06282B8639L7977
13198F6616A0092a43423F5994k8568J29763K3904I1491K252K64268H367J50973
$$ y = [201203, 145634, 289376, 225630, 62917, -68370, 336014, 130165, 227015, 185179, -249871, 118868, 167308, 62480, 83985, 219590, -336420, -29016, 296207, 91709, 369499, -18768, 69703, 15913, 226766, -213175, -64746, 93086, -120623, 126377, 65103, 185327, 380180, 220248, 204330, -850, 352331, -108855, 120127, 99929, 47612, 334610, 304909, -49526, 55545, -15073, 493040, -25969, -24597, 4631, -13876, 86011, 257837, 362739, 252262, 190071, -44941, 366013, -13120, -289876, 146077, 359737, 85589, 141205, 14571, -223927, 354690, 267419, 205171, -11277, 332020, 437093, -103652, 261495, 54013, 186555, 103297, -37838, 106282, 28639, 66616, 10092, -143423, 65994, 37426, 167189, 191093, 91491, 93743, 358011, 8367, 159340]
13187A59340a41558B90308a09157A24857J40784A10741b92469A45907J22274a46085
13176e4369B13031l1485o529K36612B04039e2699E34646b09939G0647M7735L43628
13165D62010A53621K507A0309i4526H6267O8515J84206A67317a47950F4614J64622
13154B29236A09890i4558A43691o9271j3177K32750b6938A67453j8811P4287l8901
13143A84028c1108n4586A515K18282b80603d7884J4509B71804j27622h065B42384
13131B0770M2016L8463f532p3193B88214E7250f6155B45243J23116j5063c0564
13119I7999j4937Q7650N78b26806F3471J28483h0058A97188B1590K72436b91014
13107a02630C34211A08189K46963G8016f7265c035A56216K1028i6239A72947q4268
$$ y = [159340, -141558, 290308, -109157, 124857, 265641, 110741, -292469, 145907, 268181, -146085, -54369, 213031, 181546, 175017, 411629, 204039, -52699, 534646, -209939, 70647, 118382, 462010, 153621, 156128, 10309, -94526, 86267, 154782, 338988, 167317, -147950, 64614, 229236, 109890, -94558, 143691, 74420, 61243, 293993, -26938, 167453, 148642, 222929, 184028, -31108, -85694, 1515, 219797, -280603, -47884, -33375, 271804, 144182, -8065, 242384, 20770, 62786, 101249, -6532, -79725, 288214, 57250, -66155, 245243, 368359, 353296, -30564, 97999, 83062, 170712, 171290, -226806, 63471, 191954, -80058, 197188, 21590, 294026, -291014, -102630, 334211, 108189, 355152, 78016, -67265, -3035, 156216, 177244, -96239, 172947, 88679]
13096H8679j3698K0142J53583a41873b3311C49947j51623a08645I9662K85338
13086C85000e8018A19297a10147C4847J35421d0111A15967D1111g077B28696a7332
13074C96773E1320J0742N9489c6167h124C33156e221A42591N1176Q5281A30257
13062C5248N008a28497A43845K39324h9867A4825J0122a06085A45206B7728J2929
13051D0657K62428b7082C20386I3751D022R6344K26981l2785I2084a85141C90966
13039A36099j3347a05995j73587i1144B66901i9616m5919B40900b95070B0923
13028A29488B6449J86809E4097a05664D0110A2596b96061E287L9268J58580d02921
13016B29087a17419e8234l8501C65142C2317J95435b02591B89581A01357R0771
$$ y = [88679, 74981, 95123, 248706, -141873, -23311, 349947, 198324, -108645, 99662, 385000, -58018, 119297, -110147, 34847, 170268, -40111, 115967, 41111, -7077, 228696, -17332, 396773, 51320, 62062, 121551, -36167, -8124, 333156, -5221, 142591, 193767, 279048, 130257, 35248, 40256, -128497, 143845, 383169, -89867, 14825, 24947, -106085, 145206, 27728, 40657, 303085, -27082, 320386, 93751, 4022, 100366, 327347, 294562, 92084, -185141, 390966, 136099, 122752, -105995, -279582, -91144, 266901, -99616, -145535, 240900, -295070, 20923, 129488, 26449, 213258, 54097, -105664, 40110, 12596, -296061, 5287, 44555, 203135, -402921, 229087, -117419, -58234, -96735, 365142, 32317, 227752, -202591, 289581, 101357, 192128]
13006A92128e5444p2262C99995f5398C2670O5072J76637j29949i3264A51177J87293
12995C38470A46414D9143N1538m5432N9177Q5040e316A10554a9640A45366o3710
12984H1656h7065B60165d160F683K34739n1841A422M1213i2555C63604C1382M2592
12972G3974R886P4997p6210R5500K22672b03232A83914a40397C3715K90201k5366
12961B98550d87093a77035D9681c7331p3122b2387A15617a18793a2047l04799
12951c16846C82551a23777B36866A16864m3549j8122J95880H7533J79579b97669
12940A74322K17812A66120g1416A38132a2012l05365A0051M88073k30237b04526
12929g8710j8233J3710j15899A12137K29789r9490p4515K71286A27090a8282B26944
$$ y = [192128, -55444, -127706, 399995, -65398, 32670, 97742, 274379, 144430, -93264, 151177, 338470, 146414, 49143, 100681, 55249, 114426, 199466, -5316, 110554, -19640, 145366, 81656, -87065, 260165, -4160, 6683, 241422, 189581, 1422, 42635, -92555, 363604, 31382, 73974, 83860, 158857, 82647, 178147, 400819, -203232, 183914, -140397, 33715, 323916, 298550, -487093, -177035, 49681, -37331, -110453, -22387, 115617, -118793, -12047, -316846, 382551, -123777, 236866, 116864, 73315, 55193, 251073, 87533, 267112, -297669, 174322, 392134, 166120, -71416, 138132, -12012, -317377, 10051, 498124, 267887, -204526, -78710, -96943, -83233, -199132, 112137, 341926, 242436, 167921, 439207, 127090, -18282, 226944]
12917C09936r8601k2009a73119q2525C28065a12493j27792c2490j01245O3637
12907g0098l17193C72619a75958Q5199B23417a68587l018A8084d6395A78673a46524
12895A28302K0545m4205N7355a58814c8474J1573j72128A0668J5067m899a08518
12883B41867g9377M181A61097a7700B29936m3430P1029h6142q9127A94908c9761
12871C62781d0360A11949b89006H3831J6826m6981B5299P4388a09868C77550a06217
12859D3392J70001i9099k38040b5833j59575j7364h5102q9220o1243C1281J25988
12848A57269a51709E7415K52371C2906R4064Q0607L9517H9490d6120A43047L2508
12837A75555e1557g01k9752B6102a17899F4265k0209a8140C2099a47821O1633
$$ y = [309936, 211335, 189326, -173119, -255644, 328065, -112493, -240285, -32490, -133735, -70098, -387291, 372619, -175958, -90759, 223417, -168587, -171605, 18084, -46395, 178673, -146524, 128302, 148847, 104642, 161997, -158814, -38474, -26901, -199029, 10668, 25735, 20836, -108518, 241867, -79377, -75196, 161097, -17700, 229936, 186506, 257535, -86142, -175269, 194908, -39761, 362781, -40360, 111949, -289006, 83831, 100657, 53676, 25299, 99687, -109868, 377550, -106217, 43392, 213393, -99099, -337139, -25833, -185408, -202772, -85102, -174322, -235565, 31281, 157269, -151709, 57415, 309786, 32906, 126970, 207577, 247094, 89490, -46120, 143047, 175555, -51557, -701, -30453, 26102, -117899, 64265, 44056, -18140, 32099, -147821, -86188]
12826h6188L9237A22465l0544J59685c7281A54786p3192K26052h685p4315J0461
12815g2539k2219B26507G6976a8830A24574b90965A06512K8069d7083j89511C62872
12803c6720r597C37256A1038K07945g8468L3563C02198m0754a53092A65775a42835
12791A1968d1143j43966K3581q322A61833F8932J87062f5446D10787b67204a7660
12779G6238R0380k6641a36600F9917g2401j00404k00482B11623b92298A83998
12768a70460H0363m68J51315h5646B41279a05316m2056B82384H005f7181B49749
12756a37627B61208j2325M0569p5938h2643A89006E2538J6663e8747J592I3398
12744e490n0797A69598e1518b1971B57467c52498R7623A4634a89692A10020a1404
$$ y = [-86188, -46951, 122465, 91921, 251606, -37281, 154786, 81594, 307646, -8685, -83000, -72539, -94758, 226507, 76976, -18830, 124574, -290965, 106512, 134581, -47083, -236594, 362872, -36720, -46317, 337256, 11038, 218983, -78468, -44905, 302198, 261444, -153092, 165775, -142835, 11968, -41143, -185109, -161528, -169850, 161833, 68932, 255994, -65446, 410787, -267204, -17660, 76238, 166618, 139977, -136600, 69917, -72401, -172805, -373287, 211623, -292298, 183998, -170460, 80363, 79895, 231210, -85646, 241279, -105316, -147372, 282384, 8005, -67181, 249749, -137627, 261208, 248883, 289452, 213514, -82643, 189006, 52538, 69201, -58747, -57155, 93398, -5490, -56287, 169598, -51518, -21971, 257467, -352498, -254875, 14634, -189692, 110020, -11404]
12732e6473B53927a15813L1319B44138K61315c3538j10777L4456C99280A72708
12721b6576l8650p8443A00570e0762q94A56871G6112L2379P828m1850c0709F3789
12708g8341p9473H6463b45215J09209C5691L3364O5905a19785L2263D3704A324
12696D78515A77631J8725C7783M4009K32004F7017O5613l7613f3320B98662A01764
12684A69956K81335j25680G4029a1725B92877h383C22014m7199e30l7748n37329
12673e75607K53083B69002a68898a3561A9509J20064J03483I8325e450B24692
12662A23998a0168A58369j7238a79350O8518A35314L1098f8655A00653C8484J02717
12651A41201L1705N9801D3747c7910C01964g4740a8291A42136A5058K87179A00452
$$ y = [-56473, 253927, -115813, -84494, 244138, 505453, -33538, -144315, -109859, 399280, 172708, -26576, -65226, -143669, 100570, -50762, -51656, 156871, 76112, 108491, 116319, 74469, -30709, 63789, -78341, -157814, 86463, -245215, -136006, 35691, 69055, 134960, -119785, -87522, 43704, 1324, 478515, 177631, 196356, 37783, 81792, 313796, 67017, 132630, 95017, -63320, 298662, 101764, 169956, 451291, 325611, 74029, -11725, 292877, -8383, 322014, 274815, -530, -38278, -575607, -322524, 269002, -168898, -13561, 19509, 139573, 243056, 98325, -5450, 224692, 123998, -10168, 158369, 141131, -179350, -110832, 135314, 166412, -68655, 100653, 38484, 141201, 172906, 232707, 43747, -37910, 301964, -74740, -18291, 142136, 15058, 302237, 100452]
12639e2710A50294a24540A00643J57583Q0184j45248K8239L8858b91054e5960
12628g1328D7913a2652k6514A48161e6274r7871N9678a3045C21062f1756G3101
12616a88538A76123J61855A34626L18834A40307J26731b54581D2259a42888j06237
12606b49125H6145N834J95559B3176L53588i1623A44516g9436E0991a01174K6661
12595g4513p022B20894b6252j5693I7509K02978c28321F4630j3016Q158L6609
12584I6381i1216I5208l3098a68366A40263a990D11925A18395c3691A85240m2872
12573A42368a74318E0688b19579A59864r293A0538b63531A42028j5075b06771
12562f2693C67743a8203g812q8957H8039J45926a1718A04243C1463b7657j26064
$$ y = [-52710, 150294, -124540, 100643, 258226, 338410, 193162, 221401, 260259, -291054, -55960, -71328, 47913, -12652, -39166, 148161, -56274, -154145, -94467, -13045, 321062, -61756, 73101, -188538, 176123, 337978, 134626, 453460, 140307, 267038, -254581, 42259, -142888, -249125, 86145, 91979, 287538, 23176, 376764, -91623, 144516, -79436, 50991, -101174, -74513, -81535, 220894, -26252, -41945, 97509, 300487, -328321, 64630, 51614, 59772, 96381, -91216, 95208, 62110, -168366, 140263, -1990, 411925, 118395, -33691, 185240, 142368, -174318, 50688, -219579, 159864, 150571, 10538, -263531, 142028, 126953, -206771, -62693, 367743, -18203, -7812, -96769, 88039, 233965, -11718, 104243, 31463, -27657, -153721]
12551a53721A67268a77537G2379e3694K2365B14040p3101e6806o2987K1560A49048
12539B49098b14427A65498a07792j79992I2603a05402B2134L64249j30600a00988
12528B5594a65940l89086a4365j13643k48604A06057d6877K3115p043D819N7014
12517F1833b14580C7023d9074r7342A1712K68658P6863a73559H8404K3521P8188
12506A90113C8589j6820L18307D0831d7731B20875H8350Q5104q3424h2958l51185
12495d34143A06192b0501j70275A36085a3211k06073c7487q3286A09169Q3516
12485A92685a71939A97538C1631i6260j5477c7325A22189J52156H8996a64807
12474h2172o8338d3981j00402B43713a30913N4920I916b34312a5839A29031b8062
$$ y = [-153721, 167268, -177537, 72379, -53694, -31329, 214040, 140939, -56806, -119793, -98233, 149048, 249098, -214427, 165498, -107792, -287784, 92603, -105402, 22134, 386383, 255783, -100988, 25594, -165940, -555026, -14365, -128008, -376612, 106057, -46877, -23762, -30805, 4819, 61833, -214580, 37023, -49074, -146416, 11712, 280370, 357233, -173559, 88404, 111925, 190113, 38589, 21769, 340076, 40831, -47731, 220875, 88350, 173454, 90030, -82958, -434143, 106192, -20501, -190776, 136085, -13211, -219284, -37487, -120773, 109169, 192685, -171939, 197538, 31631, -96260, -111737, -37325, 122189, 274345, 88996, -164807, -82172, -150510, -43981, -144383, 243713, -130913, -75993, 9916, -234312, -15839, 129031, -28062]
12462b14902d8077A63827b59526I9686K74347A9019a37156e3363j17456B03430
12451A29753k5187a52139p1778a0686j59084G62h0352A61719F4975a26974d4266
12439a49037j80172B95560j08012O1681i470A07098j7639o390c6475H7734N1439
12428A39173A4073P8734b3389k9167A13379R736a58110A75815B55J68365N6519
12417B25139K5026F7555i4334K6814H219K63363m3248E1490Q8321a20408A07661
12405A86308f86434f9302G7758h7344C8357a46615b6837l8330A81424a89675B3145
12393D4097N4211J26953c033j98940F7362m81a40780A35443C2451a55252D8661
12381B35612D306b0083r0408j95953C1660d1493l0970j43973j21043F6050c0753
$$ y = [-214902, -48077, 163827, -259526, 99686, 374033, 19019, -137156, -53363, -170819, 203430, 129753, 104566, -152139, -223917, -10686, -169770, 762, -80352, 161719, 64975, -126974, -44266, -149037, -329209, 295560, 187548, 249229, -9470, 107098, 89459, 83069, -36475, 87734, 139173, 14073, 92807, -23389, -52556, 113379, 123115, -158110, 175815, 255, 168620, 225139, 250165, 67555, -94334, -67520, 8219, 271582, 228334, 51490, 139811, -120408, 107661, 186308, -686434, -69302, 77758, -87344, 38357, -146615, -26837, -65167, 181424, -189675, 23145, 44097, 98308, 225261, -3033, -201973, 67362, 66881, -140780, 135443, 32451, -155252, 48661, 235612, 4306, -20083, -110491, -306444, 31660, -41493, -72463, -216436, -337479, 66050, -30753]
12369c058H3195h726j16835L8261A55053K9883b7940A90855a2011D8233c3133
12357E193a12003K1450A77327d7091B68712a80826n7870A50750a16042l5450A07832
12345c8233p6085C23306d02596B6575a58507l0370L1111C14181D8280O4825d9561
12333A85364A9521c23454C2908Q48J1975K80315f5279G2653c3123n6265F4772
12321b6346k27731A7239M0006d24254a50659O2527j00867C06694a7B35228j03244
12310A31984a04160A32794a50702k7052F1828B4784a69176A30271b73376A04199
12299A26524l7155b22962A7416d3518B18126J19590B0768K39204n6963J1666F2796
12287A26246b01621d9687J6980o6897G6683j1725R2180C9552a32507N1856D40418
$$ y = [-3058, 83195, -8726, -125561, -87300, 155053, 184936, -27940, 190855, -12011, 48233, -33133, 5193, -112003, -90553, 177327, -47091, 268712, -180826, -238696, 150750, -116042, -151492, 107832, -38233, -114318, 323306, -402596, 26575, -158507, -188877, -157766, 314181, 48280, 113105, -49561, 185364, 19521, -323454, 32908, 33756, 45731, 326046, -65279, 72653, -33123, -89388, 64772, -26346, -254077, 17239, 57245, -424254, -150659, -88132, -188999, 306694, -17, 235228, 131984, -104160, 132794, -150702, -177754, 61828, 24784, -169176, 130271, -273376, 104199, 126524, 89369, -222962, 17416, -43518, 218126, 337716, 20768, 259972, 203009, 214675, 62796, 126246, -201621, -49687, -32707, -99604, 76683, 64958, 157138, 39552, -132507, -80651, 440418]
12275C31926j41956G0562J11438Q2723E3896b33355A70035c0898P90I228K33946
12264B43174O2701a1221A88710f0566B64070E5916R2488K15132a68604D05163
12253G992R6985a25203C01945j18726m1316R9753j04683B2954L1204K33074C8329
12241h1573B88736a98638e7707B59129b36921G2989j8355b16258a07926D1028
12230b3343l6624E0419N3711J47490b5570r1908A81791G6198h002B67805A10309
12218B69522C9469G297J59180F0695R0192J23980K072l0691q6177O436F6493J57750
12206B24243a35403B69026C8395L0083J00765O4K82775A14135A6863a36043B17245
12194A72969H2782j2220R6774K72934j97029G0298J34735f075E9332M27590A75015
$$ y = [331926, 189970, 70562, 182000, 264723, 53896, -233355, 170035, -30898, -30108, 9228, 243174, 305875, -11221, 188710, -60566, 264070, 55916, 148404, 363536, -168604, 405163, 7992, 104977, -125203, 301945, 183219, 141903, 241656, 136973, 22954, 54158, 287232, 38329, -81573, 288736, -198638, -57707, 259129, -236921, 72989, 54634, -216258, -107926, 41028, -23343, -59967, 50419, 104130, 251620, -25570, -117478, 181791, 76198, -8002, 267805, 110309, 269522, 39469, 7297, 166477, 60695, 150887, 274867, 276939, 246248, 160071, 166507, 66493, 224243, -135403, 269026, 38395, 68478, 169243, 169307, 452082, 114135, 16863, -136043, 217245, 172969, 82782, 70562, 167336, 440270, 243241, 70298, 205033, -6075, 59332, 486922, 175015]
12182C5092a17501C97858j72253c871I473L03838H0721K8046m3043J05554K33315
12171D04593B4611a0144B57372j03196L5203a61994B66773c3105C14873q6887
12161B27986C0447N9655K23075D6657K78872a82115B73913B1508J89420o4180
12151A46748H592J86025F8780L15497K100j13534f543G9389J20273h5880b9462
12139A44900A3156a28757j70783d2296B00533L1739i6408A91394l2576J95266
12129C54084J40704A31277a23746j5898B32320d1760o3824A0511J13707Q379k9864
12118A02733M2254o6589J4308a20646A55036e1220G2892J21559d6482k05529B00994
12106a08770G0125e7191j20906B40141M5505A25266n0972J35941H8244d76921
$$ y = [35092, -117501, 397858, 225605, -3871, 9473, 313311, 80721, 108767, 65724, 171278, 404593, 24611, -10144, 257372, 154176, 189379, -161994, 266773, -33105, 314873, 227986, 30447, 90102, 313177, 46657, 325529, -182115, 273913, 21508, 210928, 146748, 8592, 194617, 68780, 384277, 386377, 272843, -6543, 79389, 199662, -85880, -29462, 144900, 13156, -128757, -299540, -42296, 200533, 232272, -96408, 191394, 158818, 354084, 494788, 131277, -123746, -139644, 232320, -41760, -105584, 10511, 124218, 132597, 102733, 144987, 78398, 92706, -120646, 155036, -51220, 72892, 194451, -46482, -252011, 200994, -108770, 70125, -57191, -178097, 240141, 285646, 125266, 74294, 210235, 88244, -476921]
12095A62899c2819j91905B14282P7736C9592a88744l1844A45195g3883a802E6651
12083d2261E3849J4695g6455k5665H1915l2003a37466B90028e8432b847A43339
12071b0939j06343G9176K3549c69747i8869j6004j70913I1067a17195A46036a53087
12059g7371A65294J30644A00274Q6378b71409B47191K46273J31325J97720j29707
12049F92802A59082J61553A40442F8074K63a09215C9227a53975A17335a92253
12038B2440K3123b02111M975g5440j78078a22731G841c835D1296k01D374P5133
12026G9507d0070B01220i3201A64716g0422D6108o996N9159a36505A8740J46503
12015A65243o4943j2236a06388a3544j2805A55413J27339a42237B05854E0073
$$ y = [162899, -32819, -224724, 214282, 292018, 39592, -188744, -220588, 145195, -73883, -1802, 56651, -42261, 53849, 68544, -76455, -102120, 81915, 49912, -137466, 290028, -58432, -2847, 143339, -20939, -127282, 79176, 102725, -369747, -98869, -114873, -285786, 91067, -117195, 146036, -153087, -77371, 165294, 295938, 100274, 186652, -271409, 247191, 493464, 624789, 822509, 692802, 159082, 320635, 140442, 68074, 68337, -109215, 39227, -153975, 117335, -192253, 22440, 45563, -202111, -197136, -75440, -253518, -122731, 7841, -3835, 41296, 41095, 4374, 79507, -40070, 201220, -93201, 164716, -70422, 46108, 39112, 98271, -136505, 18740, 165243, 100300, 88064, -106388, -13544, -26349, 155413, 282752, -142237, 205854, 50073]
12004a1644B21477c16942d6768m6503P499l26050F3101q193d38017a44822A31288
11992b72890A86804a74052A93093b44856A71504b35349A24473a58657C6953a0717
11981b78269B51933D0730b48330I7108d7795q466A28033a69307D409a66333G5354
11969D6301Q7098a00115M3640q8266A82857D1455F5c66959B24353A5006b9961
11957a12929j04829h140H2243a87042A47797j993g1735J0926C22703j45780h2168
11945A33132b1964j30396b9883r2935a6068p202D2476d11726F3449c9837a7591
11933e6311r9710C0384L14823p3866f463j03303k4467A09681a05580j34389c4650
11921a30529r7567J0228m6691Q7641j26120A86406p1365a59606a4188K385A94419
$$ y = [-11644, 221477, -316942, -46768, -93271, -85772, -411822, 63101, 54908, -438017, -144822, 131288, -272890, 186804, -174052, 193093, -244856, 171504, -235349, 124473, -158657, 36953, -10717, -278269, 251933, 40730, -248330, 97108, -47795, -56261, 128033, -169307, 4409, -166333, 75354, 46301, 133399, -100115, -56475, -144741, 182857, 41455, 65, -366959, 224353, 15006, -29961, -112929, -217758, -8140, 82243, -187042, 147797, 145804, -71735, -60809, 322703, 176923, -82168, 133132, -21964, -152360, -29883, -122818, -16068, -23270, 42476, -411726, 63449, -39837, -17591, -56311, -156021, 30384, 345207, 271341, -6463, -109766, -134233, 109681, -105580, -239969, -34650, -130529, -228096, -217868, -264559, -176918, -303038, 186406, 115041, -159606, -14188, -11803, 194419]
11909D069b86034d3367G872b18827D3657e53417H4275a34422e3637k0118A32035
11897b21046K0348D9751M8997e3643D6039J28506o4532E0202a41295H7788C7104
11885A37170a77354A09504J08859G5264J6780h79p1605F1574N7370d94276a21430
11873A02944K9377a25420j00362C5184M6167C8981d1491k18336k9562A39133A6519
11861b85530B33322c0376j33979A86105a17349K0949A32926b043q9868I4642a74798
11849f5329l9284J2668A08753b52759A22715P947J82603l9929a69559b9202C48651
11837b0098H391K49424b2823B60123p7716a45045A01451g8802K0595J8843C5058
11825H7675M5173b55637n6783A62969b50228g6445A54587R0925E434e4050j29426
$$ y = [4069, -286034, -43367, 7872, -218827, 43657, -553417, 84275, -134422, -53637, -73755, 132035, -221046, -200698, 49751, 98748, -53643, 46039, 174545, 110013, 50202, -141295, 87788, 37104, 137170, -177354, 109504, 218363, 75264, 92044, -879, -72484, 61574, 118944, -494276, -121430, 102944, 132321, -125420, -225782, 35184, 81351, 38981, -41491, -259827, -289389, 139133, 16519, -285530, 233322, -30376, -164355, 186105, -117349, -96400, 132926, -2043, -91911, 94642, -174798, -65329, -104613, -91945, 108753, -252759, 122715, 130662, 313265, 273336, -169559, -29202, 348651, -20098, 8391, 257815, -22823, 260123, 182407, -145045, 101451, -78802, -58207, -39364, 35058, 87675, 132848, -255637, -312420, 162969, -250228, -76445, 154587, 245512, 5434, -54050, -183476]
11814a83476H5630d6750A18297c5292m4097B11494B5909M8774e2150j82559c6217
11802I1810b14956a2047o9851A18220b80207I4132D6026M1044a26859J8752j20279
11791b28386B0223I51b1723A12894J708Q7745H8805a06740A63737r361b73988
11779B38263J75239A0513a84975F9916h9873C01005a92823j69361J62636A06965
11768C3690K52746H797a26003H6031m814J4002D0994c36016i3125k31719J08147
11757b16697e6411k2511j66191B2836c60452B6997J11497a64002b8886A6636J10265
11746A26901k2682m8255L4857K66873A11900D518J45985J77646A23625D1107L4610
11735G5717b8569r57H4630b08721i3721p760j50150f1358m4476B5546O1204a42818
$$ y = [-183476, 85630, -46750, 118297, -35292, -79389, 211494, 25909, 74683, -52150, -234709, -36217, 91810, -214956, -12047, -81898, 118220, -280207, 94132, 46026, 87070, -126859, -108107, -228386, 20223, 951, -21723, 112894, 114602, 202347, 88805, -106740, 163737, 154376, -273988, 238263, 413502, 10513, -184975, 69916, -89873, 301005, -192823, -362184, -199548, 106965, 33690, 286436, 8797, -126003, 86031, 81217, 95219, 40994, -336016, -93125, -324844, -216697, -56411, -78922, -245113, 22836, -360452, 26997, 138494, -164002, -28886, 16636, 126901, 104219, 55964, 90821, 357694, 111900, 4518, 150503, 328149, 123625, 41107, 75717, -28569, -29526, 84630, -208721, -93721, -101481, -251631, -61358, -105834, 25546, 86750, -142818]
11722B6421a13000r6915i3547A65861A8914b34191B5114b7769C28649E0241b51959
11710A92579d3856A86118D1396a57145A52965c27890J59399L9626A01496a63954
11699a90672R3917j94022A24006b04112A08966d3911j1176C75985j79014c79643
11688E9157R0601L8414g696G368a17051r4846a9377G1355J50856g651B16746D5420
11675a9772l2403A0538P3506e122q9354A66414j6915a62852E2107a82455K481
11664a79974A65451c3178j50589j55615A08048a38729B61380c3163k42105a4861
11653I6240a29462b285C53250M7371A57441d2689D50271b70130j08116d6430J9588
11642b6842k13368g7757C18357J37747D1169b23955A98723D1966K30573j3018
$$ y = [26421, -113000, -209915, -93547, 165861, 18914, -234191, 25114, -27769, 328649, 50241, -251959, 192579, -43856, 186118, 41396, -157145, 152965, -327890, -168491, -128865, 101496, -163954, -190672, -96755, -290777, 124006, -204112, 108966, -43911, -55087, 375985, 196971, -379643, 59157, 149758, 188172, -7696, 7368, -117051, -211897, -19377, 71355, 222211, -7651, 216746, 45420, -19772, -52175, 10538, 84044, -5122, -94476, 166414, 149499, -162852, 52107, -182455, -179974, 165451, -33178, -183767, -339382, 108048, -138729, 261380, -33163, -275268, -14861, 96240, -129462, -2285, 353250, 400621, 157441, -42689, 450271, -270130, -378246, -46430, -26842, -240210, -77757, 318357, 456104, 41169, -223955, 198723, 41966, 272539, 259521]
11632B59521n9021i4633j0683C18878j17535h9460p9626J268A61512a87771E8703
11620b75367J30025A73294K1083c63688B21883B4241I623f2896D28925f0934k8241
11609h9175j5232C8878K47191A16043E7285b03753B59401j22544K7031h6728J1376
11598g5352n2874L0180D0450a52728A30031i090r8589J1481j87021M9055H8267
11586a64010a9720A50536a40376A94172c6331j94416e379k825j25002B81453c03132
11574B49282j20551i5584C43364a44364C2369a4208B77567k210a23134N1944C11069
11562b7667E5441c73923D190J08536O2661c1756C85860A7040a1092A81614L45779
11551E27393B16039k4532J34431C4673J49361D2105O2149J65045b18858J09215
$$ y = [259521, 200500, -94633, -105316, 318878, 201343, -89460, -169086, -167818, 161512, -187771, 58703, -275367, -145342, 173294, 194377, -363688, 221883, 24241, 9623, -62896, 428925, -60934, -89175, -104407, 38878, 286069, 116043, 57285, -203753, 259401, 136857, 163888, -86728, -75352, -128226, -98046, 40450, -152728, 130031, -9090, -107679, -96198, -283219, -234164, 88267, -164010, -19720, 150536, -140376, 194172, -36331, -230747, -5379, -8204, -133206, 281453, -303132, 249282, 128731, -95584, 343364, -144364, 32369, -14208, 277567, 275357, -123134, -71190, 311069, -27667, 55441, -373923, 4190, 112726, 175387, -31756, 385860, 17040, -11092, 181614, 527393, 216039, 191507, 325938, 34673, 184034, 42105, 104254, 269299, -218858, -109643]
11541a09643G0877l861J94286G6099b12916B75751a04685A01145D0134M5098J24324
11530B09556c8071A88270I819a6856j71488j01895f2918F4176K96731a5848B25044
11518A16482Q8836F0871d1807E7862c0621p4356B05478p9026K1031a32194F071
11506c03214B43640j20740k8418a01970E26156A0446J05744D7098b93156C51244
11495I8621O327c39241A85544M90137g0607C37914A19896O9458A5639K94911J04887
11484D15437b46771B80337l0887b55619C30340Q5583f3248o9808N3859B18100
11473g0433B51262i0493B91519A3481L23036J70510A42449J55888K66058B09566
11462B17968j02304N1717h7884d0498E7316H323K21582b51100F6238J43036q6461
$$ y = [-109643, 70877, 67016, 261302, 76099, -212916, 275751, -104685, 101145, 40134, 85232, 209556, -38071, 188270, 9819, -16856, -188344, -290239, -62918, 64176, 360907, -15848, 225044, 116482, 205318, 60871, -41807, 57862, -30621, -104977, 205478, 126452, 147483, -132194, 6071, -303214, 243640, 122900, 94482, -101970, 526156, 10446, 116190, 47098, -293156, 351244, 98621, 104948, -339241, 185544, 675681, -70607, 337914, 119896, 189354, 15639, 310550, 415437, -246771, 280337, 249450, -255619, 330340, 415923, -63248, -133056, -79197, 218100, -70433, 251262, -90493, 291519, 13481, 336517, 507027, 142449, 298337, 564395, 209566, 217968, 115664, 167381, -87884, -40498, 57316, 8323, 229905, -251100, 66238, 209274, 122813]
11451A22813F185K21929A07624K23058j22348A9683K26563M06770C02548b2865
11440e8023A41191k3977M0248R7018p339b17840G7392e8824A06176J36747n3088
11429A89835f9556b6113r1658o9301N6812D29701H7633l0854O6097i8844A56298
11417C00410a85903h2815A61470a22997G5238K01431b53890c7739r7872d6190
11406f3272I1281J24066a46992G9250q225c34086F8620b05113k3074F3944c00572
11394A02232F283J71761n095b22981A00587b2743B56613M1270d3012j9525H6793
11382g7593B54256b00348A99865i1873C2124a71977j51532K6052H6421b42576
11371a16400L6409I5350a14159j56128H4047R8634o1220J62596a09135A99716
$$ y = [122813, 6185, 228114, 107624, 330682, 208334, 19683, 246246, 653016, 302548, -22865, -58023, 141191, 117214, 157462, 254480, 247141, -217840, 77392, -58824, 106176, 242923, 189835, -69556, -26113, -117771, -187072, -130260, 429701, 87633, 56779, 122876, -98844, 156298, 300410, -185903, -82815, 161470, -122997, 75238, 276669, -253890, -37739, -135611, -46190, -63272, 91281, 215347, -146992, 79250, 71025, -334086, 68620, -205113, -228187, 63944, -300572, 102232, 6283, 178044, 172949, -222981, 100587, -22743, 256613, 297883, -43012, -62537, 86793, -77593, 254256, -200348, 199865, -91873, 32124, -171977, -323509, -297457, 86421, -242576, -116400, -79991, 95350, -114159, -270287, 84047, 182681, 121461, 284057, -109135, 199716]
11360B692J12949g6302B53027C3667J04288L06081A18718k9479P9159d090H39
11348G3495k2427J98527c9091q1268A21256a43132B13105b42908L0077G854d989
11336A27202b09047a8820p9207A39953m8766K56339D5019a82083n3101d7010j35161
11325a82171g4951j30949A98188g9070C2858b3438l52914C539K3378b3868F201
11313a69244A10622e8886j3007n750A27074b86807i0099G2443M6059b59391D7106
11301A68755m3748a87332B46634d7903B43700A07458h4430C38121j68654a96465
11290B05904a00794j7583A33518c1825j79651A29999l9853d4262A4128a68668
11279c9202j7173m4395A81780c53029A49309J90779b55551F9448a46524L1739
$$ y = [2692, 115641, -76302, 253027, 33667, 137955, 444036, 118718, 89239, 168398, -4090, 839, 73495, 51068, 249595, -39091, -120359, 121256, -143132, 213105, -242908, -212831, 7854, -4989, 127202, -209047, -18820, -98027, 139953, 91187, 347526, 45019, -182083, -235184, -47010, -182171, -74951, -205900, 198188, -79070, 32858, -23438, -376352, 3539, 26917, -23868, 6201, -169244, 110622, -58886, -71893, -77643, 127074, -286807, -90099, 72443, 118502, -259391, 47106, 168755, 125007, -187332, 246634, -47903, 243700, 107458, -84430, 338121, 169467, -196465, 205904, -100794, -118377, 133518, -31825, -211476, 129999, 90146, -44262, 14128, -168668, -39202, -56375, -100770, 181780, -353029, 149309, 340088, -255551, 69448, -146524, -114785]
11269a14785p9675g6610K24G5764C7653c09110C86410a98911B4451a18381E3630
11257B6119K96693b47822c4616A486a18991a1933m2332F1657K47902d4642r7162
11246a41804A68289a90114j20590J980J23406B939J18281c81513H5330B067J47300
11235A49367a22484j85374j08253a66520j40670f5216p7778A40560b80100A40080
11224c31865g5069D3426J08500c16037J24261h8838B19199J4177H0443b21669
11213A117a71683r099F2796e8052D55515a73093l214Q4258I2564i0228j08517
11202a98745C2829c21062A83908L3322o4320h5190A01296a34963e4732l741j08589
11191a67062o1118d0554J8559l2060j25934A03200b42732C3902A287c92340d5576
$$ y = [-114785, -194460, -76610, -76386, 75764, 37653, -309110, 386410, -198911, 24451, -118381, 53630, 26119, 322812, -247822, -34616, 1486, -118991, -11933, -54265, 61657, 309559, -44642, -141804, 168289, -190114, -310704, -308724, -185318, 2939, 121220, -381513, 85330, 2067, 149367, -122484, -307858, -416111, -166520, -307190, -65216, -142994, 140560, -280100, 140080, -331865, -75069, 43426, 151926, -316037, -191776, -88838, 219199, 233376, 80443, -221669, 1117, -171683, -180782, 62796, -58052, 455515, -173093, -176307, -92049, 92564, -90228, -198745, 32829, -321062, 183908, 217230, 152910, -85190, 101296, -134963, -54732, -58473, -167062, -228180, -40554, -21995, -54055, -179989, 103200, -242732, 33902, 1287, -392340, -45576]
11179c8896B10095b7097B48841a73075B34657b0419j77916i8231A46867Q9437
11169B36304j13518n1390i0639k45120D03631H7988j8451M2391m4798A8535J75851
11158A94386n9303a78959P283A5040a93815k083D6988c21481a59087F7094i8611
11146I0869a35424j615d5881J6969B63875q1773J17635h3088p6547A9741a73964
11134b85225f6670A67698c1530A96706K2197k6392L5494b65672C24122c50893
11123A52047J14081b00162C2578a42142D26786A42483a25260B5273J95306r0355
11113A30224B4269Q0531C4582K23038A03389J31891f9433A64767a19327C36967
11102d14844f0423B476i0416d220D2762J5400a98740I4408f739C68233j56270
$$ y = [-38896, 210095, -27097, 248841, -173075, 234657, -20419, -198335, -98231, 146867, 236304, 122786, 71396, -90639, -335759, 403631, 87988, 69537, 111928, 67130, 18535, 194386, 135083, -178959, -171676, 15040, -193815, -195898, 46988, -321481, -159087, 67094, -98611, 90869, -135424, -137039, -45881, -28912, 263875, 182102, 299737, -83088, -159635, 19741, -173964, -285225, -66670, 167698, -31530, 196706, 218903, 192511, 228005, -265672, 324122, -350893, 152047, 266128, -200162, 32578, -142142, 426786, 142483, -125260, 25273, 220579, 130224, 24269, 104800, 34582, 257620, 103389, 235280, -69433, 164767, -119327, 336967, -414844, -60423, 2476, -90416, -4220, 42762, 58162, -198740, 94408, -6739, 368233, 211963]
11091B11963K1277K08465A29201O3541d1984B22878J09598j07245N2199r4127
11081A83303o8831K71038j78332J30948Q6167J46169A03161J45491a27999H6167
11070A94375n1735O5010B679J86049M6848J08108l6354j47682M87765A5595K50511
11059B66106N7013j15489K63995g7315E63040p2988B41529N14020l61699j28519
11049B65331K96685k3090J42486k54958R3752j03905M39406m03680K11555j72060
11039D91522P7580L44485K4004m49409J25119J73467j06070J29424j25567L28245
11029A012800l01492j91883K81478J50920l25786Q9158K95750m79841K11397J77122
11019I19623l8055k40020m5087J31982j18924M14568l30604n4586L35450K4866
$$ y = [211963, 233240, 441705, 129201, 192742, -41984, 222878, 332476, 225231, 277430, 183303, 114472, 385510, 207178, 338126, 424293, 570462, 103161, 248652, -127999, 86167, 194375, 142640, 207650, 2679, 188728, 235576, 343684, 307330, 159648, 647413, 15595, 266106, 323119, 207630, 471625, -77315, 563040, 490052, 241529, 755549, 393850, 265331, 562016, 538926, 681412, 426454, 520206, 416301, 855707, 452027, 663582, 491522, 569102, 913587, 937591, 488182, 613301, 786768, 680698, 810122, 684555, 1012800, 711308, 519425, 800903, 951823, 626037, 715195, 1010945, 531104, 742501, 919623, 881568, 641548, 596461, 728443, 609519, 1024087, 693483, 638897, 974347, 999213]
11009I99213k01026k99517J48254O830m3451j60582K48849p9725R1123N8803j60425
10998F08346J70107J25575j84743k06057N8613j65647L64256k68199J03013R0229
10988F95493r91j77824K55594J97108J01953l62733J92733k80756J83354k23298
10978E80633R1047Q6808k4898o3855J53066j3443M24602l82079K31278J15572
10968A198731J86406l05817J15475o3428P55942l61879J32448O31044n2492N78823
10958B815253k83651K61906K16355j41860j82665k78126k6186j90187j10685K24813
10948B304967l30472j85747J19861P195o6531J80167j60807J44951l94006n0450
10938A569128j73291l46131Q7982l72462k54156P0675k24140j15681L44531j96001
$$ y = [999213, 798187, 498670, 646924, 653754, 610303, 449721, 698570, 618845, 709968, 768771, 608346, 778453, 904028, 719285, 513228, 571841, 406194, 770450, 502251, 605264, 695493, 694502, 516678, 772272, 969380, 1071333, 708600, 901333, 620577, 803931, 580633, 671680, 758488, 733590, 669735, 822801, 809358, 1233960, 851881, 1083159, 1198731, 1385137, 1079320, 1194795, 1131367, 1887309, 1525430, 1657878, 2288922, 2236430, 2815253, 2531602, 2793508, 3009863, 2868003, 2685338, 2407212, 2381026, 2190839, 2080154, 2304967, 1974495, 1788748, 1908609, 1915804, 1849273, 2029440, 1868633, 2013584, 1619578, 1569128, 1395837, 1049706, 1137688, 765226, 511070, 581745, 357605, 241924, 586455, 390454]
10928C90454o2043q1198K05057A39892D8920R8514c0233J2922A82689i8811C81002
10916d3512j14258H8264C6653j6399O3515b96063a14171M3549A33057A6610J97309
10905B13919F4721a48157m0301C118M7380J75549I0353J66341A21215K8923b30307
10893c6115E2804a14273C87821A4144b6164B1726a32600A08131q487a84565K5381
10882a59184B07393c70534D9880K2072J95442C7296h5187c7468B16672L31950
10872E48622a69639A21606b92433A69968B1195J92947f0252A1590a59001o65m3449
10861b03115G7337i9568j8394k9860g0608k12821L3192A00713J05562a1474o6186
10850g7660j20055a2601D7409b02871b0886b937F747c4526B23446K7045o15A21497
$$ y = [390454, 328411, 247213, 452270, 139892, 48920, 147434, -30233, -17311, 182689, -98811, 381002, -43512, -157770, 88264, 36653, 20254, 83769, -296063, -114171, -70622, 133057, 16610, 213919, 64721, -148157, -188458, 3118, 50498, 226047, 90353, 256694, 121215, 150138, -230307, -36115, 52804, -114273, 387821, 14144, -26164, 21726, -132600, 108131, 99644, -184565, -159184, 207393, -370534, 49880, 71952, 267394, 37296, -85187, -37468, 216672, 548622, -169639, 121606, -292433, 169968, 21195, 214142, -60252, 11590, -159001, -159666, -203115, 77337, -99568, -117962, -147822, -70608, -283429, -250237, 100713, 206275, -11474, -77660, -197715, -12601, 47409, -202871, -20886, -2937, 6747, -34526, 223446, 250491, 249876, 121497]
10837a23899A1369R6445b74770C8431a71335c9727D78938a94761B059J55111e6216
10825a42835B66795A21249j4823a18538N7M3566o9912n4288k08107a70732d0025
10813H3224m831b49322J23622l9028B43085b05197d035B64167j3426A0310b32319
10801A32046a65875C07638F6852a67102C10870j20810k1993d9614F8636b45368
10790G9376f7244H858a9729F5260b48298j38084a22612k0171A12880e5208G9707
10778b77700a35158q0779B82762d3896E7640a02842c9825M969j03396G2053k0114
10767E1939g5299F0644i8063B2910K73256a67566A87458D3815a38602o4747b4977
10755A550c21315a35522b4732A12329f2463r4063H3604n728H166a48964G1911
$$ y = [-123899, 11369, 107814, -274770, 38431, -171335, -39727, 478938, -194761, 2059, 157170, -56216, -142835, 266795, 121249, 106426, -118538, -118481, -74915, -144827, -199115, -407222, -170732, -40025, 83224, 78393, -249322, -125700, -164728, 243085, -205197, -4035, 264167, 250741, 10310, -232319, 132046, -165875, 307638, 66852, -167102, 310870, 190060, 168067, -49614, 68636, -245368, 79376, -67244, 8858, -19729, 65260, -248298, -386382, -122612, -142783, 112880, -55208, 79707, -277700, -135158, -215937, 282762, -43896, 57640, -102842, -39825, -34856, -138252, 72053, 51939, -75299, 60644, -98063, 22910, 296166, -167566, 187458, 43815, -138602, -203349, -24977, 1550, -321315, -135522, -24732, 112329, -62463, -156526, 83604, 77876, 8166, -148964, 71911]
10743a43472l40223B13813a95669p5945k38212d2687J5955K438G6748a15395L6970
10732g8425A60558a4464m39523A52020M1568B7300J9330c0104k5134B1745d273
10720a02190j18112m7693j0763g6071p3128A68241c14178C26656a96715A54580
10709c30191b4937A64839o6074b67335K6186j4969A24590a21024C16369H4648
10698B15802b196k47791D2066K71349a60473k15121a39938f4060H1648J74617
10688B56265N727C0555a50190A59663b40256a07267J4125q6062H0549d84407a48263
10676A92663E3399C586c7445n1765r3287h6981R105q3A87846H5183d2648l3017
10664g5665j5290r0897N073N1007A4547b7740A3838b0509k88982J46289C80361
$$ y = [-143472, -483695, 213813, -195669, -271614, -509826, -42687, -26732, -24294, 76748, -115395, -78425, 160558, -14464, -453987, 152020, 193588, 27300, 46630, -30104, -55238, 21745, -4273, -102190, -220302, -267995, -278758, -76071, -149199, 168241, -314178, 326656, -196715, 154580, -330191, -24937, 164839, 98765, -267335, -241149, -256118, 124590, -121024, 316369, 84648, 215802, -2196, -249987, 42066, 313415, -160473, -375594, -139938, -64060, 81648, 256265, 261992, 30555, -150190, 159663, -240256, -107267, -93142, -179204, 80549, -484407, -148263, 192663, 53399, 3586, -37445, -89210, -182497, -86981, -77876, -77959, 187846, 85183, -42648, -75665, -90955, -181852, -176779, -125772, 14547, -27740, 13838, -20509, -309491, -163202, 380361]
10652B53207o941d8972k28762D1173a17661H9901Q841c04101k3705J3693c8528
10640a16720A45918J05022a05540j27753Q7395H754b98765g4570k44281B07039
10629A32598h2581A85628g111A35634P607a24179j89202a48973R822A20386a5751
10617d87184K17853L3649J16045E3652a60645c5580C29662a82256M5048e5177
10606C3962a08955M7537l07733i9486A09693m0127d8903C8689b43910j31274A09171
10594a77013b5465m4325I585N1509B6213c5527k5760C45192c3723E5752K50197
10583C05949d5114B11554q1059c00144a24849m141B57349b9121A62190J20969
10573B83159E8029j8999f426j93798C03055b40784J14212A39895a45969p4260
$$ y = [253207, 246266, -48972, -277734, 41173, -117661, 89901, 98742, -304101, -327806, -314113, -38528, -116720, 145918, 250940, -105540, -233293, -145898, 8754, -298765, -74570, -318851, 207039, 132598, -82581, 185628, -7111, 135634, 143241, -124179, -313381, -148973, -139151, 120386, -15751, -487184, -269331, -235682, -119637, 53652, -160645, -35580, 329662, -182256, -137208, -55177, 33962, -108955, -61418, -369151, -99486, 109693, 69566, -48903, 38689, -243910, -375184, 109171, -177013, -25465, -69790, 9585, 61094, 26213, -35527, -61287, 345192, -33723, 55752, 305949, -45114, 211554, 130495, -300144, -124849, -128990, 257349, -29121, 162190, 283159, 58029, 39030, -6426, -200224, 303055, -240784, -126572, 139895, -145969, -220229]
10563b20229e1219j44018c8107j06375j89823a40389B09236e8872l15048h9945
10552F8863b60613h8020A791g7259L4365e656k65415a28651A58893E1504b97116
10540A56866b4062G0802K3056K5409C6366o276c12960C29896a61274A50465k6614
10529A23851a08116A96121F2571N8000a65873r783r6579M5337c7587j47545m2554
10518b27686C2716a78893j18020A3162a4940C25484e3237j47022A52326b28983
10507F8818R56b27341p7997f0908j96742d4484C48860a75772D5585Q7914c7841
10495h447A74234G630J30275a04825M3905I3362a61756j29591O8984B80312g591
10483a52484f888o0183D5575b7291H9541C6707c06740c321G5549J56247g1146
$$ y = [-220229, -51219, -195237, -38107, -144482, -334305, -140389, 209236, -58872, -373920, -89945, 68863, -260613, -88020, 1791, -77259, -42894, -5656, -271071, -128651, 158893, 51504, -297116, 156866, -24062, 70802, 93858, 119267, 36366, 30090, -312960, 329896, -161274, 150465, 123851, -108116, 196121, 62571, 120571, -165873, -175656, -272235, -226898, -37587, -185132, -227686, 32716, -178893, -296913, 13162, -14940, 325484, -53237, -200259, 152326, -228983, 68818, 69774, -227341, -305338, -60908, -257650, -44484, 348860, -175772, 45585, 133499, -37841, -8447, 174234, 7630, 137905, -104825, -60920, 93362, -161756, -291347, -222363, 280312, -7591, -152484, -6888, -67071, 45575, -27291, 89541, 36707, -306740, -3321, 75549, 231796, -71146]
10471a60264e9249A50988J66856K02884A08230L34777J62814B87344e6589A8360
10460D4959K52382A18317a27290j1698E198J62577b55752A1401b69040R9813O3726
10449a05501k72897A89495c3426j60044r936a8257A96981b8991j08475h62A43173
10437a18448E4260O1505d8269m6375H9038B5297L02354A8251a2631j80535Q5857
10426a07309d9678k7626J3595I3912J15531D6034i763E682M31481b2884M239B00378
10413A87940Q5462a04881E9228a12850j99402C68687K4184i0050m8405m6461A22241
10401E9851j8051O0111a40675d1029A73883b1171J0233k49525f3627A98998b26286
10389A096K96134E3853f6736K3801I5c79293a45152j15573C5519b18534I0814
$$ y = [-160264, -59249, 150988, 317844, 520728, 108230, 443007, 605821, 287344, -56589, 18360, 44959, 297341, 118317, -127290, -138988, 5198, 167775, -255752, 11401, -269040, -169227, -105501, -378398, 189495, -33426, -193470, -203406, -18257, 196981, -28991, -137466, -862, 143173, -118448, 54260, 115765, -48269, -94644, 89038, 25297, 327651, 18251, -12631, -193166, -107309, -49678, -77304, -63709, 93912, 209443, 46034, -9763, 5682, 437163, -22884, -18645, 200378, 187940, 273402, -104881, 59228, -112850, -312252, 368687, 392871, -90050, -138455, -184916, 122241, 59851, 41800, 101911, -140675, -41029, 173883, -21171, -10938, -260463, -63627, 198998, -226286, 1096, 297230, 53853, -66736, -42935, 95, -379293, -145152, -260725, 35519, -218534, 90814]
10377h5258D09219H372a434C72K11744K3605a48324A58272E9052P9379K49257
10366C87688i3749B58333E6958O816K7029L24054A27280R9619M93245A65965j9204
10355A46761O69225C19286j16598Q7728p0606J72520J03706B34443o4558J55854
10345C25739M7996j73902P0232P6921P3035A82767M30192k31088r8984J52946
10335D35833l6149J42801k24722m3243J47485j86625J26874Q3112J89229D9039
10324B9499L94087a55009A40366J13003d27k03065C01972i5605A41497J74652
10314C16149A49887J78086c293l173C23465a20579p645I453J66389a62056D18017
10302B2786f7405H5676f2572G33945A5615h7525K6785D25473C4203a82541Q8454
$$ y = [-85258, 409219, 8372, -1434, 372, 212116, 235721, -148324, 158272, 59052, 138431, 387688, -93749, 258333, 56958, 63774, 90803, 414857, 127280, 226899, 720144, 165965, 146761, 815986, 319286, 202688, 290416, 219810, 392330, 496036, 234443, 169885, 325739, 373735, 199833, 270065, 346986, 420021, 182767, 612959, 381871, 282887, 435833, 399684, 542485, 317763, 274520, 422005, 235380, 362254, 445366, 634595, 49039, 29499, 423586, -155009, 140366, 253369, -427, -203492, 301972, -95605, 141497, 316149, 149887, 327973, -3293, -6466, 323465, -120579, -128224, 9453, 175842, -162056, 418017, 22786, -67405, 85676, -62572, 733945, 15615, -87525, -60740, 425473, 34203, -182541, -94087]
10291i4087k337B06510a19209B31963c17801A95197d330A5098L04956D5661M2997
10280H8658a3077k23129A22727a28577L2956a9459r2811A76533o8118a13879A80973
10268e9642B0352e35887A57010a50490J1105J7713f0705A43003J0598a073l8076
10257c9149a4039A79668b6743B53229i6927L3770l3480p192D7886a09623C21561
10245E8343J13038O01909l61452C4156J84162l282N3811A11538J62018q7585J65086
10234C51057c6499J5770B7860O76D691M17961b10595j25578J41412o2701K2348
10223b35114B02868h9130j51950h7951r8001A40406b0970j2967k03657A50373
10212b13141K8002h2331A36080D9953A3599a33640r3590R2178L913m2498C0573
$$ y = [-94087, -96424, 206510, -119209, 231963, -317801, 195197, -4330, 15098, 320054, 45661, 88658, -13077, -236206, 122727, -128577, -95621, -19459, -112270, 176533, 108415, -113879, 180973, -59642, 20352, -535887, 157010, -150490, -139385, -121672, -60705, 143003, 153601, -1073, -39149, -14039, 179668, -26743, 253229, -96927, -63157, -96637, -103829, 47886, -109623, 321561, 58343, 171381, 773290, 411838, 34156, 218318, 215036, 268847, 111538, 273556, 185971, 351057, -36499, -20729, 27860, 28536, 4691, 422652, -210595, -336173, -194761, -257462, -235114, 202868, -89130, -241080, -87951, -185952, 140406, -20970, -33937, -237594, 150373, -213141, -185139, -82331, 136080, 49953, 13599, -133640, -227230, -135052, -131139, -173637, 30573]
10200a22166D9460a34241H1460a49603A21498m14D5536M828d23587C8013d744
10188a25651b3450F0381N6853g9756k898b4091r3400K9625B806b53933k56172
10177e10105A08698a84687r4647B1040i571m04775E6074a73505d162j83217B4335
10165a35824N1680J2359A66159C8513h9182A65440a88438n2786M5746i3991A24017
10153d1814o7860b501l19336c2383j07171B81977j37633f2709A08166b59557H3414
10141b57633D7732B2890q965M3526h3777j0587k5748F3902a32526A19122a34731
10129B3176p302d3127Q851p3495A97372I4771a89801c2298I9845f5756j8740G3098
10116a52361M378C0917Q2967c31613A28074b70959J09941k529a2167A99509a30234
$$ y = [-122166, 49460, -134241, 81460, -149603, 121498, 121084, 45536, 50364, -423587, 38013, -4744, -125651, -23450, 60381, 117234, -79756, -82654, -24091, -117491, -87866, 2806, -253933, -510105, 108698, -184687, -279334, 21040, -9571, -414346, 56074, -173505, -4162, -187379, 24335, -135824, -84144, -71785, 166159, 38513, -89182, 165440, -188438, -241224, -195478, -93991, 124017, -41814, -109674, -2501, -321837, -32383, -139554, 281977, 144344, -62709, 108166, -259557, 83414, -257633, 47732, 22890, 13925, 57451, -83777, -94364, -120112, 63902, -132526, 119122, -134731, 23176, 15874, -43127, -34276, -107771, 197372, 94771, -189801, -32298, 99845, -65756, -84496, 73098, -152361, -147983, 30917, 113884, -331613, 128074, -270959, -161018, -163547, -12167, 199509, -130234]
10104h6862C06181f4337A21079a62613O9245G6658b91524d6835A0231b60126J11908
10093a48218k76444E9361a99996I3410b887A00559b24267Q5136A98325e3251k47
10082e3498k25955O1617k4565H034J45858N960K2557a71891e5897k70212a09092
10070b39873A56841c7216G3765e6571q7404C07290A22413b68815n7466E8433J1423
10059F9856a71415Q4951l10833G4064a31105J0791C02883H44J23267b870G6220
10047c9535A24762a05661J5626b788k2621k32313g9535l09670A13865a30020a3512
10035A61401i6218j2679k2289N8265l7708o4172k73961h8897k05042A82603n5761
10024A26842A9928D547M1006b80372E4579D305O3305a35069K9923j07744P1787
$$ y = [-86862, 306181, -64337, 121079, -162613, -93368, 76658, -291524, -46835, 10231, -260126, -148218, -424662, 59361, -199996, 93410, -2887, 100559, -224267, -139131, 198325, -53251, -53498, -279453, -217836, -242401, 8034, 153892, 159852, 182409, -171891, -55897, -326109, -109092, -239873, 156841, -37216, 73765, -56571, -143975, 307290, 122413, -268815, -326281, 58433, 69856, -171415, -86464, -397297, 74064, -131105, -120314, 302883, 844, 124111, -2870, 76220, -39535, 124762, -105661, -90035, -2788, -25409, -257722, -79535, -389205, 113865, -130020, -13512, 161401, -96218, -108897, -131186, -72921, -110629, -174801, -448762, -88897, -293939, 182603, 126842, 19928, 4547, 45553, -280372, 54579, 4305, 67610, -135069, -105146, -212890, -141103]
10013a41103k1814K340l02525F3261A2458e08178A74801g2366l2358F9721a49224
10001b03716a01655j12203f5126p9143p6668q5745J38274j97066M2476e8072q393
9990f6465r1228G2723h8424C22628D4148K97944a87198h0251L3134A7426J48590
9979A66016A4055M7385e3543j76854c2909C86852E9076f968B31069a10976E5210
9967b37818H8802b3512l39757J33180B34311c33936d7270I708a20777A18197b16786
9955b785l4002j1983j99942A59051O1686D7003J13148a21954j71500L9913F7457
9943d9816B21792c21794P1061A57182k2396n9336a04182k61635B0281a13838l33987
9932d47825f3642p4747C130b70029p4682B72611a52789b0446k5843l84451a77813
$$ y = [-141103, -162917, -160577, -463102, 63261, 12458, -508178, 174801, -72366, -104724, 69721, -149224, -203716, -101655, -213858, -65126, -144269, -220937, -306682, -168408, -365474, -322998, -58072, -66465, -157693, 72723, -88424, 322628, 44148, 342092, -187198, -80251, -47117, 17426, 166016, 14055, 61440, -53543, -230397, -32909, 386852, 59076, -6968, 231069, -110976, 55210, -237818, 88802, -23512, -363269, -230089, 234311, -333936, -47270, 9708, -120777, 118197, -216786, -2785, -36787, -48770, -248712, 159051, 220737, 47003, 160151, -121954, -293454, -253541, 67457, -49816, 221792, -321794, -250733, 157182, 134786, 75450, -104182, -365817, 20281, -113838, -447825, -63642, -138389, 3130, -270029, -344711, 272611, -152789, -20446, -46289, -430740, -177813]
9920c6345C76J19617h4178j72393O4960n6570D29849f470l92064A705c1859j06400
9908a38259A44044E8538c98695e5759J880b6928j31582K7406j92636J47251c6112
9896C905J20139K53764b08827A08416b29101e2429F7957J11094l2883a71869d2174
9884a65057o132q9674I6286k7476K2454j0819a27252B5275R3650d1178Q93k51013
9872b91298a45250B96729e2214H6000a39020L0818A21489f8851o6771j98185D0905
9860B3344J172h9340C86013a17897B49171F7521f1782B27649f7431d58o3423m50654
9848e14535a89537A77155a54284f4A89430J1229e9958k49863i7986j16643B86691
9836c03572G6496b21697e6380J9056A21440J42774a27115J1275q6154D84451A01328
$$ y = [-36345, 376, 119993, -84178, -256571, -191611, -248181, 429849, -6470, -398534, 1705, -31859, -138259, 144044, 58538, -398695, -55759, -53879, -26928, -158510, -131104, -323740, -176489, -36112, 3905, 124044, 377808, -208827, 108416, -229101, -52429, 67957, 179051, 146168, -171869, -42174, -165057, -171189, -260863, 96286, 68810, 91264, 80445, -127252, 25275, 118925, -41178, -40285, -291298, -145250, 296729, -52214, 86000, -139020, -108202, 121489, -68851, -135622, -333807, 40905, 23344, 24516, -89340, 386013, -117897, 249171, 67521, -61782, 227649, -67431, -458, -63881, -514535, -189537, 177155, -154284, -64, 189430, 200659, -59958, -309821, -97986, -214629, 286691, -303572, 76496, -221697, -56380, -37324, 121440, 264214, -127115, -115840, -201994, 484451, 101328]
9824A6241b15444B15220e13686a51654I6041C4488b2370k98595O8555c9578j42279
9813a81857P1898j68149E5176b44414b9373j68996d0663M774B8104a37633j97549
9802c35182A01193a08564K9346F9337h4599m4923M9184n3396A16372a46214P1815
9791g4399l8350N0885A03149b25504c8957A06109c2697j43140F5273J42942b14412
9779b96197a45951j38413F7869O2926a24752b3650B31394B098K0976K04322a95890
9767c6130D2334b69045D8070g2203E3314j5070a96239O4463F1899d28995A42927
9755B5377p529g2776b5899C57508h8864E5514a78979A9289b12532I8331a17592
9743c9516E973c53696h7904k54592A94343a85637d554j0004j17645N3694B2202
$$ y = [16241, -215444, 215220, -513686, -151654, 96041, 34488, -22370, -320965, -252410, -39578, -181857, -109959, -278108, 55176, -244414, -29373, -198369, -40663, -35889, 28104, -137633, -335182, 101193, -108564, -79218, 69337, -84599, -129522, -80338, -133734, 116372, -146214, -74399, -112749, -61864, 103149, -225504, -38957, 106109, -32697, -175837, 65273, 208215, -214412, -296197, -145951, -284364, 67869, 130795, -124752, -23650, 231394, 2098, 23074, 227396, -195890, -36130, 42334, -269045, 48070, -72203, 53314, 38244, -196239, -131776, 61899, -428995, 142927, 25377, 17848, -72776, -25899, 357508, -88864, 55514, -178979, 19289, -212532, 98331, -117592, -39516, 5973, -353696, -87904, -342496, 194343, -185637, -4554, -14558, -132203, -78509, 22202]
9731H4086l326K83139a9861r1737e2793g847j76659D8905j9624f4231k04785p8970
9719c47986J66807K1514A64515f1493J2630k11558Q2377j11524K9055H8193P6423
9708A64616F9579a44792F9099a52811J1325o2695J8707B38373H7585J36309a84015
9696a47268A44913b1112O350j05710K5769E214a19414o7529r517p6772h3798a781
9683I5250l4862b27965f4936A57434k5999k9998R9437D6388J09681a81599h3972
9671b3624A2697b31926A70143m3978a74410f7233E9997g2423r6817E7768a35376
9659e9432k14601j5964Q2712j4408m4143j5730K9699g3516A61618d7340A03312
9647a68741r078j99496e1004j403J6446C1524h1656F7328K43436E0197J71142
$$ y = [84086, 80760, 363899, -19861, -111598, -52793, -7847, -184506, 48905, 29281, -64231, -269016, -347986, -181179, -159665, 164515, -61493, -48863, -260421, -178044, -289568, -260513, 88193, 164616, 69579, -144792, 69099, -152811, -141486, -204181, -185474, 238373, 87585, 223894, -184015, -147268, 144913, -21112, -14762, -120472, -94703, 5214, -119414, -186943, -196460, -273232, -83798, -1781, 95250, 60388, -227965, -64936, 157434, 131435, 101437, 200874, 46388, 156069, -181599, -83972, -23624, 12697, -231926, 170143, 126165, -174410, -67233, 59997, -72423, -169240, 57768, -135376, -59432, -274033, -289997, -207285, -221693, -265836, -281566, -251867, -73516, 161618, -47340, 103312, -168741, -177819, -377315, -51004, -52407, -35961, 31524, -81656, 67328, 310764, 50197, 221339]
9636B21339b15867K4666B0829L3367b07245j22704H7241d5415n4632k79756C54883
9624h2459A2212c92998G3228j7547a02465D6344a96445C76404b02147l0876D7580
9612a93818C9573a151k02504A82301E7258J48956j8434a17922d7232A54995E4124
9600c9611k12631j91078F9509k2686J19312B0541C367J30541O0904c64315E5271
9588a61818g2842A82715h4968F5715p69g7396B2684r499K69709c05432f2086I6098
9575a27322a3532A03097a08144n574A06191a21870a8154B9842d1948B02767b27705
9563c88239J66235L7220l9794Q4107c7830A35048a31721L5564A5327N5451Q8325
9552A59103c23520l7224i6844A50484A3667d4420F309b94684A55714a08694j48548
$$ y = [221339, -215867, -191201, 20829, 54196, -207245, -329949, 87241, -45415, -100047, -379803, 354883, -82459, 12212, -392998, 73228, 55681, -102465, 46344, -196445, 376404, -202147, -233023, 47580, -193818, 39573, -1151, -203655, 182301, 57258, 206214, 187780, -117922, -47232, 154995, 54124, -39611, -252242, -443320, 69509, 46823, 166135, 20541, 3367, 133908, 194812, -364315, 55271, -161818, -72842, 182715, -84968, 65715, 64946, -77396, 22684, 13185, 282894, -305432, -62086, 96098, -127322, -13532, 103097, -108144, -113718, 106191, -121870, -18154, 29842, -41948, 202767, -227705, -388239, -222004, -184784, -224578, -140471, -37830, 135048, -131721, -96157, 15327, 70778, 159103, -323520, -360744, -96844, 150484, 13667, -44420, 6309, -294684, 155714, -108694, -257242]
9541b57242l3857a6496B31703e9535j58327P7864B63098f1277l3230p8471M8657
9530a24321k8771H9350b41481h5343F5567j3070c8805j40046A06017c23930B1671
9518e135F1858K5196c05433p1043f5614A139a40053q4556g120j3369A5602f864
9505a81072g2570k1476C1518b70613A21531a1798I9828a21462I442Q7550b82574
9493a36760k61064J85089D767h290A08368b3835k6902j6233q9996g5888k1162
9482i7050A84008b83131I5352B4757a10358k9531D8641b65729c3924j77252d9179
9470h3027A44722c51635Q5333b1498j40921A95312q8690C2201h4969g104k89808
9459b96912C1992J02732J20159f2622k38756G2295b51855r8589I0781B5466r903
$$ y = [-257242, -291099, -16496, 231703, -59535, -217862, -139998, 263098, -61277, -94507, -172978, -124321, -153092, 89350, -241481, -85343, 65567, 52497, -38805, -178851, 106017, -323930, 21671, -5135, 61858, 87054, -305433, -376476, -65614, 1139, -140053, -224609, -7120, -20489, 15602, -6864, -181072, -72570, -94046, 31518, -270613, 121531, -11798, 99828, -121462, 9442, 96992, -282574, -136760, -397824, -212735, 4767, -8290, 108368, -23835, -50737, -66970, -156966, -75888, -97050, 184008, -283131, 95352, 24757, -110358, -139889, 48641, -265729, -33924, -211176, -49179, -83027, 144722, -351635, -266302, -21498, -162419, 195312, 106622, 32201, -84969, -7104, -296912, 31992, 134724, 254883, -62622, -301378, 72295, -251855, -350444, 90781, 25466, 15563]
9448A5563d5561H1849c61320Q9334B56244a3227j19126p0466f1235B41190f0178
9436a82448M0883l733j35336A41864a71943j09877A10028B626a1089l7186j36158
9425a84433f509A85709m4856E42K1967N3563a61436A340c04185e1169j65251B17385
9412B6369Q8155a3086k65197f87A01592g4290o5022K1136A55488e09038a72107
9400d35437J94168C66921A41207b9975j45170O5952j30714C2509J62401g1822
9389A78243b34323j50800e4461k56968P7439k74762g8253C8417a79384H0351b96821
9377h7774C7016b3946j02991I0041l2880a67344A72473p3218a51460B66516j01560
9366A64956b25407f9472a7896j40508e2409l32128G8919b49418O8029g632r0301
$$ y = [15563, -45561, 81849, -361320, -271986, 256244, -13227, -132353, -202819, -61235, 241190, -60178, -182448, -141565, -145298, -280634, 141864, -171943, -281820, 110028, 2626, -11089, -48275, -184433, -6509, 185709, 140853, 542, 22509, 76072, -161436, 1340, -304185, -51169, -216420, 217385, 26369, 114524, -13086, -278283, -687, 101592, -74290, -139312, -118176, 155488, -509038, -172107, -435437, -241269, 366921, 141207, -29975, -175145, -109193, -239907, 32509, 194910, -71822, 178243, -234323, -385123, -54461, -311429, -233990, -508752, -78253, 38417, -179384, 80351, -296821, -87774, 37016, -23946, -126937, 90041, 57161, -167344, 172473, 99255, -151460, 266516, 164956, -225407, -69472, -17896, -158404, -52409, -384537, 78919, -249418, -181389, -7632, -97933]
9355i7933c7874o6155r9088l34384H4723R8504A1145i130j71871n6972P8450p7465
9343b36988h3541D28952B06060e4429A77351c0904C03635M4608b45144A0706a25798
9331A71536a02858j67665a16297a5993j66723O5426J0912J8616j60089b6200F8236
9319B328g4645k38678G7221c49933A35952E7836k3439O4021a61096g2274j37994
9308b10268G7623k2033c41606J08575b1906n1450B24256D2452b27609A05210J06488
9297B11698a35946r7p0195o7179c3249A81152a68869H7371C4242R9377A8627b22289
9284A3932f4080A39089b27953a3051l6349j87292a3336l72594I8526d0346A08884
9272a03196m4527O9599A11571h2389o6013a2827k10049A29416a02798j64059J02313
$$ y = [-97933, -37874, -104029, -203117, -537501, 84723, 183227, 11145, -9130, -181001, -237973, -159523, -236988, -83541, 428952, 206060, -54429, 177351, -30904, 303635, 348243, -245144, 10706, -125798, 171536, -102858, -270523, -116297, -15993, -182716, -117290, -106378, -87762, -247851, -26200, 68236, 2328, -74645, -313323, 77221, -349933, 135952, 57836, 34397, 98418, -161096, -72274, -210268, 77623, 55590, -341606, -233031, -21906, -73356, 224256, 42452, -227609, 105210, 211698, -135946, -136043, -206238, -273417, -33249, 181152, -168869, 87371, 34242, 133619, 18627, -222289, 13932, -64080, 139089, -227953, -13051, -49400, -236692, -13336, -385930, 98526, -40346, 108884, -103196, -147723, -78124, 111571, -82389, -148402, -12827, -222876, 129416, -102798, -266857, -164544]
9261a64544A45873b90299d7849k69201B2907e5493b4214k24634J05635l3057I1687
9249i5409j94687B08226H9620K0032b62766a12686m7700B11414a63179k3601P4632
9238a12148j21994h3648A3645M8937O9833a57976j4945g9979p8645i193j06480
9227a15673A02592e3652A27861b78072a08907j93533a27627J0044j1270M1213
9217h7640k12098j8470J28840E7209b04907B7556a79085j32366D7345d20288A05707
9205c49084I4114b4181B65871d4217k84347a50316q146A33845B6597b42763A12424
9193C422L3581c87384b7154k47248o021A80346n6862J80382a18314a9227A2305
9181A93762a04744D3681K33813a6449j70131l83861A40000a55418L8857H7812
$$ y = [-164544, 145873, -290299, -47849, -317050, 22907, -55493, -24214, -248848, -143213, -176270, 91687, -95409, -290096, 208226, 89620, 109652, -262766, -112686, -160386, 211414, -163179, -186780, -112148, -234142, -83648, 13645, 62582, 132415, -157976, -172921, -79979, -158624, -9193, -115673, 102592, -53652, 127861, -278072, -108907, -302440, -127627, -117583, -128853, -87640, -299738, -318208, -189368, 57209, -204907, 27556, -179085, -311451, 47345, -420288, 105707, -349084, 94114, -24181, 265871, -44217, -328564, -150316, -158462, 133845, 26597, -242763, 112424, 3422, 37003, -387384, -27154, -274402, -280423, 180346, 123484, 303866, -118314, -19227, 12305, 193762, -104744, 43681, 277494, -16449, -186580, -570441, 140000, -155418, -116561, 87812]
9170E420h3406A17499g5655r274l1156e3311I8673b3824A51073a77089N1393H498
9157B28616b29616A96696a72013A47620c12421C2526i8152d6471j91397F3986
9146C7729i4521A4051M3652J11322A2014a49140n4043o8386a7588C3025R8965
9135A31990a95738L6629A5522K9885J05893a72427A68423H1998d3017A65931a87556
9123B1180b5603j81288B15624n1489o3671B7437A2657b06089r1349a26073A58306
9111a18809H861d3689H9793a69949C42042b82945A85535a49117O1584d08l08563
9100c08971B35081b16517b0060C75216A81876a24559A27188C4674f064k82520
9090b88584G5407a58259k33591a1751l27867J06546f3873o7425n9592B92237i8721
$$ y = [5420, -83406, 117499, -75655, -84929, -116085, -53311, 98673, -23824, 151073, -177089, -125696, 8498, 228616, -229616, 196696, -172013, 147620, -312421, 32526, -98152, -46471, -237868, 63986, 37729, -94521, 14051, 57703, 169025, 12014, -149140, -203183, -271569, -17588, 33025, 131990, -195738, -159109, 15522, 45407, 151300, -172427, 168423, 81998, -43017, 165931, -187556, 21180, -25603, -206891, 215624, 164135, 100464, 27437, 12657, -206089, -297438, -126073, 158306, -118809, 8861, -43689, 89793, -169949, 342042, -282945, 185535, -149117, -87533, -408, -308971, 235081, -216517, -20060, 375216, 181876, -124559, 127188, 34674, -6064, -288584, 75407, -158259, -391850, -11751, -339618, -233072, -63873, -131298, -190890, 292237, -98721]
9078A9695d4016j59513i2609C8942a88515E2349L4620h9291A51402J94580c9903
9066B55800b14705i50k68419a26701G5254j6491h9937B05073I1628f02349B94640
9054d4369r3750a8970k24857J6838P8791d6213b1370A74239N9765E3201c11909
9042b7736k31201A73783i3260F4791k1840a66260M8472K5233E5943P9964a97145
9030a6202k22698a09255j86710N6492g6382h003A71437O5518i7663A46115a14755
9018a13350B05284A02158J33687a02527n013A27909a92455J4531e6317Q919j68130
9007b15528b1388j77487p3142A3590J68370c2273j48414C5164A0564J95233b94410
8995e3974j15001j9038C9123K18681a50724j66416J8217d9739B7572d9806q2436
$$ y = [19695, -44016, -203529, -92609, 38942, -188515, 52349, 86969, -89291, 151402, 345982, -39903, 255800, -214705, -950, -269369, -126701, 75254, 58763, -89937, 205073, 91628, -602349, 294640, -44369, -138119, -18970, -243827, -226989, -148198, -46213, -21370, 174239, 234004, 53201, -311909, -27736, -258937, 173783, -93260, 64791, 42951, -166260, -117788, -92555, 55943, 135907, -197145, -16202, -238900, -109255, -295965, -239473, -76382, -8003, 171437, 236955, -97663, 146115, -114755, -113350, 205284, 102158, 235845, -102527, -107540, 127909, -192455, -177924, -56317, -47398, -215528, -21388, -198875, -272017, 13590, 181960, -32273, -180687, 35164, 10564, 205797, -294410, -53974, -168975, -188013, 39123, 257804, -150724, -317140, -298923, -49739, 27572, -49806, -132242]
8984a32242B7658K90249c7374A10477l7940b28077A52244a38078j55040J10640
8974a82478b8469A77081i4956j0393M6016r0751f4226k9396A52429h1461A21658
8962a75422b6272m6781r0336A9764b2479A18387E2860Q6043b2950k37742C2222
8950a42542k31257a44941G4214f5334j32555K6274A17728b19877j2284o1636h6675
8938e5790B102L4568b00674A49502N2737h3493A18664N5555b00314B17426j2612
8927B04814r700b70081Q5496D5026L00388A416c2252l46705A30225e7956A2332
8915A06486O7065N54533B48584L71030B68092R11716J75132J554189K365559N436851
8905A0711539m673811k738026j506316q18388j69759k91587B17123H6629B8409
$$ y = [-132242, 27658, 317907, -37374, 110477, 72537, -228077, 152244, -138078, -293118, -182478, -28469, 177081, -94956, -105349, -59333, -150084, -64226, -93622, 152429, -81461, 121658, -175422, -26272, -73053, -163389, 19764, -22479, 118387, 52860, 138903, -22950, -260692, 32222, -142542, -373799, -144941, 74214, -65334, -197889, -171615, 117728, -219877, -232161, -293797, -86675, -55790, 2102, 36670, -200674, 149502, 202239, -83493, 118664, 174219, -200314, 217426, 204814, 195114, -270081, -184585, 45026, 345414, 1416, -32252, -378957, 130225, -57956, 12332, 106486, 173551, 728084, 248584, 619614, 268092, 1179808, 1354940, 2909129, 5274688, 10711539, 6037728, 3299702, 1793386, 974998, 805239, 513652, 217123, 86629, 28409]
8895B40536i1921C72393j41810N1417A1895J99570I4341d7715Q735A06665q38
8884A05827A7194a29333K933o7121A21355a74845k7420A12099b09317A5771J20434
8873A36205a33879O1510A07732J7195c57033a44476k92963I2931c38740P9502
8863b59238G4227e6207l41044B69831A18491g9812G9527d0549E8729a42402A12328
8851a94337F1398d4736d245A91374f2443k1923l3374A8618f4243L720A57642l5300
8839A22342i3577j67498E9371a31682f0281k86025J67128Q1857B03882f5050j3569
$$ y = [240536, -91921, 372393, 230583, 282000, 11895, 211465, 94341, -47715, -38980, 106665, 105827, 17194, -129333, -126400, -193521, 121355, -174845, -202265, 112099, -209317, 15771, 136205, -133879, -72369, 107732, 124927, -357033, -144476, -437439, 92931, -338740, -259238, 74227, -56207, -397251, 269831, 118491, -79812, 79527, -40549, 58729, -142402, 112328, -194337, 61398, -44736, -4245, 191374, -62443, -84366, -117740, 18618, -64243, -60523, 157642, 122342, -93577, -261075, 59371, -131682, -60281, -346306, -179178, -97321, 203882, -65050, -78619]
$$ [...]
##END NTUPLES=NMR SPECTRUM
##END=
