
##TITLE=UV1141_M5-1005-1002_6279411_JqRdcW4n4n
##JCAMPDX= 6.0         $$ Bruker NMR JCAMP-DX V2.0
##DATA TYPE= NMR SPECTRUM
##DATA CLASS= NTUPLES
##ORIGIN= BRUKER
##OWNER= Administrator
$$ 1.72 TOPSPIN		Version 2.1
$$ 2012-06-03 17:57:14.390 -0500  Administrator@TOPSPIN
$$ Compression mode = diff/dup
##.OBSERVE FREQUENCY= 400.13188235
##.OBSERVE NUCLEUS= ^1H
##.ACQUISITION MODE= SIMULTANEOUS (DQD)
##.ACQUISITION SCHEME= undefined
##.AVERAGES= 64
##.DIGITISER RES= 22
##SPECTROMETER/DATA SYSTEM= spect
##.PULSE SEQUENCE= noesygpps1d.comp
##.SOLVENT NAME= COFFEE_meoh
##.SHIFT REFERENCE= INTERNAL, COFFEE_meoh, 1, 14.96657
##AUDIT TRAIL= $$ (NUMBER, WHEN, WHO, WHERE, PROCESS, VERSION, WHAT)
$$ ##TITLE= Audit trail, TOPSPIN		Version 2.1
$$ ##JCAMPDX= 5.01
$$ ##ORIGIN= Bruker BioSpin GmbH
$$ ##OWNER= Administrator
$$ $$ C:\Bruker\TOPSPIN/data/COFFEE/nmr/UV1141_M5-1005-1002_6279411_JqRdcW4n4n/12/pdata/1/auditp.txt
$$ ##AUDIT TRAIL=  $$ (NUMBER, WHEN, WHO, WHERE, PROCESS, VERSION, WHAT)
(   1,<2012-06-03 17:57:09.328 -0500>,<Administrator>,<TOPSPIN>,<go>,<TOPSPIN 2.1>,
      <created by zg
	started at 2012-06-03 17:45:38.968 -0500,
	POWCHK enabled, PULCHK disabled,
       configuration hash MD5:
       D5 CA 7A 23 FE 6B EE E2 50 67 74 61 24 F7 5E 3B
       data hash MD5: 64K
       8A 07 E9 A2 33 C6 9B 7C C8 59 90 D6 8E D4 7A 62>)
(   2,<2012-06-03 17:57:12.171 -0500>,<Administrator>,<TOPSPIN>,<proc1d>,<TOPSPIN 2.1>,
      <Start of raw data processing
       efp LB = 0.3 FT_mod = 6 PKNL = 1 PHC0 = 0 PHC1 = 0 SI = 128K 
       data hash MD5: 128K
       88 EE C5 84 AF 18 8C 4F B5 A8 83 72 AE 0C 2C 89>)
(   3,<2012-06-03 17:57:13.390 -0500>,<Administrator>,<TOPSPIN>,<proc1d>,<TOPSPIN 2.1>,
      <pk PHC0 = 30.74524 PHC1 = 0 
       data hash MD5: 128K
       B6 A7 EA 97 C4 CF E7 69 CD C5 BB C8 F2 2D E4 A0>)
(   4,<2012-06-03 17:57:14.046 -0500>,<Administrator>,<TOPSPIN>,<proc1d>,<TOPSPIN 2.1>,
      <abs ABSG = 1 
       data hash MD5: 128K
       24 FE 8B 80 EA E1 6A 79 BB BD 91 47 C8 BF 83 D8>)
(   5,<2012-06-03 17:57:14.109 -0500>,<Administrator>,<TOPSPIN>,<proc1d>,<TOPSPIN 2.1>,
      <abs ABSG = 2 
       data hash MD5: 128K
       83 80 FF 41 49 0F 98 2A 7F 5B 7A 98 CB 4F 8A C7>)
(   6,<2012-06-03 17:57:14.171 -0500>,<Administrator>,<TOPSPIN>,<proc1d>,<TOPSPIN 2.1>,
      <abs ABSG = 3 
       data hash MD5: 128K
       69 6D EF CC B6 CE A9 A1 F5 B6 54 53 D3 E0 31 91>)
(   7,<2012-06-03 17:57:14.234 -0500>,<Administrator>,<TOPSPIN>,<proc1d>,<TOPSPIN 2.1>,
      <abs ABSG = 4 
       data hash MD5: 128K
       B3 BA 6B D8 7F EC 30 F7 7D 44 11 60 AC 5B 65 B1>)
(   8,<2012-06-03 17:57:14.296 -0500>,<Administrator>,<TOPSPIN>,<proc1d>,<TOPSPIN 2.1>,
      <abs ABSG = 5 
       data hash MD5: 128K
       C9 75 7F 8E C1 FF E9 C3 0E C3 BD 7D 47 64 E7 A9>)
$$ ##END=
$$ 
$$ $$ hash MD5
$$ $$ BF B9 82 6E 2E 72 1C 9B CD F1 69 B4 99 3D E3 07
##$RELAX= 
##$RELAX= 
##$RELAX= 
##$RELAX= 
##$RELAX= 
##$RELAX= 
##$RELAX= 
##$RELAX= 
$$ Bruker specific parameters
$$ [...]
##$TP07= 0
##$TPNAME0= <>
##$TPNAME1= <>
##$TPNAME2= <>
##$TPNAME3= <>
##$TPNAME4= <>
##$TPNAME5= <>
##$TPNAME6= <>
##$TPNAME7= <>
##$TPOAL= (0..7)
0.5 0.5 0.5 0.5 0.5 0.5 0.5 0.5
##$TPOFFS= (0..7)
0 0 0 0 0 0 0 0
##$TUNHIN= 0
##$TUNHOUT= 0
##$TUNXOUT= 0
##$USERA1= <user>
##$USERA2= <user>
##$USERA3= <user>
##$USERA4= <user>
##$USERA5= <user>
##$V9= 5
##$VALIST= <valist>
##$VCLIST= <CCCCCCCCCCCCCCC>
##$VD= 0
##$VDLIST= <DDDDDDDDDDDDDDD>
##$VPLIST= <PPPPPPPPPPPPPPP>
##$VTLIST= <TTTTTTTTTTTTTTT>
##$WBST= 2048
##$WBSW= 25
##$XGAIN= (0..3)
0 0 0 0
##$XL= 0
##$YL= 0
##$YMAX_a= 11039361
##$YMIN_a= -6770427
##$ZGOPTNS= <>
##$ZL1= 120
##$ZL2= 120
##$ZL3= 120
##$ZL4= 120
##$ABSF1= 14.96657
##$ABSF2= -5.58596
##$ABSG= 5
##$ABSL= 3
##$ALPHA= 0
##$AQORDER= 0
##$ASSFAC= 0
##$ASSFACI= 0
##$ASSFACX= 0
##$ASSWID= 0
##$AUNMP= <proc_prof1d_extract.lims>
##$AXLEFT= 0
##$AXNAME= <>
##$AXNUC= <1H>
##$AXRIGHT= 0
##$AXTYPE= 0
##$AXUNIT= <>
##$AZFE= 0.1
##$AZFW= 0.1
##$BCFW= 0
##$BC_mod= 0
##$BYTORDP= 0
##$COROFFS= 0
##$CY= 15
##$DATMOD= 1
##$DC= 0
##$DFILT= <>
##$DTYPP= 0
##$F1P= 0
##$F2P= 0
##$FCOR= 0.5
##$FTSIZE= 131072
##$FT_mod= 6
##$GAMMA= 0
##$GB= 0
##$INTBC= 1
##$INTSCL= 1
##$ISEN= 128
##$LB= 0.3
##$LEV0= 0
##$LPBIN= 0
##$MAXI= 10000
##$MC2= 0
##$MEAN= 0
##$ME_mod= 0
##$MI= 0
##$NCOEF= 0
##$NC_proc= -3
##$NLEV= 6
##$NOISF1= 0
##$NOISF2= 0
##$NSP= 0
##$NTH_PI= 0
##$NZP= 0
##$OFFSET= 14.96657
##$PC= 1
##$PHC0= 30.74524
##$PHC1= 0
##$PH_mod= 1
##$PKNL= yes
##$PPARMOD= 0
##$PPDIAG= 0
##$PPIPTYP= 0
##$PPMPNUM= 2147483647
##$PPRESOL= 1
##$PSCAL= 4
##$PSIGN= 0
##$PYNMP= <proc.py>
##$REVERSE= no
##$SF= 400.130005617466
##$SI= 131072
##$SIGF1= 0
##$SIGF2= 0
##$SINO= 400
##$SIOLD= 131072
##$SPECTYP= <>
##$SREGLST= <1H.CDCl3>
##$SSB= 0
##$STSI= 131072
##$STSR= 0
##$SW_p= 8223.68421052632
##$SYMM= 0
##$S_DEV= 0
##$TDeff= 65536
##$TDoff= 0
##$TI= <>
##$TILT= no
##$TM1= 0
##$TM2= 0
##$TOPLEV= 0
##$USERP1= <user>
##$USERP2= <user>
##$USERP3= <user>
##$USERP4= <user>
##$USERP5= <user>
##$WDW= 1
##$XDIM= 131072
##$YMAX_p= 474302606
##$YMIN_p= -325640569
##$CURPLOT= <Network HP LaserJet P1505>
##$CURPRIN= <$Network HP LaserJet P1505>
##$DFORMAT= <normdp>
##$LAYOUT= <+/1D_H.xwp>
##$LFORMAT= <normlp>
##$PFORMAT= <normpl>
##$SURQMSG= 1
$$ End of Bruker specific parameters
$$ ---------------------------------
##NTUPLES= NMR SPECTRUM
##VAR_NAME=  FREQUENCY,     SPECTRUM/REAL,   SPECTRUM/IMAG
##SYMBOL=    X,             R,               I
##VAR_TYPE=  INDEPENDENT,   DEPENDENT,       DEPENDENT
##VAR_FORM=  AFFN,          ASDF,            ASDF
##VAR_DIM=   131072,        131072,          131072
##UNITS=     HZ,            ARBITRARY UNITS, ARBITRARY UNITS
##FACTOR=    0.0627417313425165, 1,          1
##FIRST=     8223.62146879498, 593,          -115756
##LAST=      0,             3203,            -115070
##MIN=       0,             -325640569,      0
##MAX=       8223.62146879498, 474302606,    0
$$ Real data points
##PAGE= N=1
##DATA TABLE= (X++(R..R)), XYDATA
$$ [...]
63613E59969M165N302M737K601K41p80n8J382K184J743K99j522k947l319k558
63598E71439j321n61r96k845n553p737p987o182l732k181j772j576q01L80J219
63583E29794J378J396K147L729N213N784N848O461P780Q779Q747Q319Q711J0300
63569F14386J2368J3932J4629J4978J5875J7567J9223K0046K0525K1761K3656
63558H08946K5036K5836K7649L1251L4909L6546L6666L7504L9819M2341M4294
63547A190797M6524M9547N1959N1873M9062M4730L9745L3928K6850J8707J0487
63536A614209L566j074l542m761n510o156p360j0149j4733j9919k4377k8124l2002
63523A460068l5926l8509l8527l6274l3311l1140l0091k9184k7165k3893k0482
$$ y = [559969, 564134, 569436, 574173, 576774, 577015, 576235, 576177, 577559, 579743, 581486, 581785, 580263, 577316, 573997, 571439, 570118, 569557, 568561, 565716, 560163, 552426, 544439, 538257, 534525, 532344, 530572, 528996, 528195, 528575, 529794, 531172, 532568, 534715, 538444, 543657, 549441, 555289, 561750, 569530, 578309, 587056, 595375, 604086, 614386, 626754, 640686, 655315, 670293, 686168, 703735, 722958, 743004, 763529, 785290, 808946, 833982, 859818, 887467, 918718, 953627, 990173, 1026839, 1064343, 1104162, 1146503, 1190797, 1237321, 1286868, 1338827, 1390700, 1439762, 1484492, 1524237, 1558165, 1585015, 1603722, 1614209, 1617775, 1616701, 1613159, 1608398, 1602888, 1596732, 1589372, 1579223, 1564490, 1544571, 1520194, 1492070, 1460068, 1424142, 1385633, 1347106, 1310832, 1277521, 1246381, 1216290, 1187106, 1159941, 1136048, 1115566]
63512A115566j7726j4863j0644n464j355M28R56K156M566P406J0276J3523J6865
63499A121690J8988J9214J8785J9535K1745K4269K6547K9299L2998L6780L9676
63488A409526M2020M4793M8007N0857N3055N4799N5192N2004M3844L1983J9453
63477A905533Q689M73n457r571j2243j3692j4219j4680j6309j9583k3592k7213
63465A758136l0713l5361m1405m7282n1265n3237n4248n4780n4317n2637n0585
63454A232306m8945m7089m3709l8868l4330l1382k9311k6814k4134k2358k1105
63443H64261j8797j5393j2926j2406j2028r961p391o747p825q061o376m408l660
63430G38282l712l964n006o860p599n478j529J595K743K867K956K939K589K239
$$ y = [1115566, 1097840, 1082977, 1072333, 1066869, 1065514, 1065942, 1066898, 1069054, 1073620, 1081026, 1091302, 1104825, 1121690, 1140678, 1159892, 1178677, 1198212, 1219957, 1244226, 1270773, 1300072, 1333070, 1369850, 1409526, 1451546, 1496339, 1544346, 1595203, 1648258, 1703057, 1758249, 1810253, 1854097, 1886080, 1905533, 1914222, 1914695, 1909238, 1899667, 1887424, 1873732, 1859513, 1844833, 1828524, 1808941, 1785349, 1758136, 1727423, 1692062, 1650657, 1603375, 1552110, 1498873, 1444625, 1389845, 1335528, 1282891, 1232306, 1183361, 1136272, 1092563, 1053695, 1019365, 987983, 958672, 931858, 907724, 885366, 864261, 845464, 830071, 817145, 804739, 792711, 782750, 775359, 768612, 760787, 752726, 746350, 741942, 738282, 734570, 730606, 725600, 718740, 711141, 705663, 704134, 705729, 708472, 711339, 714295, 717234, 719823, 722062]
63416G22062K268K587K899K918K367J196k03j353k074k301k048j865k711m634
63402G19108o292o587o120o043n978m464j260K110M197M890M800M540M801O002
63388G13704P529Q324Q473R306J1577J4621J7577K0375K2967K4851K6099K7875
63376I13278L0985L4669L7796M0501M3543M6515M7877M6687M3425L9128L4483
63365A358887K9937K6148K4096K4672K7898L2483L6782M0441M4441M9112N3087
63354A747984N4954N5019N4285N2295M7527L9700L0344K0924J1659K635n125j0487
63342B101714j3504j5210j6542j8025k0181k3589k8445l4251m0091m5256m9593
63331A797027n3172n5574n6005n4272n1232m7909m4651m1503l8728l6158l2682
$$ y = [722062, 724330, 726917, 729816, 732734, 735101, 736297, 736094, 734741, 732667, 730366, 728318, 726453, 723742, 719108, 712816, 706229, 700109, 694066, 688088, 683624, 682364, 684474, 688671, 693561, 698361, 702901, 707702, 713704, 721233, 729557, 738030, 747336, 758913, 773534, 791111, 811486, 834453, 859304, 885403, 913278, 944263, 978932, 1016728, 1057229, 1100772, 1147287, 1195164, 1241851, 1285276, 1324404, 1358887, 1388824, 1414972, 1439068, 1463740, 1491638, 1524121, 1560903, 1601344, 1645785, 1694897, 1747984, 1802938, 1857957, 1912242, 1964537, 2012064, 2051764, 2082108, 2103032, 2114691, 2117326, 2112201, 2101714, 2088210, 2073000, 2056458, 2038433, 2018252, 1994663, 1966218, 1931967, 1891876, 1846620, 1797027, 1743855, 1688281, 1632276, 1578004, 1526772, 1478863, 1434212, 1392709, 1353981, 1317823, 1285141]
63320A285141k7543k1827j7413j4545j1678p777l372Q64N153R525J3034J5033
63308A224595J6313J8083K0577K3578K7488L2671L8212M2494M4891M6124M7166
63297A582192M8542N0418N2539N4196N4831N4420N2720M8771M2048L3631K5169
63286B099477J7036Q684N60n825r842j2481j4775j6762j8546k1231k5849l2067
63274A968379l8544m4118m8263n1047n3086n4866n5754n4557n1457m8389m6682
63263A421616m5319m2454l7755l2166k6264k0495j6570j6697k0958k6641l0633
63252A105664l1713l0446k8018k5622k4002k2932k1608j9813j8133j6867j5574
63241H50936j4106j3176j3344j3946j3708j2043r476p214o495p601r155r235p623
$$ y = [1285141, 1257598, 1235771, 1218358, 1203813, 1192135, 1184358, 1180986, 1181850, 1187003, 1196528, 1209562, 1224595, 1240908, 1258991, 1279568, 1303146, 1330634, 1363305, 1401517, 1444011, 1488902, 1535026, 1582192, 1630734, 1681152, 1733691, 1787887, 1842718, 1897138, 1949858, 1998629, 2040677, 2074308, 2099477, 2116513, 2125197, 2125757, 2119932, 2110090, 2097609, 2082834, 2066072, 2047526, 2026295, 2000446, 1968379, 1929835, 1885717, 1837454, 1786407, 1733321, 1678455, 1622701, 1568144, 1516687, 1468298, 1421616, 1376297, 1333843, 1296088, 1263922, 1237658, 1217163, 1200593, 1183896, 1162938, 1136297, 1105664, 1073951, 1043505, 1015487, 989865, 965863, 942931, 921323, 901510, 883377, 866510, 850936, 836830, 823654, 810310, 796364, 782656, 770613, 761137, 753923, 747428, 739827, 730672, 721437, 713814]
63228G13814o144o170o844o663n734n109m655l438j861j540k706l479k475p35
63214F56261j00q05j781k469l025l119k036pJ632K021J771J968K722L175K733
63199F58941J792J315J908L363M976O220P053P678Q117Q237Q095Q052Q491R576
63185G43814J1332J3705J6342J8490J9581J9974K0716K2237K3702K4218K4310
63174I58421K5373K7547K9206K9007K7714K7107K7688K8418K8471K8147K8014
63163A265113K8104K8288K8629K8965K8736K7663K6114K4490K2610J9976J6289
63152A544977J1574O254J284k462n307q663j3395j8644k2686k4504k4182k2422
63140A421824k0250j8604j7469j5663j2252p826l655J13M494R926J5425J9744
$$ y = [713814, 707670, 701500, 694656, 687993, 682259, 677150, 672495, 669057, 667196, 665656, 662950, 659471, 656996, 656261, 656161, 655356, 653575, 651106, 648081, 644962, 642926, 642919, 644551, 646572, 648343, 650311, 653033, 656208, 658941, 660733, 662048, 663956, 667319, 672295, 678515, 685568, 693246, 701363, 709600, 717695, 725747, 734238, 743814, 755146, 768851, 785193, 803683, 823264, 843238, 863954, 886191, 909893, 934111, 958421, 983794, 1011341, 1040547, 1069554, 1097268, 1124375, 1152063, 1180481, 1208952, 1237099, 1265113, 1293217, 1321505, 1350134, 1379099, 1407835, 1435498, 1461612, 1486102, 1508712, 1528688, 1544977, 1556551, 1562805, 1564089, 1561627, 1556320, 1547657, 1534262, 1515618, 1492932, 1468428, 1444246, 1421824, 1401574, 1382970, 1365501, 1349838, 1337586, 1329760, 1326105, 1326218, 1330712, 1340638, 1356063, 1375807]
63128A375807K2633K4631K6174K7392K8457K9747L1596L3959L6307L7956L8759
63117A713418L9247L9757L9569L7541L3640K9343K6144K3937K1138J6324R501
63106B029559J872n502j2666k0313k8527l6381m2951m8256n2822n6607n8959n9537
63094A608910n8742n7202n5203n2710m9564m5706m1550l8031l5770l4205l2049
63083A108178k8750k5070k2078k0015j8306j6281j3713j1044r265r101r957j0086
63071I14512q247n022k142p10m45m92l78m7N92J605K611K847K061J165J543L546
63055I12999O002P440P535P008O458N830M996M290M200M808N630N970N411M254
63041I92831L434L738N032O378O938O591N825N306N415N933O190N762M930M243
$$ y = [1375807, 1398440, 1423071, 1449245, 1476637, 1505094, 1534841, 1566437, 1600396, 1636703, 1674659, 1713418, 1752665, 1792422, 1831991, 1869532, 1903172, 1932515, 1958659, 1982596, 2003734, 2020058, 2029559, 2031431, 2025929, 2013263, 1992950, 1964423, 1928042, 1885091, 1836835, 1784013, 1727406, 1668447, 1608910, 1550168, 1492966, 1437763, 1385053, 1335489, 1289783, 1248233, 1210202, 1174432, 1140227, 1108178, 1079428, 1054358, 1032280, 1012265, 993959, 977678, 963965, 952921, 943656, 934555, 924598, 914512, 906265, 901243, 899101, 898391, 897946, 897454, 897076, 897029, 897621, 899226, 901837, 904684, 906745, 907910, 909453, 912999, 919001, 926441, 933976, 940984, 947442, 953272, 958268, 962558, 966758, 971566, 977196, 983166, 988577, 992831, 996265, 1000003, 1005035, 1011413, 1018351, 1024942, 1030767, 1036073, 1041488, 1047421, 1053611, 1059373, 1064303, 1068546]
63027A068546L830L451L011K656K574L076M586O965R132J0030R843R624R883J0384
63013A157591J1136J2544J4415J5864J6610J7487J9153K1151K2890K4727K7355
63002A360923L0559L3453L5722L7983M0979M4825M8941N2429N4827N6693N9104
62991A856438O2371O5631O8028O9682P1120P2351P3093P3465P3746P3825P3493
62980B633243P2951P2416P1545O9932O7920O6104O4184O1133N6403N0241M2673
62969C328745L3029K0876P022o764j8914k8980l7643m5800n3386n9168o1929o1642
62957C015446n9174n5249n0248m4696l9030l2815k5006j5342m918M982J4089K2699
62945B730738L0495L6635M1171M5605N1452N8367O4343O7860O9261O9595O8961
$$ y = [1068546, 1072376, 1075827, 1078838, 1081494, 1084068, 1087144, 1091730, 1098695, 1107827, 1117857, 1127700, 1137324, 1147207, 1157591, 1168727, 1181271, 1195686, 1211550, 1228160, 1245647, 1264800, 1285951, 1308841, 1333568, 1360923, 1391482, 1424935, 1460657, 1498640, 1539619, 1584444, 1633385, 1685814, 1740641, 1797334, 1856438, 1918809, 1984440, 2052468, 2122150, 2193270, 2265621, 2338714, 2412179, 2485925, 2559750, 2633243, 2706194, 2778610, 2850155, 2920087, 2988007, 3054111, 3118295, 3179428, 3235831, 3286072, 3328745, 3361774, 3382650, 3389672, 3382908, 3363994, 3335014, 3297371, 3251571, 3198185, 3139017, 3077088, 3015446, 2956272, 2901023, 2850775, 2806079, 2767049, 2734234, 2709228, 2693886, 2688968, 2693950, 2708039, 2730738, 2761233, 2797868, 2839039, 2884644, 2936096, 2994463, 3058806, 3126666, 3195927, 3265522, 3334483]
62934C334483O6926O4161O2167O1134N9394N5663N0594M5150L8501K8977J6515
62923C883665K717j1377k6211m2278n8877p4584q8247r9305j07824j14179j18261
62912C145239j19276j17131j13545j10554j08082j04289r8427r1881q6160q1248
62902B114646p6530p1902o7151o1542n5161m9804m7214m6925m6830m5499m2981
62891A503107l9780l6137l2437k9495k8113k8414k9508k9833k8460k6178k4599
62880A170153k3972k2887k0593j8449j8025j8711j8452j6309j3222j0670r603
62869I79260j0116j1017j0375p798n594o122q462r554q323o596n758m938l319
62856H81288k067k415l547l926l651l793m290m189l466k939k671j957q06j26l34
$$ y = [3334483, 3401409, 3465570, 3527737, 3588871, 3648265, 3703928, 3754522, 3799672, 3838173, 3867150, 3883665, 3886382, 3875005, 3848794, 3806516, 3747639, 3673055, 3584808, 3485503, 3377679, 3263500, 3145239, 3025963, 2908832, 2795287, 2684733, 2576651, 2472362, 2373935, 2282054, 2195894, 2114646, 2038116, 1966214, 1899063, 1837521, 1782360, 1732556, 1685342, 1638417, 1591587, 1546088, 1503107, 1463327, 1427190, 1394753, 1365258, 1337145, 1308731, 1279223, 1249390, 1220930, 1194752, 1170153, 1146181, 1123294, 1102701, 1084252, 1066227, 1047516, 1029064, 1012755, 999533, 988863, 979260, 969144, 958127, 947752, 939954, 934360, 928238, 919776, 910222, 901899, 895303, 889545, 884607, 881288, 879221, 876806, 873259, 869333, 865682, 861889, 857599, 853410, 849944, 847005, 844334, 842377, 841571, 841445, 841111]
62841H41111r21j458j947k131j531l30P32J500K394L143K717R78o77r83k78K20
62825H42539r7j063k222k886k417j153m23r18j733j782j448j759k557k799k355
62810H16927k098k251k056j412j399k561l776l758k805k027j558p19M09P99O6
62795G91781q35q57r9O40R73J030R11N87J92n0j74l85o27o18l31OL79R77J568
62776G95068J488O87J96R05K228K849K589K485K965L085K132R66Q27J603K269
62761H22342K641L466M915O107O305N758N192N142N893P281Q496Q839Q881R937
62747I11195J2170J4134J4649J4283J4353J5325J6866J8795K1050K3121K4374
62736A100315K4822K5050K5558K6641K8508L1120L4130L7472M1475M6056N0458
$$ y = [841111, 840190, 838732, 836785, 834654, 833123, 832793, 833525, 835025, 837419, 840562, 843279, 844257, 843580, 842597, 842319, 842539, 842442, 841379, 839157, 836271, 833854, 832701, 832278, 831360, 829627, 827845, 826397, 824638, 822081, 819282, 816927, 814829, 812578, 810522, 809110, 807711, 805150, 801374, 797616, 794811, 792784, 791226, 790507, 790916, 791715, 791781, 790946, 790089, 789990, 790630, 791603, 792633, 793544, 794131, 794323, 794273, 794099, 793714, 793087, 792469, 792138, 792144, 792523, 793500, 795068, 796556, 797243, 797439, 798344, 800572, 803421, 806010, 808495, 811460, 814545, 816677, 817643, 818470, 820073, 822342, 824983, 828449, 833364, 839471, 845776, 851534, 856726, 861868, 867761, 875042, 883538, 892377, 901258, 911195, 923365, 937499, 952148, 966431, 980784, 996109, 1012975, 1031770, 1052820, 1075941, 1100315, 1125137, 1150187, 1175745, 1202386, 1230894, 1262014, 1296144, 1333616, 1375091, 1421147, 1471605]
62725A471605N4412N8868O4586P0637P5446P9113Q3387Q9199R5209R9158R9921
62714B341541R8025R4699R0598Q5085P6730O4932N0798L5976K0924N149j1242
62703B953215k7234m2006n5281o6524p4942q0614q4680q8040r0594r1944r1968
62692B159388r0489q7234q2543p7414p2474o7707o3248n9550n6419n2882m8447
62681A400981m3646l8969l4293k9736k5940k2947j9968j6926j4835j3817j2104
62670A127800q375l907q99M02J416K938M853P382J0629J3385J4392J4693J6618
62657A201327K0393K3908K6191K8803L2917L7339M0831M4532N0078N6642O2011
62646A624972O5885P0131P5952Q2760Q9891R7552J05443J12065J16498J19859
$$ y = [1471605, 1526017, 1584885, 1649471, 1720108, 1795554, 1874667, 1958054, 2047253, 2142462, 2241620, 2341541, 2439566, 2534265, 2624863, 2709948, 2786678, 2851610, 2902408, 2938384, 2959308, 2964457, 2953215, 2925981, 2883975, 2828694, 2762170, 2687228, 2606614, 2521934, 2433894, 2343300, 2251356, 2159388, 2068899, 1981665, 1899122, 1821708, 1749234, 1681527, 1618279, 1558729, 1502310, 1449428, 1400981, 1357335, 1318366, 1284073, 1254337, 1228397, 1205450, 1185482, 1168556, 1153721, 1139904, 1127800, 1119425, 1115518, 1114619, 1115021, 1116437, 1119375, 1124228, 1131610, 1142239, 1155624, 1170016, 1184709, 1201327, 1221720, 1245628, 1271819, 1300622, 1333539, 1370878, 1411709, 1456241, 1506319, 1562961, 1624972, 1690857, 1760988, 1836940, 1919700, 2009591, 2107143, 2212586, 2324651, 2441149, 2561008]
62636B561008J23787J28011J30519J29832J26083J19783J10625R8071Q2456O4738
62626C674913M5482K4716K785j9420m1045o1526q0096r5805j08437j18664j26702
62615C096201j31570j32516j30722j28412j26357j23315j18055j10930j03190
62606A991134r5689q8775q2675p7220p1770o5978o0392n5748n1922m8124m3994
62595A248847m0020l6855l4474l2100k8981k5346k2416k1054k0559j9413j7213
62584I50416j5108j4078j3605j2565j0781r006p881p504p624p641o768m956l279
62571H29620k798l247l560l377l151k989k407j394o47m00J45J586L130L508K776
62556H16795K448L610N563O827P243Q284J0972J4167J5683J5020J3997J4507J6548
$$ y = [2561008, 2684795, 2812806, 2943325, 3073157, 3199240, 3319023, 3429648, 3527719, 3610175, 3674913, 3720395, 3745111, 3747896, 3728476, 3687431, 3625905, 3545809, 3450004, 3341567, 3222903, 3096201, 2964631, 2832115, 2701393, 2572981, 2446624, 2323309, 2205254, 2094324, 1991134, 1895445, 1806670, 1723995, 1646775, 1575005, 1509027, 1448635, 1392887, 1340965, 1292841, 1248847, 1208827, 1171972, 1137498, 1105398, 1076417, 1051071, 1028655, 1007601, 987042, 967629, 950416, 935308, 921230, 907625, 895060, 884279, 875273, 867392, 859888, 852264, 844623, 837855, 832899, 829620, 826822, 823575, 820015, 816638, 813487, 810498, 808091, 806697, 806050, 805650, 805795, 807381, 810511, 814019, 816795, 819243, 822853, 828416, 835243, 842486, 850770, 861742, 875909, 891592, 906612, 920609, 935116, 951664]
62543I51664J8953K1126K3174K4960K6285K7753L0399L4291L8388M1831M4477
62532A283301M6080M5992M4151M1559L9137L6551L2712K7100K0186J2717N055
62521A634541k881j1114j9051k5615l0304l3871l7341m0513m2165m1858m0609
62510A309219l9608l9072l8687l8230l7159l4479k9951k4961k1422j9941j9645
62499I66064j9316j8165j5942j3088j0612r151q287p223n827m557l693l178k868
62486H44157k389j206M99J547J243O97J626M060O434P810Q830J0306J2044J3491
62472I09149J4529J5086J4791J3720J2936J3742J6612K1090K6188L0749L4022
62461A122614L6392L9119M2988M7516N1782N5604N9600O4391O9843P4764P7385
$$ y = [951664, 970617, 991743, 1014917, 1039877, 1066162, 1093915, 1124314, 1158605, 1196993, 1238824, 1283301, 1329381, 1375373, 1419524, 1461083, 1500220, 1536771, 1569483, 1596583, 1616769, 1629486, 1634541, 1631660, 1620546, 1601495, 1575880, 1545576, 1511705, 1474364, 1433851, 1391686, 1349828, 1309219, 1269611, 1230539, 1191852, 1153622, 1116463, 1081984, 1052033, 1027072, 1005650, 985709, 966064, 946748, 928583, 912641, 899553, 888941, 879790, 871503, 864280, 858453, 853896, 850203, 847025, 844157, 841768, 840562, 841061, 842608, 843851, 844548, 846174, 850234, 856668, 864478, 873308, 883614, 895658, 909149, 923678, 938764, 953555, 967275, 980211, 993953, 1010565, 1031655, 1057843, 1088592, 1122614, 1159006, 1198125, 1241113, 1288629, 1340411, 1396015, 1455615, 1520006, 1589849, 1664613, 1741998]
62450A741998P6776P3920P0763O7988O4361N8422N0040L9968K8814J7108N728
62439B295886m540j3628k1852k9231l5411l9868m1962m1375l8766l5460l2048
62428A961745k8003k2911j7232j1402n209J316P339J2469J7545K3088K7907L0592
62416A997244L1659L2590L3215L1685K6985J9958J1863L382m838j2282j9701k8612
62404B123148l9004m8714n5902o0995o5308o8689o9775o8110o4890o1644n8892
62393A461225n6193n2999m9306m5556m1918l7958l3374k8859k5486k3248k0907
62382A045421j7575j3692j0218p538n549m176l349k883k757l099l724m216m633
62369I62012n415o444p069p364q374j0424j2181j2376j1721j1857j2880j3192
$$ y = [1741998, 1818774, 1892694, 1963457, 2031445, 2095806, 2154228, 2204268, 2244236, 2273050, 2290158, 2295886, 2291346, 2277718, 2255866, 2226635, 2191224, 2151356, 2109394, 2068019, 2029253, 1993793, 1961745, 1933742, 1910831, 1893599, 1882197, 1876988, 1878304, 1885643, 1898112, 1915657, 1938745, 1966652, 1997244, 2028903, 2061493, 2094708, 2126393, 2153378, 2173336, 2185199, 2188581, 2183743, 2171461, 2151760, 2123148, 2084144, 2035430, 1979528, 1918533, 1853225, 1784536, 1714761, 1646651, 1581761, 1520117, 1461225, 1405032, 1352033, 1302727, 1257171, 1215253, 1177295, 1143921, 1115062, 1089576, 1066328, 1045421, 1027846, 1014154, 1003936, 996398, 990849, 986673, 983324, 980441, 977684, 974585, 970861, 966645, 962012, 956597, 950153, 943084, 935720, 927346, 916922, 904741, 892365, 880644, 868787, 855907, 842715]
62357H42715j1802r660q277p933p782p146o181n418n119n077m921m475l888l477
62343G51559l400l412k819r22K133N064O363N731M378L844M566N579N632M703
62329G88999M370O022Q778J0155R334Q483R644J1665J2078J1187J1677J4292J6707
62316I23391J7531J8577K1603K5024K6176K5368K5222K6923K9384L1747L4515
62305A205461L8050M1737M4992M7882N0619N3552N7629O3577P0555P6664Q1014
62294A831732Q4338Q7543R0471R2054R0938Q6083P7712O7421N6489M4481L0607
62283B639869J5996L033p559j7445k8203l9406m9561n7770o4014o8624p1826p3294
62271B181196p2244o8845o5167o3398o3151o1838n7870n2195m6625m2182l9328
$$ y = [842715, 830913, 821253, 812976, 805043, 797261, 790115, 783934, 778516, 773397, 768320, 763399, 758924, 755036, 751559, 748159, 744747, 741928, 741006, 743139, 748203, 754566, 760297, 764675, 768519, 773085, 778664, 784296, 788999, 793369, 799391, 808169, 818324, 827658, 836141, 845785, 857450, 869528, 880715, 892392, 906684, 923391, 940922, 959499, 981102, 1006126, 1032302, 1057670, 1082892, 1109815, 1139199, 1170946, 1205461, 1243511, 1285248, 1330240, 1378122, 1428741, 1482293, 1539922, 1603499, 1674054, 1750718, 1831732, 1916070, 2003613, 2094084, 2186138, 2277076, 2363159, 2440871, 2508292, 2564781, 2609262, 2639869, 2655865, 2658898, 2651339, 2633894, 2605691, 2566285, 2516724, 2458954, 2394940, 2326316, 2254490, 2181196, 2108952, 2040107, 1974940, 1911542, 1848391, 1786553, 1728683, 1676488, 1629863, 1587681, 1548353]
62260A548353l8275l8275l7910l6701l5487l4883l4616l4663l5384l5954l4347
62249A151858k9932k4812k1428k0047j9466j8890j7939j5966j2832r551p025m943
62237I49027k880j486j350j665j363o59j37P25K553M343M629L903M135N999Q213
62222I73987R522R870R703R640J0772J3603J6576J7263J5537J3958J4570J6719
62210A131720J8766K0542K2988K6363L0062L3741L7583M1618M5479M8912N2190
62199A509964N6041O1184O7605P4265P9878Q4089Q7476R0353R2105R1851Q9177
62188B383988Q4010P6195O5645N2687L8111K3000Q558m285j5442k5860l6968m9604
62176B600035o2998p4840q3035q7730r0994r4063r5726r4146q9531q3777p7972
$$ y = [1548353, 1510078, 1471803, 1433893, 1397192, 1361705, 1326822, 1292206, 1257543, 1222159, 1186205, 1151858, 1121926, 1097114, 1075686, 1055639, 1036173, 1017283, 999344, 983378, 970546, 960995, 953970, 949027, 946147, 944661, 943311, 941646, 940283, 939624, 939487, 940212, 942765, 947108, 951737, 955640, 959775, 965774, 973987, 983509, 993379, 1003082, 1012722, 1023494, 1037097, 1053673, 1070936, 1086473, 1100431, 1115001, 1131720, 1150486, 1171028, 1194016, 1220379, 1250441, 1284182, 1321765, 1363383, 1408862, 1457774, 1509964, 1566005, 1627189, 1694794, 1769059, 1848937, 1933026, 2020502, 2110855, 2202960, 2294811, 2383988, 2467998, 2544193, 2609838, 2662525, 2700636, 2723636, 2732194, 2727909, 2712467, 2686607, 2649639, 2600035, 2537037, 2462197, 2379162, 2291432, 2200438, 2106375, 2010649, 1916503, 1826972, 1743195, 1665223]
62165A665223p1666o4612n7807n2371m8356m5026m1635l7655l3016k8528k5408
62154A159143k3972k3241k1961j9704j6961j4580j3053j1810r605o278l655l461
62142I90862m686m545k093Q34K628M046O351Q931J0236J0182J0231J1566J4338
62129A058881J8108K2010K4858K6154K6703K7416K8015K7923K7779K8717L0395
62118A346959L1167L0346K8919K7776K6606K5229K4784K6422K9376L1566L2271
62107A661421L3248L6753M2851M9264N3763N6215N8068O0217O1887O1446N7717
62096B232850N0427M0136K8259J6825P520N45n596j3054k2911l3979m3534m9811
62084B207677n3680n7165o0540o1996o0394n6960n3580n0547m7033m2805l8249
$$ y = [1665223, 1593557, 1528945, 1471138, 1418767, 1370411, 1325385, 1283750, 1246095, 1213079, 1184551, 1159143, 1135171, 1111930, 1089969, 1070265, 1053304, 1038724, 1025671, 1013861, 1004256, 997978, 994323, 990862, 986176, 981631, 979538, 980372, 983000, 987046, 993397, 1002328, 1012564, 1022746, 1032977, 1044543, 1058881, 1076989, 1098999, 1123857, 1150011, 1176714, 1204130, 1232145, 1260068, 1287847, 1316564, 1346959, 1378126, 1408472, 1437391, 1465167, 1491773, 1517002, 1541786, 1568208, 1597584, 1629150, 1661421, 1694669, 1731422, 1774273, 1823537, 1877300, 1933515, 1991583, 2051800, 2113687, 2175133, 2232850, 2283277, 2323413, 2351672, 2368497, 2376017, 2376562, 2370966, 2357912, 2335001, 2301022, 2257488, 2207677, 2153997, 2096832, 2036292, 1974296, 1913902, 1856942, 1803362, 1752815, 1705782, 1662977, 1624728]
62073A624728l3364k8146k3441k0048j7197j3484r273o543o009n928m553k365
62061A454377q42q3R75K484L203K134k30k545l889m174l775l121k609k759m085
62046A435061o498q915j0037r751r216r258r187p862n493l440k308j031J674N575
62032A359314R150J1285J2188J2777J3718J5141J6803J8187J8878J9299K0822
62021A527562K4393K9041L2524L3863L4508L6387L9260M1051M0631L9182L8492
62010A916894L8894L9575M0264M1541M3608M5756M7305M8416M9526N0500N0864
61999B413143N0584M9830M8038M3935L6993K8250J9258J0543J773o984j5161k2839
61987B657363l0919l9767m8551n6415o3347o9183p2805p3579p2926p2878p3325
$$ y = [1624728, 1591364, 1563218, 1539777, 1519729, 1502532, 1489048, 1479775, 1473232, 1467223, 1461295, 1456742, 1454377, 1453535, 1453452, 1454427, 1456911, 1460114, 1462248, 1462018, 1459473, 1455584, 1451410, 1447635, 1444514, 1441905, 1439146, 1435061, 1428563, 1419648, 1409611, 1399860, 1390644, 1381386, 1372199, 1364337, 1358844, 1355404, 1353096, 1352065, 1353739, 1359314, 1368464, 1379749, 1391937, 1404714, 1418432, 1433573, 1450376, 1468563, 1487441, 1506740, 1527562, 1551955, 1580996, 1613520, 1647383, 1681891, 1718278, 1757538, 1798589, 1839220, 1878402, 1916894, 1955788, 1995363, 2035627, 2077168, 2120776, 2166532, 2213837, 2262253, 2311779, 2362279, 2413143, 2463727, 2513557, 2561595, 2605530, 2642523, 2670773, 2690031, 2700574, 2702347, 2695363, 2680202, 2657363, 2626444, 2586677, 2538126, 2481711, 2418364, 2349181, 2276376, 2202797, 2129871, 2056993, 1983668]
61976A983668p2285o8906o4531o0373n5927n0689m5911m3030m1404l9250l6226
61965A405136l3377l0884k7692k3677k0433j9179j9149j8972j8666j9132k0320
61954A153655k1041k0449j8907j7229j5712j4003j1702q983o732n804n936n836
61942A001321m606k805j602j268j089n82o2km36j176k105l107m068n143o636q409
61926I58225r775j0186r798r299r423j0653j2863j4954j5364j3426j0149p395
61914H24940o362o921p971q160o755m281k134j231j208j298j411j783k053j611
61900G71761o59P2O56K001M240O136O706O513O688P345P911Q471R736J1924J4596
61885H64097J7542K0796K3767K5504K6124K6943K8563K9731K9038K7132K6160
$$ y = [1983668, 1911383, 1842477, 1777946, 1717573, 1661646, 1610957, 1565046, 1522016, 1480612, 1441362, 1405136, 1371759, 1340875, 1313183, 1289506, 1269073, 1249894, 1230745, 1211773, 1193107, 1173975, 1153655, 1132614, 1112165, 1093258, 1076029, 1060317, 1046314, 1034612, 1025629, 1018897, 1013093, 1007157, 1001321, 996715, 993910, 992308, 991040, 989951, 989369, 989307, 989305, 988869, 987693, 985588, 982481, 978413, 973270, 966634, 958225, 948450, 938264, 928466, 919167, 909744, 899091, 886228, 871274, 855910, 842484, 832335, 824940, 818578, 811657, 803686, 795526, 788771, 784490, 782356, 781125, 779917, 778619, 777208, 775425, 773372, 771761, 771102, 771174, 771830, 773831, 778071, 784207, 790913, 797426, 804114, 811459, 819370, 827841, 837577, 849501, 864097, 881639, 902435, 926202, 951706, 977830, 1004773, 1033336, 1063067, 1092105, 1119237, 1145397]
61874A145397K7174K9049L0025K9424K7578K4971K2092J9675J8278J7514J6079
61863A407256J2773P618K179j435k385k131l068n770q244q494o981n488m010o28
61849A381192N244J1234J4828J6504J8488K1154K2528K1280J8373J5242J1916
61838A557983P775K984j822o439j0613j3486j4745j5691j7803k0542k1956k1438
61826A424207k0504k0577k1333k1702k1313k0256j8600j6974j6622j7741j8596
61815A209989j7585j5562j4747j5676j6719j6491j5073j2708r135m999k209j523
61803A067562r88J620N630Q500R622J1154J4851J9831K4195K7512L0601L3877
61791A253967L7063M0078M3039M5512M6557M5707M3501M1070L9327L8207L6424
$$ y = [1145397, 1172571, 1201620, 1231645, 1261069, 1288647, 1313618, 1335710, 1355385, 1373663, 1391177, 1407256, 1420029, 1427647, 1429826, 1428391, 1426006, 1423875, 1420807, 1415037, 1406793, 1398299, 1391318, 1385830, 1381820, 1381192, 1386436, 1397670, 1412498, 1429002, 1447490, 1468644, 1491172, 1512452, 1530825, 1546067, 1557983, 1565758, 1568742, 1566920, 1560481, 1549868, 1536382, 1521637, 1505946, 1488143, 1467601, 1445645, 1424207, 1403703, 1383126, 1361793, 1340091, 1318778, 1298522, 1279922, 1262948, 1246326, 1228585, 1209989, 1192404, 1176842, 1162095, 1146419, 1129700, 1113209, 1098136, 1085428, 1076293, 1071294, 1069085, 1067562, 1066574, 1068194, 1073824, 1082324, 1091946, 1103100, 1117951, 1137782, 1161977, 1189489, 1220090, 1253967, 1291030, 1331108, 1374147, 1419659, 1466216, 1511923, 1555424, 1596494, 1635821, 1674028, 1710452]
61780A710452L2465K6249J9248J2611O041o10n689p402o830p243r891j2154j0911
61767A746336o406j431K387N661Q967J1431J2236J2112J2040J1090O982r04j0122
61754A810379j7496k2426k6885l2252l7287m0010m0553m0848m1733m1904m0174
61743A428811l7447l5473l4460l3068l0544k7728k5827k4868k3789k1675j8781
61732A115151j6437j5786j6499j6941j5888j3769j1892j0885j0344r748q983q102
61720I59877p155o280n583m992m605m820n579n845m651k553j096r18j222j201
61706I03377r40o44m9Q35J337J227J467K981N166O527O473N584M350K643N98q94
61690I40038j119n42l58j112k159k685k932l886n553o297m752j992o12j494k817
$$ y = [1710452, 1742917, 1769166, 1788414, 1801025, 1807066, 1806456, 1800767, 1793365, 1786535, 1779292, 1769401, 1757247, 1746336, 1739930, 1738499, 1740886, 1746547, 1755514, 1766945, 1779181, 1791293, 1803333, 1814423, 1821405, 1820501, 1810379, 1792883, 1770457, 1743572, 1711320, 1674033, 1634023, 1593470, 1552622, 1510889, 1468985, 1428811, 1391364, 1355891, 1321431, 1288363, 1257819, 1230091, 1204264, 1179396, 1155607, 1133932, 1115151, 1098714, 1082928, 1066429, 1049488, 1033600, 1019831, 1007939, 997054, 986710, 976962, 967979, 959877, 952722, 946442, 940859, 935867, 931262, 926442, 920863, 915018, 910367, 907814, 906718, 905800, 904578, 903377, 902437, 901793, 901744, 902579, 903916, 905143, 906610, 909591, 914757, 921284, 927757, 933341, 937691, 940334, 940932, 940038, 938919, 938377, 938019, 936907, 934748, 932063, 929131, 925245, 919692, 913395, 908643, 906651, 906039, 904545, 901728]
61675I01728k737j701j143j252j508k264l783m361j942K327M609L335J278J348
61661H93934K550K300R95J306L549M847L446J202N86J287J416N83j38m60j220
61646I16183k609l780m346m939n795n995m820l197k876m364o223o597n175l497
61632H51970l307m699o143o200m766k610n50M70n48l370n853n890l904k167j708
61617H00725j394l13P10Q11Q14J851L230L173J292r03j785j025M13R17n80l110
61601H04826l973j817J237K041N57l61P50K100J734M08Q0J007J978K459K928L508
61585H19462L681L279K662J949R37j56o51j41J176K696L560K924Q24j509k905
61570H37788l535m220m826m412l001k121l047n154o605o384n253m709n211n654
$$ y = [901728, 898991, 897290, 896147, 894895, 893387, 891123, 887340, 882979, 881037, 883364, 887973, 891308, 892586, 893934, 896484, 898784, 899779, 901085, 904634, 909481, 912927, 914129, 914715, 916002, 917418, 918001, 917863, 917403, 916183, 913574, 909794, 905448, 900509, 894714, 888719, 883899, 880702, 877826, 873462, 867239, 860642, 855467, 851970, 848663, 843964, 837821, 831621, 826855, 824245, 823695, 824165, 823617, 820247, 814394, 808504, 804600, 802433, 800725, 799331, 799018, 799728, 800539, 801353, 803204, 806434, 809607, 810899, 809996, 808211, 807186, 807599, 808516, 807936, 804826, 800853, 799036, 800273, 802314, 802871, 802510, 803260, 805360, 807094, 807502, 807582, 808589, 810567, 813026, 815954, 819462, 823143, 826422, 829084, 831033, 831970, 831814, 831163, 831022, 832198, 834894, 838454, 841378, 842202, 840693, 837788, 834253, 830033, 825207, 820795, 817794, 815673, 812626, 807472, 800867, 794483, 789230, 784521, 779310, 773656]
61556G73656m774k962k047l007m624n089m377m035m960o415p285p341p067p018
61542G02655p460q025p762o337n084n666p595q359o629m043l012l863n249o420
61528F17151p507q142p463n683m228l958m276m467m735n261n273m098k600k291
61514E47169l132l399k061k60K44o16j429j349q81o37m54j03J30J96P36J867K257
61497E38278P04j782k847j782l28j02n63k38J056K170K178J098m72j650j621l96
61481E33703R95J643J641J393P07m87j182k98J516K372J513J52l04R7M44L17%
61464E44222j55j15j88q44k131l267l364k557j757j298p17NQ5o99j308r39l66
61447E24607p97j955k360j313K96J088M58j166k647k853j634n7P63Q11P05N40
$$ y = [773656, 768882, 765920, 763873, 760866, 756242, 751153, 746776, 742741, 737781, 731366, 724081, 716740, 709673, 702655, 695195, 687170, 679408, 673071, 667987, 662321, 654726, 646367, 639738, 635695, 632683, 628820, 623571, 617151, 609644, 601502, 594039, 588356, 584128, 580170, 575894, 571427, 566692, 561431, 556158, 552060, 549460, 547169, 544037, 540638, 538577, 538317, 538561, 537945, 536516, 535167, 534286, 533649, 533195, 533092, 533222, 533418, 534154, 536021, 538278, 538982, 537200, 534353, 532571, 532243, 532141, 531578, 531340, 532396, 534566, 536744, 537842, 537370, 535720, 534099, 533703, 534698, 536341, 537982, 539375, 540082, 539595, 538413, 538115, 539631, 542003, 543516, 543668, 543364, 543461, 543905, 544222, 544222, 544067, 543952, 543764, 542920, 540789, 537522, 534158, 531601, 529844, 528546, 527829, 527834, 527919, 527220, 525912, 524973, 524607, 523810, 521855, 519495, 518182, 518478, 519566, 520024, 518858, 516211, 513358, 511724, 511667, 512430, 513241, 513946, 514486]
61431E14486L2n75p04m40k90j2J136K852L638K700R85k46r09j361j133M43K761
61414E23363M217L897K297N05o24o23L95J564J793P06j122k669k973j660M43J625
61398E31134J029j67k27Q01J282M88m35l16N73J474K320L053K922J652O01J268
61382E47452L059L886K900J327N82P39J228J939L031M339N509O250O227N280L899
61367E97647K829K088J184M52J017K907M385M075K823K340K783L082L053L562
61353F34227M592M822L597J988J198R74L67p52j857k797l621l773k570n01R28
61338F36822Q64q0r46j552j973j700l29J203J273k49j506j024K84N09m33q69k8
61321F30266R58J236J803L747O066O837N904M826M368L622J925K32j06R78K388
$$ y = [514486, 514518, 513943, 513239, 512799, 512509, 512497, 513633, 516485, 520123, 522823, 523808, 523562, 522653, 521292, 520159, 520602, 523363, 527580, 531477, 533774, 534279, 533655, 533032, 533427, 534991, 536784, 537490, 536368, 533699, 530726, 529066, 529509, 531134, 532163, 531996, 531769, 532570, 533852, 534340, 533905, 533589, 534162, 535636, 537956, 541009, 543931, 545583, 546184, 547452, 550511, 554397, 557297, 558624, 559206, 559945, 561173, 563112, 566143, 570482, 575991, 582241, 588468, 593748, 597647, 600476, 602564, 603748, 604200, 605217, 608124, 612509, 616584, 619407, 621747, 624530, 627612, 630665, 634227, 638819, 643641, 647238, 649226, 650424, 651398, 651765, 651013, 649156, 646359, 642738, 638965, 636395, 635894, 636822, 637686, 637606, 636660, 635108, 633135, 631435, 631106, 632309, 633582, 633333, 631827, 630803, 631087, 631596, 631163, 630294, 630266, 631224, 632460, 634263, 638010, 644076, 650913, 656817, 661643, 666011, 669633, 671558, 671790, 671684, 672662, 675050]
61306F75050L135L011K475K139K131J997J625J842L177M531M418L404L609N481
61292G18025O967O657N937O673Q339R234R377J0069J1228J1377J0269R496R990
61279H33638J0593R840P965O320N668N741N918N674M780L525K514K068K047K131
61265I08422J901Q62r65k558k828j955j100q07n59N6Q08J635L002M973O824Q083
61249I25794R188J0577J1879J2558J2745J2781J2585J2060J1653J1759J1925J1308
61237A066812R603P062M016R94j132j973k452l935o479q642r319r114r391j0333
61223A025717j0638r247o811n003m638m979m838l737j928JJ366J921K562M500
61209I84248P235Q483P118M972M367M840M295K598J715K472L746N076P385J0299
$$ y = [675050, 678185, 681196, 683671, 685810, 687941, 689938, 691563, 693405, 696582, 701113, 705531, 708935, 712544, 718025, 724992, 731649, 737586, 744259, 752598, 761832, 771209, 781278, 792506, 803883, 814152, 823648, 833638, 844231, 854071, 862036, 868356, 874024, 879765, 885683, 891357, 896137, 899662, 902176, 904244, 906291, 908422, 910323, 911185, 910220, 907662, 904834, 902879, 901779, 900972, 900413, 900469, 901277, 902912, 905914, 910887, 917711, 925794, 934982, 945559, 957438, 969996, 982741, 995522, 1008107, 1020167, 1031820, 1043579, 1055504, 1066812, 1076415, 1083477, 1087493, 1088487, 1087355, 1085382, 1082930, 1078995, 1072516, 1063874, 1054555, 1045441, 1036050, 1025717, 1015079, 1005832, 999021, 994018, 989380, 984401, 979563, 975826, 973898, 973899, 975265, 977186, 979748, 984248, 991483, 999966, 1007084, 1012056, 1016423, 1021263, 1025558, 1028156, 1029871, 1032343, 1036089, 1041165, 1048550, 1058849]
61195A058849J1422R810P818P743Q615Q420P684Q240R697R860Q044N476K753o22
61181A163809m155o243o492o255o412o452o055n819n838n270l908k649j817n94
61167A095850J238K625L145L996N909P468O981N125M289N718Q413J0418J0442
61154A171617Q644O646O316P855R575J0022R605R417R324Q367O467M582L467L176
61140A275080L552M241M555M267M386O117R103J1719J3106J3963J5005J5638J4683
61127A395415J1903Q275N063K929J801J359J566K461L267K409o87m144n218l638
61113A422761k156l164n878p855q285q258q352p935p099p355r371j1595j2553
61100A322905j3282j5672j9007k0438j8917j6548j5336j4659j3204j1705j1751
$$ y = [1058849, 1070271, 1080081, 1087899, 1095642, 1104257, 1112677, 1120361, 1128601, 1138298, 1148158, 1156202, 1161678, 1164431, 1163809, 1159654, 1153411, 1146919, 1140664, 1134252, 1127800, 1121745, 1115926, 1110088, 1104818, 1100910, 1098261, 1096444, 1095850, 1097088, 1099713, 1102858, 1106854, 1112763, 1120231, 1127212, 1132337, 1136626, 1142344, 1150757, 1161175, 1171617, 1180261, 1186907, 1193223, 1201078, 1210653, 1220675, 1230280, 1239697, 1249021, 1257388, 1263855, 1268437, 1271904, 1275080, 1278632, 1282873, 1287428, 1291695, 1296081, 1302198, 1311301, 1323020, 1336126, 1350089, 1365094, 1380732, 1395415, 1407318, 1415593, 1420656, 1423585, 1425386, 1426745, 1428311, 1430772, 1434039, 1436448, 1435761, 1431617, 1426399, 1422761, 1420605, 1417441, 1411563, 1403708, 1395423, 1387165, 1378813, 1370878, 1363779, 1356424, 1347053, 1335458, 1322905, 1309623, 1293951, 1274944, 1254506, 1235589, 1219041, 1203705, 1189046, 1175842, 1164137, 1152386]
61089A152386j2834j2680j0360p295n022l479k096j315k126m618p587r421r237
61076A064316p502n716n104n539n815m893k543P19L823N541N518M868N247P319
61062A060239J0489J3764J6437J8396K0384K3357K6845K8815K8219K6990K7898
61051A301833L0927L3469L3838L2767L1370K9690K7793K6448K5812K4817K2773
61040A621537K0335J8181J5947J3159R979O352J666l834q629j1886j4599j7825
61028A650383k0922k2738k3416k3820k4097k4068k4072k4246k3882k2722k1940
61017A394460k2378k2635k0592j6354j2173r792r196r596j0093r561p273l778
61005A241039k34K934N872Q349J0128J1849J4246J6803J8472J9416K0688K2497
$$ y = [1152386, 1139552, 1126872, 1116512, 1109217, 1104195, 1100716, 1098620, 1097305, 1095179, 1090561, 1082974, 1073553, 1064316, 1056814, 1051098, 1045994, 1040455, 1034640, 1029747, 1027204, 1027923, 1031746, 1037287, 1042805, 1047673, 1052920, 1060239, 1070728, 1084492, 1100929, 1119325, 1139709, 1163066, 1189911, 1218726, 1246945, 1273935, 1301833, 1332760, 1366229, 1400067, 1432834, 1464204, 1493894, 1521687, 1548135, 1573947, 1598764, 1621537, 1641872, 1660053, 1676000, 1689159, 1699138, 1705490, 1707156, 1703322, 1694693, 1682807, 1668208, 1650383, 1629461, 1606723, 1583307, 1559487, 1535390, 1511322, 1487250, 1463004, 1439122, 1416400, 1394460, 1372082, 1349447, 1328855, 1312501, 1300328, 1290536, 1281340, 1271744, 1261651, 1252090, 1244817, 1241039, 1240805, 1243739, 1249611, 1257960, 1268088, 1279937, 1294183, 1310986, 1329458, 1348874, 1369562, 1392059]
60993A392059K4290K6381K9780L4225L8054M0525M2861M6386N0836N5257N9511
60982A840165O3937O8311P2146P5784Q0343Q6417R3334R9961J06155J13037J21531
60971B821121J31002J40010J48237J56676J65717J74295J81528J88284J96586
60962D303456K08264K24536K45467K69222K93308L17540L44406L75824M11640
60953F993663M52558N02149N64144O40100P31612Q41243R67622J103109J241599
60944A4037799J386459J545725J723651J924520K155291K398433K571147K537704
60936C0280729K203690J615054R50860M03898O7877o6675m2837R3996K57215K97219
60926C6061026P3213m33390j087908j694324k119274k338156k393339k336736
$$ y = [1392059, 1416349, 1442730, 1472510, 1506735, 1544789, 1585314, 1628175, 1674561, 1725397, 1780654, 1840165, 1904102, 1972413, 2044559, 2120343, 2200686, 2287103, 2380437, 2480398, 2586553, 2699590, 2821121, 2952123, 3092133, 3240370, 3397046, 3562763, 3737058, 3918586, 4106870, 4303456, 4511720, 4736256, 4981723, 5250945, 5544253, 5861793, 6206199, 6582023, 6993663, 7446221, 7948370, 8512514, 9152614, 9884226, 10725469, 11693091, 12796200, 14037799, 15424258, 16969983, 18693634, 20618154, 22773445, 25171878, 27743025, 30280729, 32484419, 34099473, 35050333, 35454231, 35522108, 35455433, 35412596, 35506592, 35763807, 36061026, 36134239, 35700849, 34612941, 32918617, 30799343, 28461187, 26067848, 23731112]
60918B3731112k208880k042771j863857j685579j512797j349678j200535j065669
60910A0801346r42153q29013p28259o41114n66377n02577m49004m04303l66185
60901E372361l32953l03785k77437k52270k27709k04523j83560j65196j49767
60892C275161j37391j27494j19343j12703j07146j01319r4105q6041p8497p1944
60882B239178o6113o1259n7905n5615n3299n0551m7670m4789m2046m0210l9851
60871A679870m0094l9390l7352l4847l2511l0283k8169k6445k5120k4048k3308
60860A338303k2834k2145k1214k0806k0944k0126j7447j4630j4039j5216j5476
60849A133426j3748j1700j0756j0065q310n928m432m439n246n800n599m903m273
$$ y = [23731112, 21522232, 19479461, 17615604, 15930025, 14417228, 13067550, 11867015, 10801346, 9859193, 9030180, 8301921, 7660807, 7094430, 6591853, 6142849, 5738546, 5372361, 5039408, 4735623, 4458186, 4205916, 3978207, 3773684, 3590124, 3424928, 3275161, 3137770, 3010276, 2890933, 2778230, 2671084, 2569765, 2475660, 2389619, 2311122, 2239178, 2173065, 2111806, 2053901, 1998286, 1944987, 1894436, 1846766, 1801977, 1759931, 1719721, 1679870, 1639776, 1600386, 1563034, 1528187, 1495676, 1465393, 1437224, 1410779, 1385659, 1361611, 1338303, 1315469, 1293324, 1272110, 1251304, 1230360, 1210234, 1192787, 1178157, 1164118, 1148902, 1133426, 1119678, 1107978, 1097222, 1087157, 1078847, 1072919, 1068487, 1064048, 1058802, 1053002, 1047403, 1042500, 1038227]
60836A038227l701k589r87Ol8K48K018L945L873K184J358K270L315L535M106N842
60820A063612P432P577P055P190P716P839Q221J0156J3447J6662J9055K0813K1835
60807A218610K1702K0822K0310K0587K1121K1729K3182K5962K9070L0756L0314
60796A484165K8755K7663K7665K8290K9008K9710L0026K9052K6482K3485K1501
60785A785802K0332J8390J4667R605M149j026n356q643j1692j5731k0806k5635
60773A764056k9217l1719l3547l4629l5047l5404l6037l6629l6862l6674l5687
60762A382604l3546l1111k9951l0086k9549k7075k3959k2158k1685k1214k0341
60751A091929j9671j9129j7829j5618j3550j2515j2252j1837j0605q567o430n092
$$ y = [1038227, 1034526, 1031937, 1030950, 1030956, 1030918, 1031166, 1033184, 1037129, 1041002, 1043186, 1044544, 1046814, 1050129, 1053664, 1057770, 1063612, 1071044, 1078621, 1085676, 1092866, 1100582, 1108421, 1116642, 1126798, 1140245, 1156907, 1175962, 1196775, 1218610, 1240312, 1261134, 1281444, 1302031, 1323152, 1344881, 1368063, 1394025, 1423095, 1453851, 1484165, 1512920, 1540583, 1568248, 1596538, 1625546, 1655256, 1685282, 1714334, 1740816, 1764301, 1785802, 1806134, 1824524, 1839191, 1848796, 1852945, 1851919, 1846563, 1837920, 1826228, 1810497, 1789691, 1764056, 1734839, 1703120, 1669573, 1634944, 1599897, 1564493, 1528456, 1491827, 1454965, 1418291, 1382604, 1349058, 1317947, 1287996, 1257910, 1228361, 1201286, 1177327, 1155169, 1133484, 1112270, 1091929, 1072258, 1053129, 1035300, 1019682, 1006132, 993617, 981365, 969528, 958923, 950356, 943926, 938834]
60739I38834m728m599m123l650l639l593k720j327o48j261k506l547m235m771
60725H93487n046m788m065l367l183l584m300n194o381p616p916o523m203k733
60711H24588k900l778m285m519n027n650n931o080o573p251p504p141o402n410
60697G46137m203l071k322k028k363l582n150n625m267k203j049q87o19J50Q80
60682G09798J423K147K634J708o75k782l075j946q16j50O36J738K401J914N25
60667G15480r92k260l417m425m736l988k740k067k340k931l238l519m261n230
60653F69336n722n605n569o290p618q620q215o060l107j078r92k233l292l275
60639F01660k395j327n32j87l08p83j339j545r70M21K064L254L751L575K512O00
$$ y = [938834, 934106, 929507, 925384, 921734, 918095, 914502, 911782, 910455, 909807, 908546, 906040, 902493, 898258, 893487, 888441, 883653, 879588, 876221, 873038, 869454, 865154, 859960, 853579, 845963, 838047, 831524, 827321, 824588, 821688, 817910, 813625, 809106, 804079, 798429, 792498, 786418, 779845, 772594, 765090, 757949, 751547, 746137, 741934, 738863, 736541, 734513, 732150, 728568, 723418, 717793, 713526, 711323, 710274, 709387, 708768, 708918, 709798, 711221, 713368, 716002, 717710, 717035, 714253, 711178, 709232, 708416, 708266, 708902, 710640, 713041, 714955, 715480, 714488, 712228, 708811, 704386, 699650, 695662, 692922, 690855, 688515, 685584, 682346, 678827, 674566, 669336, 663614, 658009, 652440, 646150, 638532, 629912, 621697, 615637, 612530, 611452, 610460, 608227, 604935, 601660, 599265, 597938, 597406, 597219, 596911, 596128, 594789, 593244, 592274, 592695, 594759, 598013, 601764, 605339, 607851, 608451]
60623F08451r27l98K118M325M152K046J93J62J972M683O949P554O447M948M161
60608F56836L733K931K221K489L295L399K817K847L981N221N666N468M889L766
60594G09559K463K082K982M031M066L315K589J954J128M99O29R84K40k004m563
60579G29954o037o381o699p616q343p714n907m504m543n200n030l973l164l042
60565F51801k845k106j443j399j481j139r35j892l934n696n763l791o52K149L413
60550F24287L050J904P90k4l85Q4J410K840L408K799J447J01m87O1J236J869J412
60533F45802O43O45J317J631J142N31M75P21P82R85K027L651M596M254L681M273
60517F77156N809O724O300N605N907P197Q822J0646J2601J3923J4093J4089J5185
$$ y = [608451, 607524, 607126, 609244, 613569, 617721, 619767, 619960, 620122, 622094, 626777, 633726, 641280, 647727, 652675, 656836, 660569, 663500, 665721, 668210, 671505, 674904, 677721, 680568, 684549, 689770, 695436, 700904, 705793, 709559, 712022, 714104, 717086, 721117, 725183, 728498, 731087, 733041, 734169, 734668, 735297, 736281, 736521, 734517, 729954, 723917, 717536, 710837, 703221, 694878, 687164, 681257, 676753, 672210, 667010, 661980, 658007, 654843, 651801, 648956, 646850, 645407, 644008, 642527, 641388, 640453, 638561, 634627, 628931, 623168, 619377, 618725, 620874, 624287, 627337, 629241, 630031, 630007, 629622, 629706, 631116, 633956, 637364, 640163, 641610, 641711, 641224, 641285, 642521, 644390, 645802, 646445, 647090, 648407, 650038, 651180, 651711, 652186, 652907, 653689, 654674, 656701, 660352, 664948, 669202, 672883, 677156, 682965, 689689, 695989, 701594, 707501, 714698, 723520, 734166, 746767, 760690, 774783, 788872, 804057]
60504H04057J6667J6289J3278R447O789N265L779K071N99o58j997k999k826j287
60490H68474J143M093P299J0046J1623J2344J3405J5557J8466K1404K3983K6000
60478A033837K7110K6871K5007K1586J7123J2433P997L559j254n895q942r477
60466A149955q253p227p853r811j1359j1021q862o162l963k220l19J975M239N814
60452A084933O368O315O769Q707J1989J5550J8759K2118K6351L1239L5899L9933
60440A314930M3773M7970N2527N6904O0400O2619O3714O4019O3255O0487N5062
60429A945660M7190L7138K4399Q535r347k6839m2104n4811o5041p2153p5478p5626
60417A641523p4205p2179o9161o4592n9084n3965m9701m5422m0310l4888l0463
$$ y = [804057, 820724, 837013, 850291, 859738, 866527, 871792, 875571, 877642, 878241, 877583, 875586, 872587, 869761, 868474, 869617, 873710, 881009, 891055, 902678, 915022, 928427, 943984, 962450, 983854, 1007837, 1033837, 1060947, 1087818, 1112825, 1134411, 1151534, 1163967, 1171964, 1175523, 1174269, 1168374, 1159432, 1149955, 1141702, 1134475, 1126622, 1116811, 1105452, 1094431, 1085569, 1079407, 1075444, 1073224, 1072905, 1074880, 1079119, 1084933, 1091301, 1097616, 1104385, 1113092, 1125081, 1140631, 1159390, 1181508, 1207859, 1239098, 1274997, 1314930, 1358703, 1406673, 1459200, 1516104, 1576504, 1639123, 1702837, 1766856, 1830111, 1890598, 1945660, 1992850, 2029988, 2054387, 2062922, 2053575, 2026736, 1984632, 1929821, 1864780, 1792627, 1717149, 1641523, 1567318, 1495139, 1425978, 1361386, 1302302, 1248337, 1198636, 1153214, 1112904, 1078016, 1047553]
60406A047553k7566k5599k3842k2177k0661j9049j7171j5354j4092j3587j3772
60395H34683j4380j4705j3812j1482q680o683o015o406p289p780o859m440j971
60382G24181j065j698k573k994l243l176j928L43J718O49j860l447l314k796l028
60367F95769l428k964j952j629k350k982k223k9K315L353K704J421R59J592K052
60352F92608J170m22r51K25J849K575K613K784K821J770j09j171m75R92J692J451
60336G09422J321K045L358M615N446N694N276M259K937J827J498K199L480M414
60322G57791M470L961L505L305L199L117L097L022K750K516K874M092N727O874
60308H10300O807N566L986K999K852L052L086K902K655K443K456L054M321N694
$$ y = [1047553, 1019987, 994388, 970546, 948369, 927708, 908659, 891488, 876134, 862042, 848455, 834683, 820303, 805598, 791786, 780304, 771624, 764941, 758926, 752520, 745231, 737451, 730592, 726152, 724181, 723116, 721418, 718845, 715851, 712608, 709432, 707504, 707847, 709565, 710214, 708354, 704907, 701593, 698797, 695769, 692341, 689377, 687425, 685796, 683446, 680464, 678241, 678212, 680527, 683880, 686584, 688005, 688964, 690556, 692608, 693778, 693356, 692405, 692630, 694479, 697054, 699667, 702451, 705272, 707042, 706933, 705762, 705287, 706279, 707971, 709422, 710743, 712788, 716146, 720761, 726207, 731901, 737177, 741436, 744373, 746200, 747698, 749897, 753377, 757791, 762261, 766222, 769727, 773032, 776231, 779348, 782445, 785467, 788217, 790733, 793607, 797699, 803426, 810300, 817107, 822673, 826659, 829658, 832510, 835562, 838648, 841550, 844205, 846648, 849104, 852158, 856479, 862173]
60294H62173O375O131N615N963P930J0964J3267J3311J1478R550Q397P040M360
60281I72554R47j691l069l965n064o362p705q945r543q956p595o557o220n889
60267H91940n082m321m224m529m581m285l916l390k362r49K39Q95J400K316L693
60252H62844N049N963O633P809J0152J3601J7390K0670K3072K4668K5468K5062
60240A048381K2958J9190J4356Q815K210n596j3401j9257k2369k3598k3868k3082
60228I84739k1149j9014j7633j6638j5077j2979j1048r338p542o176n978o271
60216H35896n586m025l259l842m281l534k631k736l185k925k575l269m418m496
60202G85134l522k900l011k895k309k292l180l742l034j832j342j480j355o72
$$ y = [862173, 868548, 874679, 880294, 886257, 894187, 905151, 918418, 931729, 943207, 952757, 961154, 968194, 972554, 973501, 971810, 968741, 964776, 959712, 953350, 945645, 936700, 927157, 918201, 910606, 904049, 897829, 891940, 886858, 882537, 878313, 873784, 869203, 864918, 861002, 857612, 855250, 854301, 854540, 855435, 856835, 859151, 862844, 867893, 873856, 880489, 888298, 898450, 912051, 929441, 950111, 973183, 997851, 1023319, 1048381, 1071339, 1090529, 1104885, 1113700, 1115910, 1110314, 1096913, 1077656, 1055287, 1031689, 1007821, 984739, 963590, 944576, 926943, 910305, 895228, 882249, 871201, 861863, 854321, 848145, 842167, 835896, 830310, 826285, 823026, 819184, 814903, 811369, 808738, 806002, 802817, 799892, 797317, 794048, 789630, 785134, 781612, 778712, 775701, 772806, 770497, 768205, 765025, 761283, 758249, 756417, 755075, 753595, 752240, 751568]
60188G51568J52P80J139J240J301J632J950J452J06p36K52K777N310O648O409
60173G81980M618J843m87r99K46J928L042L547L572K979K014J509J933K732L047
60158H13504K660K031J781K479M282O417P578P428P239Q360J0374J1592J1109
60145H96834R649Q334P539P174P332Q093R085R668R480Q587P259N865M758M112
60131A003769L932M241M992N697N554M189K021l00k530m654o376p259p194o468
60117I99614n462m576m233m508m858m701m229m095m277l933k718j647j989l541
60103I44847m656m061k153m09O7p75k110k674j469J285M005N118M703M195M457
60088I50370M843M393L190K018J368J469K720N003O983P281O269N527N468M932
$$ y = [751568, 751720, 752500, 753639, 754879, 756180, 757812, 759762, 761214, 761320, 760584, 760836, 763613, 768923, 775571, 781980, 786598, 788441, 787954, 786955, 787201, 789129, 792171, 795718, 799290, 802269, 804283, 805792, 807725, 810457, 813504, 816164, 818195, 819976, 822455, 826737, 833154, 840732, 848160, 855399, 863759, 874133, 885725, 896834, 906483, 914817, 922356, 929530, 936862, 944955, 954040, 963708, 973188, 981775, 989034, 994899, 999657, 1003769, 1007701, 1011942, 1016934, 1022631, 1028185, 1032374, 1034395, 1034095, 1031565, 1026911, 1020535, 1013276, 1006082, 999614, 994152, 989576, 985343, 980835, 975977, 971276, 967047, 962952, 958675, 954742, 952024, 950377, 948388, 944847, 940191, 936130, 933977, 933568, 933635, 932860, 930750, 928076, 926607, 927892, 931897, 937015, 941718, 945913, 950370, 955213, 959606, 962796, 964814, 966182, 967651, 970371, 975374, 982357, 989638, 995907, 1001434, 1006902, 1011834]
60074A011834L511K746L892N723N916M040J764M75J9k31k84K02J393L088M443
60059A048531M173K057J07Q06L955O649O861N684N132N186M419K766J792K297
60045A100415L108K765J371P3o57j497l121n003n751m668k734j629j727j734n88
60030A078623J037J822J793K072K839K821J180j099k435k656k890l811m725m633
60016A069938l643l019l880o023q140r165r309r582j0459j1391j1598j0930r834
60003I62965q918q715r388j0294j0264q897p302o915p666q015o959n243m200l988
59989H56201l752l121k579k206r97J780N014O569N699L924L112L445L874L994
59975H80957M366M950M490K202o38j739m18J618K216R03j114k617l496m402n687
$$ y = [1011834, 1015345, 1018091, 1021983, 1027706, 1033622, 1037662, 1039426, 1039901, 1039920, 1039689, 1039405, 1039607, 1041000, 1044088, 1048531, 1052704, 1054761, 1054868, 1055674, 1059629, 1066278, 1073139, 1078823, 1083955, 1089141, 1093560, 1096326, 1098118, 1100415, 1103523, 1106288, 1107659, 1107732, 1107075, 1105578, 1102457, 1097454, 1091703, 1087035, 1084301, 1082672, 1080945, 1079211, 1078623, 1079660, 1081482, 1083275, 1085347, 1088186, 1091007, 1092187, 1091088, 1088653, 1085997, 1083107, 1079296, 1074571, 1069938, 1066295, 1063276, 1059396, 1053373, 1045233, 1036068, 1026759, 1017177, 1006718, 995327, 983729, 972799, 962965, 954047, 945332, 935944, 925650, 915386, 906489, 899187, 892272, 884606, 876591, 869632, 864389, 860189, 856201, 852449, 849328, 846749, 844543, 843546, 845326, 850340, 856909, 862608, 866532, 869644, 873089, 876963, 880957, 885323, 890273, 894763, 896965, 896327, 894588, 894170, 895788, 898004, 898907, 897793, 895176, 891680, 887278, 881591]
59960H81591o916p362o852n963n312m983m825n062o057p471q143p192n036l107
59946G97310k568l321m207m206l507l223l884m589m124k541r25K19J294K242K099
59931G66069N48j088j383n69J79O30J552L194M947O343P300P346N824L160R95
59916H05047N78J574K728L046K292J007K08L07L07j026l135m020k945j526j399
59901H03043j965j476N16K798M095M002K872J652J480K505L453L200K372K407
59887H30954L397L963L250K028J608K372L536L859K657N63q02m99O28R94P2j474
59871H57106k947l976m042k803r11M23P55N50J49l72m13Q62L200N232O115O303
59855H65231O471O654O758O918O909O196N044M554N057N453M852L889L544L567
$$ y = [881591, 874675, 867313, 860461, 854498, 849186, 844203, 839378, 834316, 828259, 820788, 812645, 805453, 800417, 797310, 794742, 791421, 787214, 783008, 779501, 776278, 772394, 767805, 763681, 761140, 760215, 760434, 761728, 763970, 766069, 766617, 765529, 764146, 763577, 763756, 764386, 765938, 769132, 774079, 780422, 787722, 795068, 800892, 804052, 805047, 805625, 807199, 809927, 812973, 815265, 816272, 816480, 816787, 817094, 816068, 812933, 808913, 805968, 804442, 803043, 801078, 799602, 800118, 802916, 807011, 811013, 813885, 815537, 817017, 819522, 822975, 826175, 828547, 830954, 834351, 838314, 841564, 843592, 845200, 847572, 851108, 854967, 857624, 858187, 857385, 856886, 857514, 858508, 858580, 857106, 854159, 850183, 846141, 843338, 842427, 842850, 843605, 844155, 844304, 843932, 843519, 844381, 847581, 852813, 858928, 865231, 871702, 878356, 885114, 892032, 898941, 905137, 910181, 914735, 919792, 925245, 930097, 933986, 937530, 941097]
59841I41097L112K257J717J485R47J69n2M98J011P52o3o54l57J105L444N653O631
59824I68752O234N446N200N358N166M541M223M578M716L509J295k76m25l30j369
59809A016618l058l909l778l913m721n191m805m413m492m057k355l18R52K057
59795I74617M103O570Q026Q447R090J0216J0738J0117Q933P425N091K241K28n01
59781A065341j061j961k050r03o33l294p472r855r804r889j1494j2440j0394o664
59767I77427m634n427p129p772p102n461l115j255j758m696p438p558n683m189
59753I04210l953l958l440k606j484P7J250P80q56j632q31p7o79j641j613j249
59737H82298k030l685m632m332l603k968k397k391l531m902m745l171k408l608
$$ y = [941097, 944209, 946466, 948183, 949668, 950615, 950784, 950732, 951230, 952241, 952993, 952930, 952276, 951919, 953024, 956468, 962121, 968752, 974986, 980432, 985632, 990990, 996156, 1000697, 1004920, 1009498, 1014214, 1017723, 1019018, 1018742, 1018317, 1017987, 1016618, 1013560, 1009651, 1005873, 1001960, 997239, 992048, 987243, 982830, 978338, 974281, 971926, 971608, 972560, 974617, 978720, 985290, 993316, 1001763, 1010853, 1021069, 1031807, 1041924, 1050857, 1058282, 1063373, 1065614, 1065842, 1065341, 1064280, 1062319, 1060269, 1059366, 1058733, 1055439, 1047967, 1038112, 1028308, 1018419, 1006925, 994485, 984091, 977427, 972793, 967366, 960237, 952465, 945363, 939902, 936787, 935532, 933774, 929078, 921640, 914082, 908399, 904210, 900257, 896299, 892859, 890253, 888769, 888846, 890096, 890876, 890020, 888388, 887557, 887480, 886801, 885160, 883547, 882298, 880268, 876583, 871951, 867619, 864016, 861048, 858651, 856260, 852729, 847827, 843082, 839911, 837503, 833895]
59723H33895m942m152j784l37q33j914k296k398k888k917j250J382K499R17j581
59708H11401k429j369k31q6j71K93P32N88P19K209M440N703N412M537M099M249
59692H40096M805N518N810N275M578M906O298P487P650P310P179P090O691O315
59678I27008O344O378N827M834L915L051K007J207J359K215K546J673L66p6P46
59663I69400K136L174L383K791J830J185J257J647J524O76j93m91o01j121j639
59648I84958j111N21K026K450K245K408L163M027M592M684M242L637L671M627
59634A026140N811O510O845P008O399M537K287J014P26J57j354l087m011l685
59620A055297k245m34M05n95k703m405n153n418n331m737m406n513p590q609p656
$$ y = [833895, 828953, 824801, 823017, 822680, 821847, 819933, 817637, 815239, 812351, 809434, 808184, 809566, 812065, 812982, 811401, 808972, 807603, 807372, 807286, 807115, 807408, 808140, 808728, 809447, 811656, 816096, 821799, 827211, 831748, 835847, 840096, 844901, 850419, 856229, 861504, 866082, 870988, 877286, 884773, 892423, 899733, 906912, 914002, 920693, 927008, 933352, 939730, 945557, 950391, 954306, 957357, 959364, 960571, 961930, 964145, 966691, 968364, 968730, 968654, 969400, 971536, 974710, 978093, 980884, 982714, 983899, 985156, 986803, 988327, 989003, 988810, 988319, 987718, 986597, 984958, 983847, 984368, 986394, 988844, 991089, 993497, 996660, 1000687, 1005279, 1009963, 1014205, 1017842, 1021513, 1026140, 1031951, 1038461, 1045306, 1052314, 1058713, 1063250, 1065537, 1066551, 1067277, 1067434, 1066080, 1062993, 1058982, 1055297, 1053052, 1052618, 1053023, 1052428, 1049725, 1045320, 1040167, 1034749, 1029418, 1024681, 1020275, 1014762, 1007172, 998563, 990907]
59605I90907o031n103m576l744k960k722k490j693q33m46P6J301K357K163J406
59590I67612J709L273M651M604L003L37k379l621k802j483j712l325m394m219
59576I61254m114m969n873n790n053m327l496k590k535l752m994m886l933l618
59562I01324m009l786k628k036l330n789p399o920m817k630j855k900m644n247
59548H43334l866j507J55O32Q15J353J604O09j361k988l471l203k723j831k65
59533H27287J333J891J199J6r31j397j180j78Q21M04j733l966m379k953j362q30
59517H14042j127j596k142k739k863k223j601k015l089l211j569O86J822J512
59503G93887P26O3q04j908k245r54J290K910L348L531M247M850M240K662J670
$$ y = [990907, 984876, 979773, 975197, 971453, 968493, 965771, 963281, 961588, 960755, 960309, 960385, 961686, 964043, 966206, 967612, 969321, 972594, 977245, 981849, 984852, 985189, 982810, 979189, 976387, 974904, 973192, 969867, 965473, 961254, 957140, 952171, 946298, 940508, 935455, 931128, 927632, 925042, 922507, 918755, 913761, 908875, 904942, 901324, 897315, 893529, 890901, 888865, 885535, 879746, 872347, 865427, 860610, 857980, 856125, 853225, 848581, 843334, 839468, 837961, 838116, 838748, 839563, 840916, 842520, 843129, 841768, 838780, 835309, 832106, 829383, 827552, 827287, 828620, 830511, 831710, 831726, 830795, 829398, 828218, 828040, 828861, 829265, 827532, 823566, 819187, 816234, 814872, 814042, 812915, 811319, 809177, 806438, 803575, 801352, 799751, 797736, 794647, 791436, 789867, 790553, 792375, 793887, 794613, 794676, 793872, 791964, 789719, 788765, 790055, 792965, 796313, 799844, 804091, 808941, 813181, 815843, 817513]
59488H17513K207L505M343M786N905Q019J0182J1517J2155J2479J2478J2630J4529
59475I32248J8876K3113K2822J6325O793j080n458p492q281p591n478l229j936
59462I79632j278m99K88O04O80R85J062q3k436m656n556n284m878n149o137p159
59446I40136p253o162n047n615q141j0877j1884j0912q951o544l602o41R81N22
59432H56010j115k249j998p81K78K53p79j608r12J235L368M327M492M964O136
59417H71621P536Q702R554J0098J0287J0027Q977O763L861J806J681K574K435
59404I55922N26j764k674j916m46R73K412M202O160P607Q068P935Q120R009J0104
59389A014238J0911J1601J2386J2826J2414J1387J0107Q160N122J801n67k226
$$ y = [817513, 819720, 823225, 827568, 832354, 838259, 846278, 856460, 867977, 880132, 892611, 905089, 917719, 932248, 951124, 974237, 997059, 1013384, 1020177, 1019097, 1013639, 1006147, 997866, 990275, 984797, 981568, 979632, 978354, 977855, 978143, 978747, 979427, 980412, 981474, 981391, 978955, 974299, 968743, 963459, 958581, 953432, 947295, 940136, 932883, 926721, 921674, 916059, 907918, 897041, 885157, 874245, 865294, 858750, 855148, 854507, 855488, 856010, 854895, 852646, 850648, 849867, 850145, 850398, 849619, 848011, 847099, 848334, 851702, 856029, 860521, 865485, 871621, 879157, 887859, 897413, 907511, 917798, 927825, 936802, 943565, 947426, 949232, 950913, 953487, 955922, 956448, 954684, 952010, 950094, 949648, 950621, 953033, 957235, 963395, 971002, 979070, 987005, 995125, 1004134, 1014238, 1025149, 1036750, 1049136, 1061962, 1074376, 1085763, 1095870, 1104030, 1109152, 1110953, 1110386, 1108160]
59377A108160m524p484r353r088p877p363p574p705p777q221q509p605n379k493
59363A007208P85M531Q150J0647J1953J3016J4496J6234J8006J9888K1818K3772
59351A170504K6436L0345L3805L2921K5025J1807j759j1442j6142j6929j5183
59340A269388j1947p935l327J819O093O270j65j1655k2889k9300l0725l0073k9380
59327A106174k8423k6619k4444k2416k0026j6671j2877r769p690o137m748l617
59315I22737k659j359O10K746M032L952L194L057L958M899M925M652N421P192
59301I67357Q568R050R695J0920J1269R696P955Q723J1815J4125J3720J2367J3115
59288A108375J6432J9858K1051K0196J9212J9300J9924K0082J9899K0281K1279
$$ y = [1108160, 1103636, 1096152, 1086799, 1077711, 1069834, 1062471, 1054897, 1047192, 1039415, 1031194, 1022685, 1015080, 1009701, 1007208, 1007993, 1012524, 1020674, 1031321, 1043274, 1056290, 1070786, 1087020, 1105026, 1124914, 1146732, 1170504, 1196940, 1227285, 1261090, 1294011, 1319036, 1330843, 1329084, 1317642, 1301500, 1284571, 1269388, 1257441, 1249506, 1246179, 1247998, 1254091, 1260361, 1260196, 1248541, 1225652, 1196352, 1165627, 1135554, 1106174, 1077751, 1051132, 1026688, 1004272, 984246, 967575, 954698, 944929, 937239, 931102, 926354, 922737, 920078, 918719, 919329, 922075, 926107, 930059, 933253, 936310, 940268, 945167, 950092, 954744, 960165, 967357, 975925, 984975, 994670, 1005590, 1016859, 1026555, 1034510, 1043233, 1055048, 1069173, 1082893, 1095260, 1108375, 1124807, 1144665, 1165716, 1185912, 1205124, 1224424, 1244348, 1264430, 1284329, 1304610, 1325889]
59277A325889K1636K0275J7519J4398J1292P865M033L67k433m096m998o014p789
59264A397944r945j1481j2217j3086j4631j6009j6272j5805j5479j5018j3479
59253A244522j1078r207q500q170p446o524n613m082j416J615L726M961P008J1186
59239A210982J6234J8496J4907O024m043j1063j3917j4527j5131j6121j6278j4496
59227A161067j1170p978o243n490m146j620R64K346K571K422K249K069K095K398
59213A141534K639K909L965N898P384P465P163P966R358R430P631N305L645K531
59199A224823J343l82l026o263q630r169r235j0907j3799j5441j4935j4001j3918
59186A106460j3703j2283j0400r144q281p346o749o491n320k773o30n85j614j479
$$ y = [1325889, 1347525, 1367800, 1385319, 1399717, 1411009, 1418874, 1422907, 1423274, 1420841, 1416745, 1411747, 1405733, 1397944, 1387999, 1376518, 1364301, 1351215, 1336584, 1320575, 1304303, 1288498, 1273019, 1258001, 1244522, 1233444, 1224237, 1215737, 1207567, 1200121, 1193597, 1187984, 1183902, 1182486, 1184101, 1187827, 1192788, 1199796, 1210982, 1227216, 1245712, 1260619, 1266643, 1262600, 1251537, 1237620, 1223093, 1207962, 1191841, 1175563, 1161067, 1149897, 1141919, 1135676, 1130186, 1126040, 1124420, 1125384, 1127730, 1130301, 1132723, 1134972, 1137041, 1139136, 1141534, 1144173, 1147082, 1151047, 1156945, 1164329, 1171794, 1178957, 1186923, 1196281, 1205711, 1213342, 1218647, 1222292, 1224823, 1226166, 1225784, 1222758, 1216495, 1207865, 1198696, 1189461, 1178554, 1164755, 1149314, 1134379, 1120378, 1106460, 1092757, 1080474, 1070074, 1060930, 1052649, 1045303, 1038554, 1032063, 1026743, 1023970, 1023340, 1022755, 1021141, 1019662]
59172A019662N8J331J387O18o44k244l280k877j888k065l546m850n372o096p367
59157I82827p869o672m865m069m328m506l979k920j514R1J385J990K382L313M521
59142I55787M911M160L246K973K650J193q64j546M6K418L602L589L746M432M639
59127I94982M064L984N450P777R628J0590J0868J0314Q887P387O671O582O550
59114A093734O637O964O741N209L077J679J078N12M96K411N720P617O426L836
59100A152137K534K959L693L978M069L745K280k8j861k693l397m615n715n957
59086A151129n690n586n476m917m328m472n087n269n157n898p451p808n476j913
59072A076601p4p82j991j717l39O44Q97J167J742K285K920M200N781O370N565
$$ y = [1019662, 1019720, 1021051, 1022438, 1023056, 1022412, 1020168, 1016888, 1014011, 1012123, 1010058, 1006512, 1001662, 996290, 990194, 982827, 974958, 968286, 963421, 959352, 955024, 950518, 946539, 943619, 942105, 942196, 943581, 945571, 947953, 951266, 955787, 960698, 964858, 968104, 971077, 973727, 974920, 974056, 972510, 972556, 974974, 978576, 982165, 985911, 990343, 994982, 999046, 1003030, 1008480, 1016257, 1025885, 1036475, 1047343, 1057657, 1066544, 1073931, 1080602, 1087184, 1093734, 1100371, 1107335, 1114076, 1119285, 1122362, 1124041, 1125119, 1125631, 1126127, 1128538, 1134258, 1141875, 1148301, 1152137, 1154671, 1157630, 1161323, 1165301, 1169370, 1173115, 1175395, 1175367, 1173506, 1170813, 1167416, 1162801, 1157086, 1151129, 1145439, 1139853, 1134377, 1129460, 1125132, 1120660, 1115573, 1110304, 1105147, 1099249, 1091798, 1083990, 1078514, 1076601, 1076527, 1075745, 1073754, 1072037, 1071698, 1072342, 1073239, 1074406, 1076148, 1078433, 1081353, 1085553, 1091334, 1097704, 1103269]
59057A103269M810N685P747R040Q587P427O966P231P306O917O695O968P181O665
59043A202494N484M106K687J171k44j152j424j250q74o01r10k084l723m977n312
59028A193391m839m018l382l398m091m884n199n257n799p082q595r745j0322j0397
59014A106383j0385j1069j2754j4372j4350j2600j0695r655q684o883n097m818
59002I85021n902o775o725o561o861o866n751m029k839k480k417k334k350k316
58988I20815j709l63J213K402K940K742J786L92q82j909l013l962l614j361J555
58973I17032L133K928K308K382K872L234L708M659N813O866Q032R270R884R752
58959I91873J0048J1639J3483J3863J2654J1173J0177R357Q445P510O318M670
$$ y = [1103269, 1108079, 1113764, 1121511, 1130551, 1139138, 1146565, 1153531, 1160762, 1168068, 1174985, 1181680, 1188648, 1195829, 1202494, 1207978, 1212084, 1214771, 1215942, 1215698, 1214546, 1213122, 1211872, 1210998, 1210397, 1209487, 1207403, 1203680, 1198703, 1193391, 1188552, 1184534, 1181152, 1177754, 1173663, 1168779, 1163580, 1158323, 1152524, 1145442, 1136847, 1127102, 1116780, 1106383, 1095998, 1084929, 1072175, 1057803, 1043453, 1030853, 1020158, 1010503, 1001819, 994936, 989839, 985021, 979119, 972344, 965619, 959058, 952197, 945331, 939580, 935551, 932712, 930232, 927815, 925481, 923131, 920815, 919106, 918743, 919956, 922358, 925298, 928040, 929826, 930218, 929336, 927427, 924414, 920452, 916838, 915477, 917032, 920165, 923093, 925401, 927783, 930655, 933889, 937597, 942256, 948069, 954935, 962967, 972237, 982121, 991873, 1001921, 1013560, 1027043, 1040906, 1053560, 1064733, 1074910, 1084267, 1092712, 1100222, 1106540, 1111210]
58947A111210L234K811K955K654K013J922K234J998J363J456K310K769K639K974
58933A144542L856M016L281L120L830L519J321o01k05J153Q38j022k033j204J51
58918A164562Q06Q68P36O04J018K575M924P187R082J0687J1593J1580J1632J2806
58904A250660J4475J5116J4559J4022J3995J3564J1907R199N958K638j94k360
58892A363539m620p669j0823j2867j3843j4676j5418j5514j5524j6632j8271j8254
58880A199428j5943j3491j2930j3468j2838j0293p152n038m532n078n479m828
58868A088358l435k481k494k820k788k656k862l125k892k186j401o51J33P50R30
58853A060380Q11Q63J351K162L035L900N011O666Q758J0696J1963J2554J2781
$$ y = [1111210, 1114444, 1117255, 1120210, 1122864, 1124877, 1126799, 1129033, 1131031, 1132394, 1133850, 1136160, 1138929, 1141568, 1144542, 1148398, 1152414, 1155695, 1158815, 1162645, 1166164, 1167485, 1166884, 1166679, 1167832, 1168670, 1167648, 1165615, 1164411, 1164562, 1165368, 1166236, 1166972, 1167576, 1168594, 1171169, 1176093, 1183280, 1192362, 1203049, 1214642, 1226222, 1237854, 1250660, 1265135, 1280251, 1294810, 1308832, 1322827, 1336391, 1348298, 1357497, 1363455, 1366093, 1365899, 1363539, 1358919, 1351250, 1340427, 1327560, 1313717, 1299041, 1283623, 1268109, 1252585, 1235953, 1217682, 1199428, 1183485, 1169994, 1157064, 1143596, 1130758, 1120465, 1113313, 1108275, 1103743, 1098665, 1093186, 1088358, 1084923, 1082442, 1079948, 1077128, 1074340, 1071684, 1068822, 1065697, 1062805, 1060619, 1059218, 1058567, 1058700, 1059450, 1060380, 1061191, 1062054, 1063405, 1065567, 1068602, 1072502, 1077513, 1084179, 1092937, 1103633, 1115596, 1128150, 1140931]
58840A140931J2959J3410J4349J5486J6226J6551J7043J7753J7925J7341J6949
58829A316923J7395J8103J8777K0484K3645K6191K5850K3503K1911K1476J9895
58818A554153J6111J1941R002O536L480M85j698m028p623j1744j4989j7369j9398
58805A524859k0214j8627j5629j3776j4073j5125j5546j5642j6188j6871j6859
58794A346309j6146j5517j5475j5853j6338j6791j7092j6999j6374j5401j4406
58783A169917j3520j2637j1657j0606r620r056r458j0881j2243j2117j0399q492
58771A039231p370o384m687k926k324k714k877k574k721l525l849k765o75J484
58757I95324L194M224M490M464M830N456N474M664L846L516L005J564l87j732
$$ y = [1140931, 1153890, 1167300, 1181649, 1197135, 1213361, 1229912, 1246955, 1264708, 1282633, 1299974, 1316923, 1334318, 1352421, 1371198, 1391682, 1415327, 1441518, 1467368, 1490871, 1512782, 1534258, 1554153, 1570264, 1582205, 1591207, 1597743, 1601223, 1601708, 1600010, 1595982, 1588359, 1576615, 1561626, 1544257, 1524859, 1504645, 1486018, 1470389, 1456613, 1442540, 1427415, 1411869, 1396227, 1380039, 1363168, 1346309, 1330163, 1314646, 1299171, 1283318, 1266980, 1250189, 1233097, 1216098, 1199724, 1184323, 1169917, 1156397, 1143760, 1132103, 1121497, 1111877, 1102821, 1093363, 1082482, 1070239, 1058122, 1047723, 1039231, 1031861, 1025477, 1020790, 1017864, 1015540, 1012826, 1009949, 1007375, 1004654, 1001129, 997280, 994515, 993840, 995324, 998518, 1002742, 1007232, 1011696, 1016526, 1021982, 1027456, 1032120, 1035966, 1039482, 1042487, 1044051, 1043664, 1041932]
58743A041932j881j172m10l61j298k820m338n569o305o111n064m392n322p352
58729I89537q688q321o841n263m116l510l002j471J590M661N467L837J868J157
58715I66905J371J719K052J996P39j375k673k586k752m470o436o408m192j620
58701I42270k38l01j439l150m788n897o395o083m650k514p41L75J668L421M536
58686I16074M226L481L693M741N501N583N392N160N013N528P042Q804R735R780
58672I99753R612R412Q796P754O814O407O599P185P645P419O653O246O684P346
58658A104325P322O418N068L919L785N121P180Q491Q534Q041P368N875L416J062
58644A185925n88k465n411q629j0956j2658j4660j6813j8215j8609j8480j8321
$$ y = [1041932, 1040051, 1038879, 1038469, 1038108, 1036810, 1033990, 1029652, 1024083, 1017778, 1011667, 1006603, 1002211, 996889, 989537, 980849, 972528, 965687, 960424, 956308, 952798, 949796, 948325, 949915, 954576, 960043, 963880, 965748, 966905, 968276, 969995, 972047, 974043, 974782, 973407, 970734, 968148, 965396, 960926, 954490, 948082, 943890, 942270, 942032, 941731, 940292, 937142, 932354, 926457, 920062, 913979, 909329, 906815, 906074, 906449, 908117, 911538, 916074, 920300, 923781, 927474, 932215, 937716, 943299, 948691, 953851, 958864, 964392, 971434, 980238, 989973, 999753, 1009365, 1018777, 1027573, 1035327, 1042141, 1048548, 1055147, 1062332, 1069977, 1077396, 1084049, 1090295, 1096979, 1104325, 1111647, 1118065, 1123133, 1127052, 1130837, 1135958, 1143138, 1151629, 1160163, 1168204, 1175572, 1181447, 1184863, 1185925, 1185337, 1182872, 1177461, 1168832, 1157876, 1145218, 1130558, 1113745, 1095530, 1076921, 1058441, 1040120]
58632A040120j8668j9978k1523k1378j8658j4926j2253j0790r509q278p612p165
58620H69382o158m965m654n256n823n915n767n209l850k127r18k02P13J860K679
58605H23790L287M369N760O443O093N554N353M768K866J7k239k727j894j290j771
58590H58379k540k520k105k466l432l606k627j696j500j441j403k229l600l670
58576H23544k040q58j294j363N84K447J441j159j803j28R31J50m09P00K112K356
58560H25211K225L082M643N661N526M404K884K086K982N131P006P816Q069Q328
58546H95054Q529Q488P946O195K935m60j882q67J007K124K156J600J107J228J856
58531I37016K135J729J592K417L326L536M241O803R949J1101J0086R175R602J0549
$$ y = [1040120, 1021452, 1001474, 979951, 958573, 939915, 924989, 912736, 901946, 892437, 884159, 876547, 869382, 863224, 858259, 853605, 848349, 842526, 836611, 830844, 825635, 821785, 819658, 818740, 818538, 819251, 821111, 823790, 827077, 831446, 837206, 843649, 849742, 855296, 860649, 865417, 868283, 868300, 866061, 863334, 861440, 860150, 858379, 855839, 853319, 851214, 848748, 845316, 841710, 839083, 837387, 835887, 834446, 833043, 830814, 827214, 823544, 821504, 820646, 819352, 817989, 818573, 821020, 822461, 821302, 819499, 819371, 820302, 820452, 820043, 820743, 822855, 825211, 827436, 830518, 835161, 840822, 846348, 850752, 853636, 855722, 858704, 863835, 870841, 878657, 886726, 895054, 903583, 912071, 920017, 926212, 929147, 928687, 926805, 925938, 926945, 929069, 931225, 932825, 933932, 935160, 937016, 939151, 940880, 942472, 944889, 948215, 951751, 955992, 962795, 972744, 983845, 993931, 1003106, 1012708, 1023257]
58517A023257J1443J2663J3689J3230J1797J1644J3275J4445J3659J2415J2654
58506A164171J4111J5644J7283J9310K0824K1132K1407K3223K6041K7685K6964
58495A397795K4687K2295K0304J8088J4761J0352O091L040O87k180n495p948q989
58482A493488r428r963j0502j1202j2708j4890j6803j8307k0332k2908k4464k3976
58470A298005k2503k1546k1039k0021j8375j6740j5276j3613j1739j0014q401
58459A118738o335l521o66P96J8k123l637l497k543k051k235k840m006n527o162
58444A074409n158l554k617j945p05K78k38j446j584q76r67j716j344L03J329
58429A054169J047R94K047L068L342M059O101Q257Q917Q246P750Q680J1251J4265
$$ y = [1023257, 1034700, 1047363, 1061052, 1074282, 1086079, 1097723, 1110998, 1125443, 1139102, 1151517, 1164171, 1178282, 1193926, 1211209, 1230519, 1251343, 1272475, 1293882, 1317105, 1343146, 1370831, 1397795, 1422482, 1444777, 1465081, 1483169, 1497930, 1508282, 1514373, 1517413, 1518100, 1515920, 1510425, 1502477, 1493488, 1484060, 1474097, 1463595, 1452393, 1439685, 1424795, 1407992, 1389685, 1369353, 1346445, 1321981, 1298005, 1275502, 1253956, 1232917, 1212896, 1194521, 1177781, 1162505, 1148892, 1137153, 1127139, 1118738, 1112403, 1108882, 1108216, 1109012, 1109030, 1106907, 1103270, 1099773, 1097230, 1095179, 1092944, 1090104, 1086098, 1080571, 1074409, 1069251, 1065697, 1063080, 1061135, 1060430, 1060708, 1060470, 1059024, 1057440, 1056564, 1055597, 1053881, 1052537, 1052840, 1054169, 1055216, 1056210, 1058257, 1061325, 1064667, 1068726, 1074827, 1083084, 1092001, 1100247, 1107997, 1116677, 1127928, 1142193]
58415A142193J5581J4385J2740J3123J4793J4856J2605J0009P870M719K39l323
58403A259790m409m169l985l593k881k921l631k920Q2L172M245M217M997O459
58389A254453P420P820Q001P313N277K869J028q28l385n878p411q422r484r973
58375A248800r248p767n819k780J095L785L960K933K695L473M533N909P733R213
58361A268515R767J0033J0459J0192Q619O618N183M046K774J776J175K43j153
58348A338247k238l273n624q791r805p236l619k071k446k739k302j607n78P67
58334A286685J463J217J442K915M121L666K643K686L382L597L695M414M953M458
58320A331337M014N089P016P886P025N154L284K605L996O397P453O890P124R268
$$ y = [1142193, 1157774, 1172159, 1184899, 1198022, 1212815, 1227671, 1240276, 1250285, 1258155, 1262874, 1263113, 1259790, 1255381, 1251212, 1247227, 1243634, 1240753, 1237832, 1234201, 1231281, 1231363, 1234535, 1238780, 1242997, 1247994, 1254453, 1261873, 1269693, 1277694, 1285007, 1290284, 1293153, 1294181, 1293353, 1289968, 1284090, 1276679, 1268257, 1258773, 1248800, 1239552, 1231785, 1225966, 1223186, 1224281, 1228066, 1232026, 1234959, 1237654, 1241127, 1245660, 1251569, 1259302, 1268515, 1278282, 1288315, 1298774, 1308966, 1317585, 1324203, 1329386, 1333432, 1336206, 1337982, 1339157, 1339400, 1338247, 1336009, 1332736, 1327112, 1318321, 1308516, 1301280, 1297661, 1295590, 1293144, 1290405, 1288103, 1286496, 1285918, 1286685, 1288148, 1289365, 1290807, 1293722, 1297843, 1301509, 1304152, 1306838, 1310220, 1313817, 1317512, 1321926, 1326879, 1331337, 1335351, 1340440, 1347456, 1355342, 1362367, 1367521, 1370805, 1373410, 1377406, 1383803, 1391256, 1398146, 1405270, 1414538]
58306A414538J1116J0840J0069J1000J2904J4025J4727J6139J7616J8129J8448
58295A569551J9484K0178J9412J8068J7044J5310J2447J0679J1553J2936J2384
58284A739046J1385J2721J5516J6678J5945J5819J7228J8574J8693J8068J7429
58273A917102J7308J8233J9769K0601K0888K2535K5479K6552K4254K1688K1922
58262B156331K3305K2680K0493J9097J8529J7785J7947K0108K2318K2525K2378
58251B383496K4116K5924K4792K2026K1388K3364K5672K7877L1036L4256L6039
58240B679986L7596M0568M3064M2542M0849M1574M3976M4628M3712M4361M6749
58229C149605M8189M8468N0041N3329N6558N9703O3916O7776O8920O8656P0278
$$ y = [1414538, 1425654, 1436494, 1446563, 1457563, 1470467, 1484492, 1499219, 1515358, 1532974, 1551103, 1569551, 1589035, 1609213, 1628625, 1646693, 1663737, 1679047, 1691494, 1702173, 1713726, 1726662, 1739046, 1750431, 1763152, 1778668, 1795346, 1811291, 1827110, 1844338, 1862912, 1881605, 1899673, 1917102, 1934410, 1952643, 1972412, 1993013, 2013901, 2036436, 2061915, 2088467, 2112721, 2134409, 2156331, 2179636, 2202316, 2222809, 2241906, 2260435, 2278220, 2296167, 2316275, 2338593, 2361118, 2383496, 2407612, 2433536, 2458328, 2480354, 2501742, 2525106, 2550778, 2578655, 2609691, 2643947, 2679986, 2717582, 2758150, 2801214, 2843756, 2884605, 2926179, 2970155, 3014783, 3058495, 3102856, 3149605, 3197794, 3246262, 3296303, 3349632, 3406190, 3465893, 3529809, 3597585, 3666505, 3735161, 3805439]
58218C805439P3568P5786P7202Q0527Q5566Q9541R2325R6401J02165J07846J13425
58207D799791J20005J26411J31070J35880J43300J51368J56967J62043J70684
58198F097519J81881J91735K01036K13633K28543K40960K50315K60248K71337
58189H137207K81196K91189L05580L24151L42770L61056L82387M06789M31211
58180A1263536M56419M86269N20601N56098N93263O34879O78764P20291P60794
58171A6670914Q05092Q52311Q98352R45597R99962J059851J118862J178311J245922
58162B5775174J323402J407193J500403J611193J739708J879502K031064K200183
58154C9467822K383530K570715K760768K962224L178542L410230L669950L976352
$$ y = [3805439, 3879007, 3954793, 4031995, 4112522, 4198088, 4287629, 4379954, 4476355, 4578520, 4686366, 4799791, 4919796, 5046207, 5177277, 5313157, 5456457, 5607825, 5764792, 5926835, 6097519, 6279400, 6471135, 6672171, 6885804, 7114347, 7355307, 7605622, 7865870, 8137207, 8418403, 8709592, 9015172, 9339323, 9682093, 10043149, 10425536, 10832325, 11263536, 11719955, 12206224, 12726825, 13282923, 13876186, 14511065, 15189829, 15910120, 16670914, 17476006, 18328317, 19226669, 20172266, 21172228, 22232079, 23350941, 24529252, 25775174, 27098576, 28505769, 30006172, 31617365, 33357073, 35236575, 37267639, 39467822, 41851352, 44422067, 47182835, 50145059, 53323601, 56733831, 60403781, 64380133]
58146F4380133M332799M731741N179966N698822O301565O996487P813213Q797769
58138A14232495R978262J1360615J2951294J4741280J6664766J8625812K0588811
58131B19143335K2611887K4791319K7208781K9857449L2392438L3812989L2569831
58124D22388029K7370892J8161021O382664n734008j6206487k3908011k8598607
58117C99855493l0670072l0830393k9797408k8096898k6049717k3867739k1703966
58110B08839300j9638402j7690110j5868361j4191608j2664700j1276119j0024994
58103A07485006q924664p975237p154957o441152n819099n269317m768416m307832
58095E6824332l894969l532467l211180k924533k673334k453576k254369k071175
$$ y = [64380133, 68712932, 73444673, 78624639, 84323461, 90625026, 97621513, 105434726, 114232495, 124210757, 135571372, 148522666, 163263946, 179928712, 198554524, 219143335, 241755222, 266546541, 293755322, 323612771, 356005209, 389818198, 422388029, 449758921, 467919942, 474302606, 468568598, 452362111, 428454100, 399855493, 369185421, 338355028, 308557620, 280460722, 254411005, 230543266, 208839300, 189200898, 171510788, 155642427, 141450819, 128786119, 117510000, 107485006, 98560342, 90585105, 83430148, 76988996, 71169897, 65900580, 61132164, 56824332, 52929363, 49396896, 46185716, 43261183, 40587849, 38134273, 35879904, 33808729]
58087C3808729j908152j764986j633825j511296j401386j304307j214200j129965
58079B1940612j057027r95864r39520q84905q36179p94407p53761p10912o69065
58070A4298972o30057n91277n53012n20258m94339m70549m46577m25493m08149
58061I759261l90469l71059l53984l40919l27606l11127k94158k79132k64340
58052F826467k48898k35567k25642k16362k06168j97374j91073j84522j76158
58043D944703j68477j63290j58634j52774j47030j42421j37501j31620j26426
58034C616530j22324j17300j10865j05316j01510r7139r0778q3953p7972p2326
58024B637047o7329o4470o3031o0277n6123n3544n3188n1905m8023m4000m2112
$$ y = [33808729, 31900577, 30135591, 28501766, 26990470, 25589084, 24284777, 23070577, 21940612, 20883585, 19887721, 18948201, 18063296, 17227117, 16432710, 15678949, 14968037, 14298972, 13668915, 13077638, 12524626, 12004368, 11510029, 11039480, 10592903, 10167410, 9759261, 9368792, 8997733, 8643749, 8302830, 7975224, 7664097, 7369939, 7090807, 6826467, 6577569, 6342002, 6116360, 5899998, 5693830, 5496456, 5305383, 5120861, 4944703, 4776226, 4612936, 4454302, 4301528, 4154498, 4012077, 3874576, 3742956, 3616530, 3494206, 3376906, 3266041, 3160725, 3059215, 2962076, 2871298, 2787345, 2709373, 2637047, 2569718, 2505248, 2442217, 2381940, 2325817, 2272273, 2219085, 2167180, 2119157, 2075157, 2033045]
58013B033045m1392m0521l9955l9441l7155l3087k9922k8858k7848k5547k3565
58002A665754k3217k3314k2822k2576k2814k2112k0258j9153j9521j9800j9385
57991A430782j9706k0804k0508j8448j7270j8104j8434j6549j4690j5287j7102
57980A233880j7647j6871j6038j5269j4509j4847j6669j8213j7778j5850j3809
57969A056380j2289j1777j2706j3930j3409j1436j0730j2253j3531j2402r781
57958I22136p434n632m521n075p028q200p575o765p016p246o499n762n705n280
57944H32398m277m543o643p959o358l359j450n85J59j44k463n068n547m303l453
57929G76405l358k732j459q72j666l297n051o286o362n562n299o269p401p598
$$ y = [2033045, 1991653, 1951132, 1911177, 1871736, 1834581, 1801494, 1771572, 1742714, 1714866, 1689319, 1665754, 1642537, 1619223, 1596401, 1573825, 1551011, 1528899, 1508641, 1489488, 1469967, 1450167, 1430782, 1411076, 1390272, 1369764, 1351316, 1334046, 1315942, 1297508, 1280959, 1266269, 1250982, 1233880, 1216233, 1199362, 1183324, 1168055, 1153546, 1138699, 1122030, 1103817, 1086039, 1070189, 1056380, 1044091, 1032314, 1019608, 1005678, 992269, 980833, 970103, 957850, 944319, 931917, 922136, 914702, 909070, 904549, 899474, 892446, 884246, 876671, 869906, 862890, 855644, 849145, 843383, 837678, 832398, 828121, 823578, 816935, 808976, 802618, 799259, 797809, 797224, 797383, 797239, 794776, 789708, 784161, 779858, 776405, 773047, 770315, 768856, 767984, 766318, 763021, 757970, 751684, 745322, 739760, 734461, 728192, 720791, 713193]
57915G13193p284p210p092o600o268o214n469l813k679k814k692r31J233J738
57901F57098P22q1L0M78R41J471J682J280R17J342K290L093L629L917L640K913
57885F85362K451K306J591K86j09J341L519M975N810O794P831Q424Q625Q544P920
57870G55670O989O496O186M599J338j881l376l375l061l231m504p161r980j0997
57856G33712j0196r560r772r280p591o664p382p368m674j271l06j759l492m899
57842F49498o573p620o386l455j276r79j539j902k012j948j557r04j2J313K618
57827F17266K835K041J745K381K270O15n68M30J820Q47j971l940m355m659n224
57812F11533m963l951l605m179m476m191m262m792m741l932l467l826m282m389
$$ y = [713193, 705909, 698699, 691607, 685007, 678739, 672525, 667056, 663243, 660564, 657750, 655058, 654127, 655360, 657098, 657820, 657739, 657769, 658247, 659188, 660659, 662341, 663621, 664538, 665880, 668170, 671263, 674892, 678809, 682449, 685362, 687813, 690119, 691710, 691996, 691887, 693228, 696747, 701722, 707532, 714326, 722157, 730581, 739206, 747750, 755670, 762659, 769155, 775341, 779940, 781278, 779397, 776021, 772646, 769585, 766354, 761850, 754689, 744709, 733712, 723516, 713956, 704184, 694904, 687313, 680649, 673267, 665899, 661225, 659954, 659648, 657889, 654397, 649498, 642925, 635305, 628919, 625464, 624188, 623209, 621670, 619768, 617756, 615808, 614251, 613347, 613335, 614648, 617266, 620101, 622142, 623887, 626268, 628538, 629153, 628585, 629015, 630835, 631682, 629711, 625771, 621416, 616757, 611533, 606570, 602619, 599014, 594835, 590359, 586168, 581906, 577114, 572373, 568441, 564974, 561148, 556866, 552477]
57798E52477m402m108k795o72J158K208K864L239L043K433J724O44q42j538n02
57783E54931J105J410O38N28J336J609Q84L29M71L61n01j317j620j990k549k471
57767E53154j614j047j182q58Q10K927M013L763K892K092J834K373L342L861L456
57752E79816K286M69j986m483o041o432o371o392o367o192o052n813n094m178
57738E17170l950m600n136m504k700o24O71O98N4m2O53Q54l83j861j700j24R27
57721D95403Q65J204K798M207L874K480J862K513L491M172M794N389N406M493
57707E42951L026J565L76m00n53k14l2m88j167j276q19n70o92l72N75Q36n29k197
57689E40020k244j245j590l660m959l770j601p84j451k292k794k985k363q83m
$$ y = [552477, 548075, 543967, 541172, 540500, 541658, 543866, 546730, 549969, 553012, 555445, 557169, 557813, 556971, 555433, 554931, 556036, 557446, 558084, 558612, 559948, 561557, 562441, 562770, 563241, 563602, 563101, 561784, 560164, 558174, 555625, 553154, 551540, 550493, 549311, 548453, 549263, 552190, 556203, 559966, 562858, 564950, 566784, 569157, 572499, 576360, 579816, 582102, 582571, 580585, 576102, 570061, 563629, 557258, 550866, 544499, 538307, 532255, 526442, 521348, 517170, 513220, 508620, 503484, 498980, 496280, 495656, 496327, 497025, 497079, 497037, 497690, 498544, 498161, 496300, 494600, 494476, 495403, 496268, 497472, 500270, 504477, 508351, 510831, 512693, 515206, 518697, 522869, 527663, 533052, 538458, 542951, 545977, 547542, 547918, 547518, 546965, 546751, 546719, 546231, 545064, 543788, 542969, 542399, 541707, 541335, 541910, 542746, 542217, 540020, 537776, 536531, 534941, 531281, 526322, 522552, 520951, 520167, 518716, 516424, 513630, 510645, 508282, 507399, 507395]
57674E07395r57k605k802j340J05M59L4p88j978l024l107k235j144j76P55J394
57658D89986J331O83j57j011j496j006P0K04j170k655l175l811n602p042o110
57643D59039l674k249k070j190P45J767R81J01O66J810J865O98m80o06M57J909
57627D59769K561K098J474J401J303Q85J457L894O583P703Q543J1662J6482J9888
57613E45703K1126K2674K5952K9567L2625L6359M0934M3605M1900L6161K7322
57602I03928J4804j053j6645k7867l4051l7144l8314l7561l5642l3898l2317k9592
57590E94648k5185k0121j5780j2835j1164j0082q904p701p160p399p644p246o201
57577D47226m544k385p31p51j807j765N4J835J933R39O7q03j957k323r25R85J144
$$ y = [507395, 506438, 503833, 501031, 499691, 499796, 500255, 500289, 499501, 497523, 494499, 491392, 489157, 488013, 487837, 488592, 489986, 491317, 492000, 491843, 490832, 489336, 488330, 488400, 488604, 487434, 484779, 481604, 477793, 472191, 465149, 459039, 455365, 453116, 451046, 449856, 450601, 452368, 453349, 453450, 454116, 455926, 457791, 458489, 458009, 457403, 457860, 459769, 462330, 464428, 465902, 467303, 468606, 469491, 470948, 474842, 481425, 489128, 497671, 509333, 525815, 545703, 566829, 589503, 615455, 645022, 677647, 714006, 754940, 798545, 840445, 876606, 903928, 918732, 917679, 901034, 873167, 839116, 801972, 763658, 726097, 690455, 656557, 624240, 594648, 569463, 549342, 533562, 520727, 509563, 499481, 490577, 482876, 475716, 468317, 460673, 453427, 447226, 442682, 440297, 439566, 438815, 437008, 435243, 435297, 437132, 439065, 440004, 440071, 439268, 437311, 434988, 434063, 435048, 436192]
57560D36192q05k971l597k709j611j526k506l274k610j201j075k840m613m501
57546D00353k906j425n73J45O95L88r43k591l517k988j220K80n0j881l217k971
57530C77579k159k102k764l545m291m662l927k377j556j975j970k27J790J501
57516C49315j441m865o556n900l758j680p25m62J80Q39K4k081l105j925n01p36
57500C16623j501q49N39O83k18k24J130K557L449M275M771M021K293R03J97m65
57484C38184r45m29P36J232Q87R34J835K530K151J212P59J389L029M742M999L277
57468C66522R94k50o32r90q37N45J958J599Q2m06L66P18O33K104N201O757M559
57451C88923M86k084k153q69P21J937J941P65j00L83J202R00j22l49N80J635J867
$$ y = [436192, 435387, 432416, 428819, 426110, 424499, 422973, 420467, 417193, 414583, 413382, 412307, 409467, 404854, 400353, 397447, 396022, 395449, 395594, 396289, 396677, 395734, 393143, 389626, 386638, 385418, 385698, 385648, 383767, 380550, 377579, 375420, 373318, 370554, 367009, 362718, 358056, 354129, 351752, 350196, 348221, 346251, 346024, 347814, 349315, 347874, 343009, 336453, 330553, 326795, 325115, 324390, 323928, 324108, 324947, 324971, 322890, 319785, 317860, 317359, 316623, 315122, 314273, 314812, 315495, 315277, 315053, 316183, 318740, 322189, 326464, 331235, 335256, 337549, 338452, 338649, 338184, 337239, 336810, 337546, 338778, 339665, 340599, 342434, 344964, 347115, 348327, 349086, 350475, 353504, 358246, 363245, 366522, 367516, 367266, 366634, 365644, 364807, 365352, 367310, 368909, 368991, 368585, 368951, 369669, 370302, 372406, 377607, 384364, 388923, 389409, 387325, 385172, 384303, 385024, 386961, 388902, 389667, 389567, 389950, 391152, 392052, 391930, 391581, 392161, 393796, 395663]
57434C95663R65r39k898l221j267J340K445J915J243J141R70M25J84O08R93O92
57418D00259L9m07q78j945l447m550m757m372l856l158k011o20L30M54O0l34m74
57401C70333k24N77J647K224K055K023L080M863O105O244N690M852L904L483M387
57386D21243O207P366P032O098N745N815N345M086K713J873J706K098K846L675
57372D83848M386M899N026M600L957L753M015L910K990K116K390L453L765K675
57358E35783J465J792L600N172N179M063L257L519M495N483O017N851N098M459
57344E95233M645N357N518M753L923L843M276M616M833N128N429N818O634P419
57330F67425O834M766L440M905Q061R975R737R068R205R333Q652P996Q305R001
$$ y = [395663, 396628, 395689, 392791, 389570, 388303, 389643, 392088, 394003, 395246, 396387, 397357, 397782, 397966, 398574, 399567, 400259, 400298, 399891, 399013, 397068, 393621, 389071, 384314, 379942, 376086, 372928, 370917, 370297, 370627, 371081, 371141, 370807, 370333, 370109, 370686, 372333, 374557, 376612, 378635, 381715, 386578, 392683, 398927, 404617, 409469, 413373, 416856, 421243, 427450, 434816, 441848, 447946, 453691, 459506, 464851, 468937, 471650, 473523, 475229, 477327, 480173, 483848, 488234, 493133, 498159, 502759, 506716, 510469, 514484, 518394, 521384, 523500, 525890, 529343, 533108, 535783, 537248, 539040, 542640, 547812, 552991, 557054, 560311, 563830, 568325, 573808, 579825, 585676, 590774, 595233, 599878, 605235, 610753, 615506, 619429, 623272, 627548, 632164, 636997, 642125, 647554, 653372, 660006, 667425, 674259, 679025, 682465, 687370, 695431, 705406, 715143, 724211, 733416, 742749, 751401, 759397, 767702, 776703]
57316G76703R068Q668Q445Q165P344O591O962Q112Q380O850M494K988L059M320
57302H70149O144Q077R570R976R213Q166P885Q474R219R729J0248J0762J0763
57289I88375J0278J0179J0697J0677R362Q050Q509J0350J1516J1203J0710J1299
57277A111205J2774J4372J5755J6534J6088J4429J2521J1319J1091J1690J2676
57266A260454J3182J2673J1818J1607J1790J1495J1184J2173J4033J4432J2415
57255A397256J0065R779J1335J2829J3333J3300J3234J3275J3561J4021J4174
57244A536162J3835J3482J3548J4070J5251J7201J8808J8404J6388J5512J7349
57233A710010K0062K1210K1237K2130K3720K3877K2089K0564K1383K4130K6849
$$ y = [776703, 785771, 794439, 802884, 811049, 818393, 824984, 831946, 840058, 848438, 855288, 859782, 862770, 865829, 870149, 876293, 884370, 893940, 903916, 913129, 921295, 929180, 937654, 946873, 956602, 966850, 977612, 988375, 998653, 1008832, 1019529, 1030206, 1039568, 1047618, 1056127, 1066477, 1077993, 1089196, 1099906, 1111205, 1123979, 1138351, 1154106, 1170640, 1186728, 1201157, 1213678, 1224997, 1236088, 1247778, 1260454, 1273636, 1286309, 1298127, 1309734, 1321524, 1333019, 1344203, 1356376, 1370409, 1384841, 1397256, 1407321, 1417100, 1428435, 1441264, 1454597, 1467897, 1481131, 1494406, 1507967, 1521988, 1536162, 1549997, 1563479, 1577027, 1591097, 1606348, 1623549, 1642357, 1660761, 1677149, 1692661, 1710010, 1730072, 1751282, 1772519, 1794649, 1818369, 1842246, 1864335, 1884899, 1906282, 1930412, 1957261]
57222A957261K8038K7396K5604K3835K2796K2207K1717K1862K3306K5552K7539
57211B227113K9095L0581L1456L0761K9023K8133K8971L0489L1577L2494L3773
57200B563466L4777L4371L2544L0524K9355K8807K7670K5174K2177K0544K0959
57189B870368K1866K1370J9735J8831J9323J9958J9947K0578K3479K8240L2840
57178C116535L6060L8525M1496M5375M9545N3225N6142N8371N9799O0152N9735
57167C674960N9579O0315O1169O0779N8825N6173N3480N0594M7448M4720M3103
57156D271145M2461M2042M1054L8841L5084L0284K5762K2769K1632K1676K1700
57145D614450K0625J8285J5638J3790J2847J2330J2451J3844J5886J6670J5421
$$ y = [1957261, 1985299, 2012695, 2038299, 2062134, 2084930, 2107137, 2128854, 2150716, 2174022, 2199574, 2227113, 2256208, 2286789, 2318245, 2349006, 2378029, 2406162, 2435133, 2465622, 2497199, 2529693, 2563466, 2598243, 2632614, 2665158, 2695682, 2725037, 2753844, 2781514, 2806688, 2828865, 2849409, 2870368, 2892234, 2913604, 2933339, 2952170, 2971493, 2991451, 3011398, 3031976, 3055455, 3083695, 3116535, 3152595, 3191120, 3232616, 3277991, 3327536, 3380761, 3436903, 3495274, 3555073, 3615225, 3674960, 3734539, 3794854, 3856023, 3916802, 3975627, 4031800, 4085280, 4135874, 4183322, 4228042, 4271145, 4313606, 4355648, 4396702, 4435543, 4470627, 4500911, 4526673, 4549442, 4571074, 4592750, 4614450, 4635075, 4653360, 4668998, 4682788, 4695635, 4707965, 4720416, 4734260, 4750146, 4766816, 4782237]
57134D782237J3828J3775J4450J3270R427N098K750K553L127L754M710N865O367
57121D881211N875N167M971M897M205L170K839L518M372M638M488M305L734J929
57107D939319j587o632j2452j7755k1311k3066k4153k5225k5486k4362k3447k5208
57095D708635k9748l4325l6537l6616l6078l5453l4513l3714l3937l5263l7394
57084D325057m1094m7681n6778o5836p2722p8063q4236r2590j02415j12409j22160
57073C449073j32099j42653j54026j66514j80824j98143k19902k47158k79884
57064A727870l17071l57901m02732A97585c10153n67427o30982o99142p73721
57055b981425q56431r48372j050468j163901j290226j431604j590894j770861
$$ y = [4782237, 4796065, 4809840, 4824290, 4837560, 4846987, 4852085, 4854835, 4857388, 4860515, 4864269, 4868979, 4874844, 4881211, 4887086, 4892253, 4897224, 4902121, 4906326, 4909496, 4912335, 4915853, 4920225, 4924863, 4929351, 4933656, 4937390, 4939319, 4937732, 4931100, 4918648, 4900893, 4879582, 4856516, 4832363, 4807138, 4781652, 4757290, 4733843, 4708635, 4678887, 4644562, 4608025, 4571409, 4535331, 4499878, 4465365, 4431651, 4397714, 4362451, 4325057, 4283963, 4236282, 4179504, 4113668, 4040946, 3962883, 3878647, 3786057, 3683642, 3571233, 3449073, 3316974, 3174321, 3020295, 2853781, 2672957, 2474814, 2254912, 2007754, 1727870, 1410799, 1052898, 650166, 197585, -310153, -877580, -1508562, -2207704, -2981425, -3837856, -4786228, -5836696, -7000597, -8290823, -9722427, -11313321, -13084182]
57047a3084182j973161k198982k451369k736690l063446l440286l875956m380677
57039c7204749m966374n645428o429865p330853q356378r507515j0776400j2145745
57031a02363307j3585503j5046839j6462601j7760678j8880345j9771239k0365371
57024b24235883k0536997k0083552j8761232j6383907j2945058q681041m012899
57017c25640569O07791M842272Q505437J1512880J3819434J5411439J6336565
57010b54604751J6716468J6716737J6494269J6156533J5751111J5281683J4733164
57003a42754786J4089455J3340417J2486072J1542256J0541414R523603Q524704
56996f2706865P571497O683157N872257N144153M498441L932110L440583L016934
$$ y = [-13084182, -15057343, -17256325, -19707694, -22444384, -25507830, -28948116, -32824072, -37204749, -42171123, -47816551, -54246416, -61577269, -69933647, -79441162, -90217562, -102363307, -115948810, -130995649, -147458250, -165218928, -184099273, -203870512, -224235883, -244772880, -264856432, -283617664, -300001571, -312946629, -321627670, -325640569, -325032778, -320190506, -311685069, -300172189, -286352755, -270941316, -254604751, -237888283, -221171546, -204677277, -188520744, -172769633, -157487950, -142754786, -128665331, -115324914, -102838842, -91296586, -80755172, -71231569, -62706865, -55135368, -48452211, -42579954, -37435801, -32937360, -29005250, -25564667, -22547733]
56988b2547733K652787K340266K071844J839200J634843J454959J298640J164078
56980h091116J047389R45074Q55334P76414P05763O41748N84603N34696M91119
56971a508976M52612M18464b50210A08466L30805L05316K83592K64868K46411
56962A539458K25587K01535J75537J50076J26811J05229Q3788O2289M2209K4848
56952B737367J0397j186r802j6061k1142k5506k9021l2571l7899m5294n3152o0488
56940B415642o8096p6304q3532q8573r2679r7590j02911j07425j11735j17247
56930A469550j23088j26472j26165j23563j20222j16151j10856j04345r6652q7859
56920C34177p9150p2355o7674E1905d973m9640m3068l7740l3070k8709k4757k1029
$$ y = [-22547733, -19894946, -17554680, -15482836, -13643636, -12008793, -10553834, -9255194, -8091116, -7043727, -6098653, -5243319, -4466905, -3761142, -3119394, -2534791, -2000095, -1508976, -1056364, -637900, -250210, 108466, 439271, 744587, 1028179, 1293047, 1539458, 1765045, 1966580, 2142117, 2292193, 2419004, 2524233, 2608021, 2670310, 2712519, 2737367, 2747764, 2746578, 2736776, 2720715, 2699573, 2674067, 2645046, 2612475, 2574576, 2529282, 2476130, 2415642, 2347546, 2271242, 2187710, 2099137, 2006458, 1908868, 1805957, 1698532, 1586797, 1469550, 1346462, 1219990, 1093825, 970262, 850040, 733889, 623033, 518688, 422036, 334177, 255027, 182672, 114998, 51905, -4973, -54613, -97681, -135421, -168491, -197200, -221957, -242986]
56908b42986j7187j3442j0319p721m915j496K167N470Q060R787J0709J1214J1759
56895b38900J2309J2318J1326R253O186K372j373l850m532m165l795l463k404
56882b08718m34J559K620K741K748L532N586Q782J2374J5628J8469K1033K2587
56869i1493K1722J7977J2497O696J052m163q018r859j0380j0631j0491r428q115
56856a02634p763q005p179m979l161k997l432k622l03K190L482L116J680N74R44
56841a31089K445L661L974M044M236L974L254L382N203P804J0104J2510J5565
56828e0933J8081a4393B834J6351J6218J5336J2931J0108P781N202J601j837k950
56815H3575j191J634L339L552L792N484Q292J0799J2732J5432J9655K3877K6060
$$ y = [-242986, -260173, -273615, -283934, -291655, -296570, -298066, -295899, -290429, -282369, -272582, -261873, -250659, -238900, -226591, -214273, -202947, -193694, -187508, -185136, -186509, -190359, -194891, -199056, -202851, -206314, -208718, -209152, -207593, -204973, -202232, -199484, -195952, -190366, -181584, -169210, -153582, -135113, -114080, -91493, -69771, -51794, -39297, -32601, -31549, -35712, -43730, -53589, -63969, -74600, -85091, -94519, -102634, -110397, -118402, -125581, -130560, -133721, -136718, -140150, -142772, -143075, -140885, -137403, -134287, -132607, -132033, -131089, -128644, -124983, -121009, -116965, -112729, -108755, -105501, -102119, -96916, -89112, -79008, -66498, -50933, -32852, -14393, 2834, 19185, 35403, 50739, 63670, 73778, 81559, 86761, 88362, 86525, 83575, 82384, 84018, 87357, 90909, 94701, 100185, 108477, 119276, 132008, 147440, 167095, 190972, 217032]
56802B17032K6495K7399K9751L1926L1719K8499K2957J5875Q030M80n850j0523
56790D23790j3156j3220j0846p221l666n62K447N722R510J3940J8526K2123K4081
56777D71468K5246K7116L0176L3512L5835L6274L4221K9113K0774R792k368j3649
56765G37510k2166k7176k9154k8836k6607k3127j9713j7048j3948q766k060L541
56753E22450O507Q282J1173J5525J9967K3491K5879K6554K4572J9757J2748M019
56741G20924n939j5504k2553k6609k9069l0824l1057k9099k6011k3145k0283j6558
56729D44273j2281q452n187k134K01J220K005M446Q543J2026J2839J0635N899
56716D74033o49p464j2675j5971j8674k1394k3018k2734k1567k0858k0339j8948
$$ y = [217032, 243527, 270926, 300677, 332603, 364322, 392821, 415778, 431653, 439683, 440163, 434313, 423790, 410634, 397414, 386568, 379347, 375681, 375119, 377566, 383288, 392798, 406738, 425264, 447387, 471468, 496714, 523830, 554006, 587518, 623353, 659627, 693848, 722961, 743735, 753527, 751159, 737510, 715344, 688168, 659014, 630178, 603571, 580444, 560731, 543683, 529735, 520969, 518909, 522450, 528957, 537239, 548412, 563937, 583904, 607395, 633274, 659828, 684400, 704157, 716905, 720924, 714985, 699481, 676928, 650319, 621250, 590426, 559369, 530270, 504259, 481114, 460831, 444273, 431992, 423540, 418353, 416219, 416420, 417640, 419645, 424091, 432634, 444660, 457499, 468134, 474033, 473384, 465920, 453245, 437274, 418600, 397206, 374188, 351454, 329887, 309029, 288690, 269742]
56704B69742j6679j4548j3270j2763j2398j1215q659n715m255m673n321n031m776
56691A50439n602o487n965m804m920o200o552n081l210k332j998j098M38J828
56677I8456K436K062R53j94p03n75l09j12J33L86N77R33J455J408K70j071j088
56660A05017M94K476L646L672K858K028K285L689M497L170Q07j14O60Q97m09j365
56644A34308k63J573J771M49j95Q23K154K254J155k8l03P46K760M435M266K021
56628A57926p72k232j960j189j106j386q12Q84K437K617J684P40K35j30m47n07
56612A55982m84o62o07L64J828K531K153J765K111K580K385J756J311J031N42
56597A74586k26j169k149k571j628M16K053K350K168K701L496L135J426k56q67
$$ y = [269742, 253063, 238515, 225245, 212482, 200084, 188869, 180210, 174495, 170240, 165567, 160246, 155215, 150439, 144837, 138350, 132385, 127581, 122661, 116461, 109909, 104828, 101618, 99286, 97288, 96190, 96628, 98456, 100892, 102954, 103907, 103713, 103010, 102435, 102126, 102014, 102147, 102533, 103110, 104043, 105498, 106906, 107176, 106105, 105017, 105511, 107987, 111633, 115305, 118163, 120191, 122476, 126165, 130662, 133832, 134639, 134525, 135185, 136082, 135673, 134308, 134045, 135618, 137389, 137838, 137643, 138466, 140620, 142874, 144029, 144001, 143698, 144444, 147204, 151639, 155905, 157926, 157154, 154922, 152962, 151773, 150667, 149281, 148469, 149353, 151790, 154407, 156091, 156831, 157066, 156936, 156489, 155982, 155498, 154836, 154229, 154593, 156421, 158952, 161105, 162870, 164981, 167561, 169946, 171702, 173013, 174044, 174586, 174360, 173191, 171042, 168471, 166843, 167259, 169312, 171662, 173830, 176531, 180027, 183162, 184588, 184332, 183465]
56582A83465q18r65j270r39M79K465M045M695M630M167L121J376k50o14J48N30
56566B04265l24j367j144K11J317J415Q42K9r26j661j621r49n42p92r64l35N67
56549A98021N74m66j312q67M44J294J219J072J594K260K106J248P03Q61J015O22
56533B10388J74L34Q61J044Q55R83J809K888L552L621L346K932K392J805J416
56518B38400J269J054O80P59J889L463M080L394K647K780L068K484J553J608K821
56503B71949M304N693P206Q519R069R268R793R976Q750P107P242Q830Q650N161
56489C81517J138J23J928L643L692K819J908R63k9r05j878k981l369k499j529
56474C84541k016l586m466m134l718l777l525k711k596m193o625q099p750n979
$$ y = [183465, 182647, 181682, 180412, 179473, 179952, 182417, 186462, 191157, 195787, 199954, 203075, 204451, 204201, 203587, 203735, 204265, 203941, 202574, 201430, 201641, 202958, 204373, 205215, 205244, 204318, 202657, 201036, 200087, 199545, 198753, 197789, 197454, 198021, 198595, 198129, 196817, 195950, 196394, 197688, 198907, 199979, 201573, 203833, 205939, 207187, 207890, 208751, 209766, 210388, 210562, 210896, 211757, 212801, 213656, 214639, 216448, 219336, 222888, 226509, 229855, 232787, 235179, 236984, 238400, 239669, 240723, 241403, 242162, 244051, 247514, 251594, 254988, 257635, 260415, 263483, 265967, 267520, 269128, 271949, 276253, 281946, 289152, 297671, 306740, 316008, 325801, 335777, 344527, 351634, 358876, 367706, 376356, 381517, 382655, 382778, 384706, 388349, 392041, 394860, 396768, 397731, 397702, 396797, 394919, 391938, 388569, 386070, 384541, 382525, 378939, 374473, 370339, 366621, 362844, 359319, 356608, 354012, 349819, 343194, 335095, 327345, 321366]
56460C21366l714k020j790k933m128m091l008k367l232m912n443l557j55K363
56446B82379K430P00r54j399q74j71J37r9n90p88n07k34m51r07r94o37k73p6K74
56427B76966J013J858K238J751O03m07m95M15J792L207M336M455L026R79K27J234
56411C03198K230J697M95L13J044J361J222J940L688M763L875J897O60Q42J699
56396C30924K264K225J770J034j83j903l233k795m40K014K500Q73j181j980j053
56381C30836R09K425K125K56j152p07L42j72k027k762j226P31Q35p27j913j434
56365C26339J16J244R52n85k146k374r34J196K548K335J020q9n1P41J220J336
56349C32868K166L919M932L741J288k37j96K47K51J17M5l58j042j218m86O65J643
$$ y = [321366, 317652, 315632, 313842, 310909, 306781, 302690, 299682, 297315, 294083, 289171, 283728, 280171, 280016, 282379, 284809, 285509, 284555, 283156, 282282, 282111, 282248, 282149, 281559, 280771, 280264, 280030, 279579, 278672, 277678, 277041, 276768, 276692, 276966, 277979, 279837, 282075, 283826, 284429, 284022, 283527, 283942, 285734, 288941, 293277, 297732, 300758, 301737, 301964, 303198, 305428, 307125, 307620, 307933, 308977, 310338, 311560, 313500, 317188, 321951, 325826, 327723, 328383, 329225, 330924, 333188, 335413, 337183, 338217, 338034, 336131, 332898, 330103, 329663, 331677, 334177, 335050, 333869, 331889, 330836, 331745, 334170, 336295, 336551, 335399, 334692, 335034, 334862, 332835, 330073, 328847, 329578, 330413, 329686, 327773, 326339, 326455, 327699, 328651, 328066, 325920, 323546, 322612, 323808, 326356, 328691, 329711, 329622, 329571, 330312, 331532, 332868, 335034, 338953, 343885, 347626, 348914, 348677, 348481, 348728, 348979, 349096, 349141, 348783, 347741, 346523, 346037, 346702, 348345]
56332C48345K150J841O51m65k50J142K233K137J417Q53M97J79l5k59p26j093o49
56315C57968N95J852K596K840K455J428O58J193K507K972K258J788K401L124K884
56300C89519K022J259N05l24m67O01K001K429J763R19O28J050K037L177L867L758
56284D14744K879J378j99o32Q63L157M112L171J888J585J934K252K599K876K379
56269D44986J302J236K885M565M340K704J714K278L742N386O728O756M658J429
56255D94709o15l74R38J595J457J761L245N167O207O038N507N311N156M585L899
56240E44586L475K891J867J459K800M983O011N770O112P732R126R254R056R234
56226F24356Q752P119O292Q182J1566J3609J3673J3503J4140J4746J4631J4680
$$ y = [348345, 350495, 352336, 352987, 352522, 352272, 353414, 355647, 357784, 359201, 360054, 360551, 360730, 360695, 360436, 359710, 358617, 357968, 358563, 360415, 363011, 365851, 368306, 369734, 370392, 371585, 374092, 377064, 379322, 381110, 383511, 386635, 389519, 391541, 392800, 393305, 392981, 392514, 393115, 395116, 397545, 399308, 400227, 400855, 401905, 403942, 407119, 410986, 414744, 417623, 419001, 418802, 418170, 419033, 422190, 426302, 429473, 431361, 432946, 434880, 437132, 439731, 442607, 444986, 446288, 447524, 450409, 454974, 459314, 462018, 463732, 466010, 469752, 475138, 481866, 488622, 493280, 494709, 494094, 493720, 494658, 496253, 497710, 499471, 502716, 507883, 514090, 520128, 525635, 530946, 536102, 540687, 544586, 548061, 550952, 552819, 554278, 557078, 562061, 568072, 573842, 579954, 587686, 596812, 606066, 615122, 624356, 633108, 640227, 646519, 654701, 666267, 679876, 693549, 707052, 721192, 735938, 750569, 765249]
56214G65249J6146J9024K2042K3829K4076K3780K4185K5376K6537K7666K9897
56203A027807L3618L7367L9589M0545M1636M3639M6604N0644N5742O1298O6798
56192A545287P2443P8450Q4571R0910R8313J06984J15553J22469J27511J31201
56182B573692J33757J35495J37068J38034J36326J30422J21103J09741R5953P8585
56172C790176N8144L6531J4904o489k6937m5413o1851p6806r0080j01059j10033
56161C381087j17677j23472j26123j25555j23157j19985j16016j11176j06009
56152B311917j00981r5983r0701q4987p8959p3165o8229o3986n9563n4785n0614
56141A489964m7539m4606m0971l7458l5363l4487l3413l1137k7546k3180j9366
$$ y = [765249, 781395, 800419, 822461, 846290, 870366, 894146, 918331, 943707, 970244, 997910, 1027807, 1061425, 1098792, 1138381, 1178926, 1220562, 1264201, 1310805, 1361449, 1417191, 1478489, 1545287, 1617730, 1696180, 1780751, 1871661, 1969974, 2076958, 2192511, 2314980, 2442491, 2573692, 2707449, 2842944, 2980012, 3118046, 3254372, 3384794, 3505897, 3615638, 3711591, 3790176, 3848320, 3884851, 3899755, 3893266, 3866329, 3820916, 3759065, 3682259, 3592179, 3491120, 3381087, 3263410, 3139938, 3013815, 2888260, 2765103, 2645118, 2529102, 2417926, 2311917, 2210936, 2114953, 2024252, 1939265, 1860306, 1787141, 1718912, 1654926, 1595363, 1540578, 1489964, 1442425, 1397819, 1356848, 1319390, 1284027, 1249540, 1216127, 1184990, 1157444, 1134264, 1114898]
56130A114898j7505j7187j6165j3328j0329r040q828q059o812o093n497m010k305
56117I89740j913k520k246m11J929L902N470O325N933M731L941M276N724Q001
56103A032882J0085J0443R052Q146R365J1462J2519J3021J4499J6607J8058J9308
56091A185447K1471K3653K4283K4347K6173K9615L2623L5152L9192M5033N0913
56080A537902N6568O3601P1818P8522Q2421Q5088Q7453Q7650Q3713P6135O6656
56069B377527N6770M8390M3531M1957M0900L8167L3907K8770K2382J4567O239
56058B753107j692q881j4757j9024k3199k9686l8867m8841n7952o5447p0005p0298
56046B304458o7297o3285n8498n1618m3648l7792l4652l1132k5357j9469j5887
$$ y = [1114898, 1097393, 1080206, 1064041, 1050713, 1040384, 1031344, 1022516, 1014457, 1007645, 1001552, 996055, 992045, 989740, 987827, 985307, 983061, 982650, 984579, 988481, 993951, 1000276, 1006209, 1010940, 1014881, 1019157, 1024881, 1032882, 1042967, 1053410, 1062462, 1070608, 1079973, 1091435, 1103954, 1116975, 1131474, 1148081, 1166139, 1185447, 1206918, 1230571, 1254854, 1279201, 1305374, 1334989, 1367612, 1402764, 1441956, 1486989, 1537902, 1594470, 1658071, 1729889, 1808411, 1890832, 1975920, 2063373, 2151023, 2234736, 2310871, 2377527, 2434297, 2482687, 2526218, 2568175, 2609075, 2647242, 2681149, 2709919, 2732301, 2746868, 2753107, 2751415, 2742534, 2727777, 2708753, 2685554, 2655868, 2617001, 2568160, 2510208, 2444761, 2374756, 2304458, 2237161, 2173876, 2115378, 2063760, 2020112, 1982320, 1947668, 1916536, 1891179, 1871710, 1855823]
56035A855823j3930j1983j0226r089p445m434j276O72J938L559N467P485J0031
56022A826592J2554J3281J1969J0995J2280J4819J6601J7289J7822J8899K0809
56011A993910K3272K4863K4456K3472K4486K7339K9343K9695L0527L2845L4872
56000B299080L5671L6886L9186M0396L9333L8375L9838M2512M4151M4930M5997
55989B746355M6922M6985M7144M8551N0701N2757N4891N6918N7752N7674N8825
55978C325475O1960O5079O6675O7904P0188P3302P7244Q2973Q9746R4860R7787
55967D173193J01505J07743J14156J18440J22057J27415J34158J40730J47127
55958E286524J53984J61321J69821J80683J92817K03308K11970K21912K34335
$$ y = [1855823, 1841893, 1829910, 1819684, 1810595, 1803150, 1798716, 1797440, 1798112, 1800050, 1803609, 1809076, 1816561, 1826592, 1839146, 1852427, 1864396, 1875391, 1887671, 1902490, 1919091, 1936380, 1954202, 1973101, 1993910, 2017182, 2042045, 2066501, 2089973, 2114459, 2141798, 2171141, 2200836, 2231363, 2264208, 2299080, 2334751, 2371637, 2410823, 2451219, 2490552, 2528927, 2568765, 2611277, 2655428, 2700358, 2746355, 2793277, 2840262, 2887406, 2935957, 2986658, 3039415, 3094306, 3151224, 3208976, 3266650, 3325475, 3387435, 3452514, 3519189, 3587093, 3657281, 3730583, 3807827, 3890800, 3980546, 4075406, 4173193, 4274698, 4382441, 4496597, 4615037, 4737094, 4864509, 4998667, 5139397, 5286524, 5440508, 5601829, 5771650, 5952333, 6145150, 6348458, 6560428, 6782340, 7016675]
55949G016675K46861K58604K72170K88540L04687L18984L34420L53578L74894
55940I769413L96750M20813M48412M78022N09063N43417N80529O16125O48784
55931A4411328O82381P19337P57351P95753Q38251Q85837R34120R82060J036140
55922B2042558J101177J174484J254265J345817J453538J574344J704904J847224
55914C3498311K000961K159123K318680K487163K672442K875861L102385L365877
55906E4480803L675628M029740M431328M898449N447962O084966O820899P686052
55898I7555827Q709071R899344J1261433J2802621J4506066J6322913J8218319
55891A89275594K0200523K2275799K4396212K6441311K8112882K8705266K7077416
$$ y = [7016675, 7263536, 7522140, 7794310, 8082850, 8387537, 8706521, 9040941, 9394519, 9769413, 10166163, 10586976, 11035388, 11513410, 12022473, 12565890, 13146419, 13762544, 14411328, 15093709, 15813046, 16570397, 17366150, 18204401, 19090238, 20024358, 21006418, 22042558, 23143735, 24318219, 25572484, 26918301, 28371839, 29946183, 31651087, 33498311, 35499272, 37658395, 39977075, 42464238, 45136680, 48012541, 51114926, 54480803, 58156431, 62186171, 66617499, 71515948, 76963910, 83048876, 89869775, 97555827, 106264898, 116164242, 127425675, 140228296, 154734362, 171057275, 189275594, 209476117, 231751916, 256148128, 282589439, 310702321, 339407587, 366485003]
55884C66485003K2194061J3990285L743519o517276j5072264k1142556k4776819
55877C38903953k6409169k6554882k5698976k4235878k2435977k0478896j8504514
55870A74585661j6614570j4855059j3235914j1765021j0449232r280679q246627
55863I0138559p345402o575802n919130n347117m840732m389160l979453l601479
55855D8140284l257210k952722k685287k447376k236998k054030j891960j743065
55847B8871636j607255j487262j379812j279796j188426j108931j038269r71027
55839A8810858r07802q52178q02777p55512p10635o70670o33989n96842n59358
55830A2321095n23943m90375m57745m28316m04183l82934l61693l42402l27949
$$ y = [366485003, 388679064, 402669349, 406412868, 399895592, 384823328, 363680772, 338903953, 312494784, 285939902, 260240926, 236005048, 213569071, 193090175, 174585661, 157971091, 143116032, 129880118, 118115097, 107665865, 98385186, 90138559, 82793157, 76217355, 70298225, 64951108, 60110376, 55721216, 51741763, 48140284, 44883074, 41930352, 39245065, 36797689, 34560691, 32506661, 30614701, 28871636, 27264381, 25777119, 24397307, 23117511, 21929085, 20820154, 19781885, 18810858, 17903056, 17050878, 16248101, 15492589, 14781954, 14111284, 13477295, 12880453, 12321095, 11797152, 11306777, 10849032, 10420716, 10016533, 9633599, 9271906, 8929504, 8601555]
55821H601555l16215l03363k89993k78643k68052k55551k42691k32788k25079
55812F189180k16833k09267k05647k05001k03151j98961j94471j89825j83135
55803D382889j74865j67682j62140j56310j49359j42043j34477j26724j20533
55794C048756j17085j14154j08912j02195r6504r1437q5161p8890p5333p3500
55784B105585o9719o3571n8375n5562n2796m8495m4341m2072m0769l8827l6329
55773A554729l4256l2917l2022l1142k9792k7886k5876k3873k1553j9708k0288
55762A255416k3494k6505k6834k5288k3768k2243k0167j8902j9674k0727j9594
55751A008220j6893j4850j3365j0966q533q254r359q776o157m547n458o627n809
$$ y = [8601555, 8285340, 7981977, 7691984, 7413341, 7145289, 6889738, 6647047, 6414259, 6189180, 5972347, 5763080, 5557433, 5352432, 5149281, 4950320, 4755849, 4566024, 4382889, 4208024, 4040342, 3878202, 3721892, 3572533, 3430490, 3296013, 3169289, 3048756, 2931671, 2817517, 2708605, 2606410, 2509906, 2418469, 2333308, 2254418, 2179085, 2105585, 2035866, 1972295, 1913920, 1858358, 1805562, 1757067, 1712726, 1670654, 1629885, 1591058, 1554729, 1520473, 1487556, 1455534, 1424392, 1394600, 1366714, 1340838, 1316965, 1295412, 1275704, 1255416, 1231922, 1205417, 1178583, 1153295, 1129527, 1107284, 1087117, 1068215, 1048541, 1027814, 1008220, 991327, 976477, 963112, 952146, 943613, 935359, 926000, 917224, 911067, 906520, 901062, 894435, 888626]
55738H88626l972l237l786m302m093l577l382l603l554k452p75k68j654l381l765
55723H42825l274l294l819m189m966o991r515j1277j2542j3938j4206j1761p790
55710G35263n165m475l753k106j128k380n481q990j1477j1805j0164q696r312
55697F50331j1083j1692j0968j0753j1499j1686j0737j0031j0268j0247r106p923
55685E24338p965q854r479r570r520r445r074q065o272m262l280l914n191n836
55671D23611n893o034o067n482m848n006n554n717o114p680r311q790o041l379
55657C37695k305j951r55Q01K781M581N772O167O380O977P259O149M006K122O54
55642C86133j329l937o255p769q443p792n664l721l979n943p091o225m376k529
$$ y = [888626, 884654, 881417, 877631, 873329, 869236, 865659, 862277, 858674, 855120, 852668, 851893, 851625, 849971, 846590, 842825, 839551, 836257, 832438, 828249, 823283, 816292, 806777, 795500, 782958, 769020, 754814, 743053, 735263, 730098, 725623, 721870, 719764, 718636, 716256, 710775, 701785, 690308, 678503, 668339, 659643, 650331, 639248, 627556, 616588, 605835, 594336, 582650, 571913, 561882, 551614, 541367, 532261, 524338, 516373, 507519, 498040, 488470, 478950, 469505, 460431, 452366, 446094, 441832, 438552, 434638, 429447, 423611, 417718, 411684, 405617, 400135, 395287, 390281, 384727, 379010, 372896, 365216, 355905, 347115, 341074, 337695, 335390, 333439, 332484, 333285, 336066, 340647, 346419, 352586, 358966, 365943, 373202, 379351, 383357, 385479, 386133, 384804, 380867, 374612, 366843, 358400, 350608, 344944, 341223, 337244, 331301, 324210, 317985, 313609, 311080]
55628C11080o86O42M43q52j531j222j242j830j410N39K088J631K19j99N90J450
55612C09710J708J427Q64M85O69R06K22j257k306k321j713n52J389L055K672O28
55596C15586l52J017K674K401R94N48J104J010l32j948k929l011k028k09J231
55581C15756J130j12r59o99r2j88j109k132k568k540k983m603o891q564q866p982
55565B66598o334m325k644j961k109k352k328k044j232J21R84L21j178j962k072
55550B37483k998m962o273n898m770l845k758j353o70j241j944j853j738k310
55536A94870k492j138P52J387R77J183K335L023K354R93k25j261k122k226j115
55521A97295P24K178K418J547N78O70K104M056N462N873N469M796M534N034N846
$$ y = [311080, 310394, 311036, 311479, 310627, 309096, 307874, 306632, 304802, 303392, 303931, 306019, 307650, 307869, 307670, 308260, 309710, 311418, 312845, 313709, 314194, 314863, 315769, 315991, 314734, 312428, 310107, 308394, 307842, 309231, 312286, 314958, 315586, 315234, 316251, 318925, 321326, 322320, 322868, 323972, 324982, 324650, 322702, 319773, 316762, 314734, 314525, 315756, 316886, 316774, 315815, 315116, 315024, 314836, 313727, 311595, 309027, 306487, 303504, 298901, 292010, 283446, 274580, 266598, 260264, 255939, 253295, 251334, 249225, 246873, 244545, 242501, 241269, 241390, 242374, 242695, 241517, 239555, 237483, 234485, 229523, 223250, 217352, 212582, 208737, 205979, 204626, 203956, 202715, 200771, 198918, 197180, 194870, 192378, 191240, 191992, 193379, 194356, 195539, 197874, 200897, 203251, 204244, 204019, 202758, 200636, 198410, 197295, 198019, 200197, 202615, 204162, 204740, 205410, 207514, 211570, 217032, 222905, 228374, 233170, 237704, 242738, 248584]
55506B48584O139N588M360K486J12j783k215j800k179l541m231l452k794l938
55492B41336o168p462p202o321n411m154k498j240j229k541m302n057l808j243
55478A82700N82L71j113k223k285j671q07j0L63M30J025K527L892L752K189O16
55462A90338R0M74J011J012J70j143j999j983j893k700l997m334l163j703j506
55447A68674k570l354k557o05Q30O42o58j776k069j873j762k049k701l209k777
55432A42186j272L04R06O55K59k27j040j608j232m99n68j141r09K8J06r98j618
55415A33332p65L75N96M61O98N19q21k202k128j065n40p52p32l30l15p89r89n90
55397A23963m4K18l1j064k551l060j432J468L379K979Q74j375k291j121J486L513
$$ y = [248584, 254723, 260311, 264671, 267157, 267269, 265486, 263271, 261471, 259292, 255751, 251520, 248068, 245274, 241336, 235168, 227706, 220504, 214183, 208772, 204618, 202120, 200880, 199651, 197110, 192808, 187751, 183943, 182700, 183282, 183653, 182540, 180317, 178032, 176361, 175554, 175544, 175907, 176337, 177362, 179889, 183781, 187533, 189722, 190338, 190428, 190902, 191913, 192925, 193095, 191952, 189953, 187970, 186077, 183377, 179380, 175046, 171883, 170180, 168674, 166104, 162750, 160193, 159588, 160418, 161060, 160402, 158626, 156557, 154684, 152922, 150873, 148172, 144963, 142186, 140914, 141218, 142124, 142779, 143038, 142811, 141771, 140163, 138931, 138432, 137864, 136723, 135814, 135842, 135948, 134950, 133332, 132567, 132942, 133538, 133999, 134697, 135216, 134395, 132193, 130065, 129000, 128460, 127708, 126976, 126646, 126331, 125542, 124553, 123963, 123919, 124137, 124106, 123042, 120491, 117431, 115999, 117467, 120846, 123825, 124699, 123324, 121033, 119912, 121398, 124911]
55381A24911L356J445m68j288j061j46R82J481Q96l9l46k31m41p04j43R92J573
55364A30769J579K095L095K943R60j038r85O49J687J271N60N46N91j81j091n44
55348A42906J682L828M090K516M40j351k994m299m316k610l01Q84L25j048j841
55333A37911j523q33r30j940k583j709M8R96N95o2r2Q7m1J1Q21J968K642K689
55315A38055K306J362j17j374j680j295r85r89j015q92o47l56l44j018j991k068
55299A26952p61P89J141L57k39K02J250J847J365K04m68Q7J108J165N8r86j128
55282A32943q18n87k45K19J98l37m46K02O62L75J26L80K21q03j387o15J20p73
55264A29435k279k240p02M53O24R40J795K176J585P85M08L17L69M81Q7r62j382
$$ y = [124911, 128267, 129712, 129244, 127956, 126895, 126749, 127731, 129212, 130108, 130069, 129723, 129492, 129051, 128347, 128204, 129196, 130769, 132348, 134443, 137538, 140481, 141441, 140403, 139418, 140067, 141754, 143025, 143585, 144131, 144722, 144541, 143450, 142906, 144588, 148416, 152506, 155022, 155462, 154111, 151117, 146818, 142502, 139892, 139591, 140475, 140800, 139752, 137911, 136388, 135555, 134625, 132685, 130102, 128393, 128441, 129437, 130032, 129970, 129878, 129965, 129924, 129935, 130756, 132724, 135366, 138055, 140361, 141723, 141606, 140232, 138552, 137257, 136272, 135283, 134268, 133376, 132729, 132373, 132029, 131011, 129020, 126952, 126191, 126980, 128121, 128478, 128239, 128441, 129691, 131538, 132903, 133107, 132639, 132726, 133834, 134999, 135057, 134071, 132943, 132125, 131538, 131293, 131512, 131710, 131373, 130927, 131129, 131791, 132166, 132292, 132672, 132893, 132090, 130703, 130088, 130208, 129435, 127156, 124916, 124214, 124667, 125291, 126231, 128026, 130202, 131787, 132572, 132980, 133297, 133666, 134147, 134234, 133272, 131890]
55247A31890j26J323M38k526m510l774j857p64m08J35O89P79R22J685K446K367
55231A28709J810J714K128K404K282J953J540J130Q97O49j94j500k060j176K4
55216A40310j49j630k630j994n28L00J57k52m62n12k48O18J473R74r25k125q74
55199A31503J479J983J48j468j121j27j92m92O55K653L261J791k76j526j709q60
55183A35702R36K757L180J790m44k230k790k018o93J7J07J013L249M876L932J453
55167A50837R7L55L83o94j682j782j830k411k603j565J8Q12L02j036k117j762
55151A35322MJ414R78l07l95N90P52j52k86Q24J190j74j255k18J508J398m38j771
55133A38984j558o81K9O47J071P03n18j663j727n72J013J960J835J219Q72N53
$$ y = [131890, 131764, 133087, 133525, 130999, 126489, 122715, 120858, 120094, 119686, 119821, 120510, 121289, 122211, 123896, 126342, 128709, 130519, 132233, 134361, 136765, 139047, 141000, 142540, 143670, 144567, 145216, 145022, 143522, 141462, 140286, 140310, 140161, 138531, 135901, 133907, 133379, 133679, 133836, 133584, 133122, 132610, 132362, 132980, 134453, 135427, 134502, 132377, 131503, 132982, 134965, 135113, 133645, 132524, 132397, 132205, 131713, 132368, 135021, 138282, 140073, 139797, 138271, 136562, 135702, 136638, 139395, 142575, 144365, 143921, 141691, 138901, 136883, 136190, 136207, 136314, 137327, 140576, 145452, 149384, 150837, 150934, 151289, 151672, 150978, 149296, 147514, 145684, 143273, 140670, 139105, 139123, 139935, 140237, 139201, 137084, 135322, 135326, 136740, 137718, 137411, 137016, 137606, 138358, 138206, 137920, 138744, 139934, 139760, 138505, 138287, 139795, 141193, 140755, 138984, 137426, 136745, 136774, 137421, 138492, 139195, 138677, 137014, 135287, 134715, 135728, 137688, 139523, 140742, 141614, 142167]
55117A42167n78k395l550l166j900r01m12J90J462L309M867M957L354J491R30
55102A49825J288Q73o37j553n88J400K700K665J761N97m12j193k151l512m432
55087A46631l756j690L02J368J812J795J013p0k62N56J128Q54N56O88L85q05j792
55070A48713j637j024r29r82m08L93M10l77j058j023n45l17p11j155m89J334K454
55053A42649J365n19m71J667L352L172K335J973J583J029J335K323K004o5j350
55038A62382j43J591J293l23q53J43J442K558L394K934Q78o94J85K215K698J512
55022A81212N96L45n22j949k301j285m98p80j231j191j163j371j265q14p08r74
55006A66101q38j09O70J438K507L326K885J398J25m76j039j783k257k487k894
$$ y = [142167, 141589, 139194, 135644, 132478, 130578, 129677, 129265, 129455, 130917, 134226, 139093, 144050, 147404, 148895, 149825, 151113, 151986, 151349, 149796, 149208, 150608, 153308, 155973, 157734, 158331, 157919, 156726, 154575, 151063, 146631, 142875, 141185, 141487, 142855, 144667, 146462, 147475, 147405, 147143, 147699, 148827, 149681, 150237, 150925, 151310, 150505, 148713, 147076, 146052, 145123, 144141, 143733, 144126, 144536, 144159, 143101, 142078, 141533, 141216, 140505, 139350, 138861, 140195, 142649, 144014, 143495, 143024, 144691, 148043, 151215, 153550, 155523, 157106, 158135, 159470, 161793, 163797, 163732, 162382, 162239, 163830, 165123, 164800, 163947, 164090, 165532, 168090, 171484, 174418, 175296, 174602, 174787, 177002, 179700, 181212, 181808, 182153, 181631, 179682, 177381, 176096, 175598, 174818, 173587, 172396, 171233, 169862, 168597, 167783, 167075, 166101, 165263, 165154, 165824, 167262, 169769, 173095, 175980, 177378, 177503, 177027, 175988, 174205, 171948, 169461, 166567]
54991A66567l029j984j15J089J032N60M52O02P59P65J92j094k086j819j004j032
54975A59855j608j195L28J377J199Q06R90J139N15p19k096l095k702l90K260K774
54959A59438J084k36L35J343J101L85Q37K080K323J091k79p46p63j170j778j606
54943A63439l26J015J123J81k37O75J739J472R4j160j818k004j190J049L408L890
54927A71350K451R79N62M59n2o08q88j169j277n34P56J283P95O63J712K910K938
54910A82330J870N07p24j484j247j35R37J496J924K277J838L93j271k609l726
54895A82376m071k388J025L590L385J667J016J704J712j1j802j377J241L508L111
54880A94686O12j245q97K37O0j146j439l21Q00J131J426K086K334J862J501J498
$$ y = [166567, 163538, 161554, 161439, 162528, 163560, 164120, 164572, 165174, 165933, 166698, 166890, 165796, 163710, 161891, 160887, 159855, 158247, 157052, 157380, 158757, 159956, 160762, 161752, 162891, 163406, 162687, 160591, 157496, 154794, 154404, 156664, 159438, 160522, 160286, 160621, 161964, 163065, 163450, 164287, 166367, 168690, 169781, 169502, 168756, 167993, 166823, 165045, 163439, 163113, 164128, 165251, 165432, 165195, 165870, 167609, 169081, 169175, 168015, 166197, 164193, 163003, 164052, 167460, 171350, 173801, 174780, 175342, 175801, 175749, 175141, 174253, 173084, 171807, 171273, 172029, 173312, 174107, 174770, 176482, 179392, 182330, 184200, 184707, 183983, 182499, 181252, 181117, 182054, 183550, 185474, 187751, 189589, 189982, 188711, 186102, 182376, 178305, 175917, 176942, 180532, 183917, 185584, 186600, 188304, 190016, 190005, 188203, 186826, 188067, 191575, 194686, 195298, 194053, 193156, 193393, 193453, 192307, 190868, 190547, 191347, 192478, 193904, 195990, 198324, 200186, 201687, 203185]
54864B03185R29k99o26Q25K676L334L207L543M296M601M424M510N319O937R027
54849B55888J0165Q466M081j98k021k014k069k532k748l097m366n857o075n051
54835B42572m162l952l657k835k050j919k599l954n172m742k197N37J099k28r00
54820B05841M32K477L491L312K785K438K429K834L343L386L102L510N183P274
54806B51837Q326P787O298M661K960P83j745l616m028l677m138n795p234p192
54792B45227o185n554n597n716n688n656n118l297o72R18K35j818l095k458q08
54777A94718R5k74p03LJ298J707R46K6o92j979l792m497l026o61N18J9j236k450
54759A80020l072k370l54J508J921J491J578K113K066J430J005N48q83k803l274
$$ y = [203185, 204114, 203815, 203189, 204014, 206690, 210024, 213231, 216774, 221070, 225671, 230095, 234605, 239924, 246861, 255888, 266053, 274519, 278600, 278402, 276381, 274367, 272298, 269766, 267018, 263921, 259555, 253698, 247623, 242572, 238410, 234458, 230801, 227966, 225916, 223997, 221398, 217444, 212272, 207530, 205333, 205870, 206969, 206741, 205841, 206273, 208750, 212241, 215553, 218338, 220776, 223205, 226039, 229382, 232768, 235870, 239380, 244563, 251837, 260163, 267950, 274248, 278909, 281869, 282652, 280907, 277291, 273263, 269586, 265448, 259653, 252419, 245227, 239042, 233488, 227891, 222175, 216487, 210831, 205713, 202416, 201744, 202662, 202897, 201079, 197984, 195526, 194718, 194813, 194539, 193836, 193839, 195137, 196844, 197790, 197816, 197124, 195145, 191353, 186856, 183830, 183169, 183687, 183706, 182470, 180020, 176948, 174578, 174224, 175732, 177653, 179144, 180722, 182835, 184901, 186331, 187336, 187884, 187001, 184198, 180924]
54744A80924j472J162K696K519J208j62m48O38J851J797R77J110K374K951J713
54729A99838j57r42m64L51P73L99q21j873j101J646M181M347K514P36J92N98J506
54712B11723K783L854L788K544J345J342K375L406L919M471N753P373Q029P089
54698B69794N544M903N455O262O579O320N195K641r35l929n217n313n263n275
54684B86761n164n255n732n812m888l906m250n321m971k624m40n27k265l365k787
54669B29454j363j89L89L25k43o68k51O67J036P18R11K464M658O205O709O549
54653B57371O034N418N171N230M557K435j18j392j285j379k656m347n312n529
54639B64198n655n869n804n133l849k347j420j673k736l560l529k858k023j435
$$ y = [180924, 179452, 180614, 183310, 185829, 187037, 186875, 186427, 187065, 188916, 190713, 191690, 192800, 195174, 198125, 199838, 199681, 198739, 198275, 198626, 199399, 199798, 198977, 197104, 196003, 197649, 201830, 206177, 208691, 209427, 209619, 210217, 211723, 214506, 218360, 222148, 224692, 226037, 227379, 229754, 233160, 237079, 241550, 247303, 254676, 262705, 269794, 275338, 280241, 285696, 291958, 298537, 304857, 310052, 312693, 311758, 307829, 302612, 297299, 292036, 286761, 281597, 276342, 270610, 264798, 259910, 256004, 251754, 246433, 241462, 238838, 238398, 237871, 235606, 232241, 229454, 228091, 227902, 228291, 228616, 228373, 227705, 227454, 228121, 229157, 229875, 230786, 233250, 237908, 244113, 250822, 257371, 263405, 268823, 273994, 279224, 283781, 286216, 286098, 284706, 283421, 282042, 279386, 275039, 269727, 264198, 258543, 252674, 246870, 241737, 237888, 235541, 234121, 232448, 229712, 226152, 222623, 219765, 217742, 216307]
54625B16307j492k087k197j010O70J253N12m52j257k539l951l926k221q12j150
54610A95648k165k273j600q71K54J889K533J004j310k257j977j986k119r09J468
54595A85329L153L352K849J887M0j754j563M84J909J364K56O4K08k11n44M4R71
54578A97838J387J565J807J266o57k769l363k229l25J575K708J993m95k641k477
54563A95183p42L31J42o6K77K72n45j294j223p67m86o4R09K006K435J970R11l33
54545A98916j284j448q04J64J065J908K579K654K153J804J983J826L70j632k147
54530B08107m48J657J932M06r85j132q56j085j185r2J784K908K685K033J863J964
54514B19556J684R33n5j274k639l417k713n51J817K979K604J632J181J404J479
$$ y = [216307, 214815, 212728, 210531, 209521, 210191, 211444, 211956, 211504, 210247, 207708, 203757, 199831, 197610, 196798, 195648, 193483, 191210, 189610, 188739, 188993, 190882, 193415, 194419, 193109, 190852, 188875, 186889, 184770, 183861, 185329, 188482, 191834, 194683, 196570, 196610, 194856, 193293, 193777, 195686, 197050, 197306, 197370, 197578, 197367, 196823, 196867, 197838, 199225, 200790, 202597, 203863, 203206, 200437, 197074, 194845, 194520, 196095, 198803, 200796, 200301, 197660, 195183, 194441, 194772, 194914, 194848, 195125, 195397, 194852, 193558, 192335, 191568, 191082, 191018, 191927, 193933, 196368, 198338, 199249, 198916, 197632, 196184, 195380, 195544, 196609, 198517, 201096, 203750, 205903, 207707, 209690, 211516, 211886, 210254, 208107, 207659, 209316, 211248, 211654, 210669, 209537, 208681, 207596, 206411, 206319, 208103, 211011, 213696, 215729, 217592, 219556, 221240, 222173, 222118, 220844, 218205, 214788, 212075, 211524, 213341, 216320, 218924, 220556, 221737, 223141, 224620]
54499B24620P07o74j766j805n82J368K755K290M3k338l316k951k183j285o1J021
54483B15843J244J102J865L453M165L053J403R86J835K752L153L298L050J773
54469B48975m27k199k229o76R42J290N35j2L91Q59K4k003l533l289j754l33J31
54452B36692l48j346k188k231j573r88o86J49J833K909J697j144k977k444j035
54437B26320p17j106l14J923L541K843O81q10p98p9N70J107J397R95K6p28r94
54420B33857j304j683j178N35K141K319J527J094J272J490J736K241K264J017
54406B47328m70k13J840L522L312J977Q18n1j031j975k590k742j835P31L859M988
54390B57468L088J08j516j516r26m5J084J423J52j541j768p79o01j931l146k705
$$ y = [224620, 225327, 224653, 222887, 221082, 220500, 221868, 224623, 226913, 226956, 224618, 221302, 218351, 216168, 214883, 214822, 215843, 217087, 218189, 220054, 223507, 227672, 230725, 232128, 233114, 234949, 237701, 240854, 244152, 247202, 248975, 248548, 246349, 244120, 243444, 244386, 245676, 246211, 246199, 246590, 247449, 247473, 245470, 241937, 238648, 236894, 236561, 236692, 236344, 234998, 232810, 230579, 229006, 228018, 227332, 227481, 229314, 232223, 233920, 232776, 229799, 227355, 226320, 225603, 224497, 224183, 226106, 229647, 232490, 233171, 232361, 231563, 231484, 232054, 233161, 234558, 235553, 235579, 234851, 233857, 232553, 230870, 229692, 230227, 232368, 234687, 236214, 237308, 238580, 240070, 241806, 244047, 246311, 247328, 246858, 246645, 248485, 252007, 255319, 257296, 258114, 258063, 257032, 255057, 252467, 249725, 247890, 248621, 252480, 257468, 260556, 260664, 259148, 257632, 256706, 256661, 257745, 259168, 259320, 257779, 256011, 255232, 254631, 252700, 249554, 246849]
54374B46849j024N07J154R65K90k71j74J98k31j711k934k336J64L115M957N094
54358B54612L857J810o12k903m234l949k391o99M03J142J688J492L14p54m40P91
54342B50127J123j72j623j338Q25L200M062L098J501Q06J467K488K558J381k20
54327B69283j225j048L42K254L392K810Q71j135k225k179j165L10J222P61n35
54312B71733j165m77O41J100Q99N95L29j6k57k62l36n13Q9K097M297M547K535
54295B85836L63k42j23r30k184j846M10K400K422J350P94O79K40L00K341N572
54279B97382P035N263K153L24l3n68k096l767m461l887k466j010m05r53k089l102
54263B87320l814m199l821k489j042o01j145j600j407j240j890l067l644k928
$$ y = [246849, 245825, 246332, 247486, 248451, 248741, 248470, 248296, 248494, 248263, 246552, 243618, 241282, 241446, 244561, 249518, 254612, 258469, 260279, 259667, 256764, 252530, 248581, 246190, 245491, 245894, 247036, 248724, 250216, 250530, 249776, 249336, 250127, 251250, 251078, 249455, 248117, 248942, 252142, 256204, 259302, 260803, 261609, 263076, 265564, 268122, 269503, 269283, 268058, 267010, 267352, 269606, 272998, 275808, 276679, 275544, 273319, 271140, 269975, 270285, 271507, 272268, 271733, 270568, 270091, 270732, 271832, 272731, 273326, 273655, 273639, 273382, 273120, 272784, 272271, 272360, 274457, 278754, 283301, 285836, 286199, 285957, 285834, 284904, 282720, 280874, 281284, 283684, 286106, 287456, 288250, 288929, 289169, 289469, 291810, 297382, 304417, 309680, 311833, 312157, 312124, 311556, 309460, 305693, 301232, 297345, 294879, 293869, 293464, 292511, 290422, 287320, 283506, 279307, 275486, 272997, 271955, 271354, 270209, 268609, 267202, 265962, 264072, 261005, 257361, 254433]
54249B54433j399k36r9m05M0J589L272L889L247K054R73J98k77m86n63o30o05
54232B64995l32J33M79L21n40j814k646k253p83P23J254N49r16k112j904j07J819
54215B56866K182J195O60J241J469J23j644j901p17N6n57j560j544l43J049J653
54199B58228J456J352J943K437J643J61J94K381M257L341O18q22R3J610K038J345
54183B82275j61k587n220o246m822k318p27o29j300j903j919j194k41M8m92j009
54167B51555q62m11j75L4N19P67jj581k722k343n34J632L068L391K887J994J109
54150B58327P21J060J476R13n32j467j275j207k332l433k660n95N12K29M26J920
54134B52083L013K264P08l5j86p34j324r90j47j14j009j602j128k9R45J321Q32
$$ y = [254433, 253034, 252798, 252699, 252294, 252334, 253923, 257195, 261084, 264331, 266385, 267358, 267556, 267279, 266793, 266230, 265600, 264995, 264663, 264796, 265275, 265596, 265056, 263242, 260596, 258343, 257560, 258283, 259537, 260086, 259170, 257058, 255154, 255047, 256866, 259048, 260243, 260903, 262144, 263613, 263736, 262092, 260191, 259474, 259530, 258973, 257413, 255869, 255526, 256575, 258228, 259684, 261036, 262979, 265416, 267059, 267220, 267414, 269795, 274052, 277393, 278011, 277189, 277282, 278892, 280930, 282275, 282114, 279527, 274307, 268061, 263239, 260921, 260194, 259565, 258265, 256362, 254443, 253249, 253008, 253056, 252564, 251555, 250693, 250282, 250107, 250141, 250660, 251427, 251426, 249845, 247123, 244780, 244246, 245878, 248946, 252337, 255224, 257218, 258327, 259048, 260108, 261584, 262497, 261965, 260498, 259223, 258016, 255684, 252251, 249591, 248996, 249508, 249737, 250163, 252083, 255096, 257360, 258068, 258033, 257847, 257113, 255789, 254799, 254652, 254538, 253529, 251927, 250799, 250770, 251715, 253036, 253868]
54117B53868k27p14J93J592J668n0k163l268l361l048k354r18J080K800L462K912
54101B51472J603K31o66r50q04n37m73p40j081j035n12K2M4m23q95r47n35N0M14
54082B44238M99P56J542K428K572J907J300J315J425R35J15k21M3K36l6l35j9
54065B58700R67K025K456K027J045nq34j237r48K2J033J426J401J716K434K745
54049B74973K223J465J164J278J470J608J378M09o77m74J034J653k37k946l358
54034B80963j123R98J132N14R14J656R20j117k226j156P73J529Q45K22R31K589
54018B88364L641K949Q95r11r89P80L066M267L831K539J498R30K39q07j381m85
54002C08426J652L626M313L944L535L551L538K988K191J989K781M037N005N647
$$ y = [253868, 253641, 252927, 253120, 254712, 256380, 256330, 254167, 250899, 247538, 244490, 242136, 241218, 242298, 245098, 248560, 251472, 253075, 253306, 252640, 251690, 250886, 250349, 249876, 249136, 248055, 247020, 246508, 246530, 246574, 246151, 245256, 244309, 243774, 243824, 244238, 244737, 245493, 247035, 249463, 252035, 253942, 255242, 256557, 257982, 258917, 259032, 258811, 258854, 259090, 259054, 258719, 258700, 259667, 261692, 264148, 266175, 267220, 267215, 266381, 265144, 264196, 264218, 265251, 266677, 268078, 269794, 272228, 274973, 277196, 278661, 279825, 281103, 282573, 284181, 285559, 285968, 285291, 284817, 285851, 287504, 287267, 284321, 280963, 279840, 280838, 281970, 282484, 283398, 285054, 285974, 284857, 282631, 281475, 282248, 283777, 284622, 284844, 285775, 288364, 292005, 294954, 295849, 294938, 293949, 294729, 297795, 302062, 305893, 308432, 309930, 310860, 311099, 310292, 308911, 308426, 310078, 313704, 318017, 321961, 325496, 329047, 332585, 335573, 337764, 339753, 342534, 346571, 351576, 357223]
53988C57223O445P321P353O056M580M875P586J1240J3797J4526J4080J3142J1783
53975D80007J0073Q677Q278Q721R105Q734P616O139M655L441K602J812N14j268
53961E59106k699l050k597k120j814j382j049j579l085m577n230n485o246p364
53947E10829p767p066o205o167o661o621n806n159n515o539p346p666p712p284
53933D17315n883l936k824l187m005m071l597l357k985j573K51N34j304l313l366
53918C74699j602J73O90j9j218j875j079Q80K236J579l39j524j310p58o76n47
53902C69310J58R20J172J498K738M393M984M035K768K609L548M438M524M202M323
53887D15620N154O204O913P319P883Q745R305Q867P636O773P177Q491R687J0300
$$ y = [357223, 363668, 370989, 378342, 384398, 388978, 393853, 401439, 412679, 426476, 441002, 455082, 468224, 480007, 490080, 498757, 507035, 515756, 524861, 533595, 541211, 547350, 552005, 555446, 558048, 559860, 560374, 559106, 556407, 553357, 550760, 548640, 546826, 545444, 544395, 542816, 539731, 535154, 529924, 524439, 518193, 510829, 503062, 495996, 489791, 483624, 476963, 470342, 464536, 459377, 453862, 447323, 439977, 432311, 424599, 417315, 411432, 407496, 404672, 401485, 397480, 393409, 389812, 386455, 383470, 381897, 382148, 382682, 381378, 378065, 374699, 373097, 373270, 373960, 373941, 372723, 370848, 369769, 370649, 372885, 374464, 374125, 372601, 371291, 370533, 369857, 369310, 369468, 370388, 371560, 373058, 375796, 380189, 385173, 389208, 391976, 394585, 398133, 402571, 407095, 411297, 415620, 420774, 426978, 433891, 441210, 449093, 457838, 467143, 476010, 483646, 490419, 497596, 506087, 515774, 526074]
53873E26074J0559J0402R316P436O019O103P172P910P935P938Q249Q359Q073Q239
53859F39784R753J2274J4481J5438J5348J5094J5246J5552J5327J4307J2912J1495
53847H07011R768P412M841K713R26j029k796l337k557j795k105k919l036k292
53833H10805j523j278j213o27Q62L016N068O328O773O503M644l03q412j7327k3986
53818G89330k6952k6788k4909k2820k1752k1847k1927k0816j8702j6555j4664
53807E51598j2668j0668r272q555p977p354p004o914o729o592p109q140q560p620
53793D36436n831m151k995k411k462k863k943k508k295k848l562l498k773k298
53779C92998k288j959p79O46J192L09j604l465m088k972q33R97J823J989J957
$$ y = [526074, 536633, 547035, 556351, 563787, 569806, 575909, 583081, 590991, 598926, 606864, 615113, 623472, 631545, 639784, 649537, 661811, 676292, 691730, 707078, 722172, 737418, 752970, 768297, 782604, 795516, 807011, 816779, 824191, 829032, 831745, 832671, 831642, 828846, 825509, 822952, 821157, 819052, 816133, 813097, 810805, 809282, 808004, 806791, 806164, 807026, 810042, 815110, 821438, 828211, 834714, 839358, 839055, 830643, 813316, 789330, 762378, 735590, 710681, 687861, 666109, 644262, 622335, 601519, 582817, 566262, 551598, 538930, 528262, 518990, 510435, 502458, 495104, 488100, 481186, 474457, 467865, 460756, 452616, 444056, 436436, 430605, 426454, 423459, 421048, 418586, 415723, 412780, 410272, 407977, 405129, 401567, 398069, 395296, 392998, 390710, 388751, 387972, 388618, 389810, 390119, 388515, 385050, 380962, 377990, 377157, 378154, 379977, 381966, 383923]
53764C83923J581O84k06l21K95Q82J115J570K789M374N276M876L599K617K916
53749D15970M295N371N053M042M217O314Q916J0219J0087R615R231Q356O852N621
53735E14159N435N883N995N432M670M229M095L909L489L110L053K917J825l86
53721E67815k555l343k750j959j969k924m502o133p035o962o737p178p665o918
53707D99185n198m320n079o035n643m383l771m161m701m892m942m883m377l489
53693D33311k718k246j843j620k037k921l146j977l66r7j469k628j892l18n72
53678D07461l182n340m469j625K70O80J673M068N831N118K949J511J269J222J001
53663D18437J166J856K475K626K611K944L812M716M618L056J178P40J836K884
$$ y = [383923, 385504, 386188, 385982, 385661, 385956, 386838, 387953, 389523, 392312, 396686, 401962, 406838, 410437, 413054, 415970, 420265, 425636, 430689, 434731, 438948, 445262, 454178, 464397, 474484, 484099, 493330, 501686, 508538, 514159, 519594, 525477, 531472, 536904, 541574, 545803, 549898, 553807, 557296, 560406, 563459, 566376, 568201, 567815, 565260, 561917, 559167, 557208, 555239, 552315, 547813, 541680, 534645, 527683, 520946, 513768, 506103, 499185, 493987, 489667, 484588, 478553, 472910, 468527, 464756, 460595, 455894, 451002, 446060, 441177, 436800, 433311, 430593, 428347, 426504, 424884, 422847, 419926, 416780, 414803, 414437, 414340, 412871, 410243, 408351, 408033, 407461, 404279, 398939, 394470, 392845, 393115, 393795, 395468, 399536, 405367, 410485, 413434, 414945, 416214, 417436, 418437, 419603, 421459, 423934, 426560, 429171, 432115, 435927, 440643, 445261, 448317, 449495, 450235, 452071, 454955]
53649D54955L069L360M370N031M431L535L536L829L306K540K827L874M310L917
53635E06890L486K932J534r1k19J542L608M467M061L010J819J101J408K475L416
53620E41439L676L081J436q78k511k664k527l610n186n237l646k293k001j615
53606E17464o30l53j540k770k528j397q15q23l94P84J934K159J127o65j876j372
53590E08305L55J678J942J977K202J742J97j166j074JR28J720K953M150M295L558
53574E33763L220L829M457M017K658J655K134L925N650O210N976O020O397O276
53560E96187N751O114P740Q986Q201N941M158L845M478N321O198P126P989Q549
53546F86584Q429P321N617M406M402N136N543M983L502J652L45K17P85Q26q4j052
$$ y = [454955, 458024, 461384, 465754, 470785, 475216, 478751, 482287, 486116, 489422, 491962, 494789, 498663, 502973, 506890, 510376, 513308, 514842, 514751, 514532, 516074, 519682, 524149, 528210, 531220, 533039, 534140, 535548, 538023, 541439, 545115, 548196, 549632, 548754, 546243, 543579, 541052, 537442, 532256, 527019, 523373, 521080, 519079, 517464, 516834, 516481, 514941, 512171, 509643, 508246, 507431, 506608, 506214, 506998, 508932, 511091, 512218, 511553, 509677, 508305, 508660, 510338, 512280, 514257, 516459, 518201, 518398, 517232, 516158, 516159, 517087, 518807, 521760, 525910, 530205, 533763, 536983, 540812, 545269, 549286, 551944, 553599, 555733, 559658, 565308, 571518, 577494, 583514, 589911, 596187, 601938, 608052, 615792, 624778, 632979, 638920, 643078, 646923, 651401, 656722, 662920, 670046, 678035, 686584, 695013, 702334, 707951, 712357, 716759, 721895, 727438, 732421, 735923, 737575, 737920, 738137, 738922, 739748, 739664, 738612]
53530G38612j179n86K24J085J709J510N63q4J00K15o49j864k251k000k371l768
53514G29266n197n607m919l783k885k408j766j53K178L680L088Q68j449k861l196
53499G04856k376l65K270M411N126M279K696J907K997N338P058P139O350N813
53485G57499N694N887O742Q240R450R973J0854J2804J4515J4418J3385J3762J6028
53472H99251J8329J9423K0177K1647K3331K4234K4453K4886K5983K7529K9061
53461A158304L0092L0514L1074L2787L5508L7838L8899L9543M1128M3623M5600
53450A564910M5934M4944M3801M3334M3565M4145M4809M5230M4814M3185M0914
53439B049585L9156L8392L7996L7358L6749L6549L6347L5588L4624L4165L3916
$$ y = [738612, 737433, 736847, 737071, 738156, 739865, 741375, 741938, 741854, 741954, 742169, 741520, 739656, 737405, 735405, 733034, 729266, 724069, 718462, 713543, 709760, 706875, 704467, 702701, 702548, 704726, 708406, 711494, 712362, 710913, 708052, 704856, 702480, 702115, 704385, 708796, 713922, 718201, 720897, 722804, 725801, 731139, 738197, 745336, 751686, 757499, 763193, 769080, 775822, 784062, 793512, 803485, 814339, 827143, 841658, 856076, 869461, 883223, 899251, 917580, 937003, 957180, 978827, 1002158, 1026392, 1050845, 1075731, 1101714, 1129243, 1158304, 1188396, 1218910, 1249984, 1282771, 1318279, 1356117, 1395016, 1434559, 1475687, 1519310, 1564910, 1610844, 1655788, 1699589, 1742923, 1786488, 1830633, 1875442, 1920672, 1965486, 2008671, 2049585, 2088741, 2127133, 2165129, 2202487, 2239236, 2275785, 2312132, 2347720, 2382344, 2416509, 2450425]
53428B450425L2752L0362K7870K6584K6601K6860K6149K3945K0708J7415J4680
53417B724351J2338J0069Q017O382M729K210j605o497j1827j6610j9781k1081
53405B690695k1488k2194k3374k4527k5604k7015k8699l0068l0926l1754l2913
53394B392133l4137l4845l4570l3201l1270k9852k9523k9491k8396k5971k3353
53383B057524k1582k0375j8571j5479j1571q026n642m187k866j220P98L404O795
53370A959002J0290J2770J4383J6668K0223K3495K5026K5880K8306L2606L6978
53359B205627M0127M2406M4368M5855M6920M8343N0691N3730N7125O0871O4815
53348B760878O8511P1824P4974P7949Q0537Q2970Q5722Q8722R1502R3950R6032
$$ y = [2450425, 2483177, 2513539, 2541409, 2567993, 2594594, 2621454, 2647603, 2671548, 2692256, 2709671, 2724351, 2736689, 2746758, 2754775, 2761157, 2765886, 2768096, 2766491, 2759994, 2748167, 2731557, 2711776, 2690695, 2669207, 2647013, 2623639, 2599112, 2573508, 2546493, 2517794, 2487726, 2456800, 2425046, 2392133, 2357996, 2323151, 2288581, 2255380, 2224110, 2194258, 2164735, 2135244, 2106848, 2080877, 2057524, 2035942, 2015567, 1996996, 1981517, 1969946, 1961920, 1956278, 1952091, 1949225, 1948005, 1948803, 1952207, 1959002, 1969292, 1982062, 1996445, 2013113, 2033336, 2056831, 2081857, 2107737, 2136043, 2168649, 2205627, 2245754, 2288160, 2332528, 2378383, 2425303, 2473646, 2524337, 2578067, 2635192, 2696063, 2760878, 2829389, 2901213, 2976187, 3054136, 3134673, 3217643, 3303365, 3392087, 3483589, 3577539, 3673571]
53337C673571R7039R6392R5104R5055R6509R7615R6766R4244R1040Q7328Q2890
53326D703553P8129P3721O9705O5589O0932N5559M9521M3022L6020K8050J9127
53315E282928J0537L635k101q671j7169k6901l6993m7277n7183o5343p1208p5970
53303D888284q0960q6029r0205r2950r4063r3479r1962r0965r0831r0115q7689
53292C899036q4574q2593q2074q2036q1831q1295p9967p7549p4737p2320o9929
53281C030131o6809o3396o0637n8128n4479m9579m4988m1882l9871l8155l6623
53270B475584l5233l3409l0774k7903k5724k4551k3979k3280k1712j9021j5822
53259B194176j3088j1108r386p614n935m145j569J796M866O911Q778J1738J5576
$$ y = [3673571, 3770610, 3867002, 3962106, 4057161, 4153670, 4251285, 4348051, 4442295, 4533335, 4620663, 4703553, 4781682, 4855403, 4925108, 4990697, 5051629, 5107188, 5156709, 5199731, 5235751, 5263801, 5282928, 5293465, 5297100, 5294999, 5286328, 5269159, 5242258, 5205265, 5157988, 5100805, 5035462, 4964254, 4888284, 4807324, 4721295, 4631090, 4538140, 4444077, 4350598, 4258636, 4167671, 4076840, 3986725, 3899036, 3814462, 3731869, 3649795, 3567759, 3485928, 3404633, 3324666, 3247117, 3172380, 3100060, 3030131, 2963322, 2899926, 2839289, 2781161, 2726682, 2677103, 2632115, 2590233, 2550362, 2512207, 2475584, 2440351, 2406942, 2376168, 2348265, 2322541, 2297990, 2274011, 2250731, 2229019, 2209998, 2194176, 2181088, 2169980, 2160594, 2152980, 2147045, 2142900, 2141331, 2143127, 2147993, 2154904, 2163682, 2175420, 2190996]
53246B190996J8870K1077K3181K5965K8672L0198L0993L2650L5700L8788M0430
53235B517520M0789M1226M2481M3985M4662M3827M1497L8406L5637L3619L1531
53224B955180K8309K4183K0460J7616J4445R556L168l083p830j1083j3955j7632
53212C019334k2369k7298l1404l4693l7956m1401m4235m5801m6471m6995m7605
53201B593106m8213m8911m9748n0602n1699n3485n5362n5456n2771m8985m6820
53190B031054m6887m7508m7501m7632m8749m9929m9503m7168m4090m1382l9384
53179A521321l8125l7460l6691l4943l2236k9635k7923k6650k4993k3164k2196
53168A187305k2404k2843k2543k1749k1349k1589k1917k1898k1710k1746k2206
$$ y = [2190996, 2209866, 2230943, 2254124, 2280089, 2308761, 2338959, 2369952, 2402602, 2438302, 2477090, 2517520, 2558309, 2599535, 2642016, 2686001, 2730663, 2774490, 2815987, 2854393, 2890030, 2923649, 2955180, 2983489, 3007672, 3028132, 3045748, 3060193, 3069749, 3072917, 3069834, 3062004, 3050921, 3036966, 3019334, 2996965, 2969667, 2938263, 2903570, 2865614, 2824213, 2779978, 2734177, 2687706, 2640711, 2593106, 2544893, 2495982, 2446234, 2395632, 2343933, 2290448, 2235086, 2179630, 2126859, 2077874, 2031054, 1984167, 1936659, 1889158, 1841526, 1792777, 1742848, 1693345, 1646177, 1602087, 1560705, 1521321, 1483196, 1445736, 1409045, 1374102, 1341866, 1312231, 1284308, 1257658, 1232665, 1209501, 1187305, 1164901, 1142058, 1119515, 1097766, 1076417, 1054828, 1032911, 1011013, 989303, 967557, 945351]
53157I45351k2976k3448k2731k0659j8508j7825j8486j8752j7490j5480j4077
53146G34919j3433j2745j1623j0415r555r337j0011j1411j2654j2860j2062j0885
53134E97928r626q351p573p912q906r084p632n452m180m495n665o407n988m680
53120E01977l452l057l260l148k251j074m38n18q85j268j875k955m266n098m752
53105D63680k981l16K003K661J340q21k132j901r03l43o19j226j494j081q8Q43
53089D56622Q15m19j986k765k677k472k370j707j74J289J355j61j979k479j101
53074D39791J077K147J143r06k058j571m12L17O41J047J338R74Q3n77n86k39P7
53057D42286K95L78R7o46j428j569q40K13Q68R61P87M24l50j299j617j032m34
$$ y = [945351, 922375, 898927, 876196, 855537, 837029, 819204, 800718, 781966, 764476, 748996, 734919, 721486, 708741, 697118, 686703, 677148, 667811, 657800, 646389, 633735, 620875, 608813, 597928, 588302, 579951, 572378, 564466, 555560, 546476, 538844, 533392, 529212, 524717, 519052, 512645, 506657, 501977, 498525, 495468, 492208, 489060, 486809, 485735, 485297, 484779, 483894, 482626, 480751, 477796, 473530, 468432, 463680, 460699, 460383, 462386, 465047, 466387, 465566, 463434, 461533, 460630, 460287, 459668, 458442, 456948, 455867, 455779, 456622, 457437, 457018, 455032, 452267, 449590, 447118, 444748, 443041, 442867, 444156, 445511, 445350, 443371, 440892, 439791, 440868, 443015, 444158, 443252, 441194, 439623, 439211, 439528, 440169, 441216, 442554, 443528, 443611, 443034, 442448, 442209, 442286, 442581, 442959, 443056, 442410, 440982, 439413, 438573, 438786, 439654, 440615, 441402, 441826, 441476, 440177, 438560, 437528, 437094]
53040D37094p36j670k371k630k625j996n16O93J88j546k459j754q07q27j250j257
53024D15531j246j687j889j212l26M8O13K221L935L984K219J01j330k124k464
53009D16374k384k186j935r37J029K494J967L75n6Q16R69k60j027j16R42M62o25
52992D15902m38O89Q56k59j060p40l31o12p29K05J426J595P74J32P1k14j316k818
52974D13133m065m820m772l395j048O02L71p27p27N21J169J08j559k274j992j550
52958C88975j120m03L39O34P62J339K213K664K429J693M38j188k114j196J102
52943C96567K875K865J621M51oM1J09q7m32n06k58k75r45j592j155M71K406L884
52925D06034M700M858M613M508M555L688J225j514k410j369m36r03j791j673n32
$$ y = [437094, 436358, 434688, 432317, 429687, 427062, 425066, 424550, 425243, 425431, 423885, 421426, 419672, 418865, 418038, 416788, 415531, 414285, 412598, 410709, 409497, 409171, 409219, 409832, 412053, 415988, 419972, 422191, 422292, 420962, 418838, 416374, 413990, 411804, 409869, 408932, 409961, 412455, 414422, 414797, 414741, 415557, 416526, 416266, 415239, 415123, 416065, 416527, 415902, 415464, 416153, 417009, 416750, 415690, 414950, 414619, 414007, 413278, 413483, 414909, 416504, 417278, 417410, 417481, 417267, 415951, 413133, 409068, 404248, 399476, 396081, 395033, 395635, 396006, 395279, 394552, 395073, 396242, 396350, 394791, 392517, 390525, 388975, 387855, 387452, 387791, 388425, 389187, 390526, 392739, 395403, 397832, 399525, 399963, 398775, 396661, 395465, 396567, 399442, 402307, 403928, 404379, 404373, 404414, 404523, 404436, 404004, 403498, 403240, 402965, 402020, 400428, 399273, 399744, 402150, 406034, 410734, 415592, 420205, 424713, 429268, 432956, 434181, 432667, 430257, 428888, 428452, 427549, 425758, 424085, 423553]
52910D23553Q78K234L260L352K570K052K465K831K002N02k32O7M25L57M02Q92
52894D47610J167L82j436l330m142l360j610k04O4n02j234j883k352k331j738
52879D25101j134r48o94K60J457J695N57j160k546l370l739l679l348l117l077
52864D02258k802j839l81P27O50o12k020k316j321m3N92O84P16N41k72j371j863
52847C91328j480p74j39N83J357J583Q17n20j482j349j24J224J163q54l215l409
52831C84709r36J955K891J906P01K91M88R46J426J373N00k77J82J341J449J96
52815C99141o22K60J680J896J204J255K380L210K807J867J466J620J534O75p11
52800D19662j754j627m01Q05R72K25o93j590k714l818m277l992l375k607j780
$$ y = [423553, 424431, 426665, 429925, 433277, 435847, 437899, 440364, 443195, 445197, 445699, 445467, 445534, 445959, 446316, 446718, 447610, 448777, 449159, 447723, 444393, 440251, 436891, 435281, 435077, 435141, 434639, 433405, 431522, 429170, 426839, 425101, 423967, 423019, 422325, 422585, 424042, 425737, 426294, 425134, 422588, 419218, 415479, 411800, 408452, 405335, 402258, 399456, 397617, 397236, 397963, 398613, 398001, 395981, 393665, 392344, 392301, 392893, 393577, 394293, 394834, 394562, 393191, 391328, 389848, 389074, 388935, 389518, 390875, 392458, 393275, 392755, 391273, 389924, 389800, 391024, 392187, 391333, 388118, 384709, 383773, 385728, 388619, 390525, 391226, 391517, 392005, 392951, 394377, 395750, 396250, 395973, 396155, 397496, 398945, 399141, 398519, 398779, 400459, 402355, 403559, 404814, 407194, 410404, 413211, 415078, 416544, 418164, 419698, 420373, 419662, 417908, 416281, 415880, 416685, 417657, 417882, 417189, 415599, 412885, 409067, 404790, 400798, 397423, 394816, 393036]
52785C93036j450k012k763k855k836l734m868m494k758j747k026j550P23K538
52771C63204J636n16p34J333L142L089K019J122N32J44j0l86j341k042j499n48
52755C69145q89k199k233k67J659J630K30r41j431j390l36K025M537N466M277
52740C79283J853n44j880j741q93r44k566m417m465k215P65K284J418n94j356
52725C63988J15K066K082L46o92M7Q51J49r42n34R79J576O83j67L92J911K920
52708C75770K407M59j862l268l367k797k073r50N97J644J490Q27O48O90J37o52
52692C69700o69k24o81k067k590j221O78J354J284K375M928O771N807K646K7l4
52676C88084J911L704L837K511R75L29Q80K064K826K502J511Q86J021J303J053
$$ y = [393036, 391586, 389574, 386811, 383956, 381120, 377386, 372518, 368024, 365266, 363519, 361493, 359943, 360666, 363204, 364840, 364324, 363590, 364923, 368065, 371154, 373173, 374295, 374827, 374971, 374961, 374575, 373234, 371192, 369693, 369145, 368256, 366057, 363824, 363557, 365216, 366846, 367076, 366135, 364704, 363314, 362978, 365003, 369540, 375006, 379283, 381136, 380592, 378712, 376971, 376078, 375134, 372568, 368151, 363686, 361471, 362236, 364520, 365938, 365344, 363988, 364103, 366169, 368251, 368597, 367905, 367952, 368803, 368952, 368010, 367476, 368455, 370031, 370714, 370547, 370939, 372850, 375770, 378177, 378636, 376774, 373506, 370139, 367342, 365269, 364319, 364916, 366560, 368050, 368877, 369525, 370215, 370352, 369700, 369031, 368807, 368126, 366059, 363469, 362248, 362926, 364280, 365564, 367939, 372867, 379638, 385445, 388091, 388118, 388084, 389995, 393699, 397536, 400047, 401022, 401351, 402231, 404295, 407121, 409623, 411134, 412020, 413041, 414344, 415397]
52661D15397L25m24r13j005n82M1O8r17k239k778k152r96j77o3m06p51r96j548
52643C99884k645l694l760k731j417m00M94J385J848J624J186J032R88P38N53
52628C95085Q86J549J852J378M03l20r9Q99J429N08j038j385k80M16o50k392k892
52611C95349j953q52l17ON03J100J614J786J302M67L60J522K953L307K495J313
52595D10955K34m40J0J797L648M085L297K393J392l22j968j841J1J516J437Q12
52579D27016P85P37l83k154l272l209k298r39K99N76k93j228j130l05J25j38m53
52562D13736m22l14k96j28L01O67P13O60Q62J306J567J229L08o24q24K0J511K807
52544D23079L133K226N67q10j061k06R81J779K011J850J393N81n13j405j358j37
$$ y = [415397, 415722, 415298, 414385, 413380, 412798, 412839, 412907, 411990, 409751, 406973, 404821, 403825, 403648, 403585, 403179, 402428, 401432, 399884, 397239, 393545, 389785, 387054, 385637, 385237, 385731, 387116, 388964, 390588, 391774, 392806, 393794, 394532, 395085, 395971, 397520, 399372, 400750, 401153, 400833, 400734, 401633, 403062, 403570, 402532, 401147, 400867, 401283, 400633, 398241, 395349, 393396, 392544, 392227, 392233, 392736, 393836, 395450, 397236, 398538, 399005, 399365, 400887, 403840, 407147, 409642, 410955, 411189, 410749, 410759, 412556, 416204, 420289, 423586, 425979, 427371, 427049, 425081, 423240, 423251, 424767, 426204, 427016, 427801, 428538, 428155, 426001, 422729, 419520, 417222, 416283, 416582, 417158, 416865, 415637, 414507, 414202, 414327, 414189, 413736, 413314, 413000, 412704, 412576, 412877, 413544, 414257, 414917, 415779, 417085, 418652, 419881, 420189, 419565, 418741, 418761, 420272, 423079, 426212, 428438, 429005, 428195, 427134, 426928, 427909, 429688, 431699, 433549, 434942, 435523, 435010, 433605, 432247, 432110]
52528D32110J414J969J172R8p4O24J340J630J612J331Q29N99J146K012K106J170
52512D51088J68j03j06q14k297l557l642k601j315m94j3O31J314J249K24p35m94
52495D38503O69J320N29j222k591k478q62R79J408J61j226j249j63Q06J225J294
52479D37103O21j148k770k265K15K159J976R67J025J755J419j51j230o53P28J341
52463D41092P50j66m24M0N19M82K06K31M56L15j44r9Q19J814J953J477J464K410
52445D53195L664M249L891L060K186J009r25l154m238l393j767j189j858k259
52431D52471j394j4O95N55M1n53q99l90Q94J670R05n16o50R83K672K573R27k71
52413D59699M38K390L676L406K606K646L296L173J913P35O10R34P17K43N81J862
$$ y = [432110, 433524, 435493, 436665, 436763, 436689, 437313, 438653, 440283, 441895, 443226, 444055, 444654, 445800, 447812, 449918, 451088, 451256, 451153, 451047, 450233, 447936, 444379, 440737, 438136, 436821, 436327, 436314, 436945, 438259, 439508, 439732, 438997, 438503, 439172, 440492, 441021, 439799, 437208, 434730, 433868, 434847, 436255, 436416, 435190, 433941, 433778, 434584, 435809, 437103, 437724, 436576, 433806, 431541, 431756, 433915, 435891, 436858, 437883, 439638, 441057, 440906, 439676, 439023, 439751, 441092, 441842, 441676, 441252, 441292, 441811, 442293, 442499, 442730, 443186, 443501, 443357, 443258, 444077, 445891, 447844, 449321, 450785, 453195, 456859, 461108, 464999, 468059, 470245, 471254, 470329, 467175, 462937, 459544, 457777, 456588, 454730, 452471, 451077, 451063, 451758, 452313, 452354, 451801, 450902, 450512, 451406, 453076, 453981, 453465, 452815, 453798, 456470, 459043, 459970, 459699, 460137, 462527, 466203, 469609, 472215, 474861, 478157, 481330, 483243, 483978, 484588, 485522, 486239, 486482, 487063, 488925]
52397D88925K934K667R97j170k620k571j335j58M0m13o63o43j051k210l632m703
52381D74394n194m946l701j616L40R85M6j415j889q61P20J548J368Q79M64k13
52365D60909j114j235J47K168L132K489J294P84J189K014K762L041K586J818J993
52350D83977M104P457R915R921Q120O697P150Q989J0419R960P349L508o1k202
52336E75303k956l346m156n227o145o939p510p003m803j843J29O16O93J164J573
52321E29550J428J342K184L673M619M296L210K667L652N756P211O682N049M506
52307E85825N731P118P161O347N826N423M309K828K160K445K639K207J733J728
$$ y = [488925, 491859, 494526, 495523, 494353, 491733, 489162, 487827, 487669, 487709, 487296, 486633, 485990, 484939, 482729, 479097, 474394, 469200, 464254, 460553, 458937, 459277, 460262, 460308, 458893, 457004, 456143, 456863, 458411, 459779, 460658, 461122, 460909, 459795, 458560, 458707, 460875, 464007, 466496, 467790, 468574, 469763, 471777, 474539, 477580, 480166, 481984, 483977, 488081, 495538, 505453, 515374, 523494, 530191, 537341, 546330, 556749, 566709, 574058, 577566, 577505, 575303, 572347, 569001, 564845, 559618, 553473, 546534, 539024, 532021, 527218, 525375, 525504, 526120, 526813, 527977, 529550, 530978, 532320, 534504, 538177, 542796, 547092, 550302, 552969, 556621, 562377, 569588, 576270, 581319, 585825, 591556, 598674, 605835, 612182, 618008, 623431, 627740, 630568, 632728, 635173, 637812, 640019, 641752, 643480]
$$ [...]
##END NTUPLES=NMR SPECTRUM
##END=
