
##TITLE=UV1142_M5-1005-1002_6275452_z4RHDX7KgL
##JCAMPDX= 6.0         $$ Bruker NMR JCAMP-DX V2.0
##DATA TYPE= NMR SPECTRUM
##DATA CLASS= NTUPLES
##ORIGIN= BRUKER
##OWNER= Administrator
$$ 1.72 TOPSPIN		Version 2.1
$$ 2012-06-07 02:57:01.265 -0500  Administrator@TOPSPIN
$$ Compression mode = diff/dup
##.OBSERVE FREQUENCY= 400.13188235
##.OBSERVE NUCLEUS= ^1H
##.ACQUISITION MODE= SIMULTANEOUS (DQD)
##.ACQUISITION SCHEME= undefined
##.AVERAGES= 8
##.DIGITISER RES= 22
##SPECTROMETER/DATA SYSTEM= spect
##.PULSE SEQUENCE= zg30
##.SOLVENT NAME= COFFEE_meoh
##.SHIFT REFERENCE= INTERNAL, COFFEE_meoh, 1, 14.98061
##AUDIT TRAIL= $$ (NUMBER, WHEN, WHO, WHERE, PROCESS, VERSION, WHAT)
$$ ##TITLE= Audit trail, TOPSPIN		Version 2.1
$$ ##JCAMPDX= 5.01
$$ ##ORIGIN= Bruker BioSpin GmbH
$$ ##OWNER= Administrator
$$ $$ C:\Bruker\TOPSPIN/data/COFFEE/nmr/UV1142_M5-1005-1002_6275452_z4RHDX7KgL/20/pdata/1/auditp.txt
$$ ##AUDIT TRAIL=  $$ (NUMBER, WHEN, WHO, WHERE, PROCESS, VERSION, WHAT)
(   1,<2012-06-07 02:56:52.812 -0500>,<Administrator>,<TOPSPIN>,<go>,<TOPSPIN 2.1>,
      <created by zg
	started at 2012-06-07 02:55:46.265 -0500,
	POWCHK enabled, PULCHK disabled,
       configuration hash MD5:
       D5 CA 7A 23 FE 6B EE E2 50 67 74 61 24 F7 5E 3B
       data hash MD5: 64K
       AD 57 EE 69 0E 98 FC 4A DE B5 B6 F0 EF 8E 03 5A>)
(   2,<2012-06-07 02:56:56.984 -0500>,<Administrator>,<TOPSPIN>,<proc1d>,<TOPSPIN 2.1>,
      <Start of raw data processing
       efp LB = 0 FT_mod = 6 PKNL = 1 PHC0 = 0 PHC1 = 0 SI = 32K 
       data hash MD5: 32K
       3B 41 87 1F A5 03 F7 6E 15 A2 20 3A 8C 10 7E E2>)
(   3,<2012-06-07 02:56:57.375 -0500>,<Administrator>,<TOPSPIN>,<proc1d>,<TOPSPIN 2.1>,
      <pk PHC0 = 210.8331 PHC1 = 0 
       data hash MD5: 32K
       55 3D 6D CD 1D 2F CB C4 C0 C7 CF 75 2D 95 2B E1>)
(   4,<2012-06-07 02:56:57.437 -0500>,<Administrator>,<TOPSPIN>,<proc1d>,<TOPSPIN 2.1>,
      <abs ABSG = 1 
       data hash MD5: 32K
       11 2C C2 A2 37 03 A6 65 AF 58 EE 15 8B 0D D8 43>)
(   5,<2012-06-07 02:56:57.468 -0500>,<Administrator>,<TOPSPIN>,<proc1d>,<TOPSPIN 2.1>,
      <abs ABSG = 2 
       data hash MD5: 32K
       29 EC 1A 1A B4 C8 CD 24 18 07 13 F7 F3 8A B5 F2>)
(   6,<2012-06-07 02:56:57.500 -0500>,<Administrator>,<TOPSPIN>,<proc1d>,<TOPSPIN 2.1>,
      <abs ABSG = 3 
       data hash MD5: 32K
       54 76 F2 5A EC 4B B1 2C 74 B2 D0 8C 0F 5B 42 E0>)
(   7,<2012-06-07 02:56:57.531 -0500>,<Administrator>,<TOPSPIN>,<proc1d>,<TOPSPIN 2.1>,
      <abs ABSG = 4 
       data hash MD5: 32K
       28 A2 08 64 19 07 1C 47 0C 3F 35 FD 24 E4 90 80>)
(   8,<2012-06-07 02:56:57.562 -0500>,<Administrator>,<TOPSPIN>,<proc1d>,<TOPSPIN 2.1>,
      <abs ABSG = 5 
       data hash MD5: 32K
       FD 0D 84 A3 01 1D 4E 76 53 D7 CF 6C B3 1A D2 73>)
$$ ##END=
$$ 
$$ $$ hash MD5
$$ $$ B7 57 39 3D A5 34 D7 B9 50 A6 C5 FF 93 03 3C 1F
##$RELAX= 
##$RELAX= 
##$RELAX= 
##$RELAX= 
##$RELAX= 
##$RELAX= 
##$RELAX= 
$$ Bruker specific parameters
$$ --------------------------
$$ [...]
150 150 150 150 150 150 150 150
##$TP07= 0
##$TPNAME0= <>
##$TPNAME1= <>
##$TPNAME2= <>
##$TPNAME3= <>
##$TPNAME4= <>
##$TPNAME5= <>
##$TPNAME6= <>
##$TPNAME7= <>
##$TPOAL= (0..7)
0.5 0.5 0.5 0.5 0.5 0.5 0.5 0.5
##$TPOFFS= (0..7)
0 0 0 0 0 0 0 0
##$TUNHIN= 0
##$TUNHOUT= 0
##$TUNXOUT= 0
##$USERA1= <user>
##$USERA2= <user>
##$USERA3= <user>
##$USERA4= <user>
##$USERA5= <user>
##$V9= 5
##$VALIST= <valist>
##$VCLIST= <CCCCCCCCCCCCCCC>
##$VD= 0
##$VDLIST= <DDDDDDDDDDDDDDD>
##$VPLIST= <PPPPPPPPPPPPPPP>
##$VTLIST= <TTTTTTTTTTTTTTT>
##$WBST= 2048
##$WBSW= 25
##$XGAIN= (0..3)
0 0 0 0
##$XL= 0
##$YL= 0
##$YMAX_a= 500686
##$YMIN_a= -602357
##$ZGOPTNS= <>
##$ZL1= 120
##$ZL2= 120
##$ZL3= 120
##$ZL4= 120
##$ABSF1= 14.98061
##$ABSF2= -5.57192
##$ABSG= 5
##$ABSL= 3
##$ALPHA= 0
##$AQORDER= 0
##$ASSFAC= 0
##$ASSFACI= 0
##$ASSFACX= 0
##$ASSWID= 0
##$AUNMP= <proc_prof1d_extract_pilot.lims>
##$AXLEFT= 0
##$AXNAME= <>
##$AXNUC= <1H>
##$AXRIGHT= 0
##$AXTYPE= 0
##$AXUNIT= <>
##$AZFE= 0.1
##$AZFW= 0.1
##$BCFW= 0
##$BC_mod= 0
##$BYTORDP= 0
##$COROFFS= 0
##$CY= 15
##$DATMOD= 1
##$DC= 0
##$DFILT= <>
##$DTYPP= 0
##$F1P= 0
##$F2P= 0
##$FCOR= 0.5
##$FTSIZE= 32768
##$FT_mod= 6
##$GAMMA= 0
##$GB= 0
##$INTBC= 1
##$INTSCL= 1
##$ISEN= 128
##$LB= 0
##$LEV0= 0
##$LPBIN= 0
##$MAXI= 10000
##$MC2= 0
##$MEAN= 0
##$ME_mod= 0
##$MI= 0
##$NCOEF= 0
##$NC_proc= -8
##$NLEV= 6
##$NOISF1= 0
##$NOISF2= 0
##$NSP= 0
##$NTH_PI= 0
##$NZP= 0
##$OFFSET= 14.98061
##$PC= 1
##$PHC0= 210.8331
##$PHC1= 0
##$PH_mod= 1
##$PKNL= yes
##$PPARMOD= 0
##$PPDIAG= 0
##$PPIPTYP= 0
##$PPMPNUM= 2147483647
##$PPRESOL= 1
##$PSCAL= 4
##$PSIGN= 0
##$PYNMP= <proc.py>
##$REVERSE= no
##$SF= 400.13
##$SI= 32768
##$SIGF1= 0
##$SIGF2= 0
##$SINO= 400
##$SIOLD= 32768
##$SPECTYP= <>
##$SREGLST= <1H.CDCl3>
##$SSB= 0
##$STSI= 32768
##$STSR= 0
##$SW_p= 8223.68421052632
##$SYMM= 0
##$S_DEV= 0
##$TDeff= 65536
##$TDoff= 0
##$TI= <>
##$TILT= no
##$TM1= 0
##$TM2= 0
##$TOPLEV= 0
##$USERP1= <user>
##$USERP2= <user>
##$USERP3= <user>
##$USERP4= <user>
##$USERP5= <user>
##$WDW= 1
##$XDIM= 32768
##$YMAX_p= 461146146
##$YMIN_p= -637240
##$CURPLOT= <Network HP LaserJet P1505>
##$CURPRIN= <$Network HP LaserJet P1505>
##$DFORMAT= <normdp>
##$LAYOUT= <+/1D_H.xwp>
##$LFORMAT= <normlp>
##$PFORMAT= <normpl>
##$SURQMSG= 1
$$ End of Bruker specific parameters
$$ ---------------------------------
##NTUPLES= NMR SPECTRUM
##VAR_NAME=  FREQUENCY,     SPECTRUM/REAL,   SPECTRUM/IMAG
##SYMBOL=    X,             R,               I
##VAR_TYPE=  INDEPENDENT,   DEPENDENT,       DEPENDENT
##VAR_FORM=  AFFN,          ASDF,            ASDF
##VAR_DIM=   32768,         32768,           32768
##UNITS=     HZ,            ARBITRARY UNITS, ARBITRARY UNITS
##FACTOR=    0.250966925370066, 1,           1
##FIRST=     8223.43324360095, -58916,       -45633
##LAST=      0,             -115208,         -302975
##MIN=       0,             -637240,         0
##MAX=       8223.43324360095, 461146146,    0
$$ Real data points
##PAGE= N=1
##DATA TABLE= (X++(R..R)), XYDATA
$$ [...]
23866 108142 -47213 -20521 70187 -136910 48733 -26939 -26061 -48618 51947 166636 -20231
23854 212608 -79952 -90946 47997 -156896 115528 79627 462404 29825 -62424 -5045 13146
23842 54218 -28296 146513 10442 250985 -149340 67382 -290896 -250643 -119901 180736
23831 -14417 -20071 -301575 -65696 -89166 348299 -152068 -162938 162724 -35569 -93220 138615
23819 -139134 189317 -79564 -299841 82402 24786 149928 222428 279625 4054 -292256 215396
23807 -178865 -42963 -25318 325491 -37178 -218348 -166258 107815 -205341 264825 69947
23796 -37738 -90179 -290708 -141702 150071 -249318 -19138 110433 -78355 -24371 216103
23785 78022 329159 125870 110364 -220438 -93028 -264489 -21139 169792 72370 -100153
23774 -179115 -12680 164063 43902 -192077 -62692 -281061 -58622 133780 -70310 -39262 18959
23762 -115743 -87725 168731 29698 227245 132041 -125142 141246 9237 -160844 -34437 46287
23750 76750 -258138 -281700 -84461 181946 109002 -34681 -3446 26618 61501 -1802 23823 -195381
23737 108104 -149475 -213479 128396 260726 -87363 225751 77139 -99593 -72636 -106949 -208443
23726 -208443 56012 -145516 153576 15350 92963 -431008 -377910 -114382 92586 -176562
23715 12911 -80829 9509 33167 335981 94345 7868 -87725 224299 -22565 226368 -288874
23703 -13751 -126187 75991 -146914 -189188 307986 91201 -201368 -29587 -234483 59899 -116687
23691 122705 -92683 -4357 -85008 -268053 71290 134514 172062 233109 67805 265951 178318
23680 178318 -132740 147930 -145868 176271 -101684 36473 -224750 -112085 -361408 -84657
23669 -529676 170418 -300413 -85903 -202407 -39631 70149 -38896 145039 -205397 130458
23658 65517 72563 -5233 -52610 -294724 -115135 -49920 -48623 251635 116798 -144210 -45925
23646 31103 142585 -95664 -118697 116617 110437 92508 31868 -62365 164101 -126770 -1187
23634 19867 248494 -120520 -298613 -124652 224857 142658 -208755 35877 -131083 -54994
23623 343615 -118401 171991 234523 171031 201205 82323 23580 -194804 -15760 -237931 -2019
23611 -167255 -7381 -242194 -251611 -80661 -92142 -61916 119361 -115125 -8010 -128702 -89408
23600 -89408 -239756 36570 189220 -210497 -194267 -172475 186900 213073 37203 76997 270088
23589 270088 42143 167546 -47258 68379 -174182 -178832 148735 -23521 297619 -37254 142371
23577 388874 135627 -36513 -407063 196109 -183991 71854 160755 157494 27197 77490 99399
23566 99399 -114529 67532 -106309 -30821 114981 -63565 67062 -350023 60481 36431 -268984
23554 -165915 -42913 207758 -36058 -23860 -71125 -61151 301321 -105056 223890 294041 -73137
23542 316462 152928 41050 156039 207506 -54575 -200928 171670 -225989 -166604 -130627
23532 -130627 85934 -130545 148880 128202 139707 -151170 -127320 -171454 95511 37094 -224844
23520 344685 59849 272234 -218297 -159720 108916 -61161 -108668 126373 -131135 -34925
23509 -300627 38840 127174 -61510 -220593 -259590 -30138 -154979 246003 -229928 -269435 -140858
23498 -140858 114861 -124257 237192 -46034 -8548 -359149 -180210 -227156 3712 147334 24347
23486 -218973 -248003 179725 -94305 -209122 277165 75326 -196630 -265679 -238871 6880 -42444
23474 -131064 -251678 -75022 140066 12049 -29890 202046 -13630 68380 317025 138049
23463 -12855 124599 -228975 105619 119331 260312 42120 144270 13975 -30240 -67250 -373313
23452 -373313 -128992 43626 185132 54246 -119613 -143972 -33160 83639 -71283 -118331 -287649
23441 -287649 11952 -182252 17649 -107697 -84028 87832 37627 -38159 24776 8240 -208152
23429 291524 70087 -150092 -130343 -39481 -221839 94503 52839 -167347 220310 255513 -219078
23417 516700 -36040 242740 252944 -36160 -91948 -111542 -211900 -144065 33527 248491 -46481
23405 -147199 85706 -175191 65239 -280185 119100 -51337 -26065 219404 281126 42237 71753
23394 71753 6415 34485 -141545 11364 92438 51580 -128443 12187 20423 -205399 -35557
23382 -74882 -4494 -46671 -96582 -374140 88771 1454 -85842 -66541 306187 181122 -206470
23370 -10098 -91044 177538 -25768 -6878 -54301 -349045 -263649 49495 99493 211264 202550
23359 202550 46562 64482 17556 -66662 -137980 -35972 4611 462116 -281786 -110303 278677
23347 203400 201686 165623 -137297 44443 -34073 -51746 379351 -116518 72733 -175218 237370
23335 6890 -101324 -92661 -113522 -219357 -96039 114784 -97817 61038 -82220 -135895 -302330
23324 -302330 -136193 -94045 -58492 106807 87694 -75446 -139998 -324990 -33360 41600 6998
23312 -316310 -56863 -167532 -200010 -17107 -102431 66999 -63892 -228580 -27656 192039 -40508
23300 74020 -184678 269400 243995 115789 120809 -270545 -243834 -150360 -169099 42597 -32515
23288 25692 -42622 -239139 76788 -34637 105224 -17177 190445 27612 -383625 68835 289763
23277 289763 -167125 -259647 136934 -76662 218432 134020 -315183 -231225 -148551 -338015
23267 -338015 -12314 -310371 116264 101412 -182020 -273173 -315266 -45106 73899 -170254 152085
23255 28313 -116183 153644 152347 95823 155818 77338 -249618 -82811 -17668 103025 -149089
23243 7798 -164022 -95986 236062 36333 158499 -228857 -67895 43857 -239122 -100974 243736
23231 118102 -4607 97864 223583 -160436 286417 -2416 -145624 -48661 196562 -43349 -135563
23220 -135563 -141239 221875 -97571 166172 78032 227233 14395 -19237 -28333 36825 -225510
23208 101569 405162 37281 -94250 226395 244423 310839 175016 -134241 162957 304512
23198 304512 -322879 -46920 -79061 136252 -150998 -210294 -108065 -204542 -249787 -153829 -87849
23187 -87849 360546 295830 -170000 -8966 -21064 -128879 138989 29699 156709 -16996 179037
23175 172269 -159173 -41786 -452669 268034 -8304 -124962 346364 28416 -1769 -10257 126415
23163 209306 -332913 -227501 -87192 94967 79106 -73212 -234111 -380710 409638 32120
23152 86946 25663 -242982 -31966 -225564 -44959 -26692 103587 83333 161889 -323366 18092
23140 -33657 -39468 -204158 -48100 -150865 -190083 313884 116443 209344 -68099 -65520 -210758
23129 -210758 -57897 163436 155609 -36659 -5487 -140024 31307 -45013 -156021 63996 13495
23117 55863 30050 -150363 75302 90582 -33409 39902 258722 31282 76251 50747 173849
23106 173849 83901 -229763 -102433 -280658 404048 -11028 31013 -26431 -119008 -315667
23096 -315667 -22899 -89278 -124179 186855 119967 -72447 -11227 181783 -25240 -45267 194146
23084 126515 190991 -98439 -26163 -287762 161383 170249 285265 -160893 -213190 -69056 -146918
23073 -146918 -1902 54354 192852 -201014 307357 143294 161067 -220610 -106958 -286870
23063 -286870 -186879 17597 -280113 196853 -49020 1155 -78393 -81642 23621 -47954 933 -5569
23050 85715 164302 12359 -141937 -283098 -70135 167789 -153946 273494 4551 101031 96448
23039 96448 -14818 -132876 -57619 -135457 -112856 176133 41923 -298818 79071 -27717 -108549
23028 -108549 8664 -46272 -239252 -59325 274531 -48039 -97487 -72354 34352 41743 -285610
23016 272065 17037 6330 32507 167537 252378 114251 -353741 24283 94488 -2217 28474
23004 -34987 -24133 -185035 -7318 57304 -15176 375322 38353 153476 -79409 312841 -160113
22992 -46398 74268 -214311 -224301 -172901 -189045 -275550 152514 -143202 -98320 -104704 262635
22980 -211543 -47701 -324881 -98074 -260415 -282210 135965 27089 17594 84994 378306 148524
22968 192771 172027 8141 -204991 129109 -212608 -357241 174453 -129504 381221 148548
22957 -157076 -340573 13339 -12401 -78045 -199790 -312914 161844 -440088 -122445 121757
22946 -166537 51930 196154 95928 209082 -24361 -112782 -251867 169 62900 -73012 -24389
22934 -285258 400343 164321 72756 -2900 385758 220524 -85449 54534 140311 66200 -215902
22922 161183 244269 -166751 -54638 256443 175895 -168608 -73113 -59208 5690 -19453 -238668
22911 -238668 -104723 -56275 204234 -31230 -350394 -78728 -10834 55420 196069 -181031
22900 -255684 193186 -142720 66011 -337296 83322 -39189 159770 -180485 114603 -52336
22889 -19533 431304 494349 60325 -82032 -89390 -83328 130381 226679 26935 121376 519 -14661
22876 -176423 -273878 134172 4161 -296283 -115523 90838 -283310 8770 212866 108232 -358325
22864 -289753 128093 23297 -102039 -296508 299067 207181 -432344 -293331 -109328 95728
22853 -211714 176621 -171591 -359043 -194201 527725 -69881 65437 -89848 -49113 -234346
22843 -234346 -178047 45576 -148496 37317 -90491 390715 90635 19031 151810 118537 -77871
22831 -68244 -292104 44449 -117606 -148270 529325 -354718 162447 50933 102481 -21249 11349
22819 111790 -191209 372832 -87704 318556 121462 327179 371634 -332317 -121969 336502
22808 -167999 -39989 189312 -120705 126908 182275 -176104 86359 -138038 -118588 -193534
22798 -193534 44618 330142 227763 74746 -155133 7075 -83795 157356 -371785 -14075 26159
22786 -330935 358531 85320 99486 214787 -132478 78632 -64398 -76651 -84292 -169630 -99584
22775 -99584 -133468 -58975 215259 -179842 263455 -259455 -124696 136642 -104719 -35872
22764 92734 -58480 -310245 -35053 -133460 85755 -335810 -214533 129328 -155089 -9143 63859
22752 -62508 99860 20669 -10958 229786 140057 142280 -114804 15938 106959 252313 -51849
22740 132931 -165549 -123102 -176543 -117576 -107293 -2203 119742 -25518 -298123 92985 -260774
22728 -290520 -103048 -61355 -32998 3075 -82515 -106857 -204504 -264057 -288079 12973 -235023
22716 -69671 24777 -41396 -282590 70619 23055 -164284 -64615 125970 -79281 -164628 -255249
22705 -255249 5667 214206 -255274 -412472 40808 -52969 90641 -19068 -109217 177376 -121323
22693 130485 168855 -70033 52628 -79977 161314 25675 -344442 5812 -105850 189760 -93345
22681 34108 -84040 -33298 -140868 64146 46899 114767 -179908 -876 -73650 -94242 -57963 -15053
22668 94102 58155 -22228 122617 203329 -22510 231679 35150 -300313 -318054 178141 -120154
22656 -38608 63582 299476 -37133 -146118 -163270 -172563 25498 -23984 -160650 190465 -177796
22644 -61336 187450 323332 181129 16353 69764 16981 158005 -235888 20570 368837
22634 368837 -80219 -206837 -160650 -237446 23974 -27366 -50882 -6362 -156221 106974 135473
22623 135473 -63535 -27666 -246313 199205 -29909 -28563 163251 -195477 -11051 180385 27427
22611 120742 157169 -83340 204978 147919 209743 91382 -58158 -281894 -84362 -104863 -103712
22600 -103712 -143090 -220810 229606 -141340 -132702 138365 41991 -76627 -7774 -312751 -34699
22588 172650 -120994 201793 -2577 -181947 75563 50497 -107330 91044 -24027 -452088 -174097
22576 -60870 -141633 89573 9667 157544 40833 -80787 -124751 -37940 -63489 11483 44683 -72653
22563 -15944 48289 243689 -37679 659103 -199742 295629 -119106 -125732 -180288 58407 201543
22552 201543 -80989 60932 -55178 204532 -10356 195575 118121 267949 -160867 -97336 -216986
22541 -216986 54124 158072 -84564 418107 284015 -471210 -22378 -62342 -285331 -248806
22531 -248806 86228 -361046 -330672 103668 110201 -173099 425006 192767 259063 -135616
22520 -124151 304365 -95801 87446 -215741 81445 -199787 75335 -84650 -151189 -69756 78991
22508 -457157 143528 -289841 103467 -268116 175168 110095 87028 -198047 -194560 -105805
22498 -105805 -278423 -58449 251915 -22888 76090 142205 105499 -30911 -135192 11306 -232471
22486 -179148 202827 -262144 -9376 -37291 -56183 114785 -121615 -290004 -60312 45599 88089
22475 88089 142332 168129 160043 111048 100290 -122816 231260 47344 -270321 -232728 -70787
22463 -86093 -16580 -87112 -332167 -240824 -115230 413513 -54510 91598 50420 118864 129583
22452 129583 399702 -116384 -84108 -37938 -213321 159167 126397 42448 -131449 -39184
22441 -196552 -26465 -201912 -259382 -187816 88737 85923 -298975 -192210 -1954 -28602 -104925
22430 -104925 -283104 82507 49897 190011 -418552 -94933 -17384 -49996 -127355 52633 -131179
22418 -63032 -155718 -153020 185573 2330 -289501 -256494 366940 -135976 -91207 139410 -192119
22406 162080 -65531 -115945 209756 -233220 58994 44856 40251 -7389 29451 137242 -15032
22394 -295446 203111 -120877 -56564 7140 187598 144391 -293340 -76444 -21918 -90395 195066
22382 164711 -95010 -111664 87448 -153422 274500 -128800 231707 274043 -128256 8049 -211142
22370 -458746 462309 -163132 -132137 -228153 -266814 18724 -267277 153689 39887 -355801
22359 -69062 58395 -166940 36012 -161032 -67443 76251 198138 -65367 -62197 395735 -80569
22347 -36166 -186667 66527 54649 59812 -107943 260613 -196232 -10359 82661 -270097 87803
22335 220727 346106 -190586 96511 -296545 157432 75589 269651 -134668 -260114 -189063
22325 -189063 -231512 -30580 -91220 -23527 36481 -162386 -139741 182906 58913 -199345 79917
22313 -79403 121874 -127387 -216361 -167369 -129205 -36399 54766 156898 53841 -36577 127881
22301 173754 47279 -123539 -17136 219086 -54561 315136 -19191 -372244 9294 -106377 -227991
22290 -227991 -116632 57886 137332 -15533 242224 -127008 -41290 102669 -431691 130432
22279 -342499 -15704 -158547 115991 -97742 -222283 -10887 282833 12482 108429 25353 146815
22268 146815 76210 -176561 124520 -179081 80718 -159824 111560 144462 34904 -310133
22257 21137 240121 -51474 218821 -28163 -204479 -325908 100321 -4099 -112147 82702 -139770
22245 24206 -85106 276603 -40038 -4649 19486 167762 -318118 -92644 -72226 -63722 419183
22233 166973 101837 62655 -281848 -192999 -216783 184968 -187392 -1962 -143494 41637 139804
22222 139804 78523 -103370 -187092 44172 -13035 137076 36802 13931 -84987 -34321 186180
22210 143295 -435386 -235244 -182969 -14953 -49083 -3435 -168808 149653 -224283 -110044
22199 28341 675 72817 -33512 -196466 21411 -13809 158650 -9960 221597 342783 -53919
22187 135032 236013 102131 -120063 30358 290187 338134 107866 62370 -62639 -295844
22177 -295844 -149802 -34261 -69609 -275151 56675 -12478 121971 -68256 119914 90455 -80811
22165 -40405 8955 79463 -272317 -367881 -199862 73005 -94949 -160017 73660 128887 -317878
22153 -135264 -18184 41463 -238582 83854 270251 153038 -3392 -36374 -98367 -26206 -5940
22141 -188742 21227 28751 127157 -466546 168552 234282 114046 26102 -30889 -117945 127452
22129 -77165 -91111 -389656 -49637 47157 -103151 140380 142433 -225487 41912 172689 -48055
22117 -141007 69062 -163099 -93289 -181030 -37243 -128905 99368 -298471 -59000 28034 149137
22106 149137 -140002 104136 -133614 -63474 -68379 1212 -75064 251737 -73909 3795 119243
22095 119243 -61352 123629 28027 176868 -78370 -90625 -285283 -110333 -277636 -25682
22084 -28667 -124360 57745 -39841 26302 144928 -24470 10792 250399 -277127 -246690 2580
22072 -150115 -46256 34469 71963 -342850 -200883 48797 -12093 22269 -22275 -138096 128248
22060 73700 87517 230630 110683 -243617 -108131 -159052 -40296 -125100 353430 -120693
22049 -354482 -147431 -3926 -37992 -111814 -277840 114988 -134678 -74480 -95113 -233217 239261
22037 -88966 -259126 -112684 21537 -87147 42196 -166293 -116158 -127150 -177315 -230548 82278
22025 -185895 33801 -150450 -102196 145694 -45456 -59856 -344741 -69366 283803 -284790
22014 136687 199576 -40108 182065 -306787 220362 -147159 103417 14406 -287466 -206431
22004 -206431 -224162 128854 -99419 5231 -248749 93755 -269136 6037 58628 -32179 130834
21992 -122787 -49683 -212291 -186321 215335 -64043 -44490 111764 -122726 76162 190247
21982 190247 185820 124264 -439660 -158676 -114988 123179 85382 207897 178544 130972 40295
21970 -452867 -181680 -21572 168243 20064 30226 -120186 -84180 -104476 -45435 41175 44393
21959 44393 26689 22660 -26315 273645 189170 -22389 -86558 -159017 -74088 -76754 44013 -23075
21946 108809 -155885 55581 156981 -139783 286801 161928 -136790 -143940 -258742 -370744
21936 -370744 53505 -185540 -124680 -152614 -235431 283452 276023 -44851 135391 -162310 -187735
21925 -187735 -56098 -374335 79799 5730 -27387 221706 -106333 80209 -153121 90973 -56611
21913 -209793 -14796 -122297 -48320 -99847 -89619 54877 81955 22305 -107696 299562 196768
21902 196768 -155320 -105468 225457 -93373 -402501 -79827 124852 -148008 42633 -283509
21891 104845 -87344 -43163 45230 -26085 119830 37212 -264082 -100652 133427 -82469 -358673
21880 -358673 28542 30630 181999 -37246 -75924 -29597 33535 44335 -18705 -120122 -37140
21868 -23944 193246 196047 319116 -278035 159611 -251012 -161587 -105945 277204 115387
21857 -243557 32855 181617 -77349 -173980 -70199 160464 -404508 -144357 187610 -266113
21846 242481 48583 109422 -329889 -41514 111109 49060 -216689 54655 44659 -61083 -31367
21835 -31367 -282811 -29072 58097 89656 -151071 43271 -212492 -227332 46728 11044 -298401
21823 -364022 -361013 82636 -81400 -75039 41470 -211361 74250 295834 107125 220720 -115354
21811 -12950 -34813 94836 36755 -81285 127227 -16389 213355 -28641 41528 -17880 -181938
21800 -181938 25365 -156120 -71463 -96653 -308704 -35412 -18726 12710 12399 -15660 -57988
21789 -57988 -206105 -252966 40110 -242981 -173183 -29317 -275721 -41701 -272232 -215488 -107787
21778 -107787 -183192 -149047 -226921 41369 -145185 -84993 161697 -218510 -381598 -228124
21768 -228124 108776 -165831 147214 317094 -76156 -193294 -154025 122849 -59668 88900
21757 -95391 -203969 -132608 -9405 -9114 28856 -148316 -70658 215372 -176085 -221231 301190
21745 -120052 116073 -223465 -263567 -21600 209148 127830 -157530 269700 -85128 98318
21734 211723 199989 -152422 -114618 -180381 -175288 192987 -228652 -207049 -9330 241542 231805
21723 231805 -25760 -128716 154462 -104634 4790 183083 208450 -240858 -168838 -84700 232924
21711 41463 -6973 11214 -314084 -300247 -197185 -43449 29648 -102564 38174 -52981 159533
21699 -142373 6723 102988 -219444 -199781 -308688 -162389 -114173 -282982 40266 147384 174735
21688 174735 -237444 -46051 133151 -396026 -141622 -11016 -181677 10100 207026 -126973
21677 107930 -7064 63279 -180119 57584 67403 -158061 175935 190052 117977 -161750 -197696
21666 -197696 -19478 -222246 -124156 178526 52347 267 18628 -426730 -63312 -8533 -430677
21655 -430677 -358467 238760 9000 -225816 -131954 266438 91046 -203899 84317 153256 18200
21643 -196068 313120 25650 261619 -288699 218038 -22373 -63087 142437 133443 -416815
21632 -132253 -116459 -4016 -298997 -142760 230466 -31320 -70686 -100588 208362 -197324 -110227
21621 -110227 131488 -30530 -164452 75254 -183621 -59534 42913 -310975 -13476 -50062 -52440
21610 -52440 36429 -203639 -220423 -330717 217150 -80108 147289 -271011 6580 79383 -16808
21598 27918 153226 -47924 174103 127985 149928 160818 -260922 47854 -337970 -64519 12322
21586 -60223 -199839 145104 -29089 -206597 -93967 -357321 -157602 75083 -435068 -85654
21575 66388 34518 172907 -329236 -43490 -28187 56658 -143970 35781 -96833 -64922 -47181
21564 -47181 46607 53437 75960 -109990 22312 40607 -129927 -205895 -394954 34791 -225453
21552 -138670 287310 -78114 20281 -255537 -28363 -240100 195529 183246 13943 -54612 120827
21540 85617 -2566 7497 -32746 21525 -302795 -153061 -16640 209028 50698 -293257 138123
21528 -149789 -76897 131957 276454 -252337 8755 -212728 -189993 -236912 59313 -28700 -303273
21517 -303273 175472 100201 159493 -381144 -102065 -193200 31342 95763 -92086 -395979 251315
21505 52495 -255663 49565 -106661 191409 -207795 254751 -168483 -187939 96757 113207
21495 113207 -412314 -175074 -58032 -223260 -290832 -172475 121885 29817 -115781 19120
21484 -330376 -187092 254212 -58433 -55444 541572 7516 -169840 54282 -64281 -141681 184530
21472 74104 -88189 -146605 -788 173634 -12340 -172803 65063 18825 -68551 -70378 -1144 22626
21459 427653 242239 448532 -191752 191952 11457 -35459 -52895 100404 -157329 -164985
21449 -164985 260173 -229103 -236473 -190161 210997 139208 289232 35294 -60332 218372 62722
21437 -257498 -306459 235597 136791 -241359 -18372 -109787 -174027 -236303 -77588 -50344 490461
21425 206899 597814 191533 390005 253389 433936 193004 -81279 166795 -182793 31797
21414 -216568 -164768 -242798 -139209 -162874 74570 -47327 114077 -146534 -170589 -305841 -229514
21403 -229514 -76287 36541 197873 -135309 -288663 468133 -342824 -51250 117956 -108283
21392 5752 116984 -159260 -272923 -145248 -208461 99978 -242420 -304287 147029 87871 -227593
21380 -201894 129777 50606 -21590 38707 -111511 -280009 -147410 -196316 62730 -111785
21369 -101657 160144 -122768 136478 -175286 -134797 439809 41610 14796 272487 -229318
21358 371509 -379319 71084 -136002 191476 -97733 -143962 -342128 313114 158415 54702
21347 50758 151041 27766 -122104 -133178 -7191 -239341 -18310 57454 -51107 222482 -99097
21335 104541 -203284 -291642 516 84237 252921 -61720 -219103 43910 -502422 -5695 182773
21323 214943 -194057 -3890 -132144 -46281 -242979 35803 4588 -257852 -202001 -11725 -105697
21312 -105697 -48049 40130 137297 -83562 39526 35006 -72837 257579 -105424 -162124 -21250
21300 257721 154129 -56462 -57527 -5875 -121420 47665 -37216 2251 102822 -247111 179569
21288 -5644 67258 30472 -321524 -20524 -44694 421064 32426 51237 -18904 -135110 94559
21276 -272647 123426 -96026 135520 -65398 -51082 287395 -174079 -265831 -85657 -61809 58527
21264 40196 -191005 -42040 55880 20111 125561 -335162 63632 206794 92871 181575 -142929
21252 -62413 -212770 178729 -126036 -60246 -11169 -37606 136708 -61400 -115031 38153 -91068
21240 -278854 -202241 58299 16076 -108820 63419 141342 -337640 -139129 272239 49216 -91343
21228 43616 184209 77122 -175725 154762 224027 90588 -246464 -59605 -151406 -49954 -120430
21217 -120430 -1671 -318894 60002 46777 -347912 213912 -216791 -59289 -41649 -23296 230236
21205 -237924 -133815 -310606 -214788 190666 -49903 -174377 -69768 -334956 67001 263676
21195 263676 219827 -151146 -115081 -228478 252433 -31740 250974 101454 -74518 -247890
21185 -247890 -257054 13191 8374 -92134 -190791 -178793 -77715 434730 -78730 26236 100977 -171174
21172 -426685 -220637 -326035 -178138 397707 29229 -66130 -298436 -165963 -135328 -169601
21162 -169601 -159162 -89064 24035 51899 -203006 -358959 -22255 22198 -91334 -46834 158864
21150 -10669 287214 -103199 -97245 -246262 -84998 -146969 -431615 80611 -176394 -296937 -50289
21138 32330 87154 103605 377407 71103 -331295 191685 -279590 223184 29438 35936 9877
21126 -33131 -346077 -143090 64441 -8742 271735 30405 84432 353751 -291713 -19429 96795
21114 81631 -202620 438754 386244 -39162 -172610 -29371 -4195 -1204 49960 -48650 40611
21102 -72664 59232 -179362 -162617 90845 -55035 -217699 -115296 -251642 38009 -65454 257321
21090 -48759 -251452 76448 -67586 46770 -55004 -57557 358833 -136170 -183716 177358 22309
21078 220840 141915 -117422 -185011 -251994 226868 -153847 144406 -6611 -140333 81014 7041
21066 -209654 1118 100326 -14179 -325590 -330613 -28946 -4928 92915 -60559 92896 -102316 246958
21053 8825 145993 -312244 -48212 -373172 -118257 171334 -37935 -123015 90520 -129207 284473
21041 61020 -220305 -37954 36384 57555 -199803 -184313 5454 -208858 -170522 234418 52381
21029 -106566 -487828 -104204 151327 226510 73531 -328620 226982 67937 92103 -40078
21018 124033 -136347 -198935 -174442 6643 -15458 -66882 219278 -70797 -236505 -269957 505365
21006 -55815 65639 -34699 -60991 59496 411575 -257839 -306580 64415 17569 -148465 166726
20994 -319407 -82309 -220552 28763 -270909 -133234 156217 -169546 39663 239813 36065
20983 -72596 -139909 -64549 -414357 65044 -47123 -100787 83497 29978 104983 -133424 -107450
20972 -107450 29776 -83259 -235461 -176496 -105939 -173210 -225534 -62565 340989 -264361 -355228
20961 -355228 -16790 -56600 35621 -205305 5789 -120354 182392 144415 -164877 292959 -46471
20949 -112586 -26557 -2933 -396926 -72948 -61892 -92984 -111114 -76534 -35741 -129916 -137999 215620
20936 -127850 63049 36246 -270720 -287053 -222675 -48404 146461 -146626 -234677 -131036 119189
20924 -285127 -46505 185126 -60753 203029 -456862 76045 144445 231923 -104423 -246041
20914 -246041 482323 135096 62084 -212129 -154191 -122154 -59972 -154588 -48732 -249515 -40598
20902 -156875 -220360 -12981 -91959 -61277 179261 -454966 -33586 -106020 138004 -318601 -262545
20891 -262545 176808 -180082 77777 -119656 -292476 124513 -39646 5432 121307 90792
20881 90792 104735 -159022 -143661 -95998 -45168 201285 128886 76946 -114216 -256914 -12137
20869 34017 -116717 -454580 306463 94290 -29555 6515 39279 -93770 -85838 20411 -4895 125991
20856 -79173 83464 -102160 125401 -83769 105900 -198955 -182236 -24210 -134504 -81732 -52829
20845 -52829 338021 -305023 109219 -147348 -203818 -12255 -267919 -133688 -105621 -98799 -11935
20833 86043 -178048 215399 -58852 68289 85819 78421 -12822 -182343 -110028 -147237 26721
20821 -304215 7961 -104165 23544 -173038 -164725 -125315 -131226 48083 -121862 -56284 61007
20809 126228 -203570 -38056 306565 21532 206771 25300 -78507 23590 298210 140786
20798 377464 -169057 20262 -99052 -59762 -28308 278483 74266 -282413 -4364 -315398 -11667
20786 -98843 64948 105439 221289 -111892 134860 -154881 52183 212530 254650 -12596 27535
20774 56419 27060 -59107 -167025 -145822 -135737 213890 -145976 -66510 -70524 -201554 61026
20762 -306136 142115 -4313 -233843 -205086 56304 59208 67271 -50414 -111489 -6870 -99181 321461
20749 -117394 -290090 213901 -31404 -46002 9744 -47477 -155284 13036 92660 340991 -28633
20737 173670 -255039 -3399 171005 -272826 -153638 62425 416560 -40368 -208384 -457555
20727 -457555 -279151 9383 -131047 36907 97673 -150663 -199441 -32302 -218853 164492 -141186
20715 270179 -83397 -178739 407771 -277316 -188983 -130173 -32675 159022 119276 130773 -171488
20703 250642 195796 41711 -79296 -359289 -79130 -85477 -75599 72529 -62145 -131634 -57496 -104238
20691 -104238 -26535 35856 60775 -112851 16936 214755 179170 -73811 9929 22427 -46683
20679 179008 -170074 -156299 89676 50505 -364377 -111774 -330910 5758 -182045 -51497 268700
20667 82934 -141570 290245 -168442 -134403 -281991 -6263 22046 -72101 67610 -63268 -340397
20656 -340397 139485 30641 94375 23330 146276 -77473 -351890 92725 -158002 -200545 -356716
20645 -356716 -71198 -17636 -503981 -237255 -109161 -101377 100822 -215249 -263800 -457729
20635 -457729 46790 -68957 93672 14192 -59503 -152185 -223378 26141 -187993 -93222 -12928
20623 87558 -199176 99046 285504 134692 110064 -334540 1880 77181 -116712 328580 121835
20611 -225408 -117262 248147 74749 -100279 -142273 -90756 15778 -3777 -25097 -313535 -104773
20599 316322 122504 293685 167116 96433 -195832 -7750 -199924 130490 -274822 -207377
20589 -207377 67202 64271 -202558 150443 116400 12387 -18076 60418 -349275 44141 -294323
20577 -229253 -125162 91697 220379 -75786 66434 -7834 169177 -116435 18247 9535 158678
20566 158678 344419 111784 37024 -39341 -203414 -86850 -368849 -290625 17976 -136292
20555 -96346 92048 35606 28062 -194960 115313 47951 21148 624 -125972 114389 119424 -114481
20542 -346388 -209299 -92068 -24764 -27264 190877 -295245 -192856 7248 314518 -116476 15052
20530 -146338 -60490 -33456 55255 112857 -243290 -124089 46661 -57392 -166449 -58100 -156968
20519 -156968 133416 66727 393219 -268739 -71304 -21711 -62237 -100568 -12155 159395 -101695
20507 116188 50569 -58404 -209831 32820 68562 -236663 -163471 -153240 -194445 121480 -180042
20495 -123474 -172330 180867 58712 -17045 219198 88756 2145 -147499 -158976 -96683 -214959
20484 -214959 34217 -65015 -37711 -27901 -250501 -42112 146706 -141394 -136442 -51676 216024
20472 -288231 -1903 -373485 -118230 213754 -30385 122874 -1467 -19382 -4373 -50880 -97851
20461 -97851 131691 -8029 180290 -46289 -109045 -329951 -157285 51947 -46860 -216749 -91066
20449 341791 222939 82526 -66783 -181944 -106352 242657 89641 -234528 -171805 -13521 133236
20437 -175434 -205126 -317958 -3863 -54055 103040 -21451 -227439 -193774 -27681 28747 38302
20426 38302 -102763 -143858 -110724 -167621 -43019 -155900 -450202 -34556 -177441 -2710 29599
20414 -140149 41840 -11339 -249575 177677 126277 31754 7939 45015 -19421 179421 -102872
20402 59521 121747 35199 5117 -74221 -74810 -319308 -66342 -181403 -228133 87465 237768 -98039
20389 109733 -251647 185 125470 -70324 -204340 -106695 -250491 145004 -51506 25847 128314
20378 128314 -108342 75314 93483 -330355 92677 67188 200378 59368 -128306 -467154
20368 -467154 -179255 -218561 -112395 176736 -193057 -20320 -89023 305291 -168971 -143412
20358 -143412 113205 50195 -113522 -226152 -9780 58653 -339080 -115255 -365326 185289
20347 -226267 213075 55230 -136753 -228824 -137076 -78497 28491 -47205 -226667 -491242 140851
20335 -78484 100186 287620 264810 16595 -258189 -30399 -29409 -70932 73612 199114 -56932
20323 -171887 34102 77019 -145453 97248 -101205 -211252 52566 -191362 -177280 -179386 -81308
20311 29603 -424175 -263184 -13911 46756 -362372 -355902 -330373 105782 -101607 80859 -36585
20299 -186222 -191116 213648 5338 -107300 250995 -283553 55967 -15335 -255964 -237586 -94056
20287 70866 156356 95688 122306 -113492 13543 -164432 -171952 -409427 -214718 -11922 -39227
20276 -39227 -286017 -62638 -116320 96674 -150305 302902 -26288 29518 -16155 -203909 -44747
20264 77008 49857 -191935 151814 -155455 -138473 167860 -69532 -4651 -165663 52864 100281
20253 100281 -42671 175079 -182379 -102000 18183 998 -22916 4713 -119477 267431 -28299
20241 -409083 -92794 -89608 20767 55155 -70077 285729 -209712 -223706 1301 -82257 -252370
20230 -252370 -23615 -149 -43984 -260167 411291 156712 172552 155655 70813 -196106 -340262
20219 -340262 -73832 -35259 -38699 185391 13406 173465 5931 -137445 -227312 -58926 -36601
20208 -36601 -155606 -272229 121248 20006 -304859 114421 -241643 -121134 -121153 85814 320041
20197 320041 -112620 13015 -93889 -257065 -154397 70749 -1889 -49401 38374 -253577 80105
20185 289117 -158104 7385 -163133 271649 -128890 -446622 -33975 -127803 -114393 -91137 -39262
20173 105330 12432 -63188 13949 -71994 629 35036 -78383 -227654 -239273 54552 -248021
20161 297187 -157308 81300 -168019 13816 23691 -96467 -157836 -27923 -89373 241013 -173481
20149 -88930 -212719 37659 -47729 -124330 -245878 -22887 -21231 -237527 98627 -20319 -143781
20138 -143781 -264871 -62036 66317 -106970 111590 -210481 93552 79861 143589 -65654 -32059
20126 -205351 382449 -209853 -95108 66441 -192157 37074 155703 42655 -158916 -89413
20116 -89413 146387 -202695 -226358 -92365 -276144 6515 -6580 29164 211999 -189540 233233
20104 -198194 175727 -145778 -210004 99781 -318562 65216 12802 -189661 306123 -321749
20093 -191910 -23863 -131221 295329 -40253 206474 41013 -24299 -101994 3091 16271 -118091
20081 -12472 35943 -114386 -286028 80774 70920 -126020 96925 30 168263 10287 -2945 45908
20068 -227091 -393299 -40882 -44816 74154 -50623 -137097 -202334 -138966 4262 -239866 -99926
20056 -38891 89462 -203954 -236962 -85606 47409 -60153 89338 -313438 -194334 109836 176761
20045 176761 31686 -373396 32583 -68108 -324828 300547 -52865 36294 -13611 31421 -160362
20033 -81437 199960 313421 193850 -135174 160632 226453 -160424 -325397 -240301 259421
20022 -70393 -28079 -224901 358594 -298232 40507 170005 -48231 -43241 -101712 61268 -45549
20010 -185316 -57233 860 -186557 235207 238898 -176507 121949 -121804 230515 -248410 -384242
19999 -384242 73735 -144972 171028 -59744 14597 -45349 90585 38185 -12617 -104872 -115877
19988 -115877 44223 183372 -45431 -166289 -212848 -89324 158149 7315 118907 136521 -16917
19976 -99564 186673 49642 -4521 41843 38033 -47925 95469 30534 -169316 -355134 95303
19964 -218605 -41185 272666 -175234 141514 79277 103830 -182311 127227 42679 83635
19954 83635 230706 -189130 217697 443873 -469847 -302479 232589 181182 40624 -96111
19943 -170414 157476 -127127 153974 92580 -115914 -58636 -144911 258448 -147335 144123
19932 -62434 117277 -162028 -17639 -243527 254114 6057 -92168 116576 -265706 -67791 -195588
19921 -195588 109901 9508 58954 -4518 -179130 -45400 44486 5559 112983 -140295 -126095
19910 -126095 32480 -315303 310757 41785 -24236 -215553 -22214 -254998 -81638 143166
19899 -49492 108828 -18150 11888 -325659 -222825 -74818 47927 -286024 -195755 -235057 -50251
19887 61650 -151403 -23585 232458 64467 -221514 66357 -5053 -509524 34858 113448 -402942
19875 -399534 -33088 21531 -68230 -23173 -402045 -16138 206070 239235 -74735 -61566 -95646
19864 -95646 324958 -149891 -56168 -143686 71853 -155665 -172963 -64425 -416670 -8272 -155376
19853 -155376 -5441 -388346 -20286 80419 335420 146807 -223025 -306904 314506 208650
19843 208650 -191121 -72160 -47918 -74208 -47851 -136964 -5771 -45854 -295041 -140466 -164788
19832 -164788 -178892 -82284 -66859 -58969 -414621 -343118 -109050 -223113 -119034 -180523 -79694
19820 -436558 -125335 -146703 -248647 117454 -56076 -155337 -36459 218986 -214747 206487
19809 5225 -196209 175931 175015 -354146 -34908 239891 -270666 -40856 88903 -44500 -89439
19798 -89439 -95694 114104 -93783 -113277 -262515 -27984 -160027 -70421 -116897 -10578 -142594
19787 -142594 -173821 32582 61953 -146240 186287 -78539 -23553 -197852 60735 79853 -375487
19775 -309886 197867 16672 -256185 -318413 -44745 43410 -191075 -231434 -140675 200110 -123167
19763 -229155 129578 249859 -315848 -308691 -18460 247323 -223006 -251535 238749 -285148
19752 -285200 -218606 -125901 -106154 -210586 230316 -43418 -155444 -116952 -49539 -96288 123698
19740 118581 104577 7828 -126101 18295 117479 -301309 113334 -86260 131119 189084 -82607
19728 67332 -92039 -157557 155664 28372 -19436 21514 107204 -110688 -137601 -97878 202506
19716 -331859 32191 234163 139309 -234293 -186346 -333836 -89299 57068 -66119 113081 28999
19704 76094 -53333 -210861 101892 73931 154315 -17883 26715 -170966 -4045 -91058 36960
19692 178439 -112148 71859 58117 26060 -35416 -11997 -50625 76558 19805 -182743 83060
19680 162625 -13312 -38519 278037 -202051 131678 163319 -54574 -199379 301490 -64839
19669 -50938 -153184 -135548 -52043 148009 34635 -114784 38479 -250150 333661 315270 143075
19657 -396595 -359228 -70154 -106699 -57941 -147942 259776 -44304 -127566 -31845 -174361 82600
19645 79052 -9534 53923 -136226 -143431 -289446 -52980 -192602 -17325 -92285 -160400 -108185
19634 -108185 -15700 171269 111696 -413103 -17705 191488 -141398 137115 51435 -192221
19623 -51656 -30939 -117710 -97884 -108062 -51439 -326880 239910 221246 -220413 312351 -89465
19611 -182377 -249447 -8447 155907 133099 45074 148093 -88812 128057 122987 15783 -128626
19599 -109201 -106194 189663 6580 10024 -263982 -114177 195046 106086 -258436 -8177 -87942
19588 -87942 24145 -22563 -268081 -184607 -316665 -110753 151532 262555 107816 -81371
19577 97523 167870 -3749 376813 183457 -136418 -196449 -243325 2886 -29782 -131991 190410
19565 217152 -36636 -190973 374337 -162684 -68039 -206242 -56468 -62073 -79953 -159847 -564350
19554 -564350 -16071 -157937 17573 -132674 286642 7370 -104529 -137380 -150289 182557 52576
19542 116369 -19676 5199 244570 -255317 -238509 -164014 129341 -168472 35603 -34711 -148193
19531 -148193 -52991 -293486 -25596 -340991 -305601 276690 -82618 -169859 -16454 65166 40336
19520 40336 54383 -92784 -105699 -46782 -84670 -37375 31347 -83484 -105440 -138699 -172456 13620
19507 172411 -271118 -223894 -182525 -63728 118825 14509 336565 122729 -46610 -82888 -154204
19496 -154204 -213208 79026 157152 -54767 -28953 -130876 -81651 -57814 -55384 126948 -139076
19484 26955 -409582 121986 -204947 -72495 -247989 147186 -13782 -63750 157037 -267827
19473 -70800 154329 -99379 -79041 -185509 -124726 360298 -222896 15520 -88847 -66897 192919
19461 -52731 151254 -49431 -53441 63159 5175 28678 95252 -244972 14727 42251 -152601
19449 -81957 -101007 75424 58594 151691 -167625 -314896 43376 229354 -348304 -27641 -40086
19438 -40086 106688 45977 -118414 63756 -127204 -171795 -68329 -23271 -94821 81883 23249
19426 -411124 -574866 42969 -76281 -72721 -100828 39087 -417103 32039 -36587 -8055 32013
19414 -74212 174948 -14476 103423 -268194 -211354 -84631 -87373 330215 154920 121710 -56259
19402 -198717 -52772 226115 181137 158029 -24775 -27179 -227968 -311162 -504814 -46633 1344
19390 -22517 -99705 -170403 -243146 -55561 -10981 227471 -47213 -422258 -351537 -171468 26623
19378 -30114 -5002 -68153 158982 -63505 -241311 177489 67925 -83532 27511 27909 96380 -555996
19365 -357640 -101924 103473 49173 150877 -69126 330498 87803 -223840 -12082 -70298
19355 -70298 -90484 98928 -131078 -101563 -20412 171267 1904 26338 -152597 185107 280358
19344 280358 -403267 -35564 -57522 -286769 30559 218542 40503 386230 -73033 -108982 -303568
19333 -303568 -177252 45465 -214778 -52963 -119343 39493 -24784 -31924 -65527 206561 70058
19321 72070 -303229 -67182 -133578 259120 -122235 -419772 128071 9577 -195233 79276 -141747
19309 39628 -51676 -57163 -187629 261936 373412 209017 -161330 -81268 -157665 23095 117948
19298 117948 -370950 38001 43658 -156331 93368 60934 -47968 6523 193226 -128509 61890
19286 -63109 -50787 -173718 -150314 186575 -304790 -532419 88771 303230 -298377 -91763
19275 97600 -226251 162913 181531 -52610 -181555 -171938 -447415 -43213 -291054 -200463 269265
19263 -217987 198447 195072 -14380 224811 -141488 -58326 -324759 46844 -30703 130402 41132
19251 -504176 -452996 65653 -421535 -54675 -235482 -235990 38449 -36236 -304251 34943 -159719
19239 94935 137016 67682 146521 196398 -187725 -246471 180183 206489 -322538 390703 168134
19227 -114596 319687 -37525 -131390 68489 -160058 -7277 -65906 -172037 -79918 -289947 -250100
19216 -250100 -215785 -27509 -218975 91027 -228094 -36106 151389 218904 146141 -184464 87035
19204 132290 -169026 -215671 -119011 154748 -217058 -88603 96224 86832 -276982 -212698 -115859
19193 -115859 33633 -199182 -277513 -237121 237809 72888 -189871 -230522 146460 -210885
19182 -348807 -193421 -12660 -262977 -177851 -22062 65943 11471 -372894 -111522 -194255 -12340
19170 -91123 -60053 42920 -94987 -177365 -160258 -130127 36367 -78077 -218080 485207 -124193
19158 -21765 -243208 -32594 453912 18527 145477 -13284 -290679 83074 67000 47458 -11319
19146 94859 73642 -282396 -16746 -41622 -382775 514966 -141902 -79107 36321 159854 -201439
19134 -18232 -232571 -68883 -43212 -409326 109612 -204021 333923 208770 -133230 -82519
19124 -82519 -161165 9171 -41392 -376468 -29454 95799 -471275 -299311 151514 32406 136988
19113 136988 90356 30166 45854 -302485 -105534 131209 -63880 34406 -33244 -95986 -40201
19101 -34935 12161 128136 -11580 -89836 -52700 -51746 96974 465401 71355 -34471 -2525 -150916
19089 -150916 -96328 -151759 -125096 -155866 -195347 -77846 50598 85125 290 -40286 -104372 -250921
19077 -250921 -228126 63940 -241753 -2632 -87102 -260711 -211814 34794 77993 -126819 -296861
19066 -296861 -13175 -357423 -90094 -162051 -159771 -91268 -158643 -222181 -421324 -37868 -36947 -118851
19054 -118851 32644 95297 -56797 -289008 -87303 95363 -59926 -37053 -87924 63458 184824
19043 184824 80847 -90238 -44959 -290374 180618 -117930 -124779 133954 -202918 25614 -45104
19031 77005 178772 -110041 -291424 96423 74509 -169155 240084 -286755 -401297 26117
19020 -28068 248694 85010 -43358 88610 -129353 -306317 -168642 1168 219695 194392 -261824
19008 -291021 -26073 -136714 -246693 -82638 132357 -285884 -150855 -463567 -120671 -356056
18998 -356056 135591 272241 -113693 -60884 72160 -154236 -74230 -264681 -73187 124906
18987 67754 -163880 163956 -86740 94264 -31758 -26904 -134476 -306678 -237350 -147936 175088
18975 -147959 220610 -226593 -176281 -140113 -195815 -333976 -85445 -22466 -148307 -10743 -209991
18964 -209991 -117769 371442 -98516 134000 -133496 -278235 -72308 227506 305070 28996
18953 187878 39199 -39344 206372 54357 154677 -223230 -146502 63301 -30568 -142886 -85043
18942 -85043 90011 58038 214268 251366 -182905 -138341 -152261 386533 38114 -135860 169306
18930 -100322 -161779 -15684 174965 -209896 -132264 -118862 174282 -216929 -52116 -141331 201775
18918 209268 -391958 -7525 213644 91441 -19085 -7019 219160 -237169 -126995 58763 138343
18907 138343 112687 -112423 -186747 6058 149198 146483 -356445 -67432 15144 -188773 73381
18895 121729 -5051 -82164 -152404 -46575 -138054 -274281 -212388 -109864 -65775 120797 -223656
18883 80213 142595 58266 -9027 239032 338700 -73041 75299 -87304 271647 -316596 -152490
18871 -348093 71006 -188384 -202777 151518 -163062 -169569 -2919 -37543 129761 -213234 -238585
18860 -238585 -8441 49211 -66533 -117316 -251808 1256 -210082 32269 -243639 73682 -163686
18848 171599 14799 -204778 89273 -85547 26476 -19013 71776 65471 -100648 -147656 -220893
18837 -220893 -162070 -206827 -76237 10201 -115043 34898 193664 -59628 24535 145185 -121451
18825 46496 -369762 169903 -19684 318108 -138654 159378 -122977 76945 58872 -140336
18814 -124478 -228585 -220648 -58189 49281 53324 -506212 162769 -39865 41212 -125577 452970
18802 371846 -81405 -34205 -64588 -47314 177055 124292 224290 -234519 -117414 -50940 245370
18790 283834 -71393 -11636 155772 -310441 -191830 -126957 -285766 30779 -97816 -171882 162345
18778 271292 -264608 -184601 -216185 196914 -236558 -80895 115338 -198117 -79981 54934
18767 76765 -277571 40307 164620 -179253 -3528 -41635 -145816 377302 72686 5036 322273
18756 322273 -230597 11881 -276518 101776 -195129 -174069 -203351 215511 -183378 -138718
18746 -138718 -115029 -192192 -214342 -86701 -169820 -76956 -121214 185670 362010 -109496 151636
18734 122044 -149503 140536 -121897 -175026 200630 -145263 -95846 392630 -108568 -100722
18724 -100722 268831 84692 47549 -53006 37685 -96207 -86980 -28197 79812 68270 18581
18712 37137 -21828 191092 -103392 -103586 -137635 -178789 -89781 -482190 276442 -1308 -195176
18701 -195176 -150113 -197238 -38998 -84179 -370609 -402319 125651 280991 22115 -75189 39866
18689 -24197 -204898 -92084 220823 -46045 243845 70341 -125828 -10838 -187653 -299269
18679 -299269 -188451 -68417 -112566 184249 62124 25962 -34993 -162711 -72111 31683 -74772
18667 -468804 -209538 -125181 53445 -235790 17769 -23922 -45960 32712 -10799 -30410 -134270
18656 -134270 -71165 -1101 -142878 -242186 -386756 -29285 -71720 137159 -138255 -16729 -144894
18645 -144894 25354 -24050 111069 -317816 -45730 -122718 260515 -152875 8627 23181 -226697
18633 -186975 -79141 -145820 -108472 -92902 -149168 155991 -156306 203553 -481026 -429719 52580
18621 40839 142641 -41901 -344185 301321 319165 -163158 -281680 -198216 -289801 213935
18610 -222647 -201228 236453 -53250 -281095 61048 -182703 -81785 -147566 -131956 152629 -129751
18598 -254341 24996 12386 48086 506159 -60849 296431 -138396 -108191 142326 -186794
18587 -120870 35685 -129869 -279024 -66847 -154933 83976 -101674 269383 -311579 -82184
18576 137097 72752 94822 -33630 -10242 76668 -108497 265291 147606 -96383 -117058 198504
18564 -95094 -180769 -169943 89353 -58131 -42522 12072 36071 -149141 280224 -175115 23768
18552 38403 -162793 -81085 -445271 211095 264643 -62351 -355804 -26633 -101494 -101851 91356
18540 352708 223308 98504 115870 -278313 -153698 141817 52166 89831 -86117 52288 22594
18528 -50790 164101 171743 -299855 175489 -349098 -18901 -47200 -288804 -174955 34758 112909
18517 112909 -92060 -232836 -156067 12204 97896 282827 94700 -2883 -369368 20788 -5089
18505 -263203 -124117 11341 38738 51063 -227494 176580 -105268 -101829 83502 -357573 217366
18493 105412 131431 134868 49755 -455698 -60530 223846 -152387 -188 -303731 -119230 -198256
18482 -198256 76266 -431491 238397 67747 -108493 9045 92781 -5258 -132189 -136426 -107221
18471 -107221 144222 -5143 134839 -153518 130720 -207676 -94348 -843 -285072 66927 -108737
18459 127911 -43821 2427 -165069 -177556 280653 -133504 -49121 -34010 -135801 115066 -118770
18447 12593 -129062 -7084 32859 -81362 46490 -50621 -123328 178580 -343385 238443 -132755
18435 -134068 -107048 -68549 -69364 271819 -6763 -57505 288947 123226 -31383 94663 -55661
18423 169814 -116885 -141411 -104063 -209836 -317729 -254497 -31582 -36196 -202767 -175675 -214208
18412 -214208 -150438 -121406 -103284 -133147 12392 -81687 338432 66348 -50848 45039 111161
18401 111161 6661 -291638 67185 116100 -176608 156733 -127895 -295025 -176210 -85331
18390 43873 30969 259063 -208259 -203023 -105430 99755 67414 96050 -315606 58658 -160168
18378 -156254 131019 -295970 -135858 -132403 133477 184240 -50890 75273 -159438 52888 142506
18367 142506 28956 100670 -131105 -350400 -221291 126702 -81003 157263 -75277 82855
18356 50634 -462978 -55536 -249511 -139690 1458 189735 -117533 120140 -303968 -238849
18346 -238849 27351 36833 -163579 442814 169883 -298706 -30013 -296550 190850 -149652
18335 -344513 95052 22195 179333 -374022 -29300 71735 -110879 313280 66839 -30945 142744
18323 -29868 100004 -3731 21797 -81487 -363430 166903 65010 -315907 -216369 -213314 -193454
18312 -193454 -130982 -131194 -183942 2815 -105617 -325356 -116624 -174606 129710 -37352 212225
18300 551677 -93333 163926 -240742 171294 -6048 -300477 -81190 127979 4300 -224374 191166
18288 -72219 47156 -18334 76580 67844 70048 -147299 47643 -40944 -129950 47691 -235062 -6672
18275 -305715 176376 -207067 170360 -180404 -29568 162302 175668 274066 -50757 105955
18264 -227422 -31498 155353 65188 -214380 -336042 -15661 -320257 49361 -233925 105315
18253 -115302 -193347 -325057 -13322 -234577 62365 -390279 40863 -4034 -245317 85042 65654
18242 65654 -178298 -146212 58144 -334213 -160997 -69527 24731 -13439 -202601 -13731 -157886
18231 -157886 -1917 3311 -143435 -77830 -164658 -368767 34829 -80868 -159222 104305 -168277
18219 53257 108920 -77567 381539 -58623 -432778 -13259 218003 -43355 133211 -374457 270309
18207 -118637 273673 17433 103213 266277 -93302 93455 -74769 -348080 435019 -247969
18196 -157142 -366030 -6138 -88050 21871 146929 59370 -67746 178643 -115421 -233459 -3469
18184 278346 -178220 303444 -25687 113618 -196127 221381 64884 -13937 108873 -65418
18173 -186350 82442 -196004 142991 211566 58385 95463 -293842 -77417 174934 -68826 75367
18161 16763 -64106 -135181 -16912 1795 135359 -10880 130890 353129 68063 151648 -266082
18149 135252 185908 -369841 38493 -66777 -396491 -143479 151369 -43745 -1811 -296123 -49343
18137 124874 -77744 52096 -67320 185281 -219351 265393 114146 27473 4694 -365704 -4290
18125 155009 -226059 -129300 -292696 -98714 -1970 8550 28425 -269813 291397 -142814 37191
18113 63356 458287 57675 -32445 -50672 224696 -13672 -212614 119057 106502 78226 -114414
18101 183900 45953 -272041 48131 215410 -245815 319054 -54474 163725 144406 -239109
18090 141801 -148267 -53515 287507 -236555 -21293 -237466 -207288 62777 162983 16137
18079 -490069 96417 -47765 -274448 24502 143948 -118039 35388 -239178 220332 -143694
18068 -148159 -67893 84801 -125829 -178297 -224047 -56637 -218026 51277 -98441 75401 147701
18057 147701 -64976 -96778 -363662 -136508 -176813 80110 -463329 -149267 -179380 166779
18046 -107055 49999 -81153 22684 131738 161570 -8426 -125682 -9236 189443 144450 6588
18034 204765 -199063 227628 136607 48626 -69028 -106017 -122800 -168121 -29441 66894 108391
18023 108391 52977 -269433 67034 83134 -6235 156855 333184 -176327 147765 187514 -15619
18011 -161116 -486679 62312 -112771 209910 -272114 299664 -41538 -226133 -63962 -142651
18001 -142651 -68411 -298830 13072 -81898 -29791 328142 192670 135975 -37027 169159 132915
17990 132915 -174368 -116302 170003 231213 3220 156164 -348680 -194902 198643 -175599
17979 52998 -175672 -67927 -160105 -71266 -50228 -63285 -103123 -152967 33311 223447 63368
17967 200169 59860 -56119 -61430 -38828 -164821 269091 -43920 300597 -29778 281909 30545
17955 48387 -72215 -108626 107359 11668 33623 -149245 375381 -260126 -151121 -281825
17945 -281825 -299030 -64846 -216769 -80895 138077 -201831 -216233 64065 -408140 -45869 -303402
17934 -303402 -62998 136857 -311712 -47541 59152 -148263 90124 -281442 -182844 -71039 10709
17922 110436 -73852 -66654 93040 173188 -134572 97629 185372 149294 4043 9092 -102446 204844
17909 -345821 191358 101250 -146119 -41391 68827 45884 -169394 34682 114067 -21297 125223
17897 303487 94775 323443 -3549 114258 -156369 61796 222819 -281976 -25359 -246210
17887 -246210 12720 -90523 -23196 -106767 -80698 88331 -21232 75920 461773 143766 -154853
17875 130191 -60388 -78409 65664 -14952 -199702 -114084 81755 134510 -123247 8163 248600
17864 248600 -281941 76793 -138094 188514 18601 244725 -28058 -219749 -272958 -44113
17853 156814 107809 29791 -126241 149923 65267 -223370 91322 -31051 -95675 -87226 198003
17841 32882 39888 -165336 27430 242328 -44527 44391 -53539 -119987 -309355 170003 172740
17830 172740 -399735 -123159 -14026 15715 -353373 -72896 -239254 127543 141406 -80995
17819 36025 192050 18979 -105836 -238509 238076 52614 106844 14489 15591 240316 -260018
17807 87194 211332 -32229 113495 -146968 186311 127140 136933 63518 286329 14123 -16846
17795 78360 89542 -44156 -300711 -3291 -4681 -266651 63310 84567 123971 220804 -94791 -65403
17783 -65403 36244 -229479 269982 -66934 -144307 -80012 -172671 174973 134880 -31397 -144399
17772 -144399 135783 -76922 196886 262989 -153365 239497 -27326 -51134 -34536 -128772 -231821
17761 -231821 -248902 169992 35091 79797 -139834 40296 150965 -204108 -147482 -57931 -214450
17750 -214450 -18400 312195 34489 -103550 220887 18154 -290545 108617 168174 244262
17740 244262 15388 -123788 -74998 100534 -107930 207602 49838 226467 -37674 -248438
17730 -248438 -117400 93755 52025 367667 -261163 193838 -345734 128222 -104142 114138
17719 158260 -164630 -150331 40570 -226253 -144466 -208797 234648 -138136 -60932 -101930 -320470
17708 -320470 154432 -190798 -43871 -134887 -71248 281931 178400 158290 146780 203079 58310
17696 -119562 -2625 -244877 61522 -120823 40278 -182503 -239467 -111111 -27038 148701 223907
17685 223907 399698 124146 71823 240477 80923 112766 -21324 -120535 163661 172155 -110776
17673 -2499 -85295 -56809 -132278 286663 16255 196336 -22880 -38153 171280 -114430 -261961
17662 -261961 -89071 98144 41750 -7548 -61375 -174247 -116776 -158519 54979 -71289 -344229
17651 -344229 -62627 -251035 -252665 -50833 -127555 -44432 341435 373236 -8424 16414 -237955
17639 -11360 -102938 6033 -174289 -145114 194793 101456 -36661 -24413 -99739 206890 22916
17627 -19145 -27313 28527 315388 37114 -47988 430488 -89404 -22913 27317 189647 121367
17616 121367 -179626 403246 -128598 -10804 148093 155666 -45001 201770 -200628 285550
17605 58188 -18805 -183531 -350756 116675 -79838 8177 63950 327187 -41947 5187 -253578
17593 178476 56469 -25834 -107897 -53563 134882 123733 -271752 -352715 -151839 74685 -103690
17581 58476 -76418 103381 42737 -90813 -76823 -9874 -16474 337631 278173 31383 -225163
17569 40265 -16959 64146 49550 59181 99487 -177586 147006 -10019 158806 262669 340106
17558 340106 -5613 -224467 380909 -290650 -151359 -197301 93514 4961 71786 -144336 138871
17546 -99816 -23991 -82223 5804 50073 83827 71550 -32196 177919 -44868 97361 205504
17535 205504 108762 169647 90605 -20670 5521 16577 -104306 -119594 98746 61545 195974
17524 195974 -15192 -169029 334956 315113 -55878 -20079 93160 57846 309385 11451 -244740
17512 -34595 -199481 -174498 -20151 212530 -30303 251168 13362 329514 -220053 -18941 -12701
17501 -12701 -24765 183746 53800 63770 111616 -131744 5382 164992 128678 5645 49132 -84331
17488 292916 16502 101300 -220244 161715 152163 23167 -98312 47745 -25616 7838 295796
17477 295796 463651 -225911 77177 169919 -120638 292687 -183530 -114300 3043 66480 134996
17466 134996 229645 -79435 118162 217087 -77549 -160080 -193943 503548 58594 284243 86740
17454 121310 588266 495123 31932 376641 274101 607631 184816 124309 197783 -34947
17443 -98955 67622 -74346 194804 239688 271794 105964 254694 217314 407927 62265 61523
17432 61523 136994 68217 406077 451540 489318 -96208 -4217 344147 -4351 393766 454170
17421 454170 177239 241874 169696 199405 -36098 -49839 416915 179148 374678 -19191 438081
17409 124466 379070 -32021 545962 18527 -26502 106776 253447 228106 390187 279448
17399 279448 375001 229330 456431 137632 -102151 106852 153107 301476 61078 309869
17389 309869 366441 -87605 199123 73944 309347 370631 148113 -73347 81860 78648 -10695
17377 30350 391579 242165 -158878 221251 309665 233829 366156 26826 371631 -64565
17366 222921 414398 343283 32657 381642 214393 264162 354649 77203 96512 -192291 27045
17354 367279 -176382 230820 248495 157467 -276336 31427 -106685 215510 -135724 262973
17343 145063 77019 289757 450169 109250 235355 13913 235572 341032 -6476 252107
17332 -199172 104213 68385 181625 -10356 208147 217936 218482 41075 2437 212550 -32124
17320 -247564 175433 128400 -217106 241469 -73618 110857 132472 27001 245065 192225
17310 192225 111851 102407 -16548 350700 80240 119005 46499 363198 78944 167762 -72930
17298 62553 51747 289361 141229 319731 -85437 35982 169999 190610 -101914 205444
17287 28914 260095 -83180 270533 164392 16697 -183126 41985 1073 195448 198958 307827
17276 307827 60648 407819 35969 144891 -129684 -2448 240685 189450 542074 155950
17265 42095 95738 385554 -316441 375734 198321 409189 46912 314745 14400 355963
17255 355963 7812 326271 -18414 180912 405228 346162 84263 180901 188277 -175497 -3995
17243 67894 246816 12772 142369 278267 471607 -127006 43218 98255 70299 187479
17233 187479 77408 3160 170874 306854 162812 362296 264647 169035 246498 281848 -89965
17221 -22209 11226 354771 364083 342038 59502 -58275 277467 140840 391586 -10828 203629
17209 437228 380720 412712 117997 -358526 150935 130889 319447 318090 211402 43599 116677
17198 116677 290505 290930 209967 247220 -65442 146780 98438 104597 149931 -4735 -108307 367620
17185 511458 130774 608764 18059 178235 212285 426021 613566 138214 203116 302266
17175 302266 182287 401864 148537 571992 58692 459922 236803 123320 105855 327051
17165 327051 419295 260551 245996 484246 30107 255867 299513 82669 407965 65658 403985
17154 403985 26895 133242 263914 73621 39190 -5249 -57336 173251 356634 -67299 421363
17142 316552 27911 543881 111907 374451 245703 68627 162774 441494 455541 276156
17132 276156 79408 416145 243800 501904 187651 419193 505703 -33291 305593 620657
17122 620657 294953 417359 250903 388004 265319 218596 185918 371906 521087 63561
17111 581593 468952 118309 516053 102099 519419 318056 401597 229882 107940 576448
17101 576448 27317 179213 329515 457801 318488 169043 591643 188743 444505 235451
17091 235451 579541 211121 72257 570328 322154 -45056 182153 462415 505748 399381
17081 399381 225194 100417 483737 572516 479964 411856 192407 288210 405753 721761
17071 721761 125201 352056 -2817 294244 584431 399891 628223 537893 347962 283446
17061 283446 462280 567084 382394 491693 651760 662955 501077 378040 151048 277722
17051 277722 213978 636296 510240 346760 407490 544036 442092 638074 313769 516929
17041 516929 487608 379021 460664 436782 586007 459161 619964 813451 612465 390760
17031 390760 668012 178047 545356 719131 650258 594527 756730 351050 565913 392713
17021 392713 678209 497177 465821 850469 463960 570437 717439 490606 740873 406494
17011 406494 665008 942614 511776 585816 328714 508291 589405 999045 685496 677544
17001 677544 473995 588835 614939 636875 581620 512362 865262 269805 795361 692259
16991 692259 773378 622823 581778 699999 631341 723164 568803 728340 602671 431488
16981 431488 871358 692804 720079 643138 1047681 817979 764206 1053841 766641 969354
16971 969354 825498 710027 548096 611905 611957 828313 848070 1134978 757851 893992 790438
16960 790438 943151 993192 722925 633391 579300 713444 862308 895328 757007 849171
16950 849171 821221 1231013 1132610 955392 839130 909187 1026339 1071265 644003 980224
16940 980224 1168665 994900 827843 862123 1224496 1179232 1061940 1209682 1308489 625840
16929 1092994 1375857 1179359 1047200 1491471 1055225 1159422 1329802 1145203 1059167 1383452
16919 1383452 1274493 1243761 1430084 1304882 1530633 1069877 1338114 1675787 1630216 1424432
16909 1424432 1373899 1190301 1256300 1566467 1511035 1551770 1512087 1352438 1303169 1599941
16899 1599941 1673017 1766302 1608733 1609286 1551517 1670345 1761219 1633597 1841805 1424942 1790425
16888 1790425 1488041 1675819 1518977 1970201 1699423 1770532 1949746 1935893 1722839 1693884
16878 1693884 1745077 1726454 1711614 1802966 2194314 2105423 2144332 1730022 2035322 1993197 2200481
16867 2200481 2111223 2417126 2304933 2382543 2064780 2514887 2284436 2464939 2330352 2456769
16857 2456769 2211208 2474825 2660111 2817566 2393397 2721733 2577017 2826616 2654322
16848 2654322 2849269 2822966 3060399 2874459 3083539 2998142 3177064 3191616 3327775 2980405
16838 2980405 3527373 3537623 3314190 3110968 3360018 3466589 3558024 3313771 3476001 3671886
16828 3671886 3581217 3889282 3759288 3844284 4151687 3873742 4364947 4074204 4193404 4254797
16818 4254797 4208543 4517695 4681681 4419283 4855672 4939294 4778888 4840379 4836180 5382363
16808 5382363 5192513 5128781 5631533 5391665 5525195 6150253 5895953 5894806 6101852 6291548
16798 6291548 6218720 6348205 6854015 6601186 6583959 7228655 7037740 7359382 7605891 7403929
16788 7403929 7924859 8431086 8373046 8372574 8761459 9199547 9087364 9309339 9659291 9404445
16778 9404445 9808532 10205255 10869532 10984084 11386896 11858924 11864553 12255832 12531565 12913731
16768 12913731 13270963 13684385 14098241 14693965 15043809 15378083 16196825 16557127 17237216
16759 17237216 17829265 18295291 18654078 19534516 20419182 20972241 21907952 22665247 23702371
16750 23702371 24692009 25316567 26680133 27323728 28663784 29718855 31005602 32622032
16742 32622032 33939733 35882349 37385216 38860843 40847431 42810334 45062104 47353107
16734 47353107 49820431 52044773 55112693 57932721 61131827 64329835 67537667 71737520
16726 71737520 75769330 79754462 83972210 88682058 94092491 98759706 104311651 109961965
16718 109961965 115586922 121463576 127505022 133254529 139047356 144586464 150343115 155418277
16710 155418277 159919434 164333328 167505434 170056123 171906842 172772123 172400780 171413717
16702 171413717 169264717 166554078 162962154 158312740 153110363 147860299 142178105 136525963
16694 136525963 130216955 123967733 118203174 112160787 106170097 100503887 95565681 90399442
16686 90399442 85450032 80669829 76520325 72451342 68379694 64676226 61589725 58093942
16678 58093942 55102844 51870729 49605895 47284973 44562269 42456680 40658917 38264945
16670 38264945 36600844 34904834 33359991 32094397 30577593 29154000 28096328 27003047
16662 27003047 25981907 24476746 23780416 22963670 22233444 21174981 20651244 19696548 18800979
16653 18800979 18405582 17684491 17214487 16533487 15833434 15423076 15102932 14458082 13837991
16644 13837991 13498900 12913006 12937858 12509546 11961063 11724599 11079311 10971986 10655894
16635 10655894 10198138 9824307 9822383 9490408 9142362 8877912 8678416 8388542 8437210 8048222
16625 8048222 7725701 7683563 7466746 7435588 7506226 7040215 6557336 7033276 6785709 6259563
16615 6259563 6370553 6593399 5858202 5827238 5950863 5605885 5551245 5435635 5343982 4938600
16605 4938600 5052303 4845019 4941101 4818418 4589539 4461833 4659713 4407726 4198862 4366656
16595 4366656 4067913 4271855 3952643 4094573 3991152 3715658 3590476 3684250 3580242 3303552
16585 3303552 3623019 3067450 3540168 3538286 3274107 3237796 3174757 3172664 2861166 2950111 3167553
16574 3167553 3038892 2863939 2876238 2477268 2528420 2834171 2387298 2519546 2356267 2704143
16564 2704143 2737907 2353777 2382548 2076519 2378704 2391357 2505349 2412056 2259256 2291873
16554 2291873 2414553 2117378 1808785 2059198 2158276 1958127 1849370 1894326 1738534 1819239
16544 1819239 1617085 1980627 1675080 2002990 1581584 1529514 1626056 1807059 1785116 1596326
16534 1596326 1537433 1496173 1732981 1598227 1615100 1783051 1724898 1321297 1764477 1362179
16524 1362179 1311400 1500048 1277965 1524963 1253893 1175465 1409047 1070125 1222982 1236737
16514 1236737 1544104 1346772 1226205 1679691 1123886 1422806 1100104 1398609 1209426
16505 1209426 1250844 1180177 1370366 1138583 1101614 860226 1364533 962457 1121632 1258044
16495 1258044 1011392 871866 917967 917826 912063 1026337 965298 865544 1145620 1003342 1208139
16484 1208139 801669 890862 905906 1072749 838475 735169 571641 1258093 673573 1240882
16474 1240882 1167320 812468 834282 979231 844281 1127992 733322 1149732 1065827 956594
16464 956594 861067 661912 1072033 600960 799991 674768 757625 596224 678478 1016698
16454 1016698 639729 909540 672077 581270 505771 975313 439135 487936 758756 459928
16444 459928 400478 636094 682930 625664 547337 411960 557615 490599 374233 823150
16434 823150 599637 431862 464881 445865 365589 778232 809226 549297 790740 551920
16424 551920 544986 684522 382547 739718 352790 394928 96842 573340 478325 451398 756760
16413 756760 438506 596832 296889 524953 467265 347999 425874 313802 656560 784033
16403 784033 172859 376625 352945 495093 294767 579426 525494 384567 633626 500587
16393 500587 363438 157264 410817 78543 324183 200821 233791 270622 670011 251821
16382 177106 455624 187942 431773 405599 694132 295879 631648 187470 674899 847412
16372 847412 296401 415705 389610 279501 314158 251482 440798 257486 210495 388869
16362 388869 251820 64696 122815 433318 203298 367645 272013 560483 432523 321974
16352 321974 273291 78903 251142 371385 143984 628846 582646 216904 399816 174556
16341 502673 522629 103945 123732 478722 416093 401848 334745 257919 438842 78520 494633
16330 494633 408817 -27147 347571 271208 301783 100284 201046 62844 159026 409634 192154
16318 464960 252120 154823 66861 37857 535369 209820 317249 15466 -38352 3506 127978
16307 127978 243454 -19886 330023 141771 -37044 76901 -74960 230554 337597 220490
16297 220490 -1635 385462 370498 164687 239673 16274 379440 289756 274536 140897 19642
16285 192394 368009 -52386 270990 388035 -38869 104980 135462 430864 -3484 290273
16274 499000 150163 78825 242758 113383 167147 313520 167835 245170 39624 193846
16264 193846 86542 235411 -58351 -16003 265360 291035 19225 71534 185789 413289 135748
16252 422722 411681 78436 -88095 -254497 153676 -44543 111811 291239 -111318 52753
16241 -80244 142532 159219 -73296 220006 44722 -8565 250930 129729 272441 154222 108500
16230 108500 -223641 234980 33656 -238670 165291 110198 -8375 204402 -187135 -4637 256123
16218 312894 55326 159112 -99729 134716 242446 43758 -93649 -129309 613771 -51407 359895
16206 87318 296930 147587 190457 -17858 144486 281433 -280739 221148 69023 -27393
16195 -37355 -7933 74082 401928 101802 37134 413515 -97573 217641 260070 98119 -33555
16183 94915 139509 438612 352556 -47863 287287 373753 133902 347337 76646 -271068 217973
16171 -117944 65015 117765 -33777 208124 -202510 293313 19788 -62518 168751 151863 -166326
16159 -343814 432834 156750 240938 -52277 97411 -163499 400220 35350 108292 -10309 278058
16147 -182729 -22663 243925 111308 253358 313255 -101121 -43552 72469 -9041 106510 173803
16136 173803 292335 88435 230470 -68291 60469 255656 292967 -9187 -385876 95709 -15093
16124 72878 18058 -144360 131738 109919 93972 105125 108528 217028 -155790 -8624 184152
16112 144302 -50007 25424 349024 147765 226366 757438 -93340 148908 37040 -122039
16101 -156196 -41402 248820 -175600 148075 264864 -198811 -128601 49709 -54798 276325
16090 241496 134442 299514 39813 137537 177938 42627 321117 161609 -140429 122693
16079 -89408 -194778 235391 -42160 156621 -47583 102486 -116019 189694 -173525 62427
16068 -76804 3330 419038 87024 -102054 48703 -133741 -268916 165440 118702 76014 49048
16057 49048 -103150 -57970 20403 237566 61283 -122323 23347 262284 123205 93694 156350
16046 156350 -53705 -179527 222418 75127 -165525 -26926 139350 -39719 202141 25895
16035 247409 -254580 35498 6361 97494 272746 9351 -200335 35299 -351489 -136963 147095
16023 151599 -218066 -211193 -21589 151198 249462 1683 -9384 -13049 250843 18477 47885 265519
16011 265519 -205564 73645 293096 -276964 -55213 -127926 -87066 21360 -80164 -31127 290880
15999 32718 -304128 314700 -138734 114573 72657 286588 460433 210880 -120640 389514
15988 99339 92344 -39087 124908 -116344 49861 -261130 402194 289 -99859 -77028 -165518
15977 -165518 114033 -106115 76581 -190615 7196 -187181 169073 310258 504882 311930
15967 311930 79588 116336 -13059 28262 197854 200271 -228590 213657 -254049 -99456 79414
15955 71346 223561 35838 32585 45513 -269936 -237321 15809 -95809 138114 78205 -230819
15943 -135446 86855 -16931 191613 -66149 292397 -133777 -123780 -400940 -41787 -24379 -182223
15932 -182223 -33504 59837 37738 -270237 -215911 -188400 32933 -173872 -221448 -186063 -487
15920 99587 -216449 144887 135285 133432 -31263 79750 -45146 -265524 -56965 -58333 -128264 384121
15907 123906 -93269 -197976 -245530 90100 52580 106143 -365062 -201754 91620 150413 -269888
15895 -421428 -116752 56244 365774 115175 -2840 -92315 -30267 105051 512086 -1549 -18726
15884 -18726 -107109 133889 -79533 -95230 -73135 2998 121108 -103297 -3883 15435 231746
15873 231746 -12108 -133449 32172 -46073 -52720 -15993 43405 161043 -255156 -309728 202011
15861 -23209 -178091 -48315 -127345 152570 -244394 -78829 107173 4699 16659 55800 -111491
15849 -170982 375423 -222551 -171710 259445 -257546 -4035 -88372 126993 7842 -122627 167938
15837 -122983 -30970 -74118 -97302 -71269 -166785 -84393 -80799 -387255 -100334 11332 35510
15826 35510 -94579 -101180 -160093 43761 -74223 -151860 -281069 225391 27793 -1123 6884 77949
15814 77949 -119119 -55238 173274 -69666 -71167 -239163 143466 86201 -183622 232611 -278365
15802 260932 -110244 239985 -23439 171801 147987 99401 136141 -233421 -203345 -153614 -29725
15790 406843 -148170 56433 135906 -224939 157552 -222320 -468298 -79003 -179578 190398
15779 -35121 -375400 188382 -260623 -134144 173560 -74966 -20714 13779 -100852 -111850
15769 -111850 -29445 -98880 -77299 -46857 -176541 98246 -20501 -172701 81375 -98543 209574
15757 9853 -82206 138978 -50319 79697 -304064 -303191 168097 86208 -9043 -64289 -43477 94866
15744 110435 -84542 -171378 451797 156885 30033 111665 150211 51559 -148437 61421 -72235
15732 396318 -146331 26633 123882 82447 -140691 -4371 -154278 243321 4628 -79087 -276763
15721 -276763 470653 -80258 178769 -109416 -14048 -399937 -116265 -122959 -216380 250735
15710 -58555 31917 -235838 -5854 420026 -98138 34264 77640 101762 76217 13249 -86658
15698 -22592 -197721 65816 -52183 71980 29289 25447 125628 -208995 106477 159008 221258
15687 221258 -255573 -66576 -52010 -15667 -131142 -107626 81547 -203513 143710 254950
15677 254950 -263259 -334874 36067 -127509 -92270 122052 -45624 -408207 220430 -25295
15666 -128166 108472 123738 -477235 -341086 197257 -60292 -323445 213520 114445 -127988
15655 56471 -242081 -197871 -87641 309966 138562 403200 -70488 374774 47091 253236
15645 253236 58515 -352045 -181206 -152778 194986 24942 -297438 -153551 101004 -289349
15634 -127212 244573 -107419 -175747 -8388 295997 -210668 22269 -20776 -271524 -164358
15624 -164358 191483 144633 -21465 -270449 -11650 -187793 -74299 48033 -89577 -24047 -76231
15613 -76231 -79312 100052 9210 -179704 -340111 -40719 104861 -35139 9435 -211985 29577
15601 -197980 105546 193562 -83021 -153246 10823 -47293 337595 121535 59713 228628 -155954
15589 -107555 -25042 173155 -26044 -133395 107989 237892 -87312 -100206 -16300 331637
15578 -154606 -239120 1126 -121279 170562 -231483 -54553 -143902 -109611 -97788 228491 -176010
15566 12294 -453220 -248786 110654 62868 -29690 196061 -82286 244969 252831 -163201 -39085
15554 -226169 195116 158287 204190 -103053 -107949 199083 307786 373436 -33326 76358 146498
15543 146498 -250923 -58974 117361 -81612 -297944 -100179 94679 166793 -165806 76964
15532 109270 96998 -84648 -140983 180910 -195334 79413 26619 185030 -1217 22357 -13952
15520 18839 -45178 297721 145325 23021 -183331 101354 -125947 -74215 19991 -136778
15509 -132606 160565 80513 -355412 -122333 322195 -183607 -896 -26558 107605 7364 97854
15498 97854 358202 11841 -85025 308990 -287804 -216548 3937 151273 -89822 83994 112526
15487 112526 -169608 -92460 131782 -322058 216945 58942 -83666 -240638 -35237 43577
15476 -125797 -12795 -184995 -92288 -199095 36438 2846 -67299 -60861 -68071 66303 60194 323679
15464 323679 83697 103465 149967 57120 -32502 -313595 32817 125415 243321 -253852 169852
15452 2065 24166 -210659 -51272 221167 293144 -410791 -157468 -18110 114112 3678 -108639
15440 -195885 203378 19147 -203451 300809 42372 177552 46257 73614 31174 -104009
15429 -121046 2373 204626 -140773 -104184 203926 -20214 178376 57066 -146335 -38984 -18991
15417 -177014 -161374 -121479 230707 -169979 -289110 -164261 72385 108236 11780 -223585
15406 -155182 -23962 4050 35485 -119034 -21630 81395 38532 -94968 -107975 291365 -21019
15394 -38364 -95791 401131 35788 232803 -254042 -11402 -72185 38447 64536 -86789 -129892
15383 -129892 -265266 -152674 287873 36367 -63818 -26199 -119269 104739 -66820 11008 95916
15372 95916 95802 237702 -43986 -63935 63890 160087 -158340 72368 -33003 48486 17718 294574
15360 294574 -342575 -49309 -37371 -83172 102761 -52944 -2103 -196158 -186514 269410 -127144
15348 -16617 47886 -63492 -168712 -73440 -6606 61650 261764 204791 1461 262778 -146585
15336 435697 41633 99546 84815 -223426 73169 -229332 90196 -191610 92732 267097 -92722
15324 -198092 412375 -5019 154803 -23583 -96460 -16022 40309 -136263 178415 36185 14924
15312 12209 302136 -96227 -35044 -286447 -49697 524028 267891 241222 123828 55648 -9502
15300 63661 154755 -263677 173115 -43808 47060 -162572 -12392 203396 -41828 65578 129169
15289 129169 -97065 193200 -25347 -23631 41016 319462 333975 204154 198664 -64280 58328
15277 -52217 84921 281216 -96132 -155631 -19046 -270908 273975 -103177 226849 152879 -864
15265 280595 -219579 168150 -21625 145422 -268415 112208 97859 -149921 -36877 -1649
15254 -40758 -65232 296871 -290089 -199562 -126423 -280402 130099 64392 -6410 -128952 329591
15242 -205141 -93617 260439 -124568 412791 387978 43904 565159 261964 848535 1258314
15232 1258314 1200928 1263601 1335301 672035 385017 347214 336163 239867 131880 350355
15222 350355 -66914 -271349 -53885 260019 -39043 -33934 -259908 -175959 -102805 74449 102191
15211 102191 14284 320712 -37996 -304096 -42802 145456 207860 -17454 -66973 140748 2596
15199 267095 -149755 83731 270048 392996 -11476 17966 93830 97189 91527 206008 -34430
15187 180464 191979 105808 -47030 -38025 -136730 -295564 8163 -410829 136008 -112029 -145603
15176 -145603 30588 137929 -27938 -186671 -31718 243185 125529 118300 -4593 -220303 -112141
15165 -112141 144146 -258824 136712 -10764 241993 224524 -179705 -68127 86824 -135029
15154 88649 276994 66413 220388 -123204 -243844 17758 -7693 196339 317964 -48174 176143
15142 -159422 -3884 91827 190740 172978 -130845 219954 -18270 96906 115441 -182614 15082
15130 298697 234956 144628 26927 204558 131196 246476 1775 523090 265911 -87077 167097
15118 45094 90602 31083 158460 27580 212402 311191 -135177 108350 -37346 -6932 152051
15106 48318 82850 129506 440344 649882 114523 46390 32563 208290 -98020 260469 163973
15095 163973 -255925 532085 204726 231666 50532 119989 33559 264499 103915 139499
15085 139499 196816 158898 223191 101947 338941 -62547 -169682 68834 94670 271053 98387
15073 105480 -319959 327125 238944 -53395 -82384 179788 -9498 2592 496997 163345 241797
15062 241797 134181 78566 73954 76592 83895 -252676 35497 -19991 -39549 298656 230505
15051 230505 284396 -30433 75206 -16950 307252 211309 -131252 190420 732178 11213 95543
15040 95543 115178 59860 -18209 -190250 182021 179358 451928 172754 -220185 209359 181683
15029 181683 8077 115804 332711 449717 -20344 123458 86286 543984 468472 353472
15019 353472 198319 734112 -47083 475972 110782 46042 -150464 330762 -1805 73022
15008 274744 73840 305739 -27558 258808 171483 440955 106432 175321 414757 317614
14998 317614 61349 55479 -70015 -38218 275197 298045 53079 144581 229334 121450 324882
14987 324882 73694 386732 209147 65247 270719 -21164 177043 113304 94883 -68371 53234
14975 393045 130561 522931 142307 150489 283072 198792 298211 179853 175305 220022 247485
14964 247485 46468 223995 218699 296978 130217 321540 184385 -82867 195186 510606
14954 510606 102971 517500 84527 274382 304977 121259 117233 260033 117165 340934
14944 340934 150090 375588 257103 226348 156421 -186855 94157 546107 237360 201709
14934 201709 -157693 448021 241311 192280 -142519 548270 282221 283670 49742 357109
14924 357109 -54347 234998 247823 151059 153758 168258 513938 334167 -228635 230588 166786
14913 166786 225861 128901 571256 370366 609696 393765 252470 477779 358130 589413
14903 589413 165111 182279 303644 104972 240516 172131 380299 218535 -193460 246362
14892 217040 142614 309327 41324 463947 283038 157799 109364 364238 306574 238641
14882 238641 308880 -25863 383755 209750 336426 280235 193044 279939 233252 243038 331764
14871 331764 397560 96531 289456 453526 394118 316185 258621 64536 10769 696729 530647
14860 530647 228829 372212 143666 134362 -19109 110578 432051 508135 184809 368506
14850 368506 592399 412043 421938 337267 138788 383691 352847 204919 86067 635333
14840 635333 251320 355386 444282 649825 231494 504848 156483 414658 368028 440505
14830 440505 419620 816675 420860 609404 479291 467292 389974 486162 296170 436372
14820 436372 507367 218452 437618 455618 774654 369737 605665 444185 100964 252545
14810 252545 143326 351829 470398 253465 275667 389733 619941 586044 85339 725798
14800 725798 269745 366330 644284 145846 364502 488896 624678 394274 496821 681027
14790 681027 -190713 596329 493257 452571 473012 604151 665428 592467 496496 450573 370677
14779 370677 815509 383571 736884 496550 442242 220951 569897 316867 206961 188170
14769 188170 380760 202918 416137 448236 358348 390864 599756 595166 294664 494352
14759 494352 705704 711626 442839 808239 484662 434640 783092 622164 699999 384979
14749 384979 354686 471925 604078 447322 507911 479965 688572 762209 408295 539415
14739 539415 710503 660777 760370 726332 577222 740236 454421 336377 679084 698702
14729 698702 887342 512125 472464 769179 751992 645507 868789 594702 941514 599976
14719 599976 559284 766894 599934 663882 706557 878427 652332 814312 647462 821517
14709 821517 436033 222904 617672 618279 670632 915267 739949 1134032 563407 517252
14699 517252 910481 741513 649451 880122 602136 926629 589473 618419 398255 850223
14689 850223 637126 522069 749801 987787 771397 449523 553193 572245 777731 690691
14679 690691 920755 842613 1087836 883616 727919 847021 830482 825045 788955 664604
14669 664604 1211027 728335 725734 1130191 1243457 578673 479819 665736 917400 874182
14659 874182 851430 980006 471767 732561 633258 966880 874909 825485 960976 937731
14649 937731 784488 1034617 768395 929435 1175032 747739 1049358 843485 869395 1021389
14639 1021389 996903 1046456 1012067 1128854 813483 1026317 980698 939770 1192898 1360001
14629 1360001 883810 1239046 1155980 1068248 1111656 972587 940735 980225 1293556 1152786
14619 1152786 1197581 1025629 937504 991515 1604666 1405956 1428409 1248134 1114725 1342381
14609 1342381 1232905 1302234 1361941 1065228 1296817 1322652 1095410 1212352 1236985 1594488
14599 1594488 1099327 1359381 1361853 1343235 1418765 1250394 1199503 1580570 1142419 1714979
14589 1714979 1660813 1525840 1202830 1537527 1051268 1025679 1345395 1728050 1847520 1235604
14579 1235604 1508349 1433715 1428884 1601635 1576332 1797714 1688377 1800204 1706979 1747645
14569 1747645 1644450 1720138 1580453 1949413 1908401 2113505 1837054 1969889 1912261 1937345
14559 1937345 1986075 1884434 2229464 2165710 2048161 2347476 2040838 2225075 2365748 2391304
14549 2391304 2368128 2512565 2329052 2501488 2646973 2692226 3072924 2919151 3260175 3886355
14539 3886355 4174165 4401617 4977662 6029034 6961669 9051949 12947392 20166989 31478817
14530 31478817 29932171 17887565 10979056 6519542 4495670 3475321 2550992 2172519
14522 2172519 2192860 2005260 2157603 2380973 2177499 2294409 2131546 2086685 2040214 2180678
14512 2180678 2203941 2299296 2107370 1820147 2280108 2081246 2302853 2158971 2417041 2420176
14502 2420176 2022830 2256342 2204856 2499411 2652620 2471747 2542131 2548209 2732703 2498268
14492 2498268 2460607 2633087 2663413 2753198 2686620 2921754 2593441 2716359 2852399 2924077
14482 2924077 2776256 2994352 3033669 2791726 2984065 3255905 3061426 3263197 3236404 3307724
14472 3307724 3288162 3511570 3253512 3511131 3010669 3306312 3276335 3366280 3123320 3476436
14462 3476436 3623834 3396989 3716581 3888361 3723226 3826224 4066604 3763950 3702106 3544529
14452 3544529 3813350 3915453 3738198 4069288 4394620 4255407 4215586 4280337 4192547 4355697
14442 4355697 4483571 4470391 4641818 4402202 4871274 5060879 4768589 4307335 4983575 4806563
14432 4806563 5243215 5087917 5318547 5207539 5385085 5421158 5167010 5235707 5940063 5561963
14422 5561963 5730254 5777995 5823878 6002433 5963513 6056901 6208042 6202679 6433819 6150722
14412 6150722 6006160 6814723 6440308 6843903 6900088 6887329 7298931 7058636 7397179 7369211
14402 7369211 7309112 7646272 7690336 7736761 7926430 7841252 8054081 8141673 8152748 8362065
14392 8362065 8646729 8743397 8893187 9006954 9318712 9446731 9580267 9537536 9766594 9697088
14382 9697088 10177969 10189056 10405669 10134613 10681224 10467554 10943820 11028536 11309036 11496222
14372 11496222 11810561 12159058 12689017 12443369 12427058 13230829 13056250 13451425 13398321 13673841
14362 13673841 14150334 14220161 14909385 15432130 14923595 15363504 15985148 16580789 16518534 17133234
14352 17133234 17094468 17919362 18086423 18296182 18371777 19324655 19481024 19777779 20342061 20978658
14342 20978658 21099921 22010939 22159585 23026388 23524918 24009430 24460460 25089611 25807445
14333 25807445 26305032 27242969 27863409 28914826 29361607 29611603 30646796 31878092 32684309
14324 32684309 33384992 34625408 35436739 36486577 37809736 38702513 39553224 41125227 42493724
14315 42493724 43893673 45052088 46904530 48011819 49600627 51516720 53437910 55276918
14307 55276918 57293045 59225800 61573977 63650918 66623192 68967332 71810535 74468042
14299 74468042 77632553 81158787 84141712 88168484 91927056 96216058 100422643 105016670
14291 105016670 110381019 115287093 120958764 126843384 133404523 139777501 146775317 154657967
14283 154657967 162570541 171292962 180169088 190112211 200053734 211191384 222722710 234816841
14275 234816841 247749245 261275602 275354215 290053634 305311761 319832778 334225233
14268 334225233 348596882 362208532 375506385 388252805 400194202 411438197 421432407
14261 421432407 430837400 439476921 448255655 455321782 458238890 459547509 461146146 456937089
14253 456937089 449805586 444418537 435694894 423329086 410445925 396482352 381831026
14246 381831026 366757817 351755734 336587968 321931207 307184921 292683827 278643464
14239 278643464 266018285 253228116 240761161 228756065 217345742 206562193 195992787
14232 195992787 185659672 175470616 166455203 157995223 149492055 141724485 134778364 127944619
14224 127944619 122392104 116744811 110787977 106260802 101324713 96748593 92609893 88848716
14216 88848716 85249441 81746132 78459103 75375924 72104495 69641712 66820155 64379060
14208 64379060 61764650 59836569 57685214 56134531 53972829 51984783 50443845 48948497
14200 48948497 47420544 45799305 44517881 42985648 41535973 40315333 39145853 38140459
14192 38140459 37814787 36396726 35463688 33873338 33032645 32310699 31684909 30720772 30031030
14183 30031030 29246248 28513303 27706035 26755283 26315699 25519143 25144620 24312810 23927622
14174 23927622 23091184 22431507 21997789 21518598 21121926 20630592 20103818 19912850 19060256
14165 19060256 18993216 18468600 18264650 17493687 17559528 16760734 16332049 16321344 16170022 15451964
14155 15451964 15160421 15106579 14762831 14382203 14103382 14095338 13503802 13672946 13246609 12910667
14145 12910667 12751693 12328288 12214239 11909622 11662857 11657710 11278013 11284006 11209771 11113968
14135 11113968 10801567 10639351 10173264 10272419 9938215 9971384 10104125 9519384 9340199 9269642
14125 9269642 9493852 8866973 8794618 8934137 8619835 8765993 8479699 8295240 8044462 7965104
14115 7965104 7961714 8157062 8045605 7599493 7048806 7394794 7473161 7320744 7125968 7081766
14105 7081766 6718659 6970856 6798242 6377050 6549999 6691891 6396709 6207482 6352899
14096 6352899 6202297 6304233 5902686 5937603 6010025 5567624 5709729 5689434 5886343 5333029
14086 5333029 5664348 5334209 5390063 5345835 4914545 5320431 5228347 5093493 5164596 5003407
14076 5003407 4923315 4648853 4816112 4890212 4748291 4464471 4609631 4116860 4397705 4265007
14066 4265007 4381821 4180470 4224496 4453154 4176260 3956093 3984710 4105848 4122192 3913483
14056 3913483 4066194 3889596 3992091 3790872 3937299 3571640 3751952 3464791 3801677
14047 3801677 3357343 3744899 3853169 3675974 3801421 3620421 3350263 3479054 3404984 3417012
14037 3417012 3224758 3376732 3186792 3256532 3124915 2806122 3180362 2954236 3017012 2926445
14027 2926445 2679505 2713329 3392403 2694872 2842610 2672258 3175960 2852668 2780081 2868406
14017 2868406 2903573 2755704 2629498 2742637 2907210 2528049 2777202 2788711 2700154 2287578
14007 2287578 2580894 2451101 2584169 2328770 2626653 2132610 2225040 2364936 2217745 2138448
13997 2138448 2196095 2079837 2078304 2326522 2053730 2216067 2291145 2059426 2100978 2111122
13987 2111122 1788105 2241487 2469939 2193052 2328753 2297862 2252171 2618465 2325011 2811477
13977 2811477 3056175 3630371 3950680 5828727 8610357 15076318 27259369 31300430
13969 31300430 19945723 12435039 8197842 5955924 4911071 4427829 3731381 3564393
13961 3564393 3296594 2982617 2839094 2790579 2334467 2606129 2529496 2324040 2208516 2217701
13951 2217701 2083924 2256684 1904842 2013255 1706733 1592180 1992523 1649343 1922321
13942 1922321 1748073 2021347 1785365 1834150 1673042 1745982 1748816 1801063 1674902 1894866
13932 1894866 1622768 1443172 1626103 1554796 1620093 1601422 1409248 1563574 1633397 1551356
13922 1551356 1508057 1352020 1528036 1648813 1484187 1724082 1553541 1152722 1485203 1659849
13912 1659849 1457305 1320857 1290031 1390771 1003967 1320105 1482473 1383883 1603563 1062901
13902 1062901 1523288 1251605 1639137 1061921 1209639 1084774 1240648 1474793 1007972
13893 1007972 1144989 1254875 1343709 1288229 1269053 1455323 1266251 1427355 1213969 1165465
13883 1165465 1209066 1113169 1338155 1555378 1340186 1147280 1054686 1379085 1024959 1032090
13873 1032090 1196917 1062273 903524 1233274 910320 1151063 787901 1226801 1011421
13864 1011421 759706 1059421 896103 770109 863300 1192404 1005705 1371147 995911 972828
13854 972828 1199586 1068881 649460 1172258 1297778 767511 881153 764912 1236242 925294
13844 925294 907306 1151607 997453 1255762 981153 1120616 688484 890003 1004204 962547
13834 962547 799306 950658 966935 731318 859095 890731 838211 730100 947021 787418
13824 787418 1152961 1058629 773172 1182966 942781 930128 1056134 726140 730299 456004
13814 456004 932701 797738 1087982 1043457 446061 975601 579119 665331 774957 556198
13804 556198 807093 872392 673213 817500 805712 761172 756510 761419 718153 830154 750780
13793 750780 616705 282809 765624 1076677 685502 551812 650072 520474 704540 563712
13783 563712 779491 730653 712523 729839 1251380 500361 839150 756419 875914 524492
13773 524492 701338 899771 610818 864743 853431 583397 386589 491104 409901 570482
13763 570482 782622 424162 732035 512307 467465 500540 534082 739120 745130 822781 542151
13752 542151 525403 608495 624460 499338 912558 534195 793701 699889 398868 860188
13742 860188 864790 616310 539722 317839 691482 694118 674675 493991 471889 788439 571841
13731 571841 565667 397002 695066 431192 736481 276642 484521 581455 523898 758815
13721 758815 567677 489816 345826 821787 552274 555176 412616 611280 480947 620076
13711 620076 339070 499108 502300 594818 746347 458076 419656 506842 716641 393777
13701 393777 346766 632992 162321 652751 487426 728759 306404 173896 644984 316297
13690 227044 426173 506812 466530 710132 204906 494431 421679 686811 259629 29799
13679 577742 455699 570090 680465 455607 521308 574035 428874 220808 131980 406529
13669 406529 212838 482248 213348 473586 561987 405258 384791 566051 335832 110194
13658 482895 584714 278413 417589 594737 575965 222646 588139 798164 296187 360519
13648 360519 413246 365182 407796 68428 386715 592452 498045 -37377 269178 440497 184243
13636 268134 397369 145459 322929 261212 351757 358299 10618 602671 288393 191827 313678
13625 313678 219751 404418 79531 413383 637246 432803 277282 439287 383458 452192
13615 452192 25804 149109 342792 425836 314695 353219 413737 472958 589084 297778
13605 297778 196906 379461 -101572 279648 397045 168503 262094 436155 207367 290971
13595 290971 562192 197232 216838 405667 312306 197409 170448 66947 348515 212471
13585 212471 363052 -52595 395142 7942 465202 357810 344787 265104 452278 283181
13575 283181 378047 459779 273841 384814 339175 -210413 288515 115335 362542 428546
13565 428546 535809 540967 506296 499270 424170 324696 336852 207163 25740 310338 151921
13553 383728 532705 388283 390185 391572 388284 -12976 223645 164652 342668 166267 586058
13542 586058 215638 728606 199334 319602 412933 197863 709946 116781 471471 420357
13532 420357 681583 56004 114264 69036 168301 310194 377839 77576 473868 -4228 96801
13520 212458 21781 529012 247715 538408 478842 418345 544959 375155 454725 185634
13509 154255 212619 239043 337724 217457 277182 99141 22431 86448 106498 265214 365088
13498 365088 282817 112928 111474 304855 143439 31415 133844 281726 627431 196062
13487 108570 29830 138231 296872 318558 259490 184987 425488 175366 -159352 383613
13476 110775 217768 114095 81254 321472 -27970 345828 496375 117559 305762 78032
13465 236706 536149 198453 325277 170351 280457 35363 145213 146105 -210307 386189
13454 176540 207290 25087 311173 429853 158854 397436 -23367 176405 160264 684065
13444 684065 79153 140868 358803 111627 363060 282458 136774 -138244 102848 209504
13434 209504 42764 109946 450355 305488 383936 306486 102265 143119 281403 267255 483571
13423 483571 296312 -17973 116746 256654 -96351 283553 531875 -82643 63013 155132
13413 155132 269257 398862 -267896 126336 29543 323583 -27133 120633 395893 -80272
13402 29822 79212 157009 208050 85454 184172 -46754 -9832 195533 285855 263666 -24847 457350
13389 191759 262833 24447 157494 206811 287902 90208 289556 28237 111077 372993 348421
13378 348421 51354 284832 115769 351796 98086 46342 -81703 256308 141218 271584
13368 271584 -182757 -19882 399737 323671 52384 246639 -87770 -106604 232119 214702 431813
13357 431813 289668 233899 34933 420369 69821 316814 -181599 505015 155086 26157
13346 376598 55042 448170 79422 191733 219834 154638 -37526 156698 245718 173627 226757
13335 226757 107181 381588 153386 98759 125936 45082 106294 535147 116194 410099
13325 410099 71796 467887 296090 600832 99477 201721 235237 362494 376524 16597
13314 457719 522033 23485 -137225 -114951 195447 195009 -14178 162624 62010 161779 369872
13303 369872 285526 107928 64301 173191 455742 180877 474737 268384 285350 146108
13293 146108 168368 205278 138888 327251 88896 321236 66695 103507 86344 -42057 87326
13281 -45339 253693 284092 238274 555419 182155 237435 34084 412279 308284 122840
13270 228931 267408 178586 136283 154720 -143531 190214 221200 -262642 -97152 236416 -68243
13258 177754 320211 292374 573869 -357078 -37914 -129357 274293 -36704 -174884 136335
13247 72110 217066 131541 286537 73512 64370 130552 -23539 -28985 26886 -359112 298562
13235 -54537 193456 328103 34459 -5472 475555 171361 88227 139011 -50193 -96338 -132144
13224 -132144 69907 -160040 11829 124706 463832 286153 -50733 63517 44698 97997 230164
13213 230164 -153320 7022 -340202 -1152 191258 -247629 78055 -11111 -61240 313255 -60831
13201 90416 287736 65143 -5436 234167 -6229 131162 177871 778 -96883 187218 5938 26833
13189 26833 416110 193685 3939 59880 52350 -31043 41064 468094 -113444 -96183 145478
13177 -40281 -29735 -104100 -53737 44808 220663 291525 107743 370970 202492 170321 37893
13165 254367 185150 72122 78169 446510 55778 22013 -46507 164042 106982 -46237 39275
13153 304552 281439 54855 203969 192114 135704 75229 70977 -55877 38383 176383 204827
13142 204827 -17536 46432 56363 -52713 -285429 162944 -235632 30456 231511 383832 71401
13130 158862 -34500 -11867 45592 -53116 -76422 -255478 109004 76631 145482 681 187134
13119 187134 44393 -64124 150835 37270 104716 144639 89738 163032 172932 29160 -197679
13107 115554 -187712 138854 -10345 227185 267668 59071 -40158 97586 119884 -66749 47403
13095 -138664 -83229 68741 196252 -379573 -65257 6591 200487 196445 -53251 72186 -93809
13083 115571 139384 -346667 -24651 -128225 -6536 90025 202705 12368 11229 -217226 190802
13071 97058 545 76473 -157471 -40119 472874 -117491 201077 -8238 -21671 259436 218526
13060 218526 201828 -89603 -124456 149219 150135 505113 122245 11000 268551 -52339 -93908
13049 -93908 95291 -138407 305358 399498 109235 -104694 18982 36115 -89393 -9433 -18290
13038 -18290 280217 16898 249551 56872 -39483 127302 258387 290816 261931 -152608 157274
13026 -87065 237185 143762 16502 263971 82432 409576 -39498 262427 13043 389014 176604
13014 -19308 301274 150251 111437 -72420 270014 80000 471346 -121204 112038 222701
13004 222701 -102608 116961 117659 124706 -183038 -55259 269553 119692 -1979 -67121 213679
12992 340559 287331 -69217 -49360 235453 492564 227135 70995 -30439 -104536 -19828 55688
12980 168621 -38998 258011 -134295 6706 196622 -74213 379343 250406 -121199 -121526 -251393
12969 -251393 -252993 -73574 -184350 -81593 -364332 -498 205252 79886 -143980 140851 -100470
12957 -163167 99276 316402 -197336 -35510 -28295 -129312 -357825 -356788 214093 237918 352021
12946 352021 50142 -92422 62199 59690 -49589 -206260 -161315 -223772 149737 231641 38449
12934 -21202 206375 28638 89627 157605 42590 303415 105327 -75259 95143 -36745 47058
12922 339669 244553 121930 -149726 341423 326035 233797 52718 45044 18186 -127948 56389
12910 -1371 24343 92783 127390 -202985 61633 182808 360115 3346 139434 117528 141441
12899 141441 -4764 -26329 -183407 -104882 -1821 -9041 104312 -24986 245141 57210 279303
12888 279303 29048 59731 11843 -168474 325104 -471704 -263727 113540 292762 36642
12877 -194841 -15071 -200308 143928 91712 77491 -147631 313031 8482 249169 -99041 277775
12865 212347 -137205 282659 -12670 -128021 -203456 46519 166782 33043 -52033 196825
12854 -34299 -86195 44677 -90679 171646 21047 -3480 -95636 -34477 -152042 196151 -150825
12842 -4425 205353 -102076 199954 47383 169588 -113291 -150743 311735 -84095 -17156 119409
12830 -279156 204798 -32179 -31913 243064 -189518 -64689 63206 21884 -8576 61678 17650
12818 37509 -101998 112310 15870 -80703 -57967 -174656 95979 237723 -122422 -64180 -54337
12807 -54337 247128 106850 30256 128813 -215298 274973 174710 287759 -275577 34077
12796 -3405 -88239 -87518 196543 308181 103220 -94576 55731 80280 -13968 -211058 38888
12784 24378 61830 254761 -13075 -240648 227508 61017 110002 134519 -163302 -14907 328265
12772 -34607 -78835 60395 286755 162906 183619 -215344 187761 376647 -96895 -175431 187586
12760 -2202 -3400 86401 88409 -60494 -205477 -197662 -184370 -244409 2774 126501 -94786 -574952
12748 -574952 -321285 -13162 87234 92475 78711 -95628 110240 -30871 128677 36212 113121
12737 113121 -155456 -3129 -41434 -315343 -112821 -62656 -194105 -133074 41316 -80172 -122211
12726 -122211 162199 -179054 -28335 39309 -67503 -15382 48408 167255 -42476 14027 -57934
12714 113197 -36707 27137 159907 120065 86540 -13215 -133330 166726 176000 -51563 168770
12702 -280997 -64961 9585 -49612 -162043 116133 20870 27618 2110 398125 93704 -71002
12690 302672 101484 192355 230268 -70387 311354 172687 63655 -145972 -54631 174006
12679 313096 -218283 -109478 -69459 211251 -135401 -232571 127514 435365 61242 116987
12669 116987 50061 31773 -389575 -145225 -29548 306716 35528 142672 45486 420423
12659 420423 50209 211505 231303 97122 -64470 -135213 201063 -194911 157503 -84445 165977
12647 399817 -15273 -353223 114082 221923 220157 -108281 324707 -62428 -348083 -133891
12636 165739 359279 -169816 -246667 101218 24486 185426 242197 208374 342792 156317
12625 279641 -45715 137802 -86395 75587 233008 -48815 226834 250966 132195 84563 120851
12614 120851 127082 461886 362025 217009 -128909 325257 339935 -150566 -99278 64357 407591
12603 407591 112085 183697 -379160 18170 171852 8551 53596 206110 -119899 265396
12592 -118703 210936 187507 -49890 -45152 -67976 -71494 49045 44338 -206374 368822 -14331
12580 320738 104901 223848 182975 118967 -138557 -69600 -325714 197419 -179803 180223
12569 -263487 258970 -60392 -74610 6313 238785 164732 -130055 238077 -94206 154895 -102568
12557 -47993 201416 -82031 173940 49801 271253 -75846 110247 -82300 -119731 78255 -144438
12545 -157142 135926 64872 -62544 104897 55144 17898 164150 79337 -25572 -195138 113124
12533 -18917 42216 -348511 -135291 -39126 240996 94540 177141 -253133 219549 134203 -321755
12521 -124860 241056 -192997 -185740 349813 57129 129499 92566 289053 -255389 -256436 -86329
12509 -5525 -148559 72085 -160897 466987 105520 -335276 291734 102226 -187163 -55314
12498 304580 -100214 -172113 -190902 17253 -103500 293142 -26078 -20888 289614 -142896 -72076
12487 -72076 -257999 -84268 -136050 185907 -261078 -214384 2019 -74457 252291 105888 -202748
12475 3 59834 19844 -142242 193124 341947 307925 6536 92634 27690 65238 -171216 -59080
12462 277927 -258458 -181510 155288 86863 54003 52383 254327 137148 41086 -114912 -74094
12451 -74094 141352 -250316 -168430 -120780 -245468 23453 61462 179052 -100431 -259848
12441 -259848 -244173 334646 117684 -34345 -97316 68705 -190530 116088 344176 50227
12430 -353861 25245 10862 238494 -341813 -125891 93266 176691 -10225 -453852 -8266 -57560
12419 -57560 -74817 22172 -262196 57440 73944 -48905 -418619 60066 100904 1694 39426
12408 39426 164642 -241461 -17632 -115600 73523 -23065 -49392 -47792 -92527 -88320 -42732 -133943
12396 -133943 -61140 95193 -354406 131688 -133372 -236820 -247107 173009 230024 -38557
12385 -109711 1833 20619 62980 -231166 45589 89346 443020 -189228 -43228 48412 48109
12374 48109 219267 2122 -69157 92665 109848 12059 -155571 -139080 -54992 -47665 38877 -188637
12361 400989 -137724 -141335 145167 -50253 73468 -67343 -281723 -181416 -316223 -116642
12350 50816 8772 290253 -22324 240570 35892 -218557 110319 53023 108074 -36387 -92710
12339 -92710 -47791 -305954 32150 -113431 67829 -258094 70548 -152885 178991 -125326
12328 -81735 705 305320 186928 -56122 12057 242303 -112437 550339 287050 -40076 144366
12316 157709 79761 38039 119470 66163 242658 -133203 62147 171273 143965 51713 76874
12305 76874 -354293 -447939 12605 146318 117877 -210578 -181530 -82774 2659 -59211 -11314
12293 145907 -233785 119477 -61009 209252 130576 136069 -289064 41131 -211349 -123629 295615
12281 -30808 -165431 42814 247991 -31613 -72387 -71571 7892 165394 54742 226524 40524
12269 293875 -66759 -443641 74100 -38690 -32880 103147 238033 -28827 166575 348819 -133238
12257 144211 479294 -220480 130976 73672 -151772 87800 153051 -73586 -139767 -143110 264370
12245 19306 -83353 -49622 -175177 -33009 49094 139624 -96988 -68206 51104 60362 94875 18422
12232 26197 150650 -222712 -263910 170250 273992 487854 -51103 89278 -87735 436352
12221 -142857 -67508 15048 -53860 335927 63930 251613 50720 232697 162009 103418 174155
12210 174155 138747 -69216 386342 322093 -229641 218933 482223 235027 -51024 -148813
12200 -148813 331488 -200580 -187806 48011 -8885 -87344 48478 403576 -250865 77804 45158
12189 45158 51137 143103 190007 253814 112254 162195 407239 28417 135565 161505 21834
12177 -610 457678 267033 29267 54030 295202 200514 -111800 -215746 57914 116890 230220
12166 230220 -137459 -56909 254872 142684 294277 -155159 198376 564980 278509 -37586
12155 -334432 -35697 321963 385548 -33376 274088 -99107 268487 257811 -103010 239111
12144 -29160 74530 72862 156135 126895 -380514 206739 248535 -81078 185799 109926 79455
12133 79455 -25803 224318 -271229 32332 60516 33458 184684 65902 152643 -140060 175783
12121 -225798 -10442 104885 -212896 140256 40141 -42058 -177069 -242301 51960 64765 59120
12110 59120 -286075 -100074 95444 133744 30611 206954 -101403 -250050 -33276 -202230
12100 -202230 -131779 -64131 226626 91955 457389 -20796 -152557 122139 75837 -208906
12089 -202144 128679 212787 -65866 145679 325055 -176358 -108115 141883 75306 -205076
12078 70650 -223592 67563 233289 136002 -68167 -61011 -306654 -49879 202237 54345 112545
12067 112545 -17950 234139 78852 189792 14072 293947 -165826 770356 1036900 684671
12057 684671 416307 -79172 -57726 -12612 199415 11347 -150417 -76712 -22901 -75590 163929
12045 -247487 139149 42289 105985 74627 -384514 332935 268816 -429380 74863 114855 54687
12033 -217021 120729 140129 -261912 -91185 -17697 25527 -173045 -57399 195129 -251874
12022 8065 -48328 -50306 158436 22056 -259658 117935 -118856 20218 156836 16131 -175350
12010 -142838 -214571 -113064 76072 -82777 -73215 -100596 -43445 123401 -10813 84819 -429632
11998 7319 14243 -97613 135819 200836 474108 32781 268951 6823 98170 -228538 54865
11986 71840 101383 -45885 -183779 183807 149881 -346060 -28923 220667 63964 227661 -76198
11974 -155948 122269 -438641 244355 65925 18400 384575 -437082 -380373 -210890 -40642
11963 -109859 94634 24239 -311055 -14349 -66771 -472990 -161626 112374 -211276 35791
11952 -309325 90523 -77435 134088 11104 101933 136847 -200685 102510 -82417 -133851 -145912
11941 -145912 -70060 88167 -131575 -143135 194438 325169 217540 64421 -91971 17862 -155485
11929 332482 123462 130725 -229834 42240 355238 -167330 -67403 -208028 35410 -195780
11918 150934 -23028 326442 1213 -297066 -6015 136275 2598 2844 -277607 76507 110478 220096
11906 220096 -217126 -55217 -29944 -133817 51194 -85382 31361 91748 7852 245159 63909
11894 -91241 -243745 -103844 -94688 149037 -375488 138209 -371175 89073 142487 137543 142798
11883 142798 -212360 29694 -166192 216948 -256025 -232551 84642 44391 -411897 78263
11872 73869 -47194 43966 -203587 -33182 -145437 -87049 -179910 105863 295719 28394 -198147
11860 -406357 -31513 53771 -303582 -218310 134224 -211520 36926 -263113 28433 10999 70626
11849 70626 40852 -135035 13384 -284802 -99203 121896 33907 -507034 9740 58747 -89973
11837 41042 30254 115708 42590 -26544 65556 -57484 -226399 306110 -361798 -1209 -51297
11826 -51297 25984 -66655 128284 -121352 -233840 36012 -248707 -249176 -298635 206793 -126928
11814 -414295 243549 -67107 -75093 30177 -14564 153668 146411 -38632 356783 173126 -189136
11802 -206672 -161777 -53496 -111368 167624 -124063 162380 -313043 -214849 114813 157102
11792 157102 -190817 -62139 74082 -250359 -71386 -18023 -133693 -223689 -429950 -104212
11781 -71970 -193938 74405 -384024 -62903 -178384 -64681 72123 59086 -427422 163742 -176642
11769 -129642 -166085 93123 -63750 137761 -208146 -106066 22646 -151280 227803 -122451
11758 -78152 -57742 90327 -31034 531185 465703 -150779 -31338 9964 61688 16964 -21256
11746 -95732 47283 100143 -206042 427647 -118057 -203947 -35793 455941 -181432 190103
11735 75237 -172449 -233449 -200519 -118087 -156827 -75419 -146054 332777 -276073 38652 2336
11723 -201449 -25874 -261457 256276 -251481 162710 -1641 185669 -273387 185253 96324
11713 96324 -339459 261013 300643 -264136 201964 -407966 87881 -133190 -21703 60850
11702 -16683 20256 -197007 415783 82092 111662 257537 -7679 267772 44697 -56594 -83527
11691 -83527 332235 185467 -81795 -55493 105090 53690 -77412 -64923 74328 18022 413188
11680 413188 -17422 203472 175551 -344948 -23877 196459 23123 93036 -301129 -64631 52230
11668 113059 133608 -6468 -176985 -24671 21248 -8382 105452 138104 202636 205881 -87280 -48989
11656 -48989 -102430 205336 208543 -115960 4184 10655 116076 132377 -27760 409770 242234
11645 242234 -43126 58688 65095 282951 -278484 425484 -88767 -155903 166171 -173738 50212
11633 -42225 -323847 -15109 -154074 -355927 99623 81287 2429 -151884 76012 -139633 92078
11621 17704 152255 195828 -63444 -57632 33007 322839 -188708 -24265 -60978 -25708 -131139
11610 -131139 26620 128125 -92196 26566 -101882 188550 89695 -191910 -161319 -356947
11600 -356947 120856 -150306 -8362 -38111 -246794 -110274 369025 -79545 3178 -128950 -284958
11589 -284958 -81423 -80191 -165139 -44806 181417 -299268 56737 22133 36766 28436 -302840
11577 6196 -182825 -61068 -310487 -56664 9400 -58260 249313 380222 10536 137471 269644
11566 269644 225493 -66713 306106 -160487 -34927 -8948 85856 206097 133255 231831 -17151
11554 -84802 36537 145577 449446 419743 -11993 129012 -136610 97731 42853 -156731 33954
11542 -70336 223543 -27519 178713 -20487 -160451 165219 -347938 202918 22428 244779
11532 244779 103798 -168885 -117815 437687 -36040 196841 -215007 237066 8036 48907
11522 48907 -103753 137181 118257 -164204 -69882 113048 233923 260258 353938 7978 43387
11511 43387 281966 -296631 -137668 163495 42545 202646 112420 -37419 -81911 326457
11500 239985 384542 -40544 -190155 137290 -219522 93428 64322 65021 -103705 268799 55756
11488 246411 183306 187286 -65931 304125 142451 68897 -330817 156366 -268171 135250
11477 58597 -11056 385390 89395 423962 223192 117245 113027 37698 62449 83908 135850
11466 135850 27166 213091 -166462 16561 149122 34010 362435 7094 -55422 325821 83146
11454 448198 397317 25325 165039 302759 96237 116313 13756 129527 58711 172053 -5131
11442 322299 110466 -59306 -278813 29270 51275 -21374 112590 -30422 58755 -216479 247060
11430 52148 -47186 115326 105851 -6143 243316 -112838 6281 332195 213131 -122397 -119845
11419 -119845 295192 -326689 -143688 -166254 278226 -152142 134292 70253 -49321 47265
11408 -17739 -258199 32412 -121157 -24297 -138575 488433 -192878 -116049 82329 -39153 -112992
11397 -112992 236763 21934 -163093 374649 -106167 66678 -166393 325216 165666 -233312
11386 119836 -315529 -301753 66351 167000 82047 161192 23439 115106 135330 141891 -95432
11374 194965 -42137 -72383 162496 -77697 10038 -236779 -24695 -297245 263954 178392 237501
11363 237501 -309816 -21310 163295 -226344 -100608 -177569 162526 131264 -393486 44588
11352 149871 -248239 24686 -7365 -15485 232445 105998 179421 -216587 142322 -198268 -95196
11340 -126205 -297683 59354 -301748 70122 30877 -25341 194560 43311 475792 199336
11329 -24710 58767 14747 -451324 -146643 -35400 -13866 330105 -2941 -52809 168263 328597
11318 328597 -83040 53114 156339 -112023 10659 -251678 -106641 15326 274553 -62322
11307 -20854 20340 -133527 -135335 161698 -59637 -198117 -253970 -184991 362464 -246173 -314069
11296 -314069 21313 55475 -89599 -243007 -241715 -179980 -15656 18218 197561 263032 -230778
11284 -244515 238062 -153140 164313 -165329 -72912 15187 -9329 -191487 -100075 86683 -572
11272 -89373 -78958 65674 100172 77911 -210555 -260002 -290174 -362923 142071 -227285 164415
11260 -318931 -32059 164454 -5408 -49121 -103223 45261 -232928 3903 -52082 126615 96415
11249 96415 30776 -138464 -6889 -253516 -418328 186727 -327535 -68118 -159361 -104146 117642
11237 48087 -297407 20927 -60937 -69914 -161974 -122784 -181629 -31841 285240 -200229 -102053
11226 -102053 53522 23465 169755 54354 -112277 243064 -65976 -119370 -115031 -36184 -65222
11215 -65222 182737 -90994 -9067 -1293 -51933 -24694 190988 -170859 -27806 -12205 -162643
11204 -162643 228521 -253581 113806 -60891 -190574 -69416 -225671 -86076 -154297 -126975
11194 -126975 5356 -198875 -283849 -77966 210293 -57699 12573 -121595 -201794 -122518 -270171
11183 -270171 -198240 -395132 -190069 -334990 173470 -151962 -53045 -15507 -62282 -65396 47202
11171 12036 345488 118403 215421 -53104 93858 -237583 53706 -145949 -94 -188933 180382
11159 -251942 49913 89904 -199138 -258150 -262541 82498 -113001 -192627 61791 233322 -6646
11147 314931 -142378 108890 -19036 218270 -67864 -144908 328390 109403 279786 10048
11136 333961 -223095 -343504 144079 54845 158533 -97940 74978 -292992 23349 368 105816
11125 105816 173573 -7680 166850 189424 -17661 -145017 -58906 -68762 4700 50869 -272705
11113 -30145 82195 119815 -351861 -6082 81397 21437 223941 -111014 -18231 191300 -12586
11101 233547 197712 95075 -386430 191426 229961 10732 103470 235224 -15954 -296368 74196
11089 -92277 -119423 269994 94684 11767 39358 235609 215165 -244153 -21797 379540 121859
11077 265781 244880 182644 387765 -201249 278796 191696 9174 190230 -76384 310815 2813
11065 461340 110829 270054 329226 85525 184439 277489 373327 322135 180029 115369 161707
11054 161707 186283 327174 232306 514647 369383 403656 316831 466324 264202 593463
11044 593463 651036 534732 446626 660362 637466 678282 976207 584040 540127 427545
11034 427545 642318 507495 792217 844714 1172604 635171 726529 609465 592976 839241
11024 839241 603578 807485 826973 494485 671860 663879 792546 467870 481703 725500
11014 725500 653267 689481 841565 668209 926027 703677 537633 778688 644274 683025
11004 683025 362612 562261 466563 624408 966784 905271 666770 480053 608209 656460
10994 656460 470136 415619 608657 398853 756170 613323 298692 404794 567583 865722
10984 865722 613453 261663 512678 732962 298566 679903 255841 811782 449020 824157
10974 824157 669452 701144 853957 411035 1223052 784765 718679 1144238 1405772 1047167
10964 1047167 1106764 1437716 1554265 1513757 2093254 1965683 2353659 2313297 2614511 2586976
10954 2586976 2360996 2527196 2186812 1797217 1979525 1610388 1134861 1393635 1182588
10945 1182588 1598079 1684549 1452931 1479020 1034932 1541880 1362184 1299084 1168534 736728
10935 736728 689588 556086 606465 292276 636083 410828 465391 225917 238915 314315
10925 314315 -33990 272668 139794 321573 52336 43329 226701 256513 -182885 59416 68200
10914 68200 306943 81873 -365627 80609 263667 71252 -313344 94846 301596 -147449
10903 102573 123352 60055 23919 9261 40291 162784 -210642 68451 -125830 182745 177380
10892 177380 -168224 -170441 -313612 73512 -117697 -231886 -251900 383401 17447 116079 -208983
10880 -113398 224026 -469834 200663 -201716 -2160 103936 12155 -62677 -166657 -255160
10870 -255160 -55873 -117772 -170552 415248 -150689 -2753 -110171 -161468 199318 -71984 -188363
10859 -188363 -36620 24822 -56438 185965 143621 232950 -51666 -270896 -123441 25698 -203264
10847 95145 71812 -70870 -152711 219761 -113562 270965 -132591 -130837 -104018 -102553 -8258
10835 145412 44798 -257976 209569 -47001 -190950 -278175 98759 -63842 24995 -4802 -195221
10824 -195221 278379 -231106 -136621 3374 88599 201371 147499 273915 -201735 7032 165369
10813 165369 133121 135002 -242421 -78606 45438 -98854 53586 47111 32610 -118714 -225338
10802 -225338 -173508 1977 -3387 48051 76938 551681 -29226 -50107 -118169 -318179 -182917
10791 -182917 22085 5579 26820 -300161 176215 25106 -275174 57072 -106334 330086 67268
10779 274248 56798 209875 -134415 189182 -36945 -111137 179680 -211916 -276149 -51877
10768 41985 -462159 -76412 -142067 203312 -268551 -180743 -143129 30737 47330 -485886 -89931
10756 -383349 -414608 -186391 7543 -208515 31389 107524 -36378 11479 10568 47005 31528 -118657
10743 -147719 104883 56898 183367 -124672 -502709 -109750 56650 -101859 -129221 -151425
10733 -151425 -88375 -45436 -206703 24655 -259534 -330050 -148558 73006 -96474 -56204 -354907
10722 -354907 -76849 72170 -244737 178968 173397 -150136 -16978 -436702 -134657 -160498 280730
10710 -91916 -76653 -69514 -42458 -117052 211919 -64209 142441 1858 -141711 -11842 -173393
10699 -173393 168019 -120317 -158933 317105 -198984 -273043 171561 -206984 -154581 -23656
10688 279575 -226675 -94707 -41130 -191590 163472 -119994 73394 299808 -388674 21304
10677 -214626 -84487 266303 -2850 -379342 67723 -158610 181310 178571 157939 167731 -79516
10665 -199823 -323948 224170 123331 -234009 -36377 57257 111293 -68720 -304828 -5958 39780
10653 66087 2601 -29098 -221930 -310462 19909 -198073 -176122 -350802 -52266 -267430 -259789
10642 -259789 60931 -31615 -458960 35027 244987 -295130 -124897 11454 -74061 -12309 -224697
10631 -224697 -26763 220117 240 -637240 -36970 -183273 182757 -121948 -136293 115039 -186171
10619 -367045 38914 243430 -64494 -104263 130699 315954 125368 215686 -129973 300337
10608 -538 -63332 8561 -268881 61039 -96123 -334995 317925 22780 -61343 98743 246040
10597 246040 274844 120031 -159158 -78457 26203 195681 161247 -280852 -106742 40487
10586 212860 -167846 -99369 -59202 -303698 330046 -52370 -174392 217267 -179230 -220983
10576 -220983 -73551 138133 261541 -170814 114031 18887 -89505 -318445 7722 112991
10566 112991 -290132 -91499 -20485 14577 138568 -61491 -98963 -303670 -134469 -50834 107618
10554 -265066 109003 49673 -114647 100846 -17347 -26799 -109452 57372 -298200 127351 -185823
10542 -466548 -197677 88291 -127401 -39660 31731 -40163 126398 177079 -76658 -327324 -156212
10530 79071 -175731 -248323 -291254 155179 -62909 79854 210519 354180 -272324 -384264
10520 -384264 -515 -9107 134953 -114972 -78458 -39637 -160006 -10313 -7944 167137 96203
10509 96203 -206665 142467 -29278 17574 47328 -63847 -41395 -234205 -114053 -2924 -13497
10498 -13497 140891 -82842 -78113 69979 133938 -141142 -54161 -401606 -116038 -37202 489650
10486 81345 83715 201553 -17874 -388259 268866 83965 -276921 -169296 -115352 -166713 -213017
10475 -213017 -304121 -26950 -138373 69377 73684 -90577 -198009 217136 -201777 131071 391016
10464 391016 177868 107397 -9432 242889 263280 271876 243272 83686 -334274 35758 -108586
10452 -225767 115044 33941 9350 -240154 -15338 14550 297576 -182978 -203676 -82545 27144
10440 88591 254981 -238103 -165424 -148226 -224333 18848 -219858 -147088 -208381 67793 94131
10429 94131 103094 -56560 111315 286940 76784 -280893 -311101 -230321 -114221 -104648 40567
10417 -50742 -242786 170260 76802 -170233 676 14246 23705 -61369 82196 -286249 43803
10405 -54536 -205608 -132502 -209055 -75529 15490 -45077 145021 -283490 -148689 -236390 -160380
10394 -160380 -268696 117462 56298 32348 183497 -200348 141810 -131440 -124308 33178
10383 26901 -185915 19055 -72373 220845 -185940 158350 -109059 100926 -172208 151956
10372 96719 -68639 305043 99467 231133 67739 61980 64258 161261 -204046 128058 284679
10361 284679 -222078 110938 389856 297501 54962 199060 254105 377970 87891 359653
10351 359653 290669 411682 640476 313180 220547 252455 169198 -32440 -247839 260270
10340 -4659 216501 339290 304066 5283 772259 458096 297182 534643 -266766 179536
10329 525143 521243 7523 107036 151892 283449 509239 408212 58800 216965 193709 -139355
10317 323862 302229 78813 243033 19097 18261 -3679 -41912 250731 33843 239549 -155574
10305 -52506 222433 173549 80395 228806 -28479 -61302 122049 11856 -216417 -123494 -62357
10294 -62357 68964 148968 26369 -103711 -149661 187312 -18460 24276 105684 -167063 243858
10282 -185062 217518 236243 98388 19202 -173029 105943 173881 77419 -305245 142986
10271 -201956 67233 286695 -18906 72251 -154607 -189031 188201 232099 -151384 152864
10260 -169232 -324540 44416 15619 16709 225381 -180701 -500028 280654 70868 90537 87168
10249 87168 -162435 62152 126447 284055 170573 145556 212625 249506 330081 -117282 314169
10237 103486 100109 242738 77655 91472 -32706 107566 71968 247327 56132 212126 240607
10226 240607 36613 258710 252509 -173918 -159804 -80710 -471725 386936 60628 -107678 88846
10214 -131433 -148266 -458955 -92816 -351198 170866 -258953 -51839 136748 -87171 53376
10203 -95485 -178588 -16288 -20612 -22908 -225619 129509 -129000 -282599 -10725 230122 -53767
10191 67247 -227837 31794 253066 183343 -122960 222523 -51788 -161568 133792 144139
10181 144139 -116060 -208832 -83504 144816 -179853 -243095 -348943 -92651 -123415 56098 -42545
10169 -8650 154922 200948 -119937 -225840 -59489 13479 -316882 -62393 -284368 -119973 -104175
10158 -104175 -82584 -45555 -266482 -258951 -49950 84986 -211452 -68622 -292783 -128213 154551
10146 61446 311153 -140590 -82892 -27003 286521 -139344 13981 156243 -111953 180445
10135 90919 121700 -66447 -118515 2306 -117480 -64084 88703 136887 -196687 -60348 -58197 220005
10122 -257415 -52769 153050 159230 189733 -35645 -136671 -357721 -84554 159113 -227266 -171355
10111 -171355 -4620 -22916 -75105 -37570 -133983 275 119664 -165773 -291456 159165 -349785
10099 -55189 -76795 -55629 -185437 300172 -114215 -208181 314321 -267933 -16642 307877
10088 -119892 -227081 49350 -179439 -72062 236933 29676 173283 -132081 -154740 4395 195118
10077 195118 171648 230948 -84428 117592 119067 -306302 108599 -131794 34982 98286 -79177
10065 -7261 357755 197333 103226 212988 -110094 -276572 -32560 -115101 -154313 171937 -170486
10053 -149869 63824 -19280 -41106 -87197 -258087 275871 52874 -33150 -185954 96300 7671
10041 -91435 -173713 -324379 -105570 -199080 -230061 -31606 -332578 187179 -236379 -98631 -342319
10030 -342319 -122058 13237 -56865 4940 -27557 -191338 108701 4574 312529 -193792 370510
10018 -376014 68851 162712 -4780 -365442 -140605 90717 46962 -103499 58637 -52931 40290
10006 -91716 106572 207305 -201322 -171877 -403904 2921 -80276 -23831 -156619 -7052 -129980
9995 -129980 -276192 12032 -174056 21922 -288470 -215656 -45140 244755 -92148 -73006 47158
9983 -165011 -261397 -438482 69184 -133642 -115157 204953 -132692 -190493 -403671 49338 13106
9971 -30984 -86329 -63138 -201569 146583 -100820 118019 98875 -22116 -132744 256610 -167259
9959 -110510 121690 1279 -224796 -266071 171548 -71013 44473 -36748 -218840 -102991 -241889
9948 -241889 150718 -271439 74963 -31352 -240061 -161377 67340 39839 -186262 -411124 12107
9936 -130714 -26369 288086 -73918 269916 -128196 -166612 -87986 -13209 -166609 -209322 154005
9924 36457 -11146 -30564 -184627 47171 281126 -192294 -344281 129807 -208319 -230372 -113530
9912 -98193 140268 -455706 -138338 -227900 24270 46054 88336 21431 207443 16463 -141784
9900 -4993 161663 189332 -27684 -173407 -267980 34653 90015 243364 -120118 48542 -67029
9888 28817 -126646 159698 116640 -64437 5585 -213133 37360 177520 -84314 -99742 4336
9876 12745 -77593 126440 -89461 155667 -25010 39451 179321 -191667 -36944 42889 -67147
9864 68007 -66210 190244 -295990 -255739 -196022 -432592 124970 -19883 -261702 -359947 111153
9852 -95977 22373 -247609 -105863 -54478 111734 -121554 -370800 66232 131603 -312293 -74998
9840 -69218 -129530 -36053 -96972 36378 96060 -118417 -300705 -162760 -128563 -196321 -146439
9829 -146439 -349224 -50046 102882 -78664 -72579 42000 -147376 -46288 77139 37476 -64099
9817 -242356 -10262 -395983 -222434 -52048 -129098 19580 -124523 32356 -86978 513151 172376
9805 89194 162154 -47095 80167 -92621 169078 -18449 -146852 191178 -300161 -361766 49737
9793 -32964 14595 -146437 -141880 229129 60015 -75126 71372 -171544 -105758 -128751 105703
9781 37403 9271 149328 110189 121745 -85954 -321897 -54566 259076 -418598 -133923 -339881
9770 -339881 33488 127111 68569 36390 244622 -249348 -186253 -152738 20404 -25877 -86436
9759 -86436 -114310 -104215 -106606 33786 -64725 -156236 170987 -482626 -104793 -304673 -256197
9748 -256197 112345 -107845 -155169 -5943 155359 92320 -233404 -28593 -63317 -75084 -224266
9737 -224266 -178418 69231 36361 343903 381457 -314504 243724 126755 -22346 69665 -191340
9725 -221515 -240759 -100899 271936 -139246 -4100 -159696 252 147118 -368098 -260471 177500
9713 81941 106052 32915 156776 -331983 -103973 132823 -142729 -416456 -127562 -228358
9703 -228358 -104979 27398 -278121 -244181 202914 -78341 -118747 -201881 150445 40017 -176074
9691 -171583 228643 -112936 -139905 132058 -177115 -163619 -64958 26806 -89112 54733 -209708
9679 -26762 -218902 -99095 -77786 -60359 -112077 -84316 -9003 81729 202755 -64110 64936 -92395
9666 -65502 -225366 -140587 -292868 -162769 60472 281952 -12823 111750 -12610 350540 -36274
9654 -108943 -180096 -2675 -87014 -309393 -33481 -225333 -196893 -140607 214184 -328938 -81136
9642 -235270 -164640 174129 -146247 56752 -228513 -515424 46349 -138889 -171057 121604
9631 8985 -87487 73346 183945 8675 -196311 -218264 -255128 -308127 -20075 -211904 149038
9619 -145152 -364104 -390632 10085 175641 126458 11020 -238179 -241572 -204670 109299 -236445
9607 -115266 -157283 -127488 5629 371080 -121222 29402 -12617 -101670 -121037 -168284 -209850
9596 -209850 -12539 -204638 -98606 -253207 -184129 -147353 -133221 -167138 -286005 -98138 259118
9584 2458 -83567 -309230 -20309 40652 159802 -118548 392332 391 -73951 -129625 297351
9572 -2949 37387 -136588 -128932 -498088 -150321 -65488 154313 -255027 -144454 70873 -275043
9560 -175146 51255 273416 -225726 113505 283682 127305 -276183 69156 -128335 -93769
9550 -93769 113668 210054 -232546 -160661 -44505 -145993 -267950 -22021 23697 212146 116046
9539 116046 295281 112009 -210295 -112241 24726 92507 364163 -259901 -25437 -313214
9529 -313214 -72776 38924 -41955 -74672 -100475 -187039 -116478 48301 -163813 249667 -305479
9517 -233230 37067 -93676 -51375 343301 -141165 -188338 -89147 105887 -185422 -5654 10703
9505 144820 -126230 105031 -349818 -158396 -74167 -218778 133065 2057 -149833 201002
9494 95089 -108907 -247732 77347 -102840 -84184 -3121 99686 32443 -106064 -25392 54034
9482 269701 -115752 137165 177639 -44026 -236021 8828 137921 111742 -251487 144942 135248
9471 135248 -328002 -117591 -106374 9071 -400976 -131933 -249807 65153 149014 -92285 -203677
9460 -203677 -150361 25683 -352908 76208 -118302 -189421 -256203 -240356 346910 124326 -192155
9448 -41354 280175 162033 75234 -68159 89805 -83173 18546 -172011 29470 -51163 -153744
9437 -153744 139506 156308 171525 -115579 -54327 -84378 -273316 -21618 -258702 -65331 -63341
9426 -63341 -26397 -224257 6039 -32486 -227959 -109134 -243587 -155734 -35255 -194094 -390484
9415 -390484 116664 -197253 49045 167734 -9622 -56724 -118083 97651 -125531 39982 40905
9404 40905 35693 -277879 -87706 -3545 153268 -179203 -102602 -44025 162067 34890 -77889
9392 197908 12513 52694 5683 -71557 -11920 52782 -66934 -115450 -149378 137316 -168225
9380 118338 84199 -147810 3831 -60243 -480290 96180 -95888 179713 136096 -81128 -499067
9369 -499067 -224109 -54975 -144173 129425 -143083 -364580 -308092 -221 -33016 117350 319402
9358 319402 -384585 65086 -329960 -285210 187917 187601 -211405 152591 -178595 101677 77844
9347 77844 -142451 262361 82567 125502 -291422 221938 -306548 232307 -144217 -133774
9337 -133774 -58486 -293238 -18501 -42870 58261 79192 -8230 -111925 121044 -508068 225762
9325 -164981 -124147 -207136 -21932 -201205 -159866 -103683 200783 260817 -8240 -169554 84235
9313 -143958 283211 -148558 -45684 -8477 1917 -106276 -312258 33187 -61411 -236333 -10899
9301 127916 26834 100801 -238129 105715 -276394 -162928 306232 -162898 -402035 27571
9290 -193809 17590 222495 -189503 82571 -266520 -217784 7109 -185841 -300072 -210436 10528
9278 -245791 -182998 -215572 -194475 -81253 124461 187729 63905 -426839 -40910 120752 -138618
9266 -43433 -282314 -368003 -465457 -128366 -454678 -61062 -96419 172790 97428 -166121 -66333
9254 240195 -67564 132101 -301032 42813 264447 -286861 152970 -44570 -8596 -14071 -93387
9243 -93387 -119459 82193 60019 -37099 146268 208033 -24660 -298988 13622 18246 -22848 138995
9230 -249063 -39812 286 -61095 -12766 -39122 -283957 86044 109042 -35813 155889 -45887 -288658
9218 -288658 -52571 -58038 -109554 52344 -308432 386615 62018 -256438 -123577 55286 14597
9206 -367962 24235 -35647 108176 -324548 -74005 -59953 -52428 -186012 88605 139608 -38009
9194 -159823 193149 85214 82723 -43483 45711 98344 -152376 223410 -367760 25490 109208
9183 109208 167926 -81782 -306512 -93100 -195296 -202536 -48407 82524 68781 -277561 -140591
9172 -140591 17518 97560 -9270 78228 -281552 25769 -59473 -119074 -180508 -384156 -89326
9160 -96061 138382 -28543 120158 -237988 17866 -269207 96040 -164206 317547 28324 20253
9149 20253 -312607 18256 -154513 63951 85995 -93745 -194234 -13212 48031 259504 279689
9138 279689 214854 -69833 -210678 -102830 -187731 -256791 119760 -102210 -102893 70453 -202696
9126 -236885 78306 -46182 -363623 85193 202196 39855 -165410 -197497 -121931 -362274 333608
9114 184450 -70180 -27278 72104 52484 -102068 104902 -97189 47043 -280664 -220203 -220595
9103 -220595 59045 -126190 -127789 -167933 -307953 19291 24356 -103171 -143108 -249686 -57360
9091 -106832 246486 162150 119811 47231 -132464 25105 -98815 -78426 334560 -31479 -286087
9080 -286087 -111326 -258363 -6172 23832 106949 102759 -182324 -31568 -180512 99854 -242607
9068 -83567 10230 -409555 -257848 -430404 163311 -255154 70606 -54641 114757 -397916
9057 -170574 -224745 89938 -150928 -396784 -9248 -56003 -14279 -104490 -14794 95547 80199
9046 80199 256218 -166692 -232237 431397 3127 10026 32776 29974 -13942 -271599 -83987 -220293
9034 -220293 -64558 8690 -226940 253400 -42540 192419 -390172 -40614 3952 -23245 -273144
9023 -273144 41515 -101298 288899 -218286 43100 -210099 25440 32839 5121 -105767 -320367
9012 -320367 -173369 -272690 329630 159115 -123597 -15541 -305230 -59396 176339 -32354
9001 -148531 -343582 66032 100155 178581 -138329 -92964 -154267 -321607 171691 18474 -258197
8989 -183779 -81653 -18556 110057 24426 -128205 -171360 -400331 176800 -15201 -267985 293781
8977 -124537 94633 94756 26335 270670 14361 130982 91607 -160784 80575 -80444 -116389
8966 -116389 -288813 -206070 13962 173213 51328 -5353 143946 -117485 -10157 80732 298436
8955 298436 -207845 -11410 17891 -90626 -110697 -62577 114471 -84588 370516 40044 94081
8944 94081 107140 131469 53291 327337 -105088 -317274 -63407 -206478 25298 116497 -259746
8932 -29409 16585 -387864 -535822 -416510 235830 20274 -82036 -11439 -28438 -160306 -280507
8921 -280507 -240425 209575 338924 310426 335049 88399 235670 118751 274499 383464
8911 383464 320068 340595 916132 1217985 2317369 4677773 9466799 4610303 2090100
8901 996409 770893 437040 236167 -64645 51466 102627 322430 -65393 70454 457234 148943
8889 135513 290859 -138977 -105822 -163145 -49479 264340 231464 370854 -227981 84070 92168
8878 92168 -207185 -323548 17509 200450 124526 -86102 -80381 21682 -131346 141560 62580
8866 318505 -18999 42823 20451 -252590 2242 -149823 -78179 97213 -251937 -5413 -9445 -21553
8854 -21553 -99549 75986 117823 44577 -97060 85624 -160359 90843 -86450 74338 -28550 -286267
8842 -286267 -198103 -296437 -94711 100257 56306 136214 -2746 -251035 345674 -305183 -335390
8831 -335390 15963 37034 -1802 -35658 -150001 -173474 104158 61433 18165 -83441 39966
8819 -36747 128126 120581 15786 40183 349171 90370 93672 -195312 -231498 -73367 -345806
8808 -345806 204043 -197878 -274132 37043 -106644 -137911 -43986 216564 104082 -165166
8797 -105994 145093 210677 285866 -149513 42994 78095 81133 -169621 258951 -145627 56275
8785 -158257 19584 6962 17937 -322673 -79005 -187993 -106530 138063 -12112 -258141 -152887
8774 -152887 -257174 155683 -53955 -120665 -186355 71196 90295 5269 -223576 -18505 -78707
8763 -78707 -42357 124790 -118934 -284354 21692 130325 43365 -426148 63564 300936 -44782
8751 133862 115547 166688 93372 177384 -106264 173595 -42763 -412912 98242 -86600 -38059
8739 -102960 -73729 -9961 -166818 -73414 89729 -63354 128660 -322803 -307825 -224563 114369
8727 102765 145179 -228913 -248568 45884 131168 -5355 154461 3072 -219645 61725 -43838
8715 206014 -351369 27662 -149102 -314641 16823 -136697 -190545 5844 -176746 -135220 -8801
8703 -297340 13148 -208673 162765 323473 -122826 -605567 64433 87677 30569 -270147
8692 -16119 -38523 -121320 -43538 -319316 -306536 -124642 58748 -155733 -186659 -165564 -178071
8681 -178071 -59304 -100067 145388 -34263 -185199 4792 -129134 324593 -380331 -114066 160735
8669 -157970 294831 -246421 11199 -308986 -1828 -151242 -179580 -173026 -58601 125656 100070
8658 100070 -147746 -166315 190342 -303394 -216342 -88614 217855 -283278 -46930 -406269
8648 -406269 -254161 -18979 178953 -47023 -66942 48229 -171570 -63634 25717 -123949 -349
8636 -183870 535969 63901 18706 -255682 -299356 74775 -238619 -93589 -67683 74803 89757
8625 89757 27793 17102 -27432 -8447 -135998 140636 97899 -172980 -78556 -161390 67516
8613 430171 -389076 -99227 137094 86048 50223 -111251 285026 -230323 -210392 183877
8602 -559616 -101112 -253137 -193156 -355 -81368 148559 68299 -140176 126075 77846 13754
8590 -146177 306966 -395567 -121475 86610 172717 -417379 -53580 -16192 88490 29815 -518620
8578 -180532 -117339 71733 -146123 -111583 152395 37095 147622 114979 32230 -48652 33347
8566 -38148 188402 91757 -136514 -206132 -118313 -137774 -255487 -109242 -356 -347249 -89074
8554 243031 -38174 -67418 -14787 -36626 61887 125712 127462 -173778 -301908 -100960 379162
8542 81117 -18041 -49337 26667 51152 234679 -32008 -194415 -10345 184033 -109585 -14766
8530 -28233 32260 50444 -155124 338622 -92777 128451 118760 -229593 -139692 217631 106823
8518 17878 -67396 -84714 -247473 7672 -19333 -165934 -196967 -112813 -233685 -171285 -194096
8507 -194096 30186 -135863 -87702 -432790 70102 -55982 -285274 -314049 -337151 228598 76706
8495 41346 -79871 -169352 -24663 311995 185353 -202507 31321 77430 -311457 113119 13074
8483 6222 -171720 -150024 -128480 -258568 -120567 -182015 -102232 69791 -415905 87262 81132
8472 81132 -259262 -354575 -135344 -221079 9437 -25184 -13345 34825 -15226 -295708 -134749
8460 -5920 -271802 -104997 148504 -338767 -202529 -314483 -194798 -153785 -93647 113848
8449 21956 326242 -120140 61638 16392 -221080 254941 180157 392977 -73612 206976 21006
8437 22218 -88700 114044 30106 65815 -113852 142743 -16929 -296790 57185 -81823 -128559
8426 -128559 119278 -249567 -9224 -34351 -169587 46224 -47373 -7189 86772 38829 217834
8415 217834 80344 50370 40496 -4671 -37676 -79815 -113561 29447 -137465 -40528 20401 -125042
8402 179911 -206063 102377 -114770 -23856 -361673 88020 -11575 180809 107928 -6599 41009
8390 -153928 61167 136685 -76882 137728 49272 166046 -129902 -172964 33231 49351 -123793
8378 -306292 4446 -46123 154238 -254150 -136852 79980 237920 -77091 -185610 220944 36313
8366 -13673 169945 -104670 -139583 47467 61213 -63345 -282285 -18435 -189279 -481787 93442
8354 7932 -300508 -208830 296835 -116895 -80385 -181899 -224186 -53741 -249666 187 83293
8343 83293 -74544 171870 57397 107417 -4309 -261195 -250699 -82676 -110856 -186783 -28758 39900
8330 28720 129888 125521 -278220 -109776 8652 -224801 -387146 -193891 25472 -102513 34570
8318 147687 -371515 -3544 631 -48509 46649 55273 -152159 -64332 -308988 293482 -50255 207660
8305 -111479 22706 307228 -193253 157366 99872 -287660 450120 -124070 -12487 -420108
8295 -420108 20040 137184 -123697 -47001 9285 52483 39856 -224664 -121271 -262622 40665
8283 -251767 -141102 209798 -97076 -280438 -86727 313451 141478 14323 119031 364149
8273 364149 -39024 -191946 50621 -100271 94400 -282746 -106082 -225486 73918 -151745
8262 83307 87482 -223979 -316520 231884 -102849 49296 -127051 -228218 -130680 -213151 -16850
8250 -343086 -275939 90098 -105589 -129217 112988 188929 -358257 404666 -245653 -201382 111190
8238 -95487 -111623 -77134 -131824 192671 185643 -144367 131896 -80419 125028 55029 -67380
8226 -286078 -150148 -131205 -88042 187048 28216 -118621 229977 -75732 -139611 -217956 63416
8214 -280691 199806 201755 -65105 -49227 129453 124173 -912 2033 -34318 40125 -159767 72392
8201 -144962 91367 -172837 -31026 -165232 -56440 99772 -255061 -141059 71155 8615 11579
8190 11579 96454 -125204 -159209 63948 -128187 270080 8626 -45588 147657 -163822 -60446
8178 -165545 -345554 55763 -231127 289927 180539 -124823 -52412 215375 51013 201333
8168 201333 118718 74539 -28504 163398 27919 -340016 -42549 -6652 -383165 127735 6441
8156 -124180 -46347 -232223 -157670 50980 -444539 -266288 -205388 30320 39687 75322 -80686
8144 -24331 -223727 -240739 81939 -221545 -91077 117314 -170971 -188836 41708 59134 -35948
8132 119718 141332 -5138 280197 50902 -111566 104102 -147503 -29437 -265622 -11301 -153821
8121 -153821 -75475 293214 -57020 211043 -230457 -28795 -113538 -62566 -191480 -57235 -133730
8110 -133730 97762 91440 175268 -101732 27186 -141026 -83472 -207272 223375 225812 -212515
8098 361452 54244 60775 -159611 17941 78349 -232163 169270 -141141 105640 144239 67099
8086 3224 -134941 -493780 331213 416675 -1892 -68580 13653 50986 212928 219125 18991 -329476
8073 -75170 319800 -265693 -524 -13824 311084 -21345 -48480 -44230 2948 -324649 -263335 -56741
8060 -179165 -129619 -106536 -103659 77942 58161 -314608 -31904 274251 -343941 208953 -139392
8048 290139 176941 -44425 187980 -253432 76193 145406 31370 -51881 -241176 -342594 -14528
8036 -43031 178144 137485 -366458 58445 183389 -125444 45803 144477 -107899 -133340 -87552
8025 -87552 198465 -138234 49369 -46414 -167463 -112149 -154591 -200458 11807 -133118 -7584
8013 295354 225509 -148403 -145613 234680 -48534 270479 -27918 -241252 -38870 -8511 60813
8001 -70408 -267523 -263409 -15316 100378 368280 -157979 -5910 -182878 197533 -242350 125109
7989 234291 149165 15855 96014 207027 -215387 65429 -75451 209619 95888 -141390 -205299
7978 -205299 -172911 -149217 999 34375 -25626 -19114 -59496 194663 -177664 54717 -36546 -29645
7966 -29645 -138172 152522 -26742 -212624 -177093 -104353 -250587 160543 -92915 -101617 -173320
7955 -173320 -260711 -71938 -23879 447477 -16885 -48615 -2097 -20632 -192599 -86169 -18524
7943 -296438 -10835 -26543 92391 -103595 148123 53480 -116593 -226271 43780 86309 -515
7931 -275847 14580 -25382 -315172 -210585 109456 -94154 37188 -198251 -70102 32278 139973
7920 139973 -345000 -481580 -274373 -128922 -243928 58723 -162282 -2146 -177335 25987
7909 -8559 172945 -95381 -151778 -169524 -113474 -53687 12069 98924 -87215 373846 84370 -38297
7896 -3305 -128056 193538 -504922 166410 -184074 -66780 20581 -184276 45888 -219485 -204638
7885 -204638 -76917 -37554 132643 -60236 184259 -194722 -216255 -239933 130890 -51908 -125715
7874 -125715 -9702 54800 155362 -49607 -139790 22144 195084 -17214 -207001 -45896 -1294
7862 118862 258893 8957 147352 91935 -177642 -333518 -207502 85602 -36403 112172 186099
7851 186099 -91517 -121286 -137366 186896 -258668 -212490 -17377 -167670 113413 -233117 161782
7839 -52582 88497 -117407 -112384 318345 -255587 -159123 174850 145037 -29939 -236753 55368
7827 161480 -411542 60021 -61279 277604 -33252 -156595 9872 181421 -139950 -271464 -287280
7816 -287280 -221382 -48975 336607 -18740 48681 -296145 365871 -168837 -147516 -95635 -212011
7805 -212011 -263102 -270813 98848 -58875 66683 40338 -38106 23082 364898 -291783 -78813
7793 -148030 10539 -68854 161620 -207493 -49164 -4925 -60115 -35452 -198198 -61000 55492
7781 80914 3848 -253701 -35320 -251969 20950 24873 -52241 128090 -7411 -42815 237380 -218682
7768 -192076 51664 446643 -97700 38521 -137801 -202186 -94269 57003 254653 -24254 -186060
7757 -186060 -148691 -351283 -135092 -1317 299899 -183819 -27450 142948 -165653 -227617 21197
7745 -3679 208017 -67910 125110 -58103 71178 82568 129493 -142245 -105095 -25056 323806
7733 -198113 -229522 259759 -40121 -231629 217498 -160342 -78277 -169390 32187 -34194 198677
7721 -282905 194352 26803 -118494 230191 -125927 -64230 -165280 20157 -18321 141171
7710 118882 109340 381782 -129747 -88378 4983 28540 -46681 169843 -165304 44761 29819
7699 29819 -97750 -368559 -90810 159199 261264 -347233 -269030 -5926 256136 -6488 -154379
7688 -154379 147709 -139258 -64311 -65383 3041 113962 -94234 -122118 151726 -322266 228380
7676 -70549 -79590 -139572 -143470 20146 -346541 24412 135599 -206602 169609 171291 -84740 98894
7663 222917 48855 -150259 -58502 -167150 100687 -105060 -90399 -111981 219639 -120235
7652 -18389 -82206 108263 52936 -156 -143025 -72603 132356 -154436 -116024 143388 132039
7641 132039 251234 -323845 -21189 140561 185502 -610194 136414 172261 66535 -55063 -270090
7630 -270090 -167535 71229 119755 304779 209384 -117472 165011 311375 -272416 110757
7619 -286791 -53341 -180583 264112 380260 -158780 -26497 35806 61549 -104691 -453266
7609 -453266 -129722 139520 -81757 -437289 -93300 -226808 -84285 -48438 -349996 -1703 -88998
7598 -88998 159782 -51767 -29632 -70419 -90018 -176450 -34719 -308308 -155065 -32600 157023
7586 47376 379915 -161883 -8642 -152964 -158592 102891 35636 110448 -110720 159128 -81214
7574 -113758 284888 -408679 -281360 -218849 -272087 -103253 -33621 28560 -45880 -22796 110087
7562 -341312 92702 218720 171394 -26238 86270 -227155 -133633 -13232 -77621 -50739 39871
7550 19611 -116008 -137344 -61938 -256686 239565 73024 -64604 54763 96682 -253453 114365
7538 58767 -66731 -65206 282 51497 -265665 151095 122543 317043 61267 90874 26647 -52001
7525 -2837 162847 19802 -165395 -129659 -95579 106921 -285527 -69491 -69167 -303566 -263135
7514 -263135 -233810 -48243 -142829 180724 63112 168464 189255 -204149 -250968 44027 -26856
7502 -257270 143480 -236974 -51993 109262 -76759 -395717 -498571 131113 229076 39035
7491 -248099 -59311 -333649 -268616 143459 -185928 -311907 -425528 -89982 125907 -17034
7480 295114 180397 58715 -278394 26552 48621 -118544 -309357 30778 -250533 192432
7469 165292 -76549 -195653 -130036 66231 -201727 -46986 155738 -268989 151502 87356 -280867
7457 -135655 -14096 -78359 18320 -113376 -66442 62989 157235 23753 65855 -53689 -91010
7446 -91010 339529 -18359 288588 -60469 335788 -128144 -247600 -141141 36259 125357 18949
7434 -233584 155171 -78331 208566 -7156 11621 54390 -172761 52463 -76535 -123160 183826
7422 74807 45061 126498 64978 90476 42255 -273350 -323322 208728 -422986 -48636 -63531
7411 -63531 -126860 -59923 -224914 38795 9751 -4424 -185731 -31089 -233726 115167 -183007
7399 -387335 -133211 6076 103782 42033 -53167 18706 -104748 88838 -370521 19952 -149132
7387 76284 -66262 -11857 -125630 96855 109805 115660 -314936 -65811 126157 -420 -204621 153534
7374 -114230 370955 -163803 -293866 90391 -291478 -146145 -181371 -84387 -165195 -134270 -134615
7363 -134615 93944 -92386 73020 -370064 -320242 2403 -201880 40457 -151827 6655 -139779
7351 105019 -327344 -210655 -359834 157634 357657 102741 -151141 213517 12327 -13351
7340 120309 -9055 -243020 191912 -88641 127042 65656 -118507 192988 33408 -81533 230063
7328 -64623 -124085 -40022 -79220 -28700 -26714 181948 15484 42146 12792 44513 -160738 88766
7315 -58062 -60591 -62864 -192232 44 134481 87359 -124262 116952 204603 -277186 194221 12307
7302 -49269 241100 88827 69238 -53653 104845 134804 -6647 -81715 -67345 -106521 515277
7290 232398 -179915 9417 -59895 -72434 -78845 13527 -144188 -26286 205451 168975 -119480
7278 145876 -20759 149840 111630 -280003 -11857 199658 -74666 -326072 -87028 134755 -180213
7266 -190629 -24923 15397 -93441 52307 -256311 43167 6561 93439 182212 185591 -178993 -387832
7254 -387832 -28624 -65783 -568443 -58324 123906 47880 -151009 102958 216630 47298 53900
7243 53900 -26681 -352870 153558 -107185 -171290 -177451 157464 -2021 25962 -501085 165266
7231 93200 185094 -44679 67021 247250 -92679 49380 21969 -328904 -195148 185274 -319565
7219 266608 -125903 -108574 155183 -174555 -38593 -308941 135246 -118780 -89378 -8274 -369518
7208 -369518 -125706 -58340 -98004 88961 -336871 73331 -23947 146845 -37763 -43574 -35176
7197 -35176 -228275 63149 -61749 42759 236887 77879 -181172 38903 -47141 253314 115831
7185 188358 -107722 37106 -2872 -69526 -104165 -152145 52957 -297595 182393 -58072 -52886
7174 -52886 -134391 -273351 226989 -216425 -113988 -87358 178432 16285 -274303 -175512 -259691
7163 -259691 130886 -276514 -248307 -84857 -17343 37835 175888 -103924 -161196 57328 -458064
7151 57291 75926 -126489 16679 -209738 116515 58331 129831 165978 -113800 61706 100530
7140 100530 -175740 151947 21174 60306 -223605 -52313 -60893 -98397 -67333 -234717 -52004
7128 -276216 -60095 -151208 204470 126617 82441 152197 -159901 220562 72203 87330 -466083
7116 108972 343845 -335331 153627 48387 -165897 -422301 209464 13353 -183863 157368
7105 -270343 50994 207903 68018 -251605 178629 -182701 -47319 -17356 -80484 -132698 51401
7093 -150183 -293028 -129839 127042 -30650 -92847 -17625 116797 -191256 -88091 41672 -8358
7081 207988 -55462 -376345 132810 35177 -333664 -221866 237354 2757 -145031 -109145 115566
7069 145524 -282646 338595 -97162 91074 -383501 1978 132293 -163365 17048 -55703 -129733
7058 -129733 -245211 103556 -265266 50121 251475 86547 -244350 72759 -116662 41634
7047 74131 -178211 58511 -64 -372006 46720 -134981 173762 19657 -342460 276469 -365134
7035 27729 191555 191234 -249041 -25336 95893 -45246 45606 -176892 -115850 -45095 -42552 -159000
7023 -159000 172665 75538 -160540 263802 493263 -226668 25000 -80940 -180207 -29765 3225
7011 -181442 -61447 47000 325114 161118 -261565 160390 161145 -136917 -104579 -324096 166750
6999 -104613 180837 31772 -238171 173640 177851 -390269 140708 -151023 80856 -230264
6988 -150678 107029 -52514 145505 -44569 54827 -114891 35385 103787 -102684 172726 354089
6977 354089 304480 76090 -241476 -46537 17193 19637 -502775 44313 -32578 -106667 -268971
6966 -268971 41554 18572 -135876 -342653 46448 -59777 45106 -10376 -1790 -16287 -174359
6955 -174359 -91838 67859 76522 -26215 -46246 -132817 83818 -179899 374384 144645 277989
6944 277989 -336422 -27406 -218439 -117772 208149 24617 -115221 82109 -51378 -21193 43840
6932 -72984 -21563 -289253 128353 -79936 240557 -39822 173555 156000 86261 -42750 17099
6920 -63757 -118932 -180031 -66151 -187844 63655 252820 280919 437735 -78014 195985 -48973
6908 23537 -248961 -324530 -76776 108853 -158889 -147968 138126 -166096 -184778 -146 -79351
6897 -79351 168209 231421 -451443 205514 7395 242219 399308 -112080 -128124 45620 -29551
6885 267770 -60423 -126578 405515 -142868 -443008 19345 -4686 -80918 101069 -258212 -283370
6874 -283370 8199 -23834 -247652 64442 -248534 63328 126867 -7862 53744 -39368 -362490
6863 -362490 -44385 32743 -44120 30822 -214678 337708 -170312 231656 -76392 201649 230131
6852 230131 -299004 123032 -163973 -67174 42437 120441 25312 -219445 -189268 -65596 -34635
6841 -34635 -61536 63450 -326975 1922 -112493 68198 -277556 -70420 -409122 -13001 68341
6829 -119955 -31330 -201062 -192267 31062 -57010 246238 -848 -490995 -216074 -220739 -98755 -221263
6817 -221263 130840 -134532 -148138 -23068 -285551 -260610 -19822 -175372 -385624 -89389 -135073
6806 -135073 259205 -254436 -87147 -226007 -46795 37674 -250031 -68584 43089 -101290 -315415
6795 -315415 113875 -56070 -1662 -132444 -23584 258297 -200198 -233925 150868 -64105 37233
6783 303493 -258299 129568 214355 -227038 -40828 116992 -121737 7199 -198117 177813
6772 -3840 -20781 -232455 -96801 48153 -72279 -161125 198294 26650 -160079 132701 98739
6761 98739 -63409 -606 -140091 -215369 65355 -42193 -195809 193690 -111882 -122385 28931
6749 186040 -41555 -443373 -85054 190635 -94757 39409 225116 54808 -141891 -118432 80483
6737 -274771 -38590 179606 -53843 315528 100294 -345145 -226233 -80040 12663 -42129 222878
6725 -169642 205602 106299 -183372 -62469 2316 -11072 60700 114452 96821 -17659 -122679
6714 -122679 -405856 46968 249654 -10254 269734 26528 -27085 -120352 195406 7431 2454
6702 -75863 259585 -165410 -358846 -329017 216264 -236377 320783 -96870 447326 -11623
6691 149874 182727 -53391 244825 -95621 -46121 181213 -157493 -10848 -118282 13639 -46671
6679 -212517 -81247 -84641 -126880 -36727 -231539 250869 69093 -101235 66663 147034 -34647
6667 -19057 -71134 61540 110874 -293839 89034 -61156 -334643 -182987 -60909 42379 -219834
6655 92534 -293551 -284081 96656 -44241 127660 -323458 -14547 -57453 246604 36137 -249838
6643 25099 40738 194343 -64556 126136 151656 -150922 -124758 -31731 -73188 72897 -3471
6631 -119874 -200399 -9634 -117305 -225573 309045 -12746 -131718 -130218 -178688 151266 35427
6619 -73312 106660 -183051 -75809 -209332 537633 280731 -265410 -320729 67428 46891 196281
6608 196281 77908 -17282 70681 71560 -225345 -132145 -231357 173852 76939 -246165 187277
6596 -46045 266465 -316638 102247 -190305 48769 -175564 -320646 128810 -56448 -89463
6586 -89463 62468 -8179 14971 -227133 312750 -23059 -379640 165837 42837 -111020 354638
6574 45435 -175193 312621 95271 -43254 130629 188506 -303928 20572 108573 177259 26700
6562 51222 -113384 255073 -79124 265146 -214386 -188757 38127 -617148 -145103 -463300
6552 -463300 59324 92844 -74534 89678 -129209 329742 -121120 -34845 -282885 8279 29600
6541 29600 136317 -14911 209785 120330 -16662 -152026 -243272 -45092 -329876 250010 -130588
6529 -63174 27610 110819 34500 154955 -135553 57076 192788 -395693 -172880 82963 -268257
6517 -73953 -37243 33312 356674 -162075 82870 -3714 -327218 171924 258454 27572 -106400
6505 -248297 -69302 -56273 45428 -62121 -146400 260257 19901 -9764 -71710 -210713 -59624
6493 288713 263191 -171225 -27283 -75419 -269357 22725 231430 -97430 157125 -600368 -56706
6481 -99397 -161155 134510 -103601 181098 16945 413309 67031 119604 74267 30946 -85229
6469 -129835 -78063 306071 -181032 -46074 17626 -36677 -137946 -179864 39129 -193809 66166
6457 152066 -82487 62226 184234 158914 60002 280907 -7219 -236388 -72742 106193 7765
6445 165773 -244682 -10140 127452 96024 -71487 41129 -202085 266430 -35055 251076 -168211
6433 255323 -164223 -18725 -207283 236623 32845 -219582 -186888 -403185 53130 -261196
6422 166736 -389824 -233041 -157321 139520 -39597 -48614 -19369 -66660 -167875 -216669 47649
6410 -66331 57265 132637 318872 -100681 -101201 -47510 108340 208741 -16260 -151702 -171617
6399 -171617 72304 -69982 -282765 297818 30456 223453 -120572 253466 -74696 -458 -104118
6388 -104118 -172649 -20178 82728 -75025 61945 -285882 -111750 -566629 80195 -70202 -206992
6377 -206992 71699 -23467 125397 -228584 164922 47731 -180560 -277758 -198549 -41239 28806
6365 -182389 -442352 122110 -111487 195627 46191 54626 -221226 16044 313326 460822
6355 460822 -100437 -466754 -77028 142882 -130850 152861 113446 -32769 72277 122792 -40512
6343 -32425 12199 -100153 -100994 88991 -52877 -129666 -150567 -114751 -189838 66749 79344 -9342
6330 182607 250394 143405 -52623 -64144 94434 25932 202076 26302 -6224 37758 -57836
6318 101815 -66627 73647 -82911 236592 -83285 64631 180801 -196162 -442620 171733 -6898
6306 30294 632 -80535 85350 -35966 57456 -86515 227629 -126722 46203 15435 -127819 206265
6293 -47549 -261411 173421 -13484 196937 238044 -97644 -361193 -41047 237971 65228 -536124
6281 84957 203118 55511 -159072 -232163 -131217 -273800 -114586 166398 -311424 20823
6270 100158 99289 182255 90327 -129454 -156216 196721 -115363 -67349 147815 -99742 54916
6258 73398 24274 223890 103584 145963 261971 127992 116823 -178536 91882 55629 -168616
6246 168369 -48710 -50530 194111 -48666 150516 12974 85719 13328 -113947 -38983 -225444
6235 -225444 -11808 -139804 362901 177724 38556 -115011 -136237 73496 -116736 190168
6224 302875 253614 -965 100784 -18854 -43167 37835 -156353 47542 -217881 155798 -142585
6212 -31062 -211134 85441 3699 39416 -128755 -126227 110172 -102278 18509 -233165 -155576
6201 -155576 -160690 -6888 24444 -110267 93529 -64531 33315 -107334 -144084 112867 -134864
6189 67165 112065 120985 -331117 8386 -39826 118822 -96701 -20532 215533 -179341 200443
6177 -242743 173538 -48239 99329 175229 -266881 -39139 126456 -114996 -74606 131495 -380015
6165 -1863 -112081 -343348 104679 -44975 218878 -167878 -64321 235586 -340604 -266406 -145018
6154 -145018 40468 -122732 -95065 205654 -63591 -208138 37564 -74736 -63116 -29912 -80636
6143 -80636 80539 -310337 88898 138631 -89774 -58357 208422 11678 -110810 -9096 -112839
6132 -112839 111511 198709 25585 38187 140090 -113778 -154444 122685 135568 256229 21852
6120 164492 53350 -63041 15143 268473 -33688 -60526 -150469 -549894 -489 142895 -161222
6108 -98254 161773 229456 36459 -253398 -22250 120306 7523 -62641 25519 859 -230443 117051
6095 122056 -317332 107770 -106900 289771 6052 197539 -117104 -175457 -233463 -176792 -243102
6084 -243102 53042 179726 114200 150161 12871 77070 -195477 -13762 -29742 -130348 185830
6072 -61440 -61910 -168886 -390633 120841 -111444 -222318 -113407 -30386 37035 235501 -131130
6060 -192823 12496 -54131 118241 47356 208895 -149414 -330489 -51441 320848 28618 33578
6049 33578 204220 -351214 281242 78876 -78280 35896 60694 19266 123581 -739 269588
6037 -76231 -203676 -362037 -188118 295757 178876 -108036 171151 80909 175394 246066
6027 246066 189797 -338528 75775 -361001 36763 -96119 69196 6869 -889 -193584 86471 38618
6014 -193670 -447266 171278 -345881 -56701 -220896 -202121 -155556 -82701 -410840 4795 -75979
6002 -35831 252731 -237424 276461 -147421 368877 -153894 160746 -87171 209905 -310319
5991 246650 113843 229343 103299 309635 140254 24194 100614 -352878 215223 -309 3728
5979 -20976 -798 327550 -161737 88770 17499 -187505 190642 44215 114599 -44803 -144152
5968 -144152 -163451 155823 -144879 232991 70688 -166125 18554 55009 -252930 -44334 330151
5956 214879 -174165 -313010 -440341 309766 24306 -151210 -181443 97450 1159 54067 -149585
5944 50562 -227443 323947 265872 146493 109641 -68363 -13269 -62789 -15205 -12941 96115
5932 41087 -48827 -251043 59203 81122 -295362 -59600 226162 96639 -149343 -104588 38773
5920 -46292 -93074 -39665 -134156 256644 249200 -38720 -262655 -154330 101076 182684 19334
5908 -111066 60991 199606 -314879 68686 17324 -32340 -230386 -98264 104734 142431 -219758
5896 -148676 -231472 90003 -76153 130703 -259241 63034 -140319 66087 -273408 45589 -11269
5884 -182073 -50661 -273993 263392 3069 41548 174480 279247 13813 -43397 -97643 -44175
5872 125255 27402 -16915 41792 174836 -92546 -118369 159083 256310 -144274 -413226 -107145
5860 -241554 16410 -106219 148002 249959 -146605 -170431 503776 -5290 41249 97150 -70322
5848 92902 -5185 80500 -95131 -143625 -114400 106160 181653 -181942 78295 42748 184237
5837 184237 -177161 -284161 -208224 -103419 -11716 -63256 -158704 -203183 164596 59183 56602
5826 56602 -198199 49507 227933 131693 61776 121119 -5973 -547376 59358 -351816 117304
5814 -150861 -75141 2524 61056 -135420 -207036 211711 -223676 -69097 -17502 -67782 -57606
5803 -57606 171860 23109 439855 59096 24535 -44972 -287716 179029 -104154 -95589 14698
5791 44936 -109992 -195072 27004 -283868 -54226 -100116 -97649 304570 -140742 43755 -83164
5779 -106288 206450 -12262 191340 -443473 -79678 47738 -370611 -194643 191192 19521
5768 105538 -9977 69609 44726 -31445 -42098 123957 5320 -159905 -233377 297799 -76377
5756 -97414 -19043 -277440 -43476 -313501 431525 41521 -117835 136068 -81368 114210 -232091
5744 339209 -389053 -148108 -57561 150669 15405 -123796 37783 -30574 43822 -237396 -155937
5733 -155937 -88739 162600 87764 219229 -162520 325678 19565 166107 103060 -260355
5722 397083 -153121 124190 -168929 204551 216161 -48221 219172 -201695 235714 -120042
5711 -202684 205236 189826 -40174 -153637 32257 -497 84995 -17954 156527 -130341 -61571
5699 62735 65244 -126631 58936 -145014 -78257 192930 -1126 111433 -257079 172788 260475
5688 260475 40499 -32736 -112903 339128 73035 202948 -214979 98162 -214752 -103148 -305074
5677 -305074 -100776 -305286 -215242 6444 -45699 -85007 62430 69969 345482 -264965 193143
5665 51065 6491 -245623 -36208 -277192 -122413 -34551 409713 -184205 149121 -203572 98448
5653 152506 104637 -105719 496085 -333299 79179 -54031 153983 90410 123047 197201 -150718
5641 -45866 -107098 158285 -172990 -51179 226174 10704 -371456 28082 -145888 -2989 -81188
5630 -81188 144375 14755 62333 -39356 348862 199390 -166501 -46943 -96603 97214 -52159
5618 103866 104271 149529 -43779 -34944 -122171 -82980 -446 180800 265052 76242 -32923 -88092
5606 -88092 117964 -83117 -18204 -32566 -149635 -209493 -90455 -9689 96109 -201509 212420
5594 36295 246093 -61617 -6929 13073 -107664 118653 69593 140008 -191729 259852 51238
5582 144711 67290 -189799 -50812 -47548 -171859 89242 -61269 101592 -438909 -230326 -219180
5571 -219180 -231465 -217236 92488 148529 163000 83399 -33706 168949 -56101 184920 135941
5560 135941 56788 191273 35492 28019 4596 81957 -135651 -368512 173899 -198897 150530
5548 140250 211292 217924 -141927 -59087 -339571 -190865 66450 -166969 -69938 188517 -81540
5536 -85999 -66249 325134 -87881 198905 -203324 71630 246502 10144 -468240 -231649 -189060
5525 -189060 159033 -17001 -308364 251732 -237304 -119263 -53928 -379880 -85001 27695
5514 -207394 123249 90860 -4906 59295 -113975 -200749 -413187 -119363 40007 -183824 106334
5502 233998 -233738 158245 535466 13962 3767 -308580 214861 -4080 163035 -68496 -72648
5491 -72648 133837 -259045 -62676 58834 -3644 13691 124165 -122078 207034 -92401 -639
5479 51040 55957 -59874 133051 20293 -137100 65393 22047 23449 -294011 96352 147400 170003
5467 170003 266664 139113 -160593 -40323 -5677 -213499 -73599 133474 -74293 -99597 164990
5455 60787 -3501 -100242 -291629 16151 -118625 211602 -103268 -310545 174230 70430 21952
5443 24027 216655 339237 -51598 -32807 9557 100565 -73661 -22290 -104086 34814 21564 -91943
5430 -177965 -71419 -95314 -405598 -46029 295581 -114397 239844 55004 16935 -217488 28127
5418 -355777 221120 -209119 -74735 49028 -55836 -43033 -180105 -23844 -41016 -169537 320113
5406 230695 -141858 -86163 -12035 -148924 -401176 129344 -128429 44177 265896 30418
5395 265240 25038 -349888 95404 47312 -64902 -318434 -40370 290988 16344 78449 14824
5383 23496 -183225 -168267 -64264 257217 -112424 -141668 199616 -64289 -205663 25952 -15631
5371 -48609 31333 -8586 -196875 -102880 47550 -110148 -34201 298821 -35724 247753 68588
5359 226946 99650 -7188 -343836 -139592 -338608 -51824 -288814 36438 207659 -92167 -153198
5348 -153198 -220587 -183752 18315 68030 -162406 241503 232137 -201011 348013 -9788 541979
5336 222606 123745 -237323 19163 -224550 -40759 286882 115547 -220735 301078 383562
5326 383562 176099 -131865 165623 -269666 -123960 -128195 22147 43568 -158060 -210797 129012
5314 -60525 42362 181136 -2864 216230 46801 337252 -44832 280851 -97962 -162571 245332
5302 -319918 150727 -97317 229497 -44892 185303 -178857 254876 -71680 -210018 -31936
5291 -301435 134826 118611 17466 -119107 -339999 371197 285636 187508 -105557 -111516 -82486
5280 -82486 -378753 -510807 123154 133173 135174 -79430 492756 131765 103405 16875 4562
5268 -72967 195406 -3518 30497 15496 36835 -123097 -71461 162925 134146 -29869 136424
5256 -274436 -183099 -100001 -114915 82813 27736 -170898 -66934 -310978 -64807 -69105 115165
5244 241548 45356 231836 -404610 89284 -167691 -88908 -73961 -63338 423810 174106 -141660
5232 -7726 171985 123461 -10379 100414 182014 -68174 402490 -268300 394969 398394 -7669
5220 -44468 -3348 -280494 230395 58209 -81313 -106825 283127 -36578 -65601 26693 -124534
5208 -164103 171287 -121045 -64819 38560 79821 203260 160261 75961 -139544 188687 -99546
5196 104046 30739 -33874 25936 -290946 108068 -192824 200271 195531 -95756 143082 150506
5185 150506 250463 -99700 -174233 -106092 -104427 -288759 -22313 -93237 -143478 87932 7015 305763
5173 305763 -53096 -32700 -158972 200066 25059 -39275 445956 310676 -98670 -132367 88493
5161 -280306 116062 -14748 -35611 38467 129637 -59008 -148637 -12094 111767 29996 -281360
5149 -91667 -302304 -40550 -103944 -66011 -159882 -26348 68913 -278145 122165 97579 36461
5137 115898 242681 293682 -77714 267823 -53053 144815 168588 71943 -107303 80087 211393
5126 211393 -46440 -74169 347935 -141580 -297150 -256403 124056 -165132 144897 35250
5115 -5197 392120 -157139 129640 75876 287466 -51714 -256060 31048 -177958 279820 -39265
5103 -181442 108105 -485593 110748 88575 -178930 -111142 -296328 -279018 92405 30021 -84695
5091 204697 44014 -253814 -501026 -149493 -47908 230582 -246349 67575 -231824 -303133
5081 -303133 -33585 37259 227406 191026 11679 -132800 44512 -25841 -90261 -147047 447373
5069 46706 -110402 -60499 98895 -103011 -90731 310722 198696 -319721 16054 79603 14738
5057 -58568 -17500 -247731 -25152 18138 -138578 -319847 238643 13593 -43619 147622 6095
5045 -49705 210234 -245258 -56700 -10966 452964 219907 30322 -272514 207105 -380921
5034 151357 -263606 -141655 206733 158527 165350 12558 -20779 -75346 -81386 -31797 -148691
5023 -148691 -341971 174972 195596 275472 54646 241713 181170 45908 80308 94069 16538
5011 -267025 307110 120491 -303530 192288 118154 188279 161440 116848 192605 -166675 -8651
4999 241208 -140388 17821 297101 -84020 -107315 120914 358274 7108 -68972 76741 6819
4987 390002 32756 -52298 -87045 88470 -24193 82982 -29722 65312 69164 106016 141993 -53077
4974 12300 31018 30367 -158652 -198593 -369578 -240662 -169078 241594 9774 418791 -161659
4962 169652 181113 -74952 -162523 -45264 -10709 -169564 -38742 109874 -28380 -159277 14434
4950 -139415 187217 91210 252645 241833 -101802 265598 164396 -198454 51981 150863
4940 150863 -362780 17079 -177844 96802 34216 93619 -52215 172127 32776 83569 -247439
4928 -355692 73860 -279204 -339769 191985 26702 73644 104178 -82917 -7549 97829 144256
4917 144256 -83639 261087 -19432 101832 -100023 -24475 -307799 357228 146965 -71149
4906 -209134 -199861 74017 118114 162147 -268092 536254 156661 -82074 89397 314546 -138558
4894 173021 215160 95841 338871 -103914 -17841 388883 -275994 -201422 -87260 83353 -149120
4882 -65163 -6653 -88976 -188729 -54006 62667 121894 -42773 30002 -45067 -123942 338661 113973
4869 27046 -33472 23664 116083 281902 -170605 -72722 -28140 185753 -69013 -48786 -5454
4857 225571 1751 -10764 -69193 -192343 273649 194911 -252832 -161986 106067 -141988 66014
4845 39600 -149314 93181 99721 -120840 59570 -279947 379489 -82362 371809 -102345 -80562
4834 -80562 80314 -325336 44088 -54088 190420 -22972 12757 -217843 111055 -70576 228045
4822 59479 95001 77339 -155963 -186001 -547380 12094 -13557 350854 -416086 423779 -228273
4810 29534 -111974 -5291 198825 162942 43930 -107578 64132 200300 304867 25948 -274479
4798 44318 160421 159585 68409 -67658 271569 -217549 -281639 -137634 -76793 2999 63556 39280
4786 39280 402473 -4409 107183 206010 26388 -81241 -22673 81217 135595 -139177 305529
4774 244302 -12753 -164583 79282 -166616 157705 233427 -258659 172962 17823 219703
4764 219703 79218 188063 40354 -187593 -267374 74391 389065 -147843 -134775 -203453 80305
4752 31190 -250122 -2054 226962 74677 260399 -152236 -71418 -115092 197968 130315 -131763
4740 157482 -18663 -242111 146605 -388411 304542 10893 187225 225495 -102076 172296
4729 -53564 -145578 -191245 151415 140622 -39342 -70306 63846 28364 -275733 -133390 -436421
4718 -436421 53365 -224752 118795 -212723 -260960 239456 501643 -140394 -169466 287664
4707 66817 -93155 -283680 -137514 -133488 -50301 -118955 5388 -31759 97304 16012 244698 151756
4695 151756 77154 -234474 310806 -69782 310997 -237210 -230670 62336 103752 -26702 -377963
4684 -377963 150964 310183 -343892 19482 -40043 294632 -236115 -99250 441878 -70335
4673 100497 -36044 128773 -50242 -279353 -28697 -37500 -85270 -138327 138802 200957 -246304
4661 -84315 -195652 -30884 18535 202162 9264 -42828 -35037 24994 -238941 -321842 -75262 -105846
4649 -105846 -143259 -111509 246721 -169335 -3122 -1196 -312648 -293259 -157950 -6994 15201
4637 -102116 -49114 -38626 -8278 -13490 96926 -22159 -224776 -159004 218451 -14671 273409
4625 161644 166813 -28880 -267467 -81840 137397 -50515 39683 56022 265006 -259768 -67833
4613 163443 -53214 -87934 -76823 -15128 -15027 -109900 24934 17845 -64487 309469 190613 133515
4601 133515 82228 -40243 -279156 425020 311 322464 -248162 -39544 -138173 17999 -97252
4589 303975 66868 59330 -232247 170109 -133668 28987 -79335 -380390 -105248 19931 -83823
4577 -38546 -13728 135928 -200258 -103572 75884 -64623 74879 -247931 101058 12832 60591
4566 60591 303873 80826 165575 -96861 -101844 164526 69127 70925 -249035 267437 -251194
4554 240721 201979 -220251 32919 -120394 115690 80599 -111508 -38093 -182297 88250 -108757
4542 223616 47119 51435 -164618 -299459 191007 -26545 187578 1269 44850 239083 97690
4530 119366 229617 -140997 1531 205470 -57727 130731 237710 -106911 220152 -142903
4519 -1683 -65900 177685 8711 67052 -25858 -20468 335555 -133611 -213649 5875 -10768 -13191
4507 -13191 185339 102785 -81916 168472 -245831 357991 -72998 -23013 277705 -29924 98817
4495 183497 -153095 50842 -23537 95185 17712 -35611 188960 97348 215794 -79969 180307
4483 -28578 -41540 202536 -203728 -105193 -80778 -338954 -194122 -152323 -38034 -228302 152031
4471 -95829 129280 -24372 54908 79538 -118812 94783 -70399 -381817 -113796 62506 40229
$$ [...]
##END NTUPLES=NMR SPECTRUM
##END=
