
##TITLE=UV1142_M5-1005-1002_6275452_z4RHDX7KgL
##JCAMPDX= 6.0         $$ Bruker NMR JCAMP-DX V2.0
##DATA TYPE= NMR SPECTRUM
##DATA CLASS= NTUPLES
##ORIGIN= BRUKER
##OWNER= Administrator
$$ 1.72 TOPSPIN		Version 2.1
$$ 2012-06-07 03:10:04.796 -0500  Administrator@TOPSPIN
$$ Compression mode = diff/dup
##.OBSERVE FREQUENCY= 400.13188235
##.OBSERVE NUCLEUS= ^1H
##.ACQUISITION MODE= SIMULTANEOUS (DQD)
##.ACQUISITION SCHEME= undefined
##.AVERAGES= 64
##.DIGITISER RES= 22
##SPECTROMETER/DATA SYSTEM= spect
##.PULSE SEQUENCE= noesygpps1d.comp
##.SOLVENT NAME= COFFEE_meoh
##.SHIFT REFERENCE= INTERNAL, COFFEE_meoh, 1, 14.96707
##AUDIT TRAIL= $$ (NUMBER, WHEN, WHO, WHERE, PROCESS, VERSION, WHAT)
$$ ##TITLE= Audit trail, TOPSPIN		Version 2.1
$$ ##JCAMPDX= 5.01
$$ ##ORIGIN= Bruker BioSpin GmbH
$$ ##OWNER= Administrator
$$ $$ C:\Bruker\TOPSPIN/data/COFFEE/nmr/UV1142_M5-1005-1002_6275452_z4RHDX7KgL/22/pdata/1/auditp.txt
$$ ##AUDIT TRAIL=  $$ (NUMBER, WHEN, WHO, WHERE, PROCESS, VERSION, WHAT)
(   1,<2012-06-07 03:09:59.531 -0500>,<Administrator>,<TOPSPIN>,<go>,<TOPSPIN 2.1>,
      <created by zg
	started at 2012-06-07 02:58:29.156 -0500,
	POWCHK enabled, PULCHK disabled,
       configuration hash MD5:
       D5 CA 7A 23 FE 6B EE E2 50 67 74 61 24 F7 5E 3B
       data hash MD5: 64K
       BA B4 B8 A8 B5 4C BE 7B 02 C8 A3 82 5C AE 54 63>)
(   2,<2012-06-07 03:10:02.343 -0500>,<Administrator>,<TOPSPIN>,<proc1d>,<TOPSPIN 2.1>,
      <Start of raw data processing
       efp LB = 0.3 FT_mod = 6 PKNL = 1 PHC0 = 0 PHC1 = 0 SI = 128K 
       data hash MD5: 128K
       00 84 9D C9 DB 22 48 8A 16 86 BC E8 EB 1E 67 F7>)
(   3,<2012-06-07 03:10:03.640 -0500>,<Administrator>,<TOPSPIN>,<proc1d>,<TOPSPIN 2.1>,
      <pk PHC0 = 32.74475 PHC1 = 0 
       data hash MD5: 128K
       CD 09 A8 B7 A8 4F 79 83 7A C5 BD 3F 4D 98 36 4C>)
(   4,<2012-06-07 03:10:04.453 -0500>,<Administrator>,<TOPSPIN>,<proc1d>,<TOPSPIN 2.1>,
      <abs ABSG = 1 
       data hash MD5: 128K
       38 D9 48 4C 3C 26 A4 0E B4 EB 68 79 B1 82 74 66>)
(   5,<2012-06-07 03:10:04.546 -0500>,<Administrator>,<TOPSPIN>,<proc1d>,<TOPSPIN 2.1>,
      <abs ABSG = 2 
       data hash MD5: 128K
       BD 26 EC 1E D2 C3 DE 79 15 F8 D5 37 09 71 11 A1>)
(   6,<2012-06-07 03:10:04.609 -0500>,<Administrator>,<TOPSPIN>,<proc1d>,<TOPSPIN 2.1>,
      <abs ABSG = 3 
       data hash MD5: 128K
       32 7E B7 99 E0 EB 7A 1F F2 8E 3C 7D 3F 6D 4A E7>)
(   7,<2012-06-07 03:10:04.656 -0500>,<Administrator>,<TOPSPIN>,<proc1d>,<TOPSPIN 2.1>,
      <abs ABSG = 4 
       data hash MD5: 128K
       4F DB F0 15 33 90 08 12 7F 70 A7 A6 7B 19 B5 AD>)
(   8,<2012-06-07 03:10:04.718 -0500>,<Administrator>,<TOPSPIN>,<proc1d>,<TOPSPIN 2.1>,
      <abs ABSG = 5 
       data hash MD5: 128K
       47 4E 68 FB 05 A2 15 13 FE D2 9F 6B F0 F2 C3 97>)
$$ ##END=
$$ 
$$ $$ hash MD5
$$ $$ 21 5A DC 37 19 D1 8F E9 44 27 A5 AA D6 21 E0 7D
##$RELAX= 
##$RELAX= 
##$RELAX= 
##$RELAX= 
##$RELAX= 
##$RELAX= 
##$RELAX= 
##$RELAX= 
$$ Bruker specific parameters
$$ [...]
##$TP07= 0
##$TPNAME0= <>
##$TPNAME1= <>
##$TPNAME2= <>
##$TPNAME3= <>
##$TPNAME4= <>
##$TPNAME5= <>
##$TPNAME6= <>
##$TPNAME7= <>
##$TPOAL= (0..7)
0.5 0.5 0.5 0.5 0.5 0.5 0.5 0.5
##$TPOFFS= (0..7)
0 0 0 0 0 0 0 0
##$TUNHIN= 0
##$TUNHOUT= 0
##$TUNXOUT= 0
##$USERA1= <user>
##$USERA2= <user>
##$USERA3= <user>
##$USERA4= <user>
##$USERA5= <user>
##$V9= 5
##$VALIST= <valist>
##$VCLIST= <CCCCCCCCCCCCCCC>
##$VD= 0
##$VDLIST= <DDDDDDDDDDDDDDD>
##$VPLIST= <PPPPPPPPPPPPPPP>
##$VTLIST= <TTTTTTTTTTTTTTT>
##$WBST= 2048
##$WBSW= 25
##$XGAIN= (0..3)
0 0 0 0
##$XL= 0
##$YL= 0
##$YMAX_a= 8636475
##$YMIN_a= -6997621
##$ZGOPTNS= <>
##$ZL1= 120
##$ZL2= 120
##$ZL3= 120
##$ZL4= 120
##$ABSF1= 14.96707
##$ABSF2= -5.585461
##$ABSG= 5
##$ABSL= 3
##$ALPHA= 0
##$AQORDER= 0
##$ASSFAC= 0
##$ASSFACI= 0
##$ASSFACX= 0
##$ASSWID= 0
##$AUNMP= <proc_prof1d_extract.lims>
##$AXLEFT= 0
##$AXNAME= <>
##$AXNUC= <1H>
##$AXRIGHT= 0
##$AXTYPE= 0
##$AXUNIT= <>
##$AZFE= 0.1
##$AZFW= 0.1
##$BCFW= 0
##$BC_mod= 0
##$BYTORDP= 0
##$COROFFS= 0
##$CY= 15
##$DATMOD= 1
##$DC= 0
##$DFILT= <>
##$DTYPP= 0
##$F1P= 0
##$F2P= 0
##$FCOR= 0.5
##$FTSIZE= 131072
##$FT_mod= 6
##$GAMMA= 0
##$GB= 0
##$INTBC= 1
##$INTSCL= 1
##$ISEN= 128
##$LB= 0.3
##$LEV0= 0
##$LPBIN= 0
##$MAXI= 10000
##$MC2= 0
##$MEAN= 0
##$ME_mod= 0
##$MI= 0
##$NCOEF= 0
##$NC_proc= -2
##$NLEV= 6
##$NOISF1= 0
##$NOISF2= 0
##$NSP= 0
##$NTH_PI= 0
##$NZP= 0
##$OFFSET= 14.96707
##$PC= 1
##$PHC0= 32.74475
##$PHC1= 0
##$PH_mod= 1
##$PKNL= yes
##$PPARMOD= 0
##$PPDIAG= 0
##$PPIPTYP= 0
##$PPMPNUM= 2147483647
##$PPRESOL= 1
##$PSCAL= 4
##$PSIGN= 0
##$PYNMP= <proc.py>
##$REVERSE= no
##$SF= 400.130005419438
##$SI= 131072
##$SIGF1= 0
##$SIGF2= 0
##$SINO= 400
##$SIOLD= 131072
##$SPECTYP= <>
##$SREGLST= <1H.CDCl3>
##$SSB= 0
##$STSI= 131072
##$STSR= 0
##$SW_p= 8223.68421052632
##$SYMM= 0
##$S_DEV= 0
##$TDeff= 65536
##$TDoff= 0
##$TI= <>
##$TILT= no
##$TM1= 0
##$TM2= 0
##$TOPLEV= 0
##$USERP1= <user>
##$USERP2= <user>
##$USERP3= <user>
##$USERP4= <user>
##$USERP5= <user>
##$WDW= 1
##$XDIM= 131072
##$YMAX_p= 241257555
##$YMIN_p= -354809121
##$CURPLOT= <Network HP LaserJet P1505>
##$CURPRIN= <$Network HP LaserJet P1505>
##$DFORMAT= <normdp>
##$LAYOUT= <+/1D_H.xwp>
##$LFORMAT= <normlp>
##$PFORMAT= <normpl>
##$SURQMSG= 1
$$ End of Bruker specific parameters
$$ ---------------------------------
##NTUPLES= NMR SPECTRUM
##VAR_NAME=  FREQUENCY,     SPECTRUM/REAL,   SPECTRUM/IMAG
##SYMBOL=    X,             R,               I
##VAR_TYPE=  INDEPENDENT,   DEPENDENT,       DEPENDENT
##VAR_FORM=  AFFN,          ASDF,            ASDF
##VAR_DIM=   131072,        131072,          131072
##UNITS=     HZ,            ARBITRARY UNITS, ARBITRARY UNITS
##FACTOR=    0.0627417313425165, 1,          1
##FIRST=     8223.62146879498, 516,          -46122
##LAST=      0,             2381,            -46905
##MIN=       0,             -354809121,      0
##MAX=       8223.62146879498, 241257555,    0
$$ Real data points
##PAGE= N=1
##DATA TABLE= (X++(R..R)), XYDATA
$$ [...]
66583 104150 103398 102486 101178 99730 98479 97855 98347 99792 101002 100815 99463 98277 98103 98669 99467 100392
66567 100392 101266 101502 100780 99537 98325 97085 95542 93909 92620 91630 90575 89503 88896 88938 89217 89193 88640
66550 88640 87634 86477 85627 85355 85416 85316 84897 84333 83658 82723 81648 80859 80555 80550 80760 81370 82287 82904 82816
66531 82816 82427 82372 82625 82648 82288 81951 81873 81747 81277 80673 80291 80083 79766 79395 79362 79706 79766 78776 76740 74473
66511 74473 72752 71627 70657 69586 68575 67909 67773 68275 69362 70616 71432 71521 71078 70409 69656 68964 68568
66494 68568 68436 68138 67374 66432 65821 65599 65414 65052 64584 64085 63674 63777 64821 66519 67877 68130 67438 66506
66476 66506 65868 65705 66025 66632 67070 66896 66047 64845 63751 63166 63244 63738 64158 64253 64210 64290 64455 64495 64300 63834
66456 63834 63063 62150 61547 61575 61983 62196 61981 61636 61514 61600 61572 61173 60533 60130 60331 60819 60692 59356 57213
66437 57213 55288 54261 54083 54354 54763 55256 55971 56921 57567 57010 55009 52531 50751 49761 48907 48270 48838
66420 48838 50982 53636 55529 56581 57499 58520 59208 59150 58236 56558 54674 53627 53908 54573 54259 53018
66404 53018 52244 52646 53327 53307 53016 53468 54556 55172 54809 54205 54253 54980 55817 56421 56927 57629 58631 59659 60142
66385 60142 59676 58488 57234 56326 55674 55117 54771 54729 54752 54555 54302 54460 55223 56301 57300 58043 58464 58442 57948
66366 57948 57199 56475 55807 55040 54244 53836 54166 55036 55813 56037 55740 55191 54518 53753 53122 52952 53291 53802 54198
66347 54198 54605 55343 56428 57420 57772 57261 56142 54914 53904 53050 52159 51394 51232 51838 52696 53133 53058 52828
66329 52828 52502 51710 50395 49240 49003 49665 50604 51462 52441 53759 55185 56323 57098 57781 58610 59528 60215
66312 60215 60287 59563 58303 57139 56592 56634 56821 56870 56857 56807 56390 55384 54286 53949 54442 54777 54061 52592 51316
66293 51316 50524 49758 48944 48744 49509 50590 51254 51727 52602 53609 53845 53184 52582 52727 53132 52981 52365 52129
66275 52129 52744 53781 54389 53986 52694 51420 51313 52652 54326 54835 53850 52463 51874 52225 52831 53116 53010
66258 53010 52639 52016 51084 49882 48647 47793 47688 48281 49016 49276 48911 48278 47827 47747 47991 48429 48935 49440 49946
66239 49946 50431 50762 50850 50910 51321 52099 52685 52524 51722 50883 50380 50116 50054 50500 51578 52731 53178 52827 52382
66220 52382 52515 53193 53958 54586 55230 55971 56476 56290 55408 54395 53725 53126 51913 50078 48619 48427 49149 49665
66202 49665 49568 49553 50306 51606 52850 53897 54955 55957 56537 56517 56001 55144 54157 53488 53564 54318 55239 55913 56292
66183 56292 56460 56478 56436 56391 56179 55578 54699 54001 53803 53955 54032 53697 52884 51934 51578 52402 54116 55614 56013 55490
66163 55490 54921 54868 55182 55462 55614 55886 56535 57497 58317 58429 57628 56254 54891 53940 53512 53584 54077 54787 55370
66144 55370 55498 55042 54222 53608 53837 55086 56817 58157 58607 58343 57863 57443 56972 56268 55449 54907 54897 55210
66126 55210 55379 55192 54851 54605 54436 54262 54239 54621 55320 55842 55744 55073 54345 54115 54480 54931 54756 53778 52599
66107 52599 51943 51838 51758 51526 51634 52476 53633 54336 54392 54246 54221 54191 54100 54245 54751 55139 54866 54127 53749 54284
66087 54284 55530 56872 57768 57882 57170 56081 55384 55556 56425 57503 58451 59095 59273 58996 58574 58268 57945 57402
66069 57402 56924 57106 58028 58992 59220 58589 57551 56594 55979 55783 55937 56236 56454 56407 55945 55076 54204 53969 54607
66050 54607 55643 56460 57115 58290 60417 63033 65126 66022 65906 65525 65380 65233 64500 63134 61881 61494 61826
66033 61826 61995 61404 60313 59407 59117 59540 60724 62656 64963 66871 67687 67388 66718 66613 67362 68273 68301 67129
66015 67129 65559 64694 64811 65236 65255 64868 64448 64015 63262 62268 61703 62080 63048 63791 64019 64258 65095 66440 67683
65996 67683 68373 68588 68735 69155 69894 70767 71583 72363 73244 74169 74787 74817 74458 74298 74752 75713 76821 77992 79483
65977 79483 81412 83414 84967 85944 86590 86980 86884 86332 85916 86146 86696 86770 86207 85765 86190 87391 88735 89816
65959 89816 90628 91175 91324 91058 90730 90944 92127 94105 96116 97434 98035 98528 99443 100779 102248 103673 105153
65942 105153 107040 109762 113279 116717 119043 120248 121395 123272 125486 127217 128262 128841 128850 128023 126609
65927 126609 125210 124056 122929 121669 120243 118489 116319 114044 111935 109677 106938 104279 102633 101925
65913 101925 101081 99562 97928 96658 95377 93775 92397 91803 91575 90977 90143 89876 90535 91773 93187 94575
65897 94575 95793 96930 98421 100406 102150 102785 102527 102501 103338 104631 105857 107131 108754 110576 112219 113629
65881 113629 115029 116475 117755 118670 119290 119942 121032 122753 124954 127268 129365 131037 132290 133475 135159
65866 135159 137569 140309 142886 145360 148129 151228 154208 156685 158644 160200 161440 162509 163482 164155 164327
65851 164327 164315 164744 165709 166550 166626 165998 165190 164608 164325 164122 163570 162319 160487 158540 156679 154647 152206
65834 152206 149454 146500 143198 139428 135370 131340 127658 124742 122876 121586 119743 116715 113118 110059
65820 110059 107962 106590 105812 105678 105894 105892 105486 104983 104558 104015 103234 102409 101679 100897 99967 99107 98570 98297 98080
65801 98080 97911 97989 98504 99517 100958 102654 104407 106078 107580 108841 109856 110706 111338 111464 110892 109905 109044
65784 109044 108499 108041 107584 107505 108194 109465 110636 111107 110817 110233 110018 110609 112057 114269 117237 120827 124460
65767 124460 127419 129581 131524 133763 136185 138479 140788 143498 146424 148604 149034 147495 144641 141420
65753 141420 138453 135900 133812 132464 132098 132344 132165 130703 128087 125226 122862 121053 119507 118077 116770
65738 116770 115539 114326 113297 112788 112936 113512 114242 115214 116720 118657 120384 121488 122478 124329 127378 131142
65722 131142 135318 140347 146566 153213 158862 162707 164844 165449 164397 161911 158884 156052 153196 149647
65708 149647 145369 141061 137255 133814 130389 126974 123842 121266 119553 119084 120011 121962 124310 126727 129242
65693 129242 131794 134071 136009 138182 141361 145639 150276 154455 157971 161058 163824 166136 167893 169063
65679 169063 169352 168157 165089 160461 155153 150014 145428 141321 137413 133478 129430 125287 121117 117079
65665 117079 113390 110087 106874 103417 99835 96672 94261 92383 90668 89160 88231 88075 88544 89388 90378
65650 90378 91201 91519 91258 90700 90223 90049 90202 90548 90850 90893 90627 90109 89398 88640 88158 88199 88622 89109 89687 90761
65630 90761 92562 94841 97203 99458 101519 103262 104705 106084 107606 109353 111607 114902 119398 124460
65616 124460 129269 133721 138333 143394 148646 153790 158934 164403 170348 176537 182422 187505 191893 196309
65602 196309 201159 205701 208582 209240 208304 206725 205036 203616 202971 203338 204370 205613 206994 208537 209940
65587 209940 210801 211037 210654 209364 206774 202841 197813 191918 185471 179037 173007 167091 160721 153978 147663
65572 147663 142372 137835 133292 128251 122796 117415 112587 108354 104294 100128 96300 93629 92394 92108
65558 92108 92153 92224 92108 91550 90613 89802 89514 89634 89885 90259 90806 91269 91405 91494 92040 92958 93493 93058 91924 90922
65538 90922 90699 91357 92568 93816 94626 94841 94758 94917 95687 97078 98888 100911 102962 104876 106686 108749
65522 108749 111488 114949 118768 122635 126593 130774 135058 139240 143394 147836 152780 158147 163583 168470
65508 168470 172102 174182 175086 175348 174998 173709 171436 168384 164428 159201 152961 146813 141697 137526 133586
65493 133586 129433 125071 120646 116421 112795 109926 107467 105072 102968 101630 101044 100746 100483 100368 100418 100456
65477 100456 100549 101060 102049 103017 103494 103625 103895 104378 104514 103619 101528 98787 96257 94499 93489 92862 92278
65460 92278 91482 90211 88385 86367 84795 84027 83891 83971 84021 84075 84320 84927 85901 87026 87989 88551 88615 88248 87671
65441 87671 87130 86696 86355 86338 87050 88504 90157 91646 93387 95936 98975 101598 103610 105830 108809 111785
65425 111785 113475 113636 113301 113473 113942 113674 112206 110348 109319 109335 109347 108247 105957 103168 100458 98062
65409 98062 96183 94908 93906 92766 91593 90767 90185 89371 88394 87978 88415 88985 88757 87546 85839 84263
65393 84263 83422 83711 84847 85974 86616 87187 88250 89733 91218 92485 93333 93417 92922 92901 94204 96316 98035
65376 98035 99052 100050 101373 102516 103075 103382 103890 104528 104990 105238 105400 105511 105546 105419 104847 103558 101792 100252
65358 100252 99405 99114 99042 99103 99399 100005 100913 101931 102621 102680 102467 102775 103985 105708 107298 108399 109050 109666
65340 109666 110874 112855 114840 115850 115990 116326 117299 118081 117921 117330 117262 117730 118068 118189 118704 119860 121143
65323 121143 121972 122240 122099 121776 121690 122228 123216 123959 124029 123768 123893 124838 126569 128763 130965 132692 133618 133780
65305 133780 133651 133986 135380 137894 141207 145151 149819 155051 160219 164818 168976 173052 176951 180271 182863
65290 182863 184798 185933 186020 185175 183734 181672 178698 174927 170954 167195 163619 160167 156837 153270 148903
65275 148903 143907 139412 136333 134314 132295 129783 127098 124675 122670 121164 120155 119304 118109 116468
65261 116468 114804 113556 112813 112502 112577 112850 112856 112212 111078 110026 109400 108912 108038 106736 105573 105040 104987 104939
65243 104939 104842 105127 105956 106814 107075 106792 106636 107127 108171 109284 110068 110455 110630 110788 110889 110694 110082 109266
65225 109266 108612 108317 108362 108674 109136 109485 109404 108828 108032 107338 106746 105917 104530 102672 100845 99573 98989 98803
65207 98803 98612 98238 97845 97831 98506 99732 100914 101498 101476 101299 101381 101837 102516 102975 102572 101088 99320 98515 98969
65188 98969 99652 99519 98746 98259 98456 98954 99314 99426 99326 99234 99646 100730 101652 101208 99337 97341 96387 96371 96548
65169 96548 96656 96817 96855 96394 95506 94706 94381 94610 95352 96338 96961 96866 96576 96920 97748 97904 96687 94787 93413
65150 93413 92956 92978 93112 93386 93848 94414 95116 96073 97144 97959 98361 98523 98561 98350 97879 97536 97848 99026 100837
65131 100837 102727 104109 104784 105213 106054 107307 108246 108450 108510 109289 110737 112022 112774 113583 115041 116821 118091
65114 118091 118611 119042 120258 122647 125992 129680 132968 135353 136911 138250 139977 142213 144647 147013 149377
65099 149377 151943 154736 157652 160816 164617 169300 174661 180328 186225 192601 199736 207884 217427 228773
65085 228773 241944 256392 271226 285536 298593 310112 320438 330300 340271 350495 360749 370483
65073 370483 378877 385328 389917 393062 394653 394028 390939 385998 379885 372653 364247 355129 345709 335465
65059 335465 323431 309559 294975 280875 267666 255222 243354 231838 220457 209372 199167
65048 199167 190315 182811 176354 170577 165003 159186 153209 147806 143714 140988 139089 137485 135988 134640
65034 134640 133465 132405 131451 130811 130767 131203 131428 130780 129384 128077 127535 127704 128020 127992 127617 127446 128123 129548
65016 129548 130665 130514 129394 128478 128375 128686 128927 129122 129224 128761 127542 126171 125417 125457 126109 127267 128616
64999 128616 129420 129205 128360 127560 126907 126174 125503 125164 124898 124268 123574 123645 124631 125615 125613 124510 122926 121567 120785
64980 120785 120370 119601 117798 114969 111787 109023 107148 106246 105926 105473 104564 103741 103755 104583 105521 106038 106071 105663
64962 105663 105025 104846 105729 107212 108075 107810 107137 106895 107154 107703 108679 110228 112045 113743 115298 116743 117823
64945 117823 118363 118605 118861 119185 119667 120623 122100 123622 124780 125755 126870 128030 128980 129739 130414 131018 131822
64928 131822 133327 135409 137072 137728 138173 139447 141152 141855 140973 139311 137794 136626 135777 135356 135221 134889
64912 134889 134159 133229 132057 130272 127927 125681 123886 122172 120318 118898 118500 118805 118995 118734 118167 117245
64896 117245 115750 113894 112324 111458 111188 111264 111570 111930 112011 111593 110835 110138 109837 110019 110524 111055 111371 111497
64878 111497 111768 112625 114184 115918 116921 116781 116130 116010 116654 117234 117007 116339 116262 117188 118447 119066 118721 117859
64860 117859 117090 116634 116338 116121 116250 117037 118315 119451 120049 120459 121407 123170 125303 127207 128794 130484
64844 130484 132599 134909 136907 138463 139992 141915 144172 146486 148889 151661 154808 157914 160484 162205
64830 162205 162947 162933 162883 163525 164787 165889 166361 166522 166678 166373 164927 162389 159457 156596 153785 151053 148783
64813 148783 147416 147171 148029 149626 151132 151657 150975 149654 148356 147275 146336 145547 144871 143934 142258 139860
64797 139860 137400 135586 134456 133342 131534 128958 126179 123905 122557 122136 122257 122302 121921 121466 121612 122365
64781 122365 122813 122225 121156 120939 122126 123815 124644 124131 122986 122356 122905 124384 125921 126836 127306 128179 130067
64764 130067 132707 135203 136854 137770 138808 140830 143907 147279 150251 152979 156138 159950 163884 167325
64750 167325 170158 172593 174784 176807 178664 179970 179923 177989 174565 170638 166870 163319 160028 157382 155617
64735 155617 154323 152836 151025 149304 147908 146578 145195 144262 144269 144794 144842 144201 143866 144806 146762 148711 150225
64718 150225 151779 153796 155977 157732 158877 159697 160651 162194 164669 168094 172124 176344 180509 184443 187888
64703 187888 190598 192551 194004 195356 196882 198408 199346 199289 198610 198254 198846 200146 201314 201490 200217 197690
64687 197690 194717 192015 189408 186042 181616 177004 173360 170917 169028 167126 165161 163228 161336 159602
64673 159602 158314 157633 157468 157684 158205 158868 159442 159913 160469 161051 161160 160432 159327 158923 159880 161772 163588
64656 163588 164777 165575 166344 166957 167038 166554 165777 164760 163267 161327 159428 157974 156760 155269 153311 151205
64640 151205 149500 148639 148687 149191 149482 149355 149282 149751 150586 151203 151380 151447 151808 152602 153836 155543 157719 160289
64622 160289 163173 166318 169716 173458 177600 181859 185719 188987 192008 195004 197539 199073 199737 199985 199667
64607 199667 198180 195579 192751 190240 187600 184319 180863 178229 176824 176275 176062 175816 175132 173731 171959
64592 171959 170751 170869 172286 174318 176218 177698 179077 180957 183644 186901 190355 194034 198315 203406
64578 203406 209083 214872 220255 224729 227991 230271 232258 234368 236082 236251 234230 230621 226782 223660
64564 223660 221202 218807 216007 212717 209153 205776 203051 200947 198839 196183 193208 190618 188810 187784
64550 187784 187648 188591 190289 191950 193163 194254 195579 196904 197777 198085 197915 197197 195909 194351 192898 191720
64534 191720 190934 190660 190568 189856 188197 186338 185238 184917 184809 184885 185592 186804 187732 188029 188214 188794 189585 190152
64516 190152 190289 189800 188463 186633 185259 184775 184384 182998 180566 177903 175495 173114 170567 168137 166177
64501 166177 164690 163550 162827 162605 162613 162270 161137 159282 157135 155053 153086 151239 149777 149041 149010 149326 149794
64484 149794 150575 151774 153134 154285 155061 155434 155375 154988 154527 154111 153659 153253 153244 153752 154403 154901 155508 156461 157202
64465 157202 156816 155244 153552 152912 153671 155395 157383 159045 160255 161462 163189 165318 167260 168871 170741
64450 170741 173367 176491 179587 182664 186152 190201 194487 198624 202413 205745 208581 211036 213239 215071
64436 215071 216211 216437 215708 214018 211435 208288 205071 202043 199115 196225 193698 192036 191387 191338 191226 190576
64420 190576 189321 187732 186225 185130 184527 184223 183935 183493 182939 182444 182178 182216 182488 182857 183354 184335 186189
64403 186189 188836 191649 194021 195900 197693 199781 202332 205335 208533 211378 213426 214805 216078 217693
64389 217693 219882 222956 227099 231753 235821 238949 242151 246706 252751 259513 266591 274269 282712 291694
64375 291694 301340 312359 325122 339083 353604 368875 385494 403562 422986 444399 468927 496862
64363 496862 527440 560274 596329 636865 681862 730111 780480 832178 883759 932857 977509
64352 977509 1017344 1052963 1084362 1110457 1129945 1142104 1146745 1143881 1133741 1116777 1093426 1064006
64340 1064006 1028950 988894 944363 895644 843321 788923 734745 682953 634845 590800 550598
64329 550598 513765 479961 449262 422066 398622 378696 361621 346540 332601 319199 306313
64318 306313 294544 284582 276501 269636 263170 256783 250717 245319 240638 236442 232500 228729 225114 221585
64304 221585 218040 214485 211105 208201 206006 204487 203296 202043 200749 200038 200751 203274 207247 211893 216553
64289 216553 220896 224719 227708 229481 229918 229420 228719 228279 227888 226986 225407 223681 222563 222358 222777 223281
64273 223281 223425 223076 222562 222570 223628 225548 227597 229320 230998 233118 235548 237506 238342 238070 237059 235437
64257 235437 233052 229999 226883 224355 222403 220303 217353 213541 209403 205410 201761 198665 196373 194711
64243 194711 192983 190734 188395 186749 185834 184896 183537 182390 182328 183344 184681 185866 187168 188985 191181
64228 191181 193235 194892 196477 198630 201797 205884 210326 214457 217884 220601 222859 224997 227291 229882
64214 229882 232748 235686 238250 239857 240224 239727 239060 238437 237475 235991 234542 233820 233776 233787 233446 232699 231320
64197 231320 228998 226012 223204 220955 218704 215849 212731 210225 208569 207089 205037 202278 199195 196234
64183 196234 193697 191720 190290 189329 188787 188654 188928 189609 190687 192092 193738 195586 197534 199288 200575
64168 200575 201523 202559 203891 205383 206986 208869 210909 212566 213642 214782 216693 219185 221531 223533
64154 223533 225541 227494 228700 228799 228320 227977 227874 227660 227102 226144 224752 223085 221657 220999 221204 221899 222558
64137 222558 222764 222486 222291 223062 225238 228516 232416 236879 242046 247769 253658 259340 264225 267244 267479
64122 267479 265203 261772 258255 254539 250036 244900 240004 235811 231775 227082 221700 216399 211873 208150
64108 208150 204868 201844 199213 197211 196022 195680 195867 195930 195373 194350 193458 193079 193166 193618 194484 195693 196980
64091 196980 198257 199791 201728 203696 205148 205954 206369 206625 206817 207093 207531 207825 207423 206167 204612 203576
64075 203576 203449 203963 204557 204841 204774 204476 204046 203669 203778 204787 206577 208489 210061 211595 213857 217363 222037
64058 222037 227339 232513 237010 241029 245475 250991 257115 262723 267208 270831 273977 276582 278436 279649
64044 279649 280603 281663 283096 285015 287313 289829 292610 295761 299016 301808 303858 305292 306050 305637 303814
64029 303814 301197 298730 296756 294933 292869 290431 287527 284012 279852 275102 269805 264182 258856 254479
64015 254479 251079 248117 245248 242740 241069 240399 240534 241114 241685 241877 241697 241478 241411 241381 241354 241604 242318 243346
63997 243346 244684 246846 250244 254351 258110 261237 264534 268776 273830 279174 284778 290973 297800 305008
63983 305008 312512 320287 327896 334705 340639 346237 351760 356672 360190 362054 362518 361967 360803 359433 357970
63968 357970 356109 353547 350416 347119 343987 341389 339870 339624 339929 339525 337658 334510 330744 327017 323810
63953 323810 321190 318606 315390 311632 308284 306221 305548 305788 306349 306640 306342 305921 306470 308642 312017 315810
63937 315810 319787 324075 328562 333160 338341 344621 351572 358133 364032 370267 377940 387212 397671 409112
63923 409112 421472 434395 447402 460380 473563 487211 501573 516947 533447 550887 569205
63912 569205 588868 610472 634082 659312 685987 714307 744439 776358 810160 846110 884276
63901 884276 924503 967027 1012811 1062967 1118051 1178225 1244058 1316891 1398328 1489460 1590672
63890 1590672 1702213 1824971 1960501 2110023 2273338 2448956 2635303 2831479 3036689
63881 3036689 3249269 3466565 3685421 3902248 4112698 4311810 4494788 4657559 4796711
63872 4796711 4909354 4993265 5046989 5069573 5060350 5019067 4946147 4842785 4711073 4554223 4376467
63861 4376467 4182432 3976486 3762614 3544552 3325762 3109335 2898124 2694900 2502076
63852 2502076 2321215 2152921 1997276 1854327 1724181 1606745 1501389 1406909 1321957 1245589
63842 1245589 1177318 1116586 1062422 1013790 970020 930587 894656 861283 830042 801046 774251
63831 774251 749109 725037 701896 679832 658953 639378 621311 604834 589875 576605 565577
63820 565577 557107 550689 545449 541115 538175 537113 537842 539919 542978 546877 551723 557867 565579 574668
63806 574668 584616 595152 606369 618198 630110 641474 651872 660917 668189 673739 678233 682075 684643
63793 684643 684941 682837 679067 674045 667428 658961 649011 637873 625196 610644 594701 578123 560879
63780 560879 542380 522703 502836 483592 464909 446586 429150 413434 399493 386390 373124
63769 373124 359485 346022 333365 321688 310779 300572 291450 283852 277654 272164 266746 261190 255475
63756 255475 249618 244019 239523 236645 234865 233133 231049 229166 228080 227579 226857 225294 222877 220042 217307
63741 217307 215002 213224 211943 211030 210117 208664 206430 203814 201479 199668 198164 196790 195537 194137 192065
63726 192065 189250 186489 184762 184274 184448 184664 184666 184357 183651 182668 181798 181383 181457 181874 182529 183288 183793 183617 182743
63707 182743 181755 181315 181434 181494 181101 180672 180824 181344 181288 180250 179013 178558 178844 179134 179302 180041 181594 183002
63689 183002 183190 182401 181944 182604 183936 185193 186306 187571 188877 189905 190931 192764 195708 199057 201882
63674 201882 203977 205749 207520 209335 211287 213552 216045 218412 220472 222495 224930 227979 231444 234918
63660 234918 238118 241091 243948 246389 247787 247914 247284 246420 245088 242844 240155 238293 237956 238514 238811 238238
63644 238238 236918 235355 234178 233813 234095 234586 235421 237343 240584 244270 247371 249785 251992 254139 256142
63629 256142 258282 260829 263229 264486 264476 264175 264425 265038 265331 265033 264381 263753 263527 264044 265355 267034 268447
63612 268447 269206 269435 269652 270285 271220 271993 272545 273391 274641 275322 274348 272030 269805 268412 267112 264930 261914
63595 261914 258790 256002 253663 251982 251105 250709 250283 249774 249592 250024 250920 251903 252726 253474 254470 255882 257469
63578 257469 258965 260677 263263 266869 271019 275489 280697 286847 293338 299564 305858 312972 320980 329378
63564 329378 338070 347529 358089 369684 382260 395748 409674 423547 437805 453731 472088 492322
63552 492322 513376 534788 556582 578438 599454 618619 635213 648865 659469 667061 671735 673785
63540 673785 673891 672900 671266 668919 665708 661640 656560 649955 641394 630975 619158 606387 593090 579802
63526 579802 566914 554390 541944 529420 516885 504648 493480 484515 478422 474687 472167 470353
63514 470353 469646 470364 472092 474391 477680 482728 489404 496540 503228 509718 516703 524124 531279 537983 544920
63499 544920 552702 561206 570288 580650 593302 608331 624957 642863 662732 685156 709627 735021
63487 735021 760442 784813 806024 821561 830296 833109 831569 826665 819203 810712 802943 796373 789856
63474 789856 782097 773096 763815 754650 744759 732944 718784 702608 684659 664837 643351 621187
63462 621187 599529 578902 559228 540637 523768 509083 496146 483854 471357 458703 446679
63451 446679 436088 427098 419194 411749 404637 398184 392614 387815 383687 380392 377986 376004 373758 371052
63437 371052 368370 366291 364862 363648 362258 360761 359572 358998 358923 359074 359510 360599 362351 364088 365116
63422 365116 365609 366355 367576 368503 368389 367625 367404 368387 370025 371240 371459 370849 369796 368449 366723 364537
63406 364537 361947 359161 356537 354456 353059 352117 351318 350650 350310 350294 350421 350860 352253 354986 358634 362535
63390 362535 366700 371659 377529 383905 390650 398104 406259 414449 422432 431240 442297 455945 471472
63377 471472 488406 506933 526879 546924 565299 581037 594302 605786 616211 626291 636790
63366 636790 648248 660728 674054 688452 704779 723828 745416 768479 792049 815742 839043
63355 839043 860593 878620 891884 899964 903062 902095 898654 894096 888576 881470 872763 863413 854237 844947
63341 844947 834446 821689 806204 788348 769211 749782 730063 709534 688580 668722 651007
63330 651007 634900 619368 604501 591324 580383 571380 564035 558495 554812 552743 552318 554012 557958
63317 557958 563306 568750 573639 578440 584211 591771 601275 612370 624579 637460 650548 663503 676474
63304 676474 690129 705172 721916 740372 760420 781692 803576 825592 847473 868554 887431
63293 887431 902673 913741 920796 923882 922919 918471 911822 904052 895435 885912 875664 864865 853173
63280 853173 839831 824305 806679 787507 767394 746658 725356 703672 682170 661596 642484
63269 642484 625074 609417 595336 582521 571047 561636 554926 550429 546588 541942 535865 528241 519036
63256 519036 508495 497274 485986 474817 463831 453447 444262 436562 430186 424774 419943 415404 411087
63243 411087 407136 403670 400692 398226 396289 394588 392534 389750 386314 382325 377592 372173 366939 362992
63229 362992 360446 358241 355390 352036 348997 346519 343986 340899 337690 335204 333578 332133 330435 328941
63215 328941 328243 328034 327377 325937 324342 323233 322423 321338 319939 318835 318566 319070 319847 320504 321110 322021 323320
63198 323320 324550 325252 325687 326694 328761 331599 334766 338308 342450 346926 351051 354444 357425 360699 364844
63183 364844 370010 375965 382382 389155 396435 404370 412940 422069 431795 442317 453981 467108 481517
63170 481517 496239 510090 522679 534499 545995 557007 567351 577432 587803 598435 608898
63159 608898 619081 629308 639805 650352 660382 669215 676454 682413 687808 692690 695977 696488 694151
63146 694151 689667 683409 675409 666242 656916 647761 638245 628240 618777 610987 604830 599401 594209 589667
63132 589667 586447 584747 584195 584256 584839 586568 590316 596355 604185 613194 623148 633867 644930 656047
63118 656047 667381 679081 690786 702104 713369 725229 737431 748627 757658 764664 770641 776146
63106 776146 780729 783460 783691 781323 776563 769485 759838 747359 732372 715913 699000 681835 663982
63093 663982 645335 626575 608536 591447 575166 559921 546297 534500 524136 514917 507087 500776
63081 500776 495336 489847 484153 478921 474759 471762 469884 469171 469413 470043 470697 471583 473042 475043 477388
63066 477388 480101 483219 486409 489266 491925 494941 498519 502211 505498 508341 510988 513474 515560 517115
63052 517115 518413 519980 522138 524632 526771 528126 529054 530357 532364 534569 536270 537303 537941 538324 538367
63037 538367 538218 538390 539298 540884 542875 545169 547758 550438 552870 554917 556689 558287 559709 560998 562297
63022 562297 563695 565223 566975 568997 571065 572858 574519 576700 579858 583699 587561 591194 594937 599342
63008 599342 604888 611881 620252 629502 639188 649463 660885 673795 688199 704089 721461 740053
62996 740053 759571 780329 803082 827976 854097 880409 906763 933572 960900 988437 1016217
62985 1016217 1044650 1073690 1102473 1130096 1156550 1182638 1209070 1235760 1261887 1286528 1309342
62974 1309342 1330719 1351183 1370544 1387726 1401488 1411232 1417015 1418916 1416612 1409632 1397838 1381535
62962 1381535 1361244 1337599 1311434 1283690 1255055 1225838 1196447 1167913 1141624 1118424 1098202
62951 1098202 1080494 1065362 1053529 1045730 1042035 1041745 1043861 1047754 1053486 1061455 1071765 1084138 1098403
62938 1098403 1114746 1133227 1153304 1174167 1195361 1216723 1237860 1258146 1277285 1295394 1312396
62927 1312396 1327742 1340923 1351860 1360470 1366127 1367959 1365509 1358708 1347347 1331075 1309931 1284457
62915 1284457 1255185 1222406 1186660 1149092 1111087 1073685 1037455 1002557 968647 935120 901927
62904 901927 870043 840715 814292 790127 767449 745793 724691 703670 682859 663059 644885
62893 644885 628242 612914 599063 586578 574440 561570 548236 535808 524999 515074 505090 495256
62881 495256 486561 479410 473240 467352 461639 456388 451697 447280 442762 438043 433369 429024 425084 421582
62867 421582 418791 417041 416191 415557 414516 412954 411018 408761 406345 404284 403035 402397 401717 400666 399390
62852 399390 397858 395570 392277 388681 385970 384653 384121 383405 382151 380794 379977 379995 380721 381900 383450 385506
62836 385506 388184 391240 393981 395606 395796 394979 394040 393732 394329 395656 397265 398593 399188 398971 398212 397121
62820 397121 395496 392983 389727 386559 384312 382973 381768 380070 378004 375994 374062 371876 369338 366706
62806 366706 364172 361794 359932 359205 359647 360328 360294 359627 359116 359104 359218 359109 358782 358122 356861 355292 354377 354624
62788 354624 355239 355021 353825 352607 352095 352014 351716 351062 350439 350192 350337 350641 350777 350507 349963 349673 350135 351277
62770 351277 352509 353373 354010 354846 355982 357126 358143 359342 361090 363362 365901 368606 371467 374285 376827
62755 376827 379271 382118 385650 389766 394324 399218 404053 408229 411626 414868 418654 423150 428283 434208
62741 434208 441028 448332 455528 462596 470123 478645 488302 499076 510942 523694 536987 550707 565180
62728 565180 580943 598414 617751 638877 661662 686239 713089 742700 775176 810280 847670
62717 847670 886901 927340 968299 1009114 1048894 1086447 1120811 1151625 1178561 1200594 1216397
62706 1216397 1225439 1228143 1224931 1215697 1200335 1179184 1152744 1121560 1086789 1050267 1013356 975998
62694 975998 937488 898067 859191 822247 787479 754282 722205 691536 663111 637604 614820
62683 614820 593749 573552 554455 537357 522645 509828 498417 488616 480796 474642 469292 464166
62671 464166 459308 455019 451604 449458 448886 449665 451109 452741 454671 457149 460148 463652 468015 473583 480154
62656 480154 487275 494997 503860 514186 525902 539078 554084 570953 589064 607782 627114 647508
62644 647508 669416 693312 719771 749019 780615 813962 848942 885719 924192 964080 1005296
62633 1005296 1047630 1090115 1131122 1169068 1202693 1230901 1252947 1268736 1278333 1281175 1276362 1263809
62621 1263809 1244510 1219487 1189141 1153902 1114879 1073423 1030487 986860 943526 901227 859989
62610 859989 819639 780652 743988 710223 679222 650597 624054 599422 576779 556517 538849
62599 538849 523222 508687 494887 482296 471298 461462 451986 442615 433745 425734 418440 411559 405157
62586 405157 399622 395076 391077 387080 383096 379674 377229 375593 374295 373016 371651 370160 368582 367051
62572 367051 365592 364015 362213 360402 358873 357623 356516 355687 355477 355981 356975 358286 359918 361781 363606
62557 363606 365287 367035 369025 371124 373163 375276 377683 380337 383056 385983 389556 393991 399126 404897
62543 404897 411640 419628 428589 438095 448268 459647 472283 485619 499508 514836 532517 552094
62531 552094 571947 590859 608805 626145 642627 657467 669950 679518 685607 687887 686586 682282
62519 682282 675392 666051 654428 640906 626003 610281 594275 578319 562467 546682 531019 515579
62507 515579 500450 485844 472103 459388 447510 436316 426073 417181 409635 403030 397074 391806
62495 391806 387317 383532 380309 377537 375127 373093 371670 371161 371571 372490 373355 373825 374050 374675 376420 379413
62479 379413 383000 386423 389519 392530 395460 398105 400690 403891 407980 412433 416690 421014 426211 432759
62465 432759 440633 449927 461094 474375 489292 505027 521202 538038 555800 574416 593857 614675
62453 614675 637858 664000 692769 723174 754191 785043 815083 843687 870253 894212 915066
62442 915066 932507 946498 957172 964744 969628 972550 974411 976021 977960 980636 984412 989757 997303
62429 997303 1007635 1021030 1037550 1057382 1080696 1107022 1135037 1163224 1190419 1215451 1236671
62418 1236671 1252520 1262564 1267427 1267575 1262531 1251381 1233650 1209472 1179287 1143764 1103963 1061281
62406 1061281 1017070 972248 927328 882962 840394 801038 765313 732286 700881 671259 644482
62395 644482 621012 600281 581760 565696 552345 541119 531075 522005 514566 509377 506345 504741
62383 504741 503695 502640 501519 500558 499817 499117 498410 497852 497370 496502 494939 492870 490455 487309 482971 477687
62367 477687 472208 466867 461407 455695 450092 444916 440021 435171 430530 426443 422897 419498 415960 412361
62353 412361 408930 405806 403092 400950 399470 398403 397247 395726 394155 393191 393234 394187 395737 397669 399840
62338 399840 402133 404572 407334 410442 413613 416640 419811 423717 428625 434223 439967 445545 451063 456978
62324 456978 463914 472313 482081 492553 502906 512691 522154 532057 543062 555111 567445 579359 590891
62311 590891 602761 615750 630275 646400 664019 683059 703744 726642 752204 780250 810179
62300 810179 841787 875573 912077 951098 991744 1033054 1074159 1113946 1151011 1184184 1212904
62289 1212904 1236865 1255519 1268249 1274951 1276109 1272188 1263219 1249152 1230354 1207564 1181573 1153231
62277 1153231 1123587 1093603 1063698 1033874 1004357 975845 949026 924097 900802 878665 857125
62266 857125 835735 814464 793635 773487 753979 735067 716799 698988 681206 663475 646613
62255 646613 631423 617726 604646 591742 579395 568112 557964 548874 540997 534592 529683 525976
62243 525976 522932 519868 516337 512629 509700 508384 508729 510175 512183 514560 517347 520664 524624 529206
62229 529206 534163 539123 543837 548382 553189 558881 565943 574458 584129 594498 605084 615447 625356
62216 625356 634971 644712 654916 665777 677586 690810 705780 722518 740993 761333 783520 807034
62204 807034 831143 855625 881053 908294 937873 969769 1003571 1038707 1074705 1111404 1148810
62193 1148810 1186506 1223202 1256941 1285817 1308500 1324314 1333185 1335604 1332375 1324143 1311204 1293834
62181 1293834 1272561 1247859 1219720 1187836 1152293 1113907 1073913 1033531 993809 955525 919068
62170 919068 884554 852202 822448 795620 771716 750554 731953 715653 701266 688461 677030
62159 677030 666660 656931 647667 639060 631252 624142 617854 612988 609889 607920 605987 603784 601999 601316
62145 601316 601777 603203 605650 609075 612948 616638 620105 623927 628681 634482 641036 647974 655090 662355
62131 662355 669762 677316 685177 693654 702843 712412 722023 731850 742322 753394 764468 775068 785130
62118 785130 794544 802992 810646 818560 827860 838732 850679 863655 878413 895730 915743 938207
62106 938207 962964 989828 1018164 1046891 1074880 1101214 1125062 1145545 1161838 1173435 1180230 1182375
62094 1182375 1180127 1173837 1164003 1151180 1135815 1118175 1098423 1076723 1053337 1028713 1003498 978435
62082 978435 954206 931316 909976 890086 871486 854358 839205 826295 815338 805844 797599 790458
62070 790458 783920 777353 770611 763997 757642 751388 745367 740224 736492 734076 732526 731526 731031 731275 732816
62055 732816 736058 740416 744316 746422 746610 745475 743352 740357 737019 734140 732027 730336 728591 726355
62041 726355 722946 717686 710744 703315 696680 691225 686511 681971 677437 673269 670203 668882 669335 671050
62027 671050 673649 677302 682368 688908 696757 705863 716233 727691 740011 753292 767891 783858 800685
62014 800685 817799 835128 852952 871292 889828 908552 928114 949145 971330 993588 1015158
62003 1015158 1036093 1056486 1075594 1092125 1105207 1114734 1120840 1123430 1122315 1117532 1109352 1098057
61991 1098057 1083718 1066153 1045152 1020917 994258 966226 937516 908325 878735 849125 820133
61980 820133 792248 765457 739381 713933 689748 667680 647864 629679 612730 597316 583558
61969 583558 570623 557533 544511 532779 522961 514361 505936 497416 489241 481903 475619 470182 464854
61956 464854 458856 452291 446203 441375 437425 433537 429670 426492 424340 422947 422205 422571 424485 427748 431766
61941 431766 436132 440687 445202 449272 452517 454725 455852 456031 455643 455159 454703 453723 451308 447070 441681
61926 441681 436335 431622 427093 421975 416079 409851 403751 397898 392305 387196 382936 379746 377520 375900
61912 375900 374538 373318 372338 371611 370844 369638 367911 366091 364811 364452 365000 366275 368202 370792 373885
61897 373885 377114 380215 383345 386929 391254 396320 402098 408701 416187 424289 432485 440379 448051 456152
61883 456152 465643 477247 490989 506246 522275 538691 555445 572492 589537 606113 621889 636964
61871 636964 651786 666624 681025 693902 704211 711564 716297 719111 720703 721511 721600 720781 718906 716117
61857 716117 712879 709833 707619 706761 707691 710789 716157 723302 731307 739630 748528 758387 768795 778667
61843 778667 787193 794138 799210 801763 801431 798624 794024 787883 780123 770866 760504 749475 738308 727712
61829 727712 718211 709707 701637 693521 685164 676477 667365 657787 647698 637066 626131 615521 605844
61816 605844 597174 589107 581233 573442 565992 559507 554707 551821 550418 550117 551211 554228 559032 564914
61802 564914 571536 579279 588553 599258 611108 624095 638395 654097 671337 690445 711735 735163
61790 735163 760296 786463 812815 838447 862708 885419 906685 926437 944116 958765 969540
61779 969540 976252 979356 979364 976472 970946 963672 955895 948475 941798 936376 933026 932267 933838 937091 941548
61764 941548 946835 952333 957207 960698 962152 960850 956076 947497 935441 920770 904311 886278 866377
61751 866377 844710 822363 800683 779962 759378 738392 717666 698246 680343 663437 647294
61740 647294 632247 618558 606074 594526 583715 573321 563071 553299 544901 538365 533082 527924
61728 527924 522340 516589 511141 506250 502095 498799 496147 493589 490803 488066 485840 484171 482751 481443
61714 481443 480362 479505 478694 478037 478102 479451 482159 485963 490632 495962 501613 507223 512661 518025 523513
61699 523513 529408 535974 543121 550202 556316 560710 562920 562852 560979 558113 554631 550133 544193 537147 529769
61684 529769 522469 515333 508614 502537 496838 491251 486287 482670 480029 477150 473732 470866 469325 468345
61670 468345 466805 464817 463310 462585 462188 461846 461675 461600 461359 461005 460791 460648 460386 460255 460671 461437 461917 461940
61652 461940 461852 461666 460925 459562 458155 456969 455332 452371 448000 442849 437612 432794 428701 425231 421898
61637 421898 418376 414825 411438 407958 404079 400091 396639 393787 390789 387026 382918 379581 377605 376373
61623 376373 374734 372201 369249 366510 364090 361880 360111 359066 358436 357563 356405 355617 355478 355264 354184
61608 354184 352540 351427 351449 352281 353427 354849 356636 358569 360382 362247 364572 367342 370010 372148 373927
61593 373927 375768 377726 379504 381036 382734 385087 388163 391621 395033 398099 400659 402670 404143 405151
61579 405151 405907 406718 407641 408299 408415 408417 408978 409859 409889 408393 406025 403608 400810 396871 392311 388722 386708
61562 386708 384954 381842 377387 373057 370093 368529 367647 366840 365945 364972 363689 361583 358310 354008 348979
61547 348979 343331 337289 331629 327153 323741 320534 317100 313797 310832 307827 304703 302210 300897 300078
61533 300078 298555 296065 293315 290888 288853 287293 286373 285842 285166 284362 284058 284475 284884 284456 283265 282052
61517 282052 281270 280801 280463 280341 280500 280677 280493 279911 279337 279174 279370 279523 279462 279565 280389 282098 284365 286746
61499 286746 288914 290552 291318 291167 290655 290641 291496 292704 293478 293751 294261 295565 297387 299230 301217 303653
61483 303653 305965 307018 306695 306369 307305 309137 310623 311406 312264 313777 315604 317192 318460 319487 320027 319808
61467 319808 319027 318186 317505 316810 315957 315132 314634 314488 314443 314342 314320 314551 314920 315154 315192 315155 314957 314374 313561 313175
61447 313175 313730 315103 316859 318724 320456 321660 322191 322559 323452 324960 326644 328285 330115 332338 334835
61432 334835 337438 340170 343112 346184 349111 351484 352985 353690 354029 354279 354329 354182 354272 354896 355584 355604 354895
61415 354895 353955 352976 351719 350265 349187 348888 349235 349959 350862 351571 351659 351198 350756 350686 350918 351430 352291 353065
61397 353065 352899 351623 350173 349543 349840 350720 352103 353815 355097 355314 354973 355331 357014 359513 361955 363852
61381 363852 365120 365901 366504 367225 368172 369438 371312 373985 377126 380104 382608 384704 386337 387187 387166 386775
61365 386775 386719 387273 388128 388873 389530 390574 392313 394321 395703 395937 395257 394185 393008 391832 390768 389790
61349 389790 388680 387365 386135 385295 384799 384430 384120 383887 383716 383682 383896 384174 384141 383916 384158 385102 386088 386561
61331 386561 387010 388214 390003 391609 392910 394388 396039 397352 398414 400048 402624 405567 408322 411014
61317 411014 413855 416801 420146 424510 429591 433769 435862 436755 438374 441380 444709 447137 448393 448823 448884
61302 448884 449274 450772 453469 456539 459149 461391 464072 467770 472341 477259 482222 487376 492982 498925
61288 498925 504685 509859 514551 519007 522981 525814 527242 527856 528543 529541 530239 529969 528842 527676 527058 526747
61272 526747 526118 524961 523443 521466 518687 515352 512529 510995 510283 509316 507768 506256 505341 504977 504982 505446
61256 505446 506428 507677 508944 510311 512081 514596 518287 523494 530028 537204 544608 552512 561193 570088
61242 570088 578068 584382 588934 591748 592734 592083 590360 587905 584503 579965 574881 570389 567220 565213 563634
61227 563634 561678 558711 554512 549594 545064 541895 540280 539767 539813 540042 540229 540472 541378 543680 547444 551829
61211 551829 555782 558792 560939 562613 564442 567216 571344 576440 581872 587798 595119 604195 613935 622604
61197 622604 629355 634649 639281 643467 646943 649492 651043 651486 650762 649100 646877 644224 640989 637157 633047
61182 633047 629017 625161 621406 617720 614046 610218 606149 601964 597738 593268 588475 583978 580866 579718
61168 579718 580122 581290 582867 584934 587456 590032 592183 593691 594722 595719 597073 598784 600471 601769 602653
61153 602653 603338 604089 605227 607015 609309 611529 613307 615005 617302 620311 623527 626651 630133 634771 640989
61138 640989 648559 656831 665146 673210 681233 689575 698252 706824 714720 721510 726888 730676 732905 733769
61124 733769 733452 732157 730269 728237 726238 724088 721469 718050 713476 707611 700845 693846 686863 679553
61110 679553 671625 663323 655085 647003 638832 630293 621183 611492 601638 592384 584218 577092 570952 566110
61096 566110 562600 559518 555737 551345 547746 546144 546365 547361 548351 549060 549152 548092 545627 542094 538057 533798
61080 533798 529320 524721 520379 516667 513682 511319 509528 508342 507766 507929 509290 512345 517011 522631 528764
61065 528764 535616 543422 551793 560207 568976 579095 590998 603944 616888 629641 642870 657030
61053 657030 671607 685491 697975 709286 720106 730795 741246 751369 761164 770184 777459 782373
61041 782373 785264 786704 786517 784047 779132 772122 763124 752104 739836 727886 717226 707454 697741
61028 697741 687972 678537 669570 661000 653106 646350 640749 635889 631569 628058 625670 624323 623628 623240 623132
61013 623132 623577 624851 627017 630019 633905 638721 644290 650453 657452 665690 675162 685618 697247 710483
60999 710483 724979 739593 753877 768954 786308 806175 827735 850405 874232 899333 925764
60988 925764 953844 983914 1015813 1049138 1084008 1120932 1159985 1200669 1242739 1286601 1332743
60977 1332743 1381140 1431442 1483503 1537599 1594337 1654395 1718245 1786121 1858200 1934587 2015107
60966 2015107 2099574 2188382 2282226 2380969 2483574 2589763 2701032 2819324 2945447 3079746
60956 3079746 3223584 3378773 3545858 3724307 3914363 4117768 4337362 4577751 4846232
60947 4846232 5151176 5499329 5896389 6350245 6871505 7470983 8160033 8954337 9873638
60938 9873638 10935636 12153526 13538824 15090549 16757818 18405169 19834436 20873799
60930 20873799 21469857 21703969 21726491 21678781 21662815 21743543 21933077 22153832 22236929 21993208
60920 21993208 21314702 20224742 18844042 17316349 15755950 14236822 12802860 11477891
60912 11477891 10272240 9188493 8224912 7375722 6631595 5982145 5417721 4928860 4505539
60903 4505539 4137953 3817402 3536105 3287192 3065456 2867395 2690106 2530796 2387435
60894 2387435 2258776 2143179 2038283 1942374 1855179 1776544 1704954 1638043 1574062 1512285 1452550
60883 1452550 1395125 1340603 1289140 1240021 1192530 1147008 1104434 1065183 1028814 994851 963134
60872 963134 933411 905241 878457 853329 830085 808550 788420 769674 752591 737387 723856
60861 723856 711358 699275 687511 676403 666100 656304 646768 637769 629793 622902 616662 610670 604884
60848 604884 599458 594439 589686 585033 580477 576175 572214 568418 564513 560409 556217 552025 547764 543240
60834 543240 538102 531949 524790 517338 510495 504495 498795 492785 486283 479387 472312 465495 459459 454289
60820 454289 449444 444241 438394 432087 425868 420498 416469 413493 410733 407674 404520 401749 399609 398135
60806 398135 397222 396585 396045 395933 396750 398343 399975 401410 403259 405929 408837 411161 412855 414429 416124
60791 416124 417877 419774 421969 424352 426712 428997 431078 432602 433499 434209 434864 434630 432549 428823 424617
60776 424617 420782 417406 414415 411850 409493 406895 403903 400686 397287 393726 390571 388692 388225 388293 387947
60761 387947 386934 385350 383103 380063 376408 372484 368517 364596 360700 356624 352095 347107 341931 336771
60747 336771 331748 327238 323777 321437 319638 317767 315714 313594 311312 308747 306200 304310 303554 303900 304889
60732 304889 305951 306755 307326 307808 308218 308594 309231 310419 311983 313436 314580 315612 316655 317672 318890 320730
60716 320730 323034 324901 325681 325738 325855 326317 327081 328406 330541 332939 334559 335124 335469 336406 337763 338863
60700 338863 339483 339856 339975 339509 338380 337024 335885 334964 334044 333106 332320 331765 331424 331390 331793 332476 332964 332867
60682 332867 332238 331429 330595 329404 327240 323812 319627 315697 312646 310221 307834 305345 302918 300395 297457
60667 297457 294476 292475 291916 292115 292256 292390 292896 293527 293795 293973 294785 296174 297285 297784 298384 299779 301737
60650 301737 303645 305344 307017 308690 310382 312394 314948 317686 319932 321413 322452 323585 325140 327034
60636 327034 328794 329960 330622 331333 332336 333240 333669 333845 334118 334260 333794 332880 332290 332484 333188 333961 334712 335484
60618 335484 336161 336655 337126 337706 338187 338277 338066 337884 337714 337020 335333 332849 330204 327757 325312 322568 319638
60601 319638 316951 314762 312953 311300 309735 308369 307369 306939 307283 308490 310382 312473 314215 315478 316779
60586 316779 318739 321123 322762 322749 321485 320022 318560 316268 312719 308842 306052 304821 304547 304502 304468 304581
60570 304581 305013 305811 306777 307522 307829 307859 307865 307880 307937 308316 309193 310230 311037 311982 313960 317170 320627 323134 324399
60551 324399 324936 325242 325529 326010 326877 327896 328429 328061 327014 325886 325156 325044 325574 326624 328059 330020 332867
60534 332867 336584 340425 343575 346155 349130 353056 357317 360864 363401 365442 367395 369061 370074 370473
60520 370473 370708 371294 372551 374512 377027 380022 383637 387927 392565 397185 402089 408279 416565 426779
60506 426779 438013 449456 460847 472224 483439 493954 503072 510334 515684 519207 520871 520713 519152
60493 519152 516861 514335 511871 509960 509332 510402 512977 516700 521621 528105 536322 546065 557057 569263
60479 569263 582953 598612 616807 638013 662302 689030 716809 744056 769763 793585 814992
60468 814992 832635 844907 850995 851089 845881 836456 824459 811433 797782 783133 768014 754398 743954
60455 743954 736327 729826 723516 717965 714218 712748 713396 715789 719689 725285 733164 743831 757447 774288
60441 774288 795059 820282 849657 882609 919154 959455 1002611 1046779 1090578 1133534 1174846
60430 1174846 1212687 1245442 1273136 1296919 1317504 1334949 1349858 1363784 1377834 1391156 1401215
60419 1401215 1405408 1402142 1390478 1369490 1338537 1298157 1250181 1196817 1139898 1081146 1022640 966364
60407 966364 913334 863583 817050 774108 735211 700478 669766 642732 618629 596460 575710
60396 575710 556746 540227 526230 514234 503768 494697 486909 480089 473886 468095 462504 456794 450785
60383 450785 444745 439293 434938 431694 429127 426684 424038 421198 418366 415659 412991 410257 407615 405423
60369 405423 403798 402386 400775 398985 397282 395584 393448 390738 387920 385504 383556 382008 381072 380944 381353
60354 381353 381910 382709 384035 385538 386302 385934 385068 384584 384661 384950 385299 385875 386695 387436 387826 387972 388207 388744
60336 388744 389568 390665 392206 394445 397393 400714 404001 407097 410036 412846 415545 418263 421082 423770
60322 423770 425914 427408 428661 430227 432327 434740 437071 439126 441128 443450 446025 448132 449043 448840 448360
60307 448360 448387 449124 450346 451670 452663 453193 453811 455445 458516 462623 467200 472004 476802 481126 484868 488784
60291 488784 493807 499951 506325 512042 516629 519683 520873 520499 519450 518215 516312 513085 508818 504539
60277 504539 500813 497271 493470 489767 486899 484866 482754 479907 476890 474822 473812 472561 469787 465663
60263 465663 461482 458138 455551 453576 452809 453955 456773 460224 463652 467327 471725 476773 482188 488298
60249 488298 496022 505901 517429 529498 541372 553153 565407 578429 591744 604121 614076 620571
60237 620571 623340 622569 618341 610584 599591 586397 572342 558337 544727 531839 520174 509786
60225 509786 499866 489586 479354 470601 464100 459024 454070 448997 444460 440671 437053 433279 429840 427304
60211 427304 425469 423594 421079 417725 413807 410225 408108 407780 408353 408770 408955 409483 410442 411188 411253 410880 410610
60194 410610 410719 411165 411760 412294 412755 413452 414683 416205 417320 417563 417155 416774 417031 418107 419653 421086 422190
60177 422190 423377 425155 427450 429719 431610 433160 434465 435591 436812 438533 440910 443796 447025 450381
60163 450381 453398 455787 458144 461619 466589 472100 476917 480773 484309 488193 492744 498074 504054 510150
60149 510150 515707 520479 524726 528824 532951 537143 541459 545986 550686 555235 559118 562067 564332 566328
60135 566328 568092 569376 570220 570995 571736 571881 570894 568865 566239 563258 560040 556962 554579 553117 552203 551108
60119 551108 549272 546810 544564 543406 543358 543626 543602 543525 543958 544999 546304 547549 548448 548531 547381 545059 541994
60102 541994 538544 534950 531584 528840 526756 525049 523643 522969 523649 525879 529049 531954 533662 534376 535223
60087 535223 537010 539423 541709 543747 545971 548489 550891 552936 554892 557037 559267 561386 563454 565640
60073 565640 567960 570343 572800 575419 578316 581572 585038 588269 590967 593485 596526 600225 603960 607312
60059 607312 610840 615447 621166 627048 632313 637190 642453 648379 654504 660344 665985 671769 677549 682571
60045 682571 686110 688012 688566 688122 687012 685556 683851 681701 679064 676448 674494 673224 672135 671026 670193
60030 670193 669636 668654 666633 663831 660823 657405 652708 646432 639371 632514 626020 619363 612132 604340 596185
60015 596185 587857 579515 571183 562751 554342 546560 540083 535020 530929 527339 523942 520354 516198 511529
60001 511529 506774 502180 497750 493839 491174 489864 488885 487103 484539 482118 480479 479628 479541 480304 481598
59986 481598 482715 483357 483975 485081 486629 488288 489928 491554 492966 493794 493850 493389 493041 493294 493830 493650 492192
59969 492192 490046 488043 485933 482792 478615 474537 471320 468551 465692 462940 460469 457688 454060 449997
59955 449997 446113 442158 437666 433236 430089 428440 427319 426001 424710 423740 422806 421639 420494 419630 418780
59940 418780 417609 416312 415303 414571 413810 413108 413086 414222 416226 418236 419641 420641 421938 423944 426445
59925 426445 429010 431419 433596 435454 437023 438486 439839 440739 440927 440608 440149 439704 439347 439187 438984 438106
59909 438106 436426 434915 434639 435368 435909 435711 435371 435522 436027 436435 436560 436351 435802 435308 435574 436786 438224
59892 438224 439018 438918 438130 436859 435410 434340 434029 434288 434692 435044 435239 434943 433940 432742 432421 433630 435927
59875 435927 438115 439267 439508 439840 441161 443496 446269 449204 452594 456740 461511 466619 471971 477546 483154
59860 483154 488582 493780 498691 503081 506740 509782 512580 515437 518394 521270 523806 525884 527664 529381
59846 529381 531078 532667 534270 536178 538396 540498 542059 543031 543579 543847 544085 544782 546307 548438 550533
59831 550533 552303 554293 557440 562082 567474 572439 576518 580267 584400 588954 593463 597612 601338 604511
59817 604511 606990 608952 610763 612567 614273 615807 616943 617078 615769 613469 611164 609224 607153 604543
59803 604543 601589 598540 595301 591987 589285 587786 587352 587489 587973 588713 589486 590260 591512 593721 596805 600512
59787 600512 605082 610951 617931 625114 631574 636742 640281 642119 642742 642988 643354 643735 643974 644339 645142 645915
59771 645915 645283 641942 635841 628267 620638 613364 606076 598709 591879 586222 581870 578696 576591 575209
59757 575209 573796 571649 568569 564735 560453 556214 552629 549921 547646 545227 542554 539842 537200 534662
59743 534662 532414 530634 529211 527909 526635 525246 523352 520748 517981 516066 515578 516210 517203 517934 518126
59728 518126 517738 516813 515404 513676 512023 510865 510231 509778 509350 509244 509721 510449 510672 509862 508097 506028 504574
59711 504574 504358 505174 506142 506582 506598 506717 507250 508197 509584 511658 514846 519517 525493 531830 537519 542552
59695 542552 547847 553966 560469 566744 572814 578850 584488 589223 593099 596469 599435 602087 604846 607922
59681 607922 610740 612572 613501 614124 614622 614862 615162 616050 617295 617998 617724 616904 616051 615242 614467 613803 613037 611654
59663 611654 609427 606708 604101 602189 601406 601574 601648 600587 598558 596680 595653 595366 595831 597516 600404 603549
59647 603549 606099 608232 610700 614011 618418 624082 630718 637537 644022 650402 656942 663218 668601 673067
59633 673067 676993 680414 683020 684713 685660 685952 685623 684921 684172 683461 682717 681940 681029 679519 676897 673170
59617 673170 668839 664377 659955 655608 651426 647560 644181 641401 639134 637155 635322 633603 631931 630384
59603 630384 629569 630370 633040 636876 641016 645213 649514 653694 657536 661383 665808 670805 675689 679631 681930
59588 681930 682006 679741 675804 671098 665826 659567 652169 644001 635257 625663 615202 604577 594603 585477
59574 585477 577052 569431 562795 556873 551129 545455 540181 535310 530189 524202 517518 510895 504913 499641
59560 499641 494823 490021 484592 478107 471055 464785 460273 457081 453954 450395 447157 445089 444047 443341
59546 443341 442781 442729 443297 444116 444971 446135 447807 449595 450864 451372 451335 451004 450539 450188 450232 450643 451024 451062 450914
59527 450914 450981 451365 451697 451516 450667 449296 447571 445561 443392 441408 440003 439255 438774 437975 436507 434412
59511 434412 431979 429570 427566 426232 425509 425069 424696 424493 424572 424735 424710 424590 424675 424948 425119 425301 426129 427933
59493 427933 430180 432141 433869 436042 438982 442313 445645 449114 453118 457856 463358 469713 477085 485614
59479 485614 495496 506948 519825 533231 545612 555300 561102 562706 560845 557116 553286 550423 548513
59466 548513 546962 545511 544555 544494 544994 545184 544549 543251 541527 539211 536114 532472 528629 524517 519922 515100
59450 515100 510598 506433 501998 496919 491580 486577 482022 477694 473571 469819 466373 462947 459571 456807
59436 456807 455198 454620 454484 454652 455814 458609 462470 465826 467686 468617 469902 472009 474378 476486 478570
59421 478570 481159 484312 487504 490075 491667 492443 492934 493609 494581 495779 497265 499131 501214 503189 504860
59406 504860 506125 506780 506722 506276 505957 505994 506467 507771 510371 514036 517888 521434 525009 529033 533323 537523
59390 537523 541708 546066 550257 553640 556044 557873 559395 560254 559769 557557 553887 549574 545555 542382 540061
59375 540061 538328 537034 536226 535934 536003 536191 536525 537520 539802 543372 547438 551293 555218 560202 566877 575072
59359 575072 584340 594486 605554 617746 631494 647296 665261 684820 704636 722442 735393 741563
59347 741563 741477 737712 732768 727753 723116 719733 718699 720513 724930 731114 737392 741349 740949 735634 726146
59332 726146 713740 700023 687043 676546 668988 663689 659857 657018 654706 652463 650329 648763 647932
59319 647932 647467 647076 647012 647739 649380 651648 654039 656037 657325 657974 658272 658346 658179 657994 658317 659517 661502
59302 661502 663970 666711 669507 672008 674102 676382 679919 685388 692472 700245 708068 715936 724083 732565
59288 732565 741391 750789 760977 771705 782290 792125 800989 809003 816563 824225 832190 839773 845703
59275 845703 849088 849887 848544 845569 841472 836545 830471 822652 813218 803240 793602 784066 773856 762759
59261 762759 751159 739353 727487 715945 705178 695118 685279 675441 665821 656507 647211 637759 628462
59248 628462 619817 612059 605175 599224 594423 590944 588694 587405 587026 588017 591059 596488 604159 613781 624858
59233 624858 636060 645100 649820 649451 644745 637117 627910 618150 608482 599292 591029 584297 579412 576077
59219 576077 573786 572455 572416 573967 577115 581640 587183 593456 600487 608434 617018 625554 633772 642060 650528
59204 650528 658404 664988 670705 676334 681482 684722 685298 683849 681381 678334 674880 671347 667890 664241
59190 664241 660285 656504 653475 651176 649153 647204 645572 644586 644346 644744 645659 647100 649109 651408 653291
59175 653291 654201 654420 654898 656245 658044 659202 658811 656725 653499 649808 645818 641153 635602 629684 624210
59160 624210 619424 614926 610373 605856 601604 597675 594001 590421 586652 582495 578105 573790 569627 565646
59146 565646 562286 560162 559281 559000 558898 559261 560520 562653 565403 568683 572412 576266 580002 583852 588263
59131 588263 593329 598759 604307 609949 615654 621183 626168 630283 633448 636000 638596 641619 644630 646616
59117 646616 646963 646010 644404 642129 638640 634039 629537 626232 623753 620729 616497 611704 607278 603540 600469
59102 600469 598076 596064 593736 590733 587408 584032 580235 575758 571167 567057 563015 558202 552651 547138
59088 547138 541969 536755 531298 525840 520433 514851 509177 503790 498722 493726 489005 485128 482194 479816
59074 479816 477966 477054 477067 477452 477996 479021 480599 482518 485291 490069 496984 504529 511285 517470 524051
59059 524051 531160 538357 545812 554058 562791 571016 578485 586159 595025 604987 615076 624245 631824 637639
59045 637639 641961 645187 647508 648956 649707 650102 650325 650214 649351 647318 644015 639818 635335 630937 626716
59030 626716 622831 619540 616760 613994 610975 608029 605502 603056 599891 595523 590090 584060 577939 572155
59016 572155 566887 561969 557096 552156 547336 543005 539483 536725 534171 531125 527348 523119 518710 514161
59002 514161 509659 505800 503194 501903 501353 500696 499323 497298 495286 493852 492911 492111 491523 491414 491522 491304
58986 491304 490955 491387 492950 494833 496059 496490 496497 496279 495984 496004 496633 497751 499194 501023 503155 505261 507468
58969 507468 510593 515167 520723 526599 532915 540091 547881 555689 563577 572052 580915 589069 595570 600339
58955 600339 603817 606391 608163 608951 608587 607499 606686 606649 606695 605899 604475 603406 602962 602521 601939 602100 603711
58938 603711 606272 608731 610591 611831 612250 611532 609866 607903 606062 604187 601973 599437 596872 594497 592368
58923 592368 590551 589207 588440 588214 588560 589781 592160 595496 599220 603095 607534 613058 619673 626998 634752
58908 634752 642779 650710 658019 664456 670187 675429 680096 683903 686712 688643 689780 689866 688448 685410 681187
58893 681187 676204 670338 663224 654985 646260 637583 629151 621168 613914 607350 601101 594937 588920 583085
58879 583085 577526 572868 569956 568760 568160 567160 565814 564618 563608 562572 561650 561164 561129 561378 561819 562165
58863 562165 561821 560526 558802 557337 556265 555453 555031 555109 555348 555433 555623 556302 557325 558465 560196 563316 567990
58846 567990 573787 580470 588010 595979 603677 610923 618106 625481 632960 640644 648909 657863 667194 676610
58832 676610 686086 695593 705090 714811 725167 736252 747697 758990 769669 779284 787541 794492 800360
58819 800360 805277 809346 812721 815323 816703 816513 814941 812437 809341 806088 803273 800989 798471 794910
58805 794910 790332 785242 779844 774177 768501 762726 755880 747029 736500 725417 714293 702970 691683
58792 691683 681086 671260 661684 652213 643167 634427 625455 616346 607840 600085 592404 584607 577508 571653
58778 571653 566431 561016 555412 550024 544906 540095 536046 533089 530888 529025 527700 527212 527135 526680 525726
58763 525726 524965 525117 526357 528374 530630 532660 534416 536219 538199 539994 541210 541929 542505 543037 543280 542987
58747 542987 542093 540695 538985 537079 534771 531584 527235 522095 517135 513345 510999 509375 507429 504917
58733 504917 502579 500988 499634 497668 495206 493265 492564 493173 495280 499397 505454 512377 519040 525299 531744
58718 531744 538710 545814 552294 557582 561680 565005 567739 569422 569437 567696 564577 560429 555643 550964 547026
58703 547026 543542 539558 534594 529041 523463 518113 513170 508815 504938 501362 498449 496857 496569 496788 496988
58688 496988 497438 498499 500043 501876 504178 507158 510714 514732 519262 524216 529324 534576 540199 546014
58674 546014 551401 556200 561094 566735 572856 578590 583299 586887 589634 591943 593947 595325 595897 596305 597540
58659 597540 599766 602326 604927 607942 611336 614245 616174 617839 620143 622817 624627 624483 621880 616797
58645 616797 609845 602121 594251 585697 575478 563335 549841 535721 521573 508102 495997 485479
58633 485479 476176 467468 458901 450422 442315 434817 427903 421650 416559 412971 410267 407320 403825 400558
58619 400558 398235 396766 395808 395337 395326 395506 395829 396635 398065 399780 401521 403412 405498 407678 410404 414707
58603 414707 420958 428137 434767 440160 444350 447360 449062 449350 448044 444942 440308 434936 429450 423967
58589 423967 418647 414000 410334 407419 405006 403194 401987 401053 400147 399206 397819 395380 392120 389216 387420
58574 387420 386295 385200 384302 384003 384167 384481 384950 385374 385033 383579 381708 380340 379700 379781 380981 383457 386374
58557 386374 388608 389840 390392 390552 390686 391465 393198 395390 397595 400163 403435 406764 409209 410753 412071
58542 412071 413505 415028 416826 419065 421428 423554 425637 427934 430188 432249 434747 438313 442583 446856
58528 446856 451271 456446 462349 468548 475256 483067 491831 500727 509394 518049 526605 534517 541518 547764
58514 547764 553353 558450 563754 570011 577168 584778 593185 603462 616083 630348 645223 660122 674888
58501 674888 689645 704757 720369 735847 750090 762381 772574 780589 786150 789000 789077 786640 782447
58488 782447 777432 771909 765449 757817 749455 740674 731025 720084 708213 695892 682887 668824 654047
58475 654047 639166 624397 610159 597614 587423 578478 569033 558893 549444 541748 535656 530572 525999
58462 525999 521404 516554 512001 508363 505235 501697 497838 494801 493312 492990 493115 493224 492926 491946 490467
58447 490467 488861 487170 485414 484155 483984 484628 485279 485596 485660 485265 484194 483033 482744 483482 484641 485982
58431 485982 487906 490641 493988 497850 502334 507376 512906 519227 526653 535052 544331 554873 566677 578500
58417 578500 588820 597353 604751 611199 616325 620094 622742 624013 623494 621489 618647 615017 610432 605418
58403 605418 600647 595960 591127 587144 585369 585654 586811 588718 592413 598069 604408 610358 615935 621182
58389 621182 625471 628165 628914 627200 622827 617023 611801 607837 603996 599283 594222 590042 587405 586224
58375 586224 585900 585494 584390 582952 581930 581477 581568 582916 586259 590920 595350 599083 602970 607464 611893
58360 611893 615539 618280 620027 620493 619625 617416 613597 608488 603756 600990 599689 597933 594805 590870 586680
58345 586680 582420 578791 576540 575129 573479 572008 572265 574531 577464 580202 583091 586243 589192 592197
58331 592197 596076 600442 603822 605896 607885 610408 612736 614606 616942 620142 623314 625858 628387 631557
58317 631557 635385 640006 645552 650984 654751 657054 659828 664087 668915 673381 677660 681837 685513 689167
58303 689167 694150 700754 707864 714846 721992 728864 734302 738536 743239 748908 754292 758878 763621 768560
58289 768560 772184 774177 776454 780360 785091 789987 796026 803640 811265 817706 824078 831885 840939 850550
58275 850550 861030 872588 884364 895901 907942 920545 932083 941419 949464 957406 965060 972049
58263 972049 978881 985716 991846 997445 1003994 1011930 1019893 1027322 1035543 1045128 1054562 1063020 1072138 1083352
58249 1083352 1095675 1107866 1120633 1134819 1149407 1163301 1177342 1192692 1208853 1224909 1241124
58238 1241124 1257835 1274453 1290847 1307897 1325534 1342367 1358468 1376096 1396349 1417649 1439050
58227 1439050 1462220 1488330 1515776 1543093 1571546 1602677 1635770 1669900 1705940 1744339 1783444
58216 1783444 1822256 1862390 1905174 1949359 1993836 2039848 2088303 2137831 2187892 2240832 2298334
58205 2298334 2358858 2421158 2487158 2558551 2633865 2711854 2794466 2883172 2975723 3070034 3168089
58194 3168089 3272376 3381724 3494512 3612943 3740175 3876085 4019675 4172782 4337566
58185 4337566 4513311 4699386 4898266 5111830 5338101 5575540 5826928 6094928 6377690
58176 6377690 6673305 6984626 7314956 7663006 8027048 8409982 8815090 9241078 9686781
58167 9686781 10156584 10655692 11184622 11744099 12340465 12979855 13661988 14386207 15158463
58158 15158463 15985448 16867369 17803883 18801338 19866485 20999424 22201297 23482446 24854319
58149 24854319 26320811 27887606 29572623 31397451 33378015 35536280 37912827 40556616
58141 40556616 43514505 46845922 50635872 54977497 59956931 65675367 72269604 79886430
58133 79886430 88652305 98691118 110149966 123189795 137998448 154815350 173721322
58126 173721322 194036044 213756043 229823739 239401807 241257555 236146548 226041396
58119 226041396 213033991 198703322 184027408 169512753 155355972 141630115 128437396
58112 128437396 115935693 104272025 93538324 83780736 75009209 67191371 60262761
58105 60262761 54151655 48785402 44081712 39955047 36333252 33156494 30364162 27896906
58097 27896906 25709218 23767398 22036914 20482804 19080180 17813243 16664990 15616938
58089 15616938 14656862 13777499 12968862 12219744 11524838 10882379 10286432 9728919 9207386
58080 9207386 8723356 8274538 7855563 7464721 7102901 6766952 6450521 6150540 5867111
58071 5867111 5598405 5341623 5097913 4870522 4658788 4458910 4269519 4091582 3923970
58062 3923970 3764110 3611913 3468468 3331962 3199425 3071226 2949515 2833628 2721485
58053 2721485 2613909 2512829 2416622 2321978 2229257 2141316 2058040 1976695 1896891 1820553 1747588
58042 1747588 1675950 1605608 1538372 1474255 1411880 1351883 1296056 1243749 1192961 1144387 1100524
58031 1100524 1061352 1024749 990641 960793 934855 910464 887048 865864 846522 827196 808123
58020 808123 791201 776107 760309 742996 725601 708400 690015 670527 651889 634897 618667
58009 618667 603183 589395 576717 563407 549625 537357 527142 517564 508002 499123 490690 481664
57997 481664 472527 464709 457667 449318 439516 430358 422886 416168 409792 404507 400114 395349 390184 385778
57983 385778 381957 377256 371699 366996 363666 360379 356402 352293 347968 342594 336666 331685 327445 322072
57969 322072 315143 308306 302421 296542 290202 284248 278802 272770 266116 260463 256702 253955 251435 249343
57955 249343 247392 244526 240747 237352 234870 232586 230435 229340 229218 228661 227121 225485 224043 221845 218645
57940 218645 215553 213180 210869 208328 206253 204871 203501 201900 200390 198543 195642 192607 191380 192101
57926 192101 192941 192999 193217 194073 194687 194756 195120 195755 195408 193945 192849 192672 192242 191217 191077 192489 193955 194342
57908 194342 194623 195759 196847 196855 196380 196156 195492 193740 191887 191144 191157 191048 190995 191398 191608 190885 189682 188731
57890 188731 187694 185875 183484 181247 179483 178382 178319 179121 179908 180401 181413 183347 185269 186289 186918 188249
57874 188249 190678 194156 198738 204113 209324 213633 217022 219499 220792 221004 220565 219221 216187 211590 206621
57859 206621 201952 197261 192525 188317 184465 180065 175315 171729 169892 168651 167278 166733 167833 169706
57845 169706 171136 172040 172692 172924 173049 174095 176094 177581 177855 178223 179780 181537 182238 182656 184373 187301
57829 187301 190035 191852 192880 193008 192088 190633 189108 187049 183951 180394 177228 174318 171159 168057 165594
57814 165594 163505 161082 158233 155340 152659 150534 149445 149035 147970 145635 143145 141911 142068 143162 145282
57799 145282 148384 151507 153888 156140 159234 163097 167271 172079 177831 183574 187943 190764 192691 193841
57785 193841 193958 193428 192910 192282 191032 189374 188021 187119 186258 185222 184023 182583 181014 179723 178656 177079
57769 177079 174703 172222 170116 167835 164992 162350 160602 159086 156870 154322 152412 151084 149549 147631
57755 147631 145698 143769 141793 140312 139713 139209 137589 134585 130662 126006 120683 115237 110162 105219 100179
57740 100179 95652 92279 89778 87749 86699 87098 88067 88263 87635 87172 87355 87949 88895 90308 91940 93599
57724 93599 95713 98575 101616 104348 107359 111304 115618 119374 122739 126341 129874 132738 135449 138883
57710 138883 142499 144823 145462 145320 145062 144716 144484 144504 143955 141798 138388 135107 132523 130130 127744 125764
57694 125764 124039 121866 119323 117419 116715 116780 117120 117665 118268 118647 118859 118979 118466 116784 114536 112927 112177
57677 112177 111481 110464 109648 109476 109877 110811 112353 114176 115810 117441 119703 122723 126034 129149 131590
57662 131590 132763 132672 132366 132809 133741 134502 135294 136495 137397 136996 135537 133952 132283 130131 128138 127228 126670
57645 126670 124721 121190 117676 115191 113251 111447 110088 108937 107012 104193 101552 99547 97281 94179
57631 94179 91069 88928 87672 86750 85908 84908 83528 82305 82261 83492 85047 86539 88779 92494 97554
57616 97554 103924 112191 122667 135024 149349 166529 187038 210322 235881 263906 294184 325076
57604 325076 353957 377797 393164 397103 389087 371556 348019 321207 293181 265903 240706 217772
57592 217772 196836 177983 161405 146920 134161 122824 112589 103301 95292 88933 83904 79557
57580 79557 75769 72564 69230 65030 60713 57921 56943 56352 55024 53168 51162 48827 46327 44373 42976
57565 42976 41271 39072 37295 36354 35486 34268 33382 33080 32285 30160 27412 25106 23245 21338 19351 17237
57549 17237 14642 11854 9985 9337 8766 7491 6290 5891 5490 4186 2680 2040 1703 273 -2305 -4886
57533 -4886 -6951 -8986 -11270 -13500 -15448 -17011 -17922 -18313 -19209 -21516 -24827 -28039 -30680 -32801 -34170
57518 -34170 -34612 -34794 -35602 -37014 -38490 -40059 -42104 -44387 -46365 -48207 -50513 -53194 -55621 -57746 -60108
57503 -60108 -62737 -65010 -66683 -68244 -70148 -72334 -74658 -77132 -79607 -81645 -82873 -83180 -82664 -81694 -80926
57488 -80926 -80879 -81557 -82637 -83842 -84906 -85551 -85748 -85824 -86073 -86583 -87504 -89051 -91112 -93350 -95768 -98507 -100996
57471 -100996 -102122 -101592 -100302 -99029 -97611 -95874 -94402 -93706 -93402 -92898 -92142 -91074 -89140 -86153 -82958
57456 -82958 -80518 -78897 -77760 -77066 -76575 -75535 -73749 -72153 -71413 -70733 -69123 -67127 -66100 -66321 -67046 -68009
57440 -68009 -69646 -72044 -74726 -77384 -79960 -82177 -83800 -85177 -86762 -88433 -89851 -91117 -92404 -93557
57426 -93557 -94800 -97096 -100773 -104511 -106943 -108696 -111484 -115528 -119323 -121815 -123442 -124976 -126688 -128900
57412 -128900 -132141 -136297 -140455 -143951 -146977 -149946 -152872 -155497 -157541 -158851 -159768 -161123 -163278 -165488
57398 -165488 -166858 -167559 -168337 -169199 -169572 -169473 -169424 -169331 -168594 -167420 -166955 -167855 -169530 -171039 -171998 -172459 -172626 -172910
57380 -172910 -173703 -174847 -175733 -175959 -175572 -174836 -174260 -174581 -176070 -177958 -179193 -179628 -179919 -180431 -180869 -180896 -180571 -180246
57362 -180246 -180511 -181951 -184523 -187482 -190345 -193437 -196941 -200111 -202244 -203845 -205853 -208199 -210188 -211870
57348 -211870 -213896 -216228 -218141 -219406 -220492 -221733 -223223 -225343 -228329 -231465 -233704 -235029 -236275 -237771
57334 -237771 -239136 -240202 -241118 -241766 -242096 -242867 -244763 -246928 -247686 -246809 -245872 -246212 -247666 -249457 -251122 -252317
57318 -252317 -252846 -253244 -254396 -256309 -258126 -259441 -260663 -262044 -263418 -265052 -267569 -270760 -273533 -275348 -276698
57303 -276698 -277940 -278782 -279351 -280636 -283245 -286498 -289268 -291076 -292094 -292814 -293945 -295854 -297804 -298541 -297858
57288 -297858 -296801 -296214 -295998 -295947 -296271 -296956 -297574 -298145 -299279 -301131 -303112 -305015 -307477 -310843 -314494 -317854
57272 -317854 -321294 -325393 -329953 -334277 -337975 -341079 -343847 -346723 -350034 -353580 -356979 -360381 -364145 -367933
57258 -367933 -370993 -373382 -375931 -378886 -381577 -383680 -385728 -388014 -389979 -391142 -391800 -392408 -393096 -394215 -396453
57243 -396453 -399901 -403696 -407009 -409780 -412188 -414252 -416285 -418967 -422429 -425949 -428968 -431838 -435191 -439121
57229 -439121 -443304 -447413 -451224 -454815 -458728 -463425 -468647 -473971 -479826 -487113 -495928 -505543 -515542 -525954
57215 -525954 -536333 -545822 -554132 -561461 -567500 -571662 -574192 -575815 -576411 -575502 -573885 -573025 -572670 -570871 -566788
57200 -566788 -561727 -556842 -551683 -545903 -540644 -537064 -534793 -532913 -531209 -529457 -526707 -522441 -517517 -512920
57186 -512920 -508403 -503187 -497101 -490163 -481889 -471836 -460121 -446835 -431854 -415742 -399807 -384645
57174 -384645 -369677 -354699 -340747 -328782 -318752 -310563 -304680 -300873 -297606 -293570 -288681 -282750 -274470
57161 -274470 -262768 -248048 -231114 -211918 -190384 -167338 -143558 -118921 -93484 -68383 -44656
57150 -44656 -22139 -478 19827 38320 55507 71846 86873 100323 113087 126043 138922 151305
57138 151305 163668 176461 189250 201776 214774 228655 242443 255092 266774 277825 287580 295401
57126 295401 301746 306993 310209 310334 307696 303282 297417 290155 282001 273259 263604 253053 242285 231255
57112 231255 218820 204552 189511 174407 158500 141240 123403 105658 87697 69778 53305
57101 53305 38689 24476 9729 -4691 -18457 -33194 -50130 -68419 -87395 -108308 -132171 -158097
57089 -158097 -185571 -216066 -250540 -287817 -327724 -373331 -427552 -489788 -558489 -634755 -720624
57078 -720624 -816062 -920704 -1036584 -1166072 -1308873 -1463953 -1632603 -1816682 -2015807 -2229259
57068 -2229259 -2458849 -2707079 -2974686 -3263047 -3576730 -3920451 -4295913 -4705007 -5153565
57059 -5153565 -5648321 -6192908 -6790867 -7449884 -8178800 -8983156 -9868193 -10843676 -11921350
57050 -11921350 -13110762 -14422627 -15873457 -17482162 -19266315 -21248607 -23464750 -25960190
57042 -25960190 -28784014 -31993785 -35663081 -39877665 -44729465 -50323229 -56784587 -64251998
57034 -64251998 -72864362 -82762844 -94091854 -106977169 -121499315 -137689298 -155527626
57027 -155527626 -174922728 -195708564 -217696766 -240692972 -264342051 -287860212 -309926780
57020 -309926780 -328915698 -343323397 -352105082 -354809121 -351593986 -343175326 -330645473
57013 -330645473 -315174827 -297751302 -279095804 -259723508 -240029527 -220337380 -200921589
57006 -200921589 -182015833 -163807944 -146442576 -130048184 -114763135 -100725643 -88036850
56999 -88036850 -76735845 -66800055 -58155162 -50686711 -44259103 -38736913 -33994891 -29917845
56991 -29917845 -26402775 -23363603 -20729248 -18436990 -16431474 -14668616 -13114754 -11741061
56983 -11741061 -10521655 -9435747 -8466852 -7599332 -6818487 -6113319 -5475870 -4898105 -4372137
56974 -4372137 -3892725 -3456461 -3058813 -2694363 -2359262 -2051051 -1766759 -1503362 -1259004
56965 -1259004 -1031569 -817472 -614603 -425133 -252337 -95394 49856 185948 312501 429279
56955 429279 537168 636085 724683 802491 870318 928650 977755 1019083 1054362 1083406 1104884
56944 1104884 1119078 1127819 1131821 1130214 1122740 1110328 1093313 1070905 1042589 1008459 968124 920918
56932 920918 867365 809160 747930 685460 624634 568221 516669 468679 423834 382949 345894
56921 345894 310996 276904 243513 210893 178835 147723 118415 91062 65305 41698 21372
56910 21372 4157 -11482 -26333 -39557 -50324 -58975 -66253 -72538 -78102 -82919 -85990 -86078 -83360 -79236
56896 -79236 -74383 -68385 -61547 -55577 -51877 -50293 -50070 -50815 -51931 -52368 -51837 -51445 -52258 -53812 -54601 -53472
56880 -53472 -50088 -44686 -37929 -30478 -22324 -12957 -2272 9402 22301 37222 54018 70735 84815
56867 84815 94662 99888 100899 98864 95413 91616 87463 82673 77524 72530 67819 63323 59160 55366
56853 55366 51593 47565 43606 40352 38050 36385 34875 33338 32189 32303 34276 37794 41990 46345 50780
56838 50780 55038 58714 62061 66054 71277 77286 83491 90165 98092 107520 117940 128718 139569 150527
56824 150527 161678 172768 182889 190684 195164 196346 195077 192387 189014 185365 181774 178796 177104
56811 177104 176959 178050 180174 183853 189734 197494 205987 214670 224348 236219 250510 266258 282135
56798 282135 297142 310619 321761 329300 331915 329325 322868 314724 306558 299089 292626 287436 283624
56785 283624 281225 280535 281977 285636 291412 299604 310831 325280 342536 362229 384343 408751 434852
56772 434852 461624 487357 509229 524015 529913 527478 518668 505429 489304 471627 453457 435620
56760 435620 419125 405109 394018 385304 378403 373618 371651 372720 376667 383574 393696 407062 423631
56747 423631 443448 465807 488231 506966 518689 521720 516063 503067 485076 464624 443544 422899
56735 422899 403552 386258 371177 357881 346101 336122 328304 322589 318723 316669 316565 318478 322433
56722 322433 328511 336687 346489 356760 365687 371272 372241 368681 361647 352124 340615 327651 314182
56709 314182 301118 288737 276861 265547 255296 246608 239549 233771 228876 224674 221093 217940 214941
56696 214941 212102 209757 208009 206269 203817 200763 197970 196013 194669 193596 192919 192802 192863 192491 191460
56681 191460 189923 188091 186296 185022 184400 183953 183313 182895 183249 184021 184301 183881 183343 182966 182383 181478 180746
56664 180746 180457 180283 180185 180854 182599 184433 185111 184692 184300 184584 185185 185665 186174 187031 188227 189581 191023
56647 191023 192449 193528 193899 193538 192861 192443 192499 192714 192778 193045 194198 196165 197911 198614 198486 198041 197173 195622
56629 195622 193888 192854 192702 192945 193304 193791 194053 193563 192527 191777 191609 191518 191236 191199 191670 192194 192411 192783
56611 192783 193918 195657 197369 198811 200129 201287 202054 202497 203044 203993 205241 206517 207756 209182 211009
56596 211009 213034 214669 215570 216020 216425 216656 216379 215829 215559 215434 214585 212596 210053 207736 205898 204617
56580 204617 204142 204419 204784 204647 204060 203282 202299 201214 200516 200358 200010 198721 196853 195544 195476 196530 198311
56563 198311 200338 201890 202350 201750 200510 198817 196849 195411 195543 197248 199209 200043 199466 198077 196491
56548 196491 195027 193932 193439 193526 193831 193935 193825 194003 194998 196699 198374 199411 199818 199876 199673 199227 198758 198456
56530 198456 198162 197693 197293 197356 197798 198183 198437 199006 200230 201878 203467 204760 205857 206961 208153 209317
56514 209317 210292 211184 212371 214044 215914 217647 219452 221894 225118 228576 231609 234091 236484 239462 243486
56499 243486 248505 253917 258912 262945 265878 267807 268942 269622 270247 271094 272197 273386 274441 275300 276179
56484 276179 277348 278738 279921 280557 280716 280668 280594 280637 280981 281558 281862 281396 280258 278992 277918 276836 275408
56467 275408 273574 271572 269707 268143 266770 265286 263525 261665 259965 258328 256390 254108 251965 250382
56453 250382 249046 247194 244623 242119 240675 240486 240962 241506 241855 241811 241356 241177 242287 244611 246546 246628 245225
56436 245225 243853 243135 242317 240645 238264 235697 233323 231553 230664 230142 228978 226994 225160 224238 223808 223151
56420 223151 222358 221948 221852 221534 220790 219916 219273 219103 219494 220143 220460 220248 219987 220114 220433 220593 220700 220954 221021
56401 221021 220393 219193 218151 217882 218437 219417 220278 220727 220972 221327 221529 221048 220183 220136 221579 223831 225940
56384 225940 227881 230008 231927 232823 232575 231775 230839 229755 228547 227355 226203 225171 224587 224592 224750 224594 224228
56367 224228 223942 223625 223169 223024 223644 224680 225422 225767 226074 226323 226229 226071 226582 227987 229756 231267 232234 232582
56349 232582 232483 232381 232528 232660 232623 232989 234369 236401 238171 239418 240554 241583 241902 241254 240140 239132 238373
56332 238373 237883 237764 237941 238048 237745 236971 235988 235379 235642 236492 236992 236787 236663 237325 238268 238660 238722 239163 239732
56313 239732 239566 238832 238703 239612 240657 240994 240826 240683 240659 240705 240974 241508 242143 242894 243862 244680 244796 244465 244751
56294 244751 246308 248690 251069 253063 254734 256294 257948 259555 260483 260363 259878 260106 261154 262183 262780
56279 262780 263394 264373 265462 266489 267736 269328 271002 272688 274643 276776 278602 280072 281690 283552 285059
56264 285059 285983 286969 288547 290288 291516 292323 293349 294957 297104 299664 302452 305173 307637 309853 311797
56249 311797 313411 314915 316811 319386 322501 325926 329586 333418 337246 340811 343734 345739 347268 349558
56235 349558 353520 358717 363951 368629 372929 377023 381033 385563 391299 398034 404911 411654 418811 426736
56221 426736 435129 443617 452054 460194 467853 475426 483546 492296 501470 511438 522786 535216 547786
56208 547786 560337 573674 588308 603988 620592 638482 657828 678527 700897 725523 752357
56197 752357 780981 811788 845775 883099 923055 965684 1012111 1062990 1117839 1176249 1238509
56186 1238509 1304581 1373611 1444894 1518047 1591740 1663512 1731555 1795509 1854823 1907512 1951392
56175 1951392 1985535 2009672 2023100 2025111 2015805 1995780 1965718 1926880 1881228 1830325 1774780 1715203
56163 1715203 1652896 1589109 1524599 1460457 1398317 1339004 1281866 1226188 1172386 1121177 1072602
56152 1072602 1026713 984244 945483 909271 874221 840448 809175 781037 755553 731907 709576
56141 709576 688509 669262 652595 638569 626422 615473 605557 596469 587894 580080 573550 567879 561918
56128 561918 555605 550333 546949 544641 542436 540476 538948 537106 534486 532018 530788 530555 530570 530993 532383
56113 532383 534555 537024 539922 543493 547303 550868 554480 558625 563241 568305 574337 581493 588923 595909
56099 595909 602868 610474 618694 627495 637499 648918 660790 672423 684801 699431 716539 735480
56087 735480 756188 779057 804059 831255 861669 896590 936444 981271 1031684 1088206 1150007
56076 1150007 1215111 1281329 1346158 1406417 1459235 1503371 1539093 1567325 1589506 1607556 1623046
56065 1623046 1636611 1648340 1657963 1664355 1666131 1663522 1658628 1652990 1645735 1634717 1618301 1595244 1564098
56052 1564098 1524103 1476078 1421709 1362780 1301672 1241412 1184312 1131413 1083670 1042299 1007270
56041 1007270 977016 950535 928325 910445 895415 882159 871247 862903 855594 848136 841512 836977
56029 836977 833943 831529 830630 832455 836311 840679 845309 850496 855609 860239 865588 872842 881309 889924
56015 889924 899263 910119 921404 931676 941649 952984 965516 977758 989357 1001093 1013231 1025758
56003 1025758 1039396 1054582 1070247 1085196 1099726 1114394 1128581 1141927 1155697 1170829 1186102
55992 1186102 1200235 1214238 1229665 1246165 1263005 1281359 1302600 1325783 1349267 1373392 1399183
55981 1399183 1426042 1453249 1482143 1514015 1547420 1580339 1613479 1648623 1685339 1722323 1760370
55970 1760370 1800914 1843066 1885335 1928793 1975375 2024535 2074805 2127107 2183198 2242455 2303696
55959 2303696 2368547 2439440 2515937 2596691 2683148 2777309 2877696 2981828 3091117 3208954
55949 3208954 3335559 3469180 3610729 3762448 3923470 4091638 4268388 4456946 4657049
55940 4657049 4866455 5086306 5319747 5566542 5824369 6094163 6378796 6677857 6989336
55931 6989336 7315006 7658350 8018759 8393962 8786722 9202858 9644237 10110423 10605593
55922 10605593 11136694 11706144 12313486 12962554 13659511 14405568 15199565 16045849 16951355
55913 16951355 17917238 18942552 20034023 21202879 22455092 23795675 25240172 26810815
55905 26810815 28524781 30399303 32466304 34770520 37359422 40291141 43646663 47515194
55897 47515194 51972924 57098667 63008318 69856462 77818812 87103322 97956710 110599569
55889 110599569 125140709 141561804 159661966 178744234 197180620 212438196 221926828
55882 221926828 224185611 219465399 209312810 195662857 180176417 164056319 148112993
55875 148112993 132859121 118599367 105514756 93702791 83179068 73893092 65764352
55868 65764352 58697771 52576398 47269529 42658626 38646051 35142987 32067134 29354263
55860 29354263 26957794 24834635 22941966 21246995 19727361 18360557 17122731 15997627
55852 15997627 14976306 14047421 13196653 12415479 11701048 11046902 10442205 9880402 9360313
55843 9360313 8878102 8426020 7999814 7600184 7226247 6874244 6543116 6234591 5947113
55834 5947113 5675868 5419316 5179812 4957473 4749269 4554426 4374836 4209612 4054911
55825 4054911 3909688 3776216 3654452 3541210 3435477 3339263 3252366 3171148 3093089 3017743
55815 3017743 2942651 2863282 2778078 2689244 2597832 2502478 2403596 2304255 2205897 2107407 2009370
55804 2009370 1915062 1826086 1740901 1658744 1581203 1508766 1439474 1372295 1308635 1249437 1193831
55793 1193831 1141565 1093832 1050915 1011804 976566 946145 919432 893690 868361 845390 825345
55782 825345 806416 787710 770310 754469 738898 723448 709391 696431 682628 667872 654272
55771 654272 642423 630523 617899 606066 595331 583752 570684 558183 547475 537042 525679
55760 525679 514605 504960 495816 486309 477446 470230 464101 458479 453791 449874 445555 440952 437965 437274
55746 437274 437092 436097 435402 436309 438270 440413 443049 446238 448776 450012 450901 451969 451988 449988 446809 443297
55730 443297 438660 432048 424300 416728 409489 402388 396038 391023 386997 383533 380699 378034 374353 369375
55716 369375 364269 359891 355989 352779 351602 353076 356122 359710 363894 368105 370208 368644 364220 358597
55702 358597 352243 344957 337096 329039 320484 311409 302705 294919 287410 279677 272406 266238 260595 254748
55688 254748 249122 244617 241484 239610 238970 239062 238882 238149 237613 237573 237195 235906 234212 232443 229925 226292
55672 226292 222511 219705 217872 216437 215018 213022 209690 205388 201748 199719 198460 196897 195224 194084
55658 194084 193407 192981 193179 194226 195624 197046 198884 201292 203741 206145 209221 212889 215534 215856 214441
55643 214441 212574 210506 207862 204708 201082 196340 190200 183850 178947 175922 173970 172222 170292 168314
55629 168314 167001 167085 168211 169138 169405 169841 170974 172039 172298 172295 172929 174195 175635 177182 178744 179718 179761
55612 179761 179367 179000 178394 177370 176554 176509 176845 176855 176401 175637 174599 173641 173463 174194 175217 176312 178040 180515
55594 180515 182813 184210 185019 185614 185697 185218 184936 185330 185858 185966 185833 185477 184265 182016 179399 176465 172107
55577 172107 166043 160011 155708 152635 149295 145591 142509 140187 137850 135319 133290 132238 132041 132495 133345
55562 133345 134035 134098 133540 132387 130379 127569 124637 122146 120154 118901 118865 119652 119975 119448 119275 120249 121241
55545 121241 120765 119046 117322 115933 114393 112732 111513 110893 110628 110539 110225 108955 106689 104546 103443 102993
55529 102993 102530 102342 102909 103761 104205 104435 104910 105305 105177 104974 105357 106190 107177 108740 111151 113541 114911
55512 114911 115491 116071 116766 117484 118733 120664 122101 121929 120798 120084 119860 119316 118561 118363 118549 118207 117237
55495 117237 116225 115090 113339 111470 110622 110878 111209 111046 110649 110042 108932 107681 107110 107241 107314 107058 106917
55478 106917 107055 107222 107565 108553 110079 111518 112577 113240 113136 111929 110160 108721 107704 106687 105780 105343
55462 105343 105007 104160 103103 102551 102218 101140 99248 97460 96306 95580 95124 94828 94069 92418 90679 90050
55446 90050 90421 90739 90667 90499 89784 87836 85542 84853 86145 87770 88558 89132 90201 91174 91304 90927 90657 90325
55428 90325 89494 88239 86872 85603 84883 85227 86342 87247 87592 88012 88884 89678 89887 89696 89340 88701 87940 87654
55410 87654 87946 88138 87826 87414 87283 87212 87021 86997 87244 87394 87330 87468 87956 88299 88150 87776 87395 86809 85993 85310
55390 85310 84817 84127 83271 82885 83172 83486 83381 83286 83665 84260 84685 85071 85596 85938 85764 85233 84599 83813 82925
55371 82925 82341 82276 82441 82645 83175 84150 84995 85033 84302 83495 83301 83971 85171 86148 86400 86212 86169 86331 86447 86743
55351 86743 87617 88598 88621 87548 86484 86265 86470 86290 85601 84815 84328 84421 85044 85432 84686 82991 81530 80930
55333 80930 80672 80253 79909 79734 79104 77701 76279 75677 75741 75955 76422 77384 78325 78456 77860 77382 77565 78225 78970
55314 78970 79583 80001 80234 80302 80143 79869 80082 81376 83285 84281 83241 80590 77796 76140 76108 77355 78849
55297 78849 79487 78989 78013 77360 77431 78391 80111 81800 82428 81872 81016 80502 80089 79520 79115 79050 78827 78168 77774
55278 77774 78463 80016 81523 82500 83068 83382 83512 83746 84448 85683 87173 88443 88911 88236 86821 85609 85147
55261 85147 85182 85287 85332 85182 84525 83343 82103 81206 80705 80662 81191 81946 82200 81723 80955 80097 78748 76793 74898
55242 74898 73692 73118 73021 73638 74970 76326 77048 77231 77299 77396 77616 78152 78796 78952 78572 78405 78875 79555 80249
55223 80249 81631 83969 86122 86869 86607 86626 87165 87296 86480 85172 83932 82830 81834 81110 80814 80960 81414
55206 81414 81675 81013 79303 77425 76369 76221 76459 76817 77314 77831 78297 78970 79967 80849 81271 81634 82462 83438
55188 83438 83826 83653 83764 84800 86637 88649 89992 89921 88452 86612 85497 85169 84912 84308 83597 83190 83342
55171 83342 84134 85307 86289 86648 86352 85430 83945 82534 82277 83479 85191 86459 87366 88220 88548 87848 86743
55154 86743 86325 86740 87302 87558 87346 86327 84560 83196 83449 85102 86918 88178 88759 88261 86478 84448
55138 84448 83545 83607 83427 83029 83687 85460 86542 85799 84315 83529 83267 82786 82461 83027 83981 84225 83874 84049
55120 84049 85095 86180 86614 86550 86289 85859 85476 85654 86509 87504 88168 88669 89399 90369 91283 91994 92586 93118 93511
55101 93511 93717 93852 94089 94382 94370 93707 92546 91541 91220 91430 91535 91133 90397 89715 89217 88856 88806 89385 90449
55082 90449 91149 90680 89231 87831 87182 87005 86710 86354 86563 87654 89246 90724 91803 92508 92852 92762 92373
55065 92373 92183 92630 93471 93811 93054 91605 90334 89490 88624 87516 86666 86729 87811 89449 90884 91388 90791
55048 90791 89766 89166 89048 88919 88813 89264 90109 90357 89711 89219 89726 90585 90749 90424 90645 91783 93394 95123
55030 95123 96696 97454 97024 96267 96466 97611 98474 98384 97903 97709 97801 98025 98417 98694 98285 97267 96586 96865 97573
55011 97573 97769 97199 96312 95688 95756 96652 97986 99044 99472 99482 99246 98557 97308 95923 94941 94421 94040 93622
54993 93622 93354 93555 94339 95407 96232 96549 96547 96386 95809 94635 93388 92861 93063 93229 92935 92659 93006 93858 94566
54974 94566 94718 94501 94491 95146 96345 97489 98238 98937 99957 100857 100819 99849 98863 98486 98342 97790 96795 95800 95136
54955 95136 94877 94975 95246 95432 95448 95448 95607 96051 96933 98249 99547 100248 100282 100146 100284 100735 101348 101920 102151 101950
54935 101950 101812 102394 103566 104400 104337 103877 103854 104415 105060 105364 105305 105049 104749 104500 104275 103967 103570 103300 103465
54916 103465 104239 105460 106530 106715 105812 104484 103703 103878 104707 105691 106472 106777 106470 105743 105004 104538 104389 104478
54898 104478 104662 104810 104978 105317 105645 105506 104884 104446 104627 104937 104694 104100 103889 104209 104577 104793 105185 106043 107422
54879 107422 109353 111612 113447 114275 114510 114964 115642 115993 116194 117113 118903 120698 121953 123146 124842 127010
54863 127010 129693 133483 138756 144999 151381 157409 162670 166592 168978 170306 171037 171005 169844 167606 164642
54848 164642 161221 157500 153542 149235 144613 140249 136794 134169 131895 130146 129547 129851 129900 129254 128813 129317
54832 129317 130220 130649 130506 129902 128521 126539 125389 126408 129171 132197 134944 138067 141925 145924 149453
54817 149453 152628 155880 159372 162991 166501 169617 172155 174007 174767 173682 170370 165423 159942 154648
54803 154648 149783 145511 141912 138697 135398 131815 128085 124483 121354 118994 117341 116037 114978 114417
54789 114417 114290 113872 112509 110344 108051 106261 105535 106265 108075 109741 110293 109905 109267 108521 107418 106140
54773 106140 105239 104940 104990 105037 104750 103805 102331 101133 100978 101751 102642 102925 102356 101265 100668 101716 104432 107387
54755 107387 109191 109859 110165 110301 110078 109902 110416 111340 111698 111177 110382 109830 109612 110000 111303 112907 113509 112738
54737 112738 111719 111567 112054 112290 112049 111774 111705 111708 111812 112305 113264 114325 115028 115237 115204 115279 115601 116101 116784 117805
54717 117805 119094 120167 120618 120743 121364 123073 125863 129419 133428 137656 142032 146698 151760 157015 162100
54702 162100 166834 171186 174910 177477 178403 177559 175224 171926 168089 163797 159132 154658 151091 148351 145557
54687 145557 142297 139297 137324 135969 134238 131963 129894 128663 128379 129037 130465 131876 132309 131711 131027
54672 131027 131121 132055 133439 134918 136286 137632 139423 141968 144856 147455 149929 153046 156929 160731 163729
54657 163729 166055 168013 169319 169477 168421 166333 163153 158853 154015 149646 146267 143422 140231 136409
54643 136409 132605 129617 127438 125417 123370 121921 121467 121386 120849 119945 119257 118705 117696 116304 115367 115310 115657
54626 115657 115856 115851 115686 115264 114738 114504 114464 114004 112954 111971 111578 111444 111061 110623 110716 111463 112407 112968 112771 111820
54606 111820 110648 109974 109950 110128 110266 110657 111365 111765 111320 110364 109590 109167 108893 108900 109508 110549 111425 111800 111809 111634
54586 111634 111364 111254 111675 112623 113607 114129 114109 113785 113423 113150 112949 112718 112375 111937 111470 111029 110638 110229 109631
54567 109631 108843 108310 108656 109943 111393 112061 111764 111199 111203 111952 112859 113204 112866 112357 112105 111950 111502 110695 109594
54548 109594 107967 105699 103548 102728 103556 105080 106327 107297 108436 109726 110876 111946 113113 114074 114276
54533 114276 113711 113000 112709 112900 113311 113656 113790 113821 114017 114439 114837 115060 115281 115532 115391 114647 113964 114230 115345
54514 115345 116316 116571 116556 116827 117218 117285 117080 117062 117523 118545 120186 122194 123715 123925 123055 122323 122634 123661
54496 123661 124408 124367 123865 123512 123643 124181 124758 125021 125066 125461 126598 128136 129486 130719 132428 134650 136568
54479 136568 137565 137991 138380 138417 137431 135710 134508 134647 135713 136790 137439 137687 137511 136737 135262 133158 130757
54462 130757 128760 127933 128364 129191 129356 128590 127505 126884 127064 127899 128965 129683 129489 128166 126115 124225 123253
54445 123253 123227 123534 123651 123598 123572 123429 122974 122643 123414 125776 129064 131953 133502 133694 133231 132988 133429 134364
54427 134364 135342 136321 137717 139708 141759 143154 143842 144431 145346 146273 146633 146380 146097 146268 146707 146869 146610
54410 146610 146397 146788 147898 149456 151140 152741 154176 155503 156764 157753 158169 158111 158127 158514 158846 158490 157398
54393 157398 156072 154913 153974 153216 152585 151908 151062 150210 149595 149115 148404 147276 145827 144247 142845 142061 142024
54376 142024 142165 141760 140779 139866 139486 139565 139876 140306 140686 140843 140866 140934 140894 140465 139862 139643 139887 140046 139794 139508
54356 139508 139709 140461 141509 142588 143436 143928 144367 145197 146221 146587 145852 144667 144135 144761 146218 147787 148788
54339 148788 148933 148534 148123 147783 147155 146190 145401 145206 145500 146105 147107 148412 149444 149714 149382 148910 148436 147847
54321 147847 147222 146887 147163 148156 149503 150318 149932 148835 148320 148922 149883 150479 151147 152678 154884 156862 158198
54304 158198 159144 159869 160318 160727 161545 162773 163927 164701 165245 165804 166465 167199 167761 167636 166521 164806 163142
54287 163142 161586 159581 156777 153482 150293 147687 145900 144845 144108 143303 142432 141598 140618 139362 138319
54272 138319 138169 138783 139300 139293 139222 139440 139470 138806 137950 137922 138850 139740 139758 139219 139050 139594 140261 140254 139321 137849 136397
54251 136397 135277 134451 133788 133384 133509 134146 134745 134731 134162 133515 132876 131863 130521 129610 129577 129791 129480 129007
54233 129007 129350 130506 131392 131420 131266 131755 132777 133717 134333 134669 134662 134309 133906 133658 133405 133118 133224 133908 134464
54214 134464 133942 132347 130617 129530 129059 128826 128713 128884 129434 130172 130770 131155 131674 132689 134038 135189 135972
54197 135972 136809 138135 139914 141837 143587 144822 145243 144895 144101 143061 141874 140925 140602 140578 140053 138935
54181 138935 138057 137985 138349 138723 139286 140016 140085 138931 137339 136581 136902 137674 138605 139804 140904 141139 140343 139157
54163 139157 138145 137334 136634 136158 136041 136267 136635 136713 136130 135233 134987 135753 136643 136731 136364 136427 136728 136183 134512
54144 134512 132759 131995 132261 132917 133370 133350 133109 133462 134994 137140 138581 138621 137708 136578 135473 134323 133213
54127 133213 132473 132557 133747 135694 137440 138313 138577 138848 139260 139707 140365 141249 141696 141195 140410 140365 140961 141326
54109 141326 141400 141884 142717 142981 142473 142012 141893 141408 140421 140013 140756 141528 141062 139709 138611 137911 136988 135965
54091 135965 135654 136169 136675 136651 136540 136917 137663 138285 138621 138948 139497 140084 140258 139803 139030 138390 137884 137169 136172
54072 136172 135242 134627 134176 133689 133233 132986 133104 133750 134916 136175 136993 137324 137477 137475 137101 136610 136716 137656 138826
54053 138826 139610 140025 140352 140676 141052 141659 142517 143458 144536 145963 147547 148835 149943 151544 153755 155788
54037 155788 157060 157870 158570 158919 158918 159502 161484 164238 166267 166843 166407 165588 164540 163168 161428 159444 157662
54020 157662 156773 157131 158396 159971 161521 162915 164048 165023 166065 166979 167255 167014 167227 168469 170114 171417
54004 171417 172742 174824 177327 179191 180165 180991 182051 182773 182577 181678 180716 180115 179974 180130 180213 180012 179855
53987 179855 180252 181256 182611 184442 187193 190778 194425 197576 200531 203985 208228 213088 218341 223868
53973 223868 229511 234989 240036 244572 248768 252895 257098 261310 265262 268462 270327 270771 270642 271083 272322
53958 272322 273526 274010 274041 274157 274290 274077 273551 272933 272058 270545 268280 265261 261286 256355 251112 246238
53942 246238 241624 236766 231765 227344 223965 221574 220023 219071 218029 216164 213568 211019 208938 207053
53928 207053 205176 203654 202798 202354 201823 200945 199742 198401 197199 196196 195028 193362 191530 190259 189760
53913 189760 189588 189416 189430 189868 190694 191893 193578 195586 197404 198723 199709 200622 201593 202936 205214 208654
53897 208654 212879 217395 222051 226879 231944 237601 244356 252037 259392 264980 268227 269395 268887 267111
53883 267111 264772 262704 261314 260551 260408 261062 262471 264220 265990 267970 270584 273893 277378 280366 282551
53868 282551 284173 285731 287568 289669 291841 294109 296941 300934 306129 311727 316734 320904 324858 329262
53854 329262 334202 339487 345175 351442 358098 364629 370715 376426 381907 387065 391576 395043 397204 398136
53840 398136 398142 397377 395752 393404 390965 389029 387438 385397 382197 377599 371766 365269 359000 353526 348430
53825 348430 342690 335858 328545 321687 315598 309829 303702 296908 289871 283598 278934 275819 273381 270737
53811 270737 267573 264050 260469 257062 253840 250581 247119 243599 240280 237188 234172 231096 227696 223578
53797 223578 218901 214854 212716 212370 212366 211619 210387 209371 208564 207476 205955 204151 202012 199417 196742 194748
53781 194748 193863 193874 194269 194641 194799 194817 194960 195321 195562 195306 194824 195007 196390 198371 199657 199479 198211 196785
53763 196785 195741 195093 194900 195472 196873 198637 200287 201896 203738 205608 206950 207626 208134 209024 210458 212405
53747 212405 214827 217571 220419 223449 227025 231299 236000 240818 245672 250417 254685 258329 261764 265501
53733 265501 269533 273474 277150 280681 284086 287161 289741 291825 293407 294447 295041 295337 295198 294180 292073
53718 292073 289326 286678 284385 282024 279093 275560 271657 267360 262464 257112 251872 247154 242896 238989
53704 238989 235619 232870 230343 227650 225056 223123 221786 220378 218582 216774 215293 213895 212242 210444
53690 210444 208759 207090 205235 203420 202156 201637 201556 201443 200863 199461 197275 195040 193753 193694 194110 194087 193524
53673 193524 192986 192752 192466 191795 191103 191162 192258 193890 195349 196329 196956 197476 198074 198839 199678 200372 200873 201473
53655 201473 202509 203964 205522 207010 208625 210649 213006 215155 216496 216973 217212 217942 219296 220838 222213
53640 222213 223489 224848 226307 227849 229534 231326 233142 235188 237888 241223 244524 247162 249088 250431
53626 250431 251032 250819 250249 249836 249481 248756 247598 246230 244722 243215 242346 242704 243912 244878 244994 244560 244132
53609 244132 244056 244564 245617 246580 246729 246187 245751 245665 245243 243902 241967 240205 239143 239079 240145 241918 243494
53592 243494 244332 244730 245133 245435 245314 244913 244753 245150 246047 247212 248391 249441 250481 251725 253042 253994 254462
53575 254462 254889 255742 257022 258489 260009 261423 262407 262824 263104 264039 266201 269516 273220 276297 278311 279817
53559 279817 281692 284108 286570 288789 290967 293273 295662 298295 301403 304627 307168 308888 310577 312822
53545 312822 315308 317601 319922 322586 325302 327572 329380 330984 332512 334214 336575 339559 342240 343778
53531 343778 344403 344835 345123 344778 343747 342559 341657 341139 340983 340969 340584 339566 338370 337596 337157 336582 335874 335423
53513 335423 335209 334712 333576 331809 329430 326549 323781 321989 321536 322120 323258 324454 325067 324645 323451 322242
53497 322242 321522 321384 321859 322889 324057 325007 326081 327913 330375 332577 334008 335084 336403 338052 339888
53482 339888 341994 344545 347519 350767 354156 357565 361031 364915 369549 374768 380177 385807 392014 398809
53468 398809 405945 413756 423139 434313 446202 457489 467909 478096 488577 499399 510479 521824
53456 521824 533498 545721 558878 573197 588467 604355 620869 638280 656670 675764 695158
53445 695158 714554 733798 752816 771464 789422 806454 822828 839277 856287 873584 890522
53434 890522 906848 922837 938755 954471 969759 984777 1000026 1015740 1031384 1045918 1058709
53423 1058709 1070180 1081474 1093473 1106125 1118676 1130397 1141102 1151107 1160791 1170167 1178832 1186250
53411 1186250 1192007 1195832 1197611 1197508 1195993 1193480 1189937 1184961 1178292 1170146 1161012 1151179 1140567 1129037
53397 1129037 1116794 1104269 1091523 1078041 1063405 1048019 1032730 1017786 1002671 987070 971463
53386 971463 956510 942284 928432 914755 901278 888173 875993 865611 857440 850945 845401 840843
53374 840843 837769 836166 835488 835481 836339 838058 840321 843223 847445 853316 860133 866900 873659 881691 892345
53359 892345 905838 921272 937678 954787 972715 991329 1010437 1030454 1052097 1075241 1098818
53348 1098818 1122326 1146804 1173635 1202827 1233158 1263675 1294322 1325421 1357405 1390930 1426399
53337 1426399 1463363 1501063 1539513 1579223 1619914 1660469 1700360 1740255 1780895 1822105 1863236
53326 1863236 1903843 1943486 1981577 2017929 2052944 2086759 2118685 2147994 2174786 2199512 2221982
53315 2221982 2241440 2257472 2270375 2280774 2289171 2295628 2299440 2299264 2293984 2283488 2268382 2249104
53303 2249104 2225625 2197958 2166643 2132623 2096728 2059274 2020186 1979531 1937807 1895565 1852968
53292 1852968 1810117 1767683 1726685 1687547 1649792 1612788 1576310 1540226 1504233 1468339 1433217
53281 1433217 1399642 1367710 1336867 1306528 1276498 1247096 1219116 1193512 1170797 1150750 1132723
53270 1132723 1116073 1100379 1085645 1072345 1060838 1050606 1040497 1029908 1019370 1009782 1001483 994245
53258 994245 987654 981251 974724 968338 962813 958537 955301 953023 952137 952808 954346 956000 957990 961138 965803
53243 965803 971790 978999 987483 996945 1006897 1017345 1028795 1041478 1055025 1069011 1083487 1098848
53231 1098848 1115421 1133215 1151859 1170762 1189448 1207658 1225030 1240964 1255114 1267855 1279836
53220 1279836 1291149 1301228 1309551 1316130 1321262 1325006 1326981 1326648 1323868 1319130 1313038 1305612 1296423 1285417
53206 1285417 1273043 1259407 1243923 1226273 1207184 1187603 1167438 1145784 1122288 1097718 1073200
53195 1073200 1049328 1025948 1002425 978186 953363 928769 904938 881484 857832 834267 811628
53184 811628 790167 769391 748958 728977 709405 689897 670539 652099 635199 619609 604659
53173 604659 589986 575665 561899 548844 536554 524920 513792 503226 493439 484506 476305 468711
53161 468711 461585 454596 447314 439523 431237 422547 413665 404948 396534 388153 379758 372039 365672 360188
53147 360188 354381 347907 341697 336513 331821 326540 320329 313698 307312 301646 296943 292935 288790 283798
53133 283798 278022 272053 266370 261250 257024 253927 251705 249718 247444 244823 242197 240014 238349 236628
53119 236628 234081 230693 227368 224899 223085 221236 219246 217665 216775 216153 215287 214316 213903 214438 215456 215929
53103 215929 215260 213949 213005 212691 212239 210973 209246 207902 207206 206818 206534 206370 206039 205051 203536 202376 202228
53086 202228 202770 203183 203069 202667 202425 202690 203557 204746 205722 206159 206183 206025 205671 205116 204745 205068 206116 207440
53068 207440 208676 209782 210705 211253 211463 211792 212634 213894 215266 216730 218446 220321 222047 223515 224799
53053 224799 225737 225961 225462 224684 223853 222601 220633 218452 216947 216393 216277 216060 215628 215010 214113 212920 211592
53036 211592 210224 208774 207402 206522 206248 206086 205551 204890 204788 205391 205991 205761 204543 202880 201474 200675 200327
53019 200327 199931 199076 197722 196090 194439 193125 192724 193622 195373 196861 197390 197286 197143 196799 195599 193546
53003 193546 191519 190164 189129 187778 186240 185222 185004 185229 185652 186431 187483 188102 187706 186729 186313 187156
52987 187156 189014 191262 193499 195469 196769 197002 196223 194972 193830 193026 192484 192122 191981 192128 192559 193203
52971 193203 193918 194472 194694 194753 195109 195989 196946 197220 196503 195199 193920 193013 192594 192610 192660 192111 190770 189319
52953 189319 188687 189072 189892 190652 191428 192388 193242 193514 193184 192772 192724 192932 192921 192464 191854 191581 191897 192820 194401
52934 194401 196603 198874 200235 200141 199066 197943 197245 196913 196999 197790 199204 200577 201325 201541 201749 202311 203253
52917 203253 204406 205464 206122 206466 207017 208088 209204 209496 208622 207022 205269 203541 201827 200298 199242
52902 199242 198741 198626 198704 198972 199598 200733 202226 203546 204124 203858 203166 202491 201921 201380 200943 200738 200676 200527
52884 200527 200244 199944 199601 199028 198238 197561 197217 196945 196256 194995 193460 192042 190892 189962 189227 188761 188597
52867 188597 188572 188482 188443 188887 189914 190769 190420 188825 187235 186980 188212 190014 191447 192154 192332 192560 193450 194946
52849 194946 196121 196148 195339 194705 194638 194717 194719 194946 195374 195317 194420 193324 192837 192989 193417 194126 195157 195969 195945 195351
52829 195351 195103 195662 196727 197859 198774 199110 198678 197992 197842 198232 198399 198016 197630 197623 197536 196964 196469 196879 198141
52810 198141 199598 201194 203525 206691 209829 212023 213143 213524 213319 212529 211401 210348 209587 209073 208622 207874
52794 207874 206408 204238 202026 200330 198753 196422 193328 190579 189010 188211 187381 186646 186727 187607 188356 188331
52778 188331 187822 187284 186624 185574 184235 182882 181620 180608 180251 180728 181637 182497 183333 184317 185130 185197 184459
52761 184459 183477 182805 182651 183006 183717 184480 185154 185984 187176 188363 189015 189321 190109 191786 193804 195343 196045
52744 196045 195841 194570 192243 189463 187134 185672 184780 183996 183232 182695 182491 182528 182740 183151 183603 183680 183204 182626
52726 182626 182488 182489 181608 179435 176902 175325 175027 175323 175567 175683 175809 175983 176234 176611 177057 177556 178352 179673
52708 179673 181312 182776 183805 184405 184488 183988 183326 183240 183949 184846 185216 185015 184768 184889 185262 185407 185050 184540
52690 184540 184564 185386 186623 187917 189446 191379 193195 194139 194185 194009 194123 194583 195368 196401 197201 197238 196751 196608
52672 196608 197231 198162 198800 199038 199115 199381 200220 201566 202475 201932 200248 198848 198470 198434 197961 197208 196497 195501
52654 195501 194045 192938 193017 193849 194284 193927 193209 192379 191406 190718 190972 192004 192807 192718 191960 190971 189924 189127
52636 189127 189129 189988 190919 191109 190596 190001 189707 189698 190006 190857 192228 193546 194072 193620 192714 191958 191381 190674 189961
52617 189961 189910 190926 192545 193866 194349 194083 193582 193509 194209 195206 195543 195027 194763 195924 198285 200530 201794
52600 201794 202267 202411 202342 202110 201944 201932 201895 201846 202219 203399 205267 207365 209240 210484 210793 210261 209464 208966
52582 208966 208873 208938 208942 208816 208538 208171 207897 207825 207764 207315 206243 204711 203210 202309 202446 203732 205784 207737 208690
52563 208690 208397 207511 206940 206896 206830 206281 205516 205120 205243 205485 205418 204926 204110 203132 202162 201329 200724 200481 200760 201570
52543 201570 202717 204025 205422 206723 207529 207564 206953 205973 204716 203217 201755 200735 200323 200406 200813 201395 202011
52526 202011 202667 203586 204943 206631 208395 210014 211153 211355 210564 209471 208943 209154 209568 209665 209312 208518 207310
52509 207310 205972 205044 204911 205496 206329 206797 206485 205516 204464 203683 202881 201706 200559 200306 201219 202664 203887
52492 203887 204654 205007 204961 204712 204699 205097 205528 205595 205475 205655 206263 207001 207641 208253 208990 209940 211181 212663 213953
52473 213953 214403 213768 212478 211115 209781 208257 206665 205531 205077 204870 204459 204097 204413 205547 207040 208524
52457 208524 210019 211533 212875 214031 215261 216637 217862 218801 219733 220832 221794 222320 222563 222738 222719 222485
52441 222485 222546 223317 224314 224504 223373 221197 218577 216255 215056 215206 215709 215167 213347 211328 210050 209382
52425 209382 208811 208393 208590 209627 211373 213515 215502 216668 216777 216337 216087 216312 216802 217299 217718 218043 218267
52408 218267 218476 218915 219868 221315 222743 223550 223808 224364 225874 227962 229760 231035 232200 233283 233640 232906
52392 232906 231638 230574 229651 228227 226075 223686 221591 219733 217741 215666 214141 213665 213931 214206 214320
52377 214320 214718 215489 215960 215742 215504 216002 216776 216721 215722 214778 214511 214543 214535 214856 215759 216752 217367 217974 219172 220848
52357 220848 222390 223499 224264 224759 225125 225871 227551 230183 233303 236490 239527 242256 244665 247104 250076
52342 250076 253721 257615 261035 263360 264348 264167 263136 261490 259474 257533 256034 254873 253692 252507 251659
52327 251659 251179 250728 250240 250040 250088 249778 248822 247782 247350 247572 248211 249280 250671 251721 251944 251906 252667 254457
52309 254457 256595 258654 260982 263906 266989 269403 270808 271620 272547 273936 275501 276656 277134 277189 277250 277661
52293 277661 278734 280562 282492 283297 282411 280777 279999 280817 282777 285103 287313 289133 290524 291896 293837
52278 293837 296515 299675 303178 307089 311235 315243 319207 323842 329686 336417 343207 349503 355327 361142
52264 361142 367576 375039 383305 391678 399774 407968 416794 426112 435247 443902 452530 461645 471057 480123
52250 480123 488623 497082 506167 516018 526306 536701 547099 557503 567957 578507 589007 599069
52238 599069 608482 617586 626821 635905 643889 650189 655153 659413 663100 666027 668332 670482 672699 674669
52224 674669 675791 675533 673694 670623 667165 664204 662190 661140 660900 661284 662091 663150 664345 665588 666973
52209 666973 668930 671941 675934 680244 684348 688368 692700 697436 702423 707630 713126 718892 724970 731672
52195 731672 739350 747961 757038 765987 774348 781971 789033 795689 801717 806838 811421 816290 821534 826021
52181 826021 828509 828835 827656 825598 823271 821515 820702 819948 817899 814303 810099 805983 801805 797555 794070
52166 794070 792103 791191 790077 788056 785501 783164 781364 779912 778515 777101 775817 774897 774590 775107 776475
52151 776475 778372 780304 781987 783498 785091 787093 789833 793236 796468 798569 799616 800689 802459 804534
52137 804534 806698 809925 815191 821728 827578 831747 834820 837480 839462 840336 840444 840495 840728 840886 840682 839985
52121 839985 838822 837325 835428 832563 828187 822710 817377 813008 809231 805218 800782 796553 793416 791940
52107 791940 791947 792401 792106 790831 789459 788901 789175 789713 790175 790619 791192 791995 793035 794079 794763 795011 795108 795219
52089 795219 795184 795024 795220 796134 797407 798388 798984 799635 800556 801403 801842 802125 802874 804334 806039 807337 808211 809409
52071 809409 811696 815146 819281 823690 828278 833161 838674 845317 853324 862417 872330 883314 895582 908494
52057 908494 921043 933090 945375 958235 971150 983689 996065 1008334 1019870 1030129 1039288 1047644
52045 1047644 1055050 1061555 1067937 1074857 1081938 1088484 1094614 1100878 1107042 1112205 1115998 1118736 1120410 1120386
52031 1120386 1118319 1114623 1109814 1103991 1097223 1089944 1082633 1075486 1068538 1061757 1054897 1047720 1040502 1033915
52017 1033915 1028247 1023173 1018470 1014407 1011141 1008301 1005709 1004092 1004365 1006340 1008813 1010929 1012914 1015322
52003 1015322 1018199 1021361 1025057 1029730 1035206 1040700 1045827 1051214 1057750 1065355 1072839 1078996 1083553 1086968
51989 1086968 1089566 1091151 1091368 1090144 1087632 1083888 1078836 1072615 1065805 1059105 1052756 1046401 1039600 1032358
51975 1032358 1025044 1017913 1010816 1003382 995386 987079 979199 972435 966634 960670 953367 944552 935081 926031
51961 926031 918075 911282 905019 898233 890459 882540 875764 870234 864788 858627 852176 845972 839556 832180
51947 832180 823943 815341 806110 795472 783386 770614 757508 743691 729153 714838 701686 689660
51935 689660 678189 667077 656472 646274 636146 625945 615740 605474 594997 584343 573651
51924 573651 562904 552068 541390 531121 520983 510447 499651 489612 481138 473903 466989 460090
51912 460090 453743 448459 444232 440964 438852 438007 438054 438484 439225 440587 442773 445771 449474 453502 456990
51897 456990 459091 459786 459814 459661 458968 457157 454352 451393 449130 447928 447709 448208 449211 450736 453084 456644
51881 456644 461618 467892 475128 483043 491694 501380 512162 523641 535403 547447 559801 571897 582924
51868 582924 592845 602452 612116 620965 627621 631314 631825 628689 621126 608830 592498 573583 553671
51855 553671 533988 515135 497229 480421 465210 452106 441108 431762 423698 416928 411577 407446
51843 407446 403953 400588 397455 395174 394024 393320 392068 390099 388018 385969 383134 378815 373461 368144
51829 368144 363407 359090 354919 350760 346649 343107 341123 341176 342423 343535 344178 345012 346416 348087 350001
51814 350001 352848 357054 361970 366536 370359 373623 376230 377584 377207 375294 372616 370051 368109 366759
51800 366759 365650 364539 363484 362724 362500 362915 363718 364258 363951 362854 361539 360285 358653 356014 352323 348244
51784 348244 344603 341771 339475 337126 334376 331418 328652 326201 323851 321388 318832 316406 314500 313557
51770 313557 313720 314604 315669 316780 318148 319765 321249 322292 322938 323263 323111 322315 321052 319833 319182 319298
51754 319298 319883 320355 320437 320485 321013 322003 322975 323628 323973 323880 323012 321404 319666 318431 317924 318209 319383 321232
51736 321232 323073 324328 325018 325431 325581 325317 324720 324022 323230 322190 320887 319478 318145 317133 316749 317060
51720 317060 317732 318394 318957 319371 319411 319098 319099 320173 322301 324832 327401 330214 333458 337050 341089 345945 351550
51703 351550 357034 361454 364547 366496 367290 366783 365117 362582 359200 354901 350110 345638 341881 338493 334938
51688 334938 331042 326927 322865 319406 317186 316235 315812 315296 314988 315596 317204 319320 321762 324799 328381
51673 328381 331979 335413 339149 343370 347293 349965 351341 352086 352679 353389 354826 357642 361537 365172 367307
51658 367307 367689 366828 365364 363798 362302 360570 358252 355743 354114 353891 354246 353811 352075 349664 347409
51643 347409 345595 344146 343147 342895 343480 344435 344984 344687 343730 342486 341024 339382 338068 337689 337959 337711 336187
51626 336187 333899 331845 330298 328796 326968 324836 322498 320111 318063 316675 315836 315376 315690 317298 319829
51611 319829 322126 323660 325227 327904 331836 336528 341918 348439 356104 364055 371119 376469 379724 380821
51597 380821 380004 377728 374364 370079 365111 360038 355603 352316 350322 349591 350037 351244 352180 351510 348600
51582 348600 344228 340021 336979 334713 332233 329188 326005 323081 320383 317882 315821 314337 313261 312598
51568 312598 312813 314135 315854 316852 316806 316366 316172 316190 316112 315851 315386 314491 313017 311226 309521 307999 306479
51551 306479 304836 303117 301487 300251 299700 299732 299839 299730 299716 300191 300974 301650 302348 303701 306051 309225 313092
51534 313092 317802 323311 329119 334726 340008 344902 349055 351986 353408 353272 351864 350045 348970 349115 349851
51519 349851 350354 350798 352203 355267 359810 365329 371550 378247 385000 391531 398117 405259 412922 420367 426843
51504 426843 432341 437509 442968 448929 455586 463591 473799 486457 500858 515917 530895 545370 558655
51491 558655 569623 577312 581542 582830 581710 578295 572526 564604 554943 543734 530908 516688 501930
51478 501930 487610 474148 461579 450266 440815 433139 426220 419224 412564 407359 404066 402130 400797
51465 400797 399678 398434 396534 393621 389765 385147 379819 374049 368500 363683 359491 355596 352006 348770
51451 348770 345422 341460 337295 333966 331698 329430 326192 322367 319063 316705 314909 313457 312610 312446 312544
51436 312544 312502 312300 312021 311649 311318 311367 311890 312531 312856 312710 312142 311303 310476 309826 309055 307727 306019 304628
51418 304628 303827 303156 302291 301519 301002 300241 298902 297593 297074 297088 296774 295897 294866 293746 292224 290535 289470
51401 289470 289237 289078 288331 287242 286390 285855 285370 284888 284626 284772 285398 286469 287803 289254 290993 293339 296308
51384 296308 299676 303488 308131 313823 320302 326995 333109 337693 340238 341303 342065 343174 344495 345767
51370 345767 346775 346896 345503 343105 341207 340494 339966 338402 335928 333482 331395 329359 327304 325488 323920
51355 323920 322417 321063 320029 319218 318605 318610 319418 320248 320026 318684 317163 316238 316012 316462 317715 319697 322029
51338 322029 324433 326836 329117 331188 333315 335953 339284 343234 347764 352733 357701 362424 367374 373251
51324 373251 380145 387786 396386 406525 418374 431790 447071 464719 484411 505110 526307 548190
51312 548190 570259 590727 607857 621248 631357 638370 642028 641997 637867 629300 616701 601277 583958
51299 583958 564788 543863 522243 501220 481090 461472 442474 424737 408476 393362 379395
51288 379395 367136 356867 348074 339985 332212 324740 317712 311424 306168 301893 298210 294889 292169 290513
51274 290513 290204 291136 292727 294067 294453 293888 292859 291736 290660 289950 290104 291178 292516 293360 293500 293163
51258 293163 292563 291816 291081 290441 289737 288811 287857 287247 287008 286784 286368 285989 285858 285630 284646 282738 280569 279100
51240 279100 278768 279235 279810 280030 279872 279540 279108 278387 277165 275533 273847 272402 271317 270824 271318 272881 274919
51223 274919 276657 278014 279635 282050 285067 288106 290758 292847 294250 295056 295786 297075 299072 301291 303056
51208 303056 304066 304601 305310 306751 308943 311351 313362 314733 315567 315934 315662 314439 312068 308721 305018
51193 305018 301731 299225 297264 295400 293474 291639 290065 288796 287768 286818 285793 284775 284013 283406 282386
51178 282386 280666 278915 278155 278507 279086 279191 279056 279215 279676 280165 280806 281970 283571 284996 285783 286083 286386
51161 286386 287059 288120 289330 290424 291350 292199 292894 293239 293406 294051 295531 297283 298501 299262 300323 301798
51145 301798 302802 302723 302265 302716 304510 306905 308877 309914 310137 310031 309982 309895 309448 308862 308960 310062 311238 311317
51127 311317 310387 309626 309724 310178 310207 309648 308727 307613 306605 306244 306715 307449 307677 307223 306498 306000 306086 306948 308408
51108 308408 309898 310932 311488 311732 311623 311114 310478 310128 310222 310710 311566 312617 313362 313374 312799 312112 311451 310580
51090 310580 309391 308058 306701 305287 303892 302724 301861 301244 300945 301086 301487 301757 301810 301962 302412 302951 303324
51073 303324 303549 303711 303763 303744 304019 305010 306815 309175 311711 314050 315947 317481 318978 320553 321810 322207
51057 322207 321672 320739 320129 320314 321411 323209 325243 326996 328239 329187 330262 331677 333316 335012 336780
51042 336780 338625 340250 341239 341584 341756 342167 342802 343523 344406 345480 346365 346563 346017 345104 344166 343402 343109 343584
51024 343584 344721 346084 347412 348761 350086 351080 351576 351818 352174 352886 354195 356339 359149 361891 363858
51009 363858 365056 366121 367669 369876 372542 375328 377989 380624 383754 388065 393999 401545 410261 419445
50995 419445 428392 436640 444014 450476 456083 461113 466066 471383 477153 483096 488749 493715 497844 501187
50981 501187 503637 504670 503661 500578 496220 491709 487840 484886 482781 481243 479762 477702 474601 470495
50967 470495 465928 461519 457484 453666 450013 446790 444240 442343 441130 440893 441719 443093 444477 446121 448761
50952 448761 452606 457186 462122 467365 472598 477242 481432 486329 492887 500773 508982 517048 525000 532446
50938 532446 538518 542799 545670 547684 549034 549823 550395 551127 552084 553114 554136 555243 556715 559111 563175
50923 563175 569384 577475 586577 595944 605570 616021 627600 639753 651359 661632 670795 680055 690921
50910 690921 704297 719979 737113 755278 774941 796690 820324 845123 870843 897879 926494
50899 926494 956411 987295 1019093 1051648 1084330 1116283 1146719 1174878 1200169 1222641 1242958
50888 1242958 1261660 1278745 1294140 1308080 1320686 1331646 1340777 1348649 1356177 1363781 1371260 1378180
50876 1378180 1383973 1387917 1389517 1388840 1386129 1381320 1374218 1364856 1353250 1339120 1322357 1303523 1283240
50863 1283240 1261211 1236525 1208919 1179139 1148015 1115826 1082767 1049500 1016881 985480 955621
50852 955621 927663 901969 878676 857644 838522 820916 804657 789872 776656 764718 753535
50841 753535 742710 731974 721147 710556 701244 694121 688801 683864 678430 673006 668566 665371 663066
50828 663066 661516 660992 661605 663015 664747 666583 668579 670843 673439 676501 680286 684960 690359 696313 703291
50813 703291 712230 723335 735421 747070 758249 770097 783226 797096 811243 826228 842928 861569
50801 861569 882034 904439 928704 954004 979649 1006392 1036055 1069697 1106791 1146418 1188673
50790 1188673 1234533 1284727 1339139 1397119 1458059 1521679 1587945 1656702 1727370 1799093 1871206
50779 1871206 1943292 2014579 2083436 2147781 2206018 2257479 2302032 2339532 2369803 2392974 2409689
50768 2409689 2421019 2428287 2432866 2435927 2438285 2440526 2443219 2446915 2451917 2458221 2465664 2473925 2482146 2488581
50754 2488581 2490830 2486662 2474859 2455443 2429004 2395595 2354353 2304442 2246463 2182592 2115197 2045572
50742 2045572 1974241 1902101 1830815 1762182 1697573 1637877 1583451 1533978 1488760 1447540 1410915
50731 1410915 1379736 1354172 1333449 1316459 1302497 1291453 1283353 1277779 1273771 1270296 1266726 1262851
50719 1262851 1258673 1254321 1249964 1245531 1240627 1234895 1228319 1220937 1212471 1202554 1191138 1178333 1164035
50706 1164035 1148239 1131512 1114507 1097019 1078304 1058581 1039425 1022197 1006691 991908 977632
50695 977632 964513 952998 943114 935243 930179 928093 928027 928835 930324 933260 938613 947000 958485 972568
50681 972568 988614 1006598 1027150 1050567 1076106 1102760 1130560 1160519 1193270 1228332 1264868
50670 1264868 1302529 1341182 1380321 1419332 1458087 1496649 1534536 1570893 1605390 1638295 1669423
50659 1669423 1697614 1721605 1741013 1756079 1766808 1772869 1774158 1771022 1764071 1754251 1743044 1732167
50647 1732167 1722940 1716110 1712136 1711206 1713004 1716889 1722453 1729592 1737896 1746262 1753316 1758017 1759719 1757810
50633 1757810 1751507 1740033 1723068 1701162 1675686 1648171 1619669 1590826 1562407 1535391 1510528
50622 1510528 1488151 1468548 1452174 1439376 1430134 1424330 1422079 1423613 1428998 1438165 1451166 1468168
50610 1468168 1489152 1513651 1540774 1569473 1598855 1628249 1657040 1684587 1710505 1734922 1758255
50599 1758255 1780739 1802382 1823274 1843632 1863500 1882611 1900562 1916938 1931372 1943833 1954928
50588 1954928 1965600 1976448 1987655 1999530 2012682 2027465 2043650 2060935 2079499 2099759 2121796
50577 2121796 2145239 2169487 2193772 2217219 2239172 2259396 2277734 2293749 2306963 2317377 2325452
50566 2325452 2331646 2336095 2338632 2338724 2335331 2327107 2312989 2292800 2267534 2239242 2210538 2183813 2160511
50553 2160511 2140888 2124393 2110484 2099284 2091457 2087211 2085467 2084193 2081566 2076628 2068922 2057934 2042972
50540 2042972 2023246 1997946 1966639 1929839 1888881 1845009 1798849 1750909 1702126 1653552 1605913
50529 1605913 1559868 1516292 1475670 1437417 1400539 1365032 1332104 1302884 1277402 1254987 1235249
50518 1235249 1218346 1204524 1193640 1185113 1178343 1173354 1170950 1171940 1176145 1182427 1189766 1198031 1207683
50505 1207683 1219137 1232595 1248109 1265439 1283983 1303294 1323609 1345643 1369889 1396395 1425181
50494 1425181 1456527 1490568 1526772 1564112 1601814 1639819 1678386 1717380 1756140 1794153 1831700
50483 1831700 1869697 1909000 1950015 1992955 2038124 2085811 2136135 2189205 2245313 2304677 2367039
50472 2367039 2431831 2498807 2568215 2640173 2714195 2789675 2866689 2945957 3027965 3112341 3198034
50461 3198034 3283675 3367682 3448413 3524498 3594860 3658201 3712693 3756417 3787929 3806259 3810639
50450 3810639 3800649 3776567 3739275 3689877 3629613 3559995 3482822 3400225 3314979 3230479 3149847
50439 3149847 3075102 3007535 2948646 2900011 2862183 2834435 2815831 2806065 2804949 2811502 2823770 2839024
50427 2839024 2853688 2863487 2864323 2853296 2829008 2791308 2740985 2679406 2608116 2528843 2443790 2355375
50415 2355375 2265432 2175060 2085542 1998872 1916866 1840099 1768219 1701042 1638771 1581337 1528225
50404 1528225 1479023 1433662 1392082 1354082 1319605 1288812 1261749 1238270 1218372 1202297 1190071
50393 1190071 1181091 1174395 1169328 1165945 1164688 1165705 1168567 1172875 1179004 1187875 1199823 1214079 1229641
50380 1229641 1246321 1264551 1284295 1304454 1323216 1338874 1350731 1359626 1367323 1374950 1382190 1388337
50368 1388337 1393782 1399874 1407560 1416826 1427429 1439401 1452776 1467432 1483449 1501189 1520904 1542735
50356 1542735 1567168 1594927 1626174 1660315 1696859 1735969 1777872 1822168 1868122 1915210 1962907
50345 1962907 2010219 2055950 2099365 2140189 2178038 2212176 2241751 2265951 2283943 2294991 2298656
50334 2298656 2294622 2282297 2260896 2230100 2190619 2144116 2092730 2038646 1983777 1929537 1876837
50323 1876837 1826427 1779310 1736724 1699608 1668176 1642161 1621452 1606268 1596653 1592050 1591488 1593839
50311 1593839 1597578 1600522 1600379 1595714 1586161 1571771 1552484 1528291 1499511 1466707 1430628 1392367
50299 1392367 1353267 1314322 1275847 1238014 1201561 1167620 1136827 1108870 1082985 1058757 1036342
50288 1036342 1016107 998194 982384 968220 955113 942393 929441 915935 901961 887805 873697
50277 873697 859829 846568 834429 823758 814536 806540 799756 794541 791338 790118 790101 790230 790070 790158 791317
50262 791317 793729 796872 800277 804026 808389 813238 818007 822206 825853 829421 833415 838035 843199 848775
50248 848775 854640 860503 865910 870643 875045 879782 885282 891475 897998 904508 910919 917489 924628 932402
50234 932402 940305 947757 954849 962440 971424 982051 993935 1006468 1018937 1030175 1038314 1041358 1038405
50221 1038405 1030434 1019719 1008364 997495 987634 979290 972862 968335 965469 964155 964336 965869 968760
50208 968760 973278 979438 986594 993997 1001594 1009745 1018363 1027021 1035970 1046307 1058815 1073106 1088320
50195 1088320 1104319 1121850 1141663 1163728 1187143 1210567 1232873 1253607 1272956 1291285 1308794
50184 1308794 1325443 1340918 1354672 1366175 1375174 1381466 1384501 1383449 1377676 1366872 1350882 1329914
50172 1329914 1305086 1278316 1251408 1225354 1200561 1177271 1155523 1134970 1114994 1094908 1073982
50161 1073982 1051608 1027693 1002824 977925 953829 931106 909909 889906 870668 852275 835269
50150 835269 819860 805536 791683 778327 766003 755123 745689 737443 729992 722947 716145 709729 703927
50137 703927 698851 694502 690693 686952 682868 678703 675328 673287 672163 671118 669775 668326 667080 666293
50123 666293 666241 666991 668091 668839 668957 668790 668760 668839 668736 668570 669119 671156 674516 678148 681342 684599 688870
50106 688870 694193 699733 705064 710605 716560 722306 727362 732386 738527 746196 755105 765112 776244 788060
50092 788060 799871 811770 824814 839877 856715 874434 892633 911870 933148 957071 983464
50081 983464 1011866 1042417 1076019 1113363 1154038 1197023 1241877 1288801 1337407 1386002 1432578
50070 1432578 1476352 1518060 1558813 1598867 1637452 1673515 1706391 1735565 1759828 1776937 1784420
50059 1784420 1780851 1766321 1741973 1709355 1670105 1625734 1577452 1526237 1473123 1419358 1366341
50048 1366341 1315534 1268250 1225084 1185528 1148548 1113701 1081357 1051699 1024045 997588 972468
50037 972468 949442 928630 909263 890849 873898 859113 846322 834815 824402 815489 808202 802126
50025 802126 797024 793136 790460 788310 786031 783773 782102 781146 780589 780258 780188 780287 780438 780907 782180 784424
50009 784424 787445 791035 794922 798502 801230 803275 805220 807138 808531 809229 809625 809853 809406 807940 805974
49994 805974 804426 803818 804090 804692 804685 803402 801362 800007 800120 801077 802022 803142 805201 808447 812737 818246
49978 818246 825201 833222 841757 851056 861827 873968 886396 898292 909887 921919 934827 948647
49966 948647 963222 978294 993696 1009527 1025901 1042627 1059516 1076931 1095578 1115828 1137608
49955 1137608 1160759 1184793 1208378 1229875 1248733 1265837 1282213 1297950 1312605 1326019 1338170
49944 1338170 1348588 1356386 1360646 1360364 1354337 1341702 1322606 1297976 1268673 1235257 1198553 1159963
49932 1159963 1120977 1082610 1045469 1010140 977217 946963 919184 893452 869278 846094 823353
49921 823353 800895 779112 758523 739268 721247 704641 689903 677157 665916 655609 646109 637593
49909 637593 630114 623575 617851 612678 607583 602247 596859 591907 587685 584219 581488 579461 578033 577267
49895 577267 577566 579281 582138 585360 588422 591454 594808 598466 602013 605071 607601 609742 611451 612479
49881 612479 612736 612513 612124 611453 610124 608022 605287 601844 597385 591834 585386 578096 570051 562038 555265
49866 555265 550040 545437 540762 536630 533952 532474 531181 529669 528197 526784 525295 524293 524685 526365
49852 526365 528155 529403 530807 533245 536485 539610 542240 544820 547892 551548 555554 559779 564376 569486
49838 569486 574781 579532 583369 586635 589693 592235 593782 594490 594750 594156 591729 587250 581707 576224 571151
49823 571151 566362 561778 557348 552947 548548 544160 539574 534625 529769 525808 522965 520801 519049 517810
49809 517810 516835 515489 513791 512728 513021 514299 515984 518343 521948 526629 531716 536928 542275 547358 551611
49794 551611 555273 559402 564751 571092 577723 584152 590092 595118 598748 600804 601549 601429 600766 599662 598142
49779 598142 596224 593847 590860 587254 583235 578955 574417 569822 565736 562552 559990 557589 555449 553973
49765 553973 553065 552238 551467 551268 551892 553099 554781 557111 559975 563027 566445 570862 576240 581575 586026
49750 586026 589590 592279 593583 593421 592834 592867 593240 592881 591360 589075 586420 583539 580656 577924 575100 571952
49734 571952 568721 565561 561863 556898 550984 545280 540476 536389 532764 529740 527417 525628 524296 523477
49720 523477 522945 522242 521392 521123 522129 524363 527184 529930 532279 534313 536398 538915 542047 545813 550096
49705 550096 554432 558033 560399 561862 563242 564995 566916 568568 569687 570199 570037 568944 566439 562225 556764
49690 556764 551133 546093 541637 537636 534396 532081 530062 527539 524634 522235 520903 520497 520785 521723 523103
49675 523103 524457 525467 526148 526646 527269 528560 530814 533532 535906 537907 540337 543671 547394 550783 553913
49660 553913 557618 562630 568950 575894 582625 588739 594354 599607 604236 607834 610271 611646 612072 611786 611128
49645 611128 610074 608109 605107 601954 599684 598280 597028 595770 594908 594309 593253 591649 590350 589981 590324
49630 590324 591160 592807 595361 598227 601030 604340 608797 614134 619701 625470 631741 638272 644506 650432
49616 650432 656533 663147 670558 679414 689984 700968 709964 715518 718143 719103 718941 717672 715785 714206
49602 714206 713354 712850 712349 712264 713405 715934 718744 719859 717572 711520 702841 693274 684014 675335 667096
49587 667096 659340 652271 645886 639967 634491 629835 626432 624388 623536 623717 624828 626632 628760 630842 632520
49572 632520 633321 632766 630705 627516 623923 620578 617730 615200 612672 610061 607599 605592 604215 603526 603446
49557 603446 603612 603464 602712 601653 600903 600926 601918 603848 606299 608489 609904 610933 612513 615047 617927 620244
49541 620244 621758 623050 624824 627120 629219 630380 630693 631007 631940 633298 634692 636309 638550 641169 643434
49526 643434 645136 646784 648566 649832 649943 649231 648651 648737 649313 650032 650786 651610 652555 653705 655096 656585 657984
49509 657984 659390 661259 664051 667837 672301 677115 682271 688016 694427 701113 707369 712552 716219 718103
49495 718103 718217 717050 715444 714013 712682 710883 708295 705377 703063 701872 701506 701475 701938 703478 706030
49480 706030 708548 710042 710602 711061 711965 713246 714664 716133 717734 719885 723407 728927 736184 744287 752731
49465 752731 761843 772262 784304 797881 812655 828132 843702 858560 871478 881033 886626 889282
49453 889282 890945 892901 895190 897507 900062 903315 907225 911000 913462 913665 911378 906992 900763 892335
49439 892335 881444 868889 856188 844201 832693 821359 810589 800945 792508 785165 779021 774034
49427 774034 769579 765005 760432 756622 754112 752779 752125 751671 751190 750829 750972 751766 752890 753936 754871 755878
49411 755878 756861 757410 757342 757125 757624 759367 762032 764698 766654 767858 768658 769336 770116 771262 772722 773943
49395 773943 774511 774833 775576 776547 776788 775828 774106 772073 769634 766868 764526 763217 762610 761993 761271 760889 761139
49378 761139 762062 763813 766566 770173 774329 778968 784163 789887 796198 803374 811372 819375 826481 832783
49364 832783 839271 846687 854954 863796 873273 883412 893524 902238 908228 910881 910530 908254 905432 903220
49350 903220 902155 902124 902772 904061 906377 910079 915207 921842 930411 941135 953316 965778 978035 990442
49336 990442 1003108 1015387 1026670 1037034 1046684 1055428 1063228 1070657 1078044 1084541 1088883 1090972 1091975
49323 1091975 1092777 1092899 1091171 1087102 1081408 1075365 1069739 1064311 1058522 1052505 1047122 1042900 1039474 1036420
49309 1036420 1034085 1033025 1033018 1033332 1033769 1034718 1036238 1037740 1038681 1039007 1038745 1037647 1035407 1032015 1027797 1023372
49293 1023372 1019446 1016237 1013117 1009227 1004569 1000124 996854 994928 993988 993698 993825 994069 994194 994212 994252 994199 993528
49276 993528 991582 988131 983695 979152 974997 971230 967981 965737 964626 963983 963192 962651 963247 965054 967276
49261 967276 969511 972365 976641 982501 989700 998096 1007481 1017142 1025906 1032496 1035782 1035111 1030814 1024255
49247 1024255 1017026 1009978 1003032 995786 988117 980291 972668 965403 958392 951407 944294 937108 930214 924179
49233 924179 919349 915487 912024 908699 905657 902928 900282 897802 896024 895080 894078 891996 888937 885940
49219 885940 883636 881750 879919 878406 877774 878259 879650 881596 883859 886450 889491 892778 895664 897622 898814
49204 898814 899802 900847 901806 902459 902489 901428 899218 896747 895247 895230 896536 899209 903456 908745 913844 918084
49188 918084 921809 925175 927311 927217 924895 920958 915601 908698 900686 892542 884825 877278 869532 861836 854935
49173 854935 849466 845643 843386 842607 843291 845332 848402 852047 855848 859423 862522 865373 868709 873018 877881
49158 877881 882487 886756 891328 896362 901061 904726 907759 911098 915003 918968 922707 926704 931681 937839
49144 937839 944775 952029 959602 967876 977045 986798 996707 1006751 1017142 1027731 1038000 1047664 1056928
49131 1056928 1066092 1075325 1084873 1094991 1105483 1115678 1125093 1133838 1142261 1150565 1158987 1167938 1177761
49118 1177761 1188636 1200782 1214308 1228826 1243798 1259540 1277274 1297831 1320895 1345786 1372150
49107 1372150 1399141 1424534 1445655 1461073 1470897 1475930 1477409 1477229 1477186 1477717 1478027 1477563 1476711 1475987 1475357
49092 1475357 1474692 1474291 1474588 1475806 1478109 1481657 1486260 1491453 1497182 1503967 1512060 1520901 1529773 1538653 1547991
49077 1547991 1558007 1568637 1579959 1592192 1605366 1619394 1634361 1650407 1667360 1684781 1702332
49066 1702332 1719901 1737463 1755103 1773037 1791363 1809938 1828860 1848887 1870938 1895221 1921328
49055 1921328 1949130 1979064 2011550 2046866 2085927 2130580 2182572 2242630 2311142 2389388 2478960
49044 2478960 2579186 2685112 2788700 2883282 2968267 3049640 3134067 3220248 3295569 3342797 3351900
49033 3351900 3326567 3279976 3224567 3164767 3097366 3017358 2923832 2821624 2718262 2619648 2528491
49022 2528491 2445770 2372140 2307546 2250796 2200678 2157079 2120185 2089098 2062166 2038393 2017554
49011 2017554 1999147 1982295 1966718 1952855 1940788 1929883 1919734 1910645 1902870 1896032 1889726 1884056
48999 1884056 1879205 1875061 1871666 1869475 1868682 1868746 1869015 1869354 1869696 1869562 1868718 1868011 1868869 1872095 1877603 1885057
48983 1885057 1894051 1903713 1912801 1920477 1926641 1931462 1934931 1937038 1938110 1938807 1939905 1942050 1945493 1949926
48969 1949926 1954650 1959006 1962745 1966123 1969670 1973798 1978551 1983827 1989668 1996008 2002192 2007288 2011149 2014797
48955 2014797 2019434 2025372 2032231 2039860 2048479 2058067 2068110 2078071 2087819 2097537 2107454 2117658 2128017
48942 2128017 2138276 2148392 2158638 2169225 2179858 2189889 2198832 2206573 2213160 2218634 2223036 2226400
48930 2226400 2228747 2230211 2231068 2231522 2231560 2231208 2230775 2230605 2230655 2230544 2229962 2228882 2227429 2225736 2223868 2221685 2218829
48913 2218829 2215048 2210572 2206011 2201842 2197981 2193895 2189153 2183957 2179083 2175119 2171813 2168481 2165106 2162627
48899 2162627 2161980 2163153 2165483 2168556 2172525 2177744 2184530 2193172 2203789 2216063 2229347 2243125 2257356
48886 2257356 2272451 2288929 2306947 2326051 2345556 2365247 2385534 2406980 2429973 2454825 2481612
48875 2481612 2509735 2538257 2567152 2597753 2631431 2668148 2706799 2746587 2787400 2829187 2871821
48864 2871821 2915573 2960886 3007449 3054143 3100187 3145910 3192135 3239213 3286891 3334734 3382324
48853 3382324 3429253 3475267 3520414 3564892 3608717 3651563 3692906 3732435 3770365 3807149 3842747
48842 3842747 3876509 3908101 3938209 3967836 3997045 4024935 4050723 4074234 4095321 4113588 4128992
48831 4128992 4142161 4153684 4163430 4170868 4175662 4177609 4176411 4172085 4165437 4157520 4148515 4137482 4123358
48818 4123358 4105918 4085660 4063085 4038399 4011823 3983741 3954317 3923166 3889746 3854038 3816566
48807 3816566 3777765 3737747 3696848 3655866 3615423 3575393 3535405 3495659 3456680 3418483 3380639
48796 3380639 3343172 3306835 3272367 3239987 3209768 3181890 3156254 3132331 3109825 3089166 3070993
48785 3070993 3055397 3042055 3030834 3021781 3014687 3009128 3005035 3002842 3002975 3005408 3009837 3016004 3023759
48772 3023759 3032968 3043582 3055716 3069456 3084579 3100614 3117232 3134415 3152097 3169855 3187215
48761 3187215 3204235 3221490 3239361 3257653 3276040 3294596 3313626 3333185 3353039 3372920 3392506
48750 3392506 3411343 3429214 3446503 3463844 3481405 3498938 3516480 3534517 3553288 3572358 3591154
48739 3591154 3609684 3628407 3647588 3667034 3686397 3705455 3724079 3742058 3759070 3774827 3789255
48728 3789255 3802456 3814469 3825178 3834496 3842561 3849559 3855437 3859894 3862547 3862940 3860516 3854817 3845744
48715 3845744 3833508 3818474 3801170 3782148 3761391 3738058 3711273 3681252 3649189 3615981 3581501
48704 3581501 3545274 3507474 3468863 3430007 3390856 3351065 3310504 3269466 3228497 3188086 3148509
48693 3148509 3109997 3072890 3037479 3003729 2971399 2940379 2910708 2882270 2854701 2827692 2801301
48682 2801301 2776009 2752567 2731617 2713186 2696605 2681219 2667138 2655012 2645142 2637127 2630365 2624505
48670 2624505 2619375 2614866 2611064 2608228 2606497 2605803 2606056 2607178 2608915 2610977 2613394 2616351 2619572 2622288
48656 2622288 2624110 2625635 2627869 2631206 2635235 2639425 2643742 2648584 2654234 2660461 2666736 2672885 2679337 2686495
48642 2686495 2693935 2700560 2705560 2709046 2711793 2714622 2717944 2721577 2724995 2728137 2731906 2737394 2744537 2751980
48628 2751980 2758453 2763845 2768794 2773730 2778738 2783964 2789609 2795615 2801745 2808036 2814911 2822757 2831467 2840502
48614 2840502 2849440 2858481 2868248 2879056 2890560 2902266 2914123 2926343 2938825 2950949 2961553 2968780
48602 2968780 2970391 2964974 2952647 2934032 2908974 2877269 2840355 2800908 2760480 2718725 2675448 2632198
48590 2632198 2590983 2552292 2515413 2480077 2446764 2415774 2386990 2360473 2336395 2314334 2293234
48579 2293234 2272141 2250615 2228690 2206909 2186209 2167181 2149434 2132067 2114599 2097096 2079738
48568 2079738 2062855 2047054 2032597 2018788 2004671 1990272 1976443 1963568 1951234 1939307 1928508
48557 1928508 1919558 1912306 1906095 1900527 1895559 1891248 1887780 1885466 1884283 1883620 1882798 1881770 1881032 1880908 1881130
48542 1881130 1881131 1880589 1879681 1878912 1878764 1879462 1880935 1882794 1884361 1885005 1884661 1883903 1883267 1882590 1881210 1878745 1875460
48525 1875460 1871875 1868176 1864004 1858665 1851604 1842809 1832832 1822459 1812421 1803248 1794988 1787000 1778468
48512 1778468 1769409 1760865 1753785 1748072 1743080 1738707 1735425 1733337 1731752 1729690 1726421 1721580 1715170 1707491
48498 1707491 1698701 1688464 1676439 1663108 1649667 1637000 1625154 1613885 1603173 1592939 1582668
48487 1582668 1571797 1560364 1548941 1537941 1527199 1516192 1504476 1491942 1478860 1465797 1453414
48476 1453414 1442070 1431522 1421085 1410324 1399626 1389924 1381803 1375014 1368928 1363332 1358659 1355570 1354406
48463 1354406 1354965 1356748 1359497 1363304 1367903 1371927 1373396 1371145 1365452 1357206 1347081 1335888 1325067
48450 1325067 1315981 1308806 1302744 1297373 1293317 1291537 1292313 1295069 1298917 1303312 1308326 1314366 1321619 1329884
48436 1329884 1338892 1348337 1357280 1363882 1366301 1363915 1357551 1348715 1338816 1328779 1318886 1309017 1299207 1289791
48422 1289791 1280783 1271520 1261478 1251258 1242250 1235322 1230190 1225903 1221571 1216728 1211487 1206348 1201644
48409 1201644 1197287 1193285 1190060 1187802 1185868 1183515 1180971 1179023 1177678 1176062 1173754 1171420 1169911 1169347
48395 1169347 1169362 1169649 1169858 1169407 1167830 1165143 1161651 1157610 1153159 1148323 1143034 1137382 1131812 1126680 1121542
48380 1121542 1115379 1107748 1099379 1091389 1084141 1077105 1069653 1061793 1054152 1047356 1041493 1036188 1031168 1026435
48366 1026435 1021836 1016866 1011183 1004947 998317 991034 983071 975309 968831 963690 959035 954346 949823 945603
48352 945603 941385 937039 932872 929056 925261 921170 916925 912888 909258 906027 902999 899828 896405 893183
48338 893183 890736 888944 887082 884731 882207 880086 878656 877773 876832 874967 871792 867943 864475 861820 859791
48323 859791 858339 857686 857775 858212 858756 859357 859886 860365 861217 862607 863815 864076 863767 863830 864298 864550 864961 866977
48305 866977 871279 876976 882990 889305 896461 904765 914421 925635 938169 951419 965259 980236 996874
48292 996874 1015417 1036152 1058923 1082246 1103989 1123233 1140625 1156878 1172085 1186770 1202417
48281 1202417 1220445 1241363 1265097 1291336 1319594 1349985 1383855 1422606 1466074 1513269 1564252
48270 1564252 1619757 1679461 1742645 1810212 1883802 1963118 2046766 2135745 2233280 2340910 2457830
48259 2457830 2584691 2725097 2883091 3062795 3271071 3516296 3803494 4135110 4517755
48250 4517755 4963266 5482568 6085767 6790212 7619272 8589328 9708390 10988839 12431293
48241 12431293 13957655 15359289 16352190 16725398 16454269 15681015 14603255 13382694 12124838
48232 12124838 10896039 9736777 8668287 7701172 6841025 6086954 5430966 4862929 4374226
48223 4374226 3955898 3597347 3289229 3025268 2799889 2606539 2439503 2294983 2169342
48214 2169342 2058567 1960340 1874353 1799534 1733113 1673281 1620458 1574805 1534606 1498330 1466230
48203 1466230 1438409 1413127 1388638 1365280 1344204 1325276 1307715 1291704 1277821 1265611 1254143
48192 1254143 1243477 1234355 1226843 1220321 1214583 1210091 1207190 1205468 1203573 1199450 1191446 1179654 1165783
48179 1165783 1151492 1137409 1123794 1111070 1099215 1087563 1075857 1064789 1055020 1046325 1038187 1030464
48167 1030464 1022940 1015065 1006744 998644 991070 983223 974257 964435 954538 944708 934567 923950 912814
48154 912814 900854 887868 874128 859876 844926 829284 813613 798502 783765 769063 754661
48143 754661 740924 727588 714303 701471 689777 679186 669152 659536 650696 642899 636205 630626
48131 630626 625830 620999 615576 609843 604298 598922 593637 588982 585469 582664 579709 576493 573491 570734
48117 570734 567793 564668 561834 559496 557499 555857 554625 553443 552027 550951 551019 551864 552132 551107 549376
48102 549376 547786 546648 546048 546039 546239 546052 545548 545416 545851 546342 546785 547842 549694 551360 551918 551674 551435 551288
48084 551288 550885 550427 550484 551090 551765 552310 552944 553793 554774 555905 557235 558568 559718 560885 562299 563642 564362
48067 564362 564514 564727 565331 566123 567123 568917 571860 575314 578124 579819 581033 582800 585628 589255 593096
48052 593096 596761 600185 603422 606490 609389 612126 614692 617188 619988 623566 628005 632861 637699 642569
48038 642569 647780 653326 658874 664311 670049 676606 684003 691630 698717 704953 710697 716562 722803 729216
48024 729216 735656 742411 749853 757761 765238 771463 776469 781082 786095 791536 796851 801705 806381 811254
48010 811254 816184 820733 824825 828743 832492 835734 838608 842113 847168 853449 859538 864198 867278 869472
47996 869472 871499 873543 875223 876027 875781 874632 872578 869263 864453 858490 852058 845616 839337 833412 827982
47981 827982 822779 817165 810670 803285 795235 786715 777941 769269 761097 753589 746420 738764 729841 719762
47967 719762 709709 700896 693355 686060 678210 669991 661974 654275 646615 638920 631428 624275 617325 610472
47953 610472 603919 598033 593000 588641 584556 580426 576194 571963 567774 563569 559294 554978 550711 546683
47939 546683 543254 540811 539417 538596 537543 535678 533079 530399 528213 526391 524270 521539 518759 516755
47925 516755 515637 514724 513430 511881 510579 509742 509171 508575 507779 506678 505202 503411 501521 499770 498228
47910 498228 496802 495432 494213 493178 492057 490547 488899 487860 487796 488115 487949 487211 486556 486419 486567 486640 486605
47893 486605 486572 486561 486743 487541 489208 491497 493977 496489 499117 501922 504924 508216 511842 515689 519647 523769
47877 523769 528084 532392 536460 540371 544469 548896 553320 557157 560083 562367 564658 567353 570163 572430
47863 572430 573844 574698 575479 576428 577481 578359 578676 578210 577129 575737 573963 571397 567909 563867 559654 555390
47847 555390 551287 547769 544906 542132 539035 536192 534750 535206 536948 538877 540097 540147 539105 537657 536768
47832 536768 537032 538372 540341 542592 545031 547626 550177 552397 554282 556261 558682 561245 563358 565048
47818 565048 567051 569833 573105 576515 580154 583864 586710 587904 587905 587832 588000 587755 586626 584819 582600 579910
47802 579910 576735 573203 569186 564347 558726 552768 546752 540729 534981 529852 525079 520071 514978 510661
47788 510661 507340 504134 500388 496597 493472 490897 488568 486886 486261 486031 485137 483667 482816 483405 485290
47773 485290 488119 491743 495696 499178 501913 504447 507308 510381 513419 516676 520579 525058 529573 533691
47759 533691 537402 540995 544787 548904 553308 558138 563857 570776 578537 586494 594577 603321 612984 623179
47745 623179 633571 644417 656014 668020 679705 690594 700542 709461 717458 724968 732281 738937 744023
47732 744023 747058 748247 747945 746267 743356 739659 735741 731937 728239 724371 719980 714973 709754 705028
47718 705028 701379 699055 697923 697362 696399 694426 691849 689583 687772 685447 681693 676809 672004 668219 665510
47703 665510 663268 660599 656677 651302 645158 639164 633505 627617 621123 614403 608145 602686 597981 593954
47689 593954 590618 588041 586363 585728 586023 586816 587719 588693 589954 591761 594409 598092 602510 606844 610536
47674 610536 613970 618031 623022 628444 633853 639472 645720 652438 658977 664900 670334 675648 680990 686131
47660 686131 690574 693793 695523 695934 695473 694531 693224 691476 689134 685954 681607 675938 669307 662551 656379
47645 656379 650786 645154 639075 632960 627699 623669 620212 616244 611363 606260 601982 598920 596680 594829
47631 594829 593440 592797 592920 593709 595318 597965 601484 605569 610393 616417 623409 630258 636200 641699 647670
47616 647670 654265 661100 668248 676059 684093 691134 696595 701154 705605 709730 712785 714578 715432 715442 714493
47601 714493 712834 710966 708949 706392 703232 699928 696667 692832 687697 681387 674802 668706 663203 658110
47587 658110 653529 649887 647474 646010 644697 642821 640380 638094 636700 636280 636367 636575 636935 637659 638903 640905
47571 640905 644060 648558 654057 660056 666577 674143 682965 692513 702055 711395 720814 730496 740359 750268
47557 750268 760039 769148 776848 782660 786507 788304 787767 784804 779791 773073 764396 753221 739625 724518
47543 724518 708857 692901 676421 659419 642357 625736 609764 594529 580263 567270 555678
47532 555678 545431 536438 528558 521456 514737 508290 502376 497301 493075 489423 485974 482476 479022 476130
47518 476130 474370 473754 473642 473317 472478 471095 469135 466686 464133 461844 459805 457787 455747 453782 451803
47503 451803 449587 447113 444580 442129 439836 437906 436582 435775 434995 433695 431635 429076 426762 425441 425000
47488 425000 424268 422148 418857 415698 413637 412600 412063 411712 411383 410889 410178 409354 408395 407194 405950 405084
47472 405084 404577 403843 402487 400815 399377 398368 397708 397336 397107 396769 396323 396129 396402 396894 397373 398047 399161
47455 399161 400440 401353 401718 401756 401728 401812 402136 402608 402876 402722 402366 402163 402183 402324 402566 402904 403272 403776 404680 405913
47435 405913 406920 407370 407580 407848 407795 406988 405935 405739 406778 408297 409393 409954 410623 412144 414678 417465
$$ [...]
##END NTUPLES=NMR SPECTRUM
##END=
