
##TITLE=UV1143_M5-1005-1002_6279095_Cy1ukQ6bDw
##JCAMPDX= 6.0         $$ Bruker NMR JCAMP-DX V2.0
##DATA TYPE= NMR SPECTRUM
##DATA CLASS= NTUPLES
##ORIGIN= BRUKER
##OWNER= Administrator
$$ 1.72 TOPSPIN		Version 2.1
$$ 2012-06-07 05:25:56.328 -0500  Administrator@TOPSPIN
$$ Compression mode = diff/dup
##.OBSERVE FREQUENCY= 400.13188235
##.OBSERVE NUCLEUS= ^1H
##.ACQUISITION MODE= SIMULTANEOUS (DQD)
##.ACQUISITION SCHEME= undefined
##.AVERAGES= 8
##.DIGITISER RES= 22
##SPECTROMETER/DATA SYSTEM= spect
##.PULSE SEQUENCE= zg30
##.SOLVENT NAME= COFFEE_meoh
##.SHIFT REFERENCE= INTERNAL, COFFEE_meoh, 1, 14.98061
##AUDIT TRAIL= $$ (NUMBER, WHEN, WHO, WHERE, PROCESS, VERSION, WHAT)
$$ ##TITLE= Audit trail, TOPSPIN		Version 2.1
$$ ##JCAMPDX= 5.01
$$ ##ORIGIN= Bruker BioSpin GmbH
$$ ##OWNER= Administrator
$$ $$ C:\Bruker\TOPSPIN/data/COFFEE/nmr/UV1143_M5-1005-1002_6279095_Cy1ukQ6bDw/20/pdata/1/auditp.txt
$$ ##AUDIT TRAIL=  $$ (NUMBER, WHEN, WHO, WHERE, PROCESS, VERSION, WHAT)
(   1,<2012-06-07 05:25:48.000 -0500>,<Administrator>,<TOPSPIN>,<go>,<TOPSPIN 2.1>,
      <created by zg
	started at 2012-06-07 05:24:40.781 -0500,
	POWCHK enabled, PULCHK disabled,
       configuration hash MD5:
       D5 CA 7A 23 FE 6B EE E2 50 67 74 61 24 F7 5E 3B
       data hash MD5: 64K
       85 F8 F0 F3 66 A7 8A 7B 47 51 A6 B8 93 F1 D8 9A>)
(   2,<2012-06-07 05:25:52.312 -0500>,<Administrator>,<TOPSPIN>,<proc1d>,<TOPSPIN 2.1>,
      <Start of raw data processing
       efp LB = 0 FT_mod = 6 PKNL = 1 PHC0 = 0 PHC1 = 0 SI = 32K 
       data hash MD5: 32K
       57 5F 8E 4C E6 10 4E 80 D3 08 0E FD A7 38 CC 19>)
(   3,<2012-06-07 05:25:52.625 -0500>,<Administrator>,<TOPSPIN>,<proc1d>,<TOPSPIN 2.1>,
      <pk PHC0 = 212.8601 PHC1 = 0 
       data hash MD5: 32K
       B5 43 19 37 79 7D 4F A6 E7 99 8A E2 7A D1 71 99>)
(   4,<2012-06-07 05:25:52.687 -0500>,<Administrator>,<TOPSPIN>,<proc1d>,<TOPSPIN 2.1>,
      <abs ABSG = 1 
       data hash MD5: 32K
       78 D8 10 57 FC D4 D9 0E 5D 5B 16 E1 E0 0F 67 01>)
(   5,<2012-06-07 05:25:52.718 -0500>,<Administrator>,<TOPSPIN>,<proc1d>,<TOPSPIN 2.1>,
      <abs ABSG = 2 
       data hash MD5: 32K
       78 71 4C D1 F7 C9 79 93 2C 46 5C 41 BB 52 33 7F>)
(   6,<2012-06-07 05:25:52.765 -0500>,<Administrator>,<TOPSPIN>,<proc1d>,<TOPSPIN 2.1>,
      <abs ABSG = 3 
       data hash MD5: 32K
       08 59 0D 10 58 C4 29 96 DA B1 EB 7E 98 3C C6 D9>)
(   7,<2012-06-07 05:25:52.796 -0500>,<Administrator>,<TOPSPIN>,<proc1d>,<TOPSPIN 2.1>,
      <abs ABSG = 4 
       data hash MD5: 32K
       58 AE AF C4 F3 16 DE 3E 31 50 C4 6E 87 A6 81 C7>)
(   8,<2012-06-07 05:25:52.828 -0500>,<Administrator>,<TOPSPIN>,<proc1d>,<TOPSPIN 2.1>,
      <abs ABSG = 5 
       data hash MD5: 32K
       61 05 76 59 DA 10 4F C1 5C E6 E9 56 9C 7A 23 B1>)
$$ ##END=
$$ 
$$ $$ hash MD5
$$ $$ FE FA 14 F7 D6 45 AB 9E 9F 91 59 94 A8 20 99 45
##$RELAX= 
##$RELAX= 
##$RELAX= 
##$RELAX= 
##$RELAX= 
##$RELAX= 
##$RELAX= 
$$ Bruker specific parameters
$$ --------------------------
$$ [...]
150 150 150 150 150 150 150 150
##$TP07= 0
##$TPNAME0= <>
##$TPNAME1= <>
##$TPNAME2= <>
##$TPNAME3= <>
##$TPNAME4= <>
##$TPNAME5= <>
##$TPNAME6= <>
##$TPNAME7= <>
##$TPOAL= (0..7)
0.5 0.5 0.5 0.5 0.5 0.5 0.5 0.5
##$TPOFFS= (0..7)
0 0 0 0 0 0 0 0
##$TUNHIN= 0
##$TUNHOUT= 0
##$TUNXOUT= 0
##$USERA1= <user>
##$USERA2= <user>
##$USERA3= <user>
##$USERA4= <user>
##$USERA5= <user>
##$V9= 5
##$VALIST= <valist>
##$VCLIST= <CCCCCCCCCCCCCCC>
##$VD= 0
##$VDLIST= <DDDDDDDDDDDDDDD>
##$VPLIST= <PPPPPPPPPPPPPPP>
##$VTLIST= <TTTTTTTTTTTTTTT>
##$WBST= 2048
##$WBSW= 25
##$XGAIN= (0..3)
0 0 0 0
##$XL= 0
##$YL= 0
##$YMAX_a= 499877
##$YMIN_a= -600717
##$ZGOPTNS= <>
##$ZL1= 120
##$ZL2= 120
##$ZL3= 120
##$ZL4= 120
##$ABSF1= 14.98061
##$ABSF2= -5.57192
##$ABSG= 5
##$ABSL= 3
##$ALPHA= 0
##$AQORDER= 0
##$ASSFAC= 0
##$ASSFACI= 0
##$ASSFACX= 0
##$ASSWID= 0
##$AUNMP= <proc_prof1d_extract_pilot.lims>
##$AXLEFT= 0
##$AXNAME= <>
##$AXNUC= <1H>
##$AXRIGHT= 0
##$AXTYPE= 0
##$AXUNIT= <>
##$AZFE= 0.1
##$AZFW= 0.1
##$BCFW= 0
##$BC_mod= 0
##$BYTORDP= 0
##$COROFFS= 0
##$CY= 15
##$DATMOD= 1
##$DC= 0
##$DFILT= <>
##$DTYPP= 0
##$F1P= 0
##$F2P= 0
##$FCOR= 0.5
##$FTSIZE= 32768
##$FT_mod= 6
##$GAMMA= 0
##$GB= 0
##$INTBC= 1
##$INTSCL= 1
##$ISEN= 128
##$LB= 0
##$LEV0= 0
##$LPBIN= 0
##$MAXI= 10000
##$MC2= 0
##$MEAN= 0
##$ME_mod= 0
##$MI= 0
##$NCOEF= 0
##$NC_proc= -8
##$NLEV= 6
##$NOISF1= 0
##$NOISF2= 0
##$NSP= 0
##$NTH_PI= 0
##$NZP= 0
##$OFFSET= 14.98061
##$PC= 1
##$PHC0= 212.8601
##$PHC1= 0
##$PH_mod= 1
##$PKNL= yes
##$PPARMOD= 0
##$PPDIAG= 0
##$PPIPTYP= 0
##$PPMPNUM= 2147483647
##$PPRESOL= 1
##$PSCAL= 4
##$PSIGN= 0
##$PYNMP= <proc.py>
##$REVERSE= no
##$SF= 400.13
##$SI= 32768
##$SIGF1= 0
##$SIGF2= 0
##$SINO= 400
##$SIOLD= 32768
##$SPECTYP= <>
##$SREGLST= <1H.CDCl3>
##$SSB= 0
##$STSI= 32768
##$STSR= 0
##$SW_p= 8223.68421052632
##$SYMM= 0
##$S_DEV= 0
##$TDeff= 65536
##$TDoff= 0
##$TI= <>
##$TILT= no
##$TM1= 0
##$TM2= 0
##$TOPLEV= 0
##$USERP1= <user>
##$USERP2= <user>
##$USERP3= <user>
##$USERP4= <user>
##$USERP5= <user>
##$WDW= 1
##$XDIM= 32768
##$YMAX_p= 417305167
##$YMIN_p= -687249
##$CURPLOT= <Network HP LaserJet P1505>
##$CURPRIN= <$Network HP LaserJet P1505>
##$DFORMAT= <normdp>
##$LAYOUT= <+/1D_H.xwp>
##$LFORMAT= <normlp>
##$PFORMAT= <normpl>
##$SURQMSG= 1
$$ End of Bruker specific parameters
$$ ---------------------------------
##NTUPLES= NMR SPECTRUM
##VAR_NAME=  FREQUENCY,     SPECTRUM/REAL,   SPECTRUM/IMAG
##SYMBOL=    X,             R,               I
##VAR_TYPE=  INDEPENDENT,   DEPENDENT,       DEPENDENT
##VAR_FORM=  AFFN,          ASDF,            ASDF
##VAR_DIM=   32768,         32768,           32768
##UNITS=     HZ,            ARBITRARY UNITS, ARBITRARY UNITS
##FACTOR=    0.250966925370066, 1,           1
##FIRST=     8223.43324360095, -70093,       -113907
##LAST=      0,             50673,           -86523
##MIN=       0,             -687249,         0
##MAX=       8223.43324360095, 417305167,    0
$$ Real data points
##PAGE= N=1
##DATA TABLE= (X++(R..R)), XYDATA
$$ [...]
$$ plain form
19539 -189682 -201241 23075 -125085 -237226 269018 -63878 8932 66345 5700 225691 64282
19527 -145058 -240955 -98887 246063 78988 -46489 -160005 43889 -46289 -325298 -75405 -125958
19516 -125958 68893 9852 -12876 124628 71205 -94806 12491 -53682 -397290 -287349 61862
19504 -278553 22905 425977 304275 -12969 -126386 -11508 -24352 -87433 34227 210498 -105634
19492 -27040 -284651 52850 112959 86302 -205095 -66962 -227640 -105881 -279443 -14240 -199418
19481 -199418 34370 188695 -21730 -29086 38207 -145513 161758 48771 -94358 -21431 -108994
19470 -108994 -186261 182619 267064 -408058 -103031 9204 278078 237736 -88064 -101446 -86040
19459 -86040 132543 -105321 -108869 76028 -26745 64596 -128144 -133801 -50519 1127 33407 335160
$$ packed form
19539a89682j1559B3075a25085j12141B69018f3878H932N7413E700K19991F4282
19527a45058r5897i8887B46063G8988d6489j13516D3889d6289k79009g5405n0553
19516a25958F8893I852a2876A24628n3423i4806A2491e3682l43608J09941F1862
19504b78553B2905M03072j21702a2969j13417a1508j2844o3081C4227J76271a05634
19492b7040k57611E2850O0109k6657b05095f6962j60678a05881j73562a4240j85178
19481a99418C4370J54325b1730p356C8207a45513A61758D8771i4358b1431q7563
19470a08994p7267A82619Q4445d08058a03031I204K68874m0342h8064j3382J5406
19459h6040A32543a05321l548G6028b6745F4596a28144n657e0519A127L2280L01753
$$ plain form
19447 335160 -126515 -41286 48138 13792 -149829 -273993 -123814 219910 120076 -68274
19436 -48898 1309 -127237 -88852 125355 -65391 -349910 -38728 -134178 -121452 -9990 42209
19424 -100515 -205238 199214 -132607 -553 124366 -390079 130327 -145388 45643 30004
19414 30004 -38897 -170384 -1335 -105459 43960 207679 -68145 18493 -37556 8534 176790
19403 176790 -310782 268742 -108006 -211369 -245191 -158000 -202806 -21969 -98630 108933
19392 -279200 -15575 -58259 88220 343693 269165 -116783 -111168 -383246 74704 -483689 -190028
19380 1855 175864 -204015 -313805 95392 16744 -142957 -364520 -16471 -26004 51644 40065
19369 40065 -340720 123497 -206028 28104 -45539 -17768 -93650 -12335 -403139 75631 164837
$$ packed form
19447C35160a26515d1286D8138A3792a49829j24164a23814B19910r9834f8274
19436d8898A309a27237L8385A25355f5391k84519c8728r5450J2726i990D2209
19424a00515j04723A99214a32607e53A24366c90079A30327a45388D5643j5639
19414C0004c8897j31487a335j04124D3960J63719f8145A8493c7556H534J68256
19403A76790c10782B68742a08006j03363l3822Q7191m4806b1969p6661A08933
19392b79200a5575m2684H8220K55473p4528a16783N615k72078G4704d83689a90028
19380A855J74009b04015j09790I5392A6744a42957k21563a6471r533E1644j1579
19369D0065c40720A23497b06028B8104d5539a7768p5882a2335l90804G5631Q9206
$$ plain form
19358 164837 61231 -41607 -158106 -96086 -63729 -458652 -127904 -153941 -175466 -195019 70892
19346 173900 2744 32730 -170922 78990 -97157 -202017 -4127 66815 -77102 128123 -206662
19334 -139572 -20162 -51745 -168175 87023 168991 -157278 -86393 -69162 239127 -260977 -7449
19322 -1583 52899 -74449 -251266 -49646 -170847 115388 68458 227265 262259 -108849 -252835
19311 -252835 155486 -70005 37019 143653 306997 61993 -109487 -4739 -330897 129590
19300 -238577 156300 259625 -63977 -194465 -289001 -120909 -394575 -26555 -452522 93547
19289 190507 118278 -43114 -86053 -141618 -71742 -160635 164045 304837 -132749 -224972 -129125
19278 -129125 -318708 -200133 88465 -79392 -76854 -129451 -33362 41041 -252663 -267758 -78206
$$ packed form
19358A64837F1231d1607j16499O2020L2357l94923a27904k6037k1525j9553G0892
19346A73900B744K9986a70922G8990i7157j04860d127F6815g7102A28123b06662
19334a39572b0162l1583j16430H7023Q1968a57278P0885J7231B39127b60977g449
19322a583E2899g4449j76817d9646j21201A15388m6930J58807L4994a08849j43986
19311b52835A55486g0005C7019J06634J63344F1993a09487d739l26158A29590
19300b38577A56300J03325f3977j30488r4536a20909k73666b6555m25967I3547
19289A90507p2229d3114m2939n5565O9876q8893A64045J40792a32749r2223R5847
19278a29125j89583J18575H8465g9392K538n2597c3362D1041b52663j5095g8206
$$ plain form
19266 118791 -91254 41877 27196 243290 -8372 -148010 147973 68456 -59780 113506 -221627
19254 103049 -4393 247789 -161929 -402990 -197632 58042 -201987 16679 -118380 -103731
19244 -103731 -311531 -130823 88572 -141953 -118920 -70847 37778 2179 -142963 253143 -118201
19232 -374190 206383 12683 -273053 159337 -13154 -182343 196914 -149556 343 -160785
19221 -273662 -24480 -34197 -186711 -236960 -181044 156954 -23690 198336 -202893 -76737 -92089
19210 -92089 -100836 3975 108371 13756 -321225 74247 -263544 -225998 -98345 -121313 373661
19198 -450156 137383 191184 -149997 104455 -106697 -30630 -27184 -182958 -59446 34049 -60258
19186 -178769 -22239 -61904 41573 -13013 231175 214397 219108 -269798 67106 109719 12104
$$ packed form
19266A18791i1254D1877j4681K16094h372j39638A47973F8456e9780A13506b21627
19254A03049d393B47789a61929k41061a97632E8042b01987A6679a18380J4649
19244a03731k07800a30823H8572a41953K3033M8073C7778B179a42963B53143a18201
19232c74190B06383A2683b73053A59337a3154j69189A96914a49556C43a60785
19221b73662b4480r717j52514n0249N5916A56954b3690A98336b02893g6737j5352
19210i2089q747C975J04396A3756c21225G4247b63544L7546i8345k2968C73661
19198d50156A37383N3801a49997A04455a06697c0630L446j55774e9446C4049f0258
19186a78769b2239l9665D1573a3013B31175j6778M711b69798F7106M2613A2104
$$ plain form
19174 108655 -19945 148365 27899 -273827 -200586 470756 -167967 51973 -109874 -283870
19164 -283870 -112282 -146120 -112047 13022 -139627 176928 -341830 57022 -183853 7188 31414
19153 31414 1562 75097 12755 -52707 -479081 -138799 20097 -259325 -340959 37230 135490
19142 135490 38692 -406134 57770 54339 -68669 -180248 -57744 -52975 -271717 75341 -75502
19130 -179465 38762 51815 -42892 -125385 -316599 272407 -217889 215628 94420 -20977 -221646
19119 -221646 -44571 169592 -90440 398779 -107362 -12696 -81880 -314435 74485 241755
19109 241755 -125988 -5774 -163397 -134861 -207364 321472 -13717 39217 120577 -385652 -27070
19097 139521 150462 -20792 -50789 -186995 118587 151218 114378 -55042 115178 122818 103233
$$ packed form
19174A08655a9945A48365B7899b73827P3241D70756a67967E1973a09874j73996
19164b83870a12282l3838L4073A3022a39627A76928c41830E7022a83853G188K4226
19153C1414A562P3535A2755e2707m26374a38799B0097b59325q1634C7230R8260
19142A35490C8692d06134E7770l431f8669j11579e7744M769k18742G5341g5502
19130a79465C8762J3053d2892q2493j91214B72407b17889B15628I4420b0977k00669
19119b21646d4571A69592i0440C98779a07362a2696o9184k32555G4485J67270
19109B41755a25988e774j57623K8536p2503C21472a3717C9217Q1360c85652b7070
19097A39521J0941b0792k9997j36206A18587L2631l6840e5042A15178P640j9585
$$ plain form
19086 103233 -212705 272782 -63937 -108409 -89714 -23715 -222052 -397699 -119440 -22766
19075 -87377 -352217 76419 48327 -99273 -80828 237841 -152450 -185782 -67544 306790 -118404
19063 -2904 -124975 -68301 -23963 -156172 -269822 126058 -98664 57664 56922 -246769 -3143
19051 151022 -116546 -31751 -322682 -275016 154852 -269667 -252883 -130047 31872 -187403
19040 -186636 82032 99954 -109555 118306 132152 -74135 -587744 -116979 -84364 236260
19029 54178 481820 -164802 52729 239406 208131 -253269 87472 -47275 -309830 71470 -38606
19017 -36250 79047 132011 -268564 108458 -81503 -291624 -196773 138125 -40447 -165211 7669
19005 80074 64301 135267 -89417 -109743 23616 -176012 -110093 232731 -164700 -231265 136596
$$ packed form
19086A03233b12705B72782f3937m4472J8695b3715j98337j75647a19440b2766
19075h7377k64840G6419k8092i9273J8445B37841a52450l3332f7544C06790a18404
19063b904j22071N6674b3963j32209j13650A26058i8664E7664p42b46769c143
19051A51022a16546c1751k90931M7666A54852b69667J6784J22836C1872a87403
19040a86636H2032J7922a09555A18306J3846g4135n13609a16979L2615B36260
19029E4178M27642a64802E2729J86677l1275b53269H7472d7275k62555G1470c8606
19017c6250G9047N2964b68564A08458h1503k10121R4851A38125d0447j24764G669
19005H0074j5773P0966h9417k0326B3616a76012O5919B32731a64700o6565A36596
$$ plain form
18993 -35766 -235204 -72794 104871 63973 44769 -54878 -241381 213503 -244902 -275251 -14440
18981 -100691 -302072 122070 15345 -298764 -150114 -163812 141693 -314161 72145 2965
18970 -1159 196231 76778 -308310 207078 265762 20897 464232 -50328 67893 -99054 -60565
18959 -60565 -32149 -29681 -48285 -164647 243 -235049 -409379 40719 -68023 78627 88378 36144
18946 -243268 -307314 -227692 -52300 385531 60762 -103547 293919 317901 51105 -23292 -142231
18935 -142231 109148 -35474 -215210 -59811 -95481 325126 -11513 15522 -112149 -6274 203216
18923 -136681 -52226 -191914 50163 -144258 146776 -336563 304649 100745 -218994 -107110
18912 95604 -158856 -183161 -26448 -98310 -122947 -241479 -146565 -63552 312192 -193148 -158204
$$ packed form
18993c5766j99438g2794A04871m0898j9204e4878j86503B13503b44902l0349a4440
18981a00691k01381A22070A5345b98764J48650j3698A41693c14161G2145B965
18970a159A96231G6778c08310B07078N8684B0897M43335e0328F7893i9054L8489
18959f0565K8416K468j8604j16362B43b35049j74330D0719f8023G8627R751C6144
18946b43268o4046P9622e2300C85531F0762a03547B93919K3982E1105b3292j18939
18935a42231A09148c5474j79736e9811l5670C25126a1513A5522a12149f274B03216
18923a36681e2226j39688E0163a44258A46776c36563C04649A00745b18994a07110
18912I5604a58856k4305b6448p1862k4637j18532R4914f3552C12192a93148L4944
$$ plain form
18901 -158204 -155148 6428 100853 -169036 25899 -80926 -289434 -103229 -360865 12863 204682
18890 204682 -98352 -2252 167324 -2657 -181192 -86676 -250113 18395 74637 -54418 -48466
18879 -48466 -110235 -95495 -2814 -40091 75007 13889 35297 -202946 -298747 27069 -50991 102915
18866 -116041 120666 -154363 -212062 -244249 -500481 -75359 22299 -44597 -144353 -4015 -6979
18855 -6979 3551 11267 -161738 89904 -149334 -55374 216219 17044 -256432 44585 327044
18844 327044 225243 44291 -355570 10647 -218745 213307 -157510 -131509 172213 209017
18834 209017 -354321 -111997 -188698 -138272 -151996 -18702 -36783 -136532 -10831 -95087 -152876
18823 -152876 -165099 -74869 -53363 118959 130807 53551 -243910 9544 186071 -105693 -157185
$$ packed form
18901a58204L056F428R4425a69036B5899h0926k08508a03229k57636A2863J91819
18890B04682i8352b252A67324b657j78535h6676j63437A8395N6242e4418N952
18879d8466o1769J4740b814l7277G5007A3889K1408b02946r5801B7069e0991A02915
18866a16041A20666a54363n7699l2187k56232g5359B2299d4597r9756d015k964
18855f979C551P716a61738H9904a49334e5374B16219A7044b56432D4585K82459
18844C27044j01801D4291c55570A0647b18745B13307a57510K6001A72213L6804
18834B09017c54321a11997p6701N0426j3724a8702j8081r9749a0831q4256n7789
18823a52876j2223g4869K1506A18959J1848E3551b43910I544J76527a05693n1492
$$ plain form
18812 -157185 -31545 63431 57553 230880 -17575 -423578 -116859 50003 38148 -255380 47216
18800 -73367 -133552 215904 -61281 -22958 149377 -390579 -108797 292355 305129 -119364
18789 57633 -371653 -235951 239217 -189246 -2947 -152998 -272537 93890 91123 -271309 -108338
18777 -53662 -46630 -256104 37298 -43498 -150515 47157 -279174 -52915 22653 26105 55580
18766 55580 -161463 -53536 -457954 -22742 -152784 -132512 -57561 363831 -109342 -99690 60826
18754 -159640 -72409 -254159 -174027 390901 -160066 302514 -149766 -41863 54773 -71386
18743 -141704 -165596 53773 -77362 -76363 98011 -141782 -89074 -159330 -783 333129 146711 -133358
18730 -194478 200269 -104759 -30526 102706 -28725 94619 33397 87468 12473 12801 176300
$$ packed form
18812a57185c1545F3431n878J73327a7575m06003a16859E0003j1855b55380D7216
18800g3367o0185B15904f1281b2958A49377c90579a08797B92355J2774a19364
18789E7633c71653J35702B39217a89246b947j50051j19539I3890k767b71309a08338
18777e3662P032k09474C7298d3498j07017D7157b79174e2915B2653L452K9475
18766E5580a61463e3536m04418b2742j30042K0272e7561C63831a09342R652F0826
18754a59640g2409j81750Q0132C90901a60066C02514a49766d1863E4773g1386
18743a41704k3892E3773g7362R99I8011a41782N2708p0256g83C33129A46711a33358
18730a94478B00269a04759c0526A02706b8725I4619C3397N4071A2473L28J63499
$$ plain form
18719 176300 353715 -426863 -192436 44075 -243037 -404611 -192701 -35151 -120017 97468
18708 128336 -260930 -108418 -171744 78307 -187528 -69701 -244434 -137513 -291263 -262977
18698 -262977 -124302 178208 9213 44528 131296 -264899 -17833 2505 -362837 -158925 52665
18686 -50068 26187 31055 -185492 146482 -149982 75196 108656 5012 -186322 -86825 246184
18674 -134319 102006 -1779 -46809 201683 -270983 -85214 -36332 -97745 -81528 76865 -7593
18662 -176132 -425032 148833 30467 95915 80585 -150998 -128244 85839 -110440 -88187 173185
18650 99653 -34335 -5655 302080 326872 321774 27354 253226 47430 154329 -38997 -121392
18639 -121392 -222180 -133401 114459 93631 -211440 109276 -110268 86067 -95575 -61597
$$ packed form
18719A76300J77415d26863a92436D4075b43037j61574a92701c5151q4866I7468
18708A28336b60930a08418o3326G8307a87528f9701j74733J06921j53750K8286
18698b62977a24302A78208I213L5315Q6768b64899a7833B505c62837a58925E2665
18686e0068B6187M868a85492A46482a49982G5196L3460E012a86322h6825B46184
18674a34319A02006a779m5030B01683b70983h5214c6332o1413J6217G6865g593
18662a76132k48900A48833C0467O5448j5330a50998K2754H5839a10440K2253A73185
18650I9653c4335e655C02080K4792n098B7354K25872D7430J06899c8997q2395
18639a21392j00788Q8779A14459k0828b11440A09276a10268H6067i5575L3978
$$ plain form
18629 -61597 -32381 120414 -256252 -44308 50773 -34852 -15189 32266 111533 -104503 -44018
18617 94643 -7673 -188082 -140706 -136903 55830 62056 -121986 125773 -182271 -269799 108236
18605 -61902 76812 44911 -134749 11089 -92521 -336017 -126707 -166313 313118 -223139 -191646
18594 -191646 6497 127776 -215944 -156943 -78160 53123 115544 -54065 -19788 -8747 31423
18582 -153482 -247768 40256 -50631 -205953 -120341 116187 -362101 391290 109701 383285
18572 383285 112140 39908 336485 -73761 138589 18502 -76967 110536 -172637 135477
18561 -112728 -404274 -167905 -25553 112199 -128888 108586 -182007 -408909 -194705 -127961
18551 -127961 75457 -194412 109879 144579 180464 -134485 -421138 -140726 -86469 -64060
$$ packed form
18629f1597K9216A20414b56252d4308E0773c4852a5189C2266P9267a04503d4018
18617I4643g673j80409M7376L803E5830O226a21986A25773a82271q7528A08236
18605f1902G6812l1901a34749A1089i2521k43496a26707l9606C13118b23139L1493
18594a91646F497J21279b15944N9001g8160E3123O2421e4065a9788h747C1423
18582a53482r4286D0256e0631j55322Q5612A16187c62101C91290A09701K73584
18572C83285A12140C9908K96577g3761A38589A8502g6967A10536a72637A35477
18561a12728k91546a67905b5553A12199a28888A08586a82007k26902a94705O6744
18551a27961G5457a94412A09879L4700L5885a34485k86653a40726N4257K2409
$$ plain form
18541 -64060 -253290 -204252 -220045 -117232 98592 -111775 355160 -230472 -115090 88296
18530 -88301 -197252 137702 -48934 196091 225158 -262441 52046 70381 -244392 -113472
18519 252398 237031 70867 90296 -111940 -105255 -38114 148765 44090 -157050 30357 72598
18508 72598 -189731 62259 -169437 -71601 -16432 -89831 -211624 -37747 176957 -85531 -72117
18497 -72117 59650 193152 -96481 -346120 -152430 36552 -158095 260157 -276876 207675
18486 -259202 -73900 -403565 -103008 -88082 -112579 -78308 -119042 27412 -156442 -70272 199449
18474 130994 -124588 115701 -9359 -31897 -86853 -157218 -29126 67129 -67099 28550 -39043
18462 -74700 100091 -111621 -9155 -236861 -166966 -102388 -140924 171013 -251057 -46609 -71071
$$ packed form
18541f4060j89230M9038j5793J02813I8592a11775C55160b30472a15090H8296
18530h8301j08951A37702d8934A96091K9067b62441E2046J8335b44392a13472
18519B52398j5367G0867J9429a11940O685c8114A48765D4090a57050C0357M2241
18508G2598a89731F2259a69437g1601a6432p3399j21793c7747A76957h5531J3414
18497g2117E9650J33502i6481k49639a52430C6552a58095B60157b76876B07675
18486b59202g3900l29665a03008J4926k4497L4271m0734B7412a56442g0272A99449
18474A30994a24588A15701i359k2538n4956p0365b9126F7129f7099B8550c9043
18462g4700A00091a11621i155k27706O9895O4578l8536A71013b51057d6609k4462
$$ plain form
18451 -71071 -129426 78367 -193119 -227823 85235 59732 78353 -331490 -299682 -141120 86846
18439 39778 -198791 180712 -101123 104819 -211799 -56938 27546 65566 -65168 -5345 -183152
18428 -183152 -13556 36110 501 -219735 98620 248927 -55523 -13021 -223033 -127534 110066
18416 -60313 398294 216979 -322176 104255 -155434 -151122 -21377 42369 -79075 -209473 -223852
18405 -223852 -5478 -301308 -67345 -267279 5041 -317821 164147 -270540 -140819 -178150 138211
18393 -5047 -63438 225089 -38545 -25017 26958 232073 506667 39890 234924 -78546 -212440
18382 -212440 -109431 -182860 -138020 97030 -177746 82112 205323 -98382 238105 81938 243698
18371 243698 -242122 159494 137533 -30964 -72556 -145411 -116713 69537 77370 167517 -193552
$$ packed form
18451g1071n8355G8367a93119l4704H5235k5503J8621c31490L1808a41120H6846
18439C9778a98791A80712a01123A04819b11799e6938B7546L8020f5168e345j77807
18428a83152a3556C6110E01b19735I8620J50307e5523a3021k10012R5499A10066
18416f0313C98294j81315c22176A04255a55434M312b1377D2369g9075j30398j4379
18405b23852e478k95830f7345j99934E041c17821A64147b70540J29721l7331A38211
18393e047n8391B25089c8545J3528B6958K05115K74594C9890J95034g8546j33894
18382b12440J03009p3429M4840I7030a77746H2112J23211i8382B38105H1938J61760
18371B43698b42122A59494k1961c0964m1592p2855K8698F9537P833R0147a93552
$$ plain form
18359 212038 208474 -202673 36293 61555 452959 60700 -66366 40813 -104832 -264749 44974
18347 98912 -60658 191182 -136708 161347 -190267 250983 -195294 82711 -231845 40890
18336 203754 -184927 -244522 165657 -183865 112057 -160057 300168 -28569 322172 195806
18326 195806 181839 -192769 -23432 -103697 97470 -119936 -233573 -31216 105374 -274608
18315 -94476 108702 -206729 162963 -160107 -228196 -155289 294155 -159128 -138892 -191476
18305 -191476 -205327 5961 -365554 -259996 -386477 96576 52366 -22996 -242744 263136 -153865
18293 -126805 159253 -61750 51960 -44206 -80995 157314 -198682 17807 -1989 22420 187414
18282 187414 -174875 -157685 -34774 19768 116453 -41717 -312511 47779 -15752 -334254 -41699
$$ packed form
18359B12038l564b02673C6293K5262L91404F0700f6366D0813a04832j59917D4974
18347I8912f0658A91182a36708A61347a90267B50983a95294H2711b31845D0890
18336B03754a84927n9595A65657a83865A12057a60057C00168b8569C22172j26366
18326A95806j3967a92769b3432q0265I7470a19936j13637c1216A05374b74608
18315i4476A08702b06729A62963a60107o8089P2907B94155a59128K0236n2584
18305a91476j3851E961c65554J05558j26481I6576m4210b2996k19748B63136a53865
18293a26805A59253f1750E1960d4206l6789A57314a98682A7807a989B2420J64994
18282A87414a74875J7190c4774A9768R6685d1717k70794D7779a5752l18502d1699
$$ plain form
18270 -131407 152772 275963 -382608 -70155 -129422 -41371 -243395 -3903 -121904 -120005 -129725
18259 -129725 93561 56833 -221719 144227 123944 -25997 -287529 -117469 256781 -279654
18248 157205 172647 -179320 55582 4140 -167524 68004 -37677 27194 -22797 224183 257022
18237 257022 -10074 99147 -75799 209863 -46904 -79554 -79146 64710 7619 95569 189507 -25304
18224 49364 -260060 215566 173567 -290416 31212 -135336 48124 -83754 72156 77889 -82525
18212 -254421 -126519 -358925 -163883 84469 -85405 -2919 311097 23084 212946 -88586 -232046
18201 -232046 42192 5561 98495 192131 -12296 -130225 27967 -46949 282662 148575 -19033
18189 124189 -21446 -225017 19889 -66394 -65468 133262 8049 185274 55337 74669 -160890
$$ packed form
18270a31407A52772J23191c82608g0155n9267d1371k02024c903j18001J899r720
18259a29725I3561l6728b21719A44227k0283b5997k61532a17469B56781b79654
18248A57205J5442a79320E5582D140a67524F8004c7677B7194b2797B24183L2839
18237B57022a0074I9147g5799B09863d6904l2650M08F4710G619Q7950R3938b5304
18224D9364b60060B15566m1999b90416C1212a35336D8124h3754G2156N733h2525
18212b54421a26519k32406a63883H4469h5405b919C11097B3084J89862h8586j43460
18201b32046D2192E561R2934R3636a2296j17929B7967d6949B82662j34087a9033
18189A24189b1446k03571A9889f6394R26A33262H049J77225E5337J9332a60890
$$ plain form
18177 -55239 -190005 -228234 -70647 -212313 228734 -82360 -29708 -313199 -57274 -121439 142940
18165 83501 131888 -130052 375527 -119591 324292 101286 -68236 39265 -191359 45655
18154 -189284 -220525 147818 252346 151417 -418930 -256639 -205070 171040 141226 -60425
18143 -109675 121448 -42070 387885 -189860 -267706 -36497 -79623 47319 -210414 -277233 29266
18131 127999 97705 -54331 126732 92973 71164 76195 67725 -235892 -127659 -91633 102632
18119 187468 54306 38641 -221013 -95950 -142502 -67460 100717 118128 130108 85560 210621
18108 210621 170164 -2876 -69759 -99050 20785 18056 64953 -82998 -366706 -99110 -375667
18097 -375667 -40519 -53065 23914 -55627 -361427 4546 -117574 -254029 -56747 34536 -288712
$$ packed form
18177e5239j34766l8229g0647j41666B28734h2360b9708k83491e7274o4165A42940
18165H3501M8387a30052C75527a19591C24292A01286f8236C9265a91359D5655
18154a89284l1241A47818J04528j00929d18930J62291N1569A71040k9814f0425
18143a09675A21448d2070C87885a89860p7846c6497m3126D7319b10414o6819B9266
18131A27999l0294e4331A26732l3759k1809N031q470b35892J08233L6026A02632
18119A87468E4306j5665b21013i5950m6552f7460A00717J7411J1980m4548J25061
18108B10621m0457b876o6883k9291B0785k729M6897h2998k83708i9110k76557
18097c75667d0519j2546B3914e5627l05800D546a17574j36455e6747C4536b88712
$$ plain form
18085 -227040 -17072 -193020 -256448 206073 330043 -162641 163100 -245147 54337 -178437
18074 239811 -287205 131903 19573 232728 120618 381843 -60631 96634 166187 -212574
18063 -83109 88854 63977 -91439 -140044 -14595 47481 173919 -17655 -9697 121220 -97347
18051 25600 -123318 -220403 -184790 192400 -324069 29823 -460966 -13103 -281895 -65533 -106705
18040 -106705 125549 -330322 -8177 -43146 298692 -285724 -61178 -253596 -300545 -363561 19675
18028 -112004 92135 -16720 -12561 -72252 -128152 -241189 40308 161611 12994 -51525 196640
18016 -151250 227232 -284011 28890 247863 -180421 223963 -105556 4139 168447 272126
18006 272126 110734 -139151 211067 88409 -92578 -56494 49332 -236599 -307646 274514
$$ packed form
18085b27040a7072j75948o3428B06073J23970a62641A63100b45147E4337a78437
18074B39811b87205A31903A9573K13155j12110K61225f0631I6634O9553b12574
18063h3109H8854k4877i1439m8605a4595D7481J26438a7655P958A21220i7347
18051B5600a23318r7085L5613A92400c24069B9823d60966a3103k68792f5533m1172
18040a06705A25549c30322h177l4969B98692b85724f1178j92418m6949o3016A9675
18028a12004I2135a6720M159n9691n5900j13037D0308J21303A2994e1525A96640
18016a51250B27232b84011B8890K18973a80421B23963a05556D139J64308J03679
18006B72126A10734a39151B11067H8409i2578L6084D9332b36599p1047B74514
$$ plain form
17995 -199454 -191228 44402 -61573 64221 212723 -174019 10045 -45664 81601 -133480 214503
17983 -56693 -55640 185461 -8595 167174 131860 124956 223530 -251398 -153791 88515 -396286
17971 14248 -100133 -296756 101572 56181 -28260 -55968 208354 311911 -36633 43839 -322737
17959 -327609 83798 -14707 -176224 -131403 -242467 -8359 -335947 -234785 -177635 -30148 39053
17947 329474 -93126 153693 290302 37545 -165198 43661 -123636 -273238 -9609 -133258
17937 -133258 8327 363257 -24241 -126974 261645 173641 -228963 -124977 176950 336706
17927 336706 77319 -80871 13806 114259 -100371 -67655 -54942 -24771 61532 -141090 -32775
17915 -233204 -159123 -28850 169280 37182 222773 -31363 29925 -154020 101833 188597 116501
$$ packed form
17995a99454Q226D4402f1573F4221J48502a74019A0045d5664H1601a33480B14503
17983e6693J053A85461h595A67174l5314o904R8574b51398R7607H8515c96286
17971A4248a00133j96623A01572m5391b8260k7708B08354J03557c6633D3839c22737
17959c27609H3798a4707j61517M4821j11064h359l27588J01162N7150c0148C9053
17947C29474i3126A53693J36609C7545a65198D3661a23636j49602i609j23649
17937a33258H327L54930b4241j02733B61645q8004b28963J03986A76950J59756
17927C36706G7319h0871A3806J00453a00371L2716J2713b4771F1532a41090c2775
17915b33204P4081b8850A69280C7182J85591c1363B9925a54020A01833Q6764p2096
$$ plain form
17904 116501 96855 349663 41312 -96479 -119596 41405 -253986 2251 68592 69260 73007 -99136
17891 52963 -45614 58889 102497 262434 393159 208099 21584 18611 126048 -28804 340612
17879 -237073 155345 -309245 24656 85009 44876 -116072 -164046 -20125 -16996 -40594 73465
17867 -22189 -101980 9143 -222040 155017 20660 -239970 31659 146330 -85902 -69084 127180
17855 78667 -205878 35453 -92292 134837 -95517 -82079 45836 -27645 -226752 -74648 226617
17843 260020 -32514 87989 7112 10762 26423 -43595 114755 18189 187574 -94128 66973
17831 34759 -281259 95328 103676 -307431 -199273 -20170 -79438 116083 -85470 -88176 -267492
17820 -267492 49735 137082 156447 -169109 -13868 106285 2485 -187417 -326357 47446 -68131
$$ packed form
17904A16501j9646K52808D1312i6479k3117D1405b53986B251O6341O68L747i9136
17891E2963d5614E8889M3608J59937J30725j85060B1584k973J07437b8804C40612
17879b37073A55345c09245B4656O0353m0133a16072m7974b0125L129k3598G3465
17867b2189p9791I143b22040A55017B0660b39970C1659J14671h5902J6818A27180
17855G8667b05878C5453i2292A34837i5517J3438D5836b7645j99107g4648B26617
17843B60020c2514H7989G112L650J5661d3595A14755A8189J69385i4128F6973
17831C4759b81259I5328Q348c07431J08158b0170n9268A16083h5470k706j79316
17820b67492D9735Q7347J9365a69109a3868A06285B485a87417j38940D7446f8131
$$ plain form
17808 239631 116678 -141310 -214339 37805 169093 -77230 -85733 -5774 18032 152008 -238400
17796 76864 52813 197396 104187 203159 -396048 -95806 147905 26615 100505 -21937 -89997
17785 -89997 -284052 -106201 26995 97493 -107691 6891 -133934 47705 -142774 33541 292670
17774 292670 -189548 129533 -220140 35093 -109214 -46446 318341 -321851 109562 -267697
17763 167119 -257086 226434 226215 -19180 26104 113722 272271 337688 -219840 369752 54495
17751 -27696 175973 -135737 -239508 68655 44295 -17301 81157 -60173 157150 -68335 -111334
17740 -111334 -84119 40037 -33371 -117060 -378311 272781 -259375 -203117 68655 62969 59335
17729 59335 -198155 -66759 -132933 -26027 -42341 22547 -21178 142717 213273 -149959 -103569
$$ packed form
17808B39631A16678a41310p3029C7805J31288g7230q503e774A8032J33976b38400
17796G6864k4051J44583r3209R8972c96048i5806A47905B6615P3890b1937o8060
17785h9997j94055a06201B6995P0498a07691F891a33934D7705a42774C3541K59129
17774B92670a89548A29533b20140C5093a09214d6446C18341c21851A09562b67697
17763A67119b57086B26434k19a9180B6104Q7618J58549O5417b19840C69752E4495
17751b7696A75973a35737j03771F8655k4360a7301H1157f0173A57150f8335m2999
17740a11334K7215D0037c3371q3689k61251B72781b59375N6258F8655n686l634
17729E9335a98155f6759o6174b6027j6314B2547b1178A42717P0556a49959M6390
$$ plain form
17718 -103569 231563 -335088 66710 -16064 -491624 58748 -45006 381390 -110347 39857
17707 -52466 -38862 371613 -119603 74575 -120217 207324 -108059 -167129 284306 -87082
17696 -56591 -164886 4964 -153318 -17803 -128016 79376 159996 -76293 -41436 488423 -177811
17684 -111406 262637 230076 -14985 301562 -119717 192183 143608 16331 35118 -106715
17673 -45980 -33590 126182 102353 82111 -38691 16825 256854 -205918 -30797 -45610 18304
17661 71396 -147375 -101334 175935 204938 -58566 232860 34436 69782 -247778 -82249 28184
17649 116672 267124 214956 82408 -161302 129780 91602 266272 51516 149581 -294626
17638 -12377 70948 -278986 -207284 -99993 188598 -65147 109495 12706 -155533 33413 215438
$$ packed form
17718a03569B31563c35088F6710a6064m75560E8748d5006C81390a10347C9857
17707e2466J3604C71613a19603G4575a20217B07324a08059n9070B84306h7082
17696e6591j08295D964a53318a7803j10213G9376Q0620g6293L4857D88423a77811
17684a11406B62637l2561a4985C01562a19717A92183m8575A6331J8787a06715
17673d5980J2390A26182k3829k0242c8691A6825K40029b05918c0797j4813A8304
17661G1396a47375M6041A75935K9003e8566B32860C4436L5346b47778h2249B8184
17649A16672J50452n2168H2408a61302A29780l8178J74670E1516R8065b94626
17638a2377G0948b78986P1702i9993A88598f5147A09495A2706a55533C3413J82025
$$ plain form
17627 215438 141813 161932 -169589 -10626 127714 305846 152026 54014 425390 12357
17616 -40463 -117950 272214 -13738 -216431 -2577 150711 141946 -87013 120772 64978 -20051
17604 232168 79096 -248109 17314 -210110 -127871 198652 -84027 -35144 -130074 -43890 -86470
17593 -86470 -21885 2976 48317 187305 -293842 -16166 201193 221706 120123 184905 42318
17581 -418885 -58829 128199 242711 224044 41444 -74585 245585 -12890 -13409 323609 -354251
17569 -258328 167958 91727 -200534 120405 242153 55396 -267233 37026 26022 -48256
17558 160401 158443 -180920 -46344 73599 -87484 -30840 116331 133378 -80532 134010 -265379
17546 -104540 19748 -69986 261811 234901 105900 175421 89173 299954 -144207 -30587 32232
$$ packed form
17627B15438p3625K0119a69589a0626A27714J78132A52026E4014L71376A2357
17616d0463p7487B72214a3738k02693b577A50711q765h7013A20772n5794b0051
17604B32168G9096b48109A7314b10110Q2239A98652h4027c5144r4930d3890m2580
17593h6470b1885B976M5341J38988b93842a6166B01193K0513j01583O4782D2318
17581d18885e8829A28199J14512j8667D1444g4585B45585a2890n19C23609c54251
17569b58328A67958p6231b00534A20405J21748E5396b67233C7026j1004d8256
17558A60401j958a80920d6344G3599h7484c0840A16331J7047h0532A34010b65379
17546a04540A9748f9986B61811k6910A05900O9521q6248K10781a44207c0587C2232
$$ plain form
17534 -18769 80638 -129386 475205 -167345 189901 95678 135994 11278 78815 -133363 -37517
17522 -19930 16484 389343 496603 -34755 233063 -30507 215527 -403568 -152284 -57620
17511 118418 185754 161007 -100516 158090 120075 200394 321471 -109003 258044 -122782
17500 -25972 213317 -20759 156856 285731 186379 80647 190533 93120 -30123 227462 389342
17489 389342 292484 179452 42616 167853 -16414 17026 -96130 127003 -10277 201313 168895
17478 168895 94427 233737 278008 212604 183674 180440 -71010 161365 173083 167712 311332
17467 311332 86931 160936 359372 266953 116060 545453 48466 224564 39910 208652
17457 208652 398224 12116 220775 196470 489407 165950 272156 207420 -258098 415008
$$ packed form
17534a8769H0638a29386D75205a67345A89901r4223M0316A1278O7537a33363c7517
17522a9930A6484L72859J07260c4755B33063c0507B15527d03568a52284e7620
17511A18418O7336k4747a00516A58090l8015Q0319J21077a09003B58044a22782
17500b5972B13317b0759A56856J28875r9352H0647J09886I3120c0123B27462J61880
17489C89342r6858j13032D2616J25237a6414A7026i6130A27003a0277B01313l2418
17478A68895p4468J39310M4271o5404k8930l234g1010A61365J1718n371J43620
17467C11332H6931P4005J98436r2419A16060M29393D8466J76098C9910J68742
17457B08652J89572A2116K08659k4305K92937A65950J06206o4736b58098D15008
$$ plain form
17446 108339 169132 172158 125435 196772 40333 495161 76212 219907 186781 176124 153242
17435 153242 115175 212574 367750 215696 -47710 76231 77744 163084 158090 275785 353734
17424 353734 142639 141720 -106088 228920 260849 205553 7328 160131 465818 259126 242164
17413 242164 315674 158213 245402 283885 115484 173987 -12043 185235 488168 301071
17403 301071 181414 219382 79677 275091 385563 144979 -113786 361776 235146 -128978
17392 206772 349066 102397 206670 114569 5581 194071 259225 79321 -275670 -2446 398906
17380 53545 57096 253223 109682 143645 75792 -3313 295701 236450 234548 -52014 334467
17368 216898 -15572 29938 75117 -45666 64452 2939 -32213 -79762 378737 -12821 130407
$$ packed form
17446A08339O0793L026m6723P1337D0333M54828G6212J43695l3126j0657k2882
17435A53242l8067R7399J55176j52054d7710G6231J513Q5340m994J17695P7949
17424C53734A42639r19a06088B28920L1929n5296G328J52803L05687k06692j6962
17413B42164P3510j57461Q7189L8483A15484N8503a2043A85235L02933j87097
17403C01071j19657L7968G9677J95414J10472A44979a13786C61776j26630a28978
17392B06772J42294A02397J04273r2101E581J88490O5154G9321b75670b446C98906
17380E3545L551J96127A09682L3963o7853c313B95701n9251j902e2014C34467
17368B16898a5572B9938M5179d5666F4452B939c2213m7549C78737a2821A30407
$$ plain form
17356 261133 235925 -69123 -14892 -47802 624764 -167353 126996 9090 -1393 130292 115608
17345 115608 -26733 170436 178894 -81888 18708 -117382 31911 178444 92550 48567 370984
17334 370984 -92488 93531 217827 218601 167436 135039 19752 -50179 256784 186777 278836
17323 278836 -338460 332795 140983 62402 1612 -14217 279961 226469 245458 -17321 -189637
17312 -189637 52141 172483 450385 -67354 225365 -64025 -169097 137736 325608 330857
17302 330857 9813 -212134 213521 289789 280950 270675 203298 74034 122848 206550 139479
17291 139479 49697 -9926 144628 82607 213 -25235 58563 194237 110203 190166 32616 231838
17279 231838 308161 156921 270300 376371 -103310 253104 379449 28239 308750 166392
$$ packed form
17356B61133k5208f9123a4892l2910F24764a67353A26996I090a393A30292j4684
17345A15608b6733A70436Q458h1888A8708a17382C1911J46533q5894m3983L22417
17334C70984i2488I3531J24296P74n1165l2397A9752e0179B56784p0007R2059
17323B78836c38460C32795A40983F2402A612a4217B79961n3492J8989a7321j72316
17312a89637E2141J20342K77902f7354B25365f4025j05072A37736J87872N249
17302C30857I813b12134B13521P6268q839j0275o7377G4034M8814Q3702o7071
17291A39479D9697i926A44628o2021B13b5235E8563J35674q4034P9963C2616J99222
17279B31838P6323j51240J13379J06071a03310B53104J26345B8239K80511j42358
$$ plain form
17269 166392 115032 -1436 256989 371487 75423 660021 337094 296734 283143 175710 204818
17258 204818 54843 13363 88418 215816 75788 309613 216555 50281 181635 -82238 151528
17246 354510 346490 160369 209899 1124 345781 130802 83915 250525 489477 346683 222330
17235 222330 168936 -22289 -131865 243808 14648 -3631 182734 264212 241052 186073 23090
17223 -56522 -48476 311359 522616 364884 344876 198615 241631 -71459 161362 146870 623996
17212 623996 446728 202684 296380 -214353 -171460 166777 218547 340957 -98593 -11328
17201 236612 151700 129019 60390 64725 -244783 390002 215740 115304 401594 269083
17191 269083 284339 282075 553313 139412 103923 330197 -75946 208062 119896 228282 387131
$$ packed form
17269A66392n1360a436B56989J14498G5423N84598l22927m0360j3591j07433K9108
17258B04818E4843A3363P5055J27398G5788K33825r3058E0281J31354h2238A51528
17246C54510q020A60369M9530A124L44657A30802m6887J66610K38952j42794j24353
17235B22330n3394b2289j09576B43808A4648c631A82734Q1478k3160n4979B3090
17223e6522Q046C11359K11257j57732k0008j46261M3016g1459A61362j4492M77126
17212F23996j77268B02684R3696b14353M2893A66777N1770J22410i8593a1328
17201B36612q4912k2681F0390M335b44783C90002j74262j00436K86290j32511
17191B69083J5256k264K71238A39412l5489K26274g5946B08062q8166J08386J58849
$$ plain form
17180 387131 543583 88893 248548 176857 191556 491969 200656 288193 172083 587595
17170 587595 210463 228364 139732 219037 211778 -11590 281992 87741 290319 265588 401181
17159 401181 412772 117245 283772 437847 429314 153274 363429 517970 300303 663307
17149 663307 381984 451285 239580 163644 19522 26252 342755 182210 260336 237013 445120
17138 445120 269723 451489 224492 533624 128044 409798 50355 112279 480089 296298
17128 296298 -104852 98818 487364 491446 449061 447517 278204 334397 316430 148106 261656
17117 261656 257931 561545 245473 351021 494045 652656 271814 328426 415816 170920
17106 189143 327802 314027 262614 152421 330114 328345 312198 144927 142214 14887 -76214
$$ packed form
17180C87131J56452H8893J59655p1691J4699L00413B00656Q7537j16110M15512
17170E87595B10463J7901q8632P9305p259a1590B81992H7741K02578k4731J35593
17159D01181J1591A17245J66527J54075q533A53274K10155J54541k17667L63004
17149F63307k81323O9301k11705p5936A9522O730L16503j60545P8126k3323K08107
17138D45120j75397J81766B24492L09132A28044K81754E0355O1924L67810j83791
17128B96298a04852I8818L88546M082m2385j544j69313N6193j7967A48106J13550
17117B61656l725L03614B45473J05548J43024J58611B71814N6612Q7390A70920
17106A89143J38659j3775n1413j10193J77693j769j6147A44927k713A4887g6214
$$ plain form
17094 209265 228837 400267 276009 376959 360131 624660 462091 619731 357495 91567
17083 54054 416216 329840 330758 475206 639974 492985 523998 354742 404776 506373 375650
17072 375650 339240 506768 177306 437626 531514 188490 507467 134970 413818 194111
17061 152396 387764 172449 365491 310402 267430 485353 773912 463679 405068 505005
17051 505005 727783 519684 641859 376279 432375 565546 328853 365314 348688 782560
17041 782560 607331 397842 447996 340440 404168 711667 476638 357973 418034 659534
17031 659534 746657 163341 286821 828976 606601 370301 230402 533482 716315 642161
17021 642161 428511 585927 424278 661918 518312 507816 425526 492131 456458 825973
$$ packed form
17094B09265J9572J71430j24258J00950j6828K64529j62569J57640k62236I1567
17083E4054L62162q6376R18J44448J64768j46989L1013j69256N0034J01597j30723
17072C75650l6410J67528A77306K60320R3888A88490L18977A34970K78848A94111
17061A52396K35368A72449J93042n5089m2972K17923K88559l10233n8611R9937
17051E05005K22778k08099J22175k65580N6096J33171k36693L6461j6626M33872
17041G82560j75229k09489N0154j07556O3728L07499k35029j18665O0061K41500
17031F59534Q7123A63341J23480N42155k22375k36300j39899L03080J82833p4154
17021F42161k13650J57416j61649K37640j43606j0496q2290O6605l5673L69515
$$ plain form
17011 825973 652388 951383 582600 833119 833800 395066 465346 532344 563317 594259 676665
17000 676665 803516 772253 584219 736807 795445 636422 888504 819342 432937 490466
16990 490466 946872 599744 559518 588511 823371 877554 678218 996977 630106 250137
16979 753346 806858 1056495 558714 638498 223526 280916 603149 545859 668595 709111
16969 709111 722949 756934 836970 520421 612902 904920 712471 682698 630868 945565 785631
16958 785631 971055 495911 1089814 929076 933306 1030752 993942 1196650 792483 1208121
16948 1208121 485437 928477 701250 863940 912217 688273 819932 760342 762841 1145852
16938 1145852 1101329 1002228 771058 1359277 705797 1098778 1396566 938299 1116732 1230357
$$ packed form
17011H25973j73585K98995l68783K50519O81C95066P0280O6998L0973L0942Q2406
17000F76665J26851l1263j88034J52588N8638j59023K52082o9162l86405N7529
16990D90466M56406l47128m0226K8993K34860N4183j99336L18759l66871B50137
16979G53346N3512K49637m97781P9784B23526N7390L22233n7290J22736M0516
16969G09111J3838L3985Q0036l16549R2481K92018j92449k9773n1830L14697j59934
16958G85631J85424m75144N93903j60738M230R7446l6810K02708m04167M15638
16948A208121D85437M43040k27227J62690M8277k23944J31659n9590K499L83011
16938A145852m4523r9101k31170N88219o53480L92981K97788m58267J78433J13625
$$ plain form
16928 1230357 1118844 1039228 835243 1417124 1187319 1083415 1457996 1221628 1139861 1105146
16918 1105146 1281762 1319411 1283299 1207999 954148 724728 1127756 903761 1321883 941526
16908 941526 1246393 991188 1380991 1292837 1659192 1631745 1280867 1165140 1163518 1190934
16898 1190934 1062272 1386296 1312505 1108504 1455642 1597038 1404861 1160521 1726511 1272772
16888 1272772 1405524 1915104 1592191 1423515 1808429 1764953 1693072 1642490 1929633 1935945
16878 1935945 1973028 1603618 1711155 1998578 1721663 1972849 1991648 1841597 1645395 1961706
16868 1961706 2185357 2033792 2070689 1747306 2042452 2265318 1776108 2117749 2144823 2293198
16858 2293198 2324546 2320366 2495715 2043476 2239623 2307095 2244251 2218254 2159786 2461208 2577330
$$ packed form
16928A230357j11513p9616k03985N81881k29805j03904L74581k36368q1767l4715
16918A105146J76616L7649l6112p5300k53851k29420M03028k23995M18122l80357
16908I41526L04867k55205L89803q8154L66355k7447l50878j15727j622K7416
16898A190934j28662L24024p3791k04001L47138J41396j92177k44340N65990m53739
16888A272772J32752N09580l22913j68676L84914m3476p1881n0582K87143O312
16878A935945L7083l69410J07537K87423k76915K51186J8799j50051j96202L16311
16868A961706K23651j51565L6897l23383K95146K22866m89210L41641K7074J48375
16858B293198L1348m180J75349m52239J96147O7472o2844k5997n8468L01422J16122
$$ plain form
16847 2577330 2841612 2760074 2882758 2564040 3297010 2945508 2626422 2653800 2964612 2766337
16837 2766337 2890028 2954152 3047740 2896914 3035755 3240080 3272598 2937224 3402228 3190896
16827 3190896 3324914 3414163 3623460 3653812 3614904 3605732 3485637 3471393 3882345 4074816
16817 4074816 4018952 4144310 4010338 4028603 4348393 4288170 4182501 4687361 4601840 4875026
16807 4875026 4995700 4905355 4931920 5153165 4987924 5312110 5239819 5557889 5297059 5478443
16797 5478443 5791920 5822456 5983998 5901955 6211572 6423870 6329975 6380845 6709823 7040228
16787 7040228 6770593 6801519 6930453 7638092 7828540 7952940 8026649 8056586 8411964 8627677
16777 8627677 8631280 9335432 9247492 9529412 9822476 10181355 10367919 10507997 10902614 11081068
$$ packed form
16847B577330K64282q1538J22684l18718P32970l51502l19086K7378L10812j98275
16837B766337J23691O4124R3588j50826J38841K04325L2518l35374M65004k11332
16827C190896J34018Q9249K09297L0352l8908r172j20095j4244M10952J92471
16817D074816n5864J25358j33972J8265L19790o0223j05669N04860q5521K73186
16807D875026J20674r0345K6565K21245j65241L24186p2291L18070k60830J81384
16797E478443L13477L0536J61542q2043L09617K12298r3895N0870L28978L30405
16787G040228k69635L0926J28934P07639J90448J24400P3709K9937L55378K15713
16777H627677L603P04152q7940K81920K93064L58879J86564J40078L94617J78454
$$ plain form
16767 11081068 11542064 11932461 11970955 12179975 12995072 13174126 13677936 13899099 14333048
16758 14333048 14703309 15257528 15835332 15853100 16594946 17516945 18268961 18805209 19572640
16749 19572640 19947074 20961893 21738095 22570830 23515497 24331810 25073330 26440553 27946241
16740 27946241 28641862 29784584 31135831 32867451 34280669 35885242 37624786 39382380
16732 39382380 41335786 43612300 45722113 48424126 50434149 53635585 56748093 59556377
16724 59556377 63029649 66540278 70599736 74463199 78798171 83608825 88133537 92819004
16716 92819004 97747023 102824129 107915943 113149483 118001995 122969568 126908562 131644733
16708 131644733 135112992 138254045 140651605 142764647 144509896 144866044 144929498 144834381 143644347
$$ packed form
16767A1081068M60996L90397L8494K09020Q15097J79054N03810K21163M33949
16758A4333048L70261N54219N77804J7768P41846R21999P52016N36248P67431
16749A9572640L74434J014819P76202Q32735R44667Q16313P41520J367223J505688
16740B7946241O95621J142722J351247J731620J413218J604573J739544J757594
16732C9382380J953406K276514K109813K702013K010023L201436L112508K808284
16724E9556377L473272L510629M059458L863463M334972M810654M524712M685467
16716I2819004M928019N077106N091814N233540M852512M967573L938994M736171
16708A31644733L468259L141053K397560K113042J745249L56148O3454r5117j190034
$$ plain form
16699 143644347 142064852 140603351 138532946 136597264 134069818 131378280 128660405 125944123
16691 125944123 123375558 120422942 117318061 114239116 111417414 108358178 105401582 102619767
16683 102619767 99088700 96058234 93147953 90206439 87313777 84278133 81209345 78462097
16675 78462097 75666057 73101668 70212105 68135707 65555906 63059953 60383344 58126857
16667 58126857 55957156 53739274 52088401 49999990 47892734 45937816 44199748 42316361
16659 42316361 40788855 39111398 37459088 36102426 34641233 33401892 31986351 30581084
16651 30581084 29715263 28424907 27224523 26144721 25315470 24413508 23378261 22866738 21633278
16642 21633278 20788556 20220789 19421375 18669428 18278137 17438568 17081351 16558696 15929478
$$ packed form
16699A43644347j579495j461501k070405j935682k527446k691538k717875k716282
16691A25944123k568565k952616l104881l078945k821702l059236k956596k781815
16683A02619767l531067l030466k910281k941514k892662l035644l068788k747248
16675G8462097k796040k564389k889563k076398k579801k495953k676609k256487
16667E8126857k169701k217882j650873k088411k107256j954918j738068j883387
16659D2316361j527506j677457j652310j356662j461193j239341j415541j405267
16651C0581084q65821j290356j200384j079802q29251r01962j035247n11523j233460
16642B1633278q44722n67767p99414p51947l91291q39569l57217n22655o29218
$$ plain form
16633 15929478 15261086 14642337 14438852 13602161 13188696 13007280 12518759 12150888 11903152
16624 11903152 11553050 10999487 10639118 10399562 10406991 9916810 9324154 9576875 8871077 8904537
16614 8904537 8643398 8400757 8309368 8056910 7602608 7395723 7327496 7247056 7150571 6904964
16604 6904964 6640663 6511532 6164802 6291507 5706427 5851087 5755286 5577266 5216780 5120441
16594 5120441 5152486 5000960 5085233 4781456 4822732 4734560 4915791 4212133 4617137 4397676
16584 4397676 4186847 4182670 4114640 4116759 4072588 3712638 3820654 3642761 3647874 3544122 3320203
16573 3320203 3637658 3420472 3482052 3226264 3037402 3233020 2850299 2986477 2897620 3044286
16563 3044286 2888728 2962303 2749814 2449661 2675858 2367560 2625819 2658690 2493274 2407991
$$ packed form
16633A5929478o68392o18749k03485q36691m13465j81416m88521l67871k47736
16624A1903152l50102n53563l60369k39556P429m90181n92656K52721p05798L3460
16614H904537k61139k42641r1389k52458m54302k06885o8227q0440r6485k45607
16604F904964k64301j29131l46730J26705n85080J44660r5801j78020l60486r6339
16594E120441L2045j51526Q4273l03777M1276q8172J81231p03658M05004k19461
16584D397676k10829m177o8030K119m4171l59950J08016j77893N113j03752k23919
16573C320203L17455k17186O1580k55788j88862J95618l82721J36178q8857J46666
16563C044286j55558P3575k12489l00153K26197l08298K58259L2871j65416q5283
$$ plain form
16553 2407991 2654104 2166405 2455702 2267005 2442511 2326773 2290705 2332278 2728974 2118948
16543 2118948 2177713 2136881 2016964 2080020 2107930 2082619 1875737 1758678 1828591 1890029 1711943
16532 1711943 1938637 1825369 2043104 1888988 1953505 1656112 1655119 1704141 1414578 1512771
16522 1512771 1525327 1552129 1627753 1430806 1460831 1235344 1460912 1138517 1643936 1785061
16512 1785061 1368493 1317366 1170288 1607184 1356236 1491238 1560697 1354450 1078740 1131253
16502 1131253 1454276 1185733 1203752 1278623 1371508 1503690 1151567 1146602 1029340 1166574
16492 1166574 1461150 1437000 1110839 1124058 1484954 1066643 1073019 1127030 1183467 807210
16482 807210 1031002 1180464 1192154 1025738 726949 1116226 756712 1196252 1175137 917406
$$ packed form
16553B407991K46113m87699K89297j88697J75506j15738l6068M1573L96696o10026
16543B118948N8765m0832j19917O3056K7910k5311k06882j17059O9913O1438j78086
16532A711943K26694j13268K17735j54116O4517k97393r93M9022k89563R8193
16522A512771J2556K6802P5624j96947L0025k25487K25568l22395N05419J41125
16512A785061m16568n1127j47078M36896k50948J35002O9459k06247k75710N2513
16502A131253L23023k68543J8019P4871R2885J32182l52123m965j17262J37234
16492A166574K94576k4150l26161J3219L60896m18311O376N4011N6437l76257
16482H07210K23792J49462J1690j66416k98789L89277l59514M39540k1115k57731
$$ plain form
16472 917406 1143316 759235 757605 892582 1199698 1062270 1004595 915645 1011053 953914 718431
16461 718431 701562 838363 832853 887279 877832 829405 815644 758467 868185 935494 819594
16450 819594 911540 894011 700961 719325 692330 834944 799582 637590 734075 713696 716709
16439 716709 701055 188248 602460 673258 746213 506006 852618 836820 653208 621511
16429 621511 613016 541847 733737 564375 667924 715703 513601 269649 591175 858605
16419 858605 319258 179121 693277 695478 472993 501760 538021 662856 869259 529337
16409 529337 724244 564095 365808 360774 729180 365662 345965 282740 689604 744205
16399 744205 517634 446033 133547 376561 449697 648871 251928 552088 417252 615203
$$ packed form
16472I17406K25910l84081j630J34977L07116j37428n7675q8950R5408n7139k35483
16461G18431j6869J36801n510N4426r447m8427j3761n7177J09718O7309j15900
16450H19594R1946j7529j93050J8364k6995J42614l5362j61992R6485k0379L013
16439G16709j5654A88248M14212P0798P2955k40207L46612j5798j83612l1697
16429F21511q495p1169J91890j69362J03549M7779k02102k43952L21526K67430
16419H58605C19258j40137N14156K201k22485K8767L6261J24835K06403l39922
16409E29337J94907j60149j98287n034L68406l63518j9697o3225M06864N4601
16399G44205k26571p1601A33547K43014P3136J99174B51928L00160j34836J97951
$$ plain form
16389 615203 110868 592070 350404 521834 216361 516790 485187 462672 519553 404308
16379 404308 191170 321447 300054 548589 177670 434757 422813 305214 372099 535569
16369 535569 247446 195953 617662 465602 414757 171133 253646 432481 476331 633286
16359 633286 302833 392790 439188 248546 41240 112633 211873 461583 478001 465271 491933
16348 491933 294987 307187 100735 312100 618603 453282 223000 282232 255930 331680
16338 331680 282056 312179 397511 291690 219346 597637 301836 424480 162341 264135
16328 264135 422763 267806 376486 -12355 268374 348161 150706 366031 446643 374033
16318 374033 325126 -118605 207949 458294 228979 -47513 212827 -166784 622281 384659
$$ packed form
16389F15203A10868M81202k41666J71430B16361L00429l1603k2515N6881j15245
16379D04308A91170J30277k1393K48535A77670K57087j1944j17599O6885J63470
16369E35569B47446n1493M21709j52060n0845A71133Q2513J78835M3850J56955
16359F33286C02833Q9957M6398j90642D1240P1393R9240K49710J6418j2730K6662
16348D91933j96946J2200A00735K11365L06503j65321B23000N9232k6302P5750
16338C31680m9624L0123Q5332j05821p2344L78291k95801J22644A62341J01794
16328B64135J58628j54957J08680a2355B68374P9787A50706K15325Q0612p2610
16318C74033m8907a18605B07949K50345B28979d7513B12827a66784F22281k37622
$$ plain form
16308 384659 130272 172874 596103 60017 242471 141338 163771 454272 568725 -101037
16297 168719 69742 413958 420419 29333 350742 168759 109063 -40871 3371 -12317 -21158
16286 -21158 -96398 101210 295726 174655 362476 4317 287056 343282 -7074 3287 116646
16275 116646 202312 105824 381305 248712 187393 368532 112084 224798 223060 150273 313060
16264 313060 -89479 165776 413597 437196 574590 381998 -113079 171090 403543 20466
16253 476264 292156 92771 94895 168540 -130542 164684 97176 45952 179563 -242896 45363
16241 220389 66402 98529 -21522 136019 12259 286356 172592 160942 192819 135711 -51364
16229 -32444 227101 220422 105724 -171832 -127116 88524 269955 395474 175776 339932
$$ packed form
16308C84659A30272M2602M23229F0017J82454j01133K2433K90501J14453a01037
16297A68719F9742L44216O461B9333L21409A68759n9696d0871C371a2317q841
16286b1158p5240A01210J94516j21071J87821D317K82739N6226g074C287J13359
16275A16646Q5666r6488K75481j32593o1319J81139A12084J12714j738p2787J62787
16264C13060h9479A65776K47821K3599J37394j92592a13079A71090K32453B0466
16253D76264j84108I2771K124P3645a30542A64684o7508D5952J33611b42896D5363
16241B20389F6402L2127b1522A36019A2259K74097j13764j1650L1877n7108e1364
16229c2444B27101o679A05724a71832M4716H8524J81431J25519A75776J64156
$$ plain form
16219 339932 -4700 24785 144216 7138 108355 13724 313348 408467 406404 -62087 124425
16207 358432 79378 -34277 1554 82654 128054 254076 71931 -32498 49861 -173238 -92729
16196 -92729 300348 201464 243829 28127 491985 -99331 -5096 -107142 13000 76732 75072
16185 75072 312649 296946 241634 215533 163095 -104419 -142192 283543 68415 246898 165078
16174 165078 322099 -45472 440423 -141584 -302901 128747 156582 187247 213274 34369
16163 163771 -176098 100719 -140500 369745 6232 273058 328048 61015 113714 -90000 -98334
16152 -98334 15355 -158874 -34258 113867 -118118 -279190 118609 187344 400178 -87491
16141 -99976 51722 233572 -219133 145780 90284 193393 52818 197717 -3125 66990 -188085
$$ packed form
16219C39932d700B4785J19431G138J01217A3724K99624R5119k063f2087A24425
16207C58432G9378c4277A554Q1100M5400J26022G1931c2498D9861a73238Q0509
16196i2729C00348r8884M2365B8127M63858i9331e096j02046A3000O3732j660
16185G5072K37577j5703n5312k6101n2438a04419l7773B83543F8415J78483q1820
16174A65078J57021d5472D40423a41584j61317A28747K7835L0665K6027C4369
16163A63771a76098A00719a40500C69745F232K66826N4990F1015N2699i0000q334
16152i8334A5355a58874c4258A13867a18118j61072A18609O8735K12834h7491
16141i9976E1722J81850b19133A45780n5496J03109E2818J44899c125F6990a88085
$$ plain form
16129 -221501 193865 -86583 -82486 177604 -182388 -109156 -160661 116955 98362 40014 63437
16118 63437 -191257 88001 -120638 -241150 -213766 -107031 46322 46634 168696 -346656 373772
16106 116263 -79535 16170 299600 -4222 56874 -178937 12218 297907 268880 216535 -2519
16094 -149201 -41276 58126 126776 -20570 286424 -227888 12107 359853 243688 294449 110079
16082 -122911 -13329 -45617 -49414 376418 -54818 -253447 478 176070 -97832 185354 137113
16071 137113 310735 -88169 337868 -202337 121345 117427 98582 58126 -82743 183827 111466
16060 111466 318632 276368 218488 -132882 -137654 -305092 106269 127936 189438 -120298 64278
16048 -184862 40796 -199953 -52455 -19794 77310 416267 341845 22497 87673 283373 -267012
$$ packed form
16129b21501A93865h6583M097A77604a82388P3232n1505A16955j8593D0014K3423
16118F3437a91257H8001a20638j20512K7384J06735D6322L12J22062c46656C73772
16106A16263g9535A6170K83430d222E6874a78937A2218K85689k9027n2345b519
16094a49201d1276E8126O8650b0570B86424b27888A2107L47746j16165N0761A10079
16082a22911a3329l2288l797C76418e4818j98629D78J75592i7832A85354m8241
16071A37113J73622h8169C37868b02337A21345l918j8845m0456h2743A83827p2361
16060A11466K07166m2264n7880a32882m772j67438A06269K1667O1502a20298F4278
16048a84862D0796a99953e2455a9794G7310L38957p4422B2497O5176J95700b67012
$$ plain form
16036 120314 195134 -201189 -212727 -73228 -23886 -58890 146401 -118698 233901 110820
16025 119973 -23936 -37036 -221345 -42389 -195922 -8476 61270 -264873 -119555 76724 -23842
16013 64944 198070 -181239 145926 -59987 -176173 156653 88331 297619 120670 -160323
16002 -266828 162520 8099 113570 302911 184186 95393 71160 22909 -109565 117652
15991 -78021 116399 -79609 387069 -241154 -156613 -40525 85041 59202 -122739 -139916 -230762
15980 -230762 311963 -25038 -383942 -272355 -350751 -226315 -63027 -145943 223136 -16658
15969 396640 201730 48079 52306 107267 302065 -46447 133809 20220 120905 422437 337955
15958 337955 210225 142237 119425 -392752 253424 -91813 -259736 288496 -101753 35137
$$ packed form
16036A20314P4820b01189j1538g3228b3886l5004A46401a18698B33901A10820
16025A19973b3936j3100j84309d2389j53533h476F1270b64873a19555G6724b3842
16013F4944J33126a81239A45926e9987j16186A56653o8322K09288A20670a60323
16002b66828A62520H099J05471J89341j18725q8793k4233B2909a09565A17652
15991g8021A16399g9609C87069b41154Q4541d0525H5041k5839a22739j7177r0846
15980b30762C11963b5038l58904J11587p8396J24436f3027q2916B23136a6658
15969C96640j94910D8079M227N4961J94798d6447A33809B0220J00685L01532q4482
15958C37955j27730o7988k2812c92752B53424i1813j67923B88496a01753C5137
$$ plain form
15947 50771 45365 132758 96062 232455 137538 119302 74984 -39360 -30665 70840 -213210 -7094
15934 105710 2794 6889 137507 -32970 -269057 112573 110234 -56274 -211114 -131507 -109127
15923 -109127 286660 -137454 2470 -105311 -141356 410711 -254135 -9955 145483 136612 107428
15912 107428 -320347 -239258 -32475 -371004 36744 96356 -18778 -122701 183072 -287592
15901 -31055 280357 250566 -303730 -91588 -248805 117301 157077 -107421 -139705 197268
15890 -293661 -116478 -12429 94135 -2435 -67714 -192678 -177747 -118171 -33946 209725 157376
15879 157376 -66783 52788 -191908 138625 119937 -20633 -352497 286978 -67217 72346 -225157
15867 -64080 -115717 -33125 10475 162108 -70175 127617 -49912 -219554 -109088 345628 -143137
$$ packed form
15947E0771n406Q7393l6696J36393r4917j8236m4318c9360Q695G0840b13210g094
15934A05710B794M095J30618c2970k36087A12573k339e6274j54840P9607K2380
15923a09127B86660a37454B470a05311l6045D10711b54135i955A45483q871k9184
15912A07428c20347Q1089c2475l38529C6744N9612a8778j03923A83072b87592
15901c1055B80357k9791c03730i1588j57217A17301L9776a07421l2284A97268
15890b93661a16478a2429I4135b435o5279j24964J4931N9576c3946B09725n2349
15879A57376f6783E2788a91908A38625j8688b0633l31864B86978f7217G2346b25157
15867f4080n1637c3125A0475J51633g0175A27617d9912j69642a09088C45628a43137
$$ plain form
15855 231476 325959 -44212 -391817 -87637 37291 -216501 74858 -119139 189971 188633 -64144
15843 -200733 -132910 -282192 -297309 -119682 -21593 -162518 9195 -18972 -276008 40719 51897
15832 51897 -29562 94979 78301 -207054 -5947 115066 177231 -232395 -247743 208126 -97039
15820 -74023 40841 203213 -16375 -202041 -64528 -67946 -62368 -111499 172653 -279483 -224434
15809 -224434 -6762 -79176 51796 125348 -15722 -199964 -123366 92648 -32015 -22128 -146259
15798 -146259 -129441 -142018 -614 9550 118915 -110476 205794 199983 177488 -153292 165419
15786 -98120 -154348 -45242 98919 -139322 78580 -144282 -153682 28951 117629 81846 -345673
15774 -61673 222462 -186385 31158 -60755 78008 -132993 -205988 -3399 -38679 -108773 -252764
$$ packed form
15855B31476R4483d4212l47605h7637C7291b16501G4858a19139A89971j338f4144
15843b00733O7823j49282j5117a19682b1593j40925I195a8972k57036D0719J1178
15832E1897b9562I4979j6678b07054e947A15066O2165b32395j5348B08126i7039
15820g4023D0841J62372a6375j85666f4528l418N578m9131A72653b79483N5049
15809b24434f762p2414E1796P3552a5722j84242P6598I2648c2015R887j24131
15798a46259J6818j2577f14I550J09365a10476B05794n811k2495a53292A65419
15786i8120n6228d5242I8919a39322G8580a44282r400B8951Q8678l5783c45673
15774f1673B22462a86385C1158f0755G8008a32993p2995c399l5280p0094j43991
$$ plain form
15763 -252764 -422259 -57128 127957 258910 -148145 -1458 167791 193284 -105226 98331
15752 -269440 74102 -115855 -481513 -233887 163676 267273 -185266 -161709 -163797 149629
15741 30166 -74848 199057 8239 -106174 -58490 -10451 5779 2701 65388 -173479 21712 -218435
15728 13333 135755 -175946 216671 5270 -73637 130156 4116 -104429 145298 102965 -142195
15716 -99566 -120548 169702 -216802 24724 -118421 31028 87904 -76028 40761 -324678 -59951
15704 24256 145200 182038 211801 239738 -40993 246423 -64042 347055 15085 138008 81860
15693 81860 -49504 -228930 75987 -344842 27559 59966 -162227 -171020 3952 206436 13056
15681 60155 -202521 -65603 -79763 61899 -39498 -50301 118896 195686 225573 51629 1499
$$ packed form
15763b52764j69495e7128A27957J30953a48145a458A67791K5493a05226I8331
15752b69440G4102a15855l65658b33887A63676J03597a85266K3557k088A49629
15741C0166g4848A99057H239a06174M7684a0451E779B701O2687a73479B1712b18435
15728A3333J22422a75946B16671E270g3637A30156D116a04429A45298m2333a42195
15716i9566k0982A69702b16802B4724a18421C1028N6876g6028D0761c24678e9951
15704B4256J20944L6838K9763K7937d0993B46423f4042C47055A5085J22923n6148
15693H1860d9504j79426G5987c44842B7559L2407a62227q793C952K02484A3056
15681F0155b02521f5603j4160F1899c9498j0803A18896P6790K9887E1629A499
$$ plain form
15669 -96989 -236652 129549 -40514 -76200 419820 -89824 -150039 91753 -261785 -429320 23701
15657 120997 185816 184994 90186 -79070 -180796 -26391 157682 -156204 -191396 171470 175709
15646 175709 -400558 -340509 75035 257750 -295956 -315224 -59368 -308438 -115573 -64587
15636 -64587 -47400 -159503 -699 -31832 -135542 -190816 -519832 -33897 310969 -17826 -180221
15625 -180221 -18265 -207595 -52709 -107371 -162188 67524 -165606 259654 48678 -150700 102201
15613 -28898 228839 63286 -27996 -196046 -185288 35385 62862 96801 -97386 9201 45270
15602 45270 -176600 -245834 170151 -106301 136301 -57272 -76630 66550 223856 -46788 119348
15590 50935 36341 32172 192154 -82132 -100596 -40026 -245641 -112873 -57064 -34220 -194536
$$ packed form
15669i6989j39663A29549d0514l5686D19820h9824o0215I1753b61785j67535B3701
15657A20997O4819q22I0186g9070j01726b6391A57682a56204l5192A71470M239
15646A75709d00558O0049G5035J82715b95956j9268e9368k49070a15573N0986
15636f4587J7187j12103f99l1133j03710n5274l29016c3897C10969a7826j62395
15625a80221a8265j89330e2709n4662n4817F7524a65606B59654D8678a50700A02201
15613b8898B28839F3286b7996j68050J0758C5385K7477L3939i7386I201L6069
15602D5270a76600o9234A70151a06301A36301e7272j9358F6550J57306d6788A19348
15590E0935j4594m169J59982h2132j8464d0026k05615a12873N5809K2844j60316
$$ plain form
15579 -194536 35564 70328 -302579 -148206 -111818 -11957 123217 -50116 316345 -310440
15568 -59078 -21200 86657 -360782 -33751 266272 -41872 -311458 -207474 -199287 114027 161357
15557 161357 -224176 113868 440795 -212114 -196053 -27977 -3715 -235606 -293222 91418 -76747
15545 114381 -274245 185898 -115410 43011 -97970 -138403 -173433 292482 -260847 376720
15534 -146765 -68687 148217 -73727 84512 -311063 -232881 -248426 45796 -115142 325939 -68314
15522 97415 167265 220302 -6977 306854 183921 137265 -177668 -301184 5753 -107396 -205999
15511 -205999 191786 163668 92621 78643 -26139 26478 -4676 38683 58091 -35607 -10917
15499 -58025 -206259 -35512 -294782 26588 -73807 245678 -127440 -102208 -215869 -15276 258536
$$ packed form
15579a94536C5564L4764c02579a48206L6388a1957A23217e0116C16345c10440
15568e9078b1200H6657c60782c3751B66272d1872k69586J03984Q187A14027M7330
15557A61357b24176A13868L26927b12114J6061b7977c715k31891n7616I1418g6747
15545A14381b74245A85898a15410D3011i7970m0433l5030B92482b60847C76720
15534a46765f8687A48217g3727H4512c11063P8182j5545D5796a15142C25939f8314
15522I7415O9850N3037f977C06854j22933m6656a77668j23516E753a07396r8603
15511b05999A91786k8118p1047j3978b6139B6478d676C8683J9408c5607a0917
15499e8025j48234c5512k59270B6588g3807B45678a27440K5232j13661a5276B58536
$$ plain form
15487 -127835 297568 81404 52270 -34599 -131492 -173858 -52406 -32925 140644 128635 -62002
15475 -234316 -295191 -184929 -317910 -329123 -294400 -11250 162816 34271 -249381 62191 -38907
15463 -221613 56195 -178696 -178222 -11228 40195 -124509 -155517 75846 91973 -292156 47857
15451 -69088 -133208 198937 132121 80887 -217749 1466 95867 34610 411506 -13504 -43740
15440 -43740 24080 -300625 221933 259234 225358 36761 118593 94942 17133 171174 -18063
15428 -210191 -44516 154736 -128660 -58638 3164 -124984 20045 -286517 -133923 -90295 -14246
15416 157594 -227258 63344 -154316 -134503 335745 64475 -252293 -223935 -55180 -391727
15406 -391727 -71655 2055 -25749 -41529 127442 -12924 113463 269931 -311006 -10378 10789
$$ packed form
15487a27835B97568H1404k9134c4599r6893m2366e2406J9481A40644j2009f2002
15475b34316o0875J10262j32981j1213L4723a1250A62816C4271b49381F2191c8907
15463b21613E6195a78696M74a1228D0195a24509l1008G5846J6127b92156D7857
15451f9088o4120A98937o6816n1234b17749A466R4401C4610L76896a3504l0236
15440d3740B4080c00625B21933L7301l3876C6761Q1832k3651A7133J54041a8063
15428b10191d4516A54736a28660e8638C164a24984B0045b86517a33923M3628a4246
15416A57594b27258F3344a54316J9813C35745F4475b52293K8358e5180l36547
15406c91727g1655B055b5749j5780A27442a2924A13463J56468c11006a0378A0789
$$ plain form
15394 -90794 24580 -115345 113468 -12881 67989 35828 69028 239114 305469 -24979 -10694
15382 -27185 -63702 245129 -78174 211317 184171 -37154 186214 203845 102238 -67362 155128
15370 50846 -140545 -99587 111822 39826 218994 12827 -65964 28561 249644 63519 -69441
15358 -77312 -150854 239072 -149032 285 183738 2562 -236200 -23249 24682 131050 250411
15347 250411 137652 101415 118688 -44087 -37116 -100884 -235202 -130678 84744 -51940 -12311
15335 32059 99151 -149929 123740 225212 146609 -35092 78369 29166 210419 79788 -95809
15323 -218340 -205170 20375 54712 131954 8250 -340746 -274054 19530 68320 -34322 136248
15311 -62864 227789 257837 200080 48548 -83025 288083 256108 94608 -64294 40818 -135720
$$ packed form
15394i0794B4580a15345A13468a2881F7989l2161L3200J70086O6355b4979a0694
15382b7185l6517B45129g8174B11317k7146c7154A86214J7631j01607f7362A55128
15370E0846a40545M0958A11822C9826J79168A2827f5964B8561K21083F3519f9441
15358g7312p3542B39072a49032B85J83453B562b36200b3249B4682J06368J19361
15347B50411j12759l6237J7273d4087O971o3768j34318J04524H4744e1940a2311
15335C2059O7092a49929A23740J01472p8603c5092G8369B9166J81253G9788i5809
15323b18340J3170B0375L4337P7242H250c40746O6692A9530M8790c4322A36248
15311f2864B27789L0048n7757D8548h3025B88083l1975I4608f4294D0818a35720
$$ plain form
15299 -144077 189841 -102621 316123 131012 194673 -52698 -173568 289072 49608 317856
15289 317856 116394 -51691 -30353 -8680 -183987 -117665 29251 30363 66150 -129386 133537
15277 -160590 -79040 -48190 279967 -110230 -33035 247747 491781 -287710 -181516 -100361
15267 -100361 81557 319223 89864 293958 -165623 104718 -141865 71303 227074 -265348
15256 -237995 174273 -77391 -111384 -132202 198529 -7018 -91203 97217 129039 -240466 -24019
15244 45015 -25458 -11389 -13383 -102789 -542 190842 350476 371363 527234 385940 558489
15233 558489 216181 319211 437650 486973 666985 653530 283990 431710 599344 113981
15222 325392 586158 48326 -62128 557091 -138145 161588 372217 179587 396268 252949
$$ packed form
15299a44077A89841a02621C16123A31012O3661e2698j20870B89072D9608K68248
15289C17856A16394e1691K1338h680j75307O6322B9251J112L5787a29386A33537
15277a60590g9040L0850B79967a10230c3035B47747K44034b87710J06194Q1155
15267a00361H1557K37666H9864K04094a65623A04718a41865G1303J55771b65348
15256b37995A74273g7391l3993k0818A98529g018q4185I7217L1822b40466b4019
15244D5015b5458a1389j994q9406e42A90842J59634K0887J55871j41294J72549
15233E58489B16181J03030J18439M9323J80012j3455B83990J47720J67634A13981
15222C25392K60766D8326f2128E57091a38145A61588K10629A79587K16681j43319
$$ plain form
15212 252949 308630 -58899 169547 404326 200454 293567 52577 -44536 238532 -298172
15201 31669 151477 -399171 223141 -10738 127319 98003 139237 -143630 11966 66638 141821
15190 141821 -39311 -39056 -128070 -53075 -153223 45099 -28752 -127463 137706 448694 70559
15178 -44287 148227 213184 -81561 37527 -155451 159888 113839 -208823 -190387 329802 137671
15166 -42462 -144239 368873 -8891 -128271 137305 33364 85880 133182 137161 -225656 -143966
15155 -143966 -167684 297926 150070 286108 601692 -25059 99535 78628 198942 182237
15145 182237 182835 208804 154733 -30037 134004 177807 65815 8010 271724 -2149 150057 -2709
15132 -93667 220374 -223643 -148798 480794 -83323 125574 -174210 146829 226300 222671 244947
$$ packed form
15212B52949N5681e8899A69547K34779B00454R3113E2577d4536B38532b98172
15201C1669J19808c99171B23141a0738A27319k9316M1234a43630A1966N4672P5183
15190A41821c9311K55q9014e3075j00148D5099b8752r8711A37706L10988G0559
15178d4287A48227O4957h1561C7527a55451A59888m6049b08823J8436C29802A37671
15166d2462j01777C68873h891j19380A37305C3364N2516M7302L979b25656Q1690
15155a43966k3718B97926j47856J36038L15584b5059I9535k0907J20314j6705
15145A82237N98K5969n4071c0037A34004M3803F5815H010K63714b149A50057b709
15132i3667B20374b23643P4845D80794h3323A25574a74210A46829P9471l629K2276
$$ plain form
15121 244947 248210 59367 248636 223950 285890 -59216 -217000 7811 412003 183069 -77118
15109 -109715 284675 169833 -91038 -31600 -98408 291629 136925 204560 117104 254259
15099 254259 40309 44574 122237 44664 106290 126280 210290 78760 240761 92430 -86552
15087 295089 208862 -165309 370768 -184595 -21068 -69680 199980 356006 186551 25062
15076 35377 138732 261206 -92080 -254437 223200 -82192 20447 489151 112682 552223
15066 552223 268819 101611 59999 -42279 245305 304493 111366 217335 100766 -81142
15055 -251112 -125276 241828 246696 31783 207321 119095 -1510 55027 442654 371042 404954
15044 404954 73847 202619 167989 280507 72856 -89668 372082 94398 5442 -80757 149662
$$ packed form
15121B44947L263E9367J89269k4686O1940e9216j57784G811M04192A83069g7118
15109a09715B84675j14842i1038c1600o6808B91629A36925O7635q7456J37155
15099B54259D0309M265P7663D4664O1626J9990Q4010G8760J62001I2430h6552
15087B95089q6227a65309C70768a84595b1068m8612A99980J56026j69455B5062
15076C5377J03355J22474i2080j62357B23200h2192B0447M68704A12682M39541
15066E52223B68819A01611m1612d2279B45305N9188A11366J05969A00766h1142
15055b51112a25276B41828M868C1783J75538q8226a510E5027L87627p1612L3912
15044D04954G3847J28772l4630J12518G2856h9668C72082I4398E442h0757A49662
$$ plain form
15032 79690 271257 250139 -83011 330153 179480 150164 288824 -87335 138698 -176260
15021 238669 -19787 -53301 -71310 295365 52017 116089 277167 395556 194089 518952
15011 518952 177089 118609 192519 207699 -18687 58212 355877 309613 136429 134596 245959
15000 245959 -2969 420750 433737 183283 452837 417267 138467 291840 306973 173758
14990 173758 211703 121628 485230 190689 -109958 213290 261898 136435 329344 263536
14980 263536 290189 -568 28121 384887 270354 -176067 210658 238905 179399 585130 -118091
14968 -27943 159896 169362 196628 284503 377193 483995 348627 -204339 70837 249164 307091
14957 307091 397480 445914 142043 271984 227211 276749 83487 187512 194222 416857 68945
$$ packed form
15032G9690J91567k1118h3011C30153j50673k9316J38660h7335A38698a76260
15021B38669a9787l3514j8009B95365E2017O4072J61078J18389A94089L24863
15011E18952A77089n8480P3910J5180a8687E8212K97665m6264A36429j833J11363
15000B45959b969D20750J2987A83283K69554l5570A38467J53373J5133j33215
14990A73758L7945r0075L63602A90689a09958B13290M8608j25463J92909o5808
14980B63536K6653e68B8121L56766j14533a76067B10658K8247n9506M05731a18091
14968b7943A59896R466K7266Q7875R2690J06802j35368b04339G0837J78327N7927
14957C07091R0389M8434A42043J29941m4773M9538H3487J04025O710K22635F8945
$$ plain form
14945 459287 609732 307116 47602 26959 237816 77055 98448 266350 396033 136365
14934 388531 347456 345195 -13750 -83289 308674 259942 206647 270956 361759 427813 414451
14923 414451 378341 383370 72936 445181 145888 223455 406934 280292 242726 -52228 -16115
14911 237016 569048 313390 241360 275249 -1432 240922 67329 349230 347345 176390 128151
14900 128151 315114 189538 111070 92491 410066 13941 503475 345959 282964 162068
14890 162068 -110943 465991 517176 210480 410586 286658 250234 344872 499636 34158
14879 308028 238791 469525 280443 103257 210452 374923 587160 74024 219249 505898
14869 505898 265156 197050 623875 115087 513086 465571 324512 123027 134576 175443
$$ packed form
14945D59287J50445l02616D7602k0643K10857G7055K1393J67902J29683A36365
14934C88531m1075k261a3750o9539C08674m8732n3295O4309R0803O6054j3362
14923D14451l6110N029G2936L72245A45888P7567J83479j26642l7566e2228a6115
14911B37016L32032k55658p2030L3889a432B40922F7329K81901j885j70955m8239
14900A28151J86963j25576p8468j8579L17575A3941M89534j57516o2995j20896
14890A62068a10943D65991N1185B10480K00106j23928l6424R4638J54764C4158
14879C08028o9237K30734j89082A03257J07195J64471K12237G4024J45225K86649
14869E05898k40742o8106M26825A15087L97999m7515j41059A23027J1549M0867
$$ plain form
14859 175443 328606 203696 422311 280563 238790 644244 446716 351665 719571 231664
14848 553520 286192 290330 582953 160351 113799 370147 429189 289809 602780 393660
14838 393660 279319 627186 469402 92610 194339 237765 562883 233715 548305 283159
14828 283159 471743 351551 321757 185742 398562 589450 147018 241447 114410 429501
14818 429501 313333 721254 297972 651646 330288 261927 796882 -12939 290014 576108
14808 576108 595265 588283 380984 345240 563402 131310 634401 698721 530715 496715 503892
14797 503892 502536 283962 380770 517116 163645 327283 420635 513419 285806 311547 467344
14786 467344 479978 613195 491046 725600 536192 374305 115133 766258 346638 406834
$$ packed form
14859A75443J53163j24910K18615j41748m1773M05454j97528r5051L67906B31664
14848E53520k67328M138K92623A60351m6552K56348N9042j39380L12971k09120
14838C93660j14341L47867j57784I2610J01729M3426L25118B33715L14590k65146
14828B83159J88584j20192k9794j36015K12820J90888A47018R4429A14410L15091
14818D29501j16168M07921B97972L53674l21358o8361N34955a2939B90014K86094
14808E76108J9157o982k07299l5744K18162A31310N03091O4320j68006l4000P177
14797E03892j356k18574R6808J36346A63645J63638R3352R2784k27613K5741J55797
14786D67344J2634J33217j22149K34554j89408j61887A15133O51125C46638O0196
$$ plain form
14776 406834 604925 408744 409921 112891 713656 561430 643165 632835 508559 553106
14766 553106 327015 508213 803783 772633 711892 727936 410750 845749 600378 250773
14755 515906 489182 547195 369502 452828 574618 189420 492718 537894 682357 530472
14745 530472 566129 448184 701852 545973 808575 540233 677232 659536 554896 465389
14735 465389 674578 702456 506148 761810 558800 332789 543536 427180 643408 775169
14725 775169 716362 593284 622089 765938 588846 770062 601682 650520 720386 601517
14715 601517 654999 802114 792393 430703 842148 509634 752268 517029 545900 491163
14705 491163 836192 586103 873403 716277 636957 839472 797798 819427 851051 511612
$$ packed form
14776D06834J98091j96181J177A12891O00765j52226Q1735j0330j24276M4547
14766E53106k26091J81198K95570l1150o0741J6044l17186M34999k45371B50773
14755E15906k6724N8013j77693Q3326J21790A89420L03298M5176J44463j51885
14745E30472L5657j17945K53668j55879K62602k68342J36999j7696j04640q9507
14735D65389K09189K7878j96308K55662k03010k26011K10747j16356K16228J31761
14725G75169n8807j23078K8805J43849j77092J81216j68380M8838O9866j18869
14715F01517N3482J47115r721l61690M11445l32514K42634k35239K8871n4737
14705D91163L45029k50089K87300j57126p9320K02515m1674K1629L1624l39439
$$ plain form
14695 511612 917736 651829 647680 701432 656892 714620 650374 852072 456625 694114 1068535
14684 1068535 392567 695448 537457 780845 1140631 708030 690407 800901 504654 874073
14674 874073 712678 967536 503726 694449 779234 830188 730128 697879 1094037 794833
14664 794833 785233 885006 964938 670746 982682 566565 845015 1039243 658180 1069659
14654 1069659 951663 1061479 779336 1159083 683166 1255470 777387 834487 898726 996882
14644 996882 592023 732138 853007 1247416 1041031 735462 938017 1069315 1275803 1043177
14634 1043177 905070 746532 1103614 1117790 1107566 895229 937127 1327009 784036 914887
14624 914887 1099536 879784 950585 1090583 1214889 1353911 1236645 1172170 1193973 1511085
$$ packed form
14695E11612M06124k65907m149N3752m4540N7728o4246K01698l95447K37489L74421
14684A068535C92567L02881j57991K43388L59786m32601j7623J10494k96247L69419
14674H74073j61395K54858m63810J90723Q4785N0954j00060l2249L96158k99204
14664G94833r600R9773P9932k94192L11936m16117K78450J94228l81063M11479
14654A069659j17996J09816k82143L79747m75917N72304m78083N7100O4239R8156
14644I96882m04859J40115J20869L94409k06385l05569K02555J31298K06488k32626
14634A043177j38107j58538L57082J4176j0224k12337M1898L89882n42973J30851
14624I14887J84649k19752P0801J39998J24306J39022j17266o4475K1803L17112
$$ plain form
14614 1511085 1056366 1325196 1036428 1390187 1574890 963431 1029717 1351827 1077538 1310405
14604 1310405 1066020 1667810 1124962 1373032 1038372 1443429 1220823 1497822 1513038 1094595
14594 1094595 1336785 1572832 1467739 1706865 1291865 1421705 1314331 1396641 1419689 1453195
14584 1453195 1117847 1233287 1702651 1519862 1448138 1455719 1871516 1315154 1148959 1645223
14574 1645223 1445919 1483989 1673446 1745961 1346567 1401297 1571904 1776831 1659282 1777254
14564 1777254 1901854 1968384 1806372 1929755 2079700 1929561 1814496 2076274 1823880 1666600
14554 1666600 2146086 1732123 2149857 2021528 1859917 2013930 1980143 2291076 1943795 2023377
14544 2023377 2498873 2444103 2532331 2540939 3181638 3363756 3622407 4431665 5151328 5528428
$$ packed form
14614A511085m54719K68830k88768L53759J84703o11459O6286L22110k74289K32867
14604A310405k44385O01790n42848K48070l34660M05057k22606K76999J5216m18443
14594A094595K42190K36047j05093K39126m15000J29840j07374Q2310K3048L3506
14584A453195l35348J15440M69364j82789p1724P581M15797n56362j66195M96264
14574A645223j99304L8070J89457P2515l99394N4730J70607K04927j17549J17972
14564A777254J24600O6530j62012J23383J49945j50139j15065K61778k52394j57280
14554A666600M79486m13963M17734j28329j61611J54013l3787L10933l47281P9582
14544B023377M75496n4770Q8228Q608O40699J82118K58651Q09258P19663L77100
$$ plain form
14534 5528428 6668578 7680263 9224373 11430160 13541427 12242560 10241302 9065821
14526 9065821 7914549 7256515 6641698 6266103 5943921 5594324 5539941 5612211 5248857 4810129
14516 4810129 4649296 4937980 4267009 4592764 4398531 3990394 3725171 3736222 3608194 3645012
14506 3645012 3371677 3247123 3013276 3153796 2997759 3189412 3449119 2688282 2810718
14497 2810718 2924969 2981846 3063635 3175049 2863239 2920667 3081283 2933214 2832359 3096928
14487 3096928 2613538 2785257 2917123 2726685 3015070 2972210 2776996 2708975 2823955 2903910
14477 2903910 2883542 3309220 2837839 3290097 2880373 2894176 2947842 2983169 2874372 3261864
14467 3261864 3232507 3276211 3369451 3300518 3192447 3278610 3520629 3397515 3365433 3610914
$$ packed form
14534E528428J140150J011685J544110K205787K111267j298867k001258j175481
14526I065821j151272o58034o14817l75595l22182l49597n4383P2270l63354m38728
14516D810129j60833K88684o70971L25755j94233m08137k65223J1051j28028L6818
14506C645012k73335j24554k33847J40520j56037J91653K59707p60837J22436
14497B810718J14251N6877Q1789J11414l11810N7428J60616j48069j00855K64569
14487C096928m83390J71719J31866j90438K88385m2860j95214o8021J14980P9955
14477B903910k0368M25678m71381M52258m09724J3803N3666L5327j08797L87492
14467C261864k9357M3704R3240o8933j08071Q6163K42019j23114l2082K45481
$$ plain form
14457 3610914 3406904 3580112 3296959 3541355 3664336 3435466 3813355 3449359 3774925
14448 3774925 3943493 3811597 4082813 4083518 4123115 3996917 4218397 4310992 4287676 4079489
14438 4079489 4431664 4498059 4117640 4413766 4340509 4485171 4445253 4409307 4680648 4811822
14428 4811822 5005521 4925294 4791821 5290959 5236586 5235013 5250174 5193799 5361269 5298070 5247989
14417 5247989 5463319 5624334 5823673 5759024 5860099 6165237 5772762 6371533 6159657 6309148
14407 6309148 6387076 6571264 6507989 6670380 6680794 6977920 6908381 6822757 6890646 7441518
14397 7441518 7375814 7237558 7534649 7594598 7706705 7784623 7699789 8275485 8135974 8108249
14387 8108249 8480617 8562981 8627275 8662227 9264243 8859103 9294080 9674570 9856573 9204375
$$ packed form
14457C610914k04010J73208k83153K44396J22981k28870L77889l63996L25566
14448C774925J68568j31896K71216P05L9597j26198K21480R2595k3316k08187
14438D079489L52175O6395l80419K96126p3257J44662l9918l5946K71341J31174
14428D811822J93699q0227j33473M99138n4373j573J5161n6375J67470o3199n0081
14417E247989K15330J61015J99339o4649J01075L05138l92475N98771k11876J49491
14407F309148P7928J84188o3275J62391J0414K97126o9539q5624O7889N50872
14397G441518o5704j38256K97091N9949J12107P7918q4834N75696j39511k7725
14387H108249L72368Q2364O4294L4952O02016m05140M34977L80490J82003o52198
$$ plain form
14377 9204375 10060713 9898855 10112813 10073430 10329685 10346086 10441957 10833197 11253859 11216904
14367 11216904 11263764 11829508 11635060 12114569 12462939 12630963 12955121 13222092 13519044
14358 13519044 13508550 13690785 13776196 14254826 14361089 14537650 15226174 15253883 15768470 15876908
14348 15876908 16331334 16808497 17212217 17179827 17445091 17960259 18579735 18481501 18969895 19544643
14338 19544643 20036652 20376855 20576944 21602860 22109467 22511262 22768067 23496172 24005638
14329 24005638 24634623 25126342 25712084 26526971 27129622 27651274 28586028 29349902 30114610
14320 30114610 31070533 31880192 32627887 33376345 34464909 35265634 36338962 37664044 38981907
14311 38981907 40269685 41532158 42589608 43914707 45262296 47031496 48537599 50071255
$$ packed form
14377I204375Q56338j61858K13958l9383K56255J6401R5871L91240M20662l6955
14367A1216904M6860N65744j94448M79509L48370J68024L24158K66971K96952
14358A3519044j0494J82235Q5411M78630J06263J76561O88524K7709N14587J08438
14348A5876908M54426M77163M03720l2390K65264N15168O19476r8234M88394N74748
14338A9544643M92009L40203K00089J025916N06607M01795K56805P28105N09466
14329B4005638O28985M91719N85742Q14887O02651N21652R34754P63874P64708
14320C0114610R55923Q09659P47695P48458J088564Q00725J073328J325082J317863
14311C8981907J287778J262473J057450J325099J347589J769200J506103J533656
$$ plain form
14303 50071255 52019926 53789753 55773679 57204330 59888386 62385979 64257516 67034045
14295 67034045 69532421 72480253 75481414 78683144 81804239 85443728 89268614 93255261
14287 93255261 97956604 102260703 107160693 112155891 118276974 123917314 130326500 137385762
14279 137385762 144630467 152609914 161442969 170733390 180771823 191579299 203765921
14272 203765921 216433128 230164413 245046489 261436100 279361788 298786008 320132292
14265 320132292 342749521 357703199 368007466 375253623 381174276 386487124 391280191
14258 391280191 396343605 400795063 406452393 414330298 417305167 394177871 374756265 360019656
14250 360019656 347198364 336976119 328634892 321676159 315388742 310108080 305582863 301769880
$$ packed form
14303E0071255J948671J769827J983926J430651K684056K497593J871537K776529
14295F7034045K498376K947832L001161L201730L121095L639489L824886L986647
14287I3255261M701343M304099M899990M995198O121083N640340O409186P059262
14279A37385762P244705P979447Q833055R290421J0038433J0807476J2186622
14272B03765921J2667207J3731285J4882076J6389611J7925688J9424220K1346284
14265C20132292K2617229J4953678J0304267P246157N920653N312848M793067
14258C91280191N063414M451458N657330P877905K974869k3127296j9421606j4736609
14250C60019656j2821292j0222245q341227o958733o287417n280662m525217l812983
$$ plain form
14242 301769880 298446389 295219348 291660460 287317902 283452498 278818302 273941460 269038462
14234 269038462 263951181 258485051 252693285 247024501 241098653 235276648 228925561 222788519
14226 222788519 216654804 210953755 205630632 199838058 194168818 188642103 182612506 177114109
14218 177114109 171553397 165828385 160543638 155084183 149480539 144732784 139295527 134222419
14210 134222419 129334200 124117108 119124275 113957302 109623709 105461628 101053173 97438719
14202 97438719 93712814 89922918 86483938 83020035 80009240 76774571 73952854 70971962
14194 70971962 68133739 65998316 63293582 60961114 58700714 56507869 54710948 52708023
14186 52708023 50945657 48978779 47279678 46081762 44334612 43097662 41674203 40369543
$$ packed form
14242C01769880l323491l227041l558888m342558l865404m634196m876842m902998
14234B69038462n087281n466130n791766n668784n925848n822005o351087o137042
14226B22788519o133715n701049n323123n792574n669240n526715o029597n498397
14218A77114109n560712n725012n284747n459455n603644m747755n437257n073108
14210A34222419m888219n217092m992833n166973m333593m162081m408455l614454
14202I7438719l725905l789896l438980l463903l010795l234669k821717k980892
14194G0971962k838223k135423k704734k332468k260400k192845j796921k002925
14186E2708023j762366j966878j699101j197916j747150j236950j423459j304660
$$ plain form
14178 40369543 39185855 37945815 36737103 35443504 34608612 33384967 32243835 31714595
14170 31714595 30674794 29649749 28746262 28091104 27212305 26454939 26090931 24737167 24361707
14161 24361707 23908440 23471620 22503792 21954346 21565576 20874045 20677191 19858951 19799364
14152 19799364 19088753 18554456 18621326 18105230 17491420 17257768 17032425 16535865 16139826
14143 16139826 15673592 15198514 14918443 14899289 14301486 14171053 14013702 13556049 13615232 13196276
14133 13196276 12890523 12585954 12550615 12449367 11988885 11583252 11559234 11251067 11288779 11089272
14123 11089272 10889922 10563440 10275919 10189975 10061963 10055345 10053044 9739654 9760477 9490420
14113 9490420 8815422 8936906 8742192 8766057 8564860 8558598 8369649 8186130 8063038 8268261
$$ packed form
14178D0369543j183688j240040j208712j293599q34892j223645j141132n29240
14170C1714595j039801j025045r03487o55158q78799p57366l64008j353764l75460
14161B4361707m53267m36820r67828n49446l88770o91531j96854q18240n9587
14152A9799364p10611n34297O6870n16096o13810k33652k25343m96560l96039
14143A6139826m66234m75078k80071j9154n97803j30433j57351m57653N9183m18956
14133A3196276l05753l04569l5339j01248m60482m05633k4018l08167L7712j99507
14123A1089272j99350l26482k87521q5944j28012o618k301l13390K0823k70057
14113I490420o74998J21484j94714K3865k01197o262j88949j83519j23092K05223
$$ plain form
14103 8268261 7647140 7813392 7517284 7858537 7477808 7147491 7176251 7347013 6918332 6805530
14093 6805530 6865288 6733704 6609851 6399843 6466933 6590765 6705816 5972914 6249309 6154038
14083 6154038 6080033 6169484 5576582 5973208 5901114 5671785 5689020 5623627 5219839 5644954
14073 5644954 5499552 5514832 5134581 5220739 5325646 5035229 5182877 5025129 4503467 5016245
14063 5016245 4855641 4735026 4503647 4593685 4599099 4417155 4592415 4136301 4200151 4147080
14053 4147080 4333266 4391786 3976276 4167230 4021844 4185720 3905956 4062734 3912494 3719996
14043 3719996 3774973 3542959 3903693 3633093 3743571 3479984 3543820 3595863 3475206 3516138
14033 3516138 3396005 3271166 3385497 3536599 3584086 3535298 3078363 3514001 3198109 3217783
$$ packed form
14103H268261o21121J66252k96108L41253l80729l30317K8760J70762m28681j12802
14093F805530N9758j31584j23853k10008O7090J23832J15051p32902K76395r5271
14083F154038p4005Q9451n92902L96626p2094k29329J7235o5393m03788M25115
14073E644954j45402J5280l80251Q6158J04907k90417J47648j57748n21662N12778
14063E016245j60604j20615k31379R0038N414j81944J75260m56114O3850n3071
14053D147080J86186N8520m15510J90954j45386J63876k79764J56778j50240j92498
14043C719996N4977k32014L60734k70600J10478k63587O3836N2043j20657M0932
14033C516138j20133j24839J14331J51102M7487m8788m56935M35638l15892J9674
$$ plain form
14023 3217783 3305800 3206436 2961918 2884503 3123555 3141678 3113519 3255044 2870872 3079170
14013 3079170 2795691 2985010 2695327 2847304 2494882 3048657 2696643 2797320 2451892
14004 2451892 2655411 2798997 2344297 2723981 2402580 2552534 2680120 2388807 2356943 2227772
13994 2227772 2476304 2436465 2179187 2437714 2312993 2078824 2220650 2330954 2189386 2430530
13984 2430530 2082167 2099203 2128840 1989613 2164497 2804695 2758057 3509148 3991347 4120189
13974 4120189 5020725 5991926 7232850 9506663 12555360 12384181 10088034 8729284 7437394
13965 7437394 7656005 6690142 6537995 6086846 5913372 5884372 5764917 5329244 5467601 4845134
13955 4845134 4792014 4520236 4823965 4673812 4358084 3878586 3818605 3616664 3323942 3309441
$$ packed form
14023C217783Q8017r9364k44518p7415K39052J8123k8159J41525l84172K08298
14013C079170k83479J89319k89683J51977l52422N53775l52014J00677l45428
14004B451892K03519J43586m54700L79684l21401J49954J27586k91313l1864j29171
13994B227772K48532l9839k57278K58527j24721k34169J41826J10304j41568K41144
13984B430530l48363J7036K9637j39227J74884O40198m6638P51091M82199J28842
13974D120189R00536R71201J240924K273813L048697j71179k296147j358750j291890
13965G437394K18611r65863j52147m51149j73474k9000j19455m35673J38357o22467
13955D845134n3120k71778L03729j50153l15728m79498n9981k01941k92722j4501
$$ plain form
13945 3309441 3393043 3050002 3026412 2891198 2666313 2864832 2402646 2878041 2691416 2707471
13935 2707471 2205899 2365666 2156318 2323925 1995189 2124312 2268578 2114791 2241130
13926 2241130 1878583 1843629 1528271 2064527 1986345 1648977 1695341 1801832 2006760 1533024
13916 1533024 1551412 1608437 1689494 1718437 1482798 1372784 1685889 1647093 1679436 1523627
13906 1523627 1159079 1552298 1530898 1321909 1127063 1322264 1607283 1671928 1410747 1237744
13896 1237744 1176656 1598693 1471601 1175273 1034897 1393939 1208941 1440449 1355234 1645844
13886 1645844 1407547 1174279 1164745 1228088 1303823 1405689 970997 1179095 1267382 1160529
13876 1160529 1145803 1282446 1037033 1289867 1177788 1072831 1229066 1091286 1039957 940242
$$ packed form
13945C309441Q3602l43041k3590j35214k24885J98519m62186M75395j86625J6055
13935B707471n01572J59767k09348J67607l28736J29123J44266j53787J26339
13926B241130l62547l4954l15358N36256p8182l37368M6364J06491K04928m73736
13916A533024J8388N7025Q1057K8943k35639j10014L13105l8796L2343j55809
13906A523627l64548L93219k1400k08989j94846J95201K85019O4645k61181j73003
13896A237744o1088M22037j27092k96328j40376L59042j84998K31508q5215K90610
13886A645844k38297k33268r534O3343P5735J01866m34692K08098Q8287j06853
13876A160529j4726J36643k45413K52834j12079j04957J56235j37780n1329r9715
$$ plain form
13866 940242 1168088 948372 1347206 1371798 866076 1210043 894225 1247181 1190706 1103946
13856 1103946 1113256 1042953 960327 1157359 1064117 1358671 1175764 960961 1152099 988971
13846 988971 924880 1009488 1259086 1193105 1118229 1048680 1040855 1184793 986047 859259 837671
13835 837671 1090171 789056 1020829 995010 1105139 1092393 667734 867423 671385 938772
13825 938772 951141 778978 765564 950903 1094388 703034 768212 941646 626014 1225709
13815 1225709 867242 612793 848150 980173 679731 677393 977960 651530 1169984 1225242
13805 1225242 897988 832737 1060631 872138 511155 543483 921458 586430 1002906 647720
13795 647720 864104 849646 745602 857319 731490 924027 605640 551814 663501 386637
$$ packed form
13866I40242K27846k19716L98834K4592n05722L43967l15818L52956n6475q6760
13856A103946R310p0303q2626J97032r3242K94554j82907k14803J91138j63128
13846I88971o4091Q4608K49598o5981p4876o9549p825J43938j98746j26788k1588
13835H37671K52500l01115K31773k5819J10129j2746m24659J99689j96038K67387
13825I38772J2369j72163j3414J85339J43485l91354O5178J73434l15632N99695
13815A225709l58467k54449K35357J32023l00442k338L00567l26430N18454N5258
13805A225242l27254o5251K27894j88493l60983L2328L77975l35028M16476l55186
13795F47720K16384j4458j04044J11717j25829J92537l18387n3826J11687k76864
$$ plain form
13785 386637 400031 1054290 751124 1174324 554424 883150 608363 679284 867889 661571
13775 661571 761331 668045 605416 552659 812100 384215 532503 698209 849225 505465
13765 505465 1024218 1015705 670887 453806 790069 686604 494755 793563 734568 854032
13755 854032 620588 408991 564018 794408 481748 741306 453896 693761 592823 715715
13745 715715 563336 803066 961789 754752 466572 563128 714373 720682 669721 758740
13735 758740 518708 261774 623959 275832 441137 262157 745360 592538 784399 475711
13725 475711 660686 660467 545252 636603 513912 581109 284070 718837 592592 478824
13715 478824 464209 301185 405655 837714 494238 389552 580894 361655 394948 526843
$$ packed form
13785C86637J3394O54259l03166M23200E54424L28726k74787P0921J88605k06318
13775F61571R9760r3286o2629n2757K59441C84215J48288J65706J51016l43760
13765E05465N18753q513l44818k17081L36263j03465j91849K98808n8995J19464
13755H54032k33444k11597J55027K30390l12660K59558k87410K39865j00938J22892
13745G15715j52379K39730J58723k07037k88180R6556J51245O309n0961Q9019
13735G58740k40032k56934L62185B75832J65305j78980M83203j52822J91861l08688
13725D75711J84975k19j15215R1351j22691O7197B84070M34767j26245j13768
13715D78824j4615j63024J04470M32059l43476j04686J91342k19239L3293J31895
$$ plain form
13705 526843 576325 611744 611785 336009 574095 499697 458517 360263 374723 486928 497402
13694 497402 525855 377534 551996 759135 551304 432938 645176 168941 413936 174713
13683 666304 348462 559658 448699 625831 714913 619544 231086 626810 608464 426850
13673 426850 530345 230492 317722 495087 601388 198064 485927 525567 394845 452298
13663 452298 401044 498408 424153 398452 538109 804883 409751 368530 367595 604770 777187
13652 777187 416236 434032 537975 353960 404445 216088 341719 600869 444451 302106
13642 302106 520498 209024 171273 287014 332546 325387 693674 231328 373741 546442
13632 546442 348860 701891 441158 474781 190998 682775 335089 476853 293109 316010
$$ packed form
13705E26843M9482L5419M1k75776K38086p4398m1180r8254J4460J12205J0474
13694D97402K8453j48321J74462K07139k07831j18366K12238A68941K44995A74713
13683F66304l17842K11196j10959J77132Q9082r5369B31086L95724j8346j81614
13673D26850J03495B30492Q7230J77365J06301A98064K87863L9640j30722N7453
13663D52298n1254R7364p4255k5701J39657K66774l95132m1221r35K37175J72417
13652G77187l60951J7796J03943j84015N0485j88357J25631K59150j56418j42345
13642C02106K18392B09024l7751J15741M5532p159L68287B31328J42413J72701
13632E46442j97582L53031k60733L3623A90998M91777C35089J41764j83744K2901
$$ plain form
13622 316010 355673 652478 356186 289083 705379 43046 300656 119367 670089 480735
13612 480735 172281 245758 301478 381169 136375 263411 270484 548662 211366 -127665
13601 242815 317791 421719 790118 227830 412191 374213 536478 354196 10786 6964
13591 6964 525403 112786 293817 413652 614872 471847 305671 307663 162721 433453
13581 433453 309674 168187 537225 372511 342384 376148 264186 158369 719729 234960
13570 544738 194764 295499 179750 286515 593408 -103665 347021 39255 187318 -123
13559 44538 189985 372798 -17085 397776 259314 -26673 364160 82619 360032 6096 428154
13548 428154 331549 229975 250721 543121 274762 242279 207834 -132888 104551 369621
$$ packed form
13622C16010L9663K96805k96292o7103M16296D3046K57610A19367N50722j89354
13612D80735A72281P3477N5720P9691A36375J27036P073K78178B11366a27665
13601B42815P4976J03928L68399B27830J84361l7978J62265j82282A0786l822
13591F964N18439A12786J81031J19835K01220j43025j66176J992j44942K70732
13581D33453j23779j41487L69038j64714l0127L3764j11962j05817N61360B34960
13570E44738A94764J00735j15749J06765L06893a03665C47021C9255J48063a23
13559D4538J45447J82813a7085C97776j38462b6673C64160H2619K77413F096M22058
13548D28154r6605j01574K0746K92400k68359l2483l4445a32888A04551K65070
$$ plain form
13538 369621 322818 292519 520604 480827 103269 502785 261432 95338 205725 272494
13528 272494 202429 172816 374775 443079 336204 14877 300662 -2432 203334 283141 326325
13517 326325 221830 343301 -10525 284374 41781 -53994 144835 106563 283598 173165
13507 173165 314280 512008 428519 228144 235043 290924 317806 98182 162772 297701 222614
13496 222614 671746 116286 -63702 197056 394984 474640 255924 164439 118329 230528
13486 230528 -4264 159984 141826 228209 180387 45261 181407 297216 457238 387110 466777
13475 466777 49776 30068 535970 174889 270756 227484 296845 338867 247712 580230 358440
13464 358440 13710 304161 -14158 386857 -106012 55986 453782 295815 -113883 -68257
$$ packed form
13538C69621m6803l0299K28085l9777A03269L99516k41353I5338J10387O6769
13528B72494p0065k9613K01959O8304j06875A4877K85785b432B03334P9807M3184
13517C26325j04495J21471a0525B84374D1781e3994A44835l8272J77035j10433
13507A73165J41115J97728q3489k00375O899N5881K6882I8182O4590J34929p5087
13496B22614M49132A16286f3702A97056J97928P9656k18716r1485m6110J12199
13486B30528d264A59984j8158Q6383m7822D5261J36146J15809J60022p0128P9667
13475D66777D9776j9708N05902A74889R5867m3272O9361M2022r1155L32518k21790
13464C58440A3710K90451a4158C86857a06012E5986L97796j57967a13883M5626
$$ plain form
13454 -68257 396193 254379 260999 561832 123474 105226 397560 348035 65721 129042 -34445
13442 309516 82159 301285 329024 91507 -240024 83544 98706 -61825 383248 270934 366252
13431 366252 294838 34727 186041 517932 38331 -159898 -8584 -88833 -80301 -93950 371750
13419 363486 398200 93875 299214 274035 396520 238740 285689 66233 529639 196413
13408 223175 226909 379428 72509 224792 -1974 10778 557869 564027 85806 193006 91121
13396 245110 168162 191466 152991 57823 51979 277124 251865 -94925 202725 626663 247210
13384 -11393 113474 507270 182060 -107422 154643 -75267 601408 20924 64286 122309
13374 122309 414980 116506 279 166169 273562 -72943 345399 78473 -127769 220006
$$ packed form
13454f8257C96193j41814O620L00833A23474j8248K92334m9525F5721O3321c4445
13442C09516H2159K19126K7739I1507b40024H3544J5162f1825C83248j12314R5318
13431C66252p1414C4727J51314L31891C8331a59898h584q0249Q532j3649C71750
13419C63486L4714I3875K05339k5179J22485j57780M6949F6233M63406A96413
13408B23175L734J52519G2509J52283a974A0778N47091O158H5806J07200I1121
13396B45110p6948K3304l8475E7823n844K25145k5259i4925B02725M23938B47210
13384a1393A13474L93796A82060a07422A54643g5267F01408B0924M3362N8023
13374A22309K92671A16506B79J65890J07393g2943C45399G8473a27769B20006
$$ plain form
13363 -13781 419180 -618 295595 32904 -44251 170985 306990 124964 243610 82047 -40804
13351 206918 263569 219914 248148 104078 422286 282792 217541 190921 -25753 118466 75994
13340 75994 168064 218171 557809 -147778 213021 63867 60813 242028 234525 49447 86220
13329 86220 42954 392676 262066 625722 -1541 408559 66545 559291 220573 114609
13319 114609 103564 306618 33199 254619 -212723 223850 513327 35288 17385 335525
13309 335525 151759 198185 326793 -222052 299616 404220 38002 -12704 233629 92921
13298 319644 482213 93969 107421 205898 -26742 463767 495188 13686 115181 198889 63640
13286 158394 -49345 164920 94549 48474 149201 -168953 226968 178660 216171 267382 77351
$$ packed form
13363a3781D19180f18B95595C2904d4251A70985J36005A24964J18646H2047d0804
13351B06918N6651m3655K8234A04078L18208j39494o5251k6620b5753A18466m2472
13340G5994R2070N0107L39638a47778B13021F3867l054J81215p503D9447L6773
13329H6220D2954L49722j30610L63656a541D08559F6545M92746B20573j05964
13319A14609j1045K03054C3199K21420b12723B23850K89477C5288A7385L18140
13309C35525A51759M6426J28608b22052B99616J04604C8002a2704B33629I2921
13298C19644J62569I3969J3452R8477b6742D63767L1421A3686J01495Q3708F3640
13286A58394d9345A64920p0371m6075J00727a68953B26968m8308L7511N1211G7351
$$ plain form
13274 -85 -83741 -31801 -138412 255974 -42124 124139 -30517 375167 -164941 95528 -58665
13262 230753 271737 23865 376683 658987 58960 215462 -18027 4195 207580 -321687 -75014
13250 -253556 129172 204993 366330 173157 -363113 82863 340656 343599 112839 213141
13240 213141 75023 143995 281945 338240 -85805 -45038 165182 202782 36325 -19147 -14249
13229 -14249 -131357 -315703 -78160 246207 111626 151275 52330 366010 366494 228281 166291
13218 166291 103840 94082 -85417 201242 -209222 -101139 237666 100143 111003 4169 315608
13207 315608 192090 81136 55615 119408 41990 19252 227473 31751 166560 548350 224029
13195 274554 25273 106385 -104494 245263 412776 260968 196401 -116218 419476 14456
$$ packed form
13274h5q3656c1801j06611B55974d2124A24139c0517C75167a64941I5528e8665
13262B30753M0984B3865L52818K82304E8960J56502a8027D195K03385c21687g5014
13250b53556A29172P5821J61337A73157c63113H2863K57793K943A12839J00302
13240B13141G5023O8972J37950N6295h5805M0767A65182L7600C6325a9147M898
13229a4249j17108j84346g8160B46207A11626L9649E2330L13680M84j38213o1990
13218A66291o2451r758h5417B01242b09222a01139B37666A00143J0860D169L11439
13207C15608j23518H1136k5521O3793D1990A9252K08221C1751J34809L81790B24029
13195B74554B5273Q1112a04494B45263J67513j51808o4567a16218D19476A4456
$$ plain form
13184 166798 -125678 -371174 185310 238439 -274527 20072 -58240 -5557 285605 -134450
13173 -188870 232297 165741 -13495 -116308 205811 77930 190549 29076 -118879 214658
13162 325285 206829 334678 146520 23025 123073 216916 -17697 162637 61014 -23054
13151 -3996 288018 26051 102223 -132293 80771 -45629 -136471 250178 143459 -77851 220305
13139 -71287 73558 118222 139008 350021 148920 -83158 -150603 -74986 -187629 -266062 302825
13127 57834 34553 454542 -47044 208765 224517 195759 261024 -63236 161026 193807 151030
13116 151030 -56117 52365 20122 -219099 -57309 1642 -47303 227295 -58579 118216 -101046
13104 -109452 40954 74156 3088 279604 -219554 240853 -14070 528158 -133783 -143333 163035
$$ packed form
13184A66798a25678k45496A85310N3129b74527B0072e8240e557B85605a34450
13173a88870B32297o6556a3495j02813B05811G7930J12619B9076a18879B14658
13162C25285j18456J27849A46520B3025J00048R3843a7697A62637F1014b3054
13151c996B88018B6051P6172a32293H0771d5629r0842B50178j06719g7851B20305
13139g1287G3558M4664K0786K11013A48920h3158o7445g4986j12643p8433C02825
13127E7834k3281M19989d7044B08765J5752k8758O5265f3236A61026L2781m2777
13116A51030e6117E2365B0122b19099e7309A642d7303B27295e8579A18216a01046
13104a09452D0954L3202C088K76516b19554B40853a4070E28158a33783r550A63035
$$ plain form
13092 -323142 -97393 268614 67004 44355 182754 59731 -22869 274468 116361 -44320 126827
13080 -34505 -177289 -166856 241720 -96213 249928 166554 5761 107297 63411 -36512 -79433
13069 -79433 -44049 209720 -42873 -27337 204784 -120745 114631 103108 -14377 69829 125139
13058 125139 162300 82708 -42486 240503 112256 -81202 295801 -54855 120602 24300 113161
13047 113161 246312 293333 -94146 -3682 -78172 -166794 38843 -202083 -142688 -9487 54735
13035 -155320 -45326 -134152 114042 366906 -43128 72207 88279 91746 -4325 -8509 233470
13023 143099 119917 300362 -279309 104600 251983 290374 -433814 -38671 -74534 -61868
13013 -61868 -152624 42616 -189219 18 -39823 26204 -21616 229383 165328 153274 -57518 -223090
$$ packed form
13092c23142i7393B68614F7004k2649J38399E9731b2869B74468A16361d4320A26827
13080c4505j42784J0433B41720i6213B49928q3374E761J01536m3886c6512m2921
13069g9433L5384B09720d2873J5536B04784a20745A14631j1523a4377F9829N5310
13058A25139L7161p9592d2486B40503A12256h1202B95801e4855A20602B4300Q8861
13047A13161J33151M7021i4146c682p4490q8622C8843b02083N9395i487E4735
13035a55320d5326q8826A14042K52864d3128G2207J6072L467d325m184B33470
13023A43099k3182J80445b79309A04600J47383L8391d33814c8671l5863J2666
13013f1868r0756D2616a89219A8c9823B6204b1616B29383o4055j2054e7518j65572
$$ plain form
13001 -223090 47503 -12430 7530 305702 -217520 188188 -235517 16954 212334 -182199
12990 10669 65477 63065 203599 -124595 351500 -181705 7205 -101850 1266 -99761 305974
12978 -269482 161364 147319 -133778 232445 336489 -13572 409639 -25781 195187 -89553
12967 50323 123471 129960 162981 97408 75914 288179 69661 242296 182371 -3361 43482 293011
12955 293011 208507 -37007 -146804 179536 -63793 45403 98594 319915 156879 18142 -48160
12943 24444 -257661 286970 -100948 -124039 59508 176673 6262 -153358 -39745 -157829 163572
12931 343155 -250950 -217483 108677 64086 171450 -42463 -72709 26261 -53320 -87494 169425
12919 5760 291711 -8603 -130083 -171976 -92909 -194538 71209 -13503 -187296 164202 -15678
$$ packed form
13001b23090D7503a2430G530K98172b17520A88188b35517A6954J95380a82199
12990A0669N4808k412J40534a24595C51500a81705G205a01850A266i9761C05974
12978b69482A61364j4045a33778B32445J04044a3572D09639b5781A95187h9553
12967E0323P3148O489L3021o5573k1494K12265F9661J72635n9925c361D3482K49529
12955B93011q4504c7007j09797A79536f3793D5403N3191K21321A56879A8142d8160
12943B4444b57661B86970a00948k3091E9508J17165F262a53358c9745j18084A63572
12931C43155b50950L3467A08677m4591J07364d2463l0246B6261e3320l4174A69425
12919E760K85951h603j21480m1893P9067j01629G1209a3503j73793A64202a5678
$$ plain form
12907 100744 -99610 -53636 -17124 -153704 109011 -30096 207596 -2686 176013 204723 -102624
12895 -193561 -46642 -162250 -24626 172158 -74852 164436 101588 -110951 99964 285593
12885 285593 281326 -308058 -90113 -18307 93682 485119 -248831 190878 -355337 173722
12874 130024 99119 320567 107272 -61614 232511 178994 -206947 145010 106410 79703
12864 79703 155076 127199 211364 32386 242144 -149770 -238048 -286861 245331 117752 79615
12853 79615 -209875 -98390 -19952 239530 376650 768 -9604 51656 -310399 -113540 532403
12841 -357136 -134193 -300923 -17898 248617 245041 100279 -106800 -326547 -220893 131402
12830 -53755 39457 33767 91488 -138925 -40035 134393 16196 -161163 74439 -28041 247733
$$ packed form
12907A00744i9610M5974a7124j36580A09011c0096B07596b686A76013K8710a02624
12895a93561d6642j15608b4626A72158g4852A64436o2848a10951I9964J85629
12885B85593m267c08058i0113a8307I3682L91437b48831A90878c55337A73722
12874A30024l0905K21448A07272f1614B32511n3517b06947A45010l8600k6707
12864G9703P5373k7877Q4165C2386K09758a49770q8278m8813B45331A17752l8137
12853G9615b09875i8390a9952B39530J37120G68i604E1656c10399a13540E32403
12841c57136a34193j66730a7898B48617l576A00279a06800k19747J05654A31402
12830e3755C9457n690N7721a38925d0035A34393A6196a61163G4439b8041B47733
$$ plain form
12818 18573 -84578 128694 -102064 32757 64993 105511 151402 -321171 31447 10098 -43734
12806 145991 -397306 91892 97678 68017 -32189 35003 -189071 -24160 174464 179905 -20328
12794 310840 24438 -12572 156144 108358 16479 -48015 165800 -78302 160480 -16720 31785
12782 -73823 -111882 -149828 68663 -269973 109976 -107083 158709 102207 6993 -107505 -127689
12771 -127689 -79147 66361 -8573 -224642 167483 -95684 190169 70600 216442 24743 48091
12760 48091 81374 -404501 10930 209011 -4409 132690 29271 162994 -239585 164785 -316605
12748 -219991 123704 289934 -113151 -83959 -92293 -89431 -57579 -50427 -157613 100667 -121901
12736 105473 42286 28604 -90296 -274819 -64084 -179216 -10600 490335 -237860 21453 -289295
$$ packed form
12818A8573h4578A28694a02064C2757L2236M0518M5891c21171C1447A0098d3734
12806A45991c97306I1892N786k9661c2189C5003a89071b4160A74464N441b0328
12794C10840B4438a2572A56144m7786A6479d8015A65800g8302A60480a6720C1785
12782g3823l8059l7946F8663b69973A09976a07083A58709n6502F993a07505k0184
12771a27689M8542F6361h573k16069A67483i5684A90169G0600J45842B4743K3348
12760D8091L3283d04501A0930J98081d409A32690B9271J33723b39585A64785c16605
12748b19991A23704J66230a13151K9192q334K862L1852P152j07186A00667a21901
12736A05473D2286j3682i0296j84523f4084j15132a0600D90335b37860B1453b89295
$$ plain form
12724 -111412 112007 -225174 178399 -35038 -196411 62214 -12914 -41432 -131507 61543 -5717
12712 -117675 -124558 -166303 14804 60009 -20992 -225961 45132 -108357 34794 -263962 175483
12700 14435 244274 66637 -418956 169276 112133 -171350 64074 47435 -34173 238145 45158
12688 -51052 253677 201214 -505488 465486 -119856 -30187 58183 87102 -163221 -107794 -74263
12677 -74263 -79193 21362 -133403 -29004 192644 -50125 121549 228641 95096 10762 64662
12666 64662 -132433 251185 176733 137923 240186 69734 -39031 263631 -411649 227364
12655 88047 -48603 138474 33361 34411 84103 184308 149770 -24707 -239415 -148587 -23155
12643 -284640 -21245 410730 33226 -283268 370286 -238783 -271353 147729 -160987 138305
$$ packed form
12724a11412A12007b25174A78399c5038j61373F2214a2914k8518r0075F1543e717
12712a17675o883m1745A4804M5205b0992k04969D5132a08357C4794b63962A75483
12700A4435K29839F6637d18956A69276n7143a71350F4074j6639c4173B38145D5158
12688e1052B53677n2463e05488D65486a19856c0187E8183K8919a63221N5427L3531
12677g4263m930B1362a33403b9004A92644e0125A21549J07092I5096A0762N3900
12666F4662a32433B51185p4452l8810J02263F9734c9031B63631d11649B27364
12655H8047d8603A38474C3361J050M9692J00205l4538b4707k14708R0828b3155
12643b84640b1245D10730C3226b83268C70286b38783l2570A47729a60987A38305
$$ plain form
12632 252041 10434 -76038 -161789 -18711 80731 47820 64855 86376 350176 338839 40030
12620 -62380 114863 281845 6582 -10213 310117 153358 -222848 -121366 70162 27089 136861
12609 136861 16846 422022 154740 265601 177657 -4053 1886 271592 -50342 -155481 -201880
12598 -201880 84255 44607 -8583 325612 173817 288267 -151487 -81959 476777 -178121
12587 222926 327861 -256992 129511 -15639 -33267 135471 313340 129763 441130 -43740
12576 174260 -319872 52610 -356533 -309561 -124284 -43178 313151 253562 -333799 111361
12565 292658 205755 89222 -247544 -303530 -204243 70156 11897 9487 -77110 57548 220957
12554 220957 -109075 164255 -90486 -18043 -109950 226406 196577 -228008 1674 -306157 77546
$$ packed form
12632B52041A0434g6038q5751a8711H0731l2911J7035K1521K63800j1337D0030
12620f2380A14863J66982F582a0213C10117A53358b22848J01482G0162B7089J09772
12609A36861A6846M05176A54740J10861q7944d053A886K69706e0342j05139m6399
12598b01880H4255l9648h583C25612j51795J14450a51487O9528D76777a78121
12587B22926J04935b56992A29511a5639j7628A35471J77869A29763L11367d3740
12576A74260c19872E2610c56533M6972a24284d3178C13151n9589c33799A11361
12565B92658q6903H9222b47544n5986R9287G0156A1897k410g7110E7548J63409
12554B20957a09075A64255i0486a8043r1907B26406k9829b28008A674c06157G7546
$$ plain form
12542 -7283 -205428 -55419 143268 343382 81473 364600 120335 228669 132359 -293327
12531 41761 -211243 -88818 166552 -323879 161867 222915 188044 31918 137791 281886
12521 281886 -81333 375577 -69667 -131067 -160823 384920 26112 55677 99987 -81486 -137017
12510 -137017 -338006 -201535 -70637 17578 -4508 -172196 69731 -103613 119894 55053 -151657
12498 28007 79815 -26409 441448 52574 36137 18240 248250 211016 305866 -22440 -15054
12487 -15054 54429 28655 -166552 270955 -43861 -90083 -163970 98460 -5607 131822 217844
12476 217844 -27769 -111035 -14678 -107167 33461 -150790 135685 -298068 -161272 -36192 -119744
12465 -119744 155970 -243060 -111942 168977 -193188 143540 -13876 27136 124635 -497232
$$ packed form
12542g283j98145e5419A43268K00114H1473K83127A20335J08334r6310b93327
12531D1761b11243h8818A66552c23879A61867O1048l4871C1918J05873J44095
12521B81886h1333C75577f9667o1400k9756C84920B6112K9565M4310h1486n5531
12510a37017k00989J36471g0637A7578d508j67688F9731a03613A19894E5053a51657
12498B8007N1808b6409D41448E2574j6437j7897K30010l7234R4850b2440P386
12487a5054E4429k5774a66552B70955d3861m6222p3887I8460e607A31822Q6022
12476B17844b7769q3266a4678r2489C3461a50790A35685b98068J36796c6192q3552
12465a19744A55970b43060a11942A68977a93188A43540a3876B7136R7499d97232
$$ plain form
12454 231098 253019 -120164 391650 -91407 -59234 31699 -277534 -233658 -207098 -248197 -50524
12442 -97652 -107678 104171 -95674 198167 -195691 99624 304278 -160084 69541 -57345 -56280
12431 -56280 -28137 -412791 58330 167838 -113729 -105504 64312 -123617 173305 -79737 305286
12419 -64432 -416182 -139455 222702 288472 46851 -131244 280522 92457 -91475 -90261 -32640
12407 280594 -205093 -449991 -165403 -129291 316828 -218018 -65767 -87559 237997 22774
12396 207707 -115384 -291222 27661 28782 -34516 -224689 2455 10065 21960 134231 -131013
12384 -169670 215805 344631 26496 -57670 -213355 -118477 -45548 -40981 218314 -196073 86534
12372 -46274 400654 -154154 47709 -149158 57261 193080 17706 131147 -162538 -93126
$$ packed form
12454B31098K1921a20164C91650i1407L2173C1699b77534M3876K6560m1099e0524
12442i7652j0026A04171i5674A98167a95691I9624K04654a60084F9541e7345J065
12431e6280b8137l84654E8330J09508a13729Q225F4312a23617A73305g9737C05286
12419f4432l51750a39455B22702O5770D6851a31244B80522I2457i1475J214c2640
12407B80594b05093k44898a65403L6112C16828b18018f5767k1792B37997B2774
12396B07707a15384j75838B7661J121c4516j90173B455P610J1895J12271a31013
12384a69670B15805J28826B6496e7670j55685R4878d5548M567B18314a96073H6534
12372d6274D00654a54154D7709a49158E7261J35819A7706J13441a62538O9412
$$ plain form
12362 -93126 28823 501762 28124 -109327 -190685 107135 30122 -184694 -343365 -260094 152903
12350 109188 54876 -146066 -48685 -15046 -341060 15963 174566 85210 -251473 248369
12339 205 213860 -155097 -130399 -25168 221421 398116 148785 -23039 -113959 224541 -63556
12327 184262 311838 -50764 91825 -180169 90394 22784 -6444 -54931 273855 -80958 183953
12315 2106 270134 58836 -169605 180270 -176181 -140878 30787 -82401 175245 342739 -91032
12303 84703 -191746 50141 10113 -128006 -228411 -225137 56250 46772 171851 -8578 -380215
12292 -380215 130009 -32181 -91916 75648 112735 90797 -176533 125558 -189478 154485
12281 -18211 63454 -62401 12928 251913 139653 150868 -88724 -184935 9303 -78497 -219446
$$ packed form
12362i3126B8823M72939B8124a09327q1358A07135C0122a84694j58671Q3271A52903
12350A09188n4312a46066d8685a5046l26014A5963J58603H5210b51473B48369
12339B05K13655a55097K4698b5168B21421J76695A48785b3039r0920B24541f3556
12327A84262J27576e0764I1825a80169I0394B2784f444m8487B73855h0958A83953
12315B106K68028E8836a69605A80270a76181L5303C0787h2401A75245J67494i1032
12303H4703a91746E0141A0113a28006j00405L274E6250r478J25079h578l71637
12292c80215A30009c2181n9735G5648L7087k1938a76533A25558a89478A54485
12281a8211F3454f2401A2928K38985j12260J1215h8724r6211I303g8497j40949
$$ plain form
12270 -219446 -126184 -26218 53948 -30573 -19981 93674 -171087 23043 22965 -4105 -271308 45522
12257 29200 240 -52088 8549 176576 22248 -43141 155046 180855 74637 220084 -156674
12245 -467036 36986 -198616 -248373 -21223 -102317 71169 -96934 3402 226116 190941 472072
12234 472072 41045 -17912 -256775 -74090 -14192 12402 -244692 246849 -43346 1778 -25776
12222 -173952 -108044 -104528 -153507 -10254 206733 -117495 150438 229473 11075 112045 302789
12211 302789 266944 46387 -19565 120943 3828 62613 19791 178074 307097 -76656 135879
12199 178210 100431 2666 -118895 293725 395969 294847 133393 -82377 278935 -589 92989
12187 -39162 233425 304057 64332 130332 199024 313493 192680 -21841 89121 330898 50466
$$ packed form
12270b19446R3262b6218E3948c0573J0592I3674a71087B3043p8d105k67203D5522
12257B9200B40e2088H549J68027B2248d3141A55046K5809G4637J45447a56674
12245d67036C6986a98616m9757b1223q1094G1169i6934C402K22714l5175K81131
12234D72072D1045a7912k38863g4090a4192A2402b44692B46849d3346A778b5776
12222a73952O5908L516m8979a0254B06733a17495A50438P9035A1075J00970J90744
12211C02789l5845D6387a9565A20943C828N8785A9791J58283J29023g6656A35879
12199A78210p7779B666a18895B93725J02244j01122A33393h2377B78935e89I2989
12187c9162B33425P0632F4332O6000O8692J14469j20813b1841H9121K41777E0466
$$ plain form
12175 43197 124543 436636 -98449 -91358 323075 222394 268221 178705 63857 130959 -28510
12163 -22882 284268 36994 -274037 -163716 198154 -15460 191789 185025 72349 27203 110931
12152 110931 47703 4156 79429 -11925 248899 288246 515411 -80375 -122804 3865 384347
12141 384347 183720 50829 55684 46863 98798 -55906 -95951 239405 -297437 211374 53598
12129 46556 147851 -299541 44402 -147712 57468 -348843 -85835 -70728 301800 -50879 135284
12117 -138652 613746 65719 235523 14837 61835 242634 355732 -108743 -128425 -56980
12106 -378043 -133170 28063 51660 191382 -158410 -114538 -230324 -173215 -371855 69174
12095 -24934 -293361 6831 -139788 115220 127042 -38848 172400 57973 43737 148551 -115115
$$ packed form
12175D3197Q1346L12093i8449P091C23075j00681M5827q9516F3857O7102b8510
12163b2882B84268C6994b74037J10321A98154a5460A91789o764G2349B7203Q3728
12152A10931D7703D156P5273a1925B48899L9347K27165h0375m2429C865L80482
12141C84347A83720E0829M855q821N1935e5906m0045B39405b97437B11374E3598
12129D6556J01295b99541D4402a47712E7468c48843h5835J5107C01800e0879A35284
12117a38652F13746F5719J69804A4837M6998J80799J13098a08743j9682e6980
12106c78043a33170B8063K3597J39722a58410M3872j15786N7109j98640F9174
12095b4934k68427F831a39788A15220J1822c8848A72400E7973j4236J04814a15115
$$ plain form
12083 227426 229138 -24657 74561 -63233 127125 22424 -45633 -73892 -313552 -230342 -13833
12071 218358 -158431 -198061 -309912 -154429 47858 133043 -73290 290109 311856 164672
12061 164672 38764 -182049 221330 332079 218631 313769 9965 219131 139333 193720 425938
12050 425938 277306 -85476 202326 101429 79699 147265 131257 174405 65933 6527 347317
12039 347317 64269 105627 -66791 139802 -124779 -342326 -224552 109977 -150527 236645
12028 -179527 155757 -109131 97851 168609 95862 -223022 56541 168369 -187456 40471
12017 148974 -36138 -33389 2773 143681 -325134 137216 305052 251257 124693 -42648 -111210
12006 -111210 -76270 -220861 -47994 199995 -317649 -27182 -82536 -75139 121411 -97486 -263307
$$ packed form
12083B27426J712b4657G4561f3233A27125B2424d5633k8259k39660Q3210a3833
12071B18358a58431l9630j11851a54429D7858Q5185g3290B90109K1747j47184
12061A64672C8764a82049B21330J10749j13448R5138I965K09166p9798N4387K32218
12050D25938j48632h5476B02326j00897k1730O7566j6008M3148F5933F527L40790
12039C47317F4269M1358f6791A39802a24779k17547J17774A09977a50527B36645
12028a79527A55757a09131I7851P0758p2747b23022E6541J11828a87456D0471
12017A48974c6138K749B773J40908c25134A37216J67836n3795A24693d2648o8562
12006a11210L4940j44591d7994A99995c17649b7182n5354P397A21411i7486j65821
$$ plain form
11995 -263307 88046 47063 -72031 -42027 -30924 -8607 304923 107005 237438 -155569 86912
11983 -142688 -54424 -26345 217401 -208807 -260693 -5225 -227338 -219071 18382 127757 -200833
11971 -6522 -142729 86008 88449 -207981 -7832 69953 -85167 84762 -117227 -36182 249403
11959 -11005 -299961 27581 -251324 289956 -229835 -85976 144917 -61358 224205 -168571
11948 71556 56457 -214413 -157935 454788 150037 -195967 -173270 520278 159483 -288572
11937 -55333 77261 190157 -134604 -88191 254486 -265067 -230020 -26132 -10748 -31488 118743
11925 208550 -49851 3410 -39810 31324 60138 25408 -305809 126329 105947 -24016 -258634
11914 -258634 19889 -178496 88719 -114563 99144 -8978 99445 -266951 53789 -98435 58651
$$ packed form
11995b63307H8046m0983g2031L0004J1103h607C04923A07005J30433a55569H6912
11983a42688e4424b6345B17401b08807n1886e225k22113Q267A8382J09375b00833
11971f522j36207H6008K441b07981g832F9953h5167H4762a17227c6182B49403
11959a1005k88956B7581b51324B89956b29835h5976A44917f1358B24205a68571
11948G1556j5099b14413N6478D54788A50037a95967K2697E20278A59483b88572
11937e5333G7261J12896a34604M6413B54486b65067L5047b6132a0748k0740A18743
11925B08550d9851C410c9810C1324K8814B5408c05809A26329k0382b4016k34618
11914b58634A9889a78496H8719a14563I9144h978I9445b66951E3789i8435E8651
$$ plain form
11902 26882 -170929 87825 -4890 158737 -80316 88302 180694 103995 30807 -14137 242784
11890 33584 -233297 -29187 -216225 157951 -129973 -196238 -334769 -245196 -105480 22376
11879 165219 171594 -231113 -1960 -202839 -63057 -6782 -194755 -152705 277513 -168311 -118777
11868 -118777 -182387 344712 -51114 -327947 -155735 6013 30635 14538 29132 -260789 32133
11856 -211382 -189604 -17693 82670 -48347 26699 -291662 28170 55302 53474 -84728 -228053
11845 -228053 15162 -230201 -74368 228737 -158149 -312606 -192442 -92916 -79234 -183007
11835 -183007 -126475 -61549 -31749 6159 -336378 113385 15159 -299829 -15664 178190 -258308
11823 111490 175835 -104335 -186202 -141392 183802 -186687 -13174 -253577 -238270 -183356 -96762
$$ packed form
11902B6882a70929H7825d890A58737h0316H8302R2392p6699C0807a4137B42784
11890C3584b33297b9187j87038A57951a29973o6265j38531Q9573a05480B2376
11879A65219O375b31113a960k00879f3057f782j87973M2050B77513a68311M9534
11868a18777o3610C44712e1114k76833a55735F013K4622A4538J4594b60789C2133
11856b11382K1778a7693H2670d8347B6699b91662B8170K7132j828h4728j43325
11845b28053A5162b30201g4368B28737a58149j54457J20164i2916J3682j03773
11835a83007N6532f1549K9800F159c36378A13385A5159b99829a5664A78190b58308
11823A11490O4345a04335q1867M4810A83802a86687a3174k40403J5307N4914Q6594
$$ plain form
11812 -96762 61664 -42126 132658 -232559 -266345 -166892 -213877 -81311 493452 47068 -9054
11800 -401366 -192486 26064 -322297 209664 -143152 -225083 -279258 -206608 177029 159558
11790 159558 -76359 -107563 -292864 -277712 -187836 -175325 -191589 -12417 -247499 -252494 187837
11778 -159706 -33692 -267840 36258 85616 -23059 -13846 -55135 -77307 109999 -181274 -41712
11766 61620 -20447 36449 -219815 148394 242445 55539 140360 -6105 -275114 85627 -167668
11754 -79335 66273 -45355 -258344 -31724 -60938 41885 -242809 28491 115430 -269164 42429
11742 -169666 -48202 194403 -84191 218303 188499 212575 -215132 18500 -179392 -128738 44786
11730 227048 162397 -118248 167385 -135954 98873 155459 -153876 -183763 -162740 -464479
$$ packed form
11812i6762F1664d2126A32658b32559l3786R9453m6985h1311D93452D7068i054
11800d01366a92486B6064c22297B09664a43152q1931n4175P2650A77029j7471
11790A59558g6359l1204j85301J5152Q9876J2511j6264a2417k35082m995A87837
11778a59706c3692k34148C6258M9358b3059R213m1289k2172A09999a81274d1712
11766F1620b0447C6449b19815A48394R4051E5539Q4821f105k69009H5627a67668
11754g9335F6273d5355k12989c1724k9214D1885b42809B8491Q6939b69164D2429
11742a69666d8202A94403h4191B18303k9804K4076b15132A8500a79392N0654D4786
11730B27048o4651a18248A67385a35954I8873N6586a53876k9887K1023l01739
$$ plain form
11720 -464479 84644 210613 -73151 -133555 -184 -255503 426 -414017 214839 -84471 186300
11708 -56162 -346037 -59166 -38159 113765 6389 -90477 -88472 -118629 75546 -210813 460425
11696 176040 117029 -159086 234873 51524 390371 82907 91890 -65496 152131 -437076 1295
11684 -10133 -126442 58595 301801 -33661 -83810 182382 168246 -10188 -129366 -157517 98028
11672 -322894 48885 -136525 -62739 58993 -57274 118574 -211188 269479 -132571 -294496
11662 -294496 -200566 -114605 -145557 -144378 -172571 31806 207540 -30251 170892 97845 -148754
11650 230741 163546 -297200 115664 95226 2663 -293930 -201271 48288 22549 12081 -382480
11638 30173 -33024 -202309 56204 -9695 220122 150670 -260144 41102 -211034 259774 -83760
$$ packed form
11720d64479H4644J25969g3151o0404a84k55319D26d14017B14839h4471A86300
11708e6162k89875e9166K1007A13765F389i0477K005l0157G5546b10813D60425
11696A76040n9011a59086B34873E1524L38847H2907Q983f5496A52131d37076A295
11684a0133j16309E8595K43206c3661n0149A82382j4136a0188j19178k8151I8028
11672c22894D8885a36525f2739E8993e7274A18574b11188B69479a32571j61925
11662b94496R3930Q5961l0952J179k8193C1806J75734c0251A70892p3047a48754
11650B30741o7195b97200A15664k0438B663b93930R2659D8288B2549j0468c82480
11638C0173c3024j69285E6204i695B20122o9452b60144D1102b11034B59774h3760
$$ plain form
11626 265082 189209 160576 76548 -84369 -136794 304663 -129752 41894 -111963 -107691 -137206
11615 -137206 389601 -11512 -60775 -6661 75074 -73724 -109111 80040 233105 -96082 -41304
11603 8294 166425 -563 32960 -94893 -224014 -11359 -190872 19681 255142 -174880 -165070
11592 -165070 -207962 74966 -141737 -42904 -361312 35627 -47681 -183361 -22287 -11972 -139519
11581 -139519 -184546 130754 219804 -15178 165306 -319784 200289 -192252 208228 78307
11570 41202 -107153 243682 -106883 56305 -32686 34214 106131 -110849 88672 -26416 271708
11558 106565 -44666 -76006 184766 65079 260176 -95138 -183091 250968 155716 -28769 -49083
11547 -49083 -139277 103223 -188924 194002 37231 125722 95344 49971 -132848 60686 191784
$$ packed form
11626B65082p5873k8633G6548h4369n2425C04663a29752D1894a11963M272k9515
11615a37206C89601a1512m9263f661G5074g3724l5387H0040J53065i6082d1304
11603H294J58131e63C2960i4893j29121a1359j79513A9681K35461a74880R810
11592a65070m2892G4966a41737d2904l18408C5627d7681j35680b2287J0315j27547
11581a39519m5027A30754Q9050a5178A65306c19784B00289a92252B08228G8307
11570D1202a07153B43682a06883E6305c2686C4214P1917a10849H8672b6416B71708
11558A06565d4666l1340A84766F5079J95097i5138q7953B50968r5252b8769k0314
11547d9083r0194A03223a88924A94002C7231Q8491l0378m5373a32848F0686J31098
$$ plain form
11536 191784 159773 112854 -33826 -108265 151246 58614 26202 -118294 64478 -98816 -30049
11524 -66286 -225399 -124092 182069 140234 87858 -68860 -5222 15041 159492 -117836 182015
11512 -29149 62054 4786 -300417 -173178 208756 349308 30178 254702 -82291 -161514 -30364
11500 115218 101447 -18378 -135397 42560 -133196 -26867 248876 94361 181121 -51001 94047
11488 -123318 246063 -114262 14283 56557 346938 153496 123827 30038 -124061 227894
11477 104514 229116 123677 177497 116981 365015 419854 263880 142407 -186305 -106484
11467 -106484 219196 334126 132456 142467 -71284 -156414 -144180 116774 142481 157952 143194
11456 143194 126027 87453 9546 72420 29089 240409 -74275 -53563 147246 129676 35995
$$ packed form
11536A91784l2011m6919c3826p4439A51246E8614B6202a18294F4478i8816c0049
11524f6286j59113J01307A82069m1835n2376f8860e222A5041J44451a17836A82015
11512b9149F2054D786c00417J27239B08756J40552C0178K24524h2291p9223c0364
11500A15218j3771a8378j17019D2560a33196b6867B48876I4361Q6760e1001I4047
11488a23318B46063a14262A4283M2274K90381A53496k9669C0038a24061B27894
11477A04514J24602j05439N3820o0516K48034N4839j55974j21473a86305P9821
11467a06484B19196J14930A32456J0011g1284q5130J2234A16774K5707J5471j4758
11456A43194j7167l8574I546O2874B9089K11320g4275K0712A47246j7570C5995
$$ plain form
11444 107071 142480 29687 115409 96811 237212 -41498 15264 172889 427986 128379 542625
11433 542625 213479 108081 307768 70170 227583 -24468 162321 55047 -163269 -21287
11422 -18878 204135 122130 61134 -26388 29841 -174480 -40242 173633 -235939 160880 342819
11411 342819 -298569 40029 -26964 191262 105363 327616 108734 -41946 155578 136754
11401 136754 46785 43101 -196171 -133811 -151512 249052 30081 177466 122656 2829 47837
11390 47837 -6839 -43557 53592 260716 179100 -325909 183876 -322043 -53044 29669 219582
11379 219582 -190047 31223 -50361 155412 -9750 -172100 108057 290863 181072 -271105
11368 -334749 -28091 -46659 186280 248903 -194647 154125 -25513 278010 312268 165668
$$ packed form
11444A07071L5409B9687Q5722j8598J40401d1498A5264J57625K55097A28379M14246
11433E42625B13479j05398J99687G0170J57413b4468A62321E5047a63269b1287
11422a8878B04135q2005o0996b6388B9841a74480d0242A73633b35939A60880J81939
11411C42819b98569D0029b6964A91262q5899K22253A08734d1946A55578j8824
11401A36754D6785l684a96171O2360j7701B49052C0081J47385n4810B829M5008
11390D7837f839l6718E3592K07124q1616c25909A83876c22043e3044B9669J89913
11379B19582a90047C1223e0361A55412i750j62350A08057J82806j09791b71105
11368c34749b8091j8568A86280O2623a94647A54125b5513B78010L4258j46600
$$ plain form
11358 165668 217797 -19946 -59972 -187524 -170781 -147161 -67625 36241 -98167 322945 -27363
11346 14156 27129 -196456 75492 -111075 -188675 -56464 -203241 105666 -193684 64879 128622
11335 128622 43398 -229047 -3895 -153888 25763 -65951 -177143 218186 24115 186768 -134661
11323 9581 -88010 -162326 159604 47810 96091 112653 -107507 -325947 -102444 317841 109261
11311 -78701 -4017 -28097 -185846 -197340 188941 100229 158740 -335369 -79667 -4958 -71378
11300 -71378 172603 -104576 -125865 -114668 80999 339476 -31113 13352 -38898 36625 -68750
11288 106313 -130980 -175819 76458 -107159 254558 -14893 -93053 -228487 317718 83420
11277 256557 -266810 -75218 -417814 -41850 -240168 335460 -131867 -139648 -246044 -271797
$$ packed form
11358A65668N2129a9946m0026j27552J6743K3620f7625C6241i8167C22945b7363
11346A4156J2973a96456G5492a11075p7600e6464j46777A05666a93684F4879O3743
11335A28622D3398b29047c895j49993B5763f5951j11192B18186B4115J62653a34661
11323I581h8010p4316A59604D7810M8281J6562a07507k18440a02444C17841A09261
11311g8701d017k4080j57749j1494A88941q8712N8511c35369g9667d958o6420
11300g1378A72603a04576k1289J1197H0999K58477c1113A3352c8898C6625f8750
11288A06313a30980m4839G6458a07159B54558a4893p8160j35434C17718H3420
11277B56557b66810g5218l42596d1850j98318C35460a31867p781j06396k5753
$$ plain form
11267 -271797 -318633 -31355 -108415 103095 -41353 -139933 255694 -62326 250298 -136690 -205567
11256 -205567 -464183 -176417 102860 179335 -240680 308939 22651 156386 -336592 -277734
11246 -277734 72755 170714 155230 416899 -122664 -97293 28226 -294578 137775 21333 -180106
11234 -98842 -112002 -129950 -354787 89443 -120848 186526 -41892 9522 344050 199977 -61639
11222 36245 -38081 -307652 190701 -105495 100929 81918 117472 195032 -117208 -90445 64981
11210 113536 242530 128364 -177887 78322 -194900 46656 -261040 -162719 -112509 -189857
11200 -189857 -405277 968 -61392 -99602 -242144 -21661 148844 105667 -101771 -46517 -109640
11189 -109640 -350733 352999 79797 -68282 85438 -98064 -152449 -113822 -140010 -3804 -14939
$$ packed form
11267b71797m6836c1355p7060A03095d1353r8580B55694f2326B50298a36690o8877
11256b05567k58616a76417A02860P6475b40680C08939B2651J33735c36592N8858
11246b77734G2755R7959j5484K61669a22664K5371B8226b94578A37775B1333a80106
11234i8842j3160j7948k24837H9443a20848A86526d1892I522L34528j44073f1639
11222C6245c8081k69571A90701a05495A00929j9011L5554P7560a17208K6763F4981
11210A13536J28994j14166a77887G8322a94900D6656b61040R8321N0210p7348
11200a89857k15420I68f1392l8210j42542b1661A48844m3177a01771d6517o3123
11189a09640k41093C52999G9797f8282H5438i8064n4385L8627k6188c804j1135
$$ plain form
11178 -14939 216601 49352 -1291 210177 -84269 -68669 -97292 19119 87319 -44894 37729
11166 174456 -11308 65584 -27245 -19912 145097 94544 -59678 133363 -179311 22998 -1012
11154 188055 -45727 78294 225294 123899 -172687 -196732 127142 -366191 -250306 -293811
11144 -293811 -257607 88951 -42582 -49723 -132233 5600 203494 -196245 -124775 -139524 -159711
11133 -159711 -23073 -54702 -6796 170109 -211824 -156057 -68064 -129273 -19240 233051 -132979
11121 103446 -34357 66060 -416416 -101921 -220072 -14832 278601 217989 64581 90926 57045
11110 57045 -411568 -21015 -208334 51254 289234 93831 -104528 92388 227912 -211 -464205
11099 -464205 -15221 -20665 27632 -117914 -87532 494706 -327483 102850 203830 148140 322731
$$ packed form
11178a4939B16601D9352a291B10177h4269J5600k8623A9119O8200d4894C7729
11166A74456a1308F5584b7245P333A45097n0553e9678A33363a79311B2998a012
11154A88055d5727G8294J47000j01395a72687k4045A27142c66191J15885m3505
11144b93811L6204H8951d2582p141q2510E600J97894a96245P1470j4749k0187
11133a59711b3073l1629f796A70109b11824N5767f8064o1209a9240B33051a32979
11121A03446c4357F6060d16416a01921j18151a4832B78601o0612F4581K6345l3881
11110E7045d11568b1015j87319E1254K37980I3831a04528I2388J35524b11m63994
11099d64205a5221n444B7632a17914L0382D94706c27483A02850J00980n5690J74591
$$ plain form
11088 322731 98385 25858 14833 61907 13554 502043 109144 -25688 166753 63038 72153
11077 72153 295097 208821 -21427 135763 -30147 192263 142907 -159585 -27669 315797 501025
11066 501025 229852 88536 17570 328613 251646 114570 384359 358737 132626 303328
11056 303328 -1288 85161 -17876 -10584 517374 411946 75777 210508 214203 207674 215432 300213
11044 300213 405498 278789 455368 499873 636976 569595 463782 379883 494817 706956
11034 706956 727326 472638 525356 468103 718778 677437 565727 544952 529140 682783 594920
11023 594920 420488 545664 632164 230427 365814 441790 484890 764928 713804 722392 792968
11012 792968 490357 753888 398089 841723 625478 517779 691086 462111 646919 845640
$$ packed form
11088C22731I8385B5858j1025M7074A3554M88489A09144b5688A66753F3038R115
11077G2153K22944q6276b1427A35763c0147A92263m9356a59585b7669C15797J85228
11066E01025B29852H8536A7570L11043p6967A14570K69789k5622A32626J70702
11056C03328a288H5161a7876P292E17374j05428G5777J34731L695o529P758Q4781
11044C00213J05285j26709J76579M4505J37103o7381j05813q3899J14934K12139
11034G06956K0370k54688N2718n7253K50675m1341j11710k0775j5812J53643q7863
11023E94920j74432J25176Q6500B30427J35387P5976M3100K80038n1124Q588P0576
11012G92968l02611K63531l55799M43634k16245j07699J73307k28975J84808J98721
$$ plain form
11002 845640 819916 440921 792534 730273 783905 661392 560034 667579 722657 624909
10992 624909 622790 613011 461690 765979 391236 564417 786658 514476 562071 397475
10982 397475 706232 506206 566112 720257 586358 511652 293416 509010 426310 797460
10972 797460 838708 795391 664447 694471 397074 910794 937452 693397 965019 1131415
10962 1131415 1069264 1053995 1277527 1683785 1338096 1754650 1487802 1677355 2172107 1909924
10952 1909924 1648269 1856544 1734830 1770734 1548695 1732014 1664732 1546908 1573208 1793723
10942 1793723 1507129 1675378 1623293 1201661 1619821 1386516 1149796 1021440 957104 854219
10932 854219 967720 971470 1135839 985442 517284 518355 707354 908756 712822 672366
$$ packed form
11002H45640k5724l78995L51613o2261N3632j22513j01358J07545N5078r7748
10992F24909k119r779j51321L04289l74743J73181K22241k72182M7595j64596
10982C97475L08757k00026N9906J54145j33899p4706k18236K15594q2700L71150
10972G97460M1248m3317j30944L0024k97397N13720K6658k44055K71622J66396
10962A131415o2151j5269K23532M06258l45689M16554k66848J89553M94752k62183
10952A909924k61655K08275j21714L5904k22039J83319o7282j17824K6300K20515
10942A793723k86594J68249n2085m21632M18160k33305k36720j28356o4336j02885
10932H54219J13501L750J64369j50397m68158J071J88999K01402j95934m0456
$$ plain form
10922 672366 792638 361939 385665 621734 309741 245241 71538 307665 478415 397475
10912 397475 718014 173686 152002 466001 234552 202105 144528 -202820 70646 -124957
10901 190868 61838 517474 140115 373145 -166328 38929 176583 106457 203623 -123760
10890 18805 220192 -137759 -5183 -73646 -121985 239532 -2553 -14299 -179874 50369 198849
10879 198849 -226383 330753 126333 337478 -225931 -32583 -297326 5529 24923 107539
10869 107539 -91516 -118976 244318 -265963 -259051 -177803 -127002 79680 -56602 86221 -94524
10857 260867 -92379 111220 95150 271214 38921 123060 46957 -125138 69423 -56767 -139971
10846 -139971 -293232 -43032 71634 -19128 83916 -125969 123504 185373 157599 159550 15694
$$ packed form
10922F72366J20272C61939K3726K36069C09741o4500G1538K36127J70750q0940
10912C97475L20539A73686k1684L13999k31449l2447n7577b02820G0646a24957
10901A90868F1838M55636A40115K33030a66328C8929J37654p0126R7166a23760
10890A8805K01387a37759e183o8463m8339B39532b553j1746j65575E0369J48480
10879A98849b26383C30753A26333K11145b25931c2583k64743E529J9394Q2616
10869A07539i1516k7460B44318b65963O912Q1248N0801G9680e6602H6221i4524
10857B60867i2379A11220j6070J76064C8921Q4139D6957a25138F9423e6767q3204
10846a39971j53261d3032G1634a9128H3916a25969A23504O1869k7774J951A5694
$$ plain form
10834 -112068 287640 38191 -66992 -71445 -52684 133950 61905 -282505 -279981 -80093 90077
10822 -1370 39464 -320734 -109673 -182683 -240246 -229801 173888 -258438 -25624 -140602 49594
10810 92747 297317 -148847 -422350 257185 277611 131694 -49917 27298 -99637 -195519 -243407
10799 -243407 145683 -298787 80559 57676 235636 -130277 -2802 1415 -96917 -234714 50939
10787 -289188 -22938 385060 128137 -46624 -56371 -125052 -115803 228900 -181418 -356101 -31594
10775 -118423 56923 -132833 -45622 -274424 82618 -186794 -279875 -250871 -284310 -245040 -205329
10764 -205329 -111703 202222 -251389 -67865 -221628 242985 -323796 -242369 257181 -237701
10753 218664 -243039 303561 -127217 -76061 78189 36556 -147098 12200 -167450 30235
$$ packed form
10834a12068B87640C8191f6992m453J8761A33950F1905b82505K524h0093I0077
10822a370C9464c20734a09673p3010n7563J0445A73888b58438b5624j14978D9594
10810I2747K04570a48847k73503B57185K0426A31694d9917B7298i9637r5882m7888
10799b43407A45683b98787H0559k2883J77960a30277b802A415i6917j37797E0939
10787b89188b2938C85060A28137d6624r747o8681R249B28900a81418j74683c1594
10775a18423E6923a32833d5622k28802H2618a86794r3081K9004l3439L9270L9711
10764b05329R3626B02222b51389f7865j53763B42985c23796Q1427B57181b37701
10753B18664b43039C03561a27217N1156G8189C6556a47098A2200a67450C0235
$$ plain form
10742 35001 -290708 -146079 176029 -52855 -72362 -182804 9603 25839 -74144 -99196 -181849
10731 -181849 318688 35626 56725 -73113 -78910 11435 -429092 86826 -193741 -146300 32890
10719 45982 -161035 91951 -125659 -171020 -88944 -170319 -145129 -310457 -130508 -288034 -147437
10708 -147437 329235 198340 201321 217107 -252484 -143013 -50163 -90132 211748 -293953
10697 160182 -101309 40733 126367 -68977 -31071 -136701 -317206 353259 62325 79610 6951
10685 193857 -66527 -260811 -132666 32075 -249241 -31165 -88520 102119 31668 112241 -46660
10673 38898 -100811 -353412 -328411 115531 98995 -14193 -138809 -253839 -179686 226261
10662 -221076 -101564 -392638 358 -169131 97347 -74446 51913 -269785 157534 -254547 8000
$$ packed form
10742C5001b90708J44629A76029e2855j9507j10442I603J6236g4144k5052q2653
10731a81849C18688C5626K1099g3113n797A1435d29092H6826a93741M7441C2890
10719D5982a61035I1951a25659m5361Q2076q1375K5190j65328a30508j57526J40597
10708a47437C29235j30895K981J5786b52484J09471e0163l9969B11748b93953
10697A60182a01309D0733Q5634f8977c1071j05630j80505C53259F2325J7285F951
10685A93857f6527j94284J28145C2075b49241c1165n7355A02119C1668Q0573d6660
10673C8898a00811k52601K5001A15531j6536a4193j24616j15030P4153B26261
10662b21076a01564k91074C58a69131I7347g4446E1913b69785A57534b54547H000
$$ plain form
10650 -310389 190599 -97380 268773 -124198 -155185 33549 -47551 -90562 -228709 20523 -128442
10638 62292 20132 -289204 -172598 439444 -162304 -435992 -45238 24759 169377 39329
10627 -247386 -202877 -348757 -147841 -164492 -42436 21373 3689 -295110 -99712 -195847 -225739
10616 -225739 -38370 -4480 -43040 6419 261476 -304596 -253166 -80638 -130385 219234 -27560
10604 -225102 -93701 -83083 82865 -167811 -10982 101900 -223071 -265474 -365534 -214830
10594 -214830 168689 -148910 171082 36532 -272913 -131074 276533 -261261 -164868 -92530
10584 -92530 151113 -57345 -19604 34037 -33853 88322 86397 -83656 -188093 341898 61859
10572 -144517 78483 -219221 -289232 -446541 -387242 -43547 -6062 -102537 -301465 -68769 36985
$$ packed form
10650c10389A90599i7380B68773a24198l0987C3549d7551m3011j38147B0523a28442
10638F2292B0132b89204J16606D39444a62304k73688d5238B4759J44618C9329
10627b47386M4509j45880a47841j6651d2436B1373C689b95110i9712r6135k9892
10616b25739c8370d480l8560F419K55057c04596N1430h0638m9747B19234b7560
10604b25102i3701J0618H2865a67811a0982A01900b23071m2403j00060J50704
10594b14830A68689a48910A71082C6532b72913a31074B76533b61261R6393P2338
10584i2530A51113e7345a9604C4037c3853H8322j925h3656j04437C41898F1859
10572a44517G8483b19221p0011j57309N9299d3547f062r6475j98928f8769C6985
$$ plain form
10560 21560 141092 277761 107308 23357 63301 24602 -97137 -194806 -163565 -35008 41766
10548 -207526 -21945 -49829 155056 112364 -265817 40164 223339 -192362 -52033 -61422 -63090
10537 -63090 54105 46447 -56145 -120569 -17720 -150664 -38062 205418 142284 -3366 -187967
10526 -187967 149324 -20213 -207008 -101467 -422770 -75165 -218432 33566 -393421 94212
10515 176669 -266212 -99993 -117025 -151931 200205 -147220 -166939 -42133 -165987 34229 -200298
10503 -135499 283874 118538 -26908 279040 -271752 -53079 -292935 43146 -23072 129828
10492 354626 -48490 150791 -26881 149065 -149918 176172 -309453 -16370 140231 -53812
10481 147035 51382 -81857 -91598 -150556 44747 246280 -226408 -91389 37700 223236 -156022
$$ packed form
10560B1560J19532J36669A07308B3357L9944B4602i7137r7669L1241c5008D1766
10548b07526b1945k7884A55056m2692b65817D0164J83175a92362e2033r389j668
10537f3090E4105p658e6145o4424a7720j32944c8062B05418o3134c366j84601
10526a87967A49324b0213j86795a01467l21303g5165j43267C3566c93421I4212
10515A76669b66212i9993j7032l4906B00205a47220j9719d2133j23854C4229b00298
10503a35499B83874A18538b6908B79040b71752e3079k39856D3146b3072A29828
10492C54626d8490A50791b6881A49065a49918A76172c09453a6370A40231e3812
10481A47035E1382h1857r741n8958D4747K01533b26408i1389C7700J85536a56022
$$ plain form
10469 136873 -47458 36282 -205017 216497 7363 -228513 310990 167481 57764 -31946 152775
10457 82959 125016 -65170 224122 153629 51632 -208029 113448 48552 -28257 172114 16756
10445 -21852 -170774 3116 -122884 110906 -57786 96442 -99384 117953 152905 294975 192363
10434 192363 206011 -25963 347074 -25419 52797 -64195 -33941 -266470 126443 -500300 -70929
10422 -70717 -144170 -342865 -46112 180592 -62954 -168849 151862 -90233 -92285 -504047 7097
10410 431210 431 -179574 -320855 -14163 -29623 70063 -49093 -75961 -156935 18387 -156648
10398 -116309 -72573 543847 -141473 -79306 75712 167890 112468 -176461 -143783 -312145 -311782
10387 -311782 -5507 -159774 75061 -188973 -103523 61205 144769 -154385 -91331 -112058 122575
$$ packed form
10469A36873d7458C6282b05017B16497G363b28513C10990j43509E7764c1946A52775
10457H2959M2057f5170B24122p0493E1632b08029A13448D8552b8257A72114A6756
10445b1852j48922C116a22884A10906e7786I6442i9384A17953L4952J42070j02612
10434A92363J3648b5963C47074b5419E2797f4195L0254k32529A26443e00300g0929
10422g0717p3453j98695d6112A80592f2954j05895A51862i0233k052m11762G097
10410D31210D31a79574j41281a4163j5460G0063d9093k6868q0974A8387a56648
10398a16309M3736E43847a41473O2167G5712R2178n5422a76461L2678j68362L63
10387c11782e507j54267G5061a88973Q5450F1205Q3564a54385O3054k0727A22575
$$ plain form
10375 339428 125525 302137 210942 167270 347182 254207 46840 268875 36621 -210703
10364 -17795 295003 -94186 197529 199583 41573 164425 92723 501463 228282 131069 202589
10353 202589 284329 31933 348300 -114529 297552 134389 101581 123718 215910 316112
10343 316112 89886 222616 403693 180779 453079 363775 469716 605694 125129 143187
10333 143187 308706 279061 109423 44809 231644 195646 -113227 474838 64826 376406
10323 376406 262928 65966 416170 149016 23031 200418 69101 191618 268219 24225
10312 30989 127129 -12155 206864 297530 147093 -49447 272792 164535 533246 117299
10301 340889 76227 -32442 89918 430789 249057 41457 92645 -40961 -76786 -54441 -225907
$$ packed form
10375C39428A25525J76612r1195m3672J79912r2975D6840K22035C6621b10703
10364a7795B95003i4186A97529K054D1573J22852p1702M08740B28282r7213P1520
10353B02589Q1740C1933L16367a14529B97552A34389l2808K2137R2192J00202
10343C16112H9886J32730J81077A80779K72300q9304J05941J35978A25129J8058
10333A43187J65519k9645A09423D4809J86835l5998a13227D74838F4826L11580
10323C76406j13478F5966L50204A49016B3031J77387F9101J22517P6601B4225
10312C0989R6140a2155B06864R0666A47093d9447B72792j08257L68711A17299
10301C40889G6227c2442H9918L40871j81732D1457N1188d0961l5825K2345j71466
$$ plain form
10290 -225907 118005 173569 6718 -79633 -113807 8263 34544 -163442 246250 -201916 -112613
10279 -112613 55964 166900 -23172 39868 -162152 -84050 -69572 50478 -181103 236083 -99656
10267 -244259 -74380 178039 63591 -132752 -122553 7736 35309 55995 -52505 -136 -275173
10256 -275173 -257691 79527 -24798 -52999 -317219 1864 257287 -43114 -226588 -11512 304090
10244 -152913 137005 84437 275518 -228 74340 6209 52639 388578 202120 88261 44932
10233 44932 186936 -217440 86503 145773 106621 121159 -208402 21266 195807 51692 -86006
10221 307682 -94906 124926 -195960 284132 -101013 17786 -113167 -282960 -311221 -65740
10210 292505 -17411 -117950 110446 87570 -194302 54378 -61392 -39252 -226191 28974 -77601
$$ packed form
10290b25907A18005N5564F718g9633l4174H263K6281a63442B46250b01916Q9303
10279a12613E5964J10936b3172C9868a62152P8102J4478E0478a81103B36083i9656
10267b44259g4380A78039F3591a32752J0199G736K7573K0686e2505a36k75037
10256b75173J7482G9527b4798k8201k64220A864K55423d3114j83474a1512C04090
10244a52913A37005n2568J91081b28G4340F209M6430L35939j86458H8261m3329
10233D4932J42004b17440H6503N9270l9152J4538b08402B1266J74541E1692h6006
10221C07682i4906A24926a95960B84132a01013A7786a13167j69793k8261f5740
10210B92505a7411j00539A10446k2876a94302E4378f1392K2140j86939B8974g7601
$$ plain form
10198 27426 139063 -182396 187482 50891 -183451 -34854 -130067 14354 268103 -123490
10187 76202 -149307 277020 -182250 -139337 -129580 -427562 228756 -50320 -266528 81427 192938
10176 192938 -127232 127171 44969 162199 73334 246767 -157582 4960 -95692 39702 -62117
10164 -35185 -145434 -183429 8177 136839 -362728 76170 -131644 -49686 -153832 98934 -346504
10152 -383821 -62808 287356 -61491 -143904 -121592 131820 -89765 63057 -230206 -68135 224579
10140 232294 -154096 -200955 249413 -138867 -163244 -206188 -81424 88329 -211485 -8764 -224009
10129 -224009 88219 255533 -40627 -115178 -80843 -101598 -170926 32401 34951 -261923 2936
10117 37917 39040 247217 -87457 -83555 -266617 138652 -5009 -250321 -124997 -64890 -93947
$$ packed form
10198B7426J11637a82396A87482E0891a83451c4854r5213A4354K53749a23490
10187G6202a49307B77020a82250M2913R757k97982B28756e0320k16208H1427J11511
10176A92938a27232A27171D4969J17230G3334J73433a57582D960i5692C9702f2117
10164c5185j10249l7995H177J28662c62728G6170a31644d9686j04146I8934c46504
10152c83821f2808B87356f1491q2413K2312A31820h9765F3057b30206f8135B24579
10140B32294a54096m6859B49413a38867k4377m2944h1424H8329b11485h764k15245
10129b24009H8219J67314d0627p4551L4335k0755o9328C2401K550b61923B936
10117C7917J123K08177h7457L902j83062A38652e009k45312a24997O0107k9057
$$ plain form
10106 -93947 63674 132143 -238348 -122433 -72304 -146300 315263 -145922 -186211 -250057 -329090
10095 -329090 -200091 -236887 -121259 -171347 -281162 111868 100473 -254825 -194075 -9296 52112
10083 -457171 61734 161145 -155 -130192 -420736 126645 -122660 70006 70876 -322122 -37923
10071 226137 8567 -333425 144535 -93489 173864 37580 -55775 -19452 -176061 -153303 -87736
10060 -87736 163265 -62088 47900 165039 -5801 -172849 -115459 -186816 28495 -26273 128530
10048 -304371 -45675 -92571 -202490 53593 36200 -45912 -195263 -94827 155186 230826 -15935
10036 -557279 -280550 -280506 245574 -202854 13277 352776 46834 167854 -275694 7669 -168610
10024 -183744 -405966 163785 -130156 -45796 206564 -198588 -159668 -395486 103294 -91620
$$ packed form
10106i3947F3674O8469b38348J15915N0129p3996C15263a45922m0289o3846p9033
10095c29090J28999l6796J15628n0088j09815A11868j1395b54825O0750i296E2112
10083d57171F1734R9411a55j30037k90544A26645a22660G0006Q70c22122c7923
10071B26137H567c33425A44535i3489A73864C7580e5775a9452j56609K2758O5567
10060h7736A63265f2088D7900J17139e801j67048N7390p1357B8495b6273A28530
10048c04371d5675m6896j09919E3593j7393d5912j49351i4827A55186P5640a5935
10036e57279K76729M4B45574b02854A3277L39499D6834J21020b75694G669a68610
10024a83744k22222A63785a30156d5796B06564a98588L8920k35818A03294i1620
$$ plain form
10013 -145389 -225024 -101285 -7714 98260 -312737 50076 -163112 120953 243406 9234 -15477
10001 -133891 167145 -118730 146755 -89444 -110524 -252094 -324037 164198 -259439 -114358
9990 139814 -45637 213981 83458 -101552 -2727 -38801 112436 46053 47167 -142670 160092
9978 119744 145114 -214981 -47190 77977 316403 202556 -186615 6862 10644 136299 -64228
9966 -161393 -55947 -25624 32043 7017 101463 -179433 -190699 -229789 201783 124032 -34459
9954 83887 139214 -145816 187176 -94289 190629 -335633 -148295 -50142 122201 317460
9944 317460 -84177 112348 270916 -269594 -50599 91740 15122 37160 -99742 -27684 56965
9932 308767 -144168 76328 61123 26139 233822 1485 -11354 -348423 -78143 -240221 -197875
$$ packed form
10013a45389p9635a01285g714I8260c12737E0076a63112A20953J22453I234a5477
10001a33891A67145a18730A46755h9444k1080j41570p1943A64198b59439a14358
9990A39814d5637B13981H3458a01552b727l6074A12436D6053J114a42670A60092
9978A19744K5370b14981d7190G7977K38426j13847a86615F862L782J25655f4228
9966a61393e5947b5624C2043G017R4446a79433j1266l9090B01783p7751c4459
9954H3887N5327a45816A87176i4289A90629c35633a48295e0142A22201J95259
9944C17460h4177A12348J58568b69594e0599I1740A5122K2038i9742b7684E6965
9932C08767a44168G6328j5205B6139K07683A485a1354l37069g8143j62078M2346
$$ plain form
9921 -197875 127595 -91051 -162264 -75069 -243961 28998 -28201 -139278 -52295 -190516 -135816
9910 -135816 -82415 -214164 -226772 -559059 154099 -36401 -265918 387600 -6373 192648 -157859
9898 21820 82127 -244131 -292581 -3678 10936 -331229 -22186 -102264 7059 -224873 -114568
9887 -114568 -271148 -7661 -196631 -203004 -181283 -165730 -107310 -94223 -180185 -176948 -36713 339216
9874 -178622 -33613 -204686 7999 -324241 101830 -76495 -148264 62395 -15602 56538 -116748
9862 -65729 213654 96999 5364 26274 110394 28730 107115 -227176 -278648 -485206 53160
9850 -326026 272124 -6682 -13811 154124 -168354 -168411 -262177 -13130 66694 24808 -150562 -249279
9838 -249279 -354413 78279 -10391 105523 98153 -163309 -246693 -39409 -363435 -151869 -119430
$$ packed form
9921a97875A27595i1051p1213g5069j68892B8998b8201j11077e2295j38221N4700
9910a35816N3401j31749j2608l32287A54099c6401k29517C87600f373A92648a57859
9898B1820O0307b44131m8450c678A0936c31229b2186q0078G059b24873J10305
9887a14568j56580g661j88970o373K1721J5553N8420J3087q5962L237c6713C39216
9874a78622c3613j71073G999c24241A01830g6495p1769F2395a5602E6538a16748
9862f5729B13654I6999E364K0910Q4120B8730P8385b27176n1472k06558E3160
9850c26026B72124f682p129A54124a68354n7r3766a3130F6694B4808a50562r8717
9838b49279j05134G8279a0391A05523p370a63309q3384c9409l24026a51869L2439
$$ plain form
9827 -119430 30176 36417 151729 33481 -132224 -183310 -127384 -207426 230478 233417 -162711
9815 -111641 46524 -139525 -7004 56158 -32886 41623 159481 21630 60430 -2440 -98697 213882
9802 -401108 -137528 -286038 16737 144383 114575 -120044 14577 279441 -1100 322504 28444
9790 173216 126423 24634 103202 -60862 -81052 260220 -137923 63231 -7107 -40684 -71136
9779 -71136 -429047 34105 -280706 2744 56483 -289844 -55647 -192583 137061 -98989 5491
9767 -260762 -108646 -64008 -12161 369896 157736 180352 -214582 162658 140750 -201748
9756 58721 83590 -304065 75452 -86991 364792 330923 26474 25662 -328475 45223 365489
9745 365489 -254071 -16084 77930 -303801 112253 22741 -108534 -136927 -238669 -305081 -19618
$$ packed form
9827a19430C0176O241J15312C3481a32224n1086N5926q0042B30478K939a62711
9815a11641D6524a39525g004E6158c2886D1623J17858B1630L8800b440r6257B13882
9802d01108a37528j48510A6737J27646k9808a20044A4577K64864a100C22504B8444
9790A73216m6793B4634P8568f0862k0190B60220a37923F3231g107l3577l0452
9779g1136l57911C4105b80706B744N3739b89844e5647j36936A37061i8989E491
9767b60762a08646M4638a2161C69896A57736K2616b14582A62658k1908b01748
9756E8721K4869c04065G5452h6991C64792l3869B6474q12c28475D5223L20266
9745C65489b54071a6084G7930c03801A12253B2741a08534k8393j01742o6412a9618
$$ plain form
9733 -59167 133959 -341124 -57328 277436 103391 -70360 -9057 -116600 79724 26172 -120596
9721 -176795 -189907 -114774 28672 98165 -143419 13849 211612 -12959 -232735 -90754 -15199
9709 -16011 -62346 -197241 -147606 38443 -199116 -92838 -37999 50474 -331279 -344490 -91725
9697 -136680 -50195 -68042 254825 -22065 -230376 -250526 -165179 106295 -203484 -30633 -290366
9686 -290366 -14434 2766 -181101 -172120 -173078 27304 -134232 -166584 -280607 -29317 -145193 -129604
9674 -129604 -140111 -200441 26310 -194761 -2339 85394 -124134 41273 -148340 -83170 253928
9662 -357758 -378747 -376808 -105172 74737 90753 -276693 40184 -184146 -55002 -30701 -233457
9651 -233457 -182860 -70175 -179139 -113850 -141365 31561 -215684 -53147 -5627 -325007 -173789
$$ packed form
9733e9167A33959c41124e7328B77436A03391g0360i057j07543G9724B6172a20596
9721a76795j3112P5133B8672O9493a43419A3849J97763a2959k19776i0754a5199
9709a6011m6335j34895M9635C8443a99116i2838c7999E0474c31279j3211i1725
9697a36680e0195j7847B54825b2065k08311k0150Q5347A06295b03484c0633k59733
9686b90366a4434B766a81101Q981r58B7304a34232l2352j14023b9317j15876J5589
9674a29604j0507o0330B6310a94761b339H5394a24134D1273a48340O5170B53928
9662c57758k0989J939a05172G4737J6016b76693D0184a84146e5002K4301k02756
9651b33457N0597g0175j08964O5289k7515C1561b15684e3147e627l19380J51218
$$ plain form
9640 -173789 -40659 113387 60971 -96970 -59417 43189 -217367 -293816 -228845 -357715 334330
9628 -10596 -230879 -152501 105982 -203679 25548 -284507 -25769 -258460 -98069 -83167 263209
9616 -193363 -278718 88427 123651 -87215 -174625 329459 1441 -10229 -93397 -33332 36173 -396015
9603 -182749 89624 43027 -64369 200263 -296691 242849 -203712 -361348 45278 29410 146294
9592 146294 152231 56287 159725 -388140 -13253 -222305 -10312 226024 -29892 -107989 -58485
9581 -58485 -154005 -332596 -127052 -277651 160023 -126985 247732 254899 -14112 5220 -74266
9569 -51841 -75484 -98218 -68953 -148450 126071 181678 109077 -60203 -177880 -198624 8675 -321059
9556 -304393 94126 -233629 -911 165245 -168123 -58335 -81386 65904 -265118 -75472 -2628
$$ packed form
9640a73789d0659A13387n2416i6970L7553D3189b17367p6449O4971j28870C34330
9628a0596k20283P8378A05982b03679B5548b84507b5769k32691i8069J4902B63209
9616a93363q5355H8427L5224h7215q7410C29459A441a0229q3168c3332C6173c96015
9603a82749H9624D3027f4369B00263b96691B42849b03712j57636D5278j5868J16884
9592A46294N937E6287J03438c88140a3253k09052a0312B26024b9892p8097M9504
9581e8485r5520j78591a27052j50599A60023a26985B47732P167a4112E220g4266
9569e1841k3643k2734K9265p9497A26071N5607p2601f0203j17677k0744H675c21059
9556c04393I4126b33629i11A65245a68123e8335k3051F5904b65118g5472b628
$$ plain form
9544 76986 -450032 217328 10034 -67153 -115487 -85434 -105189 250873 -135692 -32343 -4525
9532 67950 15334 -22470 108501 -227417 -89765 -149836 -306259 15424 -146536 129296 -117099
9520 151094 -91770 -35298 -211754 -62748 -338704 124486 -212960 -38420 14903 -85024 -79047
9509 -79047 -41211 21999 -283523 -214430 152949 54231 30979 247675 -108740 -143331 -417565
9498 -417565 135797 -41070 45276 67486 164926 9553 161031 203552 -98032 442505 62890
9486 47642 298650 -69704 298146 -104585 -105572 -85143 31558 69754 172407 100957 82627
9475 82627 -21380 -138652 61050 -484281 382 173836 -10152 -4938 107623 -104630 -189233
9464 -189233 -150045 -105222 47793 343757 -117306 -325698 -34189 203346 -219278 -363297
$$ packed form
9544G6986d50032B17328A0034f7153m8334L0053j9755B50873a35692c2343d525
9532F7950A5334b2470A08501b27417h9765o0071j56423A5424a46536A29296a17099
9520A51094i1770c5298j76456f2748k75956A24486b12960c8420A4903h5024N977
9509g9047L7836B1999b83523O9093A52949E4231k3252K16696a08740l4591k74234
9498d17565A35797d1070D5276K2210R7440I553J51478M2521i8032D42505F2890
9486D7642K51008f9704B98146a04585r87K0429C1558L8196J02653p1450j8330
9475H2627b1380j17272F1050d84281C82J73454a0152d938A07623a04630q4603
9464a89233L9188M4823D7793K95964a17306k08392c4189B03346b19278j44019
$$ plain form
9454 -363297 -221055 308995 252150 -118203 -281083 17347 310934 -145392 81692 84658 -563718
9442 4029 280648 25090 -17608 -238296 -82886 -56806 -149390 70397 -294694 -14947 -65087
9431 -65087 -290968 118753 -111475 -23862 -80878 -126154 -10834 -12838 -322017 -94056 -77036
9420 -77036 5649 212872 94028 -224847 -135633 -94830 -256264 52575 -139993 -93591 -20374
9408 356523 -329588 -152407 -226894 269873 113966 -433946 -28818 54218 -13471 -153372
9398 -153372 -139271 -300196 67056 153027 20626 -207953 -192718 -39337 6185 77498 -430670
9386 26707 -28037 -124258 -81478 183258 -15708 -334679 93443 -42204 -208138 33268 -127148
9374 -65796 80196 -97929 -45590 -427379 -129206 -97921 -269200 179423 94700 -123259 -226906
$$ packed form
9454c63297J42242C08995n6845a18203j62880A7347K93587a45392H1692K966e63718
9442D029K76619B5090a7608k20688h2886K6080r2584G0397b94694a4947n0140
9431f5087k25881A18753a11475b3862n7016m5276a0834k004l09179i4056J7020
9420g7036E649K07223I4028b24847Q9214M0803j61434E2575a39993M6402b0374
9408C56523c29588a52407p4487B69873A13966d33946b8818E4218a3471j39901
9398a53372J4101j60925F7056Q5971B0626b07953J5235c9337F185P1313d30670
9386B6707b8037r6221M2780A83258a5708l18971I3443d2204j65934C3268a27148
9374f5796H0196i7929d5590l81789a29206L1285j71279A79423q4723a23259j03647
$$ plain form
9363 -226906 230985 -117153 -16709 18431 -76250 139069 -76317 -243616 -97479 -350861 162797
9351 276288 -244236 -246316 -419166 -66351 -182511 19369 -257113 -237943 29348 -90051 -127860
9340 -127860 -10211 -67497 3827 -443264 127595 -77967 -28620 -217077 89711 253156 -116648
9328 -449128 113071 -208568 -234974 -79163 -217339 98612 137788 254963 526 -276062 -113523
9316 -170233 163578 49508 -97720 85001 168816 174212 -36068 -85231 371167 -229246 -176782
9305 -176782 36175 289709 -14305 22600 26593 -229738 -63485 96527 -64989 329016 435687
9294 435687 -27932 -246772 -57036 -111672 -62389 23032 -79243 70567 -150805 177777 66694
9282 -300864 -35278 -302719 -222092 -1145 105738 18951 -96125 -154618 -274920 -118810 -159714
$$ packed form
9363b26906B30985a17153a6709A8431g6250A39069g6317j67299i7479k53382A62797
9351B76288b44236k080j72850f6351j16160A9369b57113J9170B9348i0051l7809
9340a27860a0211n7286C827d43264A27595g7967b8620j88457H9711J63445a16648
9328d49128A13071b08568k6406g9163j38176I8612L9176J17175E26b76062a13523
9316a70233A63578D9508i7720H5001Q3815N396c6068m9163C71167b29246N2464
9305a76782C6175K53534a4305B2600L993b29738f3485I6527f4989C29016J06671
9294D35687b7932k18840e7036n4636M9283B3032g9243G0567a50805A77777F6694
9282c00864c5278k67441Q0627a145A05738A8951i6125n8493j20302a18810m0904
$$ plain form
9271 -159714 128061 -207268 124405 -29988 48207 245351 -105174 -147808 -319637 116622
9260 -152280 -29435 -12732 373073 40965 212589 89130 61176 -98165 -418477 -253243 -165455
9249 -165455 -534228 -225960 -74945 19835 4553 -156702 -211490 -332160 37203 47639 -179973
9237 -331594 12839 -330586 -1898 194161 -37883 -185619 -97949 -124931 -37777 -165185 130150
9225 -204629 -200891 63609 -75682 -218169 131510 -162724 -92403 -166282 -122773 133393 -192331
9213 -52986 247657 -47640 -255189 27022 127893 181054 -155566 145875 -396404 97815 -46774
9201 -90073 117616 124961 31939 15021 -270818 -204179 -344716 57496 -30018 -176984 16516
9189 66776 18848 -83218 -291511 -122268 30805 -44994 93530 14821 -136755 -18720 -111057
$$ packed form
9271a59714A28061b07268A24405b9988D8207J97144a05174m2634j71829A16622
9260a52280b9435a2732C73073D0965J71624H9130k7954i8165l20312J65234Q7788
9249a65455l68773b25960g4945A9835D553a56702n4788j20670C7203J0436a79973
9237c31594A2839c30586a898A94161c7883j47736Q7670k6982c7777j27408A30150
9225b04629L738F3609g5682j42487A31510a62724P0321p3879M3509A33393a92331
9213e2986B47657d7640k07549B7022J00871N3161a55566A45875c96404I7815d6774
9201i0073A17616P345C1939A5021b70818O6639j40537E7496c0018j46966A6516
9189F6776A8848h3218k08293a22268C0805d4994I3530A4821a36755a8720r2337
$$ plain form
9178 -111057 96357 -970 161114 -76434 -145528 33535 -152404 -156611 57173 -265265 -144186
9167 -144186 39501 -439053 -139859 124334 -28256 118777 154700 -65339 128103 47865 -30643
9155 87685 3129 -101077 51531 89357 -17681 -240490 -159430 54925 -30484 -15796 -89655 -168786
9143 -168786 -101974 -222651 -165400 107152 49592 164091 64183 -290981 102571 153666 -227704
9131 -55212 -109011 -234940 104576 177652 -46532 -134238 160995 -304617 163460 -309265 60203
9119 66245 68527 -92518 -239424 29705 -220031 -54165 97730 -310651 -143292 -134664 -158282
9108 -158282 -256363 -33682 -14259 -199208 110105 -13382 -405305 -250459 339304 -240366
9097 3156 -185045 -53895 59823 130497 182382 253755 -27321 9941 118481 97523 -25796 -209063
$$ packed form
9178a11057I6357i70A61114g6434o9094C3535a52404m207E7173b65265J21079
9167a44186C9501d39053a39859A24334b8256A18777L5923f5339A28103D7865c0643
9155H7685C129a01077E1531L7826a7681k22809Q1060E4925c0484J4688p3859p9131
9143a68786O6812j20677N7251A07152D9592J14499F4183b90981A02571N1095b27704
9131e5212n3799j25929A04576P3076d6532q7706A60995c04617A63460c09265F0203
9119F6245K282i2518j46906B9705b20031e4165I7730c10651a43292Q628k3618
9108a58282r8081c3682a4259j84949A10105a3382l91923J54846C39304b40366
9097C156a85045e3895E9823P0674N1885P1373b7321I941J08540k0958b5796j83267
$$ plain form
9085 -209063 131295 355295 -160407 -287160 266209 -102779 -44656 53898 199366 -275130
9074 -270083 83854 37218 214349 -99232 26473 -97094 -67628 -141033 -131971 -54109 -298518
9063 -298518 100264 -213450 220160 18346 89479 -252527 -56388 -103753 18235 -16115 -66937
9052 -66937 69901 46193 63465 -92691 -474969 21086 -130474 -32330 -321131 -16761 -183622
9041 -183622 -145282 126388 -230826 -13959 -115362 -363945 169516 -150145 -92588 -152207
9031 -152207 -51938 -124189 269022 157210 -53290 102562 156228 -14320 83085 -25258 -186314
9020 -186314 -15071 -204287 224112 -40195 -140548 -108577 -160600 -149800 18607 -5147 76967
9008 -448886 302731 -487337 104377 -72621 -26561 -92567 -220485 -42408 108018 16967 -23912
$$ packed form
9085b09063A31295K24000a60407j26753B66209a02779d4656E3898J45468b75130
9074b70083H3854C7218J77131i9232B6473i7094K9466p3405R062e4109k44409
9063b98518A00264b13450B20160A8346P1133b52527e6388m7365A8235a6115n0822
9052f6937F9901k3708J7272i2691l82278B1086a30474c2330k88801a6761j66861
9041a83622L8340A26388b30826a3959j01403k48583A69516a50145N7557n9619
9031a52207e1938p2251B69022j11812e3290A02562N3666a4320H3085b5258j61056
9020a86314a5071j89216B24112d0195j00353L1971n2023J0800A8607e147G6967
9008d48886C02731d87337A04377g2621b6561o6006j27918d2408A08018A6967b3912
$$ plain form
8996 -11557 -134706 248598 -187036 -280831 287330 256564 -79099 80099 -118612 -66730 -225060
8985 -225060 -157368 -40460 29855 177264 -72679 134821 -91624 -322358 -63190 132815 -42253
8973 25265 -175906 213988 76117 260813 149226 -293681 201589 -137631 -64513 -160082
8963 -160082 -113581 -470490 -35712 -689 -124132 -82796 -30549 374896 -88208 -272846 -90748
8951 -179836 -113698 -29246 -15410 -66898 -35344 11391 172046 153028 90479 120244 -7230 -28941
8939 -28941 -75844 -85166 -57727 119306 -65801 220324 -141837 -78581 63344 205087 -12143
8927 123953 190702 -334954 -135200 149194 -137335 -310286 129261 -121089 23708 -155015
8916 364841 138299 -255711 217048 30443 449033 504611 596159 594841 802144 1422865 1693984
$$ packed form
8996a1557j23149B48598a87036r3795B87330l0766g9099H0099a18612N1882j58330
8985b25060O7692d0460B9855J47409g2679A34821i1624k30734f3190A32815d2253
8973B5265a75906B13988G6117J84696j11587b93681B01589a37631f4513r5569
8963a60082M6501l56909c5712f89j23443M1336c0549C74896h8208j84638i0748
8951a79836O6138b9246J3836n1488L1554A1391J60655j9018o2549K9765g230k1711
8939b8941m6903r322K7439A19306f5801B20324a41837O3256F3344J41743a2143
8927A23953O6749c34954a35200A49194a37335j72951A29261a21089B3708a55015
8916C64841A38299b55711B17048C0443M18590N5578R1548j318K07303O20721K71119
$$ plain form
8905 1693984 2270361 2669850 1562895 1760591 1240708 1482569 1230738 889534 748158
8896 748158 586506 508956 430567 837857 541774 682076 565878 530786 151716 290449
8886 290449 324862 186693 378974 674360 393512 542431 188389 346638 223581 174869
8876 174869 183616 372321 269726 200085 -23586 389404 68249 373378 232112 -126141 361139
8864 -38076 -174686 245112 -182997 -115427 -42290 -98838 -172666 174337 -157358 33762 -149628
$$ packed form
8905A693984N76377L99489j106955J97696n19883K41861k51831l41204j41376
8896G48158j61652p7550p8389M07290k96083J40302j16198l5092A51716J38733
8886B90449L4413j38169J92281K95386k80848J48919A88389J58249j23057m8712
8876A74869Q747J88705j02595o9641b3586C89404F8249L05129j41266a26141C61139
8864c8076j36610B45112a82997O7570d2290n6548p3828A74337a57358C3762a49628
$$ [...]
##END NTUPLES=NMR SPECTRUM
##END=
