
##TITLE=UV1143_M5-1005-1002_6279095_Cy1ukQ6bDw
##JCAMPDX= 6.0         $$ Bruker NMR JCAMP-DX V2.0
##DATA TYPE= NMR SPECTRUM
##DATA CLASS= NTUPLES
##ORIGIN= BRUKER
##OWNER= Administrator
$$ 1.72 TOPSPIN		Version 2.1
$$ 2012-06-07 05:38:59.890 -0500  Administrator@TOPSPIN
$$ Compression mode = diff/dup
##.OBSERVE FREQUENCY= 400.13188235
##.OBSERVE NUCLEUS= ^1H
##.ACQUISITION MODE= SIMULTANEOUS (DQD)
##.ACQUISITION SCHEME= undefined
##.AVERAGES= 64
##.DIGITISER RES= 22
##SPECTROMETER/DATA SYSTEM= spect
##.PULSE SEQUENCE= noesygpps1d.comp
##.SOLVENT NAME= COFFEE_meoh
##.SHIFT REFERENCE= INTERNAL, COFFEE_meoh, 1, 14.96758
##AUDIT TRAIL= $$ (NUMBER, WHEN, WHO, WHERE, PROCESS, VERSION, WHAT)
$$ ##TITLE= Audit trail, TOPSPIN		Version 2.1
$$ ##JCAMPDX= 5.01
$$ ##ORIGIN= Bruker BioSpin GmbH
$$ ##OWNER= Administrator
$$ $$ C:\Bruker\TOPSPIN/data/COFFEE/nmr/UV1143_M5-1005-1002_6279095_Cy1ukQ6bDw/22/pdata/1/auditp.txt
$$ ##AUDIT TRAIL=  $$ (NUMBER, WHEN, WHO, WHERE, PROCESS, VERSION, WHAT)
(   1,<2012-06-07 05:38:54.765 -0500>,<Administrator>,<TOPSPIN>,<go>,<TOPSPIN 2.1>,
      <created by zg
	started at 2012-06-07 05:27:24.437 -0500,
	POWCHK enabled, PULCHK disabled,
       configuration hash MD5:
       D5 CA 7A 23 FE 6B EE E2 50 67 74 61 24 F7 5E 3B
       data hash MD5: 64K
       04 A2 1E 8E 47 22 B6 13 9C 44 EB FC A6 CF 38 25>)
(   2,<2012-06-07 05:38:57.593 -0500>,<Administrator>,<TOPSPIN>,<proc1d>,<TOPSPIN 2.1>,
      <Start of raw data processing
       efp LB = 0.3 FT_mod = 6 PKNL = 1 PHC0 = 0 PHC1 = 0 SI = 128K 
       data hash MD5: 128K
       59 5D FD 68 B0 E3 AD F2 D1 E9 02 78 C8 F8 C5 0B>)
(   3,<2012-06-07 05:38:58.796 -0500>,<Administrator>,<TOPSPIN>,<proc1d>,<TOPSPIN 2.1>,
      <pk PHC0 = 34.93103 PHC1 = 0 
       data hash MD5: 128K
       37 8C FA 19 03 46 F7 76 BF 03 C4 51 31 4D BA 68>)
(   4,<2012-06-07 05:38:59.546 -0500>,<Administrator>,<TOPSPIN>,<proc1d>,<TOPSPIN 2.1>,
      <abs ABSG = 1 
       data hash MD5: 128K
       67 6D 0C D7 54 00 8C 56 A8 2E 17 F4 D3 3A 2B 12>)
(   5,<2012-06-07 05:38:59.625 -0500>,<Administrator>,<TOPSPIN>,<proc1d>,<TOPSPIN 2.1>,
      <abs ABSG = 2 
       data hash MD5: 128K
       65 1C F2 85 81 15 50 B4 47 5C E3 12 5E 2F C4 EE>)
(   6,<2012-06-07 05:38:59.687 -0500>,<Administrator>,<TOPSPIN>,<proc1d>,<TOPSPIN 2.1>,
      <abs ABSG = 3 
       data hash MD5: 128K
       F8 DB A8 1C C6 DC 4A BB 72 69 98 E9 A7 9B F6 A7>)
(   7,<2012-06-07 05:38:59.750 -0500>,<Administrator>,<TOPSPIN>,<proc1d>,<TOPSPIN 2.1>,
      <abs ABSG = 4 
       data hash MD5: 128K
       3D D7 6D F0 BA 6F A2 D4 A7 53 41 06 92 DD 45 3D>)
(   8,<2012-06-07 05:38:59.812 -0500>,<Administrator>,<TOPSPIN>,<proc1d>,<TOPSPIN 2.1>,
      <abs ABSG = 5 
       data hash MD5: 128K
       BC CB F3 EB F3 35 60 23 24 B0 6C C2 24 66 89 5A>)
$$ ##END=
$$ 
$$ $$ hash MD5
$$ $$ D1 44 E3 24 58 A9 24 80 92 2A 6F A0 4C B8 56 EC
##$RELAX= 
##$RELAX= 
##$RELAX= 
##$RELAX= 
##$RELAX= 
##$RELAX= 
##$RELAX= 
##$RELAX= 
$$ Bruker specific parameters
$$ [...]
##$TP07= 0
##$TPNAME0= <>
##$TPNAME1= <>
##$TPNAME2= <>
##$TPNAME3= <>
##$TPNAME4= <>
##$TPNAME5= <>
##$TPNAME6= <>
##$TPNAME7= <>
##$TPOAL= (0..7)
0.5 0.5 0.5 0.5 0.5 0.5 0.5 0.5
##$TPOFFS= (0..7)
0 0 0 0 0 0 0 0
##$TUNHIN= 0
##$TUNHOUT= 0
##$TUNXOUT= 0
##$USERA1= <user>
##$USERA2= <user>
##$USERA3= <user>
##$USERA4= <user>
##$USERA5= <user>
##$V9= 5
##$VALIST= <valist>
##$VCLIST= <CCCCCCCCCCCCCCC>
##$VD= 0
##$VDLIST= <DDDDDDDDDDDDDDD>
##$VPLIST= <PPPPPPPPPPPPPPP>
##$VTLIST= <TTTTTTTTTTTTTTT>
##$WBST= 2048
##$WBSW= 25
##$XGAIN= (0..3)
0 0 0 0
##$XL= 0
##$YL= 0
##$YMAX_a= 12056901
##$YMIN_a= -5878472
##$ZGOPTNS= <>
##$ZL1= 120
##$ZL2= 120
##$ZL3= 120
##$ZL4= 120
##$ABSF1= 14.96758
##$ABSF2= -5.58495
##$ABSG= 5
##$ABSL= 3
##$ALPHA= 0
##$AQORDER= 0
##$ASSFAC= 0
##$ASSFACI= 0
##$ASSFACX= 0
##$ASSWID= 0
##$AUNMP= <proc_prof1d_extract.lims>
##$AXLEFT= 0
##$AXNAME= <>
##$AXNUC= <1H>
##$AXRIGHT= 0
##$AXTYPE= 0
##$AXUNIT= <>
##$AZFE= 0.1
##$AZFW= 0.1
##$BCFW= 0
##$BC_mod= 0
##$BYTORDP= 0
##$COROFFS= 0
##$CY= 15
##$DATMOD= 1
##$DC= 0
##$DFILT= <>
##$DTYPP= 0
##$F1P= 0
##$F2P= 0
##$FCOR= 0.5
##$FTSIZE= 131072
##$FT_mod= 6
##$GAMMA= 0
##$GB= 0
##$INTBC= 1
##$INTSCL= 1
##$ISEN= 128
##$LB= 0.3
##$LEV0= 0
##$LPBIN= 0
##$MAXI= 10000
##$MC2= 0
##$MEAN= 0
##$ME_mod= 0
##$MI= 0
##$NCOEF= 0
##$NC_proc= -4
##$NLEV= 6
##$NOISF1= 0
##$NOISF2= 0
##$NSP= 0
##$NTH_PI= 0
##$NZP= 0
##$OFFSET= 14.96758
##$PC= 1
##$PHC0= 34.93103
##$PHC1= 0
##$PH_mod= 1
##$PKNL= yes
##$PPARMOD= 0
##$PPDIAG= 0
##$PPIPTYP= 0
##$PPMPNUM= 2147483647
##$PPRESOL= 1
##$PSCAL= 4
##$PSIGN= 0
##$PYNMP= <proc.py>
##$REVERSE= no
##$SF= 400.130005215037
##$SI= 131072
##$SIGF1= 0
##$SIGF2= 0
##$SINO= 400
##$SIOLD= 131072
##$SPECTYP= <>
##$SREGLST= <1H.CDCl3>
##$SSB= 0
##$STSI= 131072
##$STSR= 0
##$SW_p= 8223.68421052632
##$SYMM= 0
##$S_DEV= 0
##$TDeff= 65536
##$TDoff= 0
##$TI= <>
##$TILT= no
##$TM1= 0
##$TM2= 0
##$TOPLEV= 0
##$USERP1= <user>
##$USERP2= <user>
##$USERP3= <user>
##$USERP4= <user>
##$USERP5= <user>
##$WDW= 1
##$XDIM= 131072
##$YMAX_p= 368047654
##$YMIN_p= -323553939
##$CURPLOT= <Network HP LaserJet P1505>
##$CURPRIN= <$Network HP LaserJet P1505>
##$DFORMAT= <normdp>
##$LAYOUT= <+/1D_H.xwp>
##$LFORMAT= <normlp>
##$PFORMAT= <normpl>
##$SURQMSG= 1
$$ End of Bruker specific parameters
$$ ---------------------------------
##NTUPLES= NMR SPECTRUM
##VAR_NAME=  FREQUENCY,     SPECTRUM/REAL,   SPECTRUM/IMAG
##SYMBOL=    X,             R,               I
##VAR_TYPE=  INDEPENDENT,   DEPENDENT,       DEPENDENT
##VAR_FORM=  AFFN,          ASDF,            ASDF
##VAR_DIM=   131072,        131072,          131072
##UNITS=     HZ,            ARBITRARY UNITS, ARBITRARY UNITS
##FACTOR=    0.0627417313425165, 1,          1
##FIRST=     8223.62146879498, -1053,        -212451
##LAST=      0,             9236,            -216338
##MIN=       0,             -323553939,      0
##MAX=       8223.62146879498, 368047654,    0
$$ Real data points
##PAGE= N=1
##DATA TABLE= (X++(R..R)), XYDATA
$$ [...]
63464B619860j2736j6668j9974k0488k0026k0536k1233k1525k3139k6725k9273
63453B387537k7835k3646j9859j7186j4649j3021j3945j6315j6819j4421j1615
63442B198226j0722j1404j2481j3850j5116j4377j0454n460l156m855q374j0956
63430B077021j1738j1137r408o969n058m720n406n692n249n015n457n991o291
63417A988890o814p439o989n160l799m805p590j0094j1637j3051j4132j3160r572
63404A874648n552l906n004o720o901n353l532k602j985k69K352L703K576Q62
63390A842317J110K923M082M628O773J0491J2566J1367R690J0736J3756J6226
63378A946665J8310K1938K6620K9539K9662K8931K9031K9355K8554K6198K2597
$$ plain form
63464 2619860 2607124 2590456 2570482 2549994 2529968 2509432 2488199 2466674 2443535 2416810 2387537
63453 2387537 2359702 2336056 2316197 2299011 2284362 2271341 2257396 2241081 2224262 2209841 2198226
63442 2198226 2187504 2176100 2163619 2149769 2134653 2120276 2109822 2104362 2101206 2096351 2087977 2077021
63430 2077021 2065283 2054146 2044738 2037769 2032711 2027991 2022585 2016893 2011644 2006629 2001172 1995181 1988890
63417 1988890 1982076 1974637 1967648 1962488 1958689 1953884 1946294 1936200 1924563 1911512 1897380 1884220 1874648
63404 1874648 1869096 1865190 1860186 1853466 1846565 1841212 1837680 1835078 1833093 1832824 1835176 1838879 1841455 1842317
63390 1842317 1843427 1846350 1850432 1855060 1861833 1872324 1884890 1896257 1905947 1916683 1930439 1946665
63378 1946665 1964975 1986913 2013533 2043072 2072734 2101665 2130696 2160051 2188605 2214803 2237400
63367B237400J8813J7075J9134K3721K7341K8117K7401K7243K8182K9917L2185
63356B516529L4072L4208L2528L0468K8667K6089K2162J7952J4282J0557O626
63345B774140L931L337L538L113K416J628j039o664j2539j4702j2958j0785j0600
63332B722816j1715j2792j3672j4314j4248j3805j3877j3860j1552o028P93O106
63320B603852Q533Q179N912L375K483L953O859R745J1568J1966J1780J2836J5693
63307B716734J8286J8849J9334K2907K8287L0463K8022K5705K7520L1036L1668
63296B998811K9486K7675K6520K3771K0085J9124K1542K3118K0397J4852R692
63285C235073N380N53m752r206j2332j4462j5380j4899j4244j5241j8154k1446
$$ plain form
63367 2237400 2256213 2273288 2292422 2316143 2343484 2371601 2399002 2426245 2454427 2484344 2516529
63356 2516529 2550601 2584809 2617337 2647805 2676472 2702561 2724723 2742675 2756957 2767514 2774140
63345 2774140 2778071 2781408 2784946 2788059 2790475 2792103 2791064 2784400 2771861 2757159 2744201 2733416 2722816
63332 2722816 2711101 2698309 2684637 2670323 2656075 2642270 2628393 2614533 2602981 2596953 2597746 2603852
63320 2603852 2612385 2620564 2626476 2629851 2632334 2636287 2643146 2652891 2664459 2676425 2688205 2701041 2716734
63307 2716734 2735020 2753869 2773203 2796110 2824397 2854860 2882882 2908587 2936107 2967143 2998811
63296 2998811 3028297 3055972 3082492 3106263 3126348 3145472 3167014 3190132 3210529 3225381 3235073
63285 3235073 3240453 3241006 3236254 3227048 3214716 3200254 3184874 3169975 3155731 3140490 3122336 3100890
63273C100890k3502k3726k2475k1173k1988k5827l0416l1902k9051k4703k2225
63262B823902k1543k0156j7407j5620j6455j8137j8056j6786j7112j9393k0794
63251B622443j9868j9182k1475k5330k7212k6325k4463k1946j7367j1761r299
63240B398215j2036j6636j8427j6878j4907j4401j4985j6273j8359k0052j9182
63229B216079j5585j2077j1549j4085j7534j9745j9717j7725j5433j5043j7113
63218B040473j9498j9347j6119j1893q949p957q546j0287j2496j3900j3743j2874
63206A884864j2727j3237j3099j2093j1651j2284j1998r033n063l457m586n331
63194A770305l726j710j912l807n006m897m729m819m119k408q14J40J102K118
$$ plain form
63273 3100890 3077388 3053662 3031187 3010014 2988026 2962199 2931783 2899881 2870830 2846127 2823902
63262 2823902 2802359 2782203 2764796 2749176 2732721 2714584 2696528 2679742 2662630 2643237 2622443
63251 2622443 2602575 2583393 2561918 2536588 2509376 2483051 2458588 2436642 2419275 2407514 2398215
63240 2398215 2386179 2369543 2351116 2334238 2319331 2304930 2289945 2273672 2255313 2235261 2216079
63229 2216079 2200494 2188417 2176868 2162783 2145249 2125504 2105787 2088062 2072629 2057586 2040473
63218 2040473 2020975 2001628 1985509 1973616 1964667 1956710 1948164 1937877 1925381 1911481 1897738 1884864
63206 1884864 1872137 1858900 1845801 1833708 1822057 1809773 1797775 1788742 1783679 1780222 1775636 1770305
63194 1770305 1766579 1764869 1762957 1759150 1754144 1749247 1744518 1739699 1735580 1733172 1732358 1732498 1733600 1735718
63180A735718K148J133Q89K901O463R917J2539J4248J4823J4740J5594J7990J9803
63167A868906J8349J3875R317O840O419P624J0627J4689J7424J6857J3500R767
63155B014194P990R147J2278J4631J3863J0858R050J0017J1353J0233P441N670
63143B136725N117L710J258J61J169J414j475n366o055k691J446L314L323L951
63129B146001O576J0325J3171J3589J1654Q974P532Q283J0887J4434J8048K0911
63117B290385K2192K1249J8034J3456R359P630Q881J1973J4974J6417J5715J3060
63105B463325R313N797L722L698N418P303O789K297m631j0272j2549j3025j4303
63092B452882j6563j8009j7831j6841j5563j3680j1789j1774j4308j7087j6853
$$ plain form
63180 1735718 1737866 1738999 1739888 1742789 1749252 1759169 1771708 1785956 1800779 1815519 1831113 1849103 1868906
63167 1868906 1887255 1901130 1910447 1917287 1923706 1931330 1941957 1956646 1974070 1990927 2004427 2014194
63155 2014194 2022184 2031331 2043609 2058240 2072103 2082961 2092011 2102028 2113381 2123614 2131055 2136725
63143 2136725 2141842 2145552 2146810 2146971 2148140 2149554 2148079 2142713 2136658 2133967 2135413 2138727 2142050 2146001
63129 2146001 2152577 2162902 2176073 2189662 2201316 2210290 2217822 2226105 2236992 2251426 2269474 2290385
63117 2290385 2312577 2333826 2351860 2365316 2374675 2382305 2391186 2403159 2418133 2434550 2450265 2463325
63105 2463325 2472638 2478435 2482157 2485855 2491273 2498576 2505365 2507662 2503031 2492759 2480210 2467185 2452882
63092 2452882 2436319 2418310 2400479 2383638 2368075 2354395 2342606 2330832 2316524 2299437 2282584
63081B282584j2870p748n023o295j0239j3796j4419j1777p552l861j936j783k230
63068B183055j520J069L891M311J994j51P64M033O110M697R91k108k917j733L76
63053B202862K497L812L641K064K11o30l03J55p5m56K64K308M270M518L044J447
63037B229629J019J300J058L25M44J737K282K46l166m632k591J246M546O740P928
63022B248111P275M396J277O44K443L839K963J145Q28K565M945O613P525Q588
63008B303157J0654J3714J6766J8688J9348J9708K0803K2863K5266K7022K7580
62997B525569K7493K8006K9611L1504L2902L4176L5845L7346L8096L9202M2384
62986B902134M7127N0496N0295M7380M4500M3724M5027M6429M5548M2083L8770
$$ plain form
63081 2282584 2269714 2261966 2256943 2250648 2240409 2226613 2212194 2200417 2192865 2189004 2187068 2185285 2183055
63068 2183055 2181535 2182604 2186495 2190806 2192800 2192649 2193413 2197446 2203556 2208253 2209244 2207136 2204219 2202486 2202862
63053 2202862 2205359 2209171 2212812 2214876 2215087 2214457 2214154 2214309 2214234 2213778 2214042 2216350 2220620 2225138 2228182 2229629
63037 2229629 2230648 2231948 2233006 2233331 2233775 2235512 2237794 2238040 2234874 2230242 2227651 2228897 2233443 2240183 2248111
63022 2248111 2255386 2259782 2261059 2261703 2264146 2267985 2270948 2272093 2272921 2275486 2280431 2287044 2294569 2303157
63008 2303157 2313811 2327525 2344291 2362979 2382327 2402035 2422838 2445701 2470967 2497989 2525569
62997 2525569 2553062 2581068 2610679 2642183 2675085 2709261 2745106 2782452 2820548 2859750 2902134
62986 2902134 2949261 2999757 3050052 3097432 3141932 3185656 3230683 3277112 3322660 3364743 3403513
62975C403513L8472M0397M0900L8388L5418L4918L5986L5040L0338K3849J8829
62964C776048J6405J4702J1142N772J737J534L216K082l630j0487j3924j2880
62952C791717r476n692j902K230O599J0166J1288R531P260P829J1643J5744J8107
62939C875044K0171K3811K7946L0186L0230K9461K8647K8140K8962L1060L1606
62928D185264K8078K2405J8987J8672J7924J4538J0928J0186J1276J0245M950
62917D353453l173j1202j7128k0552k2415k4331k7587l2340l7439m0966m1589
62906D074731m0121l9240m0749m3493m4982m4682m4192m4284m3626m1135l8097
62895C610130l6569l6500l5941l4203l3292l5161l8282l8675l4887l0235k8592
$$ plain form
62975 3403513 3441985 3482382 3523282 3561670 3597088 3632006 3667992 3703032 3733370 3757219 3776048
62964 3776048 3792453 3807155 3818297 3824069 3825806 3827340 3830556 3832638 3829008 3818521 3804597 3791717
62952 3791717 3782241 3776549 3774647 3776877 3783476 3793642 3804930 3814461 3821721 3829550 3841193 3856937 3875044
62939 3875044 3895215 3919026 3946972 3977158 4007388 4036849 4065496 4093636 4122598 4153658 4185264
62928 4185264 4213342 4235747 4254734 4273406 4291330 4305868 4316796 4326982 4338258 4348503 4353453
62917 4353453 4350280 4339078 4321950 4301398 4278983 4254652 4227065 4194725 4157286 4116320 4074731
62906 4074731 4034610 3995370 3954621 3911128 3866146 3821464 3777272 3732988 3689362 3648227 3610130
62895 3610130 3573561 3537061 3501120 3466917 3433625 3398464 3360182 3321507 3286620 3256385 3227793
62884C227793k9360k9053k7115k6638k8866l0739k9766k7976k8227k9352k8366
62873B912335k5527k3497k2851k2225k1876k3093k4693k4254k2670k3054k4832
62862B653763k3725j8913j5492j7368k1596k2747j9896j6270j4355j4396j6004
62851B453001j8330j9838k0174k1037k3270k4580k2346j7323j2527r737r246j1324
62839B243269j5264j8034j6904j3025j0031r555j0349j1421j3273j5808j7290
62828B092315j6319j3510j0794r886j1286j3746j4967j3788j1352r401q257p537
62816A951472p634q863j0138j0278j0013j0783j2153j2379j1174r925r262q393
62804A830477p129o880q900j2464j5145j4832j1878r323r750j1694j1102p097
$$ plain form
62884 3227793 3198433 3169380 3142265 3115627 3086761 3056022 3026256 2998280 2970053 2940701 2912335
62873 2912335 2886808 2863311 2840460 2818235 2796359 2773266 2748573 2724319 2701649 2678595 2653763
62862 2653763 2630038 2611125 2595633 2578265 2556669 2533922 2514026 2497756 2483401 2469005 2453001
62851 2453001 2434671 2414833 2394659 2373622 2350352 2325772 2303426 2286103 2273576 2263839 2254593 2243269
62839 2243269 2228005 2209971 2193067 2180042 2170011 2160456 2150107 2138686 2125413 2109605 2092315
62828 2092315 2075996 2062486 2051692 2041806 2030520 2016774 2001807 1988019 1976667 1967266 1959009 1951472
62816 1951472 1943838 1934975 1924837 1914559 1904546 1893763 1881610 1869231 1858057 1848132 1838870 1830477
62804 1830477 1823348 1816468 1807568 1795104 1779959 1765127 1753249 1743926 1734176 1722482 1711380 1704283
62792A704283l575l521m905m909n003p667j0598r533n489l631n119n934m471m266
62778A625662p195r457p504l426r92k03N25K37k417n552o595o400p026p505n878
62763A556274l571l260l610r41M264P182N370J591q08j476r66J240M840P724Q622
62748A582475Q645Q991R252R129R509J0577J1105J0986J2169J5480J8731J9858
62736A726907J9909K0712K1517K0605J8796J8500K0041K1672K2972K5432K9422
62725A966485L2991L4369L3940L3219L3459L5627L9807M3986M5274M3598M2600
62714B385355M5308N0062N2553N1246M8809M7955M7668M4536L6927K6836J7883
62703B855138J2161Q972N934J190n114j1090j4934j6667j7975k0321k3480k6257
$$ plain form
62792 1704283 1700708 1697187 1692282 1687373 1682370 1674703 1664105 1654572 1649083 1645452 1640333 1634399 1629928 1625662
62778 1625662 1618467 1609010 1601506 1598080 1597088 1596885 1597410 1597647 1595230 1589678 1583083 1576683 1569657 1562152 1556274
62763 1556274 1552703 1549443 1545833 1544892 1549156 1556338 1561708 1563299 1562491 1561015 1560049 1561289 1566129 1573853 1582475
62748 1582475 1591120 1600111 1609363 1618492 1628001 1638578 1649683 1660669 1672838 1688318 1707049 1726907
62736 1726907 1746816 1767528 1789045 1809650 1828446 1846946 1866987 1888659 1911631 1937063 1966485
62725 1966485 1999476 2033845 2067785 2101004 2134463 2170090 2209897 2253883 2299157 2342755 2385355
62714 2385355 2430663 2480725 2533278 2584524 2633333 2681288 2728956 2773492 2810419 2837255 2855138
62703 2855138 2867299 2876271 2882205 2883395 2878281 2867191 2852257 2835590 2817615 2797294 2773814 2747557
62691B747557k8198k9785l0974l0668k8324k5311k3686k3781k4013k3040k1259
62680B458518j9960j9801k0361k0538j9154j5976j2462j0710j1076j1588j0360
62669B286532p796n628m508l706k615j231N96L024N258O197O297P378J0031J2605
62655B312434J3629J3948J5139J6847J7434J6961J7739K1402K6603L0420L1526
62644B534082L1338L2131L4504L6985L8151L8575M0003M2668M4632M4368M3075
62633B960512M3367M6133M9652N1531N0567M7123M2692L9010L6469L3393K7800
62622C428249J9836J1460L825l691j1652j9170k5012k9125l2303l4951l6921l8126
62610C232419l8917l9915m1470m2943m3074m1918m1711m4225m7414m6841m0907
$$ plain form
62691 2747557 2719359 2689574 2658600 2627932 2599608 2574297 2550611 2526830 2502817 2479777 2458518
62680 2458518 2438558 2418757 2398396 2377858 2358704 2342728 2330266 2319556 2308480 2296892 2286532
62669 2286532 2278736 2273108 2268600 2264894 2262279 2261048 2261644 2264668 2269926 2276123 2282420 2289798 2299829 2312434
62655 2312434 2326063 2340011 2355150 2371997 2389431 2406392 2424131 2445533 2472136 2502556 2534082
62644 2534082 2565420 2597551 2632055 2669040 2707191 2745766 2785769 2828437 2873069 2917437 2960512
62633 2960512 3003879 3050012 3099664 3151195 3201762 3248885 3291577 3330587 3367056 3400449 3428249
62622 3428249 3448085 3459545 3463370 3459679 3448027 3428857 3403845 3374720 3342417 3307466 3270545 3232419
62610 3232419 3193502 3153587 3112117 3069174 3026100 2984182 2942471 2898246 2850832 2803991 2763084
62599B763084l2866k6774k3473k1732k1324k2850k5548k7396k7095k4792k1586
62588B487648j9433k0229k3351k5269k3643k0662j9901k0872j9818j5736j2083
62577B266651j1577j2480j1761r582q455r485j1565j3439j4685j5084j4409j2855
62565B121274j0930r213q442q917r476q316n632l995n022p047p438o058m709m222
62551B021857m047m078m596m523k048K406N662N210K021r17j948j704j364q59
62537B011072J007M969R818J2871J2304Q974N634M504N919Q693J1120J1923J1155
62524B119963J0068R584R256Q331P115O172M776J559l539r155j4063j7422j8136
62511B114509j6078j3889j5085j9566k3160k2746j9857j7773j7009j5744j3421
$$ plain form
62599 2763084 2730218 2703444 2679971 2658239 2636915 2614065 2588517 2561121 2534026 2509234 2487648
62588 2487648 2468215 2447986 2424635 2399366 2375723 2355061 2335160 2314288 2294470 2278734 2266651
62577 2266651 2255074 2242594 2230833 2221251 2212796 2203311 2191746 2178307 2163622 2148538 2134129 2121274
62565 2121274 2110344 2101131 2092689 2083772 2074296 2065980 2060348 2056353 2051331 2044284 2036846 2030788 2026079 2021857
62551 2021857 2017810 2013732 2009136 2004613 2002565 2004971 2010633 2015843 2017864 2016947 2014999 2013295 2011931 2011072
62537 2011072 2012079 2017048 2026866 2039737 2052041 2061015 2066649 2071153 2077072 2085765 2096885 2108808 2119963
62524 2119963 2130031 2139615 2148871 2157202 2164317 2170489 2175265 2176824 2173285 2164130 2150067 2132645 2114509
62511 2114509 2098431 2084542 2069457 2049891 2026731 2003985 1984128 1966355 1949346 1933602 1920181
62500A920181j1544j1382j2764j4852j6329j5266j0743m850j239j231k768l584
62488A813629l853m834o333o805n523l476k150k041k439k385j710j033o22M34
62474A770859L154O819R019Q150N383L616M588P461J0198J1799J2863J4229J5726
62461A883864J6846J8157K0998K5399K9290L0783L0727L1820L5159L8774M0136
62450B201953L9427L9515M2639M7608N0702M9616M6101M3956M4372M4422M0951
62439B691262L4847K9930K8157K7738K6184K3477K1316K0672K1368K3346K6802
62428B975099L1076L4474L5640L4663L2902L2054L3148L5608L7020L4805K9013
62417C345502K3061K0538K1044K0395J5621Q518K679j997r227k0408l1446l7269
$$ plain form
62500 1920181 1908637 1897255 1884491 1869639 1853310 1838044 1827301 1822451 1821212 1819981 1817213 1813629
62488 1813629 1809776 1804942 1798609 1791804 1786281 1782805 1780655 1778614 1776175 1773790 1772080 1771047 1770425 1770859
62474 1770859 1774013 1780832 1789851 1798001 1803384 1807000 1811588 1819049 1829247 1841046 1853909 1868138 1883864
62461 1883864 1900710 1918867 1939865 1965264 1994554 2025337 2056064 2087884 2123043 2161817 2201953
62450 2201953 2241380 2280895 2323534 2371142 2421844 2471460 2517561 2561517 2605889 2650311 2691262
62439 2691262 2726109 2756039 2784196 2811934 2838118 2861595 2882911 2903583 2924951 2948297 2975099
62428 2975099 3006175 3040649 3076289 3110952 3143854 3175908 3209056 3244664 3281684 3316489 3345502
62417 3345502 3368563 3389101 3410145 3430540 3446161 3454679 3457358 3455361 3446134 3425726 3394280 3357011
62405C357011l7649l6431l6185l6236l5546l4911l5587l7470l9280l9579l7661
62394B950476l4538l2645l2960l2918k9318k2973j7887j5826j4870j3844j4357
62383B688340j6642j7200j3747r646r390j1527j0415m405J791L163q13p806j5344
62370B576359k0642k1125j7425j3759j3338j5046j6091j6080j6467j7567j8485
62359B390334j9120j9877j9851j7609j3885j1548j2292j4682j5940j4626j1352
62348B219552q158p624j1162j7010k0745j9110j3216p231m181l885m607n161m845
62335B092617k944L15K912K708M8k542l258k339k47L593R136J4125J6012J4948
62321B145084J3431J3188J3908J4936J6615J9346K2454K4771K5796K5973K6376
$$ plain form
62405 3357011 3319362 3282931 3246746 3210510 3174964 3140053 3104466 3066996 3027716 2988137 2950476
62394 2950476 2915938 2883293 2850333 2817415 2788097 2765124 2747237 2731411 2716541 2702697 2688340
62383 2688340 2671698 2654498 2640751 2631105 2621715 2610188 2599773 2595368 2597159 2600322 2599509 2591703 2576359
62370 2576359 2555717 2534592 2517167 2503408 2490070 2475024 2458933 2442853 2426386 2408819 2390334
62359 2390334 2371214 2351337 2331486 2313877 2299992 2288444 2276152 2261470 2245530 2230904 2219552
62348 2219552 2211394 2203770 2192608 2175598 2154853 2135743 2122527 2115296 2111115 2107230 2102623 2097462 2092617
62335 2092617 2089673 2089988 2092900 2095608 2095656 2093114 2089856 2087517 2087270 2090863 2099999 2114124 2130136 2145084
62321 2145084 2158515 2171703 2185611 2200547 2217162 2236508 2258962 2283733 2309529 2335502 2361878
62310B361878K8184L1607L5047L6168L4473L2288L2646L6377M1476M5096M6065
62299B761305M5832M7033N0904N6219O0876O3860O4974O3719N9978N5546N2835
62288C383081N1642M8878M2453L4002K6622K1016J5438Q780K169k626n414p792
62276C618249j1447j6311k0447k2113k1799k1515k2297k3490k4551k5804k6934
62265C381541k6532k4587k3652k5651k8661k9309k7713k7174k8750k9135k5537
62254C084840k0353j8580k1493k5288k5949k3393k0158j7872j6421j5587j5545
62243B864201j5811j5327j4205j3965j5033j5234j2281p189l541l399n401o949
62231B735866o635m229j41M097O293N888M891N417P235Q751R423R805J0030R942
$$ plain form
62310 2361878 2390062 2421669 2456716 2492884 2527357 2559645 2592291 2628668 2670144 2715240 2761305
62299 2761305 2807137 2854170 2905074 2961293 3022169 3086029 3151003 3214722 3274700 3330246 3383081
62288 3383081 3434723 3483601 3526054 3560056 3586678 3607694 3623132 3631912 3634081 3631455 3626041 3618249
62276 3618249 3606802 3590491 3570044 3547931 3526132 3504617 3482320 3458830 3434279 3408475 3381541
62265 3381541 3355009 3330422 3306770 3281119 3252458 3223149 3195436 3168262 3139512 3110377 3084840
62254 3084840 3064487 3045907 3024414 2999126 2973177 2949784 2929626 2911754 2895333 2879746 2864201
62243 2864201 2848390 2833063 2818858 2804893 2789860 2774626 2762345 2755156 2751615 2748216 2742815 2735866
62231 2735866 2729231 2725002 2724861 2728958 2735251 2741139 2746030 2751447 2758682 2767433 2776856 2786661 2796691 2806633
62217B806633J0333J2384J5859J8996K0375K0011J9011J9096K1888K7213L2250
62206C024049L3878L2061K9768K9619L1914L5674L9723M2501M2912M2406M4456
62195C428961N0558N7806O1891O1631N9168N6405N3116M8536M3082L7550L1605
62184C990309K4314J6053Q882M291R57m205j2362k0971k6552k8765l0629l4744
62172C886578m0397m4599m5021m1639l6589l2981l2770l4873l5997l4153l0849
62161C476710k9036k9413k9722k7596k3161j8757j6623j7003j8118j7957j6356
62150C232968j5089j5670j7380j8004j6220j2652q818n923m533m350l969j899
62138C108461J393L304K127k31Q4M450J0282J4266J5594J5278J3876J1673J0126
$$ plain form
62217 2806633 2816966 2829350 2845209 2864205 2884580 2904591 2923602 2942698 2964586 2991799 3024049
62206 3024049 3057927 3089988 3119756 3149375 3181289 3216963 3256686 3299187 3342099 3384505 3428961
62195 3428961 3479519 3537325 3599216 3660847 3720015 3776420 3829536 3878072 3921154 3958704 3990309
62184 3990309 4014623 4030676 4039558 4043849 4044806 4040601 4028239 4007268 3980716 3951951 3921322 3886578
62172 3886578 3846181 3801582 3756561 3714922 3678333 3645352 3612582 3577709 3541712 3507559 3476710
62161 3476710 3447674 3418261 3388539 3360943 3337782 3319025 3302402 3285399 3267281 3249324 3232968
62150 3232968 3217879 3202209 3184829 3166825 3150605 3137953 3129135 3123212 3118679 3114329 3110360 3108461
62138 3108461 3109854 3113158 3115285 3115054 3115138 3119588 3129870 3144136 3159730 3175008 3188884 3200557 3210683
62125C210683J0938J3612J5800J6248J5802J5248J4312J3324J3682J5442J6647
62114C371738J6525J7144J9856K2232K1461J9115J9158K2233K5548K7916L0914
62103C613840L4709L6894L6595L5825L5204L2183K5895K0161J8225J7419J3010
62092C919960N518O2q16J14r94n355j2043j9079k3636k4022k2139k1805k4202
62079C771563k7086k8478k8509k7341k4336k0341j7971j8057j8182j6376j4173
62068C530713j4013j5392j5887j4642j2684j0638q335o284n539o107o800o645
62056C407747n523l776k117j441j756j920j420j494l120m938m917l483k912l748
62042C365182l980k192L25J376L82j613l383m410n068o306q284r418p825l844
$$ plain form
62125 3210683 3221621 3235233 3251033 3267281 3283083 3298331 3312643 3325967 3339649 3355091 3371738
62114 3371738 3388263 3405407 3425263 3447495 3468956 3488071 3507229 3529462 3555010 3582926 3613840
62103 3613840 3648549 3685443 3722038 3757863 3793067 3825250 3851145 3871306 3889531 3906950 3919960
62092 3919960 3925478 3925540 3924724 3924838 3923844 3918489 3906446 3887367 3863731 3839709 3817570 3795765 3771563
62079 3771563 3744477 3715999 3687490 3660149 3635813 3615472 3597501 3579444 3561262 3544886 3530713
62068 3530713 3516700 3501308 3485421 3470779 3458095 3447457 3439122 3432838 3427299 3421192 3414392 3407747
62056 3407747 3402224 3398448 3396331 3394890 3393134 3391214 3389794 3388300 3385180 3380242 3375325 3371842 3368930 3365182
62042 3365182 3361202 3359010 3359335 3360711 3361093 3359480 3356097 3351687 3346619 3340313 3332029 3322611 3314786 3310942
62028C310942K40K945M503M996L866K072K308N512R100J0632J1426J4152J8344
62015C401038K1329K2704K4392K6356K6006K2938K0789K2308K5246K5769K3897
62004C662772K2642K2950K2735K0711J8296J7286J7806J8970J9501J7283J0670
61993C871622J350o043q700q707j0155j4547k0422k6146l1073l4686l6501l6763
61981C639229l6012l4434l2835l3159l6023l8377l6402l0945k7415k9246l3635
61970C270746l5239l2200k6921k2441k0174k0258k1783k2976k2923k3046k5119
61959B997666k7987k8168k4312j9337j7324j9423k3501k6554k6635k3535j9041
61948B741849j6021j6043j7888j9002j8159j5988j3492j1182r591r390j0531j2082
$$ plain form
62028 3310942 3311182 3314127 3318630 3323626 3327492 3329564 3331872 3337384 3346484 3357116 3368542 3382694 3401038
62015 3401038 3422367 3445071 3469463 3495819 3521825 3544763 3565552 3587860 3613106 3638875 3662772
62004 3662772 3685414 3708364 3731099 3751810 3770106 3787392 3805198 3824168 3843669 3860952 3871622
61993 3871622 3872972 3866929 3858229 3849522 3839367 3824820 3804398 3778252 3747179 3712493 3675992 3639229
61981 3639229 3603217 3568783 3535948 3502789 3466766 3428389 3391987 3361042 3333627 3304381 3270746
61970 3270746 3235507 3203307 3176386 3153945 3133771 3113513 3091730 3068754 3045831 3022785 2997666
61959 2997666 2969679 2941511 2917199 2897862 2880538 2861115 2837614 2811060 2784425 2760890 2741849
61948 2741849 2725828 2709785 2691897 2672895 2654736 2638748 2625256 2614074 2604483 2595093 2584562 2572480
61936B572480j3376j4648j6037j6676j5698j3926j3376j4843j6776j7281j6625
61925B403218j6764j8495k0153j9619j6825j3585j1632j1616j3477j6442j8774
61914B225836j8851j7078j5611j5573j5565j3871j1167r593r588r322p508n378
61902B076731m997o492p858p275m838k173p94r03j359p10J580M741P425Q726Q631
61887B070435P860P433Q104R965J2484J4933J6746J7690J8005J8349J9286K0770
61875B242060K2346K3678K4517K4462K3547K3053K4624K8047L0691L0105K6707
61864B523837K3034K0517J8127J4304R495N986N496P141Q016N969K016k98J670
61851B645310O989J2273J5110J5742J5621J5464J5240J5129J5546J6328J6659
$$ plain form
61936 2572480 2559104 2544456 2528419 2511743 2496045 2482119 2468743 2453900 2437124 2419843 2403218
61925 2403218 2386454 2367959 2347806 2328187 2311362 2297777 2286145 2274529 2261052 2244610 2225836
61914 2225836 2206985 2189907 2174296 2158723 2143158 2129287 2118120 2108527 2098939 2089617 2082109 2076731
61902 2076731 2071734 2065242 2057384 2050109 2045271 2043098 2042304 2041401 2040042 2039332 2040912 2045653 2053078 2061804 2070435
61887 2070435 2078295 2085728 2093832 2103797 2116281 2131214 2147960 2165650 2183655 2202004 2221290 2242060
61875 2242060 2264406 2288084 2312601 2337063 2360610 2383663 2408287 2436334 2467025 2497130 2523837
61864 2523837 2546871 2567388 2585515 2599819 2609314 2615300 2620796 2627937 2635953 2641922 2643938 2643640 2645310
61851 2645310 2652299 2664572 2679682 2695424 2711045 2726509 2741749 2756878 2772424 2788752 2805411
61840B805411J5948J4493J3030J1636R240M704j320n968o639m144k469m703r764
61827B839455j3922j4878j3129r788n151k86J780j318p716j2321j2122r256p974
61814B733374r644j2044j2807j1705r442n970j099M226Q395J0466J0332Q238N251
61801B717571L834O361J2549J9153K2819K3014K2023K2643K5966L0881L5193L7474
61789B979481L8021L8055L8295L8713L9249L9850L9910L8658L6293L3779L1258
61778C391562K7770K3036J8417J5251J3082J0564P380M355K316J765K854M555
61766C522907M766K905J605L635P438Q473N402K019J557J827j281p322j1861j2998
61752C529072j3822j7529k3001k7021k8721k9717l0989l1923l2043l1735l1070
$$ plain form
61840 2805411 2821359 2835852 2848882 2860518 2869758 2874462 2873142 2867174 2860535 2856391 2853922 2849219 2839455
61827 2839455 2825533 2810655 2797526 2787738 2782587 2782301 2784081 2782763 2775047 2762726 2750604 2741348 2733374
61814 2733374 2723730 2711686 2698879 2687174 2677732 2671762 2670663 2674889 2683284 2693750 2704082 2712320 2717571
61801 2717571 2721405 2727766 2740315 2759468 2782287 2805301 2827324 2849967 2875933 2906814 2942007 2979481
61789 2979481 3017502 3055557 3093852 3132565 3171814 3211664 3251574 3290232 3326525 3360304 3391562
61778 3391562 3419332 3442368 3460785 3476036 3489118 3499682 3507062 3511417 3513733 3515498 3518352 3522907
61766 3522907 3527673 3530578 3532183 3535818 3543256 3551729 3557131 3559150 3560707 3562534 3561253 3553931 3542070 3529072
61752 3529072 3515250 3497721 3474720 3447699 3418978 3389261 3358272 3326349 3294306 3262571 3231501
61741C231501k9642k7983k7727k9433l1165l0173k5774k0030j5913j5113j7183
61730B961365k0179k2036k1760j9627j6648j4125j3226j4113j5521j6036j5845
61719B772249j6270j7383j7484j5560j2944j1394j0677r532q170p933q812r240
61707B626850q554p923q341r106q898p202m194o27J672P13l123o627o962m548
61693B553130j941j003k198n319r145j1253j0281q112q041j0688j3422j4021j3121
61680B444585j2431j2211j1683j0819j0347j0520j1018j1935j3651j5608j6137
61669B308225j4211j0965q788q701r242q434o263m481m207m864n523o047o327
61656B210172n787m568m104n191o339n644l694k971m676p690j0578j2797j3867
$$ plain form
61741 3231501 3201859 3173876 3146149 3116716 3085551 3055378 3029604 3009574 2993661 2978548 2961365
61730 2961365 2941186 2919150 2897390 2877763 2861115 2846990 2833764 2819651 2804130 2788094 2772249
61719 2772249 2755979 2738596 2721112 2705552 2692608 2681214 2670537 2661005 2652835 2644902 2636090 2626850
61707 2626850 2618296 2610373 2602032 2592926 2584028 2576826 2572632 2572005 2573677 2574390 2571267 2564640 2557678 2553130
61693 2553130 2551189 2550186 2547988 2542669 2533524 2522271 2511990 2503878 2495837 2485149 2471727 2457706 2444585
61680 2444585 2432154 2419943 2408260 2397441 2387094 2376574 2365556 2353621 2339970 2324362 2308225
61669 2308225 2294014 2283049 2274261 2265560 2256318 2247884 2241621 2237140 2232933 2228069 2222546 2216499 2210172
61656 2210172 2204385 2199817 2195713 2190522 2184183 2178539 2174845 2171874 2167198 2159508 2148930 2136133 2122266
61643B122266j3285j1905j1659j2943j3670j2029r136p753q994j1323j2439j1400
61631A985730r183p747q357j0506j2614j3587j3151j1253q425o481p001q704q427
61618A860294n537l340m660p805q983p358n314m568m560m582n005n830o102n519
61604A781131n163n807o786p291p513p605o645l796O8K967L666K358q7k636m162
61589A732699l834j631J723N049O901O293L985K258K350K636R10j938k596k16
61575A754589J730J85k868l283j061k75k635n069n132n043p396r970r000n737
61561A699035m923p212q178n699l421m714p441p933o848p169q606q154n359l314
61547A610064m334p433j0226j1131r799p376o235p570r703j0433j0151j0351j0215
$$ plain form
61643 2122266 2108981 2097076 2085417 2072474 2058804 2046775 2037639 2029886 2020892 2009569 1997130 1985730
61631 1985730 1976547 1968800 1960443 1949937 1937323 1923736 1910585 1899332 1890907 1884426 1877425 1868721 1860294
61618 1860294 1854757 1851417 1846757 1838952 1829969 1822611 1817297 1812729 1808169 1803587 1798582 1792752 1786650 1781131
61604 1781131 1775968 1770161 1763375 1756084 1748571 1740966 1734321 1730525 1730593 1733560 1737226 1739584 1739497 1736861 1732699
61589 1732699 1728865 1727234 1728957 1734006 1740907 1747200 1751185 1753443 1755793 1758429 1759339 1757401 1754805 1754589
61575 1754589 1756319 1756504 1753636 1750353 1749292 1749017 1746382 1741313 1736181 1731138 1723742 1713772 1704772 1699035
61561 1699035 1694112 1686900 1678722 1673023 1669602 1664888 1657447 1649514 1642666 1635497 1626891 1618737 1613378 1610064
61547 1610064 1605730 1598297 1588071 1576940 1567141 1559765 1553530 1545960 1536257 1525824 1515673 1505322 1495107
61534A495107p736l759j582k397m371o369r070j1599j0868o129j100N06q45k656
61520A427132m057n157n170l945l501n354p651p662n825m608m440l923l360m677
61506A357802p541q802o989m806n374p626p483l154K457M971L364P21L79K278
61492A320197L907L995L599L752M043M127M521M764K917j281m649m327j883r90
61478A342692j956j869R1R72j251m210m305j526J008J343N75N03R86N13j235k538
61462A329793j773K33J234P59O05J610J907m7k391k169K49J709J008L25J387K673
61446A337112J759j128l316k623P86M712O417M526K30l505m244j723K141M453
61432A345597L356j76l070l377j784Q41N270J1056J3859R446J00o668o359j312
$$ plain form
61534 1495107 1487371 1483612 1482030 1479633 1475262 1468893 1459823 1448224 1437356 1431227 1430127 1430633 1429788 1427132
61520 1427132 1423075 1417918 1412748 1408803 1405302 1399948 1392297 1384635 1378810 1374202 1369762 1365839 1362479 1357802
61506 1357802 1350261 1341459 1334470 1329664 1324290 1316664 1309181 1306027 1308484 1313455 1316819 1317540 1317919 1320197
61492 1320197 1324104 1328099 1331698 1335450 1339493 1343620 1348141 1352905 1355822 1354541 1349892 1345565 1343682 1342692
61478 1342692 1340736 1338867 1338958 1339930 1338679 1334469 1330164 1328638 1329646 1330989 1331564 1332067 1333053 1333566 1332331 1329793
61462 1329793 1328020 1328253 1329487 1330246 1330851 1332461 1334368 1334321 1331930 1329761 1330010 1331719 1332727 1333052 1334439 1337112
61446 1337112 1338871 1337743 1334427 1331804 1332590 1337302 1343719 1348245 1348475 1344970 1340726 1339003 1341144 1345597
61432 1345597 1348953 1348777 1345707 1342330 1340546 1341387 1346657 1357713 1371572 1381018 1381118 1374450 1368091 1366779
61418A366779M049P999J0223R683O489L268J956J204q61l322m399m578n082n041
61404A388367l279j416j675k666j117K510M005J638j095m02K905N246M938L206
61390A401165J868J823L144N041O005N017K725R62J211L645P264J0556J2200J1553
61376A474179Q917N656L896N024P951R700Q420N223K306K84j463k716k405m58
61362A524514J853L517M469M812M590M240M070L306R48k230l953l024n85J481
61348A548008K298J913P03n80j137j056j283k277l316l391k290o21P14J171J134
61333A539990J530K307K071K63j122L44M168P531Q938R034P955M654p2k606o15
61318A584370L539N560M499L331M926R104J3425J5363J3822R777N621L016J524
$$ plain form
61418 1366779 1370828 1378827 1389050 1398733 1405222 1408490 1410446 1411650 1410789 1407467 1403068 1398490 1393408 1388367
61404 1388367 1385088 1383672 1381997 1379331 1378214 1380724 1384729 1386367 1385272 1384870 1387775 1393021 1397959 1401165
61390 1401165 1403033 1404856 1408000 1413041 1419046 1424063 1426788 1427750 1428961 1432606 1439870 1450426 1462626 1474179
61376 1474179 1483096 1488752 1492648 1497672 1505623 1515323 1523743 1528966 1531272 1531556 1530093 1527377 1524972 1524514
61362 1524514 1526367 1529884 1534353 1539165 1543755 1547995 1552065 1555371 1556319 1554089 1550136 1547112 1546527 1548008
61348 1548008 1550306 1552219 1552922 1552342 1551205 1550149 1548866 1546589 1543273 1539882 1537592 1536971 1537685 1538856 1539990
61333 1539990 1541520 1543827 1545898 1546161 1545039 1545383 1549551 1557082 1566020 1575054 1583009 1587663 1587591 1584985 1584370
61318 1584370 1587909 1593469 1597968 1601299 1606225 1615329 1628754 1644117 1657939 1667716 1673337 1676353 1677877
61305A677877L0j054k97K317M991O483P439Q650R125P431M472L398O077J0619
61291A747558J3329J2661J0357Q958R400J1061J2782J3285J1895R733R131J0706
61279A880856J2128J1091Q594P581R017J1059J1602J0005O719L139J385K248L552
61266A978976K703N31P7J755K817K022J516K994N073O104O547O749N347K266M31
61251B025908J698L608L445L147O218J1489J4370J3521J1795J0768Q831N528L538
61238B123864M654P009Q114P876O938M785J615k47P19K565K439M37j253j849k210
61223B165456k377j387N94K182L125M808P727R878Q845M979J698K508P596J3269
61209B228901J5064J1799O553L515M367P754J1352J3545J3757J2449J0912J0351
$$ plain form
61305 1677877 1677907 1676853 1676556 1678873 1683864 1690347 1697786 1706436 1715561 1722992 1727464 1730862 1736939 1747558
61291 1747558 1760887 1773548 1783905 1792863 1802263 1813324 1826106 1839391 1851286 1861019 1870150 1880856
61279 1880856 1892984 1904075 1912669 1920250 1929267 1940326 1951928 1961933 1968652 1971791 1973176 1975424 1978976
61266 1978976 1981679 1982210 1982287 1984042 1986859 1988881 1990397 1993391 1998464 2004568 2011115 2017864 2023211 2025477 2025908
61251 2025908 2027606 2031214 2034659 2037806 2044024 2055513 2069883 2083404 2095199 2105967 2114798 2120326 2123864
61238 2123864 2128518 2135527 2143641 2151517 2158455 2163240 2164855 2164608 2165327 2167892 2170331 2170768 2169515 2167666 2165456
61223 2165456 2163079 2161692 2162286 2164468 2167593 2172401 2180128 2190006 2198851 2203830 2205528 2208036 2215632 2228901
61209 2228901 2243965 2255764 2262317 2265832 2270199 2277953 2289305 2302850 2316607 2329056 2339968 2350319
61197B350319J0913J1863J2369J1740R457O011L316L144N026O724O836N759M042
61184B447519J458j451k640j062J091O77k249m675m998m745n242n222l407j493
61170B413561j859l502l106J2K726K362j61k215k421q34J950M622N619M890L902
61155B425546L119J437q22o35L708R109J0912Q598N542L851K491N40p61q3K154
61140B474706M968Q114J1121J2642J1787R239O503M990N811Q910J2114J2738J0770
61127B594413Q881Q699Q847P582N505M265M068M071M005L759K371o68l749m631
61113B647418l307j867j738k699m541p709j1606j3846j2547q788n751n468p161
61100B560390q717r228r571j0720j2272j3009j2544j1566j0446q515n383k381
$$ plain form
61197 2350319 2361232 2373095 2385464 2397204 2406661 2412672 2415988 2419132 2424158 2430882 2437718 2443477 2447519
61184 2447519 2448977 2447526 2444886 2443824 2444915 2445592 2443343 2438668 2433670 2428925 2423683 2418461 2415054 2413561
61170 2413561 2411702 2408200 2405094 2405106 2407832 2410194 2410033 2407818 2405397 2404563 2406513 2411135 2416754 2421644 2425546
61155 2425546 2428665 2430102 2429280 2428645 2432353 2441462 2452374 2460972 2466514 2470365 2472856 2473396 2472635 2472552 2474706
61140 2474706 2479674 2487788 2498909 2511551 2523338 2532577 2539080 2544070 2549881 2558791 2570905 2583643 2594413
61127 2594413 2603294 2611993 2620840 2628422 2633927 2638192 2642260 2646331 2650336 2654095 2656466 2655798 2652049 2647418
61113 2647418 2644111 2642244 2640506 2637807 2633266 2625557 2613951 2600105 2587558 2578770 2573019 2567551 2560390
61100 2560390 2551673 2542445 2532874 2522154 2509882 2496873 2484329 2472763 2462317 2453802 2448419 2446038
61088B446038j594l247m689k791K475P333P644L103k690o393q146r960j2059j2396
61074B402628r624n008j123L13q45l208m250k110K103M862M124J837J414L442
61060B394555N363N231M235M868P749J1298J4071J6080J7620J8230J7869J8055
61048B535224J9872K1244J8700J2613Q141R131J3062J4483J1808P681L778p93
61036B674944n734q231o990m745m821p365j0532j3299j5154j4920j2279r292q398
61023B553184r645j1449j2881j3457j1952p708k664K4p70l600o557q358q086n819
61009B450262l228j804p54J606M801O724P175Q427J1433J3835J3196J0698R772
60996B532143J1831J5178J7885J9939K1940K3378K3597K3615K5129K7827K9826
$$ plain form
61088 2446038 2444444 2441197 2436508 2433717 2436192 2443525 2451169 2454272 2451582 2445189 2437043 2427083 2415024 2402628
61074 2402628 2393004 2387996 2386873 2387186 2386341 2383133 2378883 2376773 2378876 2383738 2387862 2389699 2391113 2394555
61060 2394555 2399918 2405149 2409384 2414252 2422001 2433299 2447370 2463450 2481070 2499300 2517169 2535224
61048 2535224 2555096 2576340 2595040 2607653 2615794 2624925 2637987 2652470 2664278 2671959 2675737 2674944
61036 2674944 2669210 2660979 2653989 2649244 2644423 2637058 2626526 2613227 2598073 2583153 2570874 2561582 2553184
61023 2553184 2543539 2532090 2519209 2505752 2493800 2486092 2483428 2483452 2482682 2479082 2472525 2464167 2456081 2450262
61009 2450262 2447034 2445230 2444476 2446082 2450883 2457607 2464782 2473209 2484642 2498477 2511673 2522371 2532143
60996 2532143 2543974 2559152 2577037 2596976 2618916 2642294 2665891 2689506 2714635 2742462 2772288
60985B772288L1339L5515M3875N2990N8346O0107O1935O5210O8472P2549Q1522
60974C404148R7039J15574J33401J50800J69001J86617K02470K18871K38397K59683
60964E176001K80293L01604L26615L54388L81063M05348M28753M51201M71209
60955H576475M90392N13084N40713N70513O00388O31040O62565O93310P23595
60946A4002075P56525P93510Q32799Q74361R22243R79478J044191J113772J190054
60937B2509008J277736J380937J503972J649992J810237J953470K032113K004610
60929C6122075J855772J602253J286651R67736P06385N45316M89929N03608N23194
60920D4602919M85914L52258J15786j98293n41526q57367j101107j254433j324531
$$ plain form
60985 2772288 2803627 2839142 2883017 2936007 2994353 3054460 3116395 3181605 3250077 3322626 3404148
60974 3404148 3501187 3616761 3750162 3900962 4069963 4256580 4459050 4677921 4916318 5176001
60964 5176001 5456294 5757898 6084513 6438901 6819964 7225312 7654065 8105266 8576475
60955 8576475 9066867 9579951 10120664 10691177 11291565 11922605 12585170 13278480 14002075
60946 14002075 14758600 15552110 16384909 17259270 18181513 19160991 20205182 21318954 22509008
60937 22509008 23786744 25167681 26671653 28321645 30131882 32085352 34117465 36122075
60929 36122075 37977847 39580100 40866751 41834487 42540872 43086188 43576117 44079725 44602919
60920 44602919 45088833 45441091 45556877 45358584 44817058 43959691 42858584 41604151 40279620
60911D0279620j331160j295001j233519j159739j080809r99798r20445q48094
60903C1411055p85338p30090o79891o35276n97003n63040n31003n01226m74788
60894B5913400m50663m27384m05462l85467l66039l46767l30723l20507l13573
60885B2566815l05226k94810k85208k77663k71470k67631k67785k69505k67626
60876B0059891k61249k55143k52823k52375k50771k48542k47624k47718k47600
60867A7796046k47864k49487k51067k50003k45789k40388k35959k33526k33186
60858A5608777k34342k35895k36780k36227k33745k29900k26677k25352k24264
60849A3525595k20865k15878k12634k11814k10261k06526k04049k05832k08655
$$ plain form
60911 40279620 38948460 37653459 36419940 35260201 34179392 33179594 32259149 31411055
60903 31411055 30625717 29895627 29215736 28580460 27983457 27420417 26889414 26388188 25913400
60894 25913400 25462737 25035353 24629891 24244424 23878385 23531618 23200895 22880388 22566815
60885 22566815 22261589 21966779 21681571 21403908 21132438 20864807 20597022 20327517 20059891
60876 20059891 19798642 19543499 19290676 19038301 18787530 18538988 18291364 18043646 17796046
60867 17796046 17548182 17298695 17047628 16797625 16551836 16311448 16075489 15841963 15608777
60858 15608777 15374435 15138540 14901760 14665533 14431788 14201888 13975211 13749859 13525595
60849 13525595 13304730 13088852 12876218 12664404 12454143 12247617 12043568 11837736 11629081
60840A1629081k06657j99541j93300j92573j95601j97558j96044j91794j86240
60831I869773j80606j76241j73743j71781j68491j64238j61521j61370j61112
60822H350670j57391j50916j46254j46253j48396j47973j43684j38306j34445
60813G037052j31758j28635j24881j21729j19835j18107j14602j08802j03046
60804E965657j00689j02213j04167j02985r8592r3028q7365q2369q0393q3010
60794E030846q7282q8254q5302q2206q0590p7806p2767o9039o9106o9746o7180
60783D181568o3589o3741o7081o8227o4688n9447n5815n3924n3134n3956n5996
60772C521970n6891n5040n1514m8089m5310m3487m3496m5083m5984m4307m1007
$$ plain form
60840 11629081 11422424 11222883 11029583 10837010 10641409 10443851 10247807 10056013 9869773
60831 9869773 9689167 9512926 9339183 9167402 8998911 8834673 8673152 8511782 8350670
60822 8350670 8193279 8042363 7896109 7749856 7601460 7453487 7309803 7171497 7037052
60813 7037052 6905294 6776659 6651778 6530049 6410214 6292107 6177505 6068703 5965657
60804 5965657 5864968 5762755 5658588 5555603 5457011 5363983 5276618 5194249 5113856 5030846
60794 5030846 4943564 4855310 4770008 4687802 4607212 4529406 4456639 4387600 4318494 4248748 4181568
60783 4181568 4117979 4054238 3987157 3918930 3854242 3794795 3738980 3685056 3631922 3577966 3521970
60772 3521970 3465079 3410039 3358525 3310436 3265126 3221639 3178143 3133060 3087076 3042769 3001762
60761C001762l8771l9051m0766m1416l9291l5337l2724l3458l5741l6151l4053
60750B595003l1792l0730k9885k8950k9473l1548l2281k9863k6742k5919k6056
60739B271764k3778j9660j8007k0526k3914k4849k4164k4143k4157k1849j7376
60728B029341j3727j2808j3564j4459j5767j8139k0332k0273j7919j5207j3073
60717A854073j0517p352n796p367r681r030n735l998o006r049r740q496p673p541
60703A746092o857n959o161o735n667l486l152n529p808p601o119n737o553p315
60689A661413p760q036p272n146l699n093q155r773r354r228j0288j0097o580
60676A560932j580J002n05m359p551q084n940l074k094m069p695j0792j1934j0691
$$ plain form
60761 3001762 2962991 2923940 2883174 2841758 2802467 2767130 2734406 2700948 2665207 2629056 2595003
60750 2595003 2563211 2532481 2502596 2473646 2444173 2412625 2380344 2350481 2323739 2297820 2271764
60739 2271764 2247986 2228326 2210319 2189793 2165879 2141030 2116866 2092723 2068566 2046717 2029341
60728 2029341 2015614 2002806 1989242 1974783 1959016 1940877 1920545 1900272 1882353 1867146 1854073
60717 1854073 1843556 1836204 1830408 1823041 1813360 1804330 1798595 1794597 1788591 1779542 1769802 1761306 1753633 1746092
60703 1746092 1739235 1733276 1727115 1720380 1714713 1711227 1708075 1702546 1694738 1687137 1681018 1675281 1668728 1661413
60689 1661413 1653653 1645617 1638345 1633199 1629500 1624407 1616252 1606479 1597125 1587897 1577609 1567512 1560932
60676 1560932 1559352 1560354 1559849 1555490 1547939 1539855 1533915 1530841 1528747 1524678 1516983 1506191 1494257 1483566
60662A483566p694n033m862o370n852j561L066L533M33j579n79O42rn58P68J434
60646A459345j544n836o345k843m90j961l480r55L563N145L441K601M455O041
60632A461137M836K900L545O242P387N111J143j756k396j421m20p15k043k678
60618A480872j854j324k940n342n269k251M79M95p01m33J179J830L75k381n256
60603A457479p073o199k082K648L728k08n914q950p850m432j177Q61K034K838
60589A425703K773O75l451p320q042n012m72K810L690K750J389R54J618J896K49
60574A420210k678m492l998k390j101OJ354J959N86k126m015l606j017K741O167
60559A407600P351N181Q80k610l351k210j574k562l602k148K039N742N484J958
$$ plain form
60662 1483566 1475872 1470839 1465977 1459607 1453755 1452194 1455260 1458793 1459226 1457647 1457068 1457710 1457701 1457143 1457911 1459345
60646 1459345 1457801 1451965 1445620 1442777 1442287 1440326 1436846 1435891 1439454 1444599 1448040 1450641 1455096 1461137
60632 1461137 1465973 1468873 1472418 1478660 1486047 1491158 1492301 1490545 1488149 1486728 1486308 1485593 1483550 1480872
60618 1480872 1479018 1477694 1474754 1469412 1464143 1461892 1462371 1462866 1462165 1461732 1462911 1464741 1465116 1462735 1457479
60603 1457479 1450406 1444207 1442125 1444773 1448501 1448293 1442379 1433429 1425579 1421147 1419970 1420831 1422865 1425703
60589 1425703 1428476 1429151 1425700 1418380 1410338 1405326 1404854 1407664 1411354 1414104 1415493 1416447 1418065 1419961 1420210
60574 1420210 1417532 1413040 1409042 1406652 1405551 1405557 1406911 1408870 1409456 1407330 1403315 1399709 1398692 1401433 1407600
60559 1407600 1414951 1420132 1421012 1418402 1415051 1412841 1411267 1408705 1405103 1402955 1404994 1410736 1416220 1418178
60545A418178k50J866N840O725L170j234k375J98L725N290L864M55k791m024k874
60530A435763m10K097M189O247Q781J1458J2729J1117P374M469M545O678Q665
60517A523702J0047J1647J2968J2495J0602R640J0421J0872R338P218O822Q449
60505A644221J1221J5075J9690K2960K3193K2060K2500K4082K3529K0087J6961
60494A865579J6145J5079J0912N663L942O686J0377J2220J3045J4503J6360J7896
60482B008407J9750K2349K4098K3296K1206K1018K3908K7920L0893L2886L5124
60471B290855L8021M1005M3361M4429M3613M0844L6597L1179K4798J8577J4310
60460B667589J2388J1045Q633N796M173L977M377N550Q428J2614J6489J9488K2317
$$ plain form
60545 1418178 1417928 1419794 1425634 1432359 1435529 1434295 1431920 1432118 1435843 1441133 1444997 1445452 1442661 1438637 1435763
60530 1435763 1435353 1437450 1441639 1447886 1456667 1468125 1480854 1491971 1499345 1503814 1508359 1515037 1523702
60517 1523702 1533749 1545396 1558364 1570859 1581461 1591101 1601522 1612394 1621732 1628950 1635772 1644221
60505 1644221 1655442 1670517 1690207 1713167 1736360 1758420 1780920 1805002 1828531 1848618 1865579
60494 1865579 1881724 1896803 1907715 1913378 1917320 1924006 1934383 1946603 1959648 1974151 1990511 2008407
60482 2008407 2028157 2050506 2074604 2097900 2119106 2140124 2164032 2191952 2222845 2255731 2290855
60471 2290855 2328876 2369881 2413242 2457671 2501284 2542128 2578725 2609904 2634702 2653279 2667589
60460 2667589 2679977 2691022 2699655 2705451 2709624 2713601 2717978 2723528 2731956 2744570 2761059 2780547 2802864
60447B802864K4695K5137K3871K3857K7259L2600L7016M0068M3208M6715M9640
60436C176930N2355N6492O1952O6123O6985O5390O3400O1884O0536N8930N6416
60425C847393N2130M6316M0745L6661L3164K8906K4649K2457K2472K1970J7870
60414D194733R218k828j6238k8967l9641m8087n4843n9909o2584o2695o1344n9915
60402C706900n8670n6695n3060m8032m3322m0989m1550m3224m3472m1267l7388
60391C199231l2924k8381k4367k2037k2327k5080k8892l1315k9808k3994j7144
60380B912962j3791j5068j7630j7963j6300j5221j5799j6997j7942j8774j9335
60369B728142j8929j7777j7285j8173j9338j9201j7711j6377j6290j6537j5119
$$ plain form
60447 2802864 2827559 2852696 2876567 2900424 2927683 2960283 2997299 3037367 3080575 3127290 3176930
60436 3176930 3229285 3285777 3347729 3413852 3480837 3546227 3609627 3671511 3732047 3790977 3847393
60425 3847393 3899523 3945839 3986584 4023245 4056409 4085315 4109964 4132421 4154893 4176863 4194733
60414 4194733 4203951 4201123 4184885 4155918 4116277 4068190 4013347 3953438 3890854 3828159 3766815 3706900
60402 3706900 3648230 3591535 3538475 3490443 3447121 3406132 3364582 3321358 3277886 3236619 3199231
60391 3199231 3166307 3137926 3113559 3091522 3069195 3044115 3015223 2983908 2954100 2930106 2912962
60380 2912962 2899171 2884103 2866473 2848510 2832210 2816989 2801190 2784193 2766251 2747477 2728142
60369 2728142 2709213 2691436 2674151 2655978 2636640 2617439 2599728 2583351 2567061 2550524 2535405
60358B535405j1947j0070j2253j6521j7674j4301j1412j3615j8127j8508j4080
60347B376897j0927j2985j6763j6939j3634j1153j1659j3165j2813r932o414n483
60335B235030q961j4404j6312j2023n118j237j787l981n593o688p278o655n529
60322B139464o088q792j1166j0849q456o330n643n689n330m258l183l004l569
60309B057107l408j512R20J400j069m789o890n568j545J973J709k037m876k955
60295B028460K601P288Q390O618L652O45j138j040n12j357k422r70K526M351L227
60280B060319K209L208L293o22o316q947p441m788l198k259j375j041j564k555
60266B028923l677m305l177k12K191J738n66j914j521n71O99K932N015M706K262
$$ plain form
60358 2535405 2523458 2513388 2501135 2484614 2466940 2452639 2441227 2427612 2409485 2390977 2376897
60347 2376897 2365970 2352985 2336222 2319283 2305649 2294496 2282837 2269672 2256859 2246927 2240513 2235030
60335 2235030 2226069 2211665 2195353 2183330 2178212 2176975 2175188 2171207 2165614 2158926 2151648 2144993 2139464
60322 2139464 2133376 2124584 2113418 2102569 2094113 2087783 2082140 2076451 2071121 2066863 2063680 2060676 2057107
60309 2057107 2053699 2052187 2053107 2054507 2053438 2048649 2041759 2036191 2034646 2036619 2038328 2036291 2031415 2028460
60295 2028460 2031061 2038349 2046739 2053357 2057009 2057654 2056516 2055476 2054964 2053607 2051185 2050215 2052741 2057092 2060319
60280 2060319 2062528 2065736 2069029 2068407 2062091 2053144 2045703 2040915 2037717 2035458 2034083 2033042 2031478 2028923
60266 2028923 2025246 2020941 2017764 2017552 2019743 2021481 2020915 2019001 2017480 2016909 2017608 2020540 2025555 2030261 2032523
60251B032523O15J433L445N266P252R641J1383J2020J2777J4515J6255J6698J5792
60238B159615J4132J2369J1464J1563J0430N489j961p414q905r067j0315j1497
60226B175903j1436j2056j4658j6131j3178q287p022j0269j3507j3399j0878p629
60214B037453l928j103k019o835j1264j1398q340o112o701q905j0601j0312p821
60201A942114m906m378o787r045p972m287j368p93j116q38m06o66r75r2J722K726
60185A902933J902L47k71j57j044l003l179O94O423R255P652M971M696O126N971
60170A943316K729k002n429n613k577J583M621O709R565J2436J1605N816k68j181
60156A981310K471N694O579P814J0654J1995R365N258L796N302P008P568P941
$$ plain form
60251 2032523 2033138 2034571 2038016 2043282 2050534 2060175 2071558 2083578 2096355 2110870 2127125 2143823 2159615
60238 2159615 2173747 2186116 2197580 2209143 2219573 2225062 2223101 2215687 2206782 2197715 2187400 2175903
60226 2175903 2164467 2152411 2137753 2121622 2108444 2100157 2093135 2082866 2069359 2055960 2045082 2037453
60214 2037453 2033525 2032422 2030403 2023568 2012304 2000906 1992566 1986454 1979753 1970848 1960247 1949935 1942114
60201 1942114 1937208 1932830 1926043 1916998 1909026 1904739 1903371 1902578 1901462 1900624 1900218 1899552 1898577 1898485 1900207 1902933
60185 1902933 1904835 1905182 1904911 1904754 1903710 1900707 1897528 1898222 1904645 1913900 1921552 1926523 1931219 1937345 1943316
60170 1943316 1946045 1944043 1938614 1933001 1930424 1932007 1936628 1943337 1952902 1965338 1976943 1982759 1982491 1981310
60156 1981310 1983781 1989475 1996054 2003868 2014522 2026517 2035882 2041140 2044936 2050238 2057246 2064814 2072755
60143B072755Q462P717M870J365k97J290N539J0162J2314J0397N345O5k534j386
60129B136064K053M842N017L321J830R14q83l514m108p98L585M321J039j469M41
60114B152655M462N415J900k236k879j74K684L813M057M331L560O06k802l182
60100B172210L45M449N346L023N18j71J55O5q8J276M666Q557J0645R917P473N511
60084B233897N456O987Q484Q243N745K452R31K160L895L135L21o42K738Q238J1607
60069B303647J1180Q444N442L462L391N237P584R117J0237J1729J2731J2137J1119
60056B415457J1505J2175J0267O289M349O219Q720R041R182J1940J5238J4657
60044B535039J0297O744O301O316M206J478Q50K122L280L836M560N077M264K689
$$ plain form
60143 2072755 2081217 2088934 2093804 2095169 2094872 2096162 2101701 2111863 2124177 2134574 2139919 2139984 2137450 2136064
60129 2136064 2138117 2142959 2147976 2151297 2153127 2154041 2153158 2149644 2145536 2144738 2148323 2152644 2153683 2152214 2152655
60114 2152655 2157117 2162532 2164432 2162196 2159317 2159143 2161827 2165640 2169697 2174028 2177588 2178194 2175392 2172210
60100 2172210 2172555 2177004 2182350 2185373 2185891 2185720 2185875 2185940 2185852 2187128 2191794 2200351 2210996 2220913 2228386 2233897
60084 2233897 2239353 2246340 2254824 2263067 2268812 2271264 2272195 2274355 2278250 2281385 2281706 2281064 2283802 2292040 2303647
60069 2303647 2314827 2323271 2328713 2332175 2335566 2340803 2348387 2357504 2367741 2379470 2392201 2404338 2415457
60056 2415457 2426962 2439137 2449404 2455693 2460042 2466261 2474981 2484022 2493204 2505144 2520382 2535039
60044 2535039 2545336 2552080 2558381 2564697 2568903 2570381 2571231 2573353 2576633 2580469 2585029 2590106 2594370 2597059
60030B597059K257L098K788m47n081p982q021o876o504o927o917o152n884p217
60016B537194r255r735p756n190m604o113p430p197p026r118j2798j4894j3536
60003B422542j0257q028q306j0327j2264j2488j0564p739n763m898m089l398m459
59990B319962p419r342p754m389k785l063k356j81K75k684o096o346l818j416
59976B262588n20r17k842o177q744q509o872o828q170p786m976k978m000n912
59962B187357n942n203o631r823j0936p759k684Q8j074m266o730p774q867j0869
59948B098887j1959r541m251k70o33l758o122o791p160p379o150m029l785o472
59934B020587r702j1183j1409j1067q363k079M386N774J563l510n668n490m443
$$ plain form
60030 2597059 2599316 2602414 2605202 2604755 2599674 2591692 2583671 2576795 2570291 2563364 2556447 2550295 2544411 2537194
60016 2537194 2527939 2518204 2510448 2505258 2500654 2494541 2487111 2479914 2472888 2463770 2450972 2436078 2422542
60003 2422542 2412285 2404257 2395951 2385624 2373360 2360872 2350308 2342569 2336806 2331908 2327819 2324421 2319962
59990 2319962 2312543 2303201 2295447 2291058 2288273 2285210 2282854 2282673 2282948 2280264 2274168 2267822 2264004 2262588
59976 2262588 2262068 2261151 2258309 2252132 2243388 2234879 2228007 2221179 2213009 2205223 2200247 2197269 2193269 2187357
59962 2187357 2181415 2176212 2169581 2159758 2148822 2141063 2138379 2138467 2137393 2133127 2126397 2118623 2109756 2098887
59948 2098887 2086928 2077387 2073136 2072866 2072233 2068475 2062353 2055562 2048402 2041023 2034873 2030844 2027059 2020587
59934 2020587 2010885 1999702 1988293 1977226 1968863 1966784 1971170 1976944 1978507 1974997 1969329 1963839 1959396
59921A959396j926K023M362K797j37l40J639J440k348o134o849n886n811o091
59907A936135m691j923n0Rp23j318j550r48P75K442K287J42k597m808n831m381
59891A912970K08N458P091M051K6j550j938m216p486p289j978M233O091L376K87
59876A919334k61N45M47k26O75L628O537P363O313M981M459N100P027R632J1048
59861A986602R618O088L333L644O782J0577J2685J2046R715Q283R194J0589R279
59848B098435N193K148L078O125P124M961K446K275M140O160P407Q135Q667R024
59834B175318R174Q960Q096O681N459N170N693O101N555M203L150L282L971L534
59820B254347J354j018j597LL111P556J2842J6277J4630Q438K588J069K809M156
$$ plain form
59921 1959396 1957470 1959493 1963855 1966652 1966515 1966175 1967814 1969254 1966906 1960772 1953923 1948037 1942226 1936135
59907 1936135 1931444 1929521 1929471 1929480 1928757 1927439 1925889 1924941 1925716 1928158 1930445 1930587 1927990 1923182 1917351 1912970
59891 1912970 1913178 1918636 1925727 1929778 1929804 1928254 1926316 1922100 1914614 1907325 1905347 1909580 1915671 1919047 1919334
59876 1919334 1919073 1919618 1920065 1919839 1920514 1924142 1930679 1938042 1944355 1949336 1953795 1958895 1965922 1975554 1986602
59861 1986602 1996220 2002308 2005641 2009285 2016067 2026644 2039329 2051375 2061090 2069373 2078567 2089156 2098435
59848 2098435 2103628 2105776 2108854 2114979 2122103 2127064 2129510 2131785 2135925 2142085 2149492 2157627 2166294 2175318
59834 2175318 2184492 2193452 2201548 2208229 2213688 2218858 2224551 2230652 2236207 2240410 2243560 2246842 2250813 2254347
59820 2254347 2255701 2254683 2253086 2253089 2256200 2263756 2276598 2292875 2307505 2315943 2318531 2319600 2322409 2326565
59806B326565L940L907N042O089N812M647L615L100L200L977M882N103M900N383
59792B390162O531O830N533M060M085N206N690M880L840L849N047O530P328P436
59778B467007P834Q903R128O696K472l16j30Q62m5k558m689o062p565q685p788
59763B465064n079k924k946m596o801r015j0190q833n148j578k45r30k243l356
59749B401180l784k824m51K147L750M006K685n09m517o840o280m667m547o146
59735B373203p893q789q729p441n136l461l799m938m430k274j152k643n145o281
59721B301092n707m632l885l689m392o197q307r151p522l630N23K092j01l721
59707B242773m774j847K580N521O711P387P543O394M803M749O284P167O244N216
$$ plain form
59806 2326565 2330505 2334412 2339454 2345543 2351355 2356002 2359617 2362717 2365917 2369894 2374776 2379879 2384779 2390162
59792 2390162 2396693 2403523 2409056 2413116 2417201 2422407 2428097 2432977 2436817 2440666 2445713 2452243 2459571 2467007
59778 2467007 2474841 2483744 2492872 2499568 2502040 2501724 2501594 2502456 2502411 2499853 2495164 2489102 2481537 2472852 2465064
59763 2465064 2459985 2457061 2454115 2449519 2442718 2433703 2423513 2414680 2409532 2407954 2407709 2406779 2404536 2401180
59749 2401180 2397396 2394572 2394121 2396268 2400018 2404024 2406709 2406200 2401683 2394843 2388563 2383896 2379349 2373203
59735 2373203 2365310 2356521 2347792 2340351 2335215 2331754 2327955 2323017 2318587 2316313 2315161 2312518 2307373 2301092
59721 2301092 2295385 2290753 2286868 2283179 2278787 2272590 2264283 2255132 2247610 2243980 2244503 2246595 2246494 2242773
59707 2242773 2237999 2236152 2238732 2244253 2250964 2258351 2265894 2272288 2277091 2281840 2288124 2295291 2301535 2306751
59693B306751N877P309P530O714O685P749Q242P329O175N754N353M145K707J779
59679B390099R11k89q67r5P07k13k273l370k987k495k506k066p05P18J660K490
59663B378719K972K139L60n69l81j269m308o987o258k630R19L113N061P243Q245
59648B386369O948M409K795L310N457P791R093R131Q389P279O176O008P622J0276
59634B481053J1976J1816J0853J0152R462Q430P606P268O703N663M999M947M650
59621B585578M381N811Q341P919K312m608p020m200k94J635J923J711J500J896
59607B606885K525R44m014q484p210p15N222P193O788N416J983k626l975j78M312
59592B614066M486J128j738k874l558l628j813J046K444J425j053m028o692p771
$$ plain form
59693 2306751 2312628 2319937 2327467 2334181 2340866 2348615 2356857 2364186 2370361 2376115 2381468 2385613 2388320 2390099
59679 2390099 2391010 2390721 2389854 2389759 2390466 2390253 2387980 2384610 2381623 2379128 2376622 2374556 2373851 2374569 2376229 2378719
59663 2378719 2381691 2383830 2384190 2383621 2383240 2381971 2377663 2370676 2364418 2361788 2362707 2365820 2370881 2378124 2386369
59648 2386369 2393317 2397726 2400521 2403831 2409288 2417079 2426172 2435303 2443692 2450971 2457147 2463155 2470777 2481053
59634 2481053 2493029 2504845 2515698 2525850 2535312 2543742 2551348 2558616 2565319 2570982 2575981 2580928 2585578
59621 2585578 2589959 2595770 2604111 2612030 2614342 2609734 2602714 2598514 2598220 2599855 2601778 2603489 2604989 2606885
59607 2606885 2609410 2610354 2606340 2597856 2590646 2589931 2595153 2602346 2609134 2614550 2616533 2613907 2609932 2609754 2614066
59592 2614066 2618552 2619680 2617942 2615068 2611510 2607882 2606069 2607115 2609559 2610984 2609931 2605903 2599211 2591440
59578B591440p149p052r424j3037j5285j5612j4926j3080r759o822o618q355q950
59565B455371p452o090o870r412j2291j4376j4834j3791j2997j3864j4992j3835
59553B314567j0813r263j0910j3686j4782j3670j1152p558l525j037j814m972
59541B211385p506p128m212j163k34j665l729m662m293l650l452l667m167n025
59527B156832o266p697q791q780p534o375o745p733o771l692j927l871o876o512
59513B067262k645N20j1l174o476q705r512q666o731m927l618k240r80r01j947
59498B007249k376r76J293K422J396j114l236l184q89J882L866N886Q740J0638
59484B031597R093M868J528J034K178L591N607Q302J0150R963Q543P386P111P747
$$ plain form
59578 2591440 2584291 2577239 2567815 2554778 2539493 2523881 2508955 2495875 2486116 2479294 2472676 2464321 2455371
59565 2455371 2447919 2441829 2434959 2425547 2413256 2398880 2384046 2370255 2357258 2343394 2328402 2314567
59553 2314567 2303754 2294491 2283581 2269895 2255113 2241443 2230291 2222733 2219208 2218171 2216357 2211385
59541 2211385 2203879 2196751 2192539 2191376 2191142 2189477 2185748 2181086 2176793 2173143 2169691 2166024 2161857 2156832
59527 2156832 2150566 2142869 2134078 2125298 2117764 2111389 2104644 2096911 2090140 2086448 2084521 2080650 2073774 2067262
59513 2067262 2064617 2065137 2065126 2061952 2055476 2046771 2037259 2028593 2021862 2016935 2013317 2011077 2010097 2009196 2007249
59498 2007249 2004873 2003897 2005190 2007612 2009008 2007894 2004658 2001474 2000585 2002467 2006333 2012219 2020959 2031597
59484 2031597 2040690 2045558 2047086 2048120 2050298 2053889 2059496 2067798 2077948 2087911 2096454 2103840 2110951 2118698
59470B118698Q863Q919O321J792k080m209n764o980n904j812K471L758K348P49
59456B127170q7j164l023m763n121l380K8K948K704q48m488n168l468k351l469
59441B095520n988q129q445o356k764K81J516J435Q15m42k155l062k546j845j965
59426B055870j665P22M322O380N389K250r16k041l29K268K173j505m977m054O97
59411B064584N278P405P754P003M990K788K488M181N477M701K656P32n74q27N81
59396B119217L111N244O475P392P709O608N253O091Q705R470O950M597N553P529
59382B209904O238K006r63j083j010k279k406Q93N396O732L661j015l819l128
59368B219127P73N998R612R796Q060P836J0284J2831J2649J0306Q649Q974J0160
$$ plain form
59470 2118698 2127561 2136480 2142801 2144593 2142513 2138304 2132540 2125560 2119656 2117844 2120315 2124073 2126421 2127170
59456 2127170 2127083 2125919 2122896 2118133 2113012 2109632 2109660 2112608 2115312 2114464 2109976 2104808 2101340 2098989 2095520
59441 2095520 2089532 2081403 2072958 2066602 2063838 2064119 2065635 2067070 2067885 2067443 2065288 2062226 2059680 2057835 2055870
59426 2055870 2054205 2054927 2059249 2065629 2071018 2073268 2072352 2070311 2069982 2072250 2074423 2072918 2067941 2063887 2064584
59411 2064584 2069862 2077267 2085021 2092024 2097014 2099802 2102290 2106471 2111948 2116649 2119305 2120037 2119463 2118636 2119217
59396 2119217 2122328 2127572 2134047 2141439 2149148 2155756 2161009 2167100 2175805 2185275 2192225 2196822 2202375 2209904
59382 2209904 2216142 2218148 2217185 2216102 2215092 2212813 2210407 2211300 2216696 2223428 2227089 2226074 2222255 2219127
59368 2219127 2219900 2225898 2235510 2245306 2253366 2261202 2271486 2284317 2296966 2307272 2315921 2324895 2335055
59355B335055J1275J2955J5580J7957J9096K0002K1937K3698K2556J7955J2406
59344B530472Q156M753J012j931j355L558J0366J5543J6858J3764P247J08m225
59331B604326m808m399n906q205p514k930K006M108M312M776M660K013j523j781
59317B589135K089O356Q051Q212Q450P766N228K951L246M854N296N454P980J1938
59303B677006J3083R965O136N155O504P840Q546R112R173Q462Q311J0078J2784
59290B792155J4036J2907J0732R514J0469J3372J6503J7965J7866J8161J9624
59279B953304K0358J8588J5384J2815J0732P783M672L592M381M073Q93l479o503
59266C046593p500o796m409j267J04j753m985o952q074j0766j5041j7780j6885
$$ plain form
59355 2335055 2346330 2359285 2374865 2392822 2411918 2431920 2453857 2477555 2500111 2518066 2530472
59344 2530472 2538628 2543381 2544393 2542462 2541107 2544665 2555031 2570574 2587432 2601196 2608443 2608551 2604326
59331 2604326 2599518 2595119 2589213 2581008 2573494 2570564 2572570 2576678 2580990 2585766 2590426 2592439 2590916 2589135
59317 2589135 2591224 2597580 2605631 2613843 2622293 2630059 2635287 2638238 2641484 2646338 2651634 2657088 2665068 2677006
59303 2677006 2690089 2700054 2706190 2711345 2717849 2725689 2734235 2743347 2752520 2760982 2769293 2779371 2792155
59290 2792155 2806191 2819098 2829830 2839344 2849813 2863185 2879688 2897653 2915519 2933680 2953304
59279 2953304 2973662 2992250 3007634 3020449 3031181 3038964 3043636 3047228 3051609 3055682 3056575 3053096 3046593
59266 3046593 3039093 3032297 3027888 3026621 3026725 3024972 3019987 3013035 3004961 2994195 2979154 2961374 2944489
59253B944489j3726j0595p907n488m756p211j1414j3834j2937j0650r233q437
59241B828301o918n180n121o687o790k806L554P414O114K276M79J657K426M0m021
59226B814738o585p280q307j0313j1054q977o077n625p970j0215r756o785l275
59213B712519o84Q24J707K356L048M057N544P276Q500Q372O795M842L936M241
59199B773333M017J285l463o835n852j590J794J929O49N91J045q11n324r352j0008
59184B741408p458l692m54J097N08j123j879j491j579k714l041j190J330K349
59170B722071K073J883J462m60l230m679m148k998k335k293l292n599p661p409
59156B683385n590n270p281q681p018l807k164k950m974p277r031q694n640j873
$$ plain form
59253 2944489 2930763 2920168 2912261 2906773 2902017 2894806 2883392 2869558 2856621 2845971 2836738 2828301
59241 2828301 2821383 2816203 2811082 2804395 2797605 2794799 2798353 2805767 2811881 2814157 2814636 2816293 2818719 2818759 2814738
59226 2814738 2808153 2800873 2792566 2782253 2771199 2762222 2756145 2750520 2742550 2732335 2722579 2715794 2712519
59213 2712519 2711835 2712659 2714366 2716722 2719770 2723827 2729371 2736647 2745147 2753519 2760314 2765156 2769092 2773333
59199 2773333 2777350 2778635 2775172 2768337 2762485 2760895 2762689 2764618 2765267 2765858 2766903 2766092 2760768 2751416 2741408
59184 2741408 2733950 2730258 2729804 2730901 2731409 2730286 2728407 2726916 2725337 2722623 2719582 2718392 2719722 2722071
59170 2722071 2724144 2726027 2727489 2727029 2723799 2719120 2714972 2711974 2709639 2707346 2704054 2698455 2690794 2683385
59156 2683385 2677795 2672525 2665244 2656563 2649545 2645738 2643574 2640624 2635650 2628373 2619342 2610648 2605008 2603135
59142B603135J50P43J842L153K277j038l548k549Q57L837N351N887N262K974J39
59127B628472j103p7K156M848P898J0068R255N653K649K914M971N346L007j97
59113B685860k512l467k764n37J312O64j508j880L76K030L66l086n253n981p410
59098B656210j0177j2588j3032j1384q536n946m974n368n423m927o220j0362j3956
59085B543317j2905q231m909n295p218q482r486j0490r963p444n206n063n759
59072B442866n453m737n053n878n678m410k952j099J766M720N954N176L732K764
59058B431718K520L122M683O882R294J1776J3721J3844J1814R366Q475R021R452
59045B545688R141Q772Q821Q923Q432O661L203q68k922j402J869L531K427O4k139
$$ plain form
59142 2603135 2603285 2604028 2605870 2609023 2611300 2610262 2606714 2604165 2605022 2608859 2614210 2620097 2625359 2628333 2628472
59127 2628472 2627369 2627292 2629448 2634296 2642194 2652262 2661517 2667170 2669819 2672733 2677704 2683050 2686057 2685860
59113 2685860 2683348 2679881 2677117 2676580 2677892 2678556 2677048 2675168 2675544 2677574 2677940 2674854 2669601 2663620 2656210
59098 2656210 2646033 2633445 2620413 2609029 2600493 2594547 2589573 2584205 2578782 2573855 2567635 2557273 2543317
59085 2543317 2530412 2522181 2517272 2511977 2504759 2496277 2486791 2476301 2466338 2458894 2453688 2448625 2442866
59072 2442866 2437413 2432676 2427623 2421745 2416067 2411657 2408705 2407606 2409372 2414092 2420046 2425222 2428954 2431718
59058 2431718 2434238 2437360 2442043 2448925 2458219 2469995 2483716 2497560 2509374 2518740 2527215 2536236 2545688
59045 2545688 2554829 2563601 2572422 2581345 2589777 2596438 2599641 2598773 2595851 2594449 2596318 2599849 2602276 2602340 2600201
59030B600201m091n470n019k415L42M60k946p864j0834r695n636k326k309m686
59016B537712o955q238r422j0893j2084j2963j4049j4787j3850j1446r442q645
59004B404938p825o259n144n222m924k827n93j053l969o088n499l841l440l989
58990B344265l421j260L17j009m661p173n622j053K186J114k446m082k016J407
58976B316546L385L915M303M256K574O9o41J284L552L964L486M683P944J0930
58962B370250J1531J0014Q229P697Q669J0070J0186Q220N360L659L707M240M081
58949B465913L512L347L790M650N822O718O191M005J833J511K618K954J607L14
58935B514785J073L150L598R56k530l309r15J222j27m124p151p199n375l241o63
$$ plain form
59030 2600201 2596110 2590640 2585621 2583206 2583548 2584008 2581062 2573198 2562364 2552669 2547033 2544707 2542398 2537712
59016 2537712 2530757 2522519 2513097 2502204 2490120 2477157 2463108 2448321 2434471 2423025 2413583 2404938
59004 2404938 2397113 2390854 2385710 2380488 2375564 2372737 2372144 2371091 2367122 2361034 2355535 2351694 2348254 2344265
58990 2344265 2340844 2339584 2339901 2338892 2334231 2327058 2321436 2320383 2322569 2323683 2321237 2317155 2315139 2316546
58976 2316546 2319931 2323846 2328149 2332405 2334979 2335048 2334407 2335691 2339243 2343207 2346693 2351376 2359320 2370250
58962 2370250 2381781 2391795 2400024 2407721 2416390 2426460 2436646 2444866 2450226 2453885 2457592 2461832 2465913
58949 2465913 2469425 2472772 2476562 2481212 2487034 2493752 2499943 2503948 2505781 2507292 2509910 2512864 2514471 2514785
58935 2514785 2515858 2519008 2522606 2523562 2521032 2517723 2516808 2518030 2517903 2513779 2506628 2499429 2494054 2490813 2490150
58920B490150K803N929O780N175L079K544L881N671O195N153M261N637R125J1883
58906B568266J1279P859M814M667O945Q909Q213N075J941Q74J356J315j00j888
58892B629525l243m577n974o399n572n098o153p227o124l562k721n254r294j1756
58878B546571j1326q962o596n649n960n827l745j76K745L242J192k036m369m285
58864B494819k332j001k134m750o396o046m538k771j024K33P03J394L551O260
58850B475968O986N077K879K497L207L456L831O063R808J2492J2463J0767R364
58837B564858Q900R020R929J2291J5543J7518J6652J4169J3021J4499J6824J7599
58825B730823J6818J6439J7388J8218J7020J3878J0931J0045J0771J0858Q992
$$ plain form
58920 2490150 2492953 2498882 2505662 2510837 2513916 2516460 2520341 2526012 2532207 2537360 2541621 2547258 2556383 2568266
58906 2568266 2579545 2587404 2592218 2596885 2603830 2612739 2620952 2626027 2627968 2628842 2630198 2631513 2631413 2629525
58892 2629525 2626282 2621705 2615731 2609332 2603760 2598662 2592509 2585282 2579158 2575596 2572875 2567621 2558327 2546571
58878 2546571 2535245 2526283 2519687 2514038 2508078 2502251 2498506 2498330 2501075 2504317 2505509 2503473 2499104 2494819
58864 2494819 2492487 2491486 2489352 2484602 2478206 2472160 2467622 2464851 2463827 2464060 2464763 2466157 2469708 2475968
58850 2475968 2482954 2488031 2490910 2493407 2496614 2500070 2503901 2509964 2519772 2532264 2544727 2555494 2564858
58837 2564858 2573758 2582778 2592707 2604998 2620541 2638059 2654711 2668880 2681901 2696400 2713224 2730823
58825 2730823 2747641 2764080 2781468 2799686 2816706 2830584 2841515 2851560 2862331 2873189 2882181
58814B882181O486N397N395M072Q49j483m19K536L792K414P19M39M78j040m156
58799B907660p126q144o847m886m736o938r083r071q554j0964j6182j9819j8496
58786B776814j3679r201p077p137r010j2477j6431j8953j8401j4304q093l059
58774B638992k086m743p928r757j0963j1960j1199q316o399q150j1120j0154m342
58761B531875J497K757j67l866o252p151o266l026J544M514L506q76n475p540
58747B505074p180o821q218j0359j0704q247m744k769l052m167m616m597n402
58734B424198p577j0307j2509j3595j2881r495l975R17K576J524M08J41r47l562
58720B354916n218l300R99L900L702K355K389M020O037P842R102Q194L219m645
$$ plain form
58814 2882181 2888667 2894064 2899459 2903531 2904380 2902897 2902478 2905014 2908806 2911220 2911939 2912378 2912856 2911816 2907660
58799 2907660 2900534 2892390 2885543 2880657 2875921 2868983 2859900 2850829 2842275 2831311 2815129 2795310 2776814
58786 2776814 2763135 2753934 2746857 2739720 2730710 2718233 2701802 2682849 2664448 2650144 2642051 2638992
58774 2638992 2636906 2632163 2624235 2614478 2603515 2591555 2580356 2572040 2565641 2557491 2546371 2536217 2531875
58761 2531875 2533372 2536129 2535962 2532096 2525844 2518693 2512427 2509401 2510945 2515459 2518965 2518089 2512614 2505074
58747 2505074 2497894 2491073 2482855 2472496 2461792 2453545 2448801 2446032 2442980 2438813 2434197 2429600 2424198
58734 2424198 2416621 2406314 2393805 2380210 2367329 2357834 2353859 2354776 2357352 2358876 2359284 2359425 2358478 2354916
58720 2354916 2349698 2346398 2347397 2351297 2354999 2357354 2359743 2363763 2369800 2377642 2386744 2394938 2398157 2393512
58706B393512j0538j0749p707p733j3039j8309j7165j0163l685j789k636l050
58694B286949l034m056n602n962n006m033l485k618r60J176L328M946N310M311
58680B271264K924K184K181K527L021L377L323L459M900P456R494J0138J0032
58667B336280R318P094L996K766M384O022N232L745M116N006L717J627K224M436
58653B399963L297j968n633l198K771O859P129M501n76p134j1861j2314j0715
58640B371121j0970j2898j2972j0269p990q767j1661j4554j6516j6898j4862j1526
58628B221238j0198j2437j5429j5265j1743p958o100n705n556n208m591l903m151
58615B112994o039q068p600m518k034k679n136o540o427o194n712l243J151M697
$$ plain form
58706 2393512 2382974 2372225 2364518 2356785 2343746 2325437 2308272 2298109 2294424 2292635 2289999 2286949
58694 2286949 2283915 2279859 2274257 2268295 2263289 2259256 2255771 2253153 2252193 2253369 2256697 2261643 2266953 2271264
58680 2271264 2274188 2276372 2278553 2281080 2284101 2287478 2290801 2294260 2299160 2306616 2316110 2326248 2336280
58667 2336280 2345598 2352692 2356688 2359454 2363838 2369860 2375092 2378837 2382953 2387959 2391676 2393303 2395527 2399963
58653 2399963 2403260 2401292 2395659 2392461 2395232 2402091 2409220 2413721 2413145 2406011 2394150 2381836 2371121
58640 2371121 2360151 2347253 2334281 2324012 2316022 2307255 2295594 2281040 2264524 2247626 2232764 2221238
58628 2221238 2211040 2198603 2183174 2167909 2156166 2148208 2142108 2136403 2130847 2125639 2121048 2117145 2112994
58615 2112994 2106955 2098887 2091287 2086769 2084735 2082056 2076920 2070380 2063953 2057759 2052047 2048804 2049955 2054652
58601B054652N309L929K372N70k456o025q052p579n791m580n041p084r592j1016
58587A999616j0663r388q479p988o849m516j950q54k218n369q142q317n554j951
58573A917378m65k506o832j0366j0462p219l582k367l239l614k312q10p01j693
58559A861210k728l371l253j898j92k53k424m186l595j957j227o47J422L918M363
58544A845182K792J498J413J643K009L093M020L459K652M082O974P789N871M824
58530A897301O896R628J0109R280R439J0268J0232R919J0991J3114J4613J5212
58518B027002J5780J6163J5388J3562J1887J1340J2451J5303J8358J8847J6051
58507B192132J2920J2531J4342J6037J7436J9887K2904K4572K4783K5066K5369
$$ plain form
58601 2054652 2059961 2063890 2066262 2066832 2064376 2058351 2050299 2042720 2036929 2032349 2027308 2020224 2010632 1999616
58587 1999616 1988953 1979565 1971086 1963098 1956249 1951733 1949783 1948929 1946711 1941342 1933200 1924883 1919329 1917378
58573 1917378 1916913 1914407 1907575 1897209 1886747 1879528 1875946 1873579 1870340 1866726 1864414 1863604 1862903 1861210
58559 1861210 1858482 1855111 1851858 1849960 1849768 1849515 1847091 1842905 1839310 1837353 1836126 1835479 1836901 1840819 1845182
58544 1845182 1847974 1849472 1850885 1852528 1854537 1857630 1861650 1865109 1867761 1871843 1878817 1886606 1892477 1897301
58530 1897301 1904197 1913825 1923934 1933214 1942653 1952921 1963153 1973072 1984063 1997177 2011790 2027002
58518 2027002 2042782 2058945 2074333 2087895 2099782 2111122 2123573 2138876 2157234 2176081 2192132
58507 2192132 2205052 2217583 2231925 2247962 2265398 2285285 2308189 2332761 2357544 2382610 2407979
58496B407979K3989K0911J8476J7997J8120J7163J4944J1722P552L528J533J719
58484B565633J932O26j329k613l559n190p615j0306j2614j3258j1066p460o364
58471B486817r871j5196j7525j5096j0161n902m056m644o275o981o169n509o741
58458B372691r323j1424j2463j2901j2065q470k563K713M740L343j43m293p438
58445B302404p751m955j272N72J6j248j494o70o5q14k511l270j628J582L933M190
58429B287019L517L464L952M082M006M558N530N778N089M681N593P560R577J0738
58415B365144J0490R137Q310R478J1486J0964O381N32k428j784n13j148l262n143
58401B417644o025n674l398P64M611N369L129J294K860O897R626Q775O017M619
$$ plain form
58496 2407979 2431968 2452879 2471355 2489352 2507472 2524635 2539579 2551301 2558853 2562381 2563914 2565633
58484 2565633 2567565 2568191 2566862 2564249 2560690 2555500 2547885 2537579 2524965 2511707 2500641 2493181 2486817
58471 2486817 2476946 2461750 2444225 2429129 2418968 2413066 2409010 2404366 2398091 2391110 2384941 2379432 2372691
58458 2372691 2363368 2351944 2339481 2326580 2314515 2306045 2303482 2306195 2310935 2314278 2314135 2309842 2302404
58445 2302404 2294653 2289698 2288426 2288998 2289014 2287766 2286272 2285602 2285537 2284723 2282212 2278942 2277314 2278896 2282829 2287019
58429 2287019 2290536 2294000 2297952 2302034 2306040 2310598 2316128 2321906 2326995 2331676 2337269 2344829 2354406 2365144
58415 2365144 2375634 2384771 2393081 2402559 2414045 2425009 2431390 2431922 2429494 2427710 2427197 2426049 2422787 2417644
58401 2417644 2411619 2405945 2402547 2403311 2407922 2413291 2416420 2417714 2420574 2427471 2437097 2445872 2451889 2456508
58387B456508N263N166J832l120n325l079K4p86n540r582r491o729m411k676L41
58372B418395M037N058K042j952l138j195J823N059Q775J1551J0576N517J81j103
58358B465626J950N529N772K380j604l144k203j113j211j380o25m92k947o682
58344B459856q068n795k194L76K077L603M109K707L97j030q28R76M172P454Q566
58329B476378O836M261K968L062M099O358Q905Q761M721J11j132L98J541K063
58315B529330M221P537Q351N278J580R24L393O676Q936R743J0028J1494J4336
58302B621827J6071J4858J2967J3621J5238J3307P987M763O350R095R616R854
58290B755554J2213J4345J3220J0979J1756J5013J6762J5887J4752J4569J4388
$$ plain form
58387 2456508 2461771 2466937 2468769 2465649 2460324 2457245 2457269 2456483 2450943 2441361 2431870 2425141 2420730 2418054 2418395
58372 2418395 2422432 2427490 2429532 2427580 2424442 2423247 2425070 2430129 2438904 2450455 2461031 2466548 2466729 2465626
58358 2465626 2467576 2473105 2478877 2481257 2479653 2476509 2474306 2473193 2471982 2470602 2469977 2469485 2466538 2459856
58344 2459856 2451788 2445993 2443799 2444175 2446252 2449855 2453964 2456671 2457068 2456038 2455210 2456186 2460358 2467812 2476378
58329 2476378 2483214 2487475 2490443 2493505 2497604 2503962 2512867 2521628 2526349 2526460 2525328 2525726 2527267 2529330
58315 2529330 2533551 2541088 2549439 2554717 2556297 2557221 2560614 2567290 2576226 2585969 2595997 2607491 2621827
58302 2621827 2637898 2652756 2665723 2679344 2694582 2707889 2715876 2720639 2726989 2736084 2745700 2755554
58290 2755554 2767767 2782112 2795332 2806311 2818067 2833080 2849842 2865729 2880481 2895050 2909438
58279B909438J4149J4840J5979J6396J6968J9130K1257K0369J7129J5075J4907
58268C095637J3855J1311J0583J3414J6743J7280J6039J5799J6714J7129J6893
58257C261397J7124J7894J8325J8278J8312J8774K0038K2484K5098K5710K4174
58246C487608K3713K6961L1821L3734L1538K8710K8778L1633L4910L7135L8437
58235C834978L9140L8864L7132L4603L3534L6108M1437M5012M2960L7177L4430
58224D255375L9173M8352N4794N5094N2505N2019N4599N7361N8183N8318O0414
58213D846187O5166P0439P3478P3799P3904P6598Q1529Q5529Q7088Q8995R4608
58202E717320J02493J07461J07092J04688J04965J09152J15541J22565J29326
$$ plain form
58279 2909438 2923587 2938427 2954406 2970802 2987770 3006900 3028157 3048526 3065655 3080730 3095637
58268 3095637 3109492 3120803 3131386 3144800 3161543 3178823 3194862 3210661 3227375 3244504 3261397
58257 3261397 3278521 3296415 3314740 3333018 3351330 3370104 3390142 3412626 3437724 3463434 3487608
58246 3487608 3511321 3538282 3570103 3603837 3635375 3664085 3692863 3724496 3759406 3796541 3834978
58235 3834978 3874118 3912982 3950114 3984717 4018251 4054359 4095796 4140808 4183768 4220945 4255375
58224 4255375 4294548 4342900 4397694 4452788 4505293 4557312 4611911 4669272 4727455 4785773 4846187
58213 4846187 4911353 4981792 5055270 5129069 5202973 5279571 5361100 5446629 5533717 5622712 5717320
58202 5717320 5819813 5927274 6034366 6139054 6244019 6353171 6468712 6591277 6720603
58193F720603J34737J38558J42613J49070J57694J66317J73766J81222J90904
58184H155484K04156K20258K36513K50649K64021K81212L05101L33550L62565
58175A0613509L91750M24842M65833N16758N79129O55610P50201Q68130J014959
58166A6280721J192846J395414J606656J806918J982781K133698K269992K404079
58158C1073105K543589K692819K858031L047235L263918L503174L753578L999553
58150E6735002M222413M405672M545173M655501M767864M923579N164154N514174
58142I4933532N964077O469433O968425P400283P717497P903835P997846Q098055
58134A53452983Q340112Q866953R802282J1209007J3040876J5143033J7313857
$$ plain form
58193 6720603 6855340 6993898 7136511 7285581 7443275 7609592 7783358 7964580 8155484
58184 8155484 8359640 8579898 8816411 9067060 9331081 9612293 9917394 10250944 10613509
58175 10613509 11005259 11430101 11895934 12412692 12991821 13647431 14397632 15265762 16280721
58166 16280721 17473567 18868981 20475637 22282555 24265336 26399034 28669026 31073105
58158 31073105 33616694 36309513 39167544 42214779 45478697 48981871 52735449 56735002
58150 56735002 60957415 65363087 69908260 74563761 79331625 84255204 89419358 94933532
58142 94933532 100897609 107367042 114335467 121735750 129453247 137357082 145354928 153452983
58134 153452983 161793095 170660048 180462330 191671337 204712213 219855246 237169103
58127B37169103J9337912K0919388K1613572K0929326J8594983J4758169R935961
58120C63258414M789240p5571m194965p286053r271639j0258596j0464189j0148059
58112C16348582r578153q991965q535441q233249q033113p880928p754311p645787
58104B49695635p540445p413279p235010o977108o621000o168914n644579n083171
58096A97012129m521929l996444l538269l171912k912695k763731k711193k724051
58088A70671905k762897k791847k785265k729500k623116k474513k296593k103775
58080A50104399j913180j743735j610939j525134j496139j533322j634111j773722
58072A36874117j911655k009682k043765k005206j900642j754036j603005j486266
$$ plain form
58127 237169103 256507015 277426403 299039975 319969301 338564284 353322453 363258414
58120 363258414 368047654 367972083 363777118 356491065 347219426 336960830 326496641 316348582
58112 316348582 306770429 297778464 289243023 281009774 272976661 265095733 257341422 249695635
58104 249695635 242155190 234741911 227506901 220529793 213908793 207739879 202095300 197012129
58096 197012129 192490200 188493756 184955487 181783575 178870880 176107149 173395956 170671905
58088 170671905 167909008 165117161 162331896 159602396 156979280 154504767 152208174 150104399
58080 150104399 148191219 146447484 144836545 143311411 141815272 140281950 138647839 136874117
58072 136874117 134962462 132952780 130909015 128903809 127003167 125249131 123646126 122159860
58064A22159860j430251j442644j512679j615440j719359j795197j823252j797359
58056A09023679j725809j628411j529800j452427j412113j414832j453998j511940
58048I6894349j567593j604887j615594j598360j558684j508805j463455j433629
58040H4543342j423780j432430j452447j471763j478193j466168j438658j402931
58032G2976972j365895j332958j308391j294488j290136j290409j287996j276534
58024F2530165j254445j225639j195969j169213j146572j128004j112330j097236
58016E3200757j081316j065596j051139j035835j015951r90922r64575r41133
58008D5054290r21516r03785q85703q66519q47550q31352q19251q09549p99167
$$ plain form
58064 122159860 120729609 119286965 117774286 116158846 114439487 112644290 110821038 109023679
58056 109023679 107297870 105669459 104139659 102687232 101275119 99860287 98406289 96894349
58048 96894349 95326756 93721869 92106275 90507915 88949231 87440426 85976971 84543342
58040 84543342 83119562 81687132 80234685 78762922 77284729 75818561 74379903 72976972
58032 72976972 71611077 70278119 68969728 67675240 66385104 65094695 63806699 62530165
58024 62530165 61275720 60050081 58854112 57684899 56538327 55410323 54297993 53200757
58016 53200757 52119441 51053845 50002706 48966871 47950920 46959998 45995423 45054290
58008 45054290 44132774 43228989 42343286 41476767 40629217 39797865 38978614 38169065 37369898
57999C7369898p86986p74419p62823p51856p40584p28948p17608p07149o97649
57990C0701876o88459o78560o67737o56896o46280o34170o18919o01805n86185
57981B4922865n73779n63311n52874n42002n31129n20483n09937m98951m86674
57972B0143725m73176m60384m50233m42022m33368m23865m15730m10103m04796
57963A6230048l96882l86095l74379l63216l52748l42772l33396l24984l18252
57954A3037324l13986l11996l10497l07041l00058k89925k79125k70873k66288
57945A0387535k62968k57542k49460k40723k32164k22500k11763k02957j98306
57936H309152j95618j90712j82471j73516j66527j61953j58853j55821j51124
$$ plain form
57999 37369898 36582912 35808493 35045670 34293814 33553230 32824282 32106674 31399525 30701876
57990 30701876 30013417 29334857 28667120 28010224 27363944 26729774 26110855 25509050 24922865
57981 24922865 24349086 23785775 23232901 22690899 22159770 21639287 21129350 20630399 20143725
57972 20143725 19670549 19210165 18759932 18317910 17884542 17460677 17044947 16634844 16230048
57963 16230048 15833166 15447071 15072692 14709476 14356728 14013956 13680560 13355576 13037324
57954 13037324 12723338 12411342 12100845 11793804 11493746 11203821 10924696 10653823 10387535
57945 10387535 10124567 9867025 9617565 9376842 9144678 8922178 8710415 8507458 8309152
57936 8309152 8113534 7922822 7740351 7566835 7400308 7238355 7079502 6923681 6772557
57927F772557j44108j36915j32921j32792j33581j32389j29258j25385j20383
57918E584825j13362j05799j00827r9356r8869r6776r3471r1000q9951q9138q7655
57907D518621q5712q3649q1641q0395q0548q0909p8853p3345o6581o1719n9864
57896C685405n9988o0782o1431o1300o0116n8208n5928n3441n1640n1911n3805
57885C056855n4239n0843m5201m0836l8793l7434l6006l5431l5407l3867l0524
57874B618274k8465l0242l4034l5471l2431k6675k1670j9895k1577k4707k6619
57863B316488k6187k4238k1949j9914j8863j9510k0939k0984j9251j8153j9648
57852B086852k2577k4789k6089k7022k6150k1517j4409q966p689r246j1106j2300
$$ plain form
57927 6772557 6628449 6491534 6358613 6225821 6092240 5959851 5830593 5705208 5584825
57918 5584825 5471463 5365664 5264837 5165481 5066612 4969836 4876365 4785365 4695414 4606276 4518621
57907 4518621 4432909 4349260 4267619 4187224 4106676 4025767 3946914 3873569 3806988 3745269 3685405
57896 3685405 3625417 3564635 3503204 3441904 3381788 3323580 3267652 3214211 3162571 3110660 3056855
57885 3056855 3002616 2951773 2906572 2865736 2826943 2789509 2753503 2718072 2682665 2648798 2618274
57874 2618274 2589809 2559567 2525533 2490062 2457631 2430956 2409286 2389391 2367814 2343107 2316488
57863 2316488 2290301 2266063 2244114 2224200 2205337 2185827 2164888 2143904 2124653 2106500 2086852
57852 2086852 2064275 2039486 2013397 1986375 1960225 1938708 1924299 1915333 1907644 1898398 1887292 1874992
57840A874992j2913j2631j1140r226q477r850j2750j5280j5684j3937j1747j0585
57828A730772j0192r569q698q402r049j0372j2066j3585j3876j2465j0391q971
57816A603136q271p810p899q730r091p888o216n741n620l764q92k38k739n584
57802A522653o594o832p282o219k621M11p67m662o059k739K316N528O433O128
57788A499694M739K116o43k179k550k822l460m079m383m498m573m748n424o940
57774A460250q711r110o802k535Q33P24k538o047p295o208m293l050l618o413
57760A395187r783j0436p122l034k138l712l285O03L939L008j60r66R50J619r11
57745A363759l804m029k894l697o662q759q104o106m855m408l776l082l197l930
$$ plain form
57840 1874992 1862079 1849448 1838308 1829082 1820605 1810755 1798005 1782725 1767041 1753104 1741357 1730772
57828 1730772 1720580 1711011 1702313 1693911 1684862 1674490 1662424 1648839 1634963 1622498 1612107 1603136
57816 1603136 1594865 1587055 1579156 1570426 1561335 1553447 1547231 1541490 1535870 1532106 1531214 1530976 1528237 1522653
57802 1522653 1516059 1509227 1501945 1495726 1493105 1493516 1492749 1488087 1482028 1479289 1481605 1487133 1493566 1499694
57788 1499694 1504433 1506549 1505906 1503727 1501177 1498355 1494895 1490816 1486433 1481935 1477362 1472614 1467190 1460250
57774 1460250 1451539 1442429 1435627 1433092 1433925 1434649 1432111 1426064 1418769 1412561 1408268 1405218 1401600 1395187
57760 1395187 1385404 1374968 1367846 1364812 1362674 1358962 1355677 1356280 1360219 1363227 1363067 1362101 1363051 1364670 1363759
57745 1363759 1359955 1355926 1353032 1349335 1342673 1333914 1325810 1319704 1314849 1310441 1306665 1303583 1300386 1296456
57731A296456m192l769l498l428k330L17K944L468J665q89k542k371j06L462O294
57716A291481O794N670M979N225M762K395p04k355j657N87K745L137J233j042
57702A323250m01L969Q557Q977M784n67l989n225n266m563l562l308m131m707
57688A313818l570r97J500K914L062J805p16l174l608j387J966M149L958J774
57674A321494j164l616m761m190j792J935N419O649N168L031K715L973M011J218
57660A340090k465l926k816j597j905k570j891n37p99l359o189p024o003n136
57646A293873n598o388n839l843k098k205l826m956l988j348J105K132K184K217
57632A261422K011O67j263j396J615N621O947M951K893L539N553N988N172O491
$$ plain form
57731 1296456 1292264 1288495 1284997 1281569 1279239 1279556 1282500 1285968 1287633 1286744 1284202 1281831 1281725 1285187 1291481
57716 1291481 1298275 1303945 1308924 1314149 1318911 1321306 1320602 1318247 1316590 1317177 1319922 1323059 1324292 1323250
57702 1323250 1322849 1326818 1335375 1344352 1349136 1348569 1344580 1339355 1334089 1329526 1325964 1322656 1318525 1313818
57688 1313818 1310248 1309251 1310751 1313665 1316727 1318532 1317816 1314642 1311034 1309647 1311613 1315762 1319720 1321494
57674 1321494 1320330 1316714 1311953 1307763 1305971 1307906 1313325 1319974 1325142 1328173 1330888 1334861 1338872 1340090
57660 1340090 1337625 1333699 1330883 1329286 1327381 1324811 1322920 1322383 1321584 1318225 1312036 1305012 1299009 1293873
57646 1293873 1288275 1281887 1276048 1272205 1270107 1267902 1264076 1259120 1255132 1253784 1254889 1257021 1259205 1261422
57632 1261422 1263433 1264100 1262837 1261441 1263056 1268677 1275624 1280575 1283468 1287007 1292560 1298548 1303720 1310211
57618A310211J1215J6121J7582J6027J4507J4251J3958J2929J2404J3396J5254
57607A467855J7174J9523K2720K5979K8203K9012K7887K3364J4624L448o607j3057
57595A660125j5866j6678j7497j9513k2085k3237k2035j9932j8648j7663j5443
57584A451528j2482j0767j0243q432m441j027r79l160m233l379k991m787p133
57571A377474p005l686K80J744K19j834k302k327m629r060j1850j0327o559m562
57557A315576n182o018n535m669m248l421j469O97J968K474K466J034k574o965
57543A284134r325q226m976k139j084j117j034j307l710q123j1031r234m673k923
57529A215232o304j0943j2129j0162q689r043r205p664n331l377j852j107k269
$$ plain form
57618 1310211 1321426 1337547 1355129 1371156 1385663 1399914 1413872 1426801 1439205 1452601 1467855
57607 1467855 1485029 1504552 1527272 1553251 1581454 1610466 1638353 1661717 1676341 1679789 1673182 1660125
57595 1660125 1644259 1627581 1610084 1590571 1568486 1545249 1523214 1503282 1484634 1466971 1451528
57584 1451528 1439046 1428279 1418036 1409604 1405163 1404136 1403157 1399997 1395764 1392385 1389394 1384607 1377474
57571 1377474 1370469 1366783 1367063 1368807 1369026 1367192 1364890 1362563 1357934 1348874 1337024 1326697 1320138 1315576
57557 1315576 1310394 1304376 1298841 1294172 1289924 1286503 1285034 1285731 1287699 1290173 1292639 1293673 1291099 1284134
57543 1284134 1274809 1266583 1261607 1259468 1258384 1257267 1256233 1254926 1251216 1243093 1232062 1222828 1218155 1215232
57529 1215232 1208928 1197985 1185856 1175694 1167005 1157962 1148757 1141093 1135762 1132385 1130533 1129426 1127157
57516A127157m988o506m707j118P56l54k307k542j040R5p16k949m886n513n100
57501A085282m251l202k326k526m224o394p435o813n214l643l155m639p315q175
57487A015970n064k16J809J50j121R89M084M330K131O02J05j567m008l566R30
57472A015558N493O218M429M031N642O243L867q0l150m478m637m318l584j926
57458A029308R01L683M247K114m20j180r30j402j654O37M643O522M985L481M888
57443A059823O848N044p07o601r938j0982j0246p263k665J175K815L142L141K073
57429A035659q08m246o363o991p090o607m720j933l05j067l042l872k332N82K473
57414I89338J444k129n709o880n546l568k531k525k757k402q80J513K988J578
$$ plain form
57516 1127157 1122169 1115663 1110956 1109838 1110594 1110240 1107933 1105391 1104351 1104446 1103730 1100781 1095895 1090382 1085282
57501 1085282 1081031 1077829 1075503 1072977 1068753 1062359 1054924 1048111 1042897 1039254 1036099 1031460 1024145 1015970
57487 1015970 1010906 1010690 1012499 1012649 1011528 1012517 1016601 1020931 1023062 1023664 1023769 1022202 1018194 1014628 1015558
57472 1015558 1021051 1027269 1031698 1035729 1041371 1047614 1051481 1051401 1048251 1043773 1039136 1034818 1031234 1029308
57458 1029308 1030209 1033892 1038139 1040253 1039833 1038653 1037723 1036321 1034667 1035304 1039947 1046469 1051454 1054935 1059823
57443 1059823 1066671 1071715 1071008 1064407 1054469 1043487 1033241 1025978 1023313 1024488 1027303 1030445 1033586 1035659
57429 1035659 1034851 1030605 1024242 1017251 1010161 1003554 998834 996901 996596 995529 992487 988615 986283 986865 989338
57414 989338 990782 988653 982944 976064 970518 966950 964419 961894 959137 956735 955855 957368 960356 961934
57400I61934k105m563l180K73J434j372n185o133l702m10J427J209p57l713o087
57385I29070o456n282m394m334l641j467P14J162K28q84k522n594q840r430o461
57370H71869j875K348N847Q185P739L827j333m421m176j978l5K59r13j880j107
57355H82356O69J123l82j837j873j938l390m463k811J90J005p38j833p19K59r76
57339H64642k798k545m51J265J750J714J395M73m77m92q3q36k955m623m188j833
57323H49958J151L651M845M237K538J799L435O030O195K367k773m759k328J121
57309H77467J651p64l040l362k730k314j488N21K691L366K406R75L7Q2J574M205
57293H81277O303O400N071L944L137J202k473o518r051r094o542k188J866L283
$$ plain form
57400 961934 959829 955266 952086 952359 953793 952421 947236 941103 937401 936991 938418 939627 938870 935157 929070
57385 929070 922614 917332 912938 908604 904963 903496 904210 905372 905600 904716 902194 896600 887760 878330 871869
57370 871869 869994 872342 878189 886374 894113 897940 896607 892186 888010 886032 885997 886256 885343 883463 882356
57355 882356 883025 884148 883766 881929 880056 878118 874728 870265 867454 867644 868649 867911 866078 865359 865618 864642
57339 864642 861844 859299 858848 860113 861863 863577 864972 865445 864968 864476 864393 863557 860602 855979 851791 849958
57323 849958 851109 854760 859605 863842 866380 868179 871614 877644 883839 886206 883433 878674 876346 877467
57309 877467 879118 878354 875314 871952 869222 866908 865420 865941 868632 871998 874404 875379 875416 875498 877072 881277
57293 881277 887580 893980 899051 902995 906132 907334 904861 898343 889292 880198 873656 871468 873334 876617
57279H76617J817m48j769k496l392l583j689J643M047M247L213K267J446L51o21
57264H81650r00q96j383k053j999j536k174m108n138l308K04K352K036J052J031
57249H64830J250M14q31p63O73J654J142L73J105L185M708M342K787J761J956
57234H88586K456K079P02j024k628l709l391j162J677K637P49k255m026m027l332
57219H73332l016l463m426m776l019Q47M612O071N452M596M319L799K231j69k615
57204H83775m165l939k126m11k92j368k418l443m830n099k030L543P450O853L451
57189H74951Q70L68N62J75p14j603k218k254j615j034j510k829l268j350K191
57174H60722M668M189J904P83J948L278K400o1j423m09J834L624M056K833M66
$$ plain form
57279 876617 878434 877986 876217 873721 870329 866746 865057 866700 870747 874994 878207 880474 881920 882271 881650
57264 881650 880750 879854 878471 876418 874419 872883 870709 866601 861463 858155 858359 860711 862747 863799 864830
57249 864830 866080 866494 865663 864900 865573 867227 868369 868742 869847 873032 877740 882082 884869 886630 888586
57234 888586 891042 893121 893823 892799 890171 886462 883071 881909 883586 886223 886972 884717 880691 876664 873332
57219 873332 870316 866853 862427 857651 854632 855479 860091 866162 871614 876210 880529 884328 886559 886390 883775
57204 883775 879610 875671 873545 873134 872842 871474 869056 865613 860783 855684 853654 857197 864647 871500 874951
57189 874951 875821 876189 876751 876926 876212 874609 872391 870137 868522 867488 865978 863149 859881 858531 860722
57174 860722 865390 869579 871483 872266 874214 877492 879892 879831 878408 877999 879833 883457 887513 890346 890812
57159H90812j493k058k531m751p928r221p615m924k777j117l21k070o641j1487
57145H25878j3962j3947j2813j1563j0871j0998j0744q644n927n535p331p730
57133G05813n728n283q860j2668j2336r987j0485j3238j3716j1909j2742j7482
57121E71379k0861j8853j4324j2296j3450j5392j7175j9275k1106k1756k2130
57110C74761k3855k6656k8730k9283k9297l0200l2822l7033m1446m4046G336c5488
57097g7888m3755m6735n0825n5420o0096o5056p0782p6924q2195q5701q8075r0994
57085h94446r5765j02103j08330j13322j18232j25058j33441j40925j47153j55161
57075b133936j66846j79749j90937k01639k14705k29309k41905k51252k58931
$$ plain form
57159 890812 889319 887261 884730 879979 872051 862830 855215 850291 847514 846397 846076 844006 837365 825878
57145 825878 811916 797969 785156 773593 762722 751724 740980 732336 726409 720874 713543 705813
57133 705813 700085 694802 685942 673274 660938 650951 640466 627228 613512 601603 588861 571379
57121 571379 550518 531665 517341 505045 491595 476203 459028 439753 418647 396891 374761
57110 374761 350906 324250 295520 266237 236940 206740 173918 136885 95439 51393 7336 -35488
57097 -77888 -121643 -168378 -219203 -274623 -334719 -399775 -470557 -547481 -629676 -715377 -803452 -894446
57085 -894446 -990211 -1092314 -1200644 -1313966 -1432198 -1557256 -1690697 -1831622 -1978775 -2133936
57075 -2133936 -2300782 -2480531 -2671468 -2873107 -3087812 -3317121 -3559026 -3810278 -4069209
57066d069209k66033k72642k78966k83253k81138k73245k73065l01771l75107
57057f674429m99590o78836r14036j195826j503258j815199k120130k417710k723346
57048b0542360l077652l540605m158854m926927n772916o578149p222447p641491
57040f3461401p873535q065461q426432r149572j0334890j1940897j3786557j5607958
57032a48646703j7134909j8135415j8419448j7847556j6379223j4138271j1443396
57025b62144921q762008o569454n157146m524377m468674m782860n309552n787524
57017c07506516n774084m910877l322169j625699m14594K81556R80712K224746
57009c20066925M122603O363794Q555163J0487395J2149932J3596519J4823899
$$ plain form
57066 -4069209 -4335242 -4607884 -4886850 -5170103 -5451241 -5724486 -5997551 -6299322 -6674429
57057 -6674429 -7174019 -7852855 -8766891 -9962717 -11465975 -13281174 -15401304 -17819014 -20542360
57048 -20542360 -23620012 -27160617 -31319471 -36246398 -42019314 -48597463 -55819910 -63461401
57040 -63461401 -71334936 -79400397 -87826829 -96976401 -107311291 -119252188 -133038745 -148646703
57032 -148646703 -165781612 -183917027 -202336475 -220184031 -236563254 -250701525 -262144921
57025 -262144921 -270906929 -277476383 -282633529 -287157906 -291626580 -296409440 -301718992 -307506516
57017 -307506516 -313280600 -318191477 -321513646 -323139345 -323553939 -323272383 -322291671 -320066925
57009 -320066925 -315944322 -309580528 -301025365 -290537970 -278388038 -264791519 -249967620
57002b49967620J5735615J6185900J6063071J5354331J4152382J2614597J0912661
56995a48949063R194362P560923O064820M729421L572817K614503J865197J316937
56987a12030083R43471P08011N72968N07913M92838N18553N90276P33700R93750
56978a05968603J420076K045403K865065L821296M798710N643832O212122O423355
56970g2738744O293348N920457N431144M916117M399544L864394L314851K828392
56962c5770497K560557K698123L381121M625333O281751Q059860A446880J0633435
56954A2080315J0964502J0618905R772325Q686488P609710O702692O021928N551200
56946G8008065N246511N067437M987325M986306N036408N090625N084773M954198
$$ plain form
57002 -249967620 -234232005 -218046105 -201983034 -186628703 -172476321 -159861724 -148949063
56995 -148949063 -139754701 -132193778 -126128958 -121399537 -117826720 -115212217 -113347020 -112030083
56987 -112030083 -111086612 -110378601 -109805633 -109297720 -108804882 -108286329 -107696053 -106962353 -105968603
56978 -105968603 -104548527 -102503124 -99638059 -95816763 -91018053 -85374221 -79162099 -72738744
56970 -72738744 -66445396 -60524939 -55093795 -50177678 -45778134 -41913740 -38598889 -35770497
56962 -35770497 -33209940 -30511817 -27130696 -22505363 -16223612 -8163752 1446880 12080315
56954 12080315 23044817 33663722 43436047 52122535 59732245 66434937 72456865 78008065
56946 78008065 83254576 88322013 93309338 98295644 103332052 108422677 113507450 118461648
56938A18461648M661269M221758L710732L236146K893519K731302K742109K871178
56930A45529661L031938L131664L106751K949404K706814K455137K266299K181347
56922A67359015K196562K267185K328231K321342K215039K014625J761177J516073
56914A83979249J333510J237307J217699J245281J287049J316461J319112J294632
56906A94230300J253224J209596J179150J175719J207542J272870J358749J442288
56898B04329438J492986J479491J381667J200188R55758O81471M16051J97555
56890B12134605N3453q721j953M7354J06397J41349J25155M5930r0876k66913
56880B12285780m55996o28460p58472q32252q49947q20489p57082o76940o00596
$$ plain form
56938 118461648 123122917 127344675 131055407 134291553 137185072 139916374 142658483 145529661
56930 145529661 148561599 151693263 154800014 157749418 160456232 162911369 165177668 167359015
56922 167359015 169555577 171822762 174150993 176472335 178687374 180701999 182463176 183979249
56914 183979249 185312759 186550066 187767765 189013046 190300095 191616556 192935668 194230300
56906 194230300 195483524 196693120 197872270 199047989 200255531 201528401 202887150 204329438
56898 204329438 205822424 207301915 208683582 209883770 210839528 211520999 211937050 212134605
56890 212134605 212188058 212179337 212177384 212224738 212331135 212472484 212597639 212643569 212552693 212285780
56880 212285780 211829784 211201324 210442852 209610600 208760653 207940164 207183082 206506142 205905546
56871B05905546n47297n29925n53238o14371p03790q07255r09185r96074j059027
56862A99185384j095180j106868j099243j079482j057943j046606j053230j078201
56854A90568631j118977j175489j247924j330801j413277j485484j542237j582061
56846A79672381j606851j622546j636032j649862j662073j670991j677447j682465
56838A66464114j686228j689688j694049j698237j699905j699278j698872j699360
56830A52898497j699371j699627j702906j708951j713961j716697j720646j727797
56822A39208541j734709j738077j740418j746248j755216j762974j766916j767472
56814A25196511j765246j760496j754646j749154j743180j734690j723252j709728
$$ plain form
56871 205905546 205358249 204828324 204275086 203660715 202956925 202149670 201240485 200244411 199185384
56862 199185384 198090204 196983336 195884093 194804611 193746668 192700062 191646832 190568631
56854 190568631 189449654 188274165 187026241 185695440 184282163 182796679 181254442 179672381
56846 179672381 178065530 176442984 174806952 173157090 171495017 169824026 168146579 166464114
56838 166464114 164777886 163088198 161394149 159695912 157996007 156296729 154597857 152898497
56830 152898497 151199126 149499499 147796593 146087642 144373681 142656984 140936338 139208541
56822 139208541 137473832 135735755 133995337 132249089 130493873 128730899 126963983 125196511
56814 125196511 123431265 121670769 119916123 118166969 116423789 114689099 112965847 111256119
56806A11256119j694311j677168j659933j644012j628059j609637j589045j569298
56798I8184656j552430j537802j523965j510632j498720j489553j483676j479657
56790H6108221j474781j467704j459405j450811j441233j430418j420197j411967
56782G4551705j403867j392651j377498j360138j342205j324235j306306j287901
56774F3756904j268108j247508j228530j212207j196179j177911j158154j138654
56766E4129653j118227j094250j066963j038978j011140r82134r51850r22059
56758D5944052q93753q66618q40921q17138p93977p69751p45673p24873p08345
56749C8783003o94980o85325o81197o81158o80480o77116o73879o72800o70798
$$ plain form
56806 111256119 109561808 107884640 106224707 104580695 102952636 101342999 99753954 98184656
56798 98184656 96632226 95094424 93570459 92059827 90561107 89071554 87587878 86108221
56790 86108221 84633440 83165736 81706331 80255520 78814287 77383869 75963672 74551705
56782 74551705 73147838 71755187 70377689 69017551 67675346 66351111 65044805 63756904
56774 63756904 62488796 61241288 60012758 58800551 57604372 56426461 55268307 54129653
56766 54129653 53011426 51917176 50850213 49811235 48800095 47817961 46866111 45944052
56758 45944052 45050299 44183681 43342760 42525622 41731645 40961894 40216221 39491348 38783003
56749 38783003 38088023 37402698 36721501 36040343 35359863 34682747 34008868 33336068 32665270
56740C2665270o63491o50578o34767o17544n98693n78423n57496n36365n16327
56731B7311586n00388m90891m86832m85040m83279m81037m78606m76832m76595
56722B2952086m76858m74268m66246m53658m39110m23778m07527l90862l74795
56713A9044984l59661l46041l36128l32023l32775l34854l35475l34012l30743
56704A6003272l26211l21794l18871l16877l13551l07447k99131k89708k79567
56695A3230115k68993k58734k49470k41461k34994k30151k25961k20998k15551
56686A1083802k12042k12234k14548k15247k12324k07336k03174k00582j97641
56677I208674j92665j86807j82930j81925j81183j77471j70787j64386j60883
$$ plain form
56740 32665270 32001779 31351201 30716434 30098890 29500197 28921774 28364278 27827913 27311586
56731 27311586 26811198 26320307 25833475 25348435 24865156 24384119 23905513 23428681 22952086
56722 22952086 22475228 22000960 21534714 21081056 20641946 20218168 19810641 19419779 19044984
56713 19044984 18685323 18339282 18003154 17671131 17338356 17003502 16668027 16334015 16003272
56704 16003272 15677061 15355267 15036396 14719519 14405968 14098521 13799390 13509682 13230115
56695 13230115 12961122 12702388 12452918 12211457 11976463 11746312 11520351 11299353 11083802
56686 11083802 10871760 10659526 10444978 10229731 10017407 9810071 9606897 9406315 9208674
56677 9208674 9016009 8829202 8646272 8464347 8283164 8105693 7934906 7770520 7609637
56668G609637j59398j57124j53168j49479j47668j46149j42110j36026j32038
56659F286477j32681j35026j34165j29395j24346j21455j19409j16619j13921
56650E159460j12186j10091j06644j03738j03296j03486j01182r7041r4484r3877
56640D133435r1753q6727q2344q2076q4417q5444q4013q1634p8980p5714p2831
56629C227502p1832p1613o9288o4794o1815o2797o5436o5869o3508o0728n9143
56618B510679n8502n8427n8675n7824n4201m8698m4660m4127m5751m7259m8127
56607A944428m8570m7603m4351m0462l8985m0696m3058m3176m0636l7348l5523
56596A484020l5959l7308l6946l3545k8861k6058k6244k7716k8433k7988k6925
$$ plain form
56668 7609637 7450239 7293115 7139947 6990468 6842800 6696651 6554541 6418515 6286477
56659 6286477 6153796 6018770 5884605 5755210 5630864 5509409 5390000 5273381 5159460
56650 5159460 5047274 4937183 4830539 4726801 4623505 4520019 4418837 4321796 4227312 4133435
56640 4133435 4041682 3954955 3872611 3790535 3706118 3620674 3536661 3455027 3376047 3300333 3227502
56629 3227502 3155670 3084057 3014769 2949975 2888160 2825363 2759927 2694058 2630550 2569822 2510679
56618 2510679 2452177 2393750 2335075 2277251 2223050 2174352 2129692 2085565 2039814 1992555 1944428
56607 1944428 1895858 1848255 1803904 1763442 1724457 1683761 1640703 1597527 1556891 1519543 1484020
56596 1484020 1448061 1410753 1373807 1340262 1311401 1285343 1259099 1231383 1202950 1174962 1148037
56585A148037k5686k4979k5823k8163l0201k9991k7373k3833k1067k0070k0764
56574H70087k1846k1694k0122j8748j9020k0342k0758j9122j6185j3921j3929
56563F64400j5909j7511j6531j3431j0791j0153j0622j1021j1640j2767j3079
56552E20945j1190p980n730n487o637q406j0169j0766r486p632p377q850j0108
56539D11127j0204j0356j1267j1243q760n575m975p063q031n119n31J402K05j84
56525C29426K657N672M339r84n596o835o602o835n911j751L707O218M470J159
56511C23134p89j065j129k264m394n659l708J117M931M709K690L633Q079J1490
56497C40775J0709P862O397O230N258L490K667K903K555J402J380L470N738N548
$$ plain form
56585 1148037 1122351 1097372 1071549 1043386 1013185 983194 955821 931988 910921 890851 870087
56574 870087 848241 826547 806425 787677 768657 748315 727557 708435 692250 678329 664400
56563 664400 648491 630980 614449 601018 590227 580074 569452 558431 546791 534024 520945
56552 520945 509755 501775 496045 490558 483921 475515 465346 454580 445094 437462 430085 421235 411127
56539 411127 400923 390567 379300 368057 359297 353722 348747 341684 333653 328534 328003 329405 329610 329426
56525 329426 332083 337755 342094 341110 335514 328679 322077 315242 309331 307580 311287 317505 321975 323134
56511 323134 322345 321280 320151 317887 313493 307834 304126 305243 310174 314883 317573 321206 329285 340775
56497 340775 351484 359346 365743 371973 377231 380721 383388 386291 388846 390248 391628 395098 400836 406384
56483D06384K714m61j872j503p39m03k3R47J827J396j94j122k1K274L770L630
56467D16604K654J596L9k506n003n509l714j934k485m388m275r42K637K913J24
56452C95811k603l532l723m564o037p664r215r906q676o001l888l236k768j488
56438C22510o11j698m060n558n163l453j357L14P45N8q8J730M505N681M088Q16
56422C18459k582n276o392m822q31L099M258K416j26j196p83k50k31m7P56J269
56406C07721K80j973l829l941k390l01J015P58o65j661j044N58J666J990K268
56391C00452K355J176j204l060l082j623M16K442L655L595L539N025O345L602
56377C23633l104p742n594N6K216m40k621n29L342M492K146q81j996r51N31N65
$$ plain form
56483 406384 409098 408637 406765 405262 404523 404120 404097 405044 406871 408267 408073 406951 406930 409204 412974 416604
56467 416604 419258 420854 420893 418387 413384 407875 404161 402227 399742 395354 391079 390137 392774 395687 395811
56452 395811 393208 389676 385953 381389 375352 367688 358473 348567 339891 333890 330002 326766 323998 322510
56438 322510 321899 320201 316141 310583 305420 301967 300610 300924 301669 301727 301639 303369 307874 313555 317643 318459
56422 318459 315877 310601 304209 299387 298556 301655 305913 308329 308203 307007 306224 305974 305743 305696 306452 307721
56406 307721 308001 306028 302199 298258 295868 295567 296582 297340 296675 295014 293970 294528 296194 298184 300452
56391 300452 302807 303983 302779 299719 296637 295014 295430 297872 301527 305122 308661 313686 320031 323633
56377 323633 320529 312787 307193 307249 309465 309025 306404 305875 309217 313709 315855 314974 312978 312027 312558 313123
56361C13123o92p62J840M759M543J775M37K049L880L979M271O523Q338O366J608
56346C62037j796k179j880l274n642o464m465j027R38p8k024j292K552N691M923
56331C46020J761j98j82N2nO70J608Q28j777l707l258j284R99L566N938O369M199
56314C61599J349R2O38J944L349M175L385J215j87N77J965J695K8r42k80J458
56298C82060L915O537P177M004j064l575j976P03J536J418K597M847O468P204
56284D21851P545O542L448P30J883N940P703M677N63k08J418J501l63o55K386
56269D64961O184P465N728K373r91k355q6M296O299L614n23j376J289L874M496
56254E05248M677N565N840M413K630K278L267M539N729O447N608L244J877L941
$$ plain form
56361 313123 312431 311669 313509 318268 322811 324586 325023 327072 330952 334931 339202 345725 354063 360429 362037
56346 362037 360241 358062 356182 352908 347266 340802 336337 335310 336248 336170 334146 332854 335406 341097 346020
56331 346020 347781 347583 347401 347453 347448 348118 349726 350554 348777 345070 341812 340528 341527 345093 351031 357400 361599
56314 361599 362948 363040 363678 365622 368971 373146 376531 377746 377559 378136 380101 381796 381824 380882 380602 382060
56298 382060 385975 392512 399689 403693 402629 399054 397078 397781 399317 400735 403332 408179 414647 421851
56284 421851 429396 435938 439386 440116 441999 447939 455642 460319 460882 460674 462092 463593 463230 462575 464961
56269 464961 471145 478610 484338 486711 485720 483365 483279 487575 493874 497488 496965 495589 496878 500752 505248
56254 505248 509925 515490 521330 525743 528373 530651 533918 538457 544186 550633 556241 559485 561362 565303
56240E65303Q311J1301J1155R929J0390J2254J2486R215M650L340O999J1923J2904
56227F90160R461O070N937P302P374P220R855J5062J9620K2053K3749K5273K5102
56214H74238K3115K2477K5997L2205L6746L6725L2889K8741K8265L3029M0519
56203A214946M6165M7663M6275M4214M2896M3975M8918N6076O0928O1585O1774
56192A775415O5855P2857P8343Q0593Q1648Q3313Q5569Q8414R1780R3730R2298
56181B689815Q9537R0107R4582R7392R3378Q3938P4728O9211O6361O3075N6769
56170C568893M6769L5051K4680J6136O543n547j6301k0670j9873k1249k9328l9825
56158C545279m4917m2846l9394m0008m3690m5991m5417m3981m2760m0590l7509
$$ plain form
56240 565303 573614 584915 596070 605999 616389 628643 641129 650344 654994 658334 665333 677256 690160
56227 690160 699621 705691 711628 718930 726304 733524 743379 758441 778061 800114 823863 849136 874238
56214 874238 897353 919830 945827 978032 1014778 1051503 1084392 1113133 1141398 1174427 1214946
56203 1214946 1261111 1308774 1355049 1399263 1442159 1486134 1535052 1591128 1652056 1713641 1775415
56192 1775415 1841270 1914127 1992470 2073063 2154711 2238024 2323593 2412007 2503787 2597517 2689815
56181 2689815 2779352 2869459 2964041 3061433 3154811 3238749 3313477 3382688 3449049 3512124 3568893
56170 3568893 3615662 3650713 3675393 3691529 3698072 3692525 3676224 3655554 3635681 3614432 3585104 3545279
56158 3545279 3500362 3457516 3418122 3378114 3334424 3288433 3243016 3199035 3156275 3115685 3078176
56147C078176l5957l6839l7426l5569l3494l4115l5589l3684k8774k5929k7522
56136B713278k9950k9201k5903k2690j9747j5969j2430j1390j2606j3256j1501
56125B508635q680p814j0698j5953j9690j9090j5527j2821j2334j1930j0070p983
56113B356045o677m796j589P05m8k546m223m580l765n12M951Q289N877R33O3M353
56097B352480Q728J0251J1658J5321J8767J9206J8661K1060K6448L1391L3701
56086B567672L4145L4318L5347L8159M2996M8648N3438N6944O0012O3533O7971
56075C103183P3229P8172Q0873Q0314P7419P3841P0302O6698O2899N8650N3418
56064C878998M7363M1994L8827L7567L6207L2816K6885J9290J1547M888n40n715
$$ plain form
56147 3078176 3042219 3005380 2967954 2932385 2898891 2864776 2829187 2795503 2766729 2740800 2713278
56136 2713278 2683328 2654127 2628224 2605534 2585787 2569818 2557388 2545998 2533392 2520136 2508635
56125 2508635 2499955 2492141 2481443 2465490 2445800 2426710 2411183 2398362 2386028 2374098 2364028 2356045
56113 2356045 2349368 2344572 2342983 2343688 2343640 2341094 2336871 2332291 2328526 2328014 2332965 2341254 2347131 2348064 2348127 2352480
56097 2352480 2361208 2371459 2383117 2398438 2417205 2436411 2455072 2476132 2502580 2533971 2567672
56086 2567672 2601817 2636135 2671482 2709641 2752637 2801285 2854723 2911667 2971679 3035212 3103183
56075 3103183 3176412 3254584 3335457 3415771 3493190 3567031 3637333 3704031 3766930 3825580 3878998
56064 3878998 3926361 3968355 4007182 4044749 4080956 4113772 4140657 4159947 4171494 4176382 4175842 4170127
56052D170127j1824j9168k6858l3526l8525m2409m5897m8563m9151m7353m4174
56041C762679m0453l6354l2838l1720l2926l3442l1067k7699k6558k7321k6835
56030C415466k3968k0595j7885j4946j1719j0060j0612j1108r346o050l348j959
56018C273870j048L90K952O343Q980R395Q285P612P668P268P005R289J4104J7740
56004C379853J7524J5379J4591J5305J5496J4625J3813J3683J4244J5901J8484
55993C548898K0279K0103J9511K0811K3516K4866K3649K1619K1055K2374K4329
55982C791010K5600K6069K6927K9315L2779L5984L8998M3267M8654N2397N2388
55971D203388N0183M9170N0693N3473N6085N8539O1614O5580O9661P2784P5272
$$ plain form
56052 4170127 4158303 4139135 4112277 4078751 4040226 3997817 3951920 3903357 3854206 3806853 3762679
56041 3762679 3722226 3685872 3653034 3621314 3588388 3554946 3523879 3496180 3469622 3442301 3415466
56030 3415466 3391498 3370903 3353018 3338072 3326353 3316293 3305681 3294573 3285227 3279177 3275829 3273870
56018 3273870 3272822 3273212 3276164 3282507 3291487 3300882 3309167 3316779 3324447 3331715 3338720 3348009 3362113 3379853
56004 3379853 3397377 3412756 3427347 3442652 3458148 3472773 3486586 3500269 3514513 3530414 3548898
55993 3548898 3569177 3589280 3608791 3629602 3653118 3677984 3701633 3723252 3744307 3766681 3791010
55982 3791010 3816610 3842679 3869606 3898921 3931700 3967684 4006682 4049949 4098603 4151000 4203388
55971 4203388 4253571 4302741 4353434 4406907 4462992 4521531 4583145 4648725 4718386 4791170 4866442
55960D866442P9078Q4941R0256R2233R2720R6466J04184J11210J14419J16622
55950E848571J21825J29716J37920J46735J57991J71173J84250J96935K10118
55941G305234K23425K36373K50724K68780K90294L13761L39720L70305M06639
55932A0005255M49249N00034N61620O36266P27908Q43538R88756J161777J353403
55923A7227806J551927J746974J931433K103101K263518K413225K549784K672177
55915C4459945K784180K890832K994566L097985L207284L328858L464693L614125
55907E9842468L776899L950949M130671M311639M493911M677312M858491N037708
55899I5080048N224731N434528N684458O001218O422102O981075P701191Q606776
$$ plain form
55960 4866442 4945520 5030461 5120717 5212950 5305670 5402136 5506320 5617530 5731949 5848571
55950 5848571 5970396 6100112 6238032 6384767 6542758 6713931 6898181 7095116 7305234
55941 7305234 7528659 7765032 8015756 8284536 8574830 8888591 9228311 9598616 10005255
55932 10005255 10454504 10954538 11516158 12152424 12880332 13723870 14712626 15874403 17227806
55923 17227806 18779733 20526707 22458140 24561241 26824759 29237984 31787768 34459945
55915 34459945 37244125 40134957 43129523 46227508 49434792 52763650 56228343 59842468
55907 59842468 63619367 67570316 71700987 76012626 80506537 85183849 90042340 95080048
55899 95080048 100304779 105739307 111423765 117424983 123847085 130828160 138529351 147136127
55891A47136127R728595J1084636J2672829J4496118J6549218J8698848K0547747
55884B50914118K1473269K0883230J8498910J4463335R271214L634702j672170
55877C37466608o007886r036694j0762799j1412385j1285054j0674786r842317
55870B68444687q986983q225267p604076p132232o797851o575123o437710o368317
55862B10317128o348663o345604o316712o226086o047632n759664n349749m826262
55854A63096756m217850l561140k893971k257021j690957j226326q78009o49020
55846A45722462n35624n28605o13926p74489r90880j242171j509036j776019k029172
55837A35722540k253320k434789k566238k646291k674578k648669k564682k419281
$$ plain form
55891 147136127 156864722 167949358 180622187 195118305 211667523 230366371 250914118
55884 250914118 272387387 293270617 311769527 326232862 335504076 339138778 337466608
55877 337466608 331458722 322422028 311659229 300246844 288961790 278287004 268444687
55870 268444687 259457704 251232437 243628361 236496129 229698278 223123155 216685445 210317128
55862 210317128 203968465 197622861 191306149 185080063 179032431 173272767 167923018 163096756
55854 163096756 158878906 155317766 152423795 150166774 148475817 147249491 146371482 145722462
55846 145722462 145186838 144658233 144044307 143269818 142278938 141036767 139527731 137751712 135722540
55837 135722540 133469220 131034431 128468193 125821902 123147324 120498655 117933973 115514692
55829A15514692k213167j955813j666763j370561j090400q45693o50799n11642
55821A05209854m24779l83050l81552m16452m80576n64126o59073p60120q62979
55812A00277147r65442j069348j177386j287471j392958j488221j571019j639628
55804H9685674j691383j724892j740975j740697j724893j696205j658815j615216
55796G6092598j565350j509502j449630j387179j322478j257675j197772j146753
55788F5256259j104501j069297j041500j022434j010933j003588r98269r95297
55780E7010440r95273r97686j002058j008564j016410j022806j025138j023772
55772D8918733j021225j018233j012162j000346r83912r66348r48705r28418r03598
$$ plain form
55829 115514692 113301525 111345712 109678949 108308388 107217988 106372295 105721496 105209854
55821 105209854 104785075 104402025 104020473 103604021 103123445 102559319 101900246 101140126 100277147
55812 100277147 99311705 98242357 97064971 95777500 94384542 92896321 91325302 89685674
55804 89685674 87994291 86269399 84528424 82787727 81062834 79366629 77707814 76092598
55796 76092598 74527248 73017746 71568116 70180937 68858459 67600784 66403012 65256259
55788 65256259 64151758 63082461 62040961 61018527 60007594 59004006 58005737 57010440
55780 57010440 56015167 55017481 54015423 53006859 51990449 50967643 49942505 48918733
55772 48918733 47897508 46879275 45867113 44866767 43882855 42916507 41967802 41039384 40135786
55763D0135786q76286q50081q26211q03921p83302p65244p49156p33448p18287
55754C3029850p05485o95151o84864o72981o60648o49312o38313o26478o14421
55745B7082197o03347n92988n82887n74469n69017n63939n54152n38267n21111
55736B1982020n08600n01489m95561m86845m74965m62055m50263m40306m31201
55727A7730735m21120m09417l97804l88637l82083l76062l68974l61123l53313
55718A4272202l45564l37974l31372l25911l20167l12953l05300k99230k95128
55709A1398603k91599k87493k82599k76636k69143k60492k51834k43872k36662
55700H998273k30350k24886k19106k11556k02402j93479j86407j81756j79443
$$ plain form
55763 40135786 39259500 38409419 37583208 36779287 35995985 35230741 34481585 33748137 33029850
55754 33029850 32324365 31629214 30944350 30271369 29610721 28961409 28323096 27696618 27082197
55745 27082197 26478850 25885862 25302975 24728506 24159489 23595550 23041398 22503131 21982020
55736 21982020 21473420 20971931 20476370 19989525 19514560 19052505 18602242 18161936 17730735
55727 17730735 17309615 16900198 16502394 16113757 15731674 15355612 14986638 14625515 14272202
55718 14272202 13926638 13588664 13257292 12931381 12611214 12298261 11992961 11693731 11398603
55709 11398603 11107004 10819511 10536912 10260276 9991133 9730641 9478807 9234935 8998273
55700 8998273 8767923 8543037 8323931 8112375 7909973 7716494 7530087 7348331 7168888
55691G168888j78208j75061j67817j58511j51789j48945j46157j40176j33166
55682E769058j29406j29012j28139j24691j20701j18570j17504j14869j09757
55673D676409j04078j00658j00632j02203j01874r7620r1073q6071q4834q6049
55663C721317q6689q5098q1985p8958p6693p4723p2502p0097o7675o5050o2332
55652B899515o0402n9707n8980n6399n1932m7434m4515m3685m5218m8911n2776
55641B329556n4215n3207n2127n1660m9511m4673m0232l9214l9921l8615l5410
55630A830771l3785l4646l4727l1654k7505k5821k7174k9206k9752k8599k6994
55619A500908k6301k6761k7316k7093k6623k6594k6001k3269j9173j6649j7212
$$ plain form
55691 7168888 6990680 6815619 6647802 6489291 6337502 6188557 6042400 5902224 5769058
55682 5769058 5639652 5510640 5382501 5257810 5137109 5018539 4901035 4786166 4676409
55673 4676409 4572331 4471673 4371041 4268838 4166964 4069344 3978271 3892200 3807366 3721317
55663 3721317 3634628 3549530 3467545 3388587 3311894 3237171 3164669 3094572 3026897 2961847 2899515
55652 2899515 2839113 2779406 2720426 2664027 2612095 2564661 2520146 2476461 2431243 2382332 2329556
55641 2329556 2275341 2222134 2170007 2118347 2068836 2024163 1983931 1944717 1904796 1866181 1830771
55630 1830771 1796986 1762340 1727613 1695959 1668454 1642633 1615459 1586253 1556501 1527902 1500908
55619 1500908 1474607 1447846 1420530 1393437 1366814 1340220 1314219 1290950 1271777 1255128 1237916
55608A237916j9172k0000j9091j7453j5994j4974j4084j2478r691p130p335j0872
55596A069642j4938j6162j4135j1347j0112j0483j0906j0209q797q096q916j0600
55584I34941j2036j3021j4034j5070j5557j5154j3920j2200j1167j2437j5780
55573G84565j8157j7119j4320j3139j3314j1443p071m316n690q102p849o533p966
55560F49546j1143j1140o820l112m379r003j2648j3937j4111j2966q867k810Q12
55547E39422p58m762o150l872j655k468m736n312m166l788n102o638p491q361
55533D74163r153q240n296k668k338l332l735l539l625l565k748k422m030o300
55519D13172o646n045l877m136m556m817o428r244r792n211K583Q433Q915M568
$$ plain form
55608 1237916 1218744 1198744 1179653 1162200 1146206 1131232 1117148 1104670 1094979 1087849 1080514 1069642
55596 1069642 1054704 1038542 1024407 1013060 1002948 992465 981559 971350 962553 954457 945541 934941
55584 934941 922905 909884 895850 880780 865223 850069 836149 823949 812782 800345 784565
55573 784565 766408 749289 734969 721830 708516 697073 690002 685686 679996 671894 664045 657512 649546
55560 649546 638403 627263 620443 617331 612952 603949 591301 577364 563253 550287 541420 538610 539422
55547 539422 538664 533902 527752 523880 522225 519757 515021 509709 505543 501755 496653 490015 482524 474163
55533 474163 465010 456770 451474 448806 446468 443136 439401 435862 432237 428672 425924 423502 419472 413172
55519 413172 406526 401481 397604 393468 388912 384095 377667 368423 358631 353420 356003 364436 373351 377919
55505C77919j684o878r253q532n365o73L771M855N57o485j0215p721k722n83j694
55490C25297k581k120k716n227o709m821j440M15J009K429M156L407k29l367k998
55475C04505r5K149K262J244L54l11j019j493j393j145j680l162m367l815j651
55460B90383J41o0j524k220j561r90j646k795l214l090l341l758l079q88J726
55445B64084L402L518J842j699o301j0001j0898q649m550l72K625L852L291J514
55431B41658m21j625k156k765l669l933k669n23R76J388J489J385M3k612m796
55416B21770n203m793m640l510LL810L876l64m787n585l129R0K877N042N700M129
55400B15286J262j456l817n808o062l528NJ453M33n09J05O84o94l405n384n724
$$ plain form
55505 377919 376235 369357 360104 351572 346207 345534 349305 354160 354717 348232 338017 330296 327574 326991 325297
55490 325297 322716 320596 317880 312653 305944 301123 299683 300098 301107 303536 307692 311099 310870 307503 304505
55475 304505 304410 306559 308821 310065 310419 310108 309089 307596 306203 305058 303378 300216 295849 292034 290383
55460 290383 290524 290464 288940 286720 285159 284169 282523 279728 276514 273424 270083 266325 263246 262358 264084
55445 264084 267486 271004 272846 271147 264846 254845 243947 235298 230748 230376 233001 236853 240144 241658
55431 241658 241237 239612 237456 234691 231022 227089 224420 223897 224873 226261 227750 229135 229178 226566 221770
55416 221770 216567 211774 207134 203624 203627 207437 211313 210949 206162 200577 197448 197538 200415 205457 211157 215286
55400 215286 216548 215092 211275 205467 199405 195877 195882 197335 197768 197259 197364 198048 197354 193949 188565 182841
55384A82841n029m004k862j597m8J886L480L424J688L63J384L710M215J617j769
55369A89299k750q23J861L386L803M063M326L860K215j8j491j208L51J260p4k892
55353B05168m470k957O94L980N243M312J762j149k498j355N13J21l005n840n272
55338A95247j640J786K171m87l743n036m050k766k748k975j639M72N85j759l482
55323A69936k191N52J882J635J544J965J918J608K302L862M693M127K910J381
55309A98124p38k566k348p7K069K539J878P96j162l908n622n008l481l452n018
55294A72026n963m632j555J587L345K823j37m273o896n655r59L625M493J872l64
55279A59337N69L003L519J808N68J087J526J23k374m390n451n252k845J504N204
$$ plain form
55384 182841 177812 173808 170946 169349 169301 171187 174667 178091 179779 180142 181526 185236 189451 191068 189299
55369 189299 186549 185726 187587 190973 194776 198839 203165 207025 209240 209222 207731 206523 206874 208134 208060 205168
55353 205168 200698 197741 198435 202415 207658 211970 213732 212583 210085 208730 209243 209364 206359 200519 195247
55338 195247 193607 195393 197564 197077 193334 188298 184248 181482 178734 175759 174120 174592 175177 173418 169936
55323 169936 167745 168297 170179 171814 173358 175323 177241 178849 181151 185013 189706 193833 196743 198124
55309 198124 197386 194820 192472 192395 194464 197003 198881 199677 198515 194607 188985 183977 180496 177044 172026
55294 172026 166063 161431 159876 161463 164808 167631 167494 163221 156325 150670 149711 153336 157829 159701 159337
55279 159337 159906 162909 166428 168236 168804 169891 171417 171540 169166 164776 159325 154073 151228 152732 157936
55264A57936N869L997J757K99l82k42M39N73j99n65J75L99j129k327m72L114M445
55247A73687K693J103J702K680K232J540J889J805k40k504k443r95j207l307m401
55232A74234l193j848k180k497j41M286P099N640R77l490n273m503l001k063j366
55217A62681L9K130L719L738K224Q7j539j761m06J601K713K085L09j294j988k055
55201A72283k031j924j508j277k276m337n234k980J057L166K179J350L690P113
55187A69271O992K734j492k870l287n139o902n565j468K359M526N947O694N385
55173A77185K102p67j611j349j227p58R19L277N139N865M809J237l789o857n412
55158A78763p76L337M539K959Pk358k292j41P80k307p623j0554r108n503k142
$$ plain form
55264 157936 163805 167802 169559 169858 169476 169234 169673 170246 170047 169482 169657 170056 168927 166600 166128 169242 173687
55247 173687 176380 177483 179185 181865 184097 185637 187526 189331 189091 186587 184144 183149 181942 178635 174234
55232 174234 171041 169193 167013 164516 164375 168661 175760 181400 182377 178887 173614 169111 166110 164047 162681
55217 162681 162720 164850 168569 172307 174531 174618 173079 171318 170912 172513 175226 177311 177620 176326 174338 172283
55201 172283 170252 168328 166820 165543 163267 158930 153696 150716 151773 154939 157118 158468 162158 169271
55187 169271 176263 178997 177505 174635 171348 166209 159307 153742 152274 154633 159159 165106 171800 177185
55173 177185 179287 178520 176909 175560 174333 173575 174494 177771 182910 188775 193584 194821 191032 184175 178763
55158 178763 177987 181324 185863 188822 188829 186471 184179 184038 184818 182511 174888 164334 155226 149723 147581
55143A47581J177N089Q122Q223N643K698J205J074R72l03k569m088l413j402k17
55128A69792k98kJ333K126J376P19J841L466L003K25k660l949l498j453J811M601
55112A78433M850K637K91l51M20J335J652J296O78N23R37Q75l21j241L2K823M248
55095A99117K980Q20p1J98K35o14k096l666m420l581j805q12j092j346p45r1J93
55078A83204J230L304M253K304q73k310j930k009l044l025j139N91M20m41J84
55063A80719K095L098K278J366K410M880O034M317J405j46o36k585o161p759m730
55048A86585N74L818M226M406N670O776P050P378P527N675J751j384j652m29p4
55033B37897p11j118j103j230j438j241k99K012N884R142Q341L320j653l196k902
$$ plain form
55143 147581 148758 153847 161969 170192 175835 178533 179738 180812 181784 181481 178912 174824 171411 170009 169792
55128 169792 169494 169492 170825 172951 174327 175046 176887 180353 183356 183581 180921 176972 173474 172021 173832 178433
55112 178433 183283 185920 186211 185860 186280 187615 189267 190563 191241 191764 192701 193576 193255 192014 192046 194869 199117
55095 199117 202097 202917 202846 203044 203279 202665 200569 196903 192483 188902 187097 186285 185193 183847 183102 183011 183204
55078 183204 184434 187738 191991 194295 193422 191112 189182 187173 184129 181104 179965 180556 180976 180535 180719
55063 180719 182814 185912 188190 189556 191966 196846 202880 207197 208602 208456 207820 205235 199074 191315 186585
55048 186585 187159 190977 195203 199609 205279 212055 219105 226483 234010 239685 241436 240052 238400 237971 237897
55033 237897 237186 236068 234965 233735 232297 231056 230757 232769 238653 247795 256136 259456 257803 254607 251705
55018B51705l832n305m485j384J374K784L831M153K110j676m373m993n254n789
55004B28866m753j375J970K728J136q94j810o46K507N340N030K041q6L16J112
54989B41482N20N9J344K707J675j266l848n165n388m129j570L48K01q16j039o94
54973B24421q9K030N400O201K017l264l990q27O37j523l666l335k479k775k813
54958B15945j812j501k067n88L659O484M857K101K848N604N184R08k463j686J258
54943B38731L015K852J732R6j920l511l623j773J619M925N867L743Q44K13K050
54928B54860L844L915L206L109L148J859q59l335l973k811r43J075L315M754L007
54913B74171k533q200r145n141p16J014J717L724N723N208K808J010J95p98j336
$$ plain form
55018 251705 247873 242568 238083 236699 238073 240857 244688 248841 250951 249275 244902 239909 234655 228866
55004 228866 224113 222738 224708 227436 228572 227678 225868 225222 227729 233069 238099 240140 240054 240370 241482
54989 241482 242002 242061 243405 246112 247787 246521 242673 237508 232120 227991 226421 226769 226970 226154 225115 224421
54973 224421 224332 226362 231762 237963 239980 236716 232726 231899 232536 231013 227347 224012 221533 218758 215945
54958 215945 214133 212632 210565 209977 213636 220120 224977 227078 229926 235530 240714 241622 239159 237473 238731
54943 238731 241746 244598 246330 246426 244506 240995 237372 235599 237218 242143 248010 251753 252597 252810 254860
54928 254860 258704 262619 265825 268934 272082 273941 273082 269747 265774 262963 262020 263095 266410 271164 274171
54913 274171 271638 263438 254293 249152 248436 249450 251167 254891 260614 265822 268630 269640 269835 269037 267701
54898B67701J52K623L209J610M45Q77J161J94m76N40K244L091K898J819m65l215
54882B84408m112j832K201N501O635N075R75l762n895l781J069N940R106R816
54868C11344Q088N318L149J277j445l366q69N663J0267Q480L067k96m54j59k35
54853C49829J182M297O767P179O171M089J002j197l10J975J354k652n381l844
54839C70461j286k134n294n923k412J686K339p60m677o101l657J237N556P267
54825C56302O599M605J761j091j908N15M311O218N281L455K622K759L264M305
54811C98998O009P324O940M890K497Q85J7r14k545m730o435o391m276j588q27
54796C99854l074o292o871l514J015K810J054j671l066l453m040m388k896P42
$$ plain form
54898 267701 267853 270476 273685 275295 275740 276617 277778 277972 277496 278036 280280 283371 286269 288088 287623 284408
54882 284408 280296 278464 280665 286166 292801 297876 298851 295089 289194 285413 286482 292422 301528 311344
54868 311344 319432 324750 327899 329176 327731 324365 323496 329159 339426 347906 350973 350677 350223 350064 349829
54853 349829 351011 355308 362075 369254 375425 379514 380516 379319 379009 380984 382338 379686 374305 370461
54839 370461 369175 367041 361747 355824 353412 355098 357437 356677 352000 345899 342242 343479 349035 356302
54825 356302 362901 367506 369267 368176 366268 366783 371094 377312 382593 386048 388670 391429 394693 398998
54811 398998 405007 412331 419271 424161 426658 427543 427560 426646 424101 419371 412936 406545 402269 400681 399854
54796 399854 396780 390488 383617 380103 381118 383928 384982 383311 380245 376792 372752 368364 365468 366210
54782C66210M697O496M907P46l652o072o186n580n704o158n434k947J02J602K06
54767C43233l201n564m270l29K191Q50k187l138j501J04K54K55R87P54j956n168
54751C21314n085q71L900N158K762K42M51K501L413K132N54M57Q86j21k217k846
54735C32630o36K906N262N178K834q00l992m963l621j825j055n89J000L328M413
54720C40070L194Q76l57N50K508L210J521p61n42K697N857O146M781M934O889
54705C81573P742N905L271K075J989J848K274M261O315N706K429l94o26K53m30
54690D24191k903n013n033l353j778j884l635m954l471N69L950M078K068P33M40
54675D04005p29k936l515r42K610M258M033L681L590L303L632N350O594M652L59
$$ plain form
54782 366210 370907 377403 382310 383056 379404 373332 367146 361566 355862 349704 344270 341323 341425 343027 343233
54767 343233 340032 334468 330198 329869 332060 332910 330723 327585 326084 326188 326442 326697 327684 328438 326482 321314
54751 321314 316229 315358 319258 324416 327178 327420 327871 330372 333785 335917 336471 336928 337814 337693 335476 332630
54735 332630 331994 334900 340162 345340 348174 347374 343382 338419 334798 332973 331918 331329 332329 335657 340070
54720 340070 343264 344140 343783 344333 346841 350051 351572 350811 350269 352966 358823 364969 369750 374684 381573
54705 381573 389315 395220 398491 400566 402555 404403 406677 410938 417253 422959 425388 424994 424368 424621 424191
54690 424191 421288 416275 411242 407889 406111 404227 400592 395638 392167 392736 396686 400764 402832 403565 404005
54675 404005 403276 400340 396825 395883 398493 402751 406784 410465 414055 417358 420990 426340 432934 437586 437945
54660D37945k386j799N8J399L099N375N440J275m534p700p346n509l183k47J733
54645D23620N72k613l949k018M94J063L30k73j034k260k647j367J6k44j454k052
54629D06184k201k749l025k192j607k963m790l916m42J929J092r29j823k319l617
54614C76632m074j593K051K753j91k937k563r56j633m647o807n991l066P5K312
54599C49365K934J448j335l384l463k167l46K129N000O387M628P01k736m287m496
54584C50378m158l709l853m897n470l827p06J165P40p5L78J055J66k013l490k645
54568C19039P56N216P689N985J879k76R48K433J685N25J086J290j779o108o869
54553C33499l318O59K462K949K671O35k229k733k79J737J214L55J155J593o55
$$ plain form
54660 437945 435559 433760 433818 435217 438316 443691 449131 450406 445872 438172 430826 425317 422134 421887 423620
54645 423620 424192 421579 417630 415612 416106 417169 417499 417226 416192 413932 411285 409918 409934 409690 408236 406184
54629 406184 403983 401234 398209 396017 394410 391447 386657 382741 382299 384228 385320 384391 382568 380249 376632
54614 376632 372558 370965 373016 375769 375578 372641 370078 369122 367489 362842 356035 350044 346978 347053 349365
54599 349365 352299 353747 352412 349028 345565 343398 343052 345181 350181 356568 361196 361897 359161 354874 350378
54584 350378 346220 342511 338658 333761 328291 324464 323758 324923 325663 325588 325966 327021 327187 325174 321684 319039
54568 319039 319795 325011 332700 338685 340564 340288 341236 343669 345354 345879 346965 348255 346476 340368 333499
54553 333499 330181 330840 333302 336251 338922 339557 337328 334595 334316 336053 337267 337622 338777 340370 339715
54538C39715l755m442k895j347K79L579P608R369Q026N542L365J320m45j292j804
54523C62823l069m275l736k281k563m538m774j480K647M220L604L479M573N022
54509C59652L296J50k191j974O74L756N149M453K607K61k044k670k16L421L820
54494C78144o20n964p175l984n38j08j993l291k089J141M160M856L171J140P69
54479C67619K201M083M930M017K094J338L093N368M609P91j787l36K283J799j234
54464D00868k787j518J60O25P55Q18n26k972l614r52K740M594M396L204J387r1
54448D07087R83M736P318N284M18k830l504m329o352p176n128j842N81K265L875
54433D01386M586L739K811L443M449L069q60m067l706p34J472J175j6M66K869
$$ plain form
54538 339715 335960 331518 328623 327276 327555 331134 338742 348111 356137 361679 365044 366364 365919 364627 362823
54523 362823 359754 355479 351743 349462 346899 342361 337587 336107 338754 342974 346578 350057 354630 359652
54509 359652 362948 363098 360907 358933 359607 363363 368512 372965 375572 375833 373789 371119 370903 374324 378144
54494 378144 377524 371560 364385 360401 359863 359755 357762 354471 352382 353523 357683 362539 365710 366850 367619
54479 367619 369820 373903 378833 382850 384944 386282 389375 394743 399352 400143 398356 398020 400303 402102 400868
54464 400868 398081 396563 396723 397348 398103 398921 398395 395423 391809 390857 393597 398191 402587 405791 407178 407087
54448 407087 408070 412806 420124 425408 425826 422996 419492 415163 408811 401635 396507 394665 395246 397511 401386
54433 401386 405972 409711 412522 415965 420414 423483 422623 418556 414850 414116 415588 416763 416747 417213 420082
54418D20082N033N323M699N098O437O473L813R9j492L19L335L841M13m119n226
54403D54128j743K529L358J265L27K265M341L746J539N24J070J250M0j784l558
54388D69297n256o092m596p92L197N588O816Q051Q670O676J647l760o097m704
54374D78645k290j692k725l067j573P21K659M134M555K403j997n016l497Q20L180
54359D75260J951J69O05J991J498j105l579m247l155j041J093J730j84l590n584
54344D61812l910R46O084Q483P237M011J244m2n51j290k583m206n294m194l0N135
54328D72852P325N120J723J094L057M044K184m11p32J368L269K576n38l486l530
54313D95915l58L547N396M621K492R4k087l120k105j14K45j756l225j041L582
$$ plain form
54418 420082 425115 430438 435137 440235 446672 453145 456958 457057 455565 455884 459219 463060 463473 459354 454128
54403 454128 452385 454914 458272 459537 459864 462129 466470 470216 471755 472279 473349 474599 474639 472855 469297
54388 469297 464041 457949 453353 452561 455758 461346 468162 476213 484883 491559 493206 489446 483349 478645
54374 478645 476355 474663 471938 468871 467298 468019 470678 474812 479367 481770 479773 474757 471260 472080 475260
54359 475260 477211 477380 477985 479976 481474 480369 476790 472543 469388 468347 469440 471170 470986 467396 461812
54344 461812 457902 458848 464932 473415 480652 484663 485907 485865 485314 484024 481441 477235 471941 467747 467717 472852
54328 472852 480177 485297 487020 488114 491171 495215 497399 496988 496256 497624 500893 503469 502931 499445 495915
54313 495915 495557 499104 504500 509121 511613 511707 509620 506500 504395 504281 504526 502770 499545 498504 502086
54298E02086N725K412l559o545m321k67R78j125l211k883j490j248j492J69L609
54283D88838N441L256j064l428k146O15J535n91m079o154n481l279j906k205k765
54268D66587k073p54p28k360l486j780K398O118O725M254J088m29Q9J267J671
54253D78587J248J120K055L190K691o5l336m726l850k360j378j88J682K571N62
54238D77803l205n048l043N63K078N15j820k263m40J820K585J806J221K028K867
54223D77467J196l073o475n700j654J510J124j602l931m662m150k671m02J509
54209D48486J472n60k812l897m237m481l658m72L963O438N191J799j002k193k404
54194D41633k235j939j970k333j896K69L085M498M155L471L107K118N5j848k383
$$ plain form
54298 502086 507811 510223 506664 500119 495798 495531 496509 495384 492173 489290 487800 486552 485060 485229 488838
54283 488838 494279 497535 496471 493043 490897 491512 493047 492456 488377 482223 476742 473463 471557 469352 466587
54268 466587 464514 463760 463032 460672 457186 455406 457804 463922 470647 474901 475989 475560 475649 476916 478587
54253 478587 479835 480955 483010 486200 488891 488826 485490 480764 476914 474554 473176 472988 474670 477241 477803
54238 477803 474598 469550 466507 467070 469148 469663 467843 465580 465140 466960 469545 471351 472572 474600 477467
54223 477467 478663 475590 469115 463415 461761 463271 464395 462793 458862 454200 450050 447379 446977 448486
54209 448486 449958 449398 446586 442689 438452 433971 430313 429841 433804 440242 445433 447232 446230 444037 441633
54194 441633 439398 437459 435489 433156 431260 431529 434614 439112 443267 446738 449845 451963 452018 450170 447787
54179D47787j778n65J447L841M760K985j06k248l133l764l790j804J668L834L041
54164D52175P35p97j169j298j536j852k842m826o314n118j335K217L185K444K720
54149D36389M902O722N409J223k456k731m97O77r86l211k720K88K304J095j718
54134D44690l299l163k510j523L34J858Q00k374m052k202P04J498J003K010L876
54119D37650K947j382m667l049J828N541O412N770M373J627j882l849k994o84
54105D47641Q12M71j400l694m680k975O84L608L946K572J443Q77l02k410l990
54090D42603l640j885n50n32p23N08L035M647L450L39j631o24J755K209n25m296
54074D44140o082n165l243j784n11J077J974J019n59k6K866M629K255k598n460
$$ plain form
54179 447787 446009 445444 446891 450732 455492 458477 458371 456123 452990 449226 445436 443632 445300 449134 452175
54164 452175 452910 452113 450944 449646 448110 446258 443416 438590 432276 427158 425823 428040 431225 433669 436389
54149 436389 441291 448013 453422 454645 452189 449458 448961 449638 448652 445441 442721 443009 445313 446408 444690
54134 444690 441391 438228 435718 434195 434529 436387 437187 434813 430761 428559 429263 430761 431764 433774 437650
54119 437650 440597 439215 434548 431499 433327 438868 445280 451050 455423 457050 455168 451319 448325 447641
54105 447641 448453 448924 447524 443830 439150 436175 436859 440467 444413 446985 448428 449305 449003 446593 442603
54090 442603 438963 437078 436528 435996 435273 435781 438816 443463 446913 447252 445621 444997 446752 448961 448436 444140
54074 444140 438058 432893 429650 427866 427355 428432 430406 431425 430866 430840 433706 438335 440590 437992 432532
54059D32532m340j187J694M236O895Q435P028K888j488l533k677p11l28k554n222
54044D41668m999j280L039N241N713O096O085M294J532P36L119O185O495L425
54030D87349m50j996k65K733L784J728j006r90K089N038N071K763P09L66J136
54015E08059J557N93j512k979j984R43L032K586J081Q07J754K418K704L786N479
54000E28324N991M622K839K105K180K149J702Q59j84k83J911N575P573O113L349
53985E74825K781M906O960O618M433K704L030N099P188Q025Q395J0045J2460J2354
53971F69823P967K578J279M748Q686R411P355M595J844m37m30K999P836J0771
53957G39025J0930R831Q278N552J813r19j084N62K124K558J726l04k832m028k323
$$ plain form
54059 432532 428192 427005 428699 432935 439830 448265 455293 458181 456693 453160 450483 449772 449444 446890 441668
54044 441668 436669 435389 438428 443669 449382 455478 461563 465857 467389 468125 471244 477429 483924 487349
54030 487349 486899 484903 484638 487371 491155 492883 491877 490887 492976 498014 503085 505848 506557 506923 508059
54015 508059 509616 510209 508697 505718 503734 504677 507709 510295 511376 512183 513937 516355 519059 522845 528324
54000 528324 534315 538937 541776 543881 546061 548210 549912 550771 550587 550304 552215 557790 565363 571476 574825
53985 574825 577606 582512 589472 596090 600523 603227 606257 611356 618544 626569 634964 645009 657469 669823
53971 669823 677790 680368 681647 686395 695081 704492 711847 716442 718286 717849 717419 720418 728254 739025
53957 739025 749955 759786 768064 773616 775429 774510 773426 773988 776112 778670 780396 780092 777260 773232 770909
53942G70909J576M763M592Q63m246p959q717o827l942j905j851l867o857q723
53928G27809p525l238J849N077N673M657L058J291m1l56n08k291n555p440o078
53913G16382l571l014l672k165J806M478L542J382R78J757J935K267M061N464
53899G31630L738K27j088K81Q88n37r15J627M159L668K100L264O796Q928Q276
53884G73042P463Q898J1780J3792J3826J2437J0881J0138R994R283P639O397O679
53871I02249P545P515P080P712Q925Q636O417M117K856J771O12J305N316J0897
53857I82953J4783J5580J4105J1289P740M923M567O383P948P761P122P877R467
53844A102498R869Q930Q603R412Q957N413Q93q63O51K553K913K577K231P55k041
$$ plain form
53942 770909 772485 777248 781840 782703 778457 770498 761781 754954 751012 749107 747256 743389 736532 727809
53928 727809 720284 717046 718895 723972 729645 734302 737360 738651 738610 738254 737746 735455 729900 722460 716382
53913 716382 712811 709797 706125 703960 705766 710244 713786 715168 716146 717903 719838 722105 726166 731630
53899 731630 735368 735595 734507 734788 735676 735139 734224 735851 740010 743678 745778 749042 755838 764766 773042
53884 773042 780505 789403 801183 814975 828801 841238 852119 862257 872251 881534 889173 895570 902249
53871 902249 909794 917309 924389 932101 941026 949662 956079 960196 963052 964823 965435 966740 972056 982953
53857 982953 997736 1013316 1027421 1038710 1046450 1051373 1055940 1062323 1070271 1078032 1085154 1093031 1102498
53844 1102498 1112367 1121297 1129900 1139312 1148269 1153682 1154575 1153712 1154363 1156916 1159829 1162406 1164637 1165392 1163351
53829A163351l537j619J685K438j86l505n504o942r063j1441j2851j2922j2135
53816A087769j1123j0343r710q415n819k577j43O24k30k354m972o744p049p054
53802A011860q142r604r568q069p280q245r115p572l875n99rk304n854q603r378
53787I13643q126n294j789L72r54n141q211p011l028k63j80j100j769k557l171
53772H65421k303l47K48j633m143n171m681l570k406k226m131o854p019l436R70
53757H18719L024L091L168L349K457P44m07n96l65J46R58J685K547M658P723Q972
53741H59873O451K150k49J32J278J914L059O045J0401J3600J2481O314p53k542
53727I20154K054P025O544K108n52N15K372K627J635j86k903m961m574l549n557
$$ plain form
53829 1163351 1159814 1158195 1159880 1162318 1162132 1158627 1153123 1146181 1137118 1125677 1112826 1099904 1087769
53816 1087769 1076646 1066303 1056593 1048178 1042359 1039782 1039639 1040263 1040033 1037679 1032707 1025963 1018914 1011860
53802 1011860 1003718 994114 984546 976477 969197 960952 951837 944265 940390 939791 939782 937478 931624 923021 913643
53787 913643 905517 900223 898434 898806 897852 892711 884500 877489 874461 874198 874018 872918 871149 868592 865421
53772 865421 863118 862771 863019 861386 857243 852072 847391 843821 841415 839189 835058 828204 821185 817749 818719
53757 818719 821743 824834 828002 831351 833808 834552 834145 833549 833184 833330 834288 835973 838520 843178 850901 859873
53741 859873 866324 868474 868225 868357 869635 871549 874608 880653 891054 904654 917135 923449 922696 920154
53727 920154 922208 929233 935777 937885 937333 937848 940220 942847 944482 944296 941393 936432 931858 928309 922752
53712I22752r897j1337p623k895j592k867l738m122n254n957m310j401Lo61k068
53697H59033l900o250p382n615k828k445m092m013j280M24j250l331k100J010
53683H15981J514j643n168o517o673p265p800p156n816m843l938k298n19J35r6
53668G57898J26Q40P85l1J18J736K656R98j814k806j346L58M11p08j141K86K998
53651G61364M891M009P91j980k252q02P46K592N431P627O533K675j01N09K508
53636G94541K715Q19r93r97Q31L511N683O113M590K137j1j194j238n42k55j229
53620H14481k607k797j926j788l002m001l480j989l71J585L755M850M418M024
53606H11152M780N162L183m91l482m686m272j944K204N797N871K688n12j778k220
$$ plain form
53712 922752 912855 901518 893895 891000 889408 886541 882803 878681 873427 867470 863160 861759 861762 861101 859033
53697 859033 855133 848883 841501 835886 833058 830613 826521 822508 821228 821652 820402 817071 814971 815981
53683 815981 817495 815852 810684 804167 797494 790229 782429 775273 769457 764614 760676 758378 757859 757994 757898
53668 757898 758024 758864 759649 759618 759736 761472 764128 765126 763312 760506 759160 759518 759929 759221 758080 758366 761364
53651 761364 766255 770264 771055 769075 766823 766021 766767 769359 774790 782417 788950 791625 791524 792033 794541
53636 794541 797256 798075 797082 796085 796916 800427 806110 812223 816813 818950 818939 817745 816507 815965 815710 814481
53620 814481 811874 809077 807151 805363 802361 798360 794880 792891 792520 794105 797860 802710 807128 811152
53606 811152 815932 821094 824277 823786 820304 815618 811346 809402 811606 817403 823274 825962 825450 823672 821452
53591H21452l064l303j611J245L217L288J957N14N97L282P370R584P851L880J294
53576H57553J530K748K658J124j87K46K586N603P379O672M176K199K596M959O989
53561I08831O614L815P31m3K175N188N925L839J663K109M530O011N344M158M103
53546I64993M720N021N541P348R825J1066J0144P918N804M600M255M019L149K040
53532A050443K101L780N652O340O266O289N834M135K350K338L755M413L256J148
53518A108100r09k448k865k075j214p29J075M768O551K633l762n053K80N428N438
53503A115218L885N686Q449O616Q86k615j136K323M800O135N786K200l076n037
53489A150120j366M137O567N961N969Q096R961Q964N768L394L658N366O453P053
$$ plain form
53591 821452 818388 815085 813474 814719 817936 821224 823181 823695 824292 827574 834944 844528 852379 856259 857553
53576 857553 859083 861831 864489 865613 865426 865672 868258 873861 881240 887912 892088 894287 896883 901842 908831
53561 908831 915445 919260 919991 919948 922123 927311 933236 937075 938738 940847 945377 951388 956732 960890 964993
53546 964993 969713 974734 980275 987623 997448 1008514 1018658 1026576 1032380 1036980 1041235 1045254 1048403 1050443
53532 1050443 1052544 1056324 1061976 1068316 1074582 1080871 1086705 1090840 1093190 1095528 1099283 1103696 1106952 1108100
53518 1108100 1107191 1104743 1101878 1099803 1098589 1097860 1098935 1103703 1110254 1112887 1109125 1104072 1104352 1109780 1115218
53503 1115218 1119103 1124789 1133238 1139854 1140740 1138125 1136989 1139312 1144112 1150247 1156033 1158233 1155157 1150120
53489 1150120 1148754 1152891 1159458 1165419 1171388 1179484 1189445 1198409 1204177 1207571 1211229 1216595 1223048 1230101
53475A230101Q952J2098J3930J3209J2288J3658J6235J7366J6835J6268J6128
53464A387068J6245J7861K1530K4255K2826J9579K0253K5819L0992L1892L0785
53453A649105L1317L3208L4480L5587L7898M0296M0467L8482L6642L6686L8713
53442B052881M1827M4366M4733M3384M2705M3946M5760M6751M7296M7602M6523
53431B547774M4129M3052M4849M7114M6766M4390M2558M1522L9689L7182L5657
53420C014682L5267L4834L4549L5592L7416L8206L7767L7081L5404L1058K5195
53409C397051K1361K0448J9364J5805J1470Q918Q040P552P697Q985R863Q283M890
53396C549727K506K553L460K527j457p128j1240j1097p208l096j828l379n796
$$ plain form
53475 1230101 1239053 1251151 1265081 1278290 1290578 1304236 1320471 1337837 1354672 1370940 1387068
53464 1387068 1403313 1421174 1442704 1466959 1489785 1509364 1529617 1555436 1586428 1618320 1649105
53453 1649105 1680422 1713630 1748110 1783697 1821595 1861891 1902358 1940840 1977482 2014168 2052881
53442 2052881 2094708 2139074 2183807 2227191 2269896 2313842 2359602 2406353 2453649 2501251 2547774
53431 2547774 2591903 2634955 2679804 2726918 2773684 2818074 2860632 2902154 2941843 2979025 3014682
53420 3014682 3049949 3084783 3119332 3154924 3192340 3230546 3268313 3305394 3340798 3371856 3397051
53409 3397051 3418412 3438860 3458224 3474029 3485499 3494417 3502457 3510009 3517706 3526691 3536554 3544837 3549727
53396 3549727 3552233 3554786 3558246 3560773 3559316 3552188 3540948 3529851 3522643 3519547 3517719 3514340 3508544
53383C508544p724q640q064o293n115n856p107o334l547j233l73R48M016O827
53369C460049O913N289N306Q252J2239J5283J7298J8775J9636K0295K2049K5167
53357C636551K7997K9323L0475L3444L7864M1634M4001M6056M8384N0210N1238
53346D077177N2409N4316N6315N8000O0154O3489O7526P1492P5104P7802P8630
53335D792414P7956P8022Q0296Q3334Q4736Q4571Q5049Q7081Q8823Q8091Q5107
53324E715480Q2265Q1604Q2741Q3163Q0790P6271P2231P0067O8538O5955O2408
53313F541513N8868N5360N1513M7896M4929M1177L4896K7031K0336J5227Q973
53302F947719J44q340j2562j2860j3573j7836k4370k9863l2991l5146l7988m1508
$$ plain form
53383 3508544 3500820 3492180 3484116 3477823 3472708 3466852 3459745 3453411 3449864 3448631 3448258 3449206 3453222 3460049
53369 3460049 3466962 3472251 3477557 3485809 3498048 3513331 3530629 3549404 3569040 3589335 3611384 3636551
53357 3636551 3664548 3693871 3724346 3757790 3795654 3837288 3881289 3927345 3975729 4025939 4077177
53346 4077177 4129586 4183902 4240217 4298217 4358371 4421860 4489386 4560878 4635982 4713784 4792414
53335 4792414 4870370 4948392 5028688 5112022 5196758 5281329 5366378 5453459 5542282 5630373 5715480
53324 5715480 5797745 5879349 5962090 6045253 6126043 6202314 6274545 6344612 6413150 6479105 6541513
53313 6541513 6600381 6655741 6707254 6755150 6800079 6841256 6876152 6903183 6923519 6938746 6947719
53302 6947719 6947863 6939523 6926961 6914101 6900528 6882692 6858322 6828459 6795468 6760322 6722334 6680826
53290F680826m4479m6032m6319m6183m6623m8218n0513n2177n2356n1644n1021
53279F145261n0262m8514m6284m5322m6039m6530m5084m2535m1043m1504m3089
53268E649055m4391m3942m0710l5582l1574l0922l2332l2510l0063k6539k4014
53257E276476k3101k3077k2577k0495j7564j6492j8728k1577k0710j5576r940
53246E066639o878n712m760m411n526o724n663k283J059K509K347J992K537M178
53232E039304O091O918O258N633P190J1211J5428J7214J6286J4981J5490J7014
53220E179018J6386J1825N208k57l577n742o809n800l828m569r838j6339j9055
53207E136623j7384j5946j9114k6081l2010l3356l1276k9788l1235l4461l7504
$$ plain form
53290 6680826 6636347 6590315 6543996 6497813 6451190 6402972 6352459 6300282 6247926 6196282 6145261
53279 6145261 6094999 6046485 6000201 5954879 5908840 5862310 5817226 5774691 5733648 5692144 5649055
53268 5649055 5604664 5560722 5520012 5484430 5452856 5421934 5389602 5357092 5327029 5300490 5276476
53257 5276476 5253375 5230298 5207721 5187226 5169662 5153170 5134442 5112865 5092155 5076579 5066639
53246 5066639 5059761 5054049 5049289 5044878 5039352 5032628 5026965 5024682 5025741 5028250 5030597 5032589 5035126 5039304
53232 5039304 5045395 5052313 5058571 5064204 5071394 5082605 5098033 5115247 5131533 5146514 5162004 5179018
53220 5179018 5195404 5207229 5212437 5212180 5208603 5202861 5196052 5190252 5186424 5181855 5172017 5155678 5136623
53207 5136623 5119239 5103293 5084179 5058098 5026088 4992732 4961456 4931668 4900433 4865972 4828468
53196D828468m0424m4104m7458m8305m6992m6551m8449n0548n0655m9860n0210
53185D304912n0847m9235m5525m2981m4009m7785n1986n4841n5082n2029m7022
53174C763570m3249m2745m4216m5065m4786m5025m6505m7569m6341m3102l9625
53163C275342l6877l4728l3388l3423l4141l3797l2263l1798l3691l5936l6371
53152B898929l6641l9817m4557m5444m0053l2461k8135k8031k9672l1451l3110
53141B509557l3799l2816l1528l1965l3816l4925l4373l3103l1903l0762k9902
53130B150665k9499k8745k6987k5378k5397k6237k5983k5009k5560k7700k8528
53119A855642k6257k2729k0735k0713k1225k1130k0243j9204j9394k1450k3337
$$ plain form
53196 4828468 4788044 4743940 4696482 4648177 4601185 4554634 4506185 4455637 4404982 4355122 4304912
53185 4304912 4254065 4204830 4159305 4116324 4072315 4024530 3972544 3917703 3862621 3810592 3763570
53174 3763570 3720321 3677576 3633360 3588295 3543509 3498484 3451979 3404410 3358069 3314967 3275342
53163 3275342 3238465 3203737 3170349 3136926 3102785 3068988 3036725 3004927 2971236 2935300 2898929
53152 2898929 2862288 2822471 2777914 2732470 2692417 2659956 2631821 2603790 2574118 2542667 2509557
53141 2509557 2475758 2442942 2411414 2379449 2345633 2310708 2276335 2243232 2211329 2180567 2150665
53130 2150665 2121166 2092421 2065434 2040056 2014659 1988422 1962439 1937430 1911870 1884170 1855642
53119 1855642 1829385 1806656 1785921 1765208 1743983 1722853 1702610 1683406 1664012 1642562 1619225
53108A619225k1853j6912j2354j1318j2770j4068j4949j6642j8547j8543j6360
53097A444909j4476j5195j8162k0916k1245j8990j6084j4637j4878j5709j6986
53086A257631j9378k1648k0667j5811j0922r343q962n638l37J262l368j0020j3376
53073A119423j2865j0995q715n457k220j374l492o554q524r146r052q599p980
53060A024450p423o945o614o962q035q150n226r3K956N86n275r122q050m820m141
53045I47136p064j0354j0904r112p379o615n655l770k220k411l470l056o13J457
53031H75970O53k447n047n770n901o660o921m976j669l5j846n746q866r180o429
53016H05130k189O02j58l141m570k720j29jj759k284o77P04P0j408j933j827k410
$$ plain form
53108 1619225 1597372 1580460 1568106 1556788 1544018 1529950 1515001 1498359 1479812 1461269 1444909
53097 1444909 1430433 1415238 1397076 1376160 1354915 1335925 1319841 1305204 1290326 1274617 1257631
53086 1257631 1238253 1216605 1195938 1180127 1169205 1159862 1150900 1145262 1144925 1146187 1142819 1132799 1119423
53073 1119423 1106558 1095563 1086848 1081391 1079171 1077797 1074305 1067751 1059227 1050081 1041029 1032430 1024450
53060 1024450 1017027 1010082 1003468 996506 988471 980321 975095 975002 977958 978544 973269 964147 956097 951277 947136
53045 947136 940072 929718 918814 909702 902323 895708 890053 886283 884063 881652 878182 875126 874513 875970
53031 875970 876623 874176 869129 863359 857458 850798 843877 838901 837232 837197 835351 829605 820739 811559 805130
53016 805130 802941 803543 803385 800244 795674 792954 792825 792824 791065 788781 788104 788808 788878 787470 785537 783710 781300
52999G81300l555m029l673l550l953l725j948O38K380K354R03r94k467l191l557
52984G52933m392o053p659p553m949j137J435J496N3j187j985l232m752m707k129
52969G06182R54J222j984n574o034l126M89K598L321L587L136J096k026m299m486
52954F95056l237j767k82J563L351M110L488J818n97l284m845l971j344P60J325
52939F92144J760L336M784L968J152j051r46N37J562J481O46o80k252l261k791
52924G00389p98J788L853M645L949K276Q53Q66K287L583K973L28k306k618o79
52909G21389R03Q5j957k445q66L35n97k247k403j531j753l110l362j787n95j202
52893F98857j316J780O227P020K728k067k512L79J607j030m644n722m301k624
$$ plain form
52999 781300 777745 773716 770043 766493 762540 758815 756867 757505 759885 762239 763142 762148 759681 756490 752933
52984 752933 748541 742488 734829 727276 722327 721190 722625 724121 724174 722987 721002 717770 713018 708311 706182
52969 706182 707136 708358 706374 700800 694766 691640 692129 694727 698048 701635 704771 705867 703841 699542 695056
52954 695056 691819 690052 689770 691333 694684 698794 702282 704100 703503 700219 695374 691403 690059 690819 692144
52939 692144 693904 697240 702024 705992 707144 706093 705147 705684 707246 708727 709373 708693 706441 703180 700389
52924 700389 699591 701379 705232 709877 713826 716102 716955 717821 720108 723691 726664 726992 724686 722068 721389
52909 721389 722292 722377 720420 717975 717109 717444 716847 714600 712197 710666 708913 705803 702441 700654 700059 698857
52893 698857 697541 699321 705548 712568 715296 713229 710717 711096 712703 711673 707029 701307 697006 694382
52879F94382j565j32K251M638N703M876K371j077m372o617p592p310n556k632
52865F77368J2J094J297K405M536N735M817L036J981J176p75l590n387n017l057
52850F85631p97N75J61j876l825m166l668m276n930o191l493Q99M855P523Q510
52835F73932O790K427j759k436L74L356L849K337J028J292K769L841K683j040
$$ plain form
52879 694382 692817 692685 694936 699574 705277 710153 712524 711447 707075 700458 692866 685556 680000 677368
52865 677368 677380 678474 679771 682176 686712 692447 697264 700300 702281 703457 702682 699092 693705 688688 685631
52850 685631 684834 685409 685570 683694 679869 675703 672035 667759 661829 655638 652145 653044 657899 665422 673932
52835 673932 680722 683149 681390 678954 679328 682684 686533 688870 689898 691190 693959 697800 700483 699443
$$ [...]
##END NTUPLES=NMR SPECTRUM
##END=
