
##TITLE=UV1144_M6-1005-1000_6278857_1ZAWa5P5aZ
##JCAMPDX= 6.0         $$ Bruker NMR JCAMP-DX V2.0
##DATA TYPE= NMR SPECTRUM
##DATA CLASS= NTUPLES
##ORIGIN= BRUKER
##OWNER= Administrator
$$ 1.72 TOPSPIN		Version 2.1
$$ 2012-06-03 15:56:58.937 -0500  Administrator@TOPSPIN
$$ Compression mode = diff/dup
##.OBSERVE FREQUENCY= 400.13188235
##.OBSERVE NUCLEUS= ^1H
##.ACQUISITION MODE= SIMULTANEOUS (DQD)
##.ACQUISITION SCHEME= undefined
##.AVERAGES= 8
##.DIGITISER RES= 22
##SPECTROMETER/DATA SYSTEM= spect
##.PULSE SEQUENCE= zg30
##.SOLVENT NAME= COFFEE_meoh
##.SHIFT REFERENCE= INTERNAL, COFFEE_meoh, 1, 14.98061
##AUDIT TRAIL= $$ (NUMBER, WHEN, WHO, WHERE, PROCESS, VERSION, WHAT)
$$ ##TITLE= Audit trail, TOPSPIN		Version 2.1
$$ ##JCAMPDX= 5.01
$$ ##ORIGIN= Bruker BioSpin GmbH
$$ ##OWNER= Administrator
$$ $$ C:\Bruker\TOPSPIN/data/COFFEE/nmr/UV1144_M6-1005-1000_6278857_1ZAWa5P5aZ/10/pdata/1/auditp.txt
$$ ##AUDIT TRAIL=  $$ (NUMBER, WHEN, WHO, WHERE, PROCESS, VERSION, WHAT)
(   1,<2012-06-03 15:56:51.687 -0500>,<Administrator>,<TOPSPIN>,<go>,<TOPSPIN 2.1>,
      <created by zg
	started at 2012-06-03 15:55:45.250 -0500,
	POWCHK enabled, PULCHK disabled,
       configuration hash MD5:
       D5 CA 7A 23 FE 6B EE E2 50 67 74 61 24 F7 5E 3B
       data hash MD5: 64K
       C2 15 D1 3C F3 06 E1 2D E3 3E 02 9D 10 2E 29 02>)
(   2,<2012-06-03 15:56:54.703 -0500>,<Administrator>,<TOPSPIN>,<proc1d>,<TOPSPIN 2.1>,
      <Start of raw data processing
       efp LB = 0 FT_mod = 6 PKNL = 1 PHC0 = 0 PHC1 = 0 SI = 32K 
       data hash MD5: 32K
       D0 68 C6 FA DE B5 A2 0D 5B 47 74 16 F7 A2 37 E6>)
(   3,<2012-06-03 15:56:55.093 -0500>,<Administrator>,<TOPSPIN>,<proc1d>,<TOPSPIN 2.1>,
      <pk PHC0 = 212.113 PHC1 = 0 
       data hash MD5: 32K
       51 63 D5 F3 AA 14 E6 FE BB 6A 68 5E 6E B1 03 36>)
(   4,<2012-06-03 15:56:55.156 -0500>,<Administrator>,<TOPSPIN>,<proc1d>,<TOPSPIN 2.1>,
      <abs ABSG = 1 
       data hash MD5: 32K
       F5 46 50 F3 DA DA 4D AC 2A 3C 96 B7 3B 65 CE 95>)
(   5,<2012-06-03 15:56:55.187 -0500>,<Administrator>,<TOPSPIN>,<proc1d>,<TOPSPIN 2.1>,
      <abs ABSG = 2 
       data hash MD5: 32K
       A4 50 F8 B9 DB 23 16 E3 EC CB 87 DC C9 39 1D 59>)
(   6,<2012-06-03 15:56:55.218 -0500>,<Administrator>,<TOPSPIN>,<proc1d>,<TOPSPIN 2.1>,
      <abs ABSG = 3 
       data hash MD5: 32K
       EF F5 69 D3 9F 38 66 68 56 64 08 15 C0 78 4A D6>)
(   7,<2012-06-03 15:56:55.250 -0500>,<Administrator>,<TOPSPIN>,<proc1d>,<TOPSPIN 2.1>,
      <abs ABSG = 4 
       data hash MD5: 32K
       0D FF FE 95 36 0B FA 12 DF 99 56 C6 6B 73 26 CD>)
(   8,<2012-06-03 15:56:55.281 -0500>,<Administrator>,<TOPSPIN>,<proc1d>,<TOPSPIN 2.1>,
      <abs ABSG = 5 
       data hash MD5: 32K
       5A 53 B8 E9 3B 77 58 A2 68 BB 8D 69 69 8B E8 97>)
$$ ##END=
$$ 
$$ $$ hash MD5
$$ $$ 28 9C 17 87 54 C4 B0 A0 F2 2C 85 A1 56 55 B1 1C
##$RELAX= 
##$RELAX= 
##$RELAX= 
##$RELAX= 
##$RELAX= 
##$RELAX= 
##$RELAX= 
$$ Bruker specific parameters
$$ --------------------------
$$ [...]
150 150 150 150 150 150 150 150
##$TP07= 0
##$TPNAME0= <>
##$TPNAME1= <>
##$TPNAME2= <>
##$TPNAME3= <>
##$TPNAME4= <>
##$TPNAME5= <>
##$TPNAME6= <>
##$TPNAME7= <>
##$TPOAL= (0..7)
0.5 0.5 0.5 0.5 0.5 0.5 0.5 0.5
##$TPOFFS= (0..7)
0 0 0 0 0 0 0 0
##$TUNHIN= 0
##$TUNHOUT= 0
##$TUNXOUT= 0
##$USERA1= <user>
##$USERA2= <user>
##$USERA3= <user>
##$USERA4= <user>
##$USERA5= <user>
##$V9= 5
##$VALIST= <valist>
##$VCLIST= <CCCCCCCCCCCCCCC>
##$VD= 0
##$VDLIST= <DDDDDDDDDDDDDDD>
##$VPLIST= <PPPPPPPPPPPPPPP>
##$VTLIST= <TTTTTTTTTTTTTTT>
##$WBST= 2048
##$WBSW= 25
##$XGAIN= (0..3)
0 0 0 0
##$XL= 0
##$YL= 0
##$YMAX_a= 502185
##$YMIN_a= -598727
##$ZGOPTNS= <>
##$ZL1= 120
##$ZL2= 120
##$ZL3= 120
##$ZL4= 120
##$ABSF1= 14.98061
##$ABSF2= -5.57192
##$ABSG= 5
##$ABSL= 3
##$ALPHA= 0
##$AQORDER= 0
##$ASSFAC= 0
##$ASSFACI= 0
##$ASSFACX= 0
##$ASSWID= 0
##$AUNMP= <proc_prof1d_extract_pilot.lims>
##$AXLEFT= 0
##$AXNAME= <>
##$AXNUC= <1H>
##$AXRIGHT= 0
##$AXTYPE= 0
##$AXUNIT= <>
##$AZFE= 0.1
##$AZFW= 0.1
##$BCFW= 0
##$BC_mod= 0
##$BYTORDP= 0
##$COROFFS= 0
##$CY= 15
##$DATMOD= 1
##$DC= 0
##$DFILT= <>
##$DTYPP= 0
##$F1P= 0
##$F2P= 0
##$FCOR= 0.5
##$FTSIZE= 32768
##$FT_mod= 6
##$GAMMA= 0
##$GB= 0
##$INTBC= 1
##$INTSCL= 1
##$ISEN= 128
##$LB= 0
##$LEV0= 0
##$LPBIN= 0
##$MAXI= 10000
##$MC2= 0
##$MEAN= 0
##$ME_mod= 0
##$MI= 0
##$NCOEF= 0
##$NC_proc= -8
##$NLEV= 6
##$NOISF1= 0
##$NOISF2= 0
##$NSP= 0
##$NTH_PI= 0
##$NZP= 0
##$OFFSET= 14.98061
##$PC= 1
##$PHC0= 212.113
##$PHC1= 0
##$PH_mod= 1
##$PKNL= yes
##$PPARMOD= 0
##$PPDIAG= 0
##$PPIPTYP= 0
##$PPMPNUM= 2147483647
##$PPRESOL= 1
##$PSCAL= 4
##$PSIGN= 0
##$PYNMP= <proc.py>
##$REVERSE= no
##$SF= 400.13
##$SI= 32768
##$SIGF1= 0
##$SIGF2= 0
##$SINO= 400
##$SIOLD= 32768
##$SPECTYP= <>
##$SREGLST= <1H.CDCl3>
##$SSB= 0
##$STSI= 32768
##$STSR= 0
##$SW_p= 8223.68421052632
##$SYMM= 0
##$S_DEV= 0
##$TDeff= 65536
##$TDoff= 0
##$TI= <>
##$TILT= no
##$TM1= 0
##$TM2= 0
##$TOPLEV= 0
##$USERP1= <user>
##$USERP2= <user>
##$USERP3= <user>
##$USERP4= <user>
##$USERP5= <user>
##$WDW= 1
##$XDIM= 32768
##$YMAX_p= 455125967
##$YMIN_p= -691286
##$CURPLOT= <Network HP LaserJet P1505>
##$CURPRIN= <$Network HP LaserJet P1505>
##$DFORMAT= <normdp>
##$LAYOUT= <+/1D_H.xwp>
##$LFORMAT= <normlp>
##$PFORMAT= <normpl>
##$SURQMSG= 1
$$ End of Bruker specific parameters
$$ ---------------------------------
##NTUPLES= NMR SPECTRUM
##VAR_NAME=  FREQUENCY,     SPECTRUM/REAL,   SPECTRUM/IMAG
##SYMBOL=    X,             R,               I
##VAR_TYPE=  INDEPENDENT,   DEPENDENT,       DEPENDENT
##VAR_FORM=  AFFN,          ASDF,            ASDF
##VAR_DIM=   32768,         32768,           32768
##UNITS=     HZ,            ARBITRARY UNITS, ARBITRARY UNITS
##FACTOR=    0.250966925370066, 1,           1
##FIRST=     8223.43324360095, -192278,      -263453
##LAST=      0,             85559,           -152491
##MIN=       0,             -691286,         0
##MAX=       8223.43324360095, 455125967,    0
$$ Real data points
##PAGE= N=1
##DATA TABLE= (X++(R..R)), XYDATA
$$ [...]
19542c33360B54c92033a76230Q7392D7131c96733C35019b33991C6589a55114a3308
$$ -333360 254 -392033 -176230 -88838 47131 -396733 335019 -233991 36589 -155114 -13308
19530c23550a9373j21505A62230a98472O8500L1244A78873j7261D0799j5475d9307
$$ -323550 -19373 -140878 162230 -198472 -129972 -98728 178873 161612 40799 25324 -49307
19518B28795J09488a34972m7514H1738a62880j22840J37390I9907L1355M1549
$$ 228795 338283 -134972 -182486 81738 -162880 -285720 -148330 99907 131262 172811
19508A72811a63990B59820b6030B52139a3005j18256A19185a55094E3166e3200
$$ 172811 -163990 259820 -26030 252139 -13005 -131261 119185 -155094 53166 -53200
19497a819j51637G9152J40326c8438D5193a80196D2099L13381b24483O2781A01855
$$ -1819 -153456 79152 219478 -38438 45193 -180196 42099 355480 -224483 -161702 101855
19485b2222o3954B7023a6316p625j15189j2259L3773A6146J8619a60467o0854
$$ -22222 -86176 27023 -16316 -23941 -139130 -151389 -117616 16146 34765 -160467 -221321
19474b21321c645j93945B03352i7287k72343e4495q9312B0603a19546o0355J0295
$$ -221321 -3645 -197590 203352 -97287 -369630 -54495 -143807 20603 -119546 -179901 -169606
19463a69606A61663a25160E4122J88905i9365f926k7923o586o7067J7613B0668
$$ -169606 161663 -125160 54122 243027 -99365 -6926 -34849 -41435 -108502 -90889 20668
19451I924c3975m9342B7258M0248L24001D6992h6335k90310n4135a27727C25536
$$ 9924 -33975 -83317 27258 67506 391507 46992 -86335 -376645 -430780 -127727 325536
19439C02640a77554n4373M4119J3837j2078A51672d9691A16073d8443a6289m0150
$$ 302640 -177554 -231927 -187808 -173971 -186049 151672 -49691 116073 -48443 -16289 -56439
19428e6439l33345A70776b64272N7747e0728j09725P8344A0511b94501j49217
$$ -56439 -389784 170776 -264272 -206525 -50728 -160453 -82109 10511 -294501 -443718
19418d43718d5704n1574A91565a0280q1295o720B7337Q4505b34909m7803q4254
$$ -443718 -45704 -97278 191565 -10280 -91575 -98295 27337 111842 -234909 -282712 -366966
19407c66966a9249o72037B2690e5727j7038A06040k1066l4515e4179B39848A02590
$$ -366966 -19249 -691286 22690 -55727 -72765 106040 84974 50459 -54179 239848 102590
19395a0643E1148j8533e8045k81237A22418m2332b46553L7754j30687g0739j73078
$$ -10643 51148 32615 -58045 -339282 122418 80086 -246553 -208799 -339486 -70739 -243817
19384b43817b2388l13910g6303E9450k1185a55420N4727k9233K8234l2195j45067
$$ -243817 -22388 -336298 -76303 59450 38265 -155420 -100693 -129926 -101692 -133887 -278954
19373b78954B48564A02774h2616K9739j56159j01504b9254A5702J54513g7130
$$ -278954 248564 102774 -82616 -52877 -209036 -310540 -29254 15702 170215 -77130
19362b25643f0943A72764a48183B24313C5151D030L3031a23752j66059E7117J32746
$$ -225643 -60943 172764 -148183 224313 35151 4030 37061 -123752 -289811 57117 189863
19351A89863b59891e9204A56915g5109G5740N421Q2619C3537A1237N1169a23543
$$ 189863 -259891 -59204 156915 -75109 75740 81161 163780 33537 11237 62406 -123543
19339D5912i3336r1240n8257r7462f7211j69503A83873a59493m0522A32326b06586
$$ 45912 -93336 -184576 -242833 -340295 -67211 -236714 183873 -159493 -200015 132326 -206586
19327b79201A4780R1944c09570f5191A30885f3298C2510n003f4641I5662K55980
$$ -279201 14780 106724 -309570 -65191 130885 -63298 32510 27507 -64641 95662 351642
19316C51642a03517p3336j36636J41918H6259b26148J09884j52870A06592a69556
$$ 351642 -103517 -176853 -313489 -171571 86259 -226148 -116264 -269134 106592 -169556
19305i7443A20822l4585b39273R2338A10132b7488I9516e5786k70786L42e6288
$$ -97443 120822 86237 -239273 -146935 110132 -27488 99516 -55786 -326572 -326230 -56288
19293d09599a39725F3301a33169L3248k08144A34441o6616k7968i0375A30649
$$ -409599 -139725 63301 -133169 -99921 -308065 134441 67825 39857 -90375 130649
19282E6449O7486n4346a80760j69675a13597J1202b9025j16419C083a83118g7517
$$ 56449 123935 69589 -180760 -350435 -113597 -102395 -29025 -145444 3083 -183118 -77517
19270a14692H2507J11338o4461L0613b86017D8416b3138p4402C0318a17001e7185
$$ -114692 82507 193845 129384 159997 -286017 48416 -23138 -97540 30318 -117001 -57185
19258c26280G7536e54312A15966b6626G6735b32453C81560A625a68997j70084
$$ -326280 77536 -554312 115966 -26626 76735 -232453 381560 1625 -168997 -339081
19248c39081A76846b96240A26977J9302b96601R7656A50037A2582c5196I4828
$$ -339081 176846 -296240 126977 146279 -296601 -198945 150037 12582 -35196 94828
19237c42895Q8211i3703D3598a4513k47994i9478j4141M9988A34156b01219j9023
$$ -342895 -254684 -93703 43598 -14513 -262507 -99478 -113619 -63631 134156 -201219 -220242
19226b20242C18885d3919m5058c0543m28465a88179a9618p4805j63884B31724
$$ -220242 318885 -43919 -88977 -30543 -459008 -188179 -19618 -94423 -258307 231724
19215A79855a53886I8181L1444j541b78008A8968a10165B9353K0004a02864B26825
$$ 179855 -153886 98181 129625 128084 -278008 18968 -110165 29353 49357 -102864 226825
19203a49393K0934M9720A37475b16460A58896P0752F5517a67624m7348b0742G4006
$$ -149393 -128459 -78739 137475 -216460 158896 229648 65517 -167624 -214972 -20742 74006
19191A4033a84075A35076f2608j04840K5018l8195I8124a28238B94925C7438a81143
$$ 14033 -184075 135076 -62608 -167448 -142430 -180625 98124 -128238 294925 37438 -181143
19179b72084e3810B5815N7310e0318r9493M7417j00619P2082j00414L4969E6091
$$ -272084 -53810 25815 83125 -50318 -149811 -102394 -203013 -130931 -231345 -196376 56091
19167e05389e1561r2321c537q7619A17711d4622j47045c073l8145A64693P9602
$$ -505389 -51561 -143882 -3537 -91156 117711 -44622 -191667 -3073 -41218 164693 244295
19156B44295b2724j02544p3370g6294o992J6781o0349j0233o0653e3974j74359
$$ 244295 -22724 -125268 -198638 -76294 -83286 -66505 -126854 -137087 -197740 -53974 -228333
19145b28333C36506j40214C4980a35627A01384b4588B25154b36528b158H2499
$$ -228333 336506 196292 34980 -135627 101384 -24588 225154 -236528 -2158 82499
19134A36434n2820b01175r112B932a91984A78863c07643A49393E0831b18936A66738
$$ 136434 83614 -201175 -210287 2932 -191984 178863 -307643 149393 50831 -218936 166738
19122b8162A4669a81538j19423F7913J30044q9014e1990F2560a9594F5623c39658
$$ -28162 14669 -181538 -300961 67913 197957 108943 -51990 62560 -19594 65623 -339658
19110c90322F1269a32609F3686b5432k17983H3164l9302b52027Q2633A62446l5270
$$ -390322 61269 -132609 63686 -25432 -243415 83164 43862 -252027 -169394 162446 127176
19099A27176P138a87653c1982k14978b5703j98214C45265F8369a6139G5563a86754
$$ 127176 134314 -187653 -31982 -246960 -25703 -223917 345265 68369 -16139 75563 -186754
19087b58924H5104b41403c5629l14630E9999K6507a86741n4512C32176d26592
$$ -258924 85104 -241403 -35629 -350259 59999 86506 -186741 -241253 332176 -426592
19076a28894G5955e00911a78278I2313a87215F1731i8302b0334C8072P9486a88718
$$ -128894 75955 -500911 -178278 92313 -187215 61731 -98302 -20334 38072 117558 -188718
19064C8375a03595j21217N4165E8801a15268F164c94605a01589d7382C8381e2673
$$ 38375 -103595 -224812 -170647 58801 -115268 6164 -394605 -101589 -47382 38381 -52673
19052h2332C3968b62602A94186a88507B0009J4988J84017B4192l976J69533a31776
$$ -82332 33968 -262602 194186 -188507 20009 34997 219014 24192 20216 189749 -131776
19040a20005o9922a5655o0109q032J64k31369a237C3539a28490r2606O6142f5512
$$ -120005 -189927 -15655 -75764 -83796 -83632 -315001 -1237 33539 -128490 -221096 -154954 -65512
19027a75386A86828D6146O9017C2502b04957c1294A51432B7266g5503B13944A5432
$$ -175386 186828 46146 115163 32502 -204957 -31294 151432 27266 -75503 213944 15432
19015I9021a44971A80539O96h7856B388J79678D1899b3135A38617g3978A08101
$$ 99021 -144971 180539 181235 -87856 2388 182066 41899 -23135 138617 -73978 108101
19003C4108i7737G2387k785K8879c4866J2218j40153A75831j0035b28175f3177
$$ 34108 -97737 72387 69602 98481 -34866 -22648 -162801 175831 165796 -228175 -63177
18991b74415B02560b375k96243G5311j5884Q2534J8991a99177j01046C1777c71798
$$ -274415 202560 -2375 -298618 75311 59427 141961 160952 -199177 -300223 31777 -371798
18979a0524k42276A43528d03900E4546f2543j32713k1809N0166e3366C3943j4630
$$ -10524 -252800 143528 -403900 54546 -62543 -195256 -217065 -166899 -53366 33943 19313
18968A9313g6119J6275k9382j70815j26496a4779k30066n34b4790j35962I8775
$$ 19313 -76119 -59844 -89226 -260041 -386537 -14779 -244845 -245379 -24790 -160752 98775
18956a44379B6275P8738A0781c44821J34051A32046a2648l1825H0631A5656f6050
$$ -144379 26275 105013 10781 -344821 -210770 132046 -12648 -44473 80631 15656 -66050
18944i6688c5006j17570k41646a65116L0827c0124a4133j45990k44594e803E1326
$$ -96688 -35006 -152576 -394222 -165116 -134289 -30124 -14133 -160123 -404717 -5803 51326
18932B8482a65303B09201c6796A03647g6794A37874c27884B49199B2603N8123
$$ 28482 -165303 209201 -36796 103647 -76794 137874 -327884 249199 22603 80726
18922H0726a41400I7159r514I057g4767k13109O1419C0754Q2850a47460C04248
$$ 80726 -141400 97159 87645 9057 -74767 -287876 -226457 30754 113604 -147460 304248
18910b24135O7598L2560F0454a63460H5688a48774p5385A52159c9715C12474b388
$$ -224135 -156537 -123977 60454 -163460 85688 -148774 -224159 152159 -39715 312474 -2388
18898a76477A99229a39614n2834g469k98944a04496h923q2762j21760b8620G5446
$$ -176477 199229 -139614 -192448 -7469 -306413 -104496 -8923 -91685 -213445 -28620 75446
18886e4715k64574h6023p1429A89726c78375J21081D9742c1890k54498A89609
$$ -54715 -319289 -86023 -157452 189726 -378375 -257294 49742 -31890 -286388 189609
18875a31426A04920k8095a11236B4858Q3721a32824k28490F6809e5619k07859
$$ -131426 104920 76825 -111236 24858 108579 -132824 -361314 66809 -55619 -263478
18865b63478r6626a11600A34985J7429E5241J08572b03246j54205A04886j5480
$$ -263478 -360104 -111600 134985 152414 55241 163813 -203246 -357451 104886 89406
18855H9406N0149h3901m6895A8189e1524j62584d2429p060D3078i7312B249e1916
$$ 89406 139555 -83901 -130796 18189 -51524 -214108 -42429 -49489 43078 -97312 2249 -51916
18842I4700m2061M3699a37576O4646b2461j06574M2140c9179j25620B13483I7392
$$ 94700 52639 96338 -137576 -72930 -22461 -129035 -86895 -39179 -164799 213483 97392
18830c8462B5927a54261L3844A3931a6242k48532o4122M7442a23001K6180m8296
$$ -38462 25927 -154261 -120417 13931 -16242 -264774 -328896 -281454 -123001 -96821 -145117
18819a45117A42362c0085k45502C43499B6903d2905h791n3044A40886b89005a0739
$$ -145117 142362 -30085 -275587 343499 26903 -42905 -8791 -61835 140886 -289005 -10739
18807A92906H8771a6719A36583h4672L2073n8936B84959n3624c07643d0035A13679
$$ 192906 88771 -16719 136583 -84672 -52599 -111535 284959 231335 -307643 -40035 113679
18795B26605a62276B08558A4927J10191a35422A66690o7877Q8885i9540j74894
$$ 226605 -162276 208558 14927 125118 -135422 166690 98813 187698 -99540 -274434
18785b74434D5258a17220q1689M1260q2627J01658B52279b35440H2573c5030q9552
$$ -274434 45258 -117220 -198909 -157649 -240276 -138618 252279 -235440 82573 -35030 -124582
18774a24582M3034R848F3380J1251a25556H8806J44179c56302F7006a98511g1691
$$ -124582 -81548 -71700 63380 74631 -125556 88806 232985 -356302 67006 -198511 -71691
18762b06464g1227A118J81725a62418B09284I0640a93835B08620c35416F5994
$$ -206464 -71227 1118 182843 -162418 209284 90640 -193835 208620 -335416 65994
18751A38324m6052L46821e75494A25514e4017D7020a89408P1375j36030G3084
$$ 138324 92272 439093 -575494 125514 -54017 47020 -189408 -118033 -254063 73084
18740b28913a5818B32800i5900A579f9796k03962E0559b43464d8084j30984D217
$$ -228913 -15818 232800 -95900 1579 -69796 -273758 50559 -243464 -48084 -179068 4217
18728c27675A12348K5844g4839q2677a5838B88903g1747l6336A67400N2778b79062
$$ -327675 112348 138192 -74839 -157516 -15838 288903 -71747 -108083 167400 220178 -279062
18716a21206k53096J06479A83301e9391n5324b1081k26128P1783g4585k71818
$$ -121206 -374302 -267823 183301 -59391 -114715 -21081 -247209 -175426 -74585 -346403
18706c46403d4782a2768A09711b67308A10625a86826j1950N7813b5943C21476
$$ -346403 -44782 -12768 109711 -267308 110625 -186826 -198776 -140963 -25943 321476
18695e4026p6394m2091k11116L9086B98586j13052R3192a54727r2032J22976E8915
$$ -54026 -130420 -172511 -383627 -344541 298586 185534 278726 -154727 -246759 -123783 58915
18683e9382E3774J2795d7544j36428Q646b8738E3856c22812i9814D7460J79224
$$ -59382 53774 66569 -47544 -183972 -175326 -28738 53856 -322812 -99814 47460 226684
18672B26684b2335j69946j32410h841B69054a06027j1164j93252d531l15137A35178
$$ 226684 -22335 -192281 -324691 -8841 269054 -106027 -117191 -310443 -4531 -319668 135178
18660A96742l7992o2805a51066C3973K34943a72650A69519A9162i3026j78343
$$ 196742 158750 95945 -151066 33973 268916 -172650 169519 19162 -93026 -271369
18650b71369g6442j19786A23490i039j31718N5868d41A69017a52600A33066c28419
$$ -271369 -76442 -196228 123490 -9039 -140757 -84889 -441 169017 -152600 133066 -328419
18638b04358K6104D8186N7028M7798C7729h408j43577h857n22536J82192a25932
$$ -204358 -178254 48186 105214 153012 37729 -8408 -151985 -8857 -531393 -349201 -125932
18626d6356C34334A9334a0735A47906b16044J9512j71765A17221a68286j73198
$$ -46356 334334 19334 -10735 147906 -216044 -196532 -368297 117221 -168286 -341484
18616c41484B40767p045a16279I1783B1069R219a3655D28670e7861C3164d792
$$ -341484 240767 233722 -116279 91783 21069 30288 -13655 428670 -57861 33164 -4792
18604A49658j5319a07402A84143e1597l8914B7642c60257J16700n2715i013A0858
$$ 149658 134339 -107402 184143 -51597 -90511 27642 -360257 -243557 -296272 -9013 10858
18592A47860E8990a04174k32689m6363J90909i362A08840b9379j1901k46758J24962
$$ 147860 58990 -104174 -336863 -383226 -192317 -9362 108840 -29379 -41280 -288038 -163076
18581a63076H5322Q4432a63303B0703b17417K1885R0463M172N400k47203c9841
$$ -163076 85322 169754 -163303 20703 -217417 -195532 -105069 -100897 -95497 -342700 -39841
18569a82077j51349D4006b98885J9758g2909F8854c8698B9433N0992c6582A22499
$$ -182077 -333426 44006 -298885 -279127 -72909 68854 -38698 29433 80425 -36582 122499
18557c11184F9414a5176A92968A4932K0502j6311c14558A44333d2235F7150J22977
$$ -311184 69414 -15176 192968 14932 35434 19123 -314558 144333 -42235 67150 190127
18546A90127B926K52085b00391e9408q4038K5456B5868J56277a64793D1770E684
$$ 190127 2926 255011 -200391 -59408 -143446 -117990 25868 182145 -164793 41770 5684
18534b89721a12587q6865M9828j43836Q0283f7048K9364j3716C90784F0049K05071
$$ -289721 -112587 -199452 -149624 -293460 -213177 -67048 -37684 -51400 390784 60049 265120
18523B65120a71467E2436d3038B55418c859k54607c4160j3711j20398r1907A09229
$$ 265120 -171467 52436 -43038 255418 -3859 -258466 -34160 -47871 -168269 -260176 109229
18511a87752f560k22947A42057a0816I0996C3054d44438c6725B24027f559k15233
$$ -187752 -6560 -229507 142057 -10816 90996 33054 -444438 -36725 224027 -6559 -221792
18500b21792A08335J58208b61738C846K84851A39328m9074d84142c2126l0937
$$ -221792 108335 266543 -261738 3846 288697 139328 90254 -484142 -32126 -63063
18490f3063A54532J77676b13462K8209L2644D6720J68977H536J77184p3184K8872
$$ -63063 154532 332208 -213462 -185253 -152609 46720 215697 8536 185720 112536 141408
18479A41408K03807j67937b92516b9213j18386E6549a99613Q9033a5594n9581
$$ 141408 345215 177278 -292516 -29213 -147599 56549 -199613 -110580 -15594 -75175
18469g5175F6883b34518A41623A9393b4192B34212b48930J2387B25147a2992k09198
$$ -75175 66883 -234518 141623 19393 -24192 234212 -248930 -236543 225147 -12992 -222190
18458b22190d2835c603I8729e4861k11368D8177J15340b83931q8870a46218o7900
$$ -222190 -42835 -3603 98729 -54861 -266229 48177 163517 -283931 -372801 -146218 -214118
18447b14118O5080M042j59871J24562r760E3079R6612j9436R2129r4362g0813
$$ -214118 -149038 -144996 -304867 -180305 -190065 53079 149691 130255 222384 128022 -70813
18435A02111J96654A32434E0317b59894g7760b2669A11899c9305k22244g9806
$$ 102111 298765 132434 50317 -259894 -77760 -22669 111899 -39305 -261549 -79806
18424d69233B41985a7694k88781a09183j68942G0169M7513d08592F8890b08130
$$ -469233 241985 -17694 -306475 -109183 -278125 70169 117682 -408592 68890 -208130
18413I4088c51546C89664d3727l88283H2179a04321A49076b00757A99985d9148
$$ 94088 -351546 389664 -43727 -432010 82179 -104321 149076 -200757 199985 -49148
18402A0021a17193j82457f9997b8479k20530B72531d330q7753k3230D13012F4277
$$ 10021 -117193 -299650 -69997 -28479 -249009 272531 -4330 -92083 -115313 413012 64277
18390B0453M9307K7249c6796r1503j42776h4695A02052a01317B24708A4491a87287
$$ 20453 69760 97009 -36796 -128299 -271075 -84695 102052 -101317 224708 14491 -187287
18378f7891j99381B23676a40884B7699J9700b45113A50207j8318L0396k7205b54931
$$ -67891 -267272 223676 -140884 27699 47399 -245113 150207 131889 162285 135080 -254931
18366e1194A5490a10151L5320a3860B99842c0894A43189e6236j31748b6510j2951
$$ -51194 15490 -110151 -74831 -13860 299842 -30894 143189 -56236 -187984 -26510 -39461
18355c9461j89034P0532n517j10477f69A42843c106B30769N740f0973j01627A39634
$$ -39461 -228495 -157963 -163480 -273957 -669 142843 -3106 230769 236509 -60973 -162600 139634
18342A7390a09005D1712b13601e7022K2722J4052j81493B80093A09137b31123
$$ 17390 -109005 41712 -213601 -57022 -34300 -20248 -201741 280093 109137 -231123
18331D3519J77489j6487C7134b05171G0989c10243J48788A55128j3524b45387
$$ 43519 221008 204521 37134 -205171 70989 -310243 -161455 155128 141604 -245387
18320B00753b12007M5845o0390a3439B8878b66385A05197a21796D8412K85785
$$ 200753 -212007 -166162 -226552 -13439 28878 -266385 105197 -121796 48412 334197
18310C34197A11933h9258q890A58287N0795d7637B03842d15079D6007K4690a07114
$$ 334197 111933 -89258 -98148 158287 209082 -47637 203842 -415079 46007 70697 -107114
18298h826F9743K793O5010a7874l44669i5742A6649J00147D4958b1839n3155C4328
$$ -8826 69743 72536 137546 -17874 -362543 -95742 16649 116796 44958 -21839 -74994 34328
18285a85607A54516P9017a97977A01653B4277J47501p9471a57324i058C14844
$$ -185607 154516 233533 -197977 101653 24277 171778 92307 -157324 -9058 314844
18274a03169H7502L48227h3898C7136e3796j83379R0066C03148j21019J5704K90577
$$ -103169 87502 435729 -83898 37136 -53796 -237175 -147109 303148 182129 197833 488410
18263D88410b02003B8576b40881N1573j06667g8300j17743a889j03841l21380
$$ 488410 -202003 28576 -240881 -189308 -295975 -78300 -196043 -1889 -105730 -427110
18253d27110l6680D44725e2552A56515J695f8494C79995i6357B37784E0528d952
$$ -427110 -463790 444725 -52552 156515 158210 -68494 379995 -96357 237784 50528 -4952
18241A6194E476c66189B9075a69875p6105C33138a96139A46078m5810h74j11029
$$ 16194 5476 -366189 29075 -169875 -245980 333138 -196139 146078 100268 -874 -111903
18230a11903j72892g1487r1266e0177a0099B01639c95872b8276o963k14227A91306
$$ -111903 -284795 -71487 -162753 -50177 -10099 201639 -395872 -28276 -35239 -249466 191306
18218I9321j0153J88291M2445j45913m6264c45174C40036H5287c25378a06331
$$ 99321 89168 277459 319904 173991 127727 -345174 340036 85287 -325378 -106331
18207b60500H5165A0182a40655I9137e28517c6729A06177c43261G0942b2649A40853
$$ -260500 85165 10182 -140655 99137 -528517 -36729 106177 -343261 70942 -22649 140853
18195b43129B00656h8841l3106E1089a66926f3030j12500q68G7018a27388J941
$$ -243129 200656 -88841 -121947 51089 -166926 -63030 -175530 -176398 77018 -127388 -125447
18184a25447l5848N8561A41509D1650a54444C17639d51829B90457R040C0773b40689
$$ -125447 -161295 -102734 141509 41650 -154444 317639 -451829 290457 299497 30773 -240689
18172h5840K4637B75953d6274q7749M5397p0538B5160a41520c2697B4999L1952
$$ -85840 -61203 275953 -46274 -134023 -88626 -159164 25160 -141520 -32697 24999 56951
18161E6951K64139a68079B57791b55047n8936C63410c63145R4883h2084j31675
$$ 56951 321090 -168079 257791 -255047 -313983 363410 -363145 -268262 -82084 -213759
18151b13759f8707B0963a72669K4451A48650a28759j73375A58056G4509Q8533
$$ -213759 -68707 20963 -172669 -148218 148650 -128759 -302134 158056 74509 163042
18141A63042a14355b6172K194C35755g513k40917I0906j7657K33502n8084j7765
$$ 163042 -114355 -26172 -23978 335755 -7513 -248430 90906 73249 306751 248667 230902
18130B30902a51560g0148b1625B5521J55683D3725J9599c42884F8114p170c1087
$$ 230902 -151560 -70148 -21625 25521 181204 43725 63324 -342884 68114 60944 -31087
18118c7142j89459i3824N391l33011a22897B12080a86161A21361b34025B0700
$$ -37142 -226601 -93824 -88433 -421444 -122897 212080 -186161 121361 -234025 20700
18107B42983n1769b52629A3643a0544D1699i1782j85026G9295e5918j3191n08
$$ 242983 191214 -252629 13643 -10544 41699 -91782 -276808 79295 -55918 -69109 -69617
18096f9617a3582j96374c3844q9370l9918B34798a15885j76494j9761N5300A00364
$$ -69617 -13582 -209956 -33844 -123214 -163132 234798 -115885 -292379 -312140 -256840 100364
18084A27195m7832b32809E0876P0464h6359A01290a81287A55910a2029j29460
$$ 127195 79363 -232809 50876 121340 -86359 101290 -181287 155910 -12029 -141489
18074a41489A86264b14702p839F4297a5187B28403c678k00858b8684D5003e0443
$$ -141489 186264 -214702 -222541 64297 -15187 228403 -3678 -204536 -28684 45003 -50443
18062g1690k87089d2620j49593P9963B64573d7058k27431D1712a67761h227r8949
$$ -71690 -358779 -42620 -192213 -112250 264573 -47058 -274489 41712 -167761 -8227 -107176
18051a07176A28129F2976g5485K7497F0784c4867B06397Q054J14629a85356A29681
$$ -107176 128129 62976 -75485 -47988 60784 -34867 206397 214451 329080 -185356 129681
18039i1073A30295k7589a19584j00204P1693A0655K7877K07673a02817I0176e5433
$$ -91073 130295 102706 -119584 -219788 -148095 10655 38532 246205 -102817 90176 -55433
18027b7309k30608f3961I6354b32922C9932R4700e7521A67343d69316A60797a19991
$$ -27309 -257917 -63961 96354 -232922 39932 134632 -57521 167343 -469316 160797 -119991
18015b22417B71477A3114K526J41756e4369m16882E1588J63396j2524a83881d4482
$$ -222417 271477 13114 15640 157396 -54369 -471251 51588 214984 202460 -183881 -44482
18003a49694I0000O7995a32650n9133A98596F411b30568l0653n9588A21907g6669
$$ -149694 90000 157995 -132650 -191783 198596 6411 -230568 -261221 -320809 121907 -76669
17991G8365c9743a4666B29888J12774G1063J90265a84066j42566A14841a06804
$$ 78365 -39743 -14666 229888 342662 71063 261328 -184066 -326632 114841 -106804
17980a55702j8156N5775a7022k19438A60267a00830M1067l14018h2127A08333
$$ -155702 -173858 -118083 -17022 -236460 160267 -100830 -59763 -373781 -82127 108333
17969D1734a2590B39034E788e6371b3514A06690a08937j33089D3645d100j72188
$$ 41734 -12590 239034 5788 -56371 -23514 106690 -108937 -242026 43645 -4100 -176288
17958a76288N4858D3742a08372j42273g3588l7709j37473K3126G8093J96836b4362
$$ -176288 -121430 43742 -108372 -250645 -73588 -111297 -248770 -225644 78093 274929 -24362
17946E7615L3816a42293J3545h68l50803d4605l1453A3027a50613M3854D48061
$$ 57615 91431 -142293 -128748 -868 -351671 -44605 -76058 13027 -150613 -106759 448061
17934A03304m0808b16051E447J55587b96867I3025d4654k6738C0715J44814a79570
$$ 103304 62496 -216051 5447 161034 -296867 93025 -44654 -71392 30715 175529 -179570
17922A51079g6862m0799A4873K0640a73097q3346o412B81349M4335A24824B1791
$$ 151079 -76862 -117661 14873 35513 -173097 -256443 -262855 281349 325684 124824 21791
17910f991B21734J41024j78490b12270b1800L511m91998a99083M2669n667g7809
$$ -6991 221734 362758 184268 -212270 -21800 -18289 -510287 -199083 -156414 -162081 -77809
17898a9136C8445J91871o3312a39605j8985J1688A43501P4803F6202K87078a35911
$$ -19136 38445 230316 167004 -139605 -158590 -146902 143501 218304 66202 353280 -135911
17886G980a3326l97871e9314B33694G1271l1615f4451j24434G794c1699P140k45430
$$ 7980 -13326 -411197 -59314 233694 71271 39656 -64451 -188885 7794 -31699 -24559 -269989
17874b69989O4726G7150J7906k0759M3420a4596A32293J79091A2762c07913g2467
$$ -269989 -205263 77150 95056 74297 117717 -14596 132293 311384 12762 -307913 -72467
17862a11838e4258o5828B5751A2710a9312o0162A55018m2758J48612G3516R5933
$$ -111838 -54258 -120086 25751 12710 -19312 -79474 155018 112260 260872 73516 169449
17851A69449b37703i386A1312J17735J14443i350j78240P2450G5148L2932A7455
$$ 169449 -237703 -9386 11312 129047 243490 -9350 -187590 -115140 75148 108080 17455
17839b0404A0525c4945j28107A58055a24248C8323a95218A18084b43321j90429
$$ -20404 10525 -34945 -163052 158055 -124248 38323 -195218 118084 -243321 -433750
17829d33750J68540B02354J04822b93831B2273M8474a60579j0545j60289B14330
$$ -433750 -265210 202354 307176 -293831 22273 70747 -160579 -171124 -331413 214330
17818B63596c4747k72788d8047A63802p078b2608B37815f5049E21825C4612a04385
$$ 263596 -34747 -307535 -48047 163802 156724 -22608 237815 -65049 521825 34612 -104385
17806A20034P2055F7019N8765A7864f6095m2176D7959j4239a10492F4851L43401
$$ 120034 192089 67019 125784 17864 -66095 -108271 47959 33720 -110492 64851 408252
17795D08252a60763C773d0682G8542J23277e3264H5221d50756E4028R7714d7683
$$ 408252 -160763 3773 -40682 78542 201819 -53264 85221 -450756 54028 151742 -47683
17783a78928A10148m9255K8192a28262j49737J03815M9638O0087M02C1013b41938
$$ -178928 110148 60893 89085 -128262 -277999 -174184 -124546 -64459 -64057 31013 -241938
17771A36195F3337N0966D6593L32134f8657K550j6175j36I6367a93920k72512
$$ 136195 63337 114303 46593 378727 -68657 -66107 -82282 -82418 96367 -193920 -466432
17760d66432M3098c4660j11564L8454A34455g0361p7745K2430a7485B20152a42460
$$ -466432 -423334 -34660 -146224 -107770 134455 -70361 -148106 -125676 -17485 220152 -142460
17748E42J7101J46303b58415I4938a99111f1743G8707a24801A5505e1223I9854
$$ 542 17643 163946 -258415 94938 -199111 -61743 78707 -124801 15505 -51223 99854
17736B55604a500p6312o3034B35220G0725m996a5661k29819J20180K107L081e7363
$$ 255604 -1500 -77812 -140846 235220 70725 65729 -15661 -245480 -125300 -123193 -120112 -57363
17723B31349j08526i662b331l1448e19B26769d9702B4811b30013F1191M8654Q8551
$$ 231349 122823 -9662 -2331 -33779 -519 226769 -49702 24811 -230013 61191 109845 198396
17711A98396a4489C03924c2116j50129Q2672E9330K75229a30349j45448A73195
$$ 198396 -14489 303924 -32116 -182245 -99573 59330 334559 -130349 -275797 173195
17700a70502k35208a6837k58248B16847N0229H2956p356L9468g9942A06664a10284
$$ -170502 -405710 -16837 -275085 216847 267076 82956 75600 115068 -79942 106664 -110284
17688b02474d1071B98332K4715a83207h439A53712a18183j03700D4734K13597
$$ -202474 -41071 298332 323047 -183207 -8439 153712 -118183 -221883 44734 258331
17678B58331E1538J15720Ki9386j04989B45580a02115r870n7061A61188b1098
$$ 258331 51538 167258 167260 -99386 -204375 245580 -102115 -111985 -169046 161188 -21098
17666B05009L39205h8133r1229B00909m8066M8137C9366f6216H85J87383D7269
$$ 205009 544214 -88133 -179362 200909 152843 200980 39366 -66216 885 188268 47269
17654A57875a700A55359o2743J4492N2522j1530b21795A83877b55834G6222J2422
$$ 157875 -1700 155359 92616 107108 159630 148100 -221795 183877 -255834 76222 88644
17643H8644J8170a88864C4171M7008K13970K6898h6592k2012l72736A29794K13279
$$ 88644 106814 -188864 34171 81179 295149 322047 -86592 -108604 -481340 129794 343073
17632C43073o6601d2384A56554b85543A44967A8068a05018A06777b22573g3342
$$ 343073 276472 -42384 156554 -285543 144967 18068 -105018 106777 -222573 -73342
17621f6025B27565b01982A52905f6523B31884j00368m7555A9642E49P5737a27012
$$ -66025 227565 -201982 152905 -66523 231884 131516 83961 19642 549 76286 -127012
17609c8567N806j72773A05470N772k4237A0933b0670B99008H7199A9249K75341
$$ -38567 -32761 -205534 105470 111242 87005 10933 -20670 299008 87199 19249 294590
17598B94590A31350N8754b15141h5285M635B8671a03025m2095l25508B4112R387
$$ 294590 131350 190104 -215141 -85285 -80650 28671 -103025 -145120 -470628 24112 33499
17587C3499a6480G4080a13842A87063D5379a4801F1615i0608K8327B288K21347
$$ 33499 -16480 74080 -113842 187063 45379 -14801 61615 -90608 -62281 2288 223635
17576B23635G7633M6518K47458I7529G869a325A04396K5345j4477C8954P9401
$$ 223635 77633 124151 371609 97529 7869 -1325 104396 129741 115264 38954 118355
17565A18355b36253H6382J7938b5202l19592H1644B9954a01815E4215K12628a74216
$$ 118355 -236253 86382 104320 -25202 -344794 81644 29954 -101815 54215 266843 -174216
17553A92342o9828O757J22043N3670A8352J14168J3663c17430D57972j63504b8921
$$ 192342 122514 129271 251314 304984 18352 132520 146183 -317430 457972 294468 -28921
17541a20345G5231C5642a42651A04847f9524R367C8418O6560d2779A48044J47614
$$ -120345 75231 35642 -142651 104847 -69524 -60157 38418 104978 -42779 148044 295658
17530B95658a01907p4473F2002L61546B05485b08402R4328D89257c58412H7793
$$ 295658 -101907 -176380 62002 423548 205485 -208402 -114074 489257 -358412 87793
17519A40886a17864C08317D3624J64753A03822N914C0717K23263I2910c9977A30962
$$ 140886 -117864 308317 43624 208377 103822 109736 30717 253980 92910 -39977 130962
17507i6030L9731I7809K2441a70255f2424B69205j03975L2024H7661Q9756a39747
$$ -96030 -56299 97809 120250 -170255 -62424 269205 165230 197254 87661 177417 -139747
17495a37539r1164B90739A09693J45650a98211A69553B9769J0822e3819A16828
$$ -137539 -228703 290739 109693 255343 -198211 169553 29769 40591 -53819 116828
17484B05099c6651B52626a76923P6854A34069a07580H3221Q9920K04973B6430
$$ 205099 -36651 252626 -176923 -100069 134069 -107580 83221 173141 378114 26430
17473C98567A51865J07236a97314c6423D99834A72573h657p102A72824J4474J5003
$$ 398567 151865 259101 -197314 -36423 499834 172573 -8657 -15759 172824 187298 202301
17462B02301k9059F5343A0154D841c94895d8229B5680J83676l9665c0401A83885
$$ 202301 173242 65343 10154 4841 -394895 -48229 25680 209356 169691 -30401 183885
17450d49114C6925O4503J37936j4991b071n5545C8365L3823c3490A1440a53577
$$ -449114 36925 101428 239364 224373 -2071 -57616 38365 72188 -33490 11440 -153577
17438c23232B01610n6352J36738Q0762B3194L58104m5963d3626k1037D8316b034
$$ -323232 201610 145258 281996 362758 23194 381298 335335 -43626 -64663 48316 -2034
17426b950l6204l7095A27141a29693H9423K78656g4343B82177n0940n0055H2306
$$ -2950 -39154 -76249 127141 -129693 89423 368079 -74343 282177 231237 181182 82306
17414A32775L62045k26165A474h8278C88847b95139H0655J59324j0245j07091
$$ 132775 494820 268655 1474 -88278 388847 -295139 80655 239979 229734 122643
17404A22643J33783i9593A31678M03233d980A84593M5274h1840B66173K57384
$$ 122643 256426 -99593 131678 534911 -4980 184593 229867 -81840 266173 523557
17394E23557k52006c3241C83276j08607A20061j4195b5929A36832N1862a08314
$$ 523557 271551 -33241 383276 274669 120061 105866 -25929 136832 188694 -108314
17383B67503Q4944a79906C15398q3402q8746O6848J25262C878M1314O462J28419
$$ 267503 352447 -179906 315398 231996 143250 210098 335360 3878 45192 51654 180073
17372A80073l7246g9743C1567K05397j06637J18338H1003j1356J22260R3732J21155
$$ 180073 142827 -79743 31567 236964 130327 248665 81003 69647 191907 285639 406794
17361D06794j47369a38395B09147j2404e2675A74549F4436J08075M584p1535K50133
$$ 406794 259425 -138395 209147 196743 -52675 174549 64436 172511 177095 105560 355693
17350C55693A03322J10517d2616A45509K2180n8511K87837A03403q420M84296
$$ 355693 103322 213839 -42616 145509 167689 109178 397015 103403 94983 579279
17340E79279a35055A0934K80144o3706G7579L0191M0263P0954N7107F0963e5465
$$ 579279 -135055 10934 291078 227372 77579 107770 148033 218987 276094 60963 -55465
17328A42407J08419P280F8686j9264R4729R9229A8649f5481r129C30010H1526
$$ 142407 250826 258106 68686 49422 144151 243380 18649 -65481 -74610 330010 81526
17316D22966j49798A15355C1256J86675o8055a166E18307d5231C6925a04543A86869
$$ 422966 273168 115355 31256 217931 149876 -1166 518307 -45231 36925 -104543 186869
17304A91226G5579J1070g7014B40246J13562K0541b67212D1614b17230k20607
$$ 191226 75579 86649 -77014 240246 353808 374349 -267212 41614 -217230 -437837
17294d37837B20928L72c4805A98462M5275g075d48D31346b12917A74537J21251
$$ -437837 220928 221300 -34805 198462 243737 -7075 -448 431346 -212917 174537 295788
17283B95788K6267q5828G1286Q9207A1891J53610A2661J40093J09075b05102B92792
$$ 295788 322055 236227 71286 160493 11891 165501 12661 152754 261829 -205102 292792
17271A87628E4331J3296f0482n6040M5017B03805J16642B8939j3478K29760C5148
$$ 187628 54331 67627 -60482 -116522 -71505 203805 320447 28939 15461 245221 35148
17259A79981a07719B46618H019L92492b15202B55110I7240K58364G6542L37891
$$ 179981 -107719 246618 8019 400511 -215202 255110 97240 355604 76542 414433
17249D14433b19311A99518K75366a01460D1746J97335b04108I6392l2679K9531
$$ 414433 -219311 199518 474884 -101460 41746 239081 -204108 96392 63713 93244
17239I3244N9866J20304B794O8058J31762a14956C09232F5876c9856C38420j13774
$$ 93244 153110 273414 2794 70852 202614 -114956 309232 65876 -39856 338420 224646
17228B24646g3481j40929E30939d3899D26883L8258j31635m9326J37078j55999
$$ 224646 -73481 -214410 530939 -43899 426883 465141 333506 284180 421258 265259
17218B65259p8248H8347Q4201E1634J59934J26139j34855q7323K64119j47448
$$ 265259 187011 88347 172548 51634 211568 337707 202852 115529 379648 232200
17208B32200J29931A47664F3766K72010A55224o8656b5177B9614L14205F949L03457
$$ 232200 362131 147664 63766 335776 155224 86568 -25177 29614 343819 6949 310406
17197C10406j28633k1618J11617R8581d3607D38839j89282B3508Q8653J08606
$$ 310406 181773 160155 271772 370353 -43607 438839 249557 23508 112161 220767
17187B20767b51320D08298j16630B0952L51649e2839A86272L1435J73350p7563
$$ 220767 -251320 408298 291668 20952 372601 -52839 186272 217707 391057 313494
17177C13494J05508j51510M2878J25772j55681l2587K64253B20963f427A694J30970
$$ 313494 419002 267492 310370 436142 280461 247874 512127 220963 -6427 1694 132664
17166A32664O4255O6011J50713r2845A15329M8485N9197o334r6885K5843R233
$$ 132664 196919 262930 413643 320798 115329 163814 223011 216677 119792 145635 154868
17155A54868p2450B2175J89292d5447G6381N74925a03258B537L61497j65350L19503
$$ 154868 82418 22175 211467 -45447 76381 651306 -103258 2537 364034 198684 518187
17144E18187k13204K8762l7764O9895K39101B39704J92763p2373q5091J42934
$$ 518187 304983 333745 295981 365876 604977 239704 432467 360094 275003 417937
17134D17937E1810P9350J95648K21794B58828j10856M17009j73149J8236A09559
$$ 417937 51810 131160 326808 548602 258828 147972 564981 391832 410068 109559
17123D35733l2868B4357O4506J21765J1194P6856J68089A32782J39123r7380L49159
$$ 435733 402865 24357 88863 210628 221822 298678 466767 132782 271905 174525 523684
17112E23684k52654j3504K72752k22391J51876F9604M86558O7827B97234n6215
$$ 523684 271030 257526 530278 307887 459763 69604 556162 623989 297234 241019
17102B41019J57209o1545j27427J71349L40243L1577B13317J87473p2990j23345
$$ 241019 398228 336683 209256 380605 720848 752425 213317 400790 327800 204455
17092B04455J76056m4270F7517K16944J89534A44428o7879K21163J49389r6282
$$ 204455 380511 336241 67517 284461 473995 144428 76549 297712 447101 350819
17082C50819J76983j86602J57282j05713n4975J851k5492J62885B22577J43614
$$ 350819 527802 341200 498482 392769 337794 339645 314153 477038 222577 366191
17072C66191J42732j96683o4865N05718p1623j80272j13978A52788L27854J26457
$$ 366191 508923 312240 247375 753093 681470 501198 387220 152788 480642 607099
17062F07099j38734b6303E37082j7104k10448J45825j08461K34404J57418q360
$$ 607099 468365 -26303 537082 519978 309530 455355 346894 581298 738716 730356
17052G30356C29582M02405j99891j02545P2084k49176L16175K3235J8913n1328
$$ 730356 329582 731987 532096 429551 501635 252459 568634 591869 610782 559454
17042E59454j73276q0656K22371p5608O0510J27213j58416l2619m0896J0899J05770
$$ 559454 386178 305522 527893 452285 512795 640008 481592 448973 408077 418976 524746
17031E24746J72697B37915K40521j62023L69610j27785j24981J5142j5068J29337
$$ 524746 697443 237915 478436 316413 686023 558238 433257 448399 433331 562668
17021E62668j68245J01745O4328L15499k45109J71957l89284J20471P3433r3674
$$ 562668 394423 496168 560496 875995 630886 802843 413559 534030 607463 513789
17011E13789K00350K06263C73350m2298K59297j02990A90985O25397N76k334K20066
$$ 513789 714139 920402 373350 331052 590349 487359 190985 816382 816958 814624 1034690
17000A034690l71376o8851k00512K25447j13948L259L26436k94018L7545j75246
$$ 1034690 663314 594463 393951 619398 505450 508709 835145 541127 578672 403426
16990D03426M10871J26736k51690P7841N1043j19898o2618j19878L34953j30844
$$ 403426 814297 941033 689343 767184 818227 698329 635711 515833 850786 719942
16980G19942L5856N179n1264K60471m05567L99989l53773L68482J1152j26739
$$ 719942 755798 760977 709713 970184 564617 964606 610833 979315 990467 863728
16970H63728l54491L81629K41571k37332j74014K28679k74304O9227K99466l95669
$$ 863728 509237 890866 1132437 895105 721091 949770 675466 744693 1044159 648490
16960F48490J1784k3908N65257m25357M02506l79801J89401j58512J09181n873
$$ 648490 660274 636366 1201623 776266 1178772 798971 988372 829860 939041 933168
16950I33168k49664K60002j74615J04037M00553m06342K23490J5749k88898K18489
$$ 933168 683504 943506 768891 872928 1273481 867139 1090629 1106378 817480 1035969
16940A035969m26254M95683l8892M1674k72161L00621O773m3029P4915k54882
$$ 1035969 609715 1105398 1066506 1108180 836019 1136640 1143413 1100384 1175299 920417
16930I20417N9706K21836l339J78544J26034m21934K7863K69197j67620r328O256
$$ 920417 980123 1201959 1198620 1377164 1503198 1081264 1109127 1378324 1210704 1201376 1207632
16919A207632K68860j30382k61282K04080j85773j24641K97311l67149K14851
$$ 1207632 1476492 1346110 1084828 1288908 1103135 978494 1275805 908656 1123507
16910A123507Q1666R7859K84048l60916K99060J5897J22298n65651J29226Q6942
$$ 1123507 1205173 1303032 1587080 1226164 1525224 1541121 1663419 1097768 1226994 1313936
16900A313936j12931J54028K18636J02023l26504L71865k71809L8860j83692J29942
$$ 1313936 1201005 1355033 1573669 1675692 1349188 1721053 1449244 1488104 1304412 1434354
16890A434354M26498l44896P0230L48607k13333J69161Q0709L2107k30726M1254
$$ 1434354 1860852 1515956 1586186 1934793 1721460 1890621 1971330 2003437 1772711 1813965
16880A813965K07679l43066O3386k1955J80169J0243k07260N27279k59059L6944
$$ 1813965 2021644 1678578 1741964 1720009 1900178 1910421 1703161 2230440 1971381 2008325
16870B008325J60646j53644J07866k50464L49837k04781J72363k1880J4878K38701
$$ 2008325 2168971 2015327 2123193 1872729 2222566 2017785 2190148 2168268 2183146 2421847
16860B421847J25465j58609J25161l48618L81837q9634L55192j67719l5833R7060
$$ 2421847 2547312 2388703 2513864 2165246 2547083 2457449 2812641 2644922 2609089 2706149
16850B706149K18791j4347L6977J86369n0605l66456J39367Q2555j1308q763L03163
$$ 2706149 2924940 2910593 2947570 3133939 3083334 2716878 2856245 2938800 2927492 2918729 3221892
16839C221892Q8100l73368k7625J6177L66163J3531r3044M06981p458j94672J18131
$$ 3221892 3309992 2936624 2908999 2925176 3291339 3304870 3211826 3618807 3611349 3416677 3534808
16828C534808K12905M5144K48533J35351J12206l54078P0306K45694K34033l81989
$$ 3534808 3747713 3792857 4041390 4176741 4288947 3934869 4005175 4250869 4484902 4102913
16818D102913J73007L17224q3650K00277q4115J53013q966L14851K06952J9234
$$ 4102913 4275920 4593144 4509494 4709771 4625656 4778669 4769703 5084554 5291506 5310740
16808E310740L2735n933L96561n6049J02175J14328j62137J08959L81960J36415
$$ 5310740 5343475 5337542 5734103 5678054 5780229 5894557 5732420 5841379 6223339 6359754
16798F359754j04801L52580J59205M57632j49490J91470J11372K73373P874J72825
$$ 6359754 6254953 6607533 6766738 7224370 7074880 7266350 7377722 7651095 7658969 7831794
16788G831794K01398L34058M09811R8044K72558P2919J90968J00383N48758l7795
$$ 7831794 8033192 8367250 8777061 8875105 9147663 9220582 9411550 9511933 10060691 10022896
16778A0022896M81081J76080R6569L23455L51968L17952M47443L34582K44512
$$ 10022896 10503977 10680057 10776626 11100081 11452049 11770001 12217444 12552026 12796538
16769A2796538K91797O55454M64330P80930n1087P65696L67738N36973O50332
$$ 12796538 13088335 13743789 14208119 14989049 14937962 15703658 16071396 16608369 17258701
16760A7258701O21227K92275P63721O47478Q25389P70087Q26474J107523N76154
$$ 17258701 17879928 18172203 18935924 19583402 20408791 21178878 22005352 23112875 23689029
16751B3689029J000258P21514J247825J189386J118808J201503J204016J375348
$$ 23689029 24689287 25410801 26658626 27848012 28966820 30168323 31372339 32747687
16743C2747687J649883J712742J369810J897350J645842K683649J745431K094724
$$ 32747687 34397570 36110312 37480122 39377472 41023314 43706963 45452394 47547118
16735D7547118K691494K577148K951650L023782L140034L282617L672486L770204
$$ 47547118 50238612 52815760 55767410 58791192 61931226 65213843 68886329 72656533
16727G2656533L980262M426073M638774M987832M866597N389392N490586N599664
$$ 72656533 76636795 81062868 85701642 90689474 95556071 100945463 106436049 112035713
16719A12035713N915757O373897N882199N950924O240989N444298N707757N176725
$$ 112035713 117951470 124325367 130207566 136158490 142399479 147843777 153551534 158728259
16711A58728259M409139L931770L498441K319052J495143L42156l10028j295944
$$ 158728259 163137398 167069168 170567609 172886661 174381804 174723960 174413932 173117988
16703A73117988k523418l157099m296707m323698n262330n647115o380373n831688
$$ 173117988 170594570 167437471 163140764 158817066 153554736 147907621 141527248 135695560
16695A35695560o413645o279696n978177o031571n728279n452781n839182m849117
$$ 135695560 129281915 123002219 117024042 110992471 105264192 99811411 93972229 89123112
16687H9123112n210045m428887m190688m360903l669169l914570l600793k714243
$$ 89123112 83913067 79484180 75293492 70932589 67263420 63348850 59748057 57033814
16679E7033814l065565k850739k483432k656159k165322k270968j690157k191002
$$ 57033814 53968249 51117510 48634078 45977919 43812597 41541629 39851472 37660470
16671C7660470k023453j125082j384649j852004r88129j468663j743152p83002
$$ 37660470 35637017 34511935 33127286 31275282 30287153 28818490 27075338 26292336
16663B6292336j010185q66743r64108j451305o01028p46263p43510q21850n98006
$$ 26292336 25282151 24415408 23451300 21999995 21398967 20652704 19909194 19087344 18489338
16654A8489338m4552j313895o96499m41528j70801j026208j06401r03976j37550
$$ 18489338 18444786 17130891 16434392 15992864 15822063 14795855 14689454 13785478 13647928
16645A3647928p31805o5020m72900m26299m57423k21327n93863m00148K92319
$$ 13647928 12916123 12851103 12378203 11951904 11494481 11273154 10679291 10279143 10571462
16636A0571462m57283N4020q76762J23981n91156Q754j99263m54332J66011m42833
$$ 10571462 10114179 10168199 9291437 9415418 8824262 8833016 8633753 8179421 8345432 7902599
16626G902599o05640J39490J4036k51882m40913L93865m60965j37234k37273k48804
$$ 7902599 7296959 7436449 7450485 7198603 6757690 7151555 6690590 6553356 6316083 6067279
16616F067279k438j17825j85492O5816k5453k74712k46898J51187l34984j2399
$$ 6067279 6064841 5947016 5761524 5827340 5801887 5527175 5280277 5431464 5096480 5084081
16606E084081o2882l00273Q4041j78877k10815j85852K44871k69872k11009j34455
$$ 5084081 5021199 4720926 4804967 4626090 4415275 4229423 4474294 4204422 3993413 3858958
16596C858958K76830j4971l97927J38997j30772L22872n07713O9907q6930k48870
$$ 3858958 4135788 4120817 3722890 3861887 3731115 4053987 3546274 3616181 3529251 3280381
16586C280381K75543l18514N9340K0038l75747K18020J63302n6134Q2711k89838
$$ 3280381 3555924 3237410 3296750 3316788 2941041 3159061 3322363 3266229 3348940 3059102
16576C059102k58600n463j9958k41120J70789j95599m3477K81560j86717k00057
$$ 3059102 2800502 2795039 2775081 2533961 2704750 2509151 2465674 2747234 2560517 2360460
16566B360460K05548l22072j70864M35209Q6666m42600J98326m7343j87592P484
$$ 2360460 2566008 2243936 2073072 2508281 2594947 2152347 2350673 2303330 2115738 2123222
16556B123222k89607K60993Q5846K50724m20237N446J22376m43734m4410j3245
$$ 2123222 1833615 2094608 2180454 2431178 2010941 2016387 2138763 1695029 1650619 1637374
16546A637374J24336K2780J57609J39233l13604m73574L24220J58370l3076K6935
$$ 1637374 1761710 1784490 1942099 2081332 1767728 1294154 1618374 1776744 1743668 1770603
16536A770603j83847j17652J41559l72255M35475j62659p1809L4273K5850k62709
$$ 1770603 1586756 1469104 1610663 1238408 1673883 1511224 1439415 1473688 1499538 1236829
16526A236829K75145j32593N4500j4593P5530j01515O4781j68280j54973J65807
$$ 1236829 1511974 1379381 1433881 1419288 1494818 1393303 1458084 1289804 1134831 1300638
16516A300638n4233k41799J32229O1423K10129j76583K33105l05159J43218p2168
$$ 1300638 1246405 1004606 1136835 1198258 1408387 1231804 1464909 1159750 1302968 1230800
16506A230800j03035J15023r8424m7461j56958K68309l45992L34899n9167J67263
$$ 1230800 1127765 1242788 1144364 1096903 939945 1208254 862262 1197161 1137994 1305257
16496A305257j99598k20274J95884o6573P9247j16967O1393k90140L13395N4569
$$ 1305257 1105659 885385 1081269 1014696 1093943 976976 1038369 748229 1061624 1116193
16486A116193j95750j6964q8094J50353m0717k31832L41174l67837j8420L55162
$$ 1116193 920443 903479 815385 965738 925021 693189 1034363 666526 648106 1003268
16476A003268j31650k87097q5861K11261J24920K3856J87254l14621L55270m60454
$$ 1003268 871618 584521 498660 709921 834841 858697 1045951 731330 1086600 626146
16466F26146K85390L8993m44621L26968k14301K32459l06620K01528j38794K08549
$$ 626146 911536 950529 505908 832876 618575 851034 544414 745942 607148 815697
16456H15697j49182o4221o5600j92972K17416J46798j87702O12406m83206l06134
$$ 815697 666515 602294 536694 343722 561138 707936 520234 1132640 649434 343300
16446C43300L71519r6275J07804j59252m4029B57460M54232k66775K11909J05715
$$ 343300 714819 618544 726348 567096 523067 257460 711692 444917 656826 762541
16436G62541k07693R6692j94032L90841C87046P5423K88291k64125r9489L73355
$$ 762541 554848 651540 457508 848349 387046 462469 750760 486635 387146 760501
16426G60501j82686q9198Q5536j55476O8089A57374L25702A91001L73355o6247
$$ 760501 577815 488617 574153 418677 486766 157374 483076 191001 564356 498109
16416D98109k36548J51964M9934R8746k11882A21416L48617J95178A74419K76954
$$ 498109 261561 413525 463459 562205 350323 121416 470033 665211 174419 451373
16406D51373K05642R6104B39401K12019o2187j03405J04390j64596H4725L30402
$$ 451373 657015 753119 239401 451420 389233 285828 390218 225622 84725 415127
16396D15127L22564J9801C72861j18915L8869K14847M8802n8933p1794J02593
$$ 415127 737691 757492 372861 253946 292815 507662 556464 497531 425737 528330
16386E28330q3592j39862J20033O7832m5953o0054j20232J91736J61459A36551
$$ 528330 444738 304876 424909 492741 446788 386734 266502 458238 619697 136551
16375D45104A92974K76098j82386m5185K88517j79790m3442A34413J67889j09012
$$ 445104 192974 469072 286686 241501 530018 350228 306786 134413 302302 193290
16365A93290P8654p829P3235J75222A87155J91925j12732j27708M13700G4865
$$ 193290 271944 264115 337350 512572 187155 379080 266348 138640 552340 74865
16354F04373A94550o8090P3222K1815L01760A3199a70783C41920A36423k4331
$$ 604373 194550 126460 199682 221497 523257 13199 -170783 341920 136423 112092
16344A12092J2497J65736J40098A93245o8404e370B42006J75926E582M34418I153
$$ 112092 124589 290325 430423 193245 124841 -5370 242006 417932 5582 440000 9153
16332g823D70181j46263L354j37037M5526j05141g633B00323J20850A20695a02770
$$ -7823 470181 323918 327272 190235 235761 130620 -7633 200323 321173 120695 -102770
16320A60020K96384b2331C74731j20226O3683B9557K71899q34I7647J51256G5063
$$ 160020 456404 -22331 374731 254505 318188 29557 301456 300622 97647 248903 75063
16308C30581n6726a93115C35827P8653a8176A22951k2456P1542d6789o2281C97235
$$ 330581 273855 -193115 335827 414480 -18176 122951 100495 172037 -46789 -109070 397235
16296A04851L83327A96194J64637A9458J87987f9510A36004m0932J9843f0493
$$ 104851 488178 196194 360831 19458 207445 -69510 136004 95072 114915 -60493
16285A17865K22336A4167L27779h6441B32543K10111j68532I8800R634K2234J49215
$$ 117865 340201 14167 341946 -86441 232543 442654 274122 98800 108434 130668 279883
16274B79883m888r9730F0007J31511N442f72B2788a27478A51832L6799m9067E8639
$$ 279883 274995 175265 60007 191518 196960 -672 22788 -127478 151832 188631 139564 58639
16261A37502c3151A21974J06750M0273a57576B48888K1247K03816A64800P4562
$$ 137502 -33151 121974 228724 268997 -157576 248888 270135 473951 164800 239362
16251B39362I9067M24507k41972j23916D3762A0524b1904A36723a50284J8041
$$ 239362 99067 523574 281602 157686 43762 10524 -21904 136723 -150284 -132243
16241a32243D96629A53096d17124d6602A66886J11075A26700N0144J80690a15736
$$ -132243 496629 153096 -417124 -46602 166886 277961 126700 176844 357534 -115736
16230A28661k6378J1636E0028i6316A53362L7440M1622A2389J26835J83026j11977
$$ 128661 102283 113919 50028 -96316 153362 190802 232424 12389 139224 322250 210273
16219B10273B4818M2792d1015C05516b13086C9007K51641c9378A41926J16414
$$ 210273 24818 67610 -41015 305516 -213086 39007 290648 -39378 141926 258340
16209B58340l0935D867L19512b26707C0715P9610l3996K14689Q8559i374B50252
$$ 258340 227405 4867 324379 -226707 30715 110325 76329 291018 379577 -9374 250252
16197a88858B03987a11371B09237m4292D1579a39528C20952b27805J02350I7279
$$ -188858 203987 -111371 209237 164945 41579 -139528 320952 -227805 -125455 97279
16186A26455J9641J87289a2915C9803c8922A77829P166a40021A27555l6043D5092
$$ 126455 146096 333385 -12915 39803 -38922 177829 184995 -140021 127555 91512 45092
16174h6275A09466d7582K1859j69243G5780k9993K83287a30752f4249B81937d9389
$$ -86275 109466 -47582 -25723 -194966 75780 45787 329074 -130752 -64249 281937 -49389
16162I8021J85419D0443K26881g5885j00759A38535M2392g9839j38509p9092a06474
$$ 98021 283440 40443 267324 -75885 -176644 138535 180927 -79839 -218348 -297440 -106474
16150a9108j65731j89164A87374a2023B05406C3801g2702m4530A08106R6617I608
$$ -19108 -184839 -374003 187374 -12023 205406 33801 -72702 -117232 108106 204723 9608
16138A97977C0982K30227j06639b18027D1067K64754i2790l0526j26285F8842
$$ 197977 30982 261209 154570 -218027 41067 305821 -92790 -123316 -249601 68842
16127F0049a93836m2771A54997o5583a18357q846k4403l5399f4133B1717B631
$$ 60049 -193836 -236607 154997 89414 -118357 -127203 -151606 -187005 -64133 21717 2631
16115a27816F816J77695J09690A15161L5474f981n7442F3731e5300C20177b27119
$$ -127816 6816 184511 294201 115161 150635 -6981 -64423 63731 -55300 320177 -227119
16103E4945M3661b13225q9893B6407f9789I6853A0021N6258b38874B4497b3429
$$ 54945 98606 -213225 -303118 26407 -69789 96853 10021 66279 -238874 24497 -23429
16091I7115a41433C2632M0648B1724d5707B3998A1793a36256B69773c3477C2780
$$ 97115 -141433 32632 73280 21724 -45707 23998 11793 -136256 269773 -33477 32780
16079a21101K8395A73061c58190R6263A83699H4774a97117M5251a7367j56438
$$ -121101 -92706 173061 -358190 -261927 183699 84774 -197117 -151866 -17367 -173805
16069a73805C2247g1302I9734d549G46a93915B3094Q9608a34823p2755c8472j58546
$$ -173805 32247 -71302 99734 -4549 746 -193915 23094 112702 -134823 -207578 -38472 -197018
16057a97018K1181M1533A3570K24243b61969G3635R3500n6217J0505K58493E2227
$$ -197018 -175837 -134304 13570 237813 -261969 73635 167135 110918 121423 379916 52227
16045e2567B11459j0467c6931k35050I3964c10801i5521o95p7525J8323B85815
$$ -52567 211459 200992 -36931 -271981 93964 -310801 -95521 -96216 -173741 -155418 285815
16033B7699L183b93356A5398K26066I4595c29623C23376q1027a47231j9215f0221
$$ 27699 30882 -293356 15398 241464 94595 -329623 323376 242349 -147231 -166446 -60221
16021a61664j08481h3912A96667i1505q710q127J8806r0459B96979d3793A99195
$$ -161664 -270145 -83912 196667 -91505 -100215 -108342 -89536 -179995 296979 -43793 199195
16009b7937k42650O4783C19338a98251a2582j11775B40447a17317g74j09411J6697
$$ -27937 -270587 -205804 319338 -198251 -12582 -124357 240447 -117317 -774 -110185 -93488
15998i3488A30552a425B8694a28465k00843g5494B74684F7735k2753d734R39A56994
$$ -93488 130552 -1425 28694 -128465 -329308 -75494 274684 67735 44982 -4734 -3795 156994
15985C0770a8798j07511D63244B3027O533q676m139a12785j15778j73885I2909
$$ 30770 -18798 -126309 463244 23027 29560 20884 16745 -112785 -228563 -402448 92909
15973a17683m1461r1331B31345h8776C24644b5273B59383A7418J06418P2736D9057
$$ -117683 -159144 -250475 231345 -88776 324644 -25273 259383 17418 123836 196572 49057
15961B19280j05197K68775A85858a6575o424A22275N8662C7628K50267a76096
$$ 219280 114083 382858 185858 -16575 -22999 122275 180937 37628 287895 -176096
15950G8053C0036K05779j05039R8166c78383E12506B15009j03527l8522d07871
$$ 78053 30036 235815 130776 228942 -378383 512506 215009 111482 72960 -407871
15939d23263M1734F0787b21744a00737A7586G177L4282K2848c8653b843m1893
$$ -423263 -381529 60787 -221744 -100737 17586 7177 41459 64307 -38653 -2843 -44736
15928d4736B34554j01311b97186G0997f8531k16116R6354j66835J26183A84889
$$ -44736 234554 133243 -297186 70997 -68531 -284647 -188293 -355128 -228945 184889
15917c6102R068j84987l3511a852B24137a18394F6846L7834L2531a63607H1408
$$ -36102 -27034 -212021 -245532 -1852 224137 -118394 66846 104680 137211 -163607 81408
15905f366A48899a71462A23419e14788b32893C74390C6852d9307A8516B054b77280
$$ -6366 148899 -171462 123419 -514788 -232893 374390 36852 -49307 18516 2054 -277280
15893B09193c04124B313i8997A19247b5984j34244P5458A40734L5643F7246J51734
$$ 209193 -304124 2313 -98997 119247 -25984 -160228 -84770 140734 176377 67246 218980
15882B18980d38924A65895d65612a24917H6570c09884f8031j33695L9996m0154
$$ 218980 -438924 165895 -465612 -124917 86570 -309884 -68031 -201726 -161730 -201884
15872b01884A27821c42195a51055L7875D954J60709a10104o0771d0260k00520
$$ -201884 127821 -342195 -151055 -113180 4954 165663 -110104 -170875 -40260 -240780
15862b40780C669M1734P2394f3426n8070e3851j9083B89894d3882j43312I4573
$$ -240780 3669 45403 117797 -63426 -121496 -53851 -72934 289894 -43882 -187194 94573
15850A83892b21444d787m4622h911l9048k71379i079G714d2127H2847J80381a25131
$$ 183892 -221444 -4787 -49409 -8911 -47959 -319338 -9079 7714 -42127 82847 263228 -125131
15837C6642e0819B8048M49987c30404e3248o516k29084e2653J9111G169J76059
$$ 36642 -50819 28048 478035 -330404 -53248 -59764 -288848 -52653 -33542 7169 183228
15826A83228J95311B6413d4114J3831A51675O9361I3238a73850C5713a45911L72
$$ 183228 378539 26413 -44114 -30283 151675 221036 93238 -173850 35713 -145911 -145539
15815a45539j8407f9675E5694c31425a61938j25000f8232j26092j59692J54942
$$ -145539 -163946 -69675 55694 -331425 -161938 -286938 -68232 -194324 -354016 -199074
15805a99074H7100J58474a02865C1520a72362p5638J6222d2043A10352a6111A31244
$$ -199074 87100 245574 -102865 31520 -172362 -248000 -231778 -42043 110352 -16111 131244
15793A77591c0876m8178j42745L1208h9043b4380A62091g461A87602g6922C5640
$$ 177591 -30876 -79054 -221799 -190591 -89043 -24380 162091 -7461 187602 -76922 35640
15781a1006k28184B03898l7144b84366c3918l401F8501b24977A67219b47840K6471
$$ -11006 -239190 203898 166754 -284366 -33918 -37319 68501 -224977 167219 -247840 -221369
15770b21369a06290j379d8691C8419a41018b691j00992F7543N4642E5929a16454
$$ -221369 -106290 -107669 -48691 38419 -141018 -2691 -103683 67543 122185 55929 -116454
15758A33956m8867a52324k2301B7220b46649A46105i129A67107D0001f7039C5406
$$ 133956 85089 -152324 -174625 27220 -246649 146105 -9129 167107 40001 -67039 35406
15746a23640F8686J15244J74223F5476E318d3956D25769i869C26184a73009c4781
$$ -123640 68686 183930 358153 65476 5318 -43956 425769 -9869 326184 -173009 -34781
15734c27225A16758J24546K9340j17530a18829L6463B88061i3745j2099a5232
$$ -327225 116758 241304 270644 153114 -118829 -82366 288061 -93745 -105844 -15232
15723i0946B48187n1323a71838A41558b69234a30923j47801b2894A68995k5779
$$ -90946 248187 196864 -171838 141558 -269234 -130923 -278724 -22894 168995 143216
15713A43216C5547J29583a42363I1369O1820e5348A2811R4187c1541D0832K62153
$$ 143216 35547 165130 -142363 91369 153189 -55348 12811 106998 -31541 40832 302985
15702C02985i9421k06256a12676A26916g8454C03012D0321b81316j96611h3272
$$ 302985 -99421 -305677 -112676 126916 -78454 303012 40321 -281316 -477927 -83272
15691A11559Q6836r6136J17667m814d2587n6952B3023J60931a33949j07027B3156
$$ 111559 198395 102259 219926 215112 -42587 -99539 23023 183954 -133949 -240976 23156
15679B64266a22377G2329a76726B6623e0408j98252g9610p402B36359j4601a2170
$$ 264266 -122377 72329 -176726 26623 -50408 -248660 -79610 -87012 236359 221758 -12170
15667F5715e6783A1117a87593F2190K30860h2733E502N2928a8766A53373m3864
$$ 65715 -56783 11117 -187593 62190 293050 -82733 5502 58430 -18766 153373 109509
15656A09509a77887k9468K3320I4723b03515N7318p658G92a72653h051q4472j13666
$$ 109509 -177887 -207355 -184035 94723 -203515 -146197 -153855 792 -172653 -8051 -92523 -206189
15644b06189P1082C6074E186d9736A56870p578e1121a5448q5610K158A56578i6242
$$ -206189 -135107 36074 5186 -49736 156870 149292 -51121 -15448 -101058 -98900 156578 -96242
15631C17892b9811j53592j21328a06448H0812J82482a26948A75291a25530f0359
$$ 317892 -29811 -183403 -304731 -106448 80812 263294 -126948 175291 -125530 -60359
15620a60735G8435d6533A64342M9894a83580j54245D7718K59026a6867C30695
$$ -160735 78435 -46533 164342 214236 -183580 -337825 47718 306744 -16867 330695
15609c4990A29632c9092I3996a12098C25660F9479b59845d3348C814b2258m1325
$$ -34990 129632 -39092 93996 -112098 325660 69479 -259845 -43348 3814 -22258 -63583
15598f3583k24348J23108a6777A24548i135k5925J0158B32948B9545b22999A41816
$$ -63583 -287931 -164823 -16777 124548 -9135 -35060 -24902 232948 29545 -222999 141816
15586B335a24614j01289E7844R4754k0228c21200M1981b3919B00431n6106b5899
$$ 2335 -124614 -225903 57844 152598 132370 -321200 -279219 -23919 200431 144325 -25899
15574B9360b95530C9852a95815A90764g8938A57735E8930B2470K4650K53765A25632
$$ 29360 -295530 39852 -195815 190764 -78938 157735 58930 22470 47120 300885 125632
15562I98a65378D0779g5381k60168A64397K4199B9789h5491N746F3361k8871J94149
$$ 998 -165378 40779 -75381 -335549 164397 188596 29789 -85491 -79745 63361 34490 228639
15550B28639h2708A98632L2812c40046A24421e1497j96395r1036e8662b3131A01951
$$ 228639 -82708 198632 231444 -340046 124421 -51497 -247892 -338928 -58662 -23131 101951
15538a78476L2888I4473J72987J07655a76038Q7204I7623l2417J41720a20618
$$ -178476 -145588 94473 267460 375115 -176038 -88834 97623 65206 206926 -120618
15527a69590C3736a37327l3707F9475a13220A26607a52878A40689A2279c350C66201
$$ -169590 33736 -137327 -171034 69475 -113220 126607 -152878 140689 12279 -3350 366201
15515a63019F2314b00525L3279A51734n9006a55099d0643B1971P1966J30114k6162
$$ -163019 62314 -200525 -167246 151734 92728 -155099 -40643 21971 93937 224051 197889
15504A97889q1828E714d974l24488i4342f346j26364e3213I0541R4435b03134
$$ 197889 116061 5714 -4974 -329462 -94342 -6346 -132710 -53213 90541 184976 -203134
15492F4066B3616a71781p7450A49241e1862A3182J71034G8048h7831G5098d14667
$$ 64066 23616 -171781 -249231 149241 -51862 13182 184216 78048 -87831 75098 -414667
15480B18391m2273a7188k09118A7973g1953B01380p9320C5935a29659n7693B547
$$ 218391 176118 -17188 -226306 17973 -71953 201380 122060 35935 -129659 -187352 2547
15468a82742a0694j75844H0226b58518L6978F0346e0824p0074o6047C17225j47562
$$ -182742 -10694 -186538 80226 -258518 -221540 60346 -50824 -120898 -186945 317225 169663
15457A69663E7858d3428A65081a55821A39808f7809l0712j20414C9405N2499b13979
$$ 169663 57858 -43428 165081 -155821 139808 -67809 -98521 -218935 39405 91904 -213979
15445b83979B16694c388j97249Q7697A94406F7848b2159k22263H4276d74003c4721
$$ -283979 216694 -3388 -200637 -112940 194406 67848 -22159 -244422 84276 -474003 -34721
15433G2227L50849G260K25594a90999L1007J9688B60888a78133I3590J5709D6894
$$ 72227 423076 7260 232854 -190999 -159992 -140304 260888 -178133 93590 109299 46894
15421c46031H1030a06558C22612a60128n2856a03956A15677a25378N8261J4803
$$ -346031 81030 -106558 322612 -160128 -212984 -103956 115677 -125378 -67117 -52314
15411e2314m2785b1177A54819b57452j6734e7827k6826k90224C5872J22423k4462
$$ -52314 -95099 -21177 154819 -257452 -274186 -57827 -84653 -374877 35872 158295 133833
15400A33833F2466b39844b0755B00070I4435c36695J54356k72960K01144C4549
$$ 133833 62466 -239844 -20755 200070 94435 -336695 -182339 -455299 -254155 34549
15389B41776A0855J53680B6621J59023a9067j09202e8295k56795C61296a34386
$$ 241776 10855 164535 26621 185644 -19067 -128269 -58295 -315090 361296 -134386
15378A49652K7017a44247d2163j42850A61850j9423a30512F9534b5387A64801
$$ 149652 176669 -144247 -42163 -185013 161850 142427 -130512 69534 -25387 164801
15367d4446j2201j92588B73841I2611b14663A00374c9842F2182b4431c832B69230
$$ -44446 -56647 -249235 273841 92611 -214663 100374 -39842 62182 -24431 -3832 269230
15355a08429B11360A1474J98519a29717q519p2884b4307A58109a22728k60503
$$ -108429 211360 11474 209993 -129717 -138236 -211120 -24307 158109 -122728 -383231
15345c83231a89626Q9810j37415J06332F5248A2905b59783C18140A14167Q718
$$ -383231 -189626 -99816 -237231 -130899 65248 12905 -259783 318140 114167 122885
15335A22885o0509K11196h523j05279A79758c8776j31222A82355m6143c9574j469
$$ 122885 62376 273572 -8523 -113802 179758 -38776 -169998 182355 136212 -39574 -41043
15324d1043A30456M1823J16897a02869B89831b26334F4985c33710e6744k36956
$$ -41043 130456 172279 289176 -102869 289831 -226334 64985 -333710 -56744 -293700
15314b93700J34554F3783L47221H3291a6029B49101j06819o5253a20398N0674
$$ -293700 -159146 63783 411004 83291 -16029 249101 142282 77029 -120398 -69724
15304f9724B74950D5076k0511b46152O3064B63405A00301L67025A41507K7515
$$ -69724 274950 45076 24565 -246152 -183088 263405 100301 467326 141507 169022
15294A69022a44959j61271Q1419j09943f2897A60602b23210B8004M917a46460
$$ 169022 -144959 -306230 -224811 -334754 -62897 160602 -223210 28004 32921 -146460
15283A50815a52546A96405J0345q5879i7948C4370K88888A49473F142J23356h206
$$ 150815 -152546 196405 206750 120871 -97948 34370 323258 149473 6142 129498 -8206
15271e5264G5369c63229h7459B28968f8287J6953n7468D1683e3498A42697a41193
$$ -55264 75369 -363229 -87459 228968 -68287 -51334 -108802 41683 -53498 142697 -141193
15259I1764b69460I3520K03820J12082j45932J20378a41274a5303B75029F1579
$$ 91764 -269460 93520 297340 409422 263490 383868 -141274 -15303 275029 61579
15248A54899J26585F7025a80833A14287E087J79411F5179M8094b4954A46284j9745
$$ 154899 281484 67025 -180833 114287 5087 184498 65179 113273 -24954 146284 126539
15237A26539N3665J89837J43492M80432K61636l97359M21470n02924C19978A24323
$$ 126539 180204 370041 513533 993965 1255601 858242 1279712 776788 319978 124323
15226B24620j11420L355m379a91912i316j00855G7147a60180r3549b8408b432
$$ 224620 113200 116555 112176 -191912 -9316 -110171 77147 -160180 -253729 -28408 -2432
15214a09877B49473n7082A9439a77134I2851K05592p9566q2475g7526B96273A32849
$$ -109877 249473 192391 19439 -177134 92851 298443 218877 136402 -77526 296273 132849
15202h3150C00566j11392K13049j32533A3036g5079F8430B3264P362N1344f4425
$$ -83150 300566 189174 402223 269690 13036 -75079 68430 23264 30626 81970 -64425
15190A4196b29516A7586J86640r6267a39233C5236A3201J20098R027a95260A05650
$$ 14196 -229516 17586 204226 107959 -139233 35236 13201 133299 142326 -195260 105650
15178H5832B9612O1852M7561B2169c88346C12981J10967c92198g5062j06178C4958
$$ 85832 29612 91464 139025 22169 -388346 312981 423948 -392198 -75062 -181240 34958
15166i7298M7015J0339A49101n2709J66738A22729J39085F4674A0320J14807a18178
$$ -97298 -50283 -39944 149101 96392 263130 122729 261814 64674 10320 125127 -118178
15154a44874C46087b14871e8011A59245d1848A99639O433k8015a02271A56302
$$ -144874 346087 -214871 -58011 159245 -41848 199639 206072 178057 -102271 156302
15143H565a7723j84187I5682c3128B6309J37641b61169A17211J63372G9975J67704
$$ 8565 -17723 -201910 95682 -33128 26309 163950 -261169 117211 280583 79975 247679
15132B47679a37653B86628c4301l4141E0613a8880G4137l814n039h5887a5636
$$ 247679 -137653 286628 -34301 -68442 50613 -18880 74137 70323 65284 -85887 -15636
15120A84446K0480f7585M440B2697J20979a96192E4875L30053A65996m0424i7983
$$ 184446 204926 -67585 -63145 22697 143676 -196192 54875 384928 165996 125572 -97983
15108A48J3163b03858C9377N9492N6436J45093j45495b07903C80929A38470b07392
$$ 148 13311 -203858 39377 98869 155305 300398 154903 -207903 380929 138470 -207392
15096C187L9485K6096c902B95123J9228D4293M7753J58419l5588j03457L2668
$$ 3187 42672 68768 -3902 295123 314351 44293 92046 250465 214877 111420 144088
15085A44088f6850B05195a60413a8947A24803a37718A23240P6759F1597b0796
$$ 144088 -66850 205195 -160413 -18947 124803 -137718 123240 199999 61597 -20796
15074a2011B33315o3327a25307A72377J10169C55K41155n1085c6564A52399d4744
$$ -12011 233315 169988 -125307 172377 282546 355 241510 190425 -36564 152399 -44744
15062B28899F7858e052E93387k96588a33675B83855b72773g976m3310B16798b1772
$$ 228899 67858 -5052 593387 296799 -133675 283855 -272773 -7976 -51286 216798 -21772
15050B61194b9200l546A89351J96109B0964J10822K4797K7150j9862G6965a5302
$$ 261194 -29200 -32746 189351 385460 20964 131786 156583 183733 163871 76965 -15302
15038B7189g931j18531D57538j78835J09702b0571j63886I1840J58036J52838
$$ 27189 -7931 -126462 457538 278703 388405 -20571 -184457 91840 249876 402714
15028D02714a59794F5977d054C34310j43128A2990J12311J15898j17412c3366
$$ 402714 -159794 65977 -4054 334310 191182 12990 125301 241199 123787 -33366
15017A73545J32775R3611A91778R945n8867O5819m7523p840f7984D7690K71524
$$ 173545 306320 399931 191778 201723 142856 208675 161152 153312 -67984 47690 319214
15006C19214q8309J5754o3539K61974d1842I0454a24940A48575J69489R1314G5900
$$ 319214 230905 246659 183120 445094 -41842 90454 -124940 148575 318064 409378 75900
14994B92143H6851b09373B42246J81896A66485P9043k2646K5892k9708K6847j05511
$$ 292143 86851 -209373 242246 424142 166485 245528 222882 248774 219066 245913 140402
14983A40402J17668e9844B98538j14881J53015e5451i872D18439m2012A36698
$$ 140402 258070 -59844 298538 183657 336672 -55451 -9872 418439 376427 136698
14972B55035J65295F8593L61836E5200n218N91379B33515j0803b43726B76946
$$ 255035 420330 68593 430429 55200 49982 641361 233515 222712 -243726 276946
14961B62109H5820J8229a65617C78838k3289j28495D6033d9445f621C80276B6714
$$ 262109 85820 104049 -165617 378838 355549 227054 46033 -49445 -6621 380276 26714
14949B02643b1053B29319B0593L8782J33599J73822k303M9591A76376M23814B97123
$$ 202643 -21053 229319 20593 59375 192974 366796 364493 414084 176376 600190 297123
14937F17790a12483H5335J33724K26494g921A69909L28910j84247A0481M43779
$$ 617790 -112483 85335 219059 445553 -7921 169909 498819 314572 10481 454260
14927D54260n6964a7284E30291a3216A33677L7440K06818H9421K78851A51754
$$ 454260 397296 -17284 530291 -13216 133677 171117 377935 89421 368272 151754
14916b8131n752C59643C6398J76416Q4886K01000B30094J65756j83480N3122j0513
$$ -28131 -33883 359643 36398 212814 297700 498700 230094 395850 212370 265492 254979
14905B54979j4503A10687J67780m1940G223N10142A52948J77363H4901K32551
$$ 254979 240476 110687 278467 236527 7223 517365 152948 330311 84901 317452
14895C17452J0091J6015J48551k41112O4021r8975K56627A55422L49009B02250
$$ 317452 327543 343558 492109 250997 315018 216043 472670 155422 504431 202250
14884C66878E5634L90836k1112D2373L38197j34599N6073Q779r6031J27394p1812
$$ 366878 55634 446470 425358 42373 380570 245971 302044 310823 214792 342186 270374
14873B70374L7407K63399B20829l8551J73296j1503j01362M4521L78697k48363
$$ 270374 307781 571180 220829 182278 355574 344071 242709 287230 665927 417564
14863D17564P2174k38049F5233K31380J19217q0119H4255J38487A00877J82723
$$ 417564 489738 251689 65233 296613 415830 335711 84255 222742 100877 283600
14853B83600K1505L51576k90559A61631M40278B02765H8373J88619K17555n2573
$$ 283600 305105 656681 366122 161631 601909 202765 88373 276992 494547 441974
14843D41974l2144E282J30156o1922M42589k40573e5162C46094A46957L80754
$$ 441974 409830 5282 135438 73516 516105 275532 -55162 346094 146957 527711
14833E27711B48715l317K70544j09005A80901M96791B02606P2142O5619Q3589
$$ 527711 248715 245398 515942 406937 180901 677692 202606 274748 340367 423956
14823D23956j9286K20097k62882J01521A20229M53608K1624j14561j34181m5320
$$ 423956 404670 624767 361885 463406 120229 573837 595461 480900 346719 301399
14813C01399j19459J2944Q2353K01373R331R9154A93690N14624B77670J3729J24486
$$ 301399 181940 194884 277237 478610 487941 587095 193690 708314 277670 291399 415885
14802D15885j23359o5388K38596B0425K32658K86305k35353R3994J80542k41471
$$ 415885 292526 227138 465734 20425 253083 539388 304035 398029 578571 337100
14792C37100A62245N62490C50056l5984J65570Q372Q7312k01149J93821m8067
$$ 337100 162245 724735 350056 314072 479642 488014 575326 374177 567998 519931
14782E19931J38190j8790J26618j31261N2446j48288r2209j58895J12598j00556
$$ 519931 658121 639331 765949 634688 687134 538846 446637 287742 400340 299784
14772B99784L23018M27894l33992L4393k67941k23689l183O366J16929L4315j76239
$$ 299784 622802 1050696 716704 751097 483156 259467 256284 262650 379579 413894 237655
14761B37655N01127l44561J69029p9271m4861M63895B46470m6227J37518L3534
$$ 237655 738782 394221 563250 483979 439118 903013 246470 200243 337761 371295
14751C71295K34620k64478N5015j17479K14789K13222j20290j91732j59423K61132
$$ 371295 605915 341437 396452 278973 493762 706984 586694 394962 235539 496671
14741D96671L99456l48211Q2521p9514L83139C40049P6072n2278L0803J71931
$$ 496671 896127 547916 630437 550923 934062 340049 416121 363843 394646 566577
14731E66577J72659j83561L76015j42907L78492l98987j56482L2102r5289O4940
$$ 566577 739236 555675 931690 788783 1167275 768288 611806 643908 548619 613559
14721F13559j75010L3421L15251j56462K44667C11880N31438p5767J18884m35142
$$ 613559 438549 471970 787221 630759 875426 311880 843318 767551 886435 451293
14711D51293J40527K11987j85972l086O5054K13907l768m25092A95498M35070
$$ 451293 591820 803807 617835 614749 679803 893710 889942 464850 195498 630568
14701F30568j81621M92536j73081K36613j24012m00743J14328M56500j08118m43843
$$ 630568 448947 941483 768402 1005015 881003 480260 594588 1051088 942970 499127
14691D99127K99171L10142k89781J62586m5456j17708l79236L85706M5944K08111
$$ 499127 798298 1108440 818659 981245 935789 818081 438845 824551 870495 1078606
14681A078606l80765J3076J24791l7197j50797P3359L3273L32422j92956L9941
$$ 1078606 697841 710917 835708 798511 647714 721073 754346 1086768 893812 933753
14671I33753k57141o498K45835o8589J31918k59373J08366r1378L2676N8759k5152
$$ 933753 676612 670114 915949 847360 979278 719905 828271 736893 769569 828328 803176
14660H03176L66845q5499l88754j12650K34065o6381L39149j54024Q7098k54288
$$ 803176 1170021 1084522 695768 583118 817183 750802 1089951 935927 1023025 768737
14650G68737M0658J33115J19582K8345k77241K08465j96988K42575q8137j19582
$$ 768737 809395 942510 1062092 1090437 813196 1021661 824673 1067248 979111 859529
14640H59529K86505N8621l43347K24802j93550m6398J2090J31095J7521Q3547
$$ 859529 1146034 1204655 861308 1086110 892560 846162 858252 989347 1006868 1090415
14630A090415L3266j75946K82887J05930j38311m21972K48316K24680m69180N24222
$$ 1090415 1123681 947735 1230622 1336552 1198241 776269 1024585 1249265 780085 1304307
14620A304307l81858M72917L1573m3946j24345q0788p1545L19008J09529k26675
$$ 1304307 922449 1395366 1426939 1382993 1258648 1177860 1106315 1425323 1534852 1308177
14610A308177k41736J71546k54397K9249N21123m20243K27469P3758M1964j67974
$$ 1308177 1066441 1237987 983590 1012839 1533962 1113719 1341188 1414946 1456910 1288936
14600A288936N9391K01999m78609N45266k19838l76945J06808M89266m33857J20629
$$ 1288936 1348327 1550326 1071717 1616983 1397145 1020200 1127008 1616274 1182417 1303046
14590A303046l0342J65148J6172J49248j40466o8172P1847P2143k50537N8226
$$ 1303046 1272704 1437852 1454024 1603272 1462806 1394634 1466481 1538624 1288087 1346313
14580A346313L21307J28463l42217k0444J55763k9910L7632j7202k0192k93523
$$ 1346313 1667620 1796083 1453866 1433422 1589185 1559275 1596907 1579705 1559513 1265990
14570A265990M37940J3045J7958K04076j53344J39293K13948o53057K71834K57618
$$ 1265990 1703930 1716975 1734933 1939009 1785665 1924958 2138906 1485849 1757683 2015301
14560B015301j13359K5779j45344J35293J61854M5979j76424L33023k1153k83768
$$ 2015301 1901942 1927721 1782377 1917670 2079524 2125503 1949079 2282102 2260949 1977181
14550A977181J52620L39427K9085M0618o7076J88341K67065L58032m82334P11677
$$ 1977181 2129801 2469228 2498313 2538931 2471855 2660196 2927261 3285293 2802959 3514636
14540C514636o6149M84265J69247R46455P08130Q75361K470477M335257O502048
$$ 3514636 3448487 3932752 4101999 5048454 5756584 6631945 9102422 13437679 19939727
14531A9939727J0250213Q31j1425867q312473m254692j589562j016435q00880
$$ 19939727 30189940 30190771 18764904 10452431 6197739 4608177 3591742 2790862
14523B790862l44076M6971j77466q4564q7200k19406P1890l2567J30571L30129
$$ 2790862 2446786 2493757 2316291 2231727 2144527 1925121 1997011 1964444 2095015 2425144
14513B425144m51314n8086K3761K65152r8638K3979l9473K2797N7149L26268l04649
$$ 2425144 1973830 1915744 1939505 2204657 2106019 2129998 2090525 2113322 2170471 2496739 2192090
14502B192090J45162j46648m1937M90339j41739J47121K23483l52378k1745K28387
$$ 2192090 2337252 2190604 2148667 2639006 2497267 2644388 2867871 2515493 2493748 2722135
14492B722135k70116j10651M70801m76609m8111M88511k6803L95494l91116J62600
$$ 2722135 2452019 2341368 2812169 2335560 2287449 2775960 2749157 3144651 2753535 2916135
14482B916135j52206k5380L42353q4250k34617J4099K31359L23138l8650o1584
$$ 2916135 2763929 2738549 3080902 2996652 2762035 2776134 3007493 3330631 3291981 3230397
14472C230397J01814l08806k34481O22681j57155L83358l31192K46831q7013K40503
$$ 3230397 3332211 3023405 2788924 3411605 3254450 3637808 3306616 3553447 3466434 3706937
14462C706937M5600k42571J95466k12766K96276Q1513l35853P39376n33262K22179
$$ 3706937 3752537 3509966 3705432 3492666 3788942 3870455 3534602 4273978 3740716 3962895
14452C962895M3765j74071J31477R4710K54836m6836l54893N43404k38293K71010
$$ 3962895 4006660 3832589 3964066 4058776 4313612 4266776 3911883 4455287 4216994 4488004
14442D488004k8342K8773J43151L01512n54027K4842K92865J92172J58779j47507
$$ 4488004 4459662 4488435 4631586 4933098 4379071 4403913 4696778 4888950 5047729 4900222
14432D900222j2104q6409Q6787M42007J2324L2093m460N9995Q7907L71941q7268
$$ 4900222 4888118 4801709 4888496 5330503 5342827 5374920 5370460 5430455 5518362 5890303 5803035
14421E803035k47937P7074M76861k588j92669L32902L726K20929m9046J51082
$$ 5803035 5555098 5632172 6109033 6106445 5913776 6246678 6250404 6471333 6422287 6573369
14411F573369k52929L90888L4544O9739L8712J58647J49642k56664L18892L7536
$$ 6573369 6320440 6711328 6745872 6815611 6854323 7012970 7162612 6905948 7224840 7262376
14401G262376M72488O2048j14380L63131r2806K36888j34491L19368k76187M93272
$$ 7262376 7734864 7796912 7682532 8045663 7952857 8189745 8055254 8374622 8098435 8591707
14391H591707j66169L86271L26911k13172p3487M13665P8750L02414J1298J4093
$$ 8591707 8425538 8811809 9138720 8925548 8852061 9265726 9344476 9646890 9658188 9672281
14381I672281N17291k9858J20794L13373j12530O26857k72838M68872k40948M85046
$$ 9672281 10189572 10159714 10280508 10593881 10481351 11108208 10835370 11304242 11063294 11548340
14371A1548340L60710M24240j3655L74813j611J87986K49090P38045k54081N36698
$$ 11548340 11909050 12333290 12319635 12694448 12692837 12880823 13129913 13867958 13613877 14150575
14361A4150575K25206L41361J14259M88704L43385M91641R7744p019N04735K94177
$$ 14150575 14375781 14717142 14831401 15320105 15663490 16155131 16252875 16245856 16750591 17044768
14351A7044768Q4618P47168P67810o9961L56430N46593N56034L68644L69233O57558
$$ 17044768 17129386 17876554 18644364 18574403 18930833 19477426 20033460 20402104 20771337 21428895
14341B1428895L80499N45100N02411M43056O09735Q49444L16694O41717N25498
$$ 21428895 21809394 22354494 22856905 23299961 23909696 24759140 25075834 25717551 26243049
14332B6243049R01779N40520R35011R85128L65733J067921O17219J194807N67562
$$ 26243049 27144828 27685348 28620359 29605487 29971220 31039141 31656360 32851167 33418729
14323C3418729J159512R42922J036639R43029J141204J226894J073410J553231
$$ 33418729 34578241 35521163 36557802 37500831 38642035 39868929 40942339 42495570
14315D2495570J319006J459717J681738J374172J490553J899445J604465J826060
$$ 42495570 43814576 45274293 46956031 48330203 49820756 51720201 53324666 55150726
14307E5150726K049013J956425K430918K314901K013568K893696K566430L027851
$$ 55150726 57199739 59156164 61587082 63901983 65915551 68809247 71375677 74403528
14299G4403528K758710L406852L369062L028931L862440M385776L995689M729671
$$ 74403528 77162238 80569090 83938152 86967083 90829523 95215299 99210988 103940659
14291A03940659M685246M884327O046792N431741O539243O522630P047573P526317
$$ 103940659 108625905 113510232 119557024 124988765 131528008 138050638 145098211 152624528
14283A52624528P956170Q124541R024592R487768J0111064J0721061J1080876
$$ 152624528 160580698 168705239 177729831 187217599 197328663 208049724 219130600
14276B19130600J2007566J2469184J3282193J3287656J3586727J3840884J4228201
$$ 219130600 231138166 243607350 256889543 270177199 283763926 297604810 311833011
14269C11833011J4635554J4383114J4167258J3923329J2614444J2938134J1619458
$$ 311833011 326468565 340851679 355018937 368942266 381556710 394494844 406114302
14262D06114302J0651787J0027734R260285Q722139M770312K655925R24132J999351
$$ 406114302 416766089 426793823 436054108 444776247 449546559 452202484 453126616 455125967
14254D55125967j842346o290570n629369q295949j0904142j0617819j2446756
$$ 455125967 453283621 446993051 441363682 433067733 422163591 411545772 399099016
14247C99099016j3389927j4599880j4416215j4880831j4825762j4878682j4214752
$$ 399099016 385709089 371109209 356692994 341812163 326986401 312107719 297892967
14240B97892967j3504761j3364636j3103835j2041541j2474969j1577228j1925670
$$ 297892967 284388206 271023570 257919735 245878194 233403225 221825997 209900327
14233B09900327j1244834j0855978r776058r041587q604706p970052p783418p082830
$$ 209900327 198655493 187799515 178023457 168981870 160377164 152407112 144623694 137540864
14225A37540864o603783o073925n733461n227837n452894m485108n013061m089194
$$ 137540864 130937081 124863156 119129695 113901858 108448964 103963856 98950795 94861601
14217I4861601l940686l538834l456271l609841l148152k900430k874959k671895
$$ 94861601 90920915 87382081 83925810 80315969 77167817 74267387 71392428 68720533
14209F8720533k561372k406398k299934k158400k057160j956741k060552j640003
$$ 68720533 66159161 63752763 61452829 59294429 57237269 55280528 53219976 51579973
14201E1579973j813856j516312j048034j866285j318851j202801j618077r70672
$$ 51579973 49766117 48249805 47201771 45335486 44016635 42813834 41195757 40225085
14193D0225085j051745p61092j261000j090169j012436j170635j181492m06333
$$ 40225085 39173340 38412248 37151248 36061079 35048643 33878008 32696516 32290183
14185C2290183l29588j340052q23194j106391l59501r97438l03688q69873q95735
$$ 32290183 31960595 30620543 29797349 28690958 28331457 27334019 27030331 26160458 25264723
14176B5264723m59378p18803k22432p75386m63938n40130l15498n02962n36378
$$ 25264723 24805345 24086542 23864110 23088724 22624786 22084656 21769158 21266196 20729818
14167B0729818l17688l07116o57802l97297k82386n53881k75167m95986l71641
$$ 20729818 20412130 20105014 19447212 19049915 18767529 18213648 17938481 17442495 17070854
14158A7070854k96708j68236k85227m12285k42072r39172J13476K24105n56167
$$ 17070854 16774146 16605910 16320683 15908398 15666326 14727154 14840630 15064735 14508568
14149A4508568k02594l58133l12042k37942N8788m05493k77257k63088l79627
$$ 14508568 14305974 13947841 13635799 13397857 13456645 13051152 12773895 12510807 12131180
14140A2131180P0226k11653k25648k70891k42892k79389O628m94789J5484p2009
$$ 12131180 12201406 11989753 11764105 11493214 11250322 10970933 10977561 10482772 10498256 10426247
14130A0426247o6575j01511m86780p2692k5700j31901m13720J38814P8697k37953
$$ 10426247 10359672 10258161 9771381 9698689 9672989 9541088 9127368 9266182 9344879 9106926
14120I106926o55216L29162r1246k12255l18045m01223K96423k02620m1560K6101
$$ 9106926 8451710 8780872 8689626 8477371 8159326 7758103 8054526 7851906 7810346 7836447
14110G836447j42958j80077J36321j30115m42532j23341j4193q4797J06226m98001
$$ 7836447 7693489 7513412 7649733 7519618 7077086 6953745 6939552 6854755 6960981 6462980
14100F462980J25664k19747K32311k33635l6454j51789J26530p7997k76352J92844
$$ 6462980 6588644 6368897 6601208 6367573 6331119 6179330 6305860 6227863 5951511 6144355
14090F144355k16981q1130j36813L7833r3629l75897M5346P1287j20737r1943
$$ 6144355 5927374 5846244 5709431 5747264 5653635 5277738 5323084 5394371 5273634 5181691
14080E181691K74635m18324J29714N2266l73495j0116J53873K00936p48875L94074
$$ 5181691 5456326 5038002 5167716 5219982 4846487 4836371 4990244 5191180 4442305 4836379
14070D836379k26345k03053k5979K8348p8183J99738k46077j57120K42271j64372
$$ 4836379 4610034 4406981 4381002 4409350 4331167 4530905 4284828 4127708 4369979 4205607
14060D205607P4087k87933l9950O0431j62962L82088j89653l66766J65539k47275
$$ 4205607 4279694 3991761 3951811 4012242 3849280 4231368 4041715 3674949 3840488 3593213
14050C593213M27696k91591j27204P3205r5142Q0753K29077q2337J52428l8016
$$ 3593213 4020909 3729318 3602114 3675319 3580177 3660930 3890007 3807670 3960098 3922082
14040C922082m54976K89071m72270K3685J2871k14364L24753k24462l46603M4968
$$ 3922082 3467106 3756177 3283907 3307592 3320463 3106099 3430852 3206390 2859787 2904755
14030B904755K41651k417K02894k37006l1379j6084k99362K0910n6932K16522
$$ 2904755 3146406 3143989 3346883 3109877 3078498 3062414 2763052 2783962 2727030 2943552
14020B943552l36201K59781J7230O2235l09251J82371j0901M0616j74104j76817
$$ 2943552 2607351 2867132 2884362 2946597 2637346 2819717 2808816 2849432 2675328 2498511
14010B498511K0997K4133O1540k12604L14648k60749K86353m64599L0202Q7469
$$ 2498511 2519508 2543641 2605181 2392577 2707225 2446476 2732829 2268230 2298432 2385901
14000B385901R5260k90407K73991k85581r7745J88762K69995l39029J91156l39164
$$ 2385901 2481161 2190754 2464745 2179164 2081419 2270181 2540176 2201147 2392303 2053139
13990B053139K88166j77484K5191k5935m2685k81362L64777j16533J63972K89681
$$ 2053139 2341305 2163821 2189012 2163077 2120392 1839030 2203807 2087274 2251246 2540927
13980B540927j63414J83302L35988L6131L23638J142165J517765L271535O458786
$$ 2540927 2377513 2560815 2896803 2932934 3256572 4398737 5916502 9188037 15646823
13971A5646823J0286092M752790r763527p349031m780033j927097j541172n58678
$$ 15646823 25932915 30685705 20922178 13573147 8793114 6866017 5324845 4766167
13963D766167p33348k90762k71856l43117m18466M1942k99404k07435K30165l96148
$$ 4766167 4032819 3742057 3470201 3127084 2708618 2750560 2451156 2243721 2473886 2077738
13953B077738K36785K7183n03031L13905J12545J7118M607r6156k53008o08j49493
$$ 2077738 2314523 2341706 1838675 2152580 2265125 2282243 2286850 2190694 1937686 1937078 1787585
13942A787585J17587M7702k07987J14992k43222K93210m32844L86253J9292l7307
$$ 1787585 1905172 1952874 1744887 1859879 1616657 1909867 1477023 1863276 1882568 1845261
13932A845261j96699J78421j53095Q0815o5499J16978n0752j98523k856L78993
$$ 1845261 1648562 1826983 1673888 1754703 1689204 1806182 1755430 1556907 1554051 1933044
13922A933044m25436J33184J92232j59634j53714n9821j93423k20442M35452q7730
$$ 1933044 1507608 1640792 1833024 1673390 1519676 1459855 1266432 1045990 1481442 1393712
13912A393712o492J0495Q7292k05741K66123k25829L43841j79220o5788r1337
$$ 1393712 1387220 1397715 1485007 1279266 1545389 1319560 1663401 1484181 1418393 1327056
13902A327056J48474k27220j61813K9005K90091j74336o91K52390j74781K5051
$$ 1327056 1475530 1248310 1086497 1115502 1405593 1231257 1230566 1482956 1308175 1333226
13892A333226k61616K12848o4496J56869l36315J73366P1745j22624L90274l72439
$$ 1333226 1071610 1284458 1219962 1376831 1040516 1213882 1285627 1163003 1553277 1180838
13882A180838K13079k97207L51347m43779N11348j56290j84885K36580K8821j23327
$$ 1180838 1393917 1096710 1448057 1004278 1515626 1359336 1174451 1411031 1439852 1316525
13872A316525k93029M9893L1021r1087J03638j39746J31323J9151m1371p3936
$$ 1316525 1023496 1073389 1104410 1013323 1116961 977215 1108538 1127689 1086318 1012382
13862A012382L00345m15902K98250k69391j21194K99923l7791J72752l6606p7490
$$ 1012382 1312727 896825 1195075 925684 804490 1104413 1066622 1239374 1202768 1125278
13852A125278K26923j25761k74906K00392L3623r6291q9342K7411l68868M57054
$$ 1125278 1352201 1226440 951534 1151926 1185549 1089258 999916 1027327 658459 1115513
13842A115513n9314j75366J23329R9787l9350n8928j63529L06765n40613j15907
$$ 1115513 1056199 880833 1004162 1103949 1064599 1005671 842142 1148907 608294 492387
13832D92387K03410L3235J16070o1186L6781j694K1970o1085L97027k72507P9715
$$ 492387 695797 729032 845102 783916 820697 819003 840973 779888 1176915 904408 984123
13821I84123k00915O7372k2619L1338k09436p1239J47569K66011J25544k71963
$$ 984123 783208 850580 827961 859299 649863 578624 726193 992204 1117748 845785
13811H45785J01698m41119K75995o6072l5356r167M14150k41006j23452J11544
$$ 845785 947483 506364 782359 716287 680931 671764 1085914 844908 721456 833000
13801H33000j52502K72919k65157L30054l19140R9190j0701j82751R9389L87069
$$ 833000 680498 953417 688260 1018314 699174 798364 787663 604912 704301 1091370
13791A091370m32944j37255K94529k26384K51254l23016K28103k20099K09633
$$ 1091370 658426 521171 815700 589316 840570 517554 745657 525558 735191
13782G35191K5761L4297K24162E07752M22208k16681l56121J62220J09091M13747
$$ 735191 760952 795249 1019411 507752 929960 713279 357158 519378 628469 1042216
13772A042216m89254L20074L1361k07935k7339k43715L68082l84364M4915M4481
$$ 1042216 552962 873036 904397 696462 669123 425408 793490 409126 454041 498522
13762D98522K32039o2771p0184A48274P46628j36566J88753k02018J00593j03852
$$ 498522 730561 667790 597606 148274 894902 758336 947089 745071 845664 741812
13752G41812N0508j99190o6537J33163k9809K12848k84735J87719K04202k61947
$$ 741812 792320 593130 526593 659756 629947 842795 558060 745779 949981 688034
13742F88034L8312p8212r5221J42905j22297m9548o2126o6366j76672M00007j51403
$$ 688034 726346 648134 552913 695818 573521 523973 461847 395481 218809 618816 467413
13731D67413J10639A04668N08768k52377K79601q8421n1592k9464R8222K86071
$$ 467413 578052 104668 613436 361059 640660 552239 500647 471183 569405 855476
13721H55476m25074Q1377j21643K65866J38969k59783J03789r3199k1446K5319
$$ 855476 430402 511779 390136 656002 794971 535188 638977 545778 524332 549651
13711E49651O4625C00701J16199K37746k82475k8986M39236j14544k88046p9255
$$ 549651 614276 300701 416900 654646 372171 343185 782421 667877 379831 300576
13701C00576L56697B55652J98974j55173K51892L78529m01056N0794p9969l7813
$$ 300576 657273 255652 454626 299453 551345 929874 528818 579612 499643 461830
13691D61830L66957k25519B62001J97683K32245k22301m5176J60746j76910j3170
$$ 461830 828787 603268 262001 459684 691929 469628 424452 585198 408288 395118
13681C95118K23400k01146K9502j35303J91603j83392k9280K675J43274J0652
$$ 395118 618518 417372 446874 311571 503174 319782 290502 293177 436451 447103
13671D47103l5563r1243k2764J05411K7499p3457p8170K72016Q2030B18840M29587
$$ 447103 411540 320297 297533 402944 430443 356986 278816 550832 632862 218840 648427
13660F48427A58891K36114J01686j56018J11745j33686L35916j03405J42601l09461
$$ 648427 158891 395005 496691 340673 452418 318732 654648 551243 693844 384383
13650C84383J63550B59557M84450B6325K31661A22983M99502M6389k31793M1601
$$ 384383 547933 259557 744007 26325 257986 122983 622485 668874 437081 478682
13640D78682A63986e2391C00171K59159k53099m438L9523J53697o7762j4725j9533
$$ 478682 163986 -52391 300171 559330 306231 301793 341316 495013 427251 412526 392993
13629C92993J27572j86420F1740L47818r7716m8291L54895B58716J36699J9188
$$ 392993 520565 334145 61740 409558 311842 263551 618446 258716 395415 414603
13619D14603j25545o5124N21105j78290B56870K24237A58979K26656K15901r9320
$$ 414603 289058 223934 745039 566749 256870 481107 158979 385635 601536 502216
13609E02216j89756K84071j27160A26095L21430B5628J39387o5831L97599j55210
$$ 502216 312460 596531 469371 126095 447525 25628 165015 99184 496783 341573
13599C41573J49288p5292n3200A69963L3392J47250K55417B99855m0261o8256
$$ 341573 490861 415569 362369 169963 203355 350605 606022 299855 259594 191338
13589A91338K19230B5352L46773r1430J86701o4813N948m782Q5024j64664r8051
$$ 191338 410568 25352 372125 280695 467396 402583 408531 403749 488773 324109 226058
13578B26058j00744K11191j62737L2800J04278L00934j49785h1341C19161C0215
$$ 226058 125314 336505 173768 206568 310846 611780 461995 -81341 319161 30215
13567E77663B02042K96598k15617J83465B11016K55922K99496l17828j31966J7356
$$ 577663 202042 498640 283023 466488 211016 466938 766434 448606 316640 333996
13557C33996j56857f491B27788M28645A86473M88318B22149j1065L01316j67521
$$ 333996 177139 -6491 227788 656433 186473 674791 222149 211084 512400 344879
13547C44879q7070j06974J53127j9850m6103K43856q2208l8540j55986E8992J02817
$$ 344879 257809 150835 303962 284112 238009 481865 399657 361117 205131 58992 161809
13536A61809Q0723k6494Q8262D2238I737K68501J40467F1975M47826M8050j60606
$$ 161809 242532 216038 304300 42238 9737 278238 418705 61975 509801 557851 397245
13525C97245j03482M7416K42351j20764B24435N2135O1964J23528j42401R1360
$$ 397245 293763 341179 583530 462766 224435 276570 338534 462062 319661 411021
13515D11021A34114O2377B2833N18578A78387F4696L28057j67255K83686G3115
$$ 411021 134114 196491 22833 541411 178387 64696 392753 225498 509184 73115
13504B26391C9728M00349j68094R9828I7708L40166j90543O0768o7501B8308K87416
$$ 226391 39728 440077 271983 371811 97708 437874 247331 308099 240598 28308 315724
13493C15724e346C44318j14815j08574P8485J1958J37353a5849E42978H0438K44638
$$ 315724 -5346 344318 229503 120929 199414 211372 348725 -15849 542978 80438 325076
13482C25076J86205E4093J99162j13309K61142E2N0236K65790E6956K73303N5787
$$ 325076 511281 54093 253255 139946 401088 52 50288 316078 56956 330259 386046
13471C86046j80113N5028N41190I6384N4832C0164L80163G4643K56365l0532A02597
$$ 386046 205933 260961 802151 96384 151216 30164 410327 74643 331008 300476 102597
13459B53676f5527B35678P5473o9637J45900A07804M93134A09985k9068K17708
$$ 253676 -65527 235678 311151 241514 387414 107804 600938 109985 80917 298625
13449B98625L06368e6398B27722J35110A24617M4468J67964C5021L52468j52897
$$ 298625 604993 -56398 227722 362832 124617 169085 337049 35021 387489 234592
13439B34592Q3572j43394J17346j01680E7795O0577N1161J88877j13136j10553
$$ 234592 318164 174770 292116 190436 57795 118372 169533 358410 245274 134721
13429A34721i7382B35766g4426D31967A55798J45999E9447M037a42708A36971
$$ 134721 -97382 235766 -74426 431967 155798 301797 59447 63484 -142708 136971
13418B58858A00687a04337C61313D2758J75380q7937K50018e757B31552p9884
$$ 258858 100687 -104337 361313 42758 218138 130201 380219 -5757 231552 151668
13408A51668J64815K03237a08747A6324M4223K94135G0678c3166G3838a25781
$$ 151668 316483 519720 -108747 16324 60547 354682 70678 -33166 73838 -125781
13397B09448N2194a52457C23939F6678J34204J91148C9832F326K24758f4993A60585
$$ 209448 261642 -152457 323939 66678 200882 392030 39832 6326 231084 -64993 160585
13385A21191L0986J04173N6882E7830L24667D784B19K07432D5944J74362M7923
$$ 121191 152177 256350 313232 57830 382497 4784 219 207651 45944 220306 268229
13374B68229B4169J30706K966E8501R3712J83203b6373B17014K9827L55696A44398
$$ 268229 24169 154875 157841 58501 152213 335416 -26373 217014 246841 602537 144398
13362a52535C09775Q7671q1026F4163K7347a23894B2903M63641j36186L45383
$$ -152535 309775 397446 316420 64163 91510 -123894 22903 486544 350358 695741
13352F95741B97145K6856k537K024p1643n9568F1640R5276a35935C26358J7487
$$ 695741 297145 324001 321464 323488 251845 192277 61640 156916 -135935 326358 343845
13341C43845n0925E8104Q6626P563O3908B0156J16642N2663G1945b0515n4112
$$ 343845 292920 58104 144730 152293 216201 20156 136798 189461 71945 -20515 -74627
13330g4627C2870P8390J85609K4570q3952j15563J09220J40587a99088A8661Q9878
$$ -74627 32870 111260 296869 321439 237487 121924 231144 371731 -199088 18661 108539
13319A08539d5777B63788A0573L0967L71157j77478b50136i6567G6817K08321
$$ 108539 -45777 263788 10573 41540 412697 235219 -250136 -96567 76817 285138
13309B85138a2546D2294K50725M443a72942E3234a9369B21943K26499A44562J41731
$$ 285138 -12546 42294 293019 297462 -172942 53234 -19369 221943 448442 144562 286293
13298B86293I4895L9531E6360K8590a0030B84353E5271f8604A86105a59349c7676
$$ 286293 94895 134426 56360 84950 -10030 284353 55271 -68604 186105 -159349 -37676
13286d9028C2341H810L9022J38801P1870m1912M10548B92011k7153K5307A703
$$ -49028 32341 8810 47832 186633 258503 216591 627139 292011 264858 290165 1703
13274B71952I8861K08413c9820A4441J99690c4986l00453D62102b22224A67798
$$ 271952 98861 307274 -39820 14441 214131 -34986 -335439 462102 -222224 167798
13263B76294P7271l6148p4236N0118a3004B12176r2122J0974P9212D6876J48530
$$ 276294 353565 317417 243181 293299 -13004 212176 120054 131028 210240 46876 195406
13252A95406O8203N9095C6809J14743c77001B70752J01238G117L8057J27580d435
$$ 195406 263609 322704 36809 151552 -377001 270752 371990 7117 45174 172754 -4435
13240b30038D2676k0319K67413B5749J05060B9590L77686A98097o3530E8027K14309
$$ -230038 42676 22357 289770 25749 130809 29590 407276 198097 134567 58027 272336
13229B72336A25673K71534e1008j00029B42221a1405A51191E1801L31431a7547
$$ 272336 125673 397207 -51008 -151037 242221 -11405 151191 51801 383232 -17547
13218f9689A43265M4521J04308o1629p6195M3145a81432A37084P3695b2782B23539
$$ -69689 143265 187786 292094 230465 154270 197415 -181432 137084 210779 -22782 223539
13206F3243i0769m1085A84207B0871O0691A7651b06691A73101p5013k4847Q8539
$$ 63243 -90769 -131854 184207 20871 81562 17651 -206691 173101 98088 73241 161780
13195A61780p8414A6559a6132I725a16249I2562d545j66829f9914K2511A58439
$$ 161780 83366 16559 -16132 9725 -116249 92562 -4545 -171374 -69914 -47403 158439
13183B77117G9010J31438q2092D4281O8624C6612K76849b27432B5370J14224E6357
$$ 277117 79010 210448 128356 44281 112905 36612 313461 -227432 25370 139594 56357
13171C03517a23504l7441A17387A4252O8972A5950J69327h4883A27443a70250
$$ 303517 -123504 -160945 117387 14252 83224 15950 185277 -84883 127443 -170250
13160b26961F6878a4839D36541j04281k9076J66200j46122e3228B51120R5565
$$ -226961 66878 -14839 436541 332260 303184 469384 323262 -53228 251120 346685
13150C46685q8112F1246k1410a4552F2441R0212D7171N4627b75393B72724A513
$$ 346685 258573 61246 39836 -14552 62441 152653 47171 101798 -275393 272724 1513
13138a55840G7044B1583b43944a20524A2978J28651J28630A20957a769D1703K7155
$$ -155840 77044 21583 -243944 -120524 12978 141629 270259 120957 -1769 41703 68858
13127F8858c57228B0013K56375G6515O84J59284a324j77599f3960D0950L75987
$$ 68858 -357228 20013 276388 76515 77199 236483 -1324 -178923 -63960 40950 416937
13116D16937A13646d2879j06727A57191J54783A16940P7720J1594c7228B77466
$$ 416937 113646 -42879 -149606 157191 311974 116940 194660 206254 -37228 277466
13105A71036a4235j0604r7242B93445I2116L25734B920b48673R2046k6576p4703
$$ 171036 -14235 -24839 -122081 293445 92116 417850 2920 -248673 -156627 -183203 -257906
13094b57906A75105i5756E8376J29449a41812C44307A69700K20198b63471A3896
$$ -257906 175105 -95756 58376 187825 -141812 344307 169700 389898 -263471 13896
13083E5460K22428d7815l30878A49510B629J54752Q9194h1386B37187a12842B49464
$$ 55460 277888 -47815 -378693 149510 2629 157381 246575 -81386 237187 -112842 249464
13071E64015F3202P8707e0435G7098f14l8308C33560A43218a46787N693A48388
$$ 564015 63202 141909 -50435 77098 -614 -38922 333560 143218 -146787 -141094 148388
13059a16247a4390l26432A08464J03059q1911h2518m1345A57358A3298Q4733d9285
$$ -116247 -14390 -340822 108464 211523 129612 -82518 -123863 157358 13298 98031 -49285
13047b23279d2163B09720l6235m0110J91846E0249J22197j6069a17028B3231c80499
$$ -223279 -42163 209720 173485 133375 325221 50249 172446 156377 -117028 23231 -380499
13035g9731j51935A23915O6335b2725o8044a121I5048D2364A0917a00436H4724
$$ -79731 -231666 123915 190250 -22725 -90769 -1121 95048 42364 10917 -100436 84724
13023c32083H8838K46585A5603f1351k02127i1298B5712a50143B78716a88571
$$ -332083 88838 335423 15603 -61351 -263478 -91298 25712 -150143 278716 -188571
13012g5431C91388l3519I9957b67642a26663A41029i7796A53413R579a75533O1703
$$ -75431 391388 357869 99957 -267642 -126663 141029 -97796 153413 162992 -175533 -113830
13001a13830A55671f8839I6799m0324Q4993a35579o6566d7145j4914b6308A074
$$ -113830 155671 -68839 96799 56475 141468 -135579 -202145 -47145 -62059 -26308 1074
12989I8046K1043i5092B17386K49012o0220A71538J86835A9356k054J28738c1271
$$ 98046 119089 -95092 217386 466398 406178 171538 358373 19356 17302 146040 -31271
12977A78974F2903L8051k1924a02161B44441R2968g5947A28676A8377a41379A88851
$$ 178974 62903 100954 79030 -102161 244441 337409 -75947 128676 18377 -141379 188851
12965F5452J89437n9217g6902c7893A61957h0136j06650G719k102a06213M8764
$$ 65452 254889 195672 -76902 -37893 161957 -80136 -186786 7719 5617 -106213 -57449
12954e7449B54213A5472J50525C7102J18200J04577C7833J19871P9406J83356
$$ -57449 254213 15472 165997 37102 155302 259879 37833 157704 237110 420466
12944D20466D5813e3547k1863D5096a39739j13608C12540b32193J02754A12445
$$ 420466 45813 -53547 -75410 45096 -139739 -253347 312540 -232193 -129439 112445
12933a23613H8903J37039a00129a7388F3377b17575R1616M4946A55665J41093
$$ -123613 88903 225942 -100129 -17388 63377 -217575 -125959 -81013 155665 296758
12923B96758a2083B1527a33536N8970A07234Q8711K6106G0423Q1542B2409f6389
$$ 296758 -12083 21527 -133536 -74566 107234 195945 222051 70423 151965 22409 -66389
12911c4808L811k7262a2320B5571J82865g5323b4240j60352D6859d4000I9928
$$ -34808 -30997 -58259 -12320 25571 208436 -75323 -24240 -184592 46859 -44000 99928
12899B54407d3621k03172J19209E1106a30291k3017B17495P580G3569a23705j32704
$$ 254407 -43621 -246793 -127584 51106 -130291 -153308 217495 225075 73569 -123705 -256409
12888b56409F9103L27772a54334B09319I8355R7770e39693A20635b54672E4463
$$ -256409 69103 396875 -154334 209319 98355 196125 -539693 120635 -254672 54463
12877A42223n8923g6332B33693F6053b37390Q6371H2687a3532n667n7956B12947
$$ 142223 83300 -76332 233693 66053 -237390 -151019 82687 -13532 -19199 -77155 212947
12865a55509B90281q266a27146B56628b50324C70489h5608e56C18945c55013L5463
$$ -155509 290281 282015 -127146 256628 -250324 370489 -85608 -556 318945 -355013 -319550
12854c19550A47665c12336E0762b7353A06041A2153O657J23696k8213E5669g6764
$$ -319550 147665 -312336 50762 -27353 106041 12153 18810 142506 114293 55669 -76764
12842A29449d3486k44368J00744E8691i9866A27274m8142a44974m8820G1999f0873
$$ 129449 -43486 -287854 -187110 58691 -99866 127274 79132 -144974 -193794 71999 -60873
12830A59054b41094A68499H1639P174P9749K99985k08545a95565A53601a38806
$$ 159054 -241094 168499 81639 88813 168562 468547 260002 -195565 153601 -138806
12819A67232n9151B659J3730K47366J16005o5791I3625b61061J19378N900C8323
$$ 167232 108081 2659 16389 263755 379760 313969 93625 -261061 -141683 -135783 38323
12807a20875E4460O0495a05160A5194c26682A03778i8011j87209h2331A35707
$$ -120875 54460 114955 -105160 15194 -326682 103778 -98011 -285220 -82331 135707
12796A10076a56629l8803I2505b32539L5086h0100I5940a12941B02803h7202B8834
$$ 110076 -156629 -195432 92505 -232539 -197453 -80100 95940 -112941 202803 -87202 28834
12784e6243K2121J2402A94260a15215C34576A08843l9611B1354d8939C066b70767
$$ -56243 -34122 -21720 194260 -115215 334576 108843 69232 21354 -48939 3066 -270767
12772a15883b6888E7193J26618a06078A26635G94L29114j51793f1423A40683a65953
$$ -115883 -26888 57193 183811 -106078 126635 794 329908 178115 -61423 140683 -165953
12760a9875m85B3993J45339d000G023J00191f9706E5926j2042d0058A7866b56075
$$ -19875 -20360 23993 169332 -4000 7023 107214 -69706 55926 43884 -40058 17866 -256075
12747H6980L14141c0823I9445j9613f798l41924A67038a1212k61961a27806b9040
$$ 86980 401121 -30823 99445 79832 -6798 -348722 167038 -11212 -273173 -127806 -29040
12735a50550A68096a61061c4162m0663j8305I7370J11648a13921k3400k10126
$$ -150550 168096 -161061 -34162 -74825 -93130 97370 209018 -113921 -137321 -347447
12725c47447g022p2427A56007m1970O5385H8976L54653j15851L5600h8945L9929
$$ -347447 -7022 -79449 156007 114037 179422 88976 443629 327778 363378 -88945 -49016
12714d9016A44646M15361i4877l8807d1649H9787a04912F5189h9535c0058J4211
$$ -49016 144646 560007 -94877 -133684 -41649 89787 -104912 65189 -89535 -30058 -15847
12703a5847C9523c45256h4919C30798b4198B53999G0774i4556d2719C33175o1701
$$ -15847 39523 -345256 -84919 330798 -24198 253999 70774 -94556 -42719 333175 271474
12692B71474j9103L8191M7957J31333A54784N2139F5958K81165H545a02453A00205
$$ 271474 252371 290562 338519 469852 154784 206923 65958 347123 8545 -102453 100205
12680A37720b57231D6759c6823H3648c67162I2265c0536F0098a01487O563B39267
$$ 137720 -257231 46759 -36823 83648 -367162 92265 -30536 60098 -101487 -94924 239267
12668A50858L5059n0126P5217F6790f0239B56289b56727C39580e0261A05193K8907
$$ 150858 185917 135791 211008 66790 -60239 256289 -256727 339580 -50261 105193 134100
12657A34100b02862b3784q3972F6500d74021I639O1248a41511A31523a32078r483
$$ 134100 -202862 -23784 -107756 66500 -474021 9639 70887 -141511 131523 -132078 -141561
12646a41561J6165r3555g5420A63974a35459k29786E9462e4554J4940a6523A74024
$$ -141561 -125396 -218951 -75420 163974 -135459 -365245 59462 -54554 -39614 -16523 174024
12634A22068J51305A14980a88001A29017b00772N3481A23716b64124J27210d7502
$$ 122068 273373 114980 -188001 129017 -200772 -147291 123716 -264124 -136914 -47502
12623b3879k34259C16800n8788A7478J3825C975a3202D3076J83811c6543B44243
$$ -23879 -258138 316800 258012 17478 31303 3975 -13202 43076 226887 -36543 244243
12611B85077j13636J11249G2942K6382L2703K55453b07302h1265j9949A05634
$$ 285077 171441 282690 72942 99324 132027 387480 -207302 -81265 -101214 105634
12600B07375l1438b14666D2920P5570b01034c7815j9322l3045F8804L86286d6953
$$ 207375 175937 -214666 42920 118490 -201034 -37815 -57137 -90182 68804 455090 -46953
12588A63052a02588D43787G507c3996q5554A05956E2239R9901c4291B79900f3217
$$ 163052 -102588 443787 7507 -33996 -119550 105956 52239 152140 -34291 279900 -63217
12576C80028A28984h0868B62677H2463k1289B8384M75698e4592A12059i7420a1303
$$ 380028 128984 -80868 262677 82463 61174 28384 504082 -54592 112059 -97420 -11303
12564C729J3084P7228J60787a6620A91131l3835E1678o57c00882a18754e4374
$$ 3729 16813 94041 254828 -16620 191131 157296 51678 51021 -300882 -118754 -54374
12552f18j22358B64912n1628D8967b34240e0807K3953A86312f1373j13636A37641
$$ -618 -122976 264912 213284 48967 -234240 -50807 -26854 186312 -61373 -175009 137641
12540i7856C82996a23427C6028A7399L6374J87715a49393B2918L66321m4711b8509
$$ -97856 382996 -123427 36028 17399 53773 241488 -149393 22918 389239 344528 -28509
12528B28761d5588j18241L1158j1999j72000J38519f538k6321B00392F4082c9189
$$ 228761 -45588 -163829 -132671 -144670 -316670 -178151 -6538 -32859 200392 64082 -39189
12516A91580q0471a57864g876p0256k18188J24187B49559A06461a4606B29947
$$ 191580 111109 -157864 -7876 -78132 -296320 -172133 249559 106461 -14606 229947
12505A80582D9544J2332K07750A4681J45103l232h6474d2716q4884B75833D9914
$$ 180582 49544 61876 269626 14681 159784 156552 -86474 -42716 -127600 275833 49914
12493H7950d9655A46693m0671d8971A45771L2210D7370K76737h346l4583h355
$$ 87950 -49655 146693 106022 -48971 145771 177981 47370 324107 -8346 -42929 -8355
12481G2112a08879j22778c5240j2629j04800A31880N9319e0744j10745c2229n455
$$ 72112 -108879 -231657 -35240 -47869 -152669 131880 191199 -50744 -161489 -32229 -37684
12470c7684a2034o386j45167A57680b3421B25635R511a44875E1594N1558q341
$$ -37684 -12034 -18420 -163587 157680 -23421 225635 235146 -144875 51594 103152 94811
12459I4811J13129c7280G5650a65947A6332a40884h287k18326I8141g4553F0801
$$ 94811 207940 -37280 75650 -165947 16332 -140884 -8287 -226613 98141 -74553 60801
12447B05336G517K61805C3243h7234I3046j8093k3875c4235m0281r697B48577
$$ 205336 7517 269322 33243 -87234 93046 74953 51078 -34235 -74516 -84213 248577
12435B096a57640A33413a16464L4802A34483b4519j64398D2417b62338I8697b31125
$$ 2096 -157640 133413 -116464 -81662 134483 -24519 -188917 42417 -262338 98697 -231125
12423D7906K16019f1783m3044b6578L852j56469d2603A22966c17435A38006c4597
$$ 47906 263925 -61783 -104827 -26578 -22726 -179195 -42603 122966 -317435 138006 -34597
12411A14050b00515F101M5908A712e0676B68085a04156d5542r8629H4088C3362
$$ 114050 -200515 6101 52009 1712 -50676 268085 -104156 -45542 -144171 84088 33362
12399a76392o2120C20160E1251J55430B136J4176L63412j31349c62989a4263l47182
$$ -176392 -238512 320160 51251 206681 2136 16312 379724 248375 -362989 -14263 -361445
12388c61445G1106o088R3839c01154A82449D9411b58594a03764D859d51319B04450
$$ -361445 71106 65018 158857 -301154 182449 49411 -258594 -103764 4859 -451319 204450
12376D3165K02338g7866B4737e7722B30822p6591Q5559f7896J3393E6395a8591
$$ 43165 245503 -77866 24737 -57722 230822 154231 239790 -67896 -54503 56395 -18591
12364B21025A450J7732a47556N807d2966B10048a29173A09331m6294a170o6684
$$ 221025 1450 19182 -147556 -141749 -42966 210048 -129173 109331 63037 -1170 -67854
12353f7854F7581J6220b11568D7235K25099a22684n462B04980a95087C80099f8816
$$ -67854 67581 83801 -211568 47235 272334 -122684 -128146 204980 -195087 380099 -68816
12341e203j41023O1961j06159c8850f686j66460c7691N617k26061A40701b52694
$$ -5203 -146226 -84265 -190424 -38850 -6686 -173146 -37691 -32074 -258135 140701 -252694
12329G5223a42817A020K15812I4950e470A4743J61352b31884f7454E9340J68188
$$ 75223 -142817 1020 216832 94950 -5470 14743 176095 -231884 -67454 59340 227528
12318B27528p9958o6330f2584A19597a92728A07903A3489K38873b60337M0821
$$ 227528 147570 81240 -62584 119597 -192728 107903 13489 252362 -260337 -219516
12308b19516F1208k2989Q4028n6966b61362D155K41328P0601p3575a4781F734
$$ -219516 61208 38219 122247 65281 -261362 4155 245483 316084 242509 -14781 6734
12296a83742O2845A71264q1825f9055A17411C578M9706J7116P3189E2669M470
$$ -183742 -120897 171264 89439 -69055 117411 3578 53284 70400 143589 52669 57139
12285E7139N0804C2708j4419K67851g3731B63555a8723j24042A9153d3283j5875
$$ 57139 107943 32708 18289 286140 -73731 263555 -18723 -142765 19153 -43283 -59158
12274e9158A43186F3334J15747l7716b5B39668C1527b40621A71832R646p8423
$$ -59158 143186 63334 179081 141365 -25 239668 31527 -240621 171832 181478 103055
12263A03055d9425m6039J0096B14451J48752m2189A41926K0149a37999C9195a0724
$$ 103055 -49425 -95464 -85368 214451 363203 321014 141926 162075 -137999 39195 -10724
12251a36011f2652b3548F1225j8435a15426B61078l0016b6565j31929A69932i2353
$$ -136011 -62652 -23548 61225 42790 -115426 261078 231062 -26565 -158494 169932 -92353
12239b67731h2995B70572a97480c7974F8958J70978l1524d4217D02855n7422F2379
$$ -267731 -82995 270572 -197480 -37974 68958 239936 208412 -44217 402855 345433 62379
12227F4818d6925A31234J81679a92351A53642b2492D08109A24449a63902A56180
$$ 64818 -46925 131234 312913 -192351 153642 -22492 408109 124449 -163902 156180
12216A76843a09298B16968a04900M0120F4424N44323A05227C2575a05429C0743
$$ 176843 -109298 216968 -104900 -64780 64424 608747 105227 32575 -105429 30743
12205A36215K14297D1682J86240o7069k3474m7507L07206b177j819A41239N6858
$$ 136215 350512 41682 227922 160853 137379 89872 397078 -2177 -3996 141239 198097
12194A98097D9745J61496b5286B20458q5389l2466D7973K05210N3431O5847a94068
$$ 198097 49745 211241 -25286 220458 135069 102603 47973 253183 306614 372461 -194068
12182B48008F9471M87756E0110J63208N2541k6421g1489G9082j5435b12705M4974
$$ 248008 69471 557227 50110 213318 265859 239438 -71489 79082 63647 -212705 -167731
12171a67731A34706l0014J44865f5294a2156A78209l6043H340N5868c0331B34437
$$ -167731 134706 104692 249557 -65294 -12156 178209 142166 8340 64208 -30331 234437
12159C07850A22105C4835L9046A5007L23766Q0168A43357F6347G053J3667Q5677
$$ 307850 122105 34835 73881 15007 338773 418941 143357 66347 7053 20720 106397
12148A06397a15499A33386n4444L776p703a10024k15123h6216D1013a10544E2180
$$ 106397 -115499 133386 78942 82718 75015 -110024 -325147 -86216 41013 -110544 52180
12136a54247K6056A93842O7033J8928O2570r2441H948J05519K80649I6445L8706
$$ -154247 -128191 193842 260875 279803 342373 249932 8948 114467 395116 96445 135151
12125A35151C4280J1741b02956B77481b4164k4530A86236N0604i0763k5305A19043
$$ 135151 34280 46021 -202956 277481 -24164 -48694 186236 236840 -90763 -116068 119043
12113B68903a69127j79137A24588g21A78567A9143K10736I6931i5374A45954a30614
$$ 268903 -169127 -348264 124588 -721 178567 19143 229879 96931 -95374 145954 -130614
12101h8824j82864A1958a10839D0610a50325F9315J0965O8273b8496B03808q9242
$$ -88824 -271688 11958 -110839 40610 -150325 69315 80280 148553 -28496 203808 114566
12090A14566C5610d6435C00774a64935O3369l5207C3009a39415K4172C70664E3953
$$ 114566 35610 -46435 300774 -164935 -101566 -136773 33009 -139415 -115243 370664 53953
12078g6622E4941f7494A44495c66137e805k36082D978b82983a28744m570G6073
$$ -76622 54941 -67494 144495 -366137 -5805 -241887 4978 -282983 -128744 -133314 76073
12066H2641l4702J42718N87307M91484l28307k25882C57413a4395D02396j68094
$$ 82641 47939 190657 777964 1269448 941141 715259 357413 -14395 402396 234302
12056B34302K8599k0515a57766I2249J09695g2356I6667g2250A37891m3423N1896
$$ 234302 262901 242386 -157766 92249 201944 -72356 96667 -72250 137891 94468 146364
12045A46364c6251m0229k7428k32727A00183J98068f5892A4880M22316i4928A11799
$$ 146364 -36251 -76480 -103908 -336635 100183 298251 -65892 14880 437196 -94928 111799
12033e8652A10332L3445b45485M0407L6658l7324a2015l04495A07034a9677B26809
$$ -58652 110332 143777 -245485 -205078 -168420 -205744 -12015 -316510 107034 -19677 226809
12021a71928E1174O993b95118a34352A87205D9129a46250B8241O748g0483m3643
$$ -171928 51174 58167 -295118 -134352 187205 49129 -146250 28241 34989 -70483 -114126
12010a14126B45250E9957c1375J1909r4480B00988I3386e897o1822j66961c4957
$$ -114126 245250 59957 -31375 -19466 -113946 200988 93386 -5897 -67719 -234680 -34957
11998B809J9624L5674i9857j15787C01978j31399J72370b52956b7542k5197j80931
$$ 2809 22433 58107 -99857 -215644 301978 170579 342949 -252956 -27542 -52739 -233670
11987b33670D02904d1751k06743A35634K33443A29867b53485a15381f105j55173
$$ -233670 402904 -41751 -248494 135634 369077 129867 -253485 -115381 -6105 -161278
11977a61278K1607c2355B4433K46490a7279A50374a69119D1981a30751j50753
$$ -161278 -139671 -32355 24433 270923 -17279 150374 -169119 41981 -130751 -281504
11967b81504C8690a03130G6419J37467g7897k32488e3807j82226i6790A83683
$$ -281504 38690 -103130 76419 213886 -77897 -310385 -53807 -236033 -96790 183683
11956a75704K3708K3323N1010l5190k6544J2586p5744h928A7003a13941G7980
$$ -175704 -151996 -128673 -77663 -112853 -139397 -126811 -202555 -8928 17003 -113941 77980
11944h9160a997m1503p2999n3562K8516D9970O7970j5139J67375J53810B1355
$$ -89160 -1997 -43500 -116499 -170061 -141545 49970 117940 102801 270176 423986 21355
11932B44885m3295C8497a15169r4996B55506b49194d2990C6472R6761a77815O1383
$$ 244885 201590 38497 -115169 -210165 255506 -249194 -42990 36472 133233 -177815 -116432
11921a16432j27430A98362I6281B0349J38527d2853q9461l3887K5091A8156b60280
$$ -116432 -243862 198362 96281 20349 158876 -42853 -132314 -166201 -141110 18156 -260280
11909A88234h7909M2436H5216O0515o0200a3071H2944b88518R4685C41061E8211
$$ 188234 -87909 -45473 85216 145731 85531 -13071 82944 -288518 -193833 341061 58211
11897A53573D1300f7431B30396a48370A6852c16181a7443I8351J85515J23178
$$ 153573 41300 -67431 230396 -148370 16852 -316181 -17443 98351 283866 407044
11887D07044b00204c0526j86107b9967j58622j3363a3171m788B2678K70069J8390
$$ 407044 -200204 -30526 -216633 -29967 -188589 -201952 -13171 -17959 22678 292747 311137
11876C11137b21755I7195b4805k49642i3189p3295B8487Q1413K5256f3334A126
$$ 311137 -221755 97195 -24805 -274447 -93189 -166484 28487 109900 135156 -63334 1126
11864B0971c44800I4235N7273d9524l27222D3714a45299c5733j08343n971J6322
$$ 20971 -344800 94235 151508 -49524 -376746 43714 -145299 -35733 -144076 -150047 -133725
11853a33725k12722B61462G0184b44123h6027c3720A86608g7032r058H8957N2986
$$ -133725 -346447 261462 70184 -244123 -86027 -33720 186608 -77032 -86090 88957 141943
11842A41943m4705I198M5924d2848B00060b53597C931a84700Q1013m8221c4206
$$ 141943 97238 9198 55122 -42848 200060 -253597 3931 -184700 -103687 -151908 -34206
11830A14521k7025j9344i7722r4418J6166P2458K0934n2134j1351B28861o404
$$ 114521 87496 68152 -97722 -192140 -175974 -103516 -82582 -134716 -146067 228861 222457
11819B22457a62846j46612A85970b59520N2429B05779a01467B1412R7428b7822
$$ 222457 -162846 -309458 185970 -259520 -207091 205779 -101467 21412 118840 -27822
11808a5059l94665A97555q8312a92418E2469d1536j39062a9166B5553B070N063
$$ -15059 -409724 197555 109243 -192418 52469 -41536 -180598 -19166 25553 2070 7133
11797G133i7195n7662e795E5482a74169d4830B25705b11136R9189c9186A94693
$$ 7133 -97195 -154857 -5795 55482 -174169 -44830 225705 -211136 -111947 -39186 194693
11785e8252A72646a58125M5841m8888A14864f7382k38298d5178r8482h884r6476
$$ -58252 172646 -158125 -112284 -161172 114864 -67382 -305680 -45178 -143660 -8884 -105360
11774a05360L4946a2187o026D9758a0216H2376L84311b8641A65481b19474r9404
$$ -105360 -70414 -12187 -18213 49758 -10216 82376 466687 -28641 165481 -219474 -318878
11763c18878B75257i1361E1534g4317m76578K55333h1618A9073R6365Q0953b49287
$$ -318878 275257 -91361 51534 -74317 -550895 -295562 -81618 19073 115438 196391 -249287
11751E0732d6576H9762a44566B78066A06637k9810H216M09631d9943E1086e8081
$$ 50732 -46576 89762 -144566 278066 106637 76827 8216 417847 -49943 51086 -58081
11739B835a02376l04172C03503h6890B17601o99h7807k98708L0410A68226D4455
$$ 2835 -102376 -406548 303503 -86890 217601 216902 -87807 -386515 -356105 168226 44455
11727a00441H0701B3727e2371j36998B64825A0533J89615b37365A46407l8592
$$ -100441 80701 23727 -52371 -189369 264825 10533 200148 -237365 146407 107815
11717A07815K6468E4586P1265n6935d38699a3739D9181i7090C9795a13359C67139
$$ 107815 134283 54586 125851 68916 -438699 -13739 49181 -97090 39795 -113359 367139
11705a08821d1531B2831J33184e3380A32931c15463A69350D7898i2052F0025B4035
$$ -108821 -41531 22831 156015 -53380 132931 -315463 169350 47898 -92052 60025 24035
11693b8042j34822a8036E7401P4695N2708n9506a80768P317E6299c6641j27267
$$ -28042 -162864 -18036 57401 132096 184804 125298 -180768 -173451 56299 -36641 -163908
11682a63908C71982d258D0809K18377a93324C02042h2817A27060i5715B20345
$$ -163908 371982 -4258 40809 259186 -193324 302042 -82817 127060 -95715 220345
11671b68421A6997a49476B88034i9489J7043D35559B09482g3927k20585G012a28224
$$ -268421 16997 -149476 288034 -99489 -82446 435559 209482 -73927 -294512 7012 -128224
11659A1513b40869g3872G7938k2045J53206F7757J0370a01603r0097q3651e6096
$$ 11513 -240869 -73872 77938 55893 209099 67757 78127 -101603 -191700 -275351 -56096
11647a28768F4599q524Q0676k5257C435J01469c3093D9081J15219A0691O483g6210
$$ -128768 64599 56075 136751 111494 3435 104904 -33093 49081 164300 10691 17174 -76210
11634A60212J07817L1714a30298k83118d9373i745j90860B17562a55952d1491
$$ 160212 268029 299743 -130298 -413416 -49373 -9745 -200605 217562 -155952 -41491
11623A73831a543j8934A9468a86874A75129a39754F2844J10950C4098J69665E8905
$$ 173831 -1543 -20477 19468 -186874 175129 -139754 62844 173794 34098 203763 58905
11611A51675i057l4281A89855a90337B410a01270A6623a46351B55839J060i7038
$$ 151675 -9057 -43338 189855 -190337 2410 -101270 16623 -146351 255839 256899 -97038
11599c64775I0500P4791i3768B00435K4490d2729A65678l1114o4541b90463C10867
$$ -364775 90500 165291 -93768 200435 224925 -42729 165678 134564 70023 -290463 310867
11587e7029B27979h7029C34143H9909a9601j28104A99880p8371D3757a40943j43903
$$ -57029 227979 -87029 334143 89909 -19601 -147705 199880 121509 43757 -140943 -284846
11576b84846m9636C20908b05787C94650A92862J25730b05198A62053g1858C0839
$$ -284846 -334482 320908 -205787 394650 192862 318592 -205198 162053 -71858 30839
11565g8565j266k1637K7279C5357a0890A2394a10818C21525b43613B55351e3316
$$ -78565 -79831 -101468 -74189 35357 -10890 12394 -110818 321525 -243613 255351 -53316
11553E9300b3135o8951A67160C8303G002b78790b989D11246b6945k266D2739L27798
$$ 59300 -23135 -92086 167160 38303 7002 -278790 -2989 411246 -26945 -29211 42739 370537
11541C70537A67561g3006H3839b09886C45635A59034k2447R2657r535K8265K0804
$$ 370537 167561 -73006 83839 -209886 345635 159034 136587 229244 219709 247974 268778
11530B68778A32145f5928C9971a64405C05061J52198d7594A6061J16792K53632
$$ 268778 132145 -65928 39971 -164405 305061 457259 -47594 16061 132853 386485
11520C86485a39818C34000f3583D10854i7662B4061J93679f8842B57671K4471
$$ 386485 -139818 334000 -63583 410854 -97662 24061 217740 -68842 257671 282142
11510B82142A01620a03011g104j04694H762J91741O8651a45229A57161a66418
$$ 282142 101620 -103011 -7104 -111798 8762 200503 269154 -145229 157161 -166418
11499C5629B826e8951G3510J60338I7520K51529B9814a23436j4770B16345q5814
$$ 35629 2826 -58951 73510 233848 97520 349049 29814 -123436 -138206 216345 130531
11488A30531g8449C26253q5859D1243M8617a951E2261b1403B03016l2150l9558
$$ 130531 -78449 326253 240394 41243 89860 -1951 52261 -21403 203016 170866 131308
11477A31308a53365G9292J58152O9178a2134p5894B77141G5886K24990q3878i2761
$$ 131308 -153365 79292 237444 306622 -12134 -88028 277141 75886 300876 216998 -92761
11465E2594A8870K46970a24697A90638a02408k2309A56584A6646J86639l4844
$$ 52594 18870 265840 -124697 190638 -102408 -124717 156584 16646 203285 168441
11455A68441c7448l4006o5367A60148I339J73710D9177K55172j50322K81389i0605
$$ 168441 -37448 -71454 -136821 160148 9339 183049 49177 304349 154027 435416 -90605
11443B3057J2002b4618F7599a15815D37235i603j8800k61729A35574c70982e6910
$$ 23057 35059 -24618 67599 -115815 437235 -9603 -28403 -290132 135574 -370982 -56910
11431H3572a33879j0924C67887a0736B50785e6254l3363L7238m7417A20640j0606
$$ 83572 -133879 -144803 367887 -10736 250785 -56254 -89617 -52379 -99796 120640 110034
11420A10034K12513A24758a34594b7980A09294A807e9607A25022m33D5231L72748
$$ 110034 322547 124758 -134594 -27980 109294 1807 -59607 125022 124589 45231 417979
11409D17979A08370J6475a12907A11726K8795a74864C69572A82183G4880b54813
$$ 417979 108370 124845 -112907 111726 140521 -174864 369572 182183 74880 -254813
11398A10083b57731A66271a64762d0875A8454b26293e3848j14091D2075K0184
$$ 110083 -257731 166271 -164762 -40875 18454 -226293 -53848 -167939 42075 62259
11388F2259J68778I6344J27967a09526b3091A47095b1246A1700i983A4530a21424
$$ 62259 231037 96344 224311 -109526 -23091 147095 -21246 11700 -9983 14530 -121424
11376c591j05858d5271A66429b11166h7428B33884l1391b12977J6133j5289D5950
$$ -3591 -109449 -45271 166429 -211166 -87428 233884 202493 -212977 -196844 -212133 45950
11364a47362G9700J53523b61387R2836G3472a62884A80772b20718d6565A84953
$$ -147362 79700 233223 -261387 -168551 73472 -162884 180772 -220718 -46565 184953
11353c2818A24703j5438a0374q7002j57543h5837C16120a71846j39224J48666
$$ -32818 124703 109265 -10374 -97376 -254919 -85837 316120 -171846 -311070 -162404
11343a62404O0724B42884c9082o0267D18248c2969j91518B33227r6672D703Q2633
$$ -162404 -101680 242884 -39082 -99349 418248 -32969 -224487 233227 136555 4703 87336
11332H7336L55217A00831b52456a08474C9683J92079b09644K3782Q1609c403q8150
$$ 87336 442553 100831 -252456 -108474 39683 231762 -209644 -185862 -104253 -3403 -91553
11321i1553j02680A08730J46244g3086B59010c47020J09870b3545G4760c34407
$$ -91553 -194233 108730 254974 -73086 259010 -347020 -237150 -23545 74760 -334407
11310a6388k33881B90796I5786a05424J326C05494b56316P0047A00770Q625C7558
$$ -16388 -250269 290796 95786 -105424 -104098 305494 -256316 -186269 100770 109395 37558
11298E8209g6646j9452C56759A48061b7524l06893e5806D1527a1238l21494a23838
$$ 58209 -76646 -96098 356759 148061 -27524 -334417 -55806 41527 -11238 -332732 -123838
11286A16682A288J79517B7412j993K78714A0435a02401k0093n5010A33507m6943
$$ 116682 1288 180805 27412 25419 304133 10435 -102401 -122494 -177504 133507 86564
11275H6564K01046c4997A15742f5172K0518j8564b2276j05514j3325f4503B0422
$$ 86564 287610 -34997 115742 -65172 -44654 -63218 -22276 -127790 -141115 -64503 20422
11263b06348R7428A54805a34705m04587B0442J13055a86063p8547E2860c42147
$$ -206348 -108920 154805 -134705 -539292 20442 133497 -186063 -264610 52860 -342147
11252h0559A19087d65j55704B6503i1102F331a9037A06946b75069a5853B4896
$$ -80559 119087 -465 -156169 26503 -91102 6331 -19037 106946 -275069 -15853 24896
11240I13a19445m6739B35373a90393f525j6928n1363B67838E6765M0902e1275
$$ 913 -119445 -166184 235373 -190393 -6525 -23453 -74816 267838 56765 97667 -51275
11228d026A04454a64844A47756j5959K7281a7698p5920n6294k3698A94778b86415
$$ -4026 104454 -164844 147756 131797 159078 -17698 -93618 -149912 -173610 194778 -286415
11216E7828b10502O9959c305l1525j71114R0259C2273b04623R9331A30441B5528
$$ 57828 -210502 -140543 -3305 -34830 -205944 -115685 32273 -204623 -105292 130441 25528
11204c4298B35103J89973a87527J1337N4217K6453A20142D4960a49680F2477C0945
$$ -34298 235103 425076 -187527 -176190 -121973 -95520 120142 44960 -149680 62477 30945
11192a1309m8819A19620b1867j43995L5158B1779f27108i2781j67587i6747o2895
$$ -11309 -60128 119620 -21867 -165862 -130704 21779 -627108 -92781 -260368 -96747 -159642
11181a59642d7610A44816b33391a14292B04767E026e9773C93374A56617a14924
$$ -159642 -47610 144816 -233391 -114292 204767 5026 -59773 393374 156617 -114924
11170b86057a3161A8158h6250A20606d72270f5926G643J44262b33845j9839A53537
$$ -286057 -13161 18158 -86250 120606 -472270 -65926 7643 151905 -233845 -253684 153537
11158i4582B4868L04346B205R1881g4780A88407b07092r8640B3731b45448C4106
$$ -94582 24868 329214 2205 94086 -74780 188407 -207092 -305732 23731 -245448 34106
11146b29557j57891Q1541I2859g2023q806J9628J2565K1381G6724b47813B60959
$$ -229557 -387448 -305907 92859 -72023 -80829 -61201 -48636 -27255 76724 -247813 260959
11134b7270C96840a3806A17667a89100n9926l5570J37080J0088k2537C5480A1182
$$ -27270 396840 -13806 117667 -189100 -249026 -284596 -147516 -137428 -159965 35480 11182
11122A74530p6976K44710h3472F6096K08948j26056R0604O4917A11484j0436O6437
$$ 174530 97554 342264 -83472 66096 275044 148988 239592 304509 111484 101048 167485
11111A67485b6071m8086C79053E7106h6048A94306J97256A1778P4180b23337B0186
$$ 167485 -26071 -74157 379053 57106 -86048 194306 391562 11778 85958 -223337 20186
11099h8411A51319o2973a28895E1510N5342R7188i002M235k02235A36095K02123
$$ -88411 151319 88346 -128895 51510 106852 204040 -9002 -4767 -207002 136095 338218
11088C38218j11154C5818K1563h1726A03443P5399D7644N0989N2844j4007j7990
$$ 338218 227064 35818 57381 -81726 103443 178842 47644 98633 151477 137470 119480
11077A19480K4787f8499r4712B77645d896D07103j17362c0157A81283A8950J36927
$$ 119480 144267 -68499 -163211 277645 -4896 407103 289741 -30157 181283 18950 155877
11066A55877K52390j88698J01871A59945d5324A26186a53697B65183J53304A46922
$$ 155877 408267 219569 321440 159945 -45324 126186 -153697 265183 418487 146922
11055A50876O8642Q5961L07511B87489J78319j67889J36778B03185K15332j13857
$$ 150876 219518 305479 612990 287489 465808 297919 434697 203185 418517 304660
11045C04660L2612Q139M11878k75751J35860J20886j7440q8162P4320o82J05222
$$ 304660 337272 345411 757289 481538 617398 738284 720844 632682 707002 706320 811542
11034H11542j71876J4966J45797C37338K57109K50848k91797J40815j68168R1285
$$ 811542 639666 654632 800429 337338 594447 845295 553498 694313 526145 617430
11024F17430A89448M17755J66959l75482J69803j02198M21271B82066L47978Q9031
$$ 617430 189448 607203 774162 398680 568483 466285 887556 282066 630044 719075
11014G19075p4232p8893k522M21606m01221J43123k52865K92890j66228j60667
$$ 719075 644843 565950 563428 985034 583813 726936 474071 766961 600733 440066
11004D40066M2470N26241B92429L59229J03666k99911R0266J49716Q3638m5218
$$ 440066 482536 1008777 292429 651658 755324 455413 545679 695395 779033 733815
10994G33815C08362N03858j33804k41789K26433k63770m687M2453K20375j11431
$$ 733815 308362 812220 678416 436627 663060 399290 394603 437056 657431 546000
10984E46000J21713k0698C20397K44194K097q2990P2237K23450l38390J55731
$$ 546000 667713 647015 320397 564591 566688 483698 555935 779385 440995 596726
10974E96726k4102K05004J53911l24060L43589K66004k32885m9806r745M03582
$$ 596726 572624 777628 931539 607479 951068 1217072 984187 934381 924636 1328218
10964A328218q6417J23782j21250R688L23823K05853K31330J95564L21925q2708
$$ 1328218 1241801 1365583 1244333 1254021 1577844 1783697 2015027 2210591 2532516 2449808
10954B449808m6510o45107K17712l0027p839j65188k83832L58248k45903l47265
$$ 2449808 2403298 1758191 1975903 1945876 1938037 1772849 1489017 1847265 1601362 1254097
10944A254097L25507m1556m0996K02807j09144j90505K2391l30157k18157l0114
$$ 1254097 1579604 1538048 1497052 1699859 1590715 1400210 1422601 1092444 874287 844173
10934H44173j50441r0081K7981k30183A93118A1970M09022D5813J28452O733J37974
$$ 844173 693732 603651 631632 401449 193118 11970 420992 45813 174265 180998 318972
10923C18972M1206d4596B83115c9186m0546B65569C3345L22687A58628F2110J31537
$$ 318972 360178 -44596 283115 -39186 -79732 265569 33345 356032 158628 62110 193647
10912A93647E5378K5020b3661C60771C994R7783l7819b98491r4739E1215h5304
$$ 193647 55378 80398 -23661 360771 3994 101777 63958 -298491 -393230 51215 -85304
10900b00951b8292j97663B26962m5988K40956a67648L4415B1237b09237h7962
$$ -200951 -28292 -225955 226962 180974 421930 -167648 -133233 21237 -209237 -87962
10889d6815j1037R382G2613a06623A20228L1564M6537a80992c9845k59505F2669
$$ -46815 -57852 -48470 72613 -106623 120228 151792 198329 -180992 -39845 -299350 62669
10877D17890a61932r0941A92657q3304k3920b96021D1302L29725a23489k03836
$$ 417890 -161932 -252873 192657 109353 85433 -296021 41302 371027 -123489 -327325
10867c27325A8113J51558c10646a37368l4881B8152K09498A7550J54639h6148
$$ -327325 18113 169671 -310646 -137368 -172249 28152 237650 17550 172189 -86148
10856h6630A87706k9330a25895I1671K58467b79983J15261j0982B9614a31856
$$ -86630 187706 158376 -125895 91671 350138 -279983 -164722 -175704 29614 -131856
10845b49464e5404q520A01481m5338a8852B28R4661j6692A5582J20686J57543
$$ -249464 -55404 -63924 101481 56143 -18852 228 94889 78197 15582 136268 293811
10834B93811b82279A39380R3707n4658O0096b49635J01530B2900a31540G776b03881
$$ 293811 -282279 139380 233087 178429 238525 -249635 -148105 22900 -131540 7776 -203881
10822d1163A10073b46562j47293c4846l63660R6884A50386b4132j35752g7281
$$ -41163 110073 -246562 -393855 -34846 -398506 -301622 150386 -24132 -159884 -77281
10811c6101E2234Q8493J17854i5441r3559A8041a38217B5056M49317F5882a24769
$$ -36101 52234 140727 258581 -95441 -189000 18041 -138217 25056 474373 65882 -124769
10799b99178C78071a51480G4885a66461A5772K65790a14407A92263F125J5479
$$ -299178 378071 -151480 74885 -166461 15772 281562 -114407 192263 6125 21604
10789B1604L61449a7747j43113o0711E3189h9429A54095G0226a42335A88372b16161
$$ 21604 383053 -17747 -160860 -221571 53189 -89429 154095 70226 -142335 188372 -216161
10777c48793E4839j4743a9435m7892A90531J9383a10201A52163J35688l8653n9606
$$ -348793 54839 40096 -19435 -67327 190531 209914 -110201 152163 287851 249198 189592
10766A89592b41931e32o2809a1647D10778C9849a16548B7313b93231J30869I1411
$$ 189592 -241931 -532 -63341 -11647 410778 39849 -116548 27313 -293231 -162362 91411
10754B6637J15955a06492A47573l532b68930E6305c70752a73844q195o7626H9422
$$ 26637 142592 -106492 147573 144041 -268930 56305 -370752 -173844 -182039 -249665 89422
10742g960k87040C8015c59656a8181j00314A2116M2449c50199e3867k48136A5036
$$ -7960 -295000 38015 -359656 -18181 -118495 12116 54565 -350199 -53867 -302003 15036
10730e2095H1019g3604B11784m4382E103K20986g9922D1900A770K7898b54238
$$ -52095 81019 -73604 211784 167402 5103 226089 -79922 41900 1770 29668 -254238
10718a96214A95520c71562c470j14646b0630f351A23800e9737k28570a38549O6717
$$ -196214 195520 -371562 -3470 -118116 -20630 -6351 123800 -59737 -288307 -138549 -71832
10707g1832q5798A67333k8231f30401a05441A60449D6537f0969B9881j3658P7297
$$ -71832 -157630 167333 139102 -630401 -105441 160449 46537 -60969 29881 16223 93520
10696I3520J75395E000K206b30886K7900l4996G6383c35281a03889L4653Q903
$$ 93520 268915 5000 7206 -230886 -202986 -237982 76383 -335281 -103889 -69236 -60333
10685f0333P484A27456c86266a29718I2622J46583h7662A82902a35008m1593A21260
$$ -60333 -52849 127456 -386266 -129718 92622 239205 -87662 182902 -135008 -176601 121260
10673G4177c45080C20466E3498d1902o1996j77779A66547K5206C8800J51215q7336
$$ 74177 -345080 320466 53498 -41902 -103898 -281677 166547 191753 38800 190015 102679
10662A02679b14023R0860A67645D7186i3717M6715j393j80711a4972B83732b81065
$$ 102679 -214023 -123163 167645 47186 -93717 -47002 -48395 -229106 -14972 283732 -281065
10650e56721b38693A03423a42165H5497o123K70487e4343j78182H2223d31391
$$ -556721 -238693 103423 -142165 85497 79374 349861 -54343 -232525 82223 -431391
10639F6411A3751b78056m0400G1243c64998d8127j60873N2764B54423f9756c0445
$$ 66411 13751 -278056 -318456 71243 -364998 -48127 -209000 -156236 254423 -69756 -30445
10627b33229o556A10635K14335b65793q053P3579k8671O531f7686A04888R2396
$$ -233229 -239785 110635 324970 -265793 -273846 -200267 -228938 -222407 -67686 104888 197284
10616A97284d2466j2698j27349J5946b8705H9220a85600Q521j19706a20603A48308
$$ 197284 -42466 -55164 -182513 -166567 -28705 89220 -185600 -177079 -296785 -120603 148308
10604d06054C3981g905m10961D5257i2292l9776I3176J58226g2348K9024p1248
$$ -406054 33981 -7905 -418866 45257 -92292 -132068 93176 251402 -72348 -43324 -114572
10593a14572L5714D332K16414A5298a49676l267I9189R9959l1185a33389n6545
$$ -114572 -78858 4332 220746 15298 -149676 -152943 99189 199148 167963 -133389 -189934
10582a89934Q1174j16878D5892A3219a79826B17884h8885I0204b7125G1341f84228
$$ -189934 -108760 -225638 45892 13219 -179826 217884 -88885 90204 -27125 71341 -684228
10570b77189a34890N2658j5106H180c0571n1250D56187C9720g8176B47608a01709
$$ -277189 -134890 -82232 -97338 8180 -30571 -81821 456187 39720 -78176 247608 -101709
10558D7923a35726o3080a9996B44316F5126a96140M7179B23307a90628A28131
$$ 47923 -135726 -198806 -19996 244316 65126 -196140 -148961 223307 -190628 128131
10547C2404a43249j23037a18597F5186L5995l1545B3659J3013a6761A64931F7494
$$ 32404 -143249 -266286 -118597 65186 101181 69636 23659 36672 -16761 164931 67494
10535F9186M0020a94028A72432g1132L3891o3976A0835f2332K2254j12891L0367
$$ 69186 109206 -194028 172432 -71132 -37241 -101217 10835 -62332 -40078 -152969 -122602
10524a22602A70024b85033a28084a0496j77366g1732B36055c4578D7786a6191
$$ -122602 170024 -285033 -128084 -10496 -187862 -71732 236055 -34578 47786 -16191
10513c0842k70145A97562N5077r4615J38618I4692I319J47784K5566A5386a008
$$ -30842 -300987 197562 252639 158024 296642 94692 9319 157103 182669 15386 -1008
10501A53199B5414K86135a33818A10657b46810A97165q1577J26205A8183K7115
$$ 153199 25414 311549 -133818 110657 -246810 197165 115588 241793 18183 45298
10491D5298a44546A02579C3433O2507m4828a79391A30197B9576g1274l9797K3017
$$ 45298 -144546 102579 33433 95940 51112 -179391 130197 29576 -71274 -111071 -88054
10480h8054j11252B4712a14314A5861b75567g4689A64109b95952D0898J91416
$$ -88054 -199306 24712 -114314 15861 -275567 -74689 164109 -295952 40898 232314
10470B32314a41218r6191A99166O9225o1445R6375L2657L6488m1308C0118J97650
$$ 232314 -141218 -237409 199166 268391 206946 303321 335978 372466 331158 30118 227768
10459B27768G1387g936k97383a40845q4392j94732o800A91151a07046R345I1806
$$ 227768 71387 -7936 -305319 -140845 -225237 -419969 -426769 191151 -107046 -97701 91806
10447C9554a53098A30417m5024J7608A0977K51546d14595a04882d627j96069j90972
$$ 39554 -153098 130417 85393 103001 10977 262523 -414595 -104882 -4627 -200696 -391668
10436c91668a59956c3455C21510e6751D8454J97648a62013A95755d387C15029
$$ -391668 -159956 -33455 321510 -56751 48454 246102 -162013 195755 -4387 315029
10425C073b8384A41947b32526i2465a7542o4930b8120A62841a53420a3808H7208
$$ 3073 -28384 141947 -232526 -92465 -17542 -82472 -28120 162841 -153420 -13808 87208
10413g9107C1129K4504a13109e4896m6455a3500k41453B49801A9692a83816F5464
$$ -79107 31129 55633 -113109 -54896 -101351 -13500 -254953 249801 19692 -183816 65464
10401a71593B23563F0649A4873a57266B02661a87488d473m62620C99b94276q8313
$$ -171593 223563 60649 14873 -157266 202661 -187488 -4473 -467093 399 -294276 -382589
10390c82589J83893B8404a32237H8094e3768B75625h5931D9834e5674A93839q9485
$$ -382589 -198696 28404 -132237 88094 -53768 275625 -85931 49834 -55674 193839 104354
10379A04354L6362o2637q924K14031c7008A13176F543c4881R904A17827E7566
$$ 104354 140716 78079 69155 283186 -37008 113176 6543 -34881 -24977 117827 57566
10367b53999R3765A88611j8102a35862f5973B91810b21438F1751J17221a02768
$$ -253999 -160234 188611 170509 -135862 -65973 291810 -221438 61751 178972 -102768
10356A88322O1702l3741e3102A2525L94293j74598O1168N5934j16859R9102j19781
$$ 188322 250024 216283 -53102 12525 406818 232220 293388 349322 232463 331565 211784
10345B11784J18641j47100J17870j27879K72090j83637A01776L13704D6280J39085
$$ 211784 330425 183325 301195 173316 445406 261769 101776 415480 46280 185365
10335A85365O3593K6681J23621l2231m7081a01389B77144K92423j58254G2029
$$ 185365 248958 275639 399260 367029 319948 -101389 277144 569567 411313 72029
10324A32474K7852G073K42081A16894M8794K25002j31522j177h8176B58774F5216
$$ 132474 160326 7073 249154 116894 165688 390690 259168 257991 -88176 258774 65216
10312A02584d2697D57122B25859m1729O7264a03763n3349C07879m5119A18829
$$ 102584 -42697 457122 225859 184130 251394 -103763 -157112 307879 262760 118829
10301C08802j02298F561a8574B27810e0237a6325G603K7b07653k3575K2840K1130
$$ 308802 206504 6561 -18574 227810 -50237 -16325 7603 7630 -207653 -231228 -208388 -187258
10289a87258L7546N9692k46662f1584L168r5618I4247c46153g0772k509a1843
$$ -187258 -149712 -90020 -336682 -61584 -58416 -154034 94247 -346153 -70772 -73281 -11843
10277a68108N327a4575k47865B2287b67603M0800N0897h4246I2801d7755I6956
$$ -168108 -162781 -14575 -262440 22287 -267603 -226803 -175906 -84246 92801 -47755 96956
10265A58225c7775F7915a09279j27584j33632D9418c305l24852E1299d0913p8131
$$ 158225 -37775 67915 -109279 -236863 -370495 49418 -3305 -328157 51299 -40913 -119044
10254a19044j15345e2335E4254a08598C79888e5990j49853b3535A12581K78787
$$ -119044 -234389 -52335 54254 -108598 379888 -55990 -205843 -23535 112581 391368
10244C91368A63663K566a8110D53607A74740H6768l6024M5045k8484J2154r618
$$ 391368 163663 166229 -18110 453607 174740 86768 50744 95789 67305 79459 69841
10233F9841a70632A12782M318n0915b82879A23817C6686K50210a01599C46903
$$ 69841 -170632 112782 117100 66185 -282879 123817 36686 286896 -101599 346903
10222I2117O8974a03002g309B49681C8991d4447m420G1703c58096a22550j8123
$$ 92117 161091 -103002 -7309 249681 38991 -44447 -48867 71703 -358096 -122550 -140673
10211a40673p5395A4372b41225A60442D6983c0298l39746j26259G494c8678F1348
$$ -140673 -216068 14372 -241225 160442 46983 -30298 -370044 -496303 7494 -38678 61348
10199I1298k5620a05731j14023B53612b06625R6165A61065o9416Q4769g9203A60808
$$ 91298 65678 -105731 -219754 253612 -206625 -110460 161065 91649 176418 -79203 160808
10187E4118c94747B36523c3187j2744o9538a5821A6273a98751n8811J25910l11170
$$ 54118 -394747 236523 -33187 -45931 -115469 -15821 16273 -198751 -257562 -131652 -442822
10176d42822a52211c7064r6512D3366J5546a50281A65559a26619B8282a82930
$$ -442822 -152211 -37064 -133576 43366 58912 -150281 165559 -126619 28282 -182930
10165C0887J68917c87299H5713a66109B03431h4746A04083d7311m9452M7479A40881
$$ 30887 199804 -387299 85713 -166109 203431 -84746 104083 -47311 -96763 -49284 140881
10153b74944F8939f4347A8495b33084e374k30746K5956k04347B9450J5143b44960
$$ -274944 68939 -64347 18495 -233084 -5374 -236120 -210164 -414511 29450 44593 -244960
10141a23764f062p5533b043j6953k56394a06853o9858p6648e7842j18286I3939
$$ -123764 -6062 -81595 -2043 -18996 -275390 -106853 -176711 -253359 -57842 -176128 93939
10129a13075D3335b72400a08358k2263n9341I4412m3209a58290k61698d9726k22657
$$ -113075 43335 -272400 -108358 -130621 -189962 94412 51203 -158290 -419988 -49726 -272383
10118b72383J7056A17290b34958J15216j25008h7295E5325j2696A4159c2386k94344
$$ -272383 -255327 117290 -234958 -119742 -244750 -87295 55325 42629 14159 -32386 -326730
10107c26730f9038B17970j01026g0688m2305H4486l6954e02743J42653A40604
$$ -326730 -69038 217970 116944 -70688 -112993 84486 47532 -502743 -360090 140604
10096C9268e0545j60113I1530a68473j93731R5971a17931h263B47136b37646B63199
$$ 39268 -50545 -210658 91530 -168473 -362204 -266233 -117931 -8263 247136 -237646 263199
10084a91202f1866k00346a9090j18616p9578A29201c8274j99786a04713M2285
$$ -191202 -61866 -262212 -19090 -137706 -217284 129201 -38274 -238060 -104713 -62428
10074f2428B8619g4313m08537I4138f9906m71258e4603k30965A53722a4688j23359
$$ -62428 28619 -74313 -482850 94138 -69906 -541164 -54603 -285568 153722 -14688 -138047
10063a38047A15267b64773p5919A32697a23041E9861e918B8877b11523B7113b0916
$$ -138047 115267 -264773 -340692 132697 -123041 59861 -5918 28877 -211523 27113 -20916
10051A86786f6178n222A0016N2446M48691A76221p8902i4815B44915p2334n5850
$$ 186786 -66178 -71400 10016 62462 511153 176221 97319 -94815 244915 172581 116731
10040A16731b3590F9652K1973J2133c19200B2931J9479d05220c7326j45502m5588
$$ 116731 -23590 69652 91625 103758 -319200 22931 42410 -405220 -37326 -182828 -228416
10029b28416d1579j38184A99860a67783Q912j41700B21213g6430q7263A14198
$$ -228416 -41579 -179763 199860 -167783 -158871 -300571 221213 -76430 -163693 114198
10018a1555j01909F6427e6016q0805A41256g5532A02478k0415A8736a12284c6817
$$ -11555 -113464 66427 -56016 -136821 141256 -75532 102478 82063 18736 -112284 -36817
10006c7654k99557C43375G3656L3513a07392A03066J99042h1616j21651n8935
$$ -37654 -337211 343375 73656 107169 -107392 103066 302108 -81616 -203267 -262202
9996b62202a10062e2834A89747A006J55759e37524G5095a19161j78205B93275
$$ -262202 -110062 -52834 189747 1006 156765 -537524 75095 -119161 -297366 293275
9985B30118m4905r1382b51093N9694N701d0186j44016b731p432k20538a12552
$$ 230118 185213 93831 -251093 -191399 -185698 -40186 -184202 -2731 -10163 -230701 -112552
9973C7345a975n2859A1236d5385q7415E1825M1268j734b04395G2199K6972a13902
$$ 37345 -1975 -54834 11236 -45385 -132800 51825 93093 91359 -204395 72199 99171 -113902
9960e2069n8312j46456B2199J46427L2347b09499j26973H8039D0382a28890l2462
$$ -52069 -110381 -256837 22199 168626 200973 -209499 -336472 88039 40382 -128890 -161352
9949a61352j83415H7704a03678l8188g0383k83440m0024f567j15544A83353J10745
$$ -161352 -344767 87704 -103678 -141866 -70383 -353823 -393847 -6567 -122111 183353 294098
9938B94098a31916e9124a2131A26771A0719I51b78783g4640D6550J68263g3706
$$ 294098 -131916 -59124 -12131 126771 10719 951 -278783 -74640 46550 214813 -73706
9926a59192C2687i6226B52060c16145A6723c75682k58115h3605j66099h7511C9214
$$ -159192 32687 -96226 252060 -316145 16723 -375682 -633797 -83605 -249704 -87511 39214
9914B58700c69675A30460b04762A73669b24453q1476F2002c504j53032N9873q388
$$ 258700 -369675 130460 -204762 173669 -224453 -305929 62002 -3504 -156536 -96663 -105051
9903a05051E6529a96884k0553D3016N6960K907a52291c5848B1817R8646c49945
$$ -105051 56529 -196884 -217437 43016 99976 102883 -152291 -35848 21817 120463 -349945
9891A74801a15049M0376j87728A05658a94166B53712B3643a99624A16225b03165
$$ 174801 -115049 -74673 -262401 105658 -194166 253712 23643 -199624 116225 -203165
9880d09660J97032L3532M5449O0199l7650N770q7060d2274A07265B493a29700
$$ -409660 -212628 -179096 -133647 -73448 -111098 -105328 -192388 -42274 107265 2493 -129700
9868c50803f0376j13532o9725i7458b3409j46949h760j26296b1812k2742B55303
$$ -350803 -60376 -173908 -243633 -97458 -23409 -170358 -8760 -135056 -21812 -44554 255303
9856a57987k67515i5455F5296d1842m9646A61382D6394K5200K37449A12343h0101
$$ -157987 -425502 -95455 65296 -41842 -91488 161382 46394 71594 309043 112343 -80101
9844g0557j45443N1791A34384a4265j69781C1701R7004Q7254C3303J86091q6675
$$ -70557 -216000 -164209 134384 -14265 -184046 31701 128705 215959 33303 219394 132719
9833A32719A3821b35868M7600Q086b7400A12905b45951c7194A60498e0343j7680
$$ 132719 13821 -235868 -188268 -180182 -27400 112905 -245951 -37194 160498 -50343 -68023
9822f8023J0785J241q4717d8124j78192i228H8740P6035a42293j51746i4387j22130
$$ -68023 -57238 -55997 -140714 -48124 -226316 -9228 88740 164775 -142293 -294039 -94387 -216517
9810b16517g4513H4356a44155N4237j20343E931J60826g0891j67724J19005k4171
$$ -216517 -74513 84356 -144155 -89918 -210261 5931 166757 -70891 -238615 -119610 -143781
9799a43781j02458M9788e1004i043n54349a55408r5634Q7236g7602C33057a24175
$$ -143781 -246239 -196451 -51004 -9043 -563392 -155408 -251042 -163806 -77602 333057 -124175
9787d99399C40671i9079B57622a58128B36558p6854F4712L723K1276a05719p1204
$$ -499399 340671 -99079 257622 -158128 236558 159704 64712 68435 89711 -105719 -176923
9776a76923n6504f8778A50211d52969a01028j44786a04629J912j9359C3361a2368
$$ -176923 -233427 -68778 150211 -452969 -101028 -245814 -104629 -102717 -122076 33361 -12368
9764e3462D1430J53734b53861C1547b72873B52645A22489J0032L4984p7597b7312
$$ -53462 41430 195164 -253861 31547 -272873 252645 122489 132521 167505 89908 -27312
9752c43484B7431J3363a17086d5001k4893q3962I2620l6937a95162Q6999n2432
$$ -343484 27431 40794 -117086 -45001 -69894 -153856 92620 55683 -195162 -108163 -160595
9741a60595p5698d1255B3049N8605c54550I1379a04697A53255a22947c5940k23944
$$ -160595 -236293 -41255 23049 81654 -354550 91379 -104697 153255 -122947 -35940 -259884
9730b59884A41464L71914F0334a72408E0984c60875E5008c10077k7943e5977B09146
$$ -259884 141464 513378 60334 -172408 50984 -360875 55008 -310077 -338020 -55977 209146
9718a08384L6049A26595J26365b59427M9427n9553F776a3571j0852p4415A38340
$$ -108384 -72335 126595 252960 -259427 -210000 -269553 6776 -13571 -24423 -98838 138340
9706A72315a55646B34164c63135A9181e8133m4517k11501e2164b1428j15985K9370
$$ 172315 -155646 234164 -363135 19181 -58133 -102650 -314151 -52164 -21428 -137413 -108043
9695a08043m2772j2464I9224J86401h5932j9972j06788N7359j54898A41053a80148
$$ -108043 -150815 -163279 99224 285625 -85932 -105904 -212692 -155333 -310231 141053 -180148
9683C33651A56506L9829B7788O4209a12885q8244b8085p4881M1382j91945i9338
$$ 333651 156506 196335 27788 91997 -112885 -201129 -28085 -102966 -61584 -253529 -99338
9671g9725M666j18494R6600k4805O372k14026a02010L8357l7101B79554a73390
$$ -79725 -75059 -193553 -96953 -121758 -115386 -329412 -102010 -63653 -100754 279554 -173390
9659c27350a55806H1150e3485l06083a33760q5631A1265L76236A60203c47494
$$ -327350 -155806 81150 -53485 -359568 -133760 -219391 11265 387501 160203 -347494
9648A20117K08247a98026n7459a21321j2034k5121B6674f8413p5746j44414c7689
$$ 120117 328364 -198026 -255485 -121321 -133355 -158476 26674 -68413 -144159 -288573 -37689
9636H6703a2861k31506A04253i6087j10158c477A930b7442j85740d2511J4399
$$ 86703 -12861 -244367 104253 -96087 -206245 -3477 1930 -27442 -213182 -42511 -28112
9625b8112l00271J46800h5604n1883k2404D2057M7289Q6371a52159K1108A11896
$$ -28112 -328383 -181583 -85604 -137487 -159891 42057 89346 175717 -152159 -131051 111896
9613a39890A39761J72762I9144J04175b9930E7132b08986g17m8235C30819C65
$$ -139890 139761 312523 99144 203319 -29930 57132 -208986 -717 -48952 330819 365
9601C5267d7955j59574C39347a70227b7382H1239b35264f9069j25841G7578a59922
$$ 35267 -47955 -207529 339347 -170227 -27382 81239 -235264 -69069 -194910 77578 -159922
9589d6821A70112P1450f0186l98693B86825b06437A06625a13256A36796j8472
$$ -46821 170112 241562 -60186 -458879 286825 -206437 106625 -113256 136796 118324
9579A18324J39623A2938J78272b54561B6817c77703c0303A89644H7564i1473n4239
$$ 118324 257947 12938 191210 -254561 26817 -377703 -30303 189644 87564 -91473 -145712
9568a45712F5384a53928a3595j75040g7727A24614C424c09703J29786f6790j17505
$$ -145712 65384 -153928 -13595 -188635 -77727 124614 3424 -309703 -179917 -66790 -184295
9557a84295c7069A06059m6022a01720B92710A7810b5065F1874f9993j94564f5144
$$ -184295 -37069 106059 60037 -101720 292710 17810 -25065 61874 -69993 -264557 -65144
9545A7184a22667j64930E154M6074c45523c4331q889k09527F2937b23691A0092
$$ 17184 -122667 -287597 5154 51228 -345523 -34331 -43220 -252747 62937 -223691 10092
9533A25687e11464c5862A25142a15415r9216A07889r285d69258A51971a51007
$$ 125687 -511464 -35862 125142 -115415 -214631 107889 98604 -469258 151971 -151007
9522E9484c88311a89232K6215P7019D85675a39456j13785R1392D5205b48557H7408
$$ 59484 -388311 -189232 -163017 -85998 485675 -139456 -253241 -161849 45205 -248557 87408
9510d3454l7993j83308c3875j27757B7119L2409f2196F3913B4788h2222I2882
$$ -43454 -81447 -264755 -33875 -161632 27119 59528 -62196 63913 24788 -82222 92882
9498A3140J47235j3302l0188b14053A38584K7174a81218j19813R9490A23403a25871
$$ 13140 160375 147073 116885 -214053 138584 165758 -181218 -301031 -201541 123403 -125871
9486B39620r0431b77074a6090k81457J41049c9358j15699B1052g370B6386a61467
$$ 239620 149189 -277074 -16090 -297547 -156498 -39358 -155057 21052 -7370 26386 -161467
9474a17695d0801o276p5838k83289d0394A54368Q7743b8157r4629L4867m8407
$$ -117695 -40801 -47077 -122915 -406204 -40394 154368 242111 -28157 -122786 -87919 -136326
9463a36326B5514K84260E4239K4160a26889p009B19895d91465b33323L5549j75806
$$ -136326 25514 309774 54239 78399 -126889 -133898 219895 -491465 -233323 -197774 -373580
9452c73580A45889m4819K8416d1896k68715j1405h2586F3112K94596A6282J2374
$$ -373580 145889 101070 129486 -41896 -310611 -322016 -82586 63112 357708 16282 28656
9441B8656a65596j61700D3653R1285b43483a11009A2873b60305c0102B73318e3260
$$ 28656 -165596 -327296 43653 134938 -243483 -111009 12873 -260305 -30102 273318 -53260
9429A81227l3537a16433k43711h3051C740J44881g9651E9563a82807A90336a87696
$$ 181227 147690 -116433 -360144 -83051 3740 148621 -79651 59563 -182807 190336 -187696
9417c9587P575F7646f2613j10259K2290A13497f0426k5393q78H0865a30684A256
$$ -39587 -32012 67646 -62613 -172872 -150582 113497 -60426 -85819 -86697 80865 -130684 1256
9404a53921m7821j83034B92795a83910B1430b66141M2108K0540I817J55963g2984
$$ -153921 -201742 -384776 292795 -183910 21430 -266141 -224033 -203493 9817 165780 -72984
9392a75016F5268a10929a2526H9565f7594k25878J02143k61591b13756j9730o5895
$$ -175016 65268 -110929 -12526 89565 -67594 -293472 -191329 -452920 -213756 -233486 -299381
9381b99381R6341D3267M3287b31240b509k27229A94145a86881k2230D7218L9419
$$ -299381 -203040 43267 86554 -231240 -2509 -229738 194145 -186881 -209111 47218 86637
9370H6637e969k35266a20040H288L22953k1111g5361k0707K2638I8588K6540J01896
$$ 86637 -5969 -241235 -120040 8288 331241 310130 -75361 -96068 -73430 98588 125128 227024
9358B27024a60027N7685b7943k0676H457i4726j84092B38471b85642J07950F6082
$$ 227024 -160027 -102342 -27943 -48619 8457 -94726 -278818 238471 -285642 -177692 66082
9346A00518C9307d6628j22861b2142q393l7454k3950m8838k06417a70464B1192
$$ 100518 39307 -46628 -169489 -22142 -30535 -67989 -91939 -140777 -347194 -170464 21192
9334b01839b7032A20844b24114g8395j8088l4986B16304b7395H9783J961D3441
$$ -201839 -27032 120844 -224114 -78395 -96483 -131469 216304 -27395 89783 91744 43441
9322b41224i3747j02797C106K83342b39886A66549A4492P6238a718k8946k06078
$$ -241224 -93747 -196544 3106 286448 -239886 166549 14492 90730 -1718 -30664 -236742
9311b36742C6132a73607f5231K4503B370O9431m209c61478J16803r9175a33406
$$ -236742 36132 -173607 -65231 -40728 2370 71801 67592 -361478 -244675 -343850 -133406
9299b18873G0193a42481A27770c09129F1657a1170r099r7215j93347B07794b33131
$$ -218873 70193 -142481 127770 -309129 61657 -11170 -20269 -117484 -310831 207794 -233131
9287A95122a41718N1794E924d19687K05011q860J03293k47938a4961l754A02631
$$ 195122 -141718 -89924 5924 -419687 -214676 -223536 -120243 -368181 -14961 -18715 102631
9275F9961J18068Q7490K4893C8401e6033n9212a0379E7018e7201F2332a11943
$$ 69961 188029 275519 300412 38401 -56033 -115245 -10379 57018 -57201 62332 -111943
9263B70887I8492a86272o3497A99495b02633G0515F220a74505C25081A40825a31685
$$ 270887 98492 -186272 -249769 199495 -202633 70515 6220 -174505 325081 140825 -131685
9251i012I2214K01958c44742c2695n0812j39093e2673A54510a68837c4713A47033
$$ -9012 92214 294172 -344742 -32695 -83507 -222600 -52673 154510 -168837 -34713 147033
9239c38852C57002D1409a38980a3249F3169q360c57115O4221h636l5102j87255
$$ -338852 357002 41409 -138980 -13249 63169 54809 -357115 -292894 -8636 -43738 -230993
9228b30993a08813C430J74673m216g0017b6086j21249O0853A75319J63182a81715
$$ -230993 -108813 3430 178103 173887 -70017 -26086 -147335 -86482 175319 338501 -181715
9216A36206l38f2133A07573D176a42131j54623A31990A0808b42141M7784k4936
$$ 136206 135868 -62133 107573 4176 -142131 -296754 131990 10808 -242141 -194357 -219293
9205b19293e9282D0156K5538f8365A05315b71032J05014A27879J4803L7599A1813
$$ -219293 -59282 40156 65694 -68365 105315 -271032 -166018 127879 142682 180281 11813
9193B15682F6327a19612A8853P0976b34726J782A69363e7524l908h195A07317
$$ 215682 66327 -119612 18853 89829 -234726 -232944 169363 -57524 -61432 -8195 107317
9181f0687M032A78981b50146J11874l08502C9743a52440n9073i8188L5805C24961
$$ -60687 -56655 178981 -250146 -138272 -446774 39743 -152440 -211513 -98188 -62383 324961
9169G8078b14283e6961l5116j23939F2223N7084C580Q6586c13413a1988n5750
$$ 78078 -214283 -56961 -92077 -216016 62223 119307 3580 90166 -313413 -11988 -67738
9158f7738B71226b27508H1653j8291K27994a17668k85385g9522I8046r603b29022
$$ -67738 271226 -227508 81653 63362 291356 -117668 -403053 -79522 98046 88443 -229022
9146h9459P45o5032e3513k88385a42277n314M7336A2774b7562B31401D0263b29456
$$ -89459 -88714 -153746 -53513 -341898 -142277 -147591 -100255 12774 -27562 231401 40263 -229456
9133c6294g12G7664J39657f6309B44791a96184B13119b94721e4306l2058p7583
$$ -36294 -712 77664 217321 -66309 244791 -196184 213119 -294721 -54306 -86364 -163947
9122a63947H0528J42860k6943d23838J96197L4078O2896e9150B7815c67011e0034
$$ -163947 80528 223388 196445 -423838 -227641 -193563 -130667 -59150 27815 -367011 -50034
9110C0855g472q9588r1474A9936b35467A7851c39149b9432m8796b5365n6402j29619
$$ 30855 -7472 -97060 -188534 19936 -235467 17851 -339149 -29432 -78228 -25365 -81767 -211386
9098b11386A3743a29583A40248J71205a11861d7257k00498a11372j39196g8454
$$ -211386 13743 -129583 140248 311453 -111861 -47257 -247755 -111372 -250568 -78454
9087B117d9881L844A04810b29397H4083j6825a81903A77505c8251j36143j44293
$$ 2117 -49881 -46037 104810 -229397 84083 67258 -181903 177505 -38251 -174394 -318687
9076c18687J21988C010d7666r849j53434B85617J47h367j36970q4099k78759A19754
$$ -318687 -196699 3010 -47666 -57515 -210949 285617 285764 -8367 -145337 -229436 -508195 119754
9063B09058I4040a45898k29161G7916a77488j2930O5316a590H0468b98229A32867
$$ 209058 94040 -145898 -375059 77916 -177488 -190418 -125102 -1590 80468 -298229 132867
9051d1001k2599L618F5167h3574o5610q7689B67459J8380d2324A0861a49359j815
$$ -41001 -63600 -59982 65167 -83574 -149184 -236873 267459 285839 -42324 10861 -149359 -151174
9039a51174M5479q1303H1495a32112B70587H7765C2040b1091D0273d41974b03205
$$ -151174 -105695 -186998 81495 -132112 270587 87765 32040 -21091 40273 -441974 -203205
9027b06536h9029j99173j55851A22089b48405B413K78168H0550a35193A04565
$$ -206536 -89029 -288202 -444053 122089 -248405 2413 280581 80550 -135193 104565
9016a05868r3281k11724B57761a28839b9344B36832E342K56196b53536f4683F4196
$$ -105868 -199149 -410873 257761 -128839 -29344 236832 5342 261538 -253536 -64683 64196
9004B07371G1542a16246A99815f9710A89979e531A17694E10b50159f2662l2238
$$ 207371 71542 -116246 199815 -69710 189979 -5531 117694 510 -250159 -62662 -94900
8993i4900C35673d30589J20587c1398k9769A76909Q0984j3611q3496b88052k5422
$$ -94900 335673 -430589 -310002 -31398 -61167 176909 257893 244282 160786 -288052 -313474
8982c13474J25722A44222D4156f5200A16374c40014a15409l7417Q017H9856K6498
$$ -313474 -187752 144222 44156 -65200 116374 -340014 -115409 -152826 -144809 89856 116354
8971A16354O6015E2921n172L5769J51777a70736H6867b2357k81393J12045C4941
$$ 116354 182369 52921 47749 83518 235295 -170736 86867 -22357 -303750 -191705 34941
8959e2418A41333P0971B7024f7660p1090c1400l09086A06193P3317e3120D6020
$$ -52418 141333 212304 27024 -67660 -138750 -31400 -340486 106193 179510 -53120 46020
8947e7090l95837c3221l3102G5801G767R4932Q6395c09228j9366d1098k22074
$$ -57090 -452927 -33221 -66323 75801 7767 102699 189094 -309228 -328594 -41098 -263172
8936b63172F6359B4491d8378B39585b97278J25630b0282j11454D660b1779l1242
$$ -263172 66359 24491 -48378 239585 -297278 -171648 -20282 -131736 4660 -21779 -53021
8925e3021m5239M7248j67794h9031l6613B08024P1071Q2385o2521j9937A19713
$$ -53021 -98260 -51012 -218806 -89031 -125644 208024 279095 361480 298959 279022 119713
8913A9469J31328K35762K97060j05163J88677Q29821J052921K361181M807821
$$ 19469 150797 386559 683619 578456 767133 1596954 2649875 5011056 9818877
8904I818877m772133k208904A309560n09099k75465p8362j61484a85574F9019
$$ 9818877 5046744 2837840 1309560 800461 524996 446634 285150 -185574 69019
8894A81207O4859r8722D2979a34885A13276N7133b90515a24559A00314I972J22215
$$ 181207 246066 147344 42979 -134885 113276 170409 -290515 -124559 100314 9972 132187
8883A32187b20428c7566l699A37011d5018e576k23674Q3895b8991B72829a25738
$$ 132187 -220428 -37566 -41265 137011 -45018 -5576 -229250 -145355 -28991 272829 -125738
8871i2354c9493n287E9522a93450J9159O0005A36976b67088a18785b2865A1372
$$ -92354 -39493 -44780 59522 -193450 -174291 -114286 136976 -267088 -118785 -22865 11372
8859a52790J7449A09296a12349C22992h626A7955g4558f570n7514B38745g4831
$$ -152790 -135341 109296 -112349 322992 -8626 17955 -74558 -6570 -64084 238745 -74831
8847B19288g5095m19593a20705j12097N8408G2104J51768i0980L374F7852h7617
$$ 219288 -75095 -494688 -120705 -232802 -174394 72104 223872 -90980 -87606 67852 -87617
8835A12020a12548C06457a81328g677B01513a33717A11472K2719e0709p5649E0177
$$ 112020 -112548 306457 -181328 -7677 201513 -133717 111472 134191 -50709 -126358 50177
$$ [...]
##END NTUPLES=NMR SPECTRUM
##END=
