
##TITLE=UV1144_M6-1005-1000_6278857_1ZAWa5P5aZ
##JCAMPDX= 6.0         $$ Bruker NMR JCAMP-DX V2.0
##DATA TYPE= NMR SPECTRUM
##DATA CLASS= NTUPLES
##ORIGIN= BRUKER
##OWNER= Administrator
$$ 1.72 TOPSPIN		Version 2.1
$$ 2012-06-03 16:10:02.156 -0500  Administrator@TOPSPIN
$$ Compression mode = diff/dup
##.OBSERVE FREQUENCY= 400.13188235
##.OBSERVE NUCLEUS= ^1H
##.ACQUISITION MODE= SIMULTANEOUS (DQD)
##.ACQUISITION SCHEME= undefined
##.AVERAGES= 64
##.DIGITISER RES= 22
##SPECTROMETER/DATA SYSTEM= spect
##.PULSE SEQUENCE= noesygpps1d.comp
##.SOLVENT NAME= COFFEE_meoh
##.SHIFT REFERENCE= INTERNAL, COFFEE_meoh, 1, 14.96708
##AUDIT TRAIL= $$ (NUMBER, WHEN, WHO, WHERE, PROCESS, VERSION, WHAT)
$$ ##TITLE= Audit trail, TOPSPIN		Version 2.1
$$ ##JCAMPDX= 5.01
$$ ##ORIGIN= Bruker BioSpin GmbH
$$ ##OWNER= Administrator
$$ $$ C:\Bruker\TOPSPIN/data/COFFEE/nmr/UV1144_M6-1005-1000_6278857_1ZAWa5P5aZ/12/pdata/1/auditp.txt
$$ ##AUDIT TRAIL=  $$ (NUMBER, WHEN, WHO, WHERE, PROCESS, VERSION, WHAT)
(   1,<2012-06-03 16:09:56.843 -0500>,<Administrator>,<TOPSPIN>,<go>,<TOPSPIN 2.1>,
      <created by zg
	started at 2012-06-03 15:58:26.531 -0500,
	POWCHK enabled, PULCHK disabled,
       configuration hash MD5:
       D5 CA 7A 23 FE 6B EE E2 50 67 74 61 24 F7 5E 3B
       data hash MD5: 64K
       D6 BC FC EF 2F 7D 63 D5 F7 9B 47 E1 F2 34 5B A6>)
(   2,<2012-06-03 16:10:00.046 -0500>,<Administrator>,<TOPSPIN>,<proc1d>,<TOPSPIN 2.1>,
      <Start of raw data processing
       efp LB = 0.3 FT_mod = 6 PKNL = 1 PHC0 = 0 PHC1 = 0 SI = 128K 
       data hash MD5: 128K
       39 05 F3 D8 6B F0 A3 B7 61 C3 E5 F3 47 8B 6C BC>)
(   3,<2012-06-03 16:10:01.187 -0500>,<Administrator>,<TOPSPIN>,<proc1d>,<TOPSPIN 2.1>,
      <pk PHC0 = 34.66187 PHC1 = 0 
       data hash MD5: 128K
       DA 59 1F 38 64 84 AF E9 95 63 3C D8 EF 41 73 04>)
(   4,<2012-06-03 16:10:01.828 -0500>,<Administrator>,<TOPSPIN>,<proc1d>,<TOPSPIN 2.1>,
      <abs ABSG = 1 
       data hash MD5: 128K
       20 63 AE 26 73 A2 D4 AA CD 71 93 9D A2 67 C3 91>)
(   5,<2012-06-03 16:10:01.906 -0500>,<Administrator>,<TOPSPIN>,<proc1d>,<TOPSPIN 2.1>,
      <abs ABSG = 2 
       data hash MD5: 128K
       F1 EC 31 88 DF 11 B9 D1 E6 E6 E5 A0 9E 6F A8 E6>)
(   6,<2012-06-03 16:10:01.953 -0500>,<Administrator>,<TOPSPIN>,<proc1d>,<TOPSPIN 2.1>,
      <abs ABSG = 3 
       data hash MD5: 128K
       DC 7D 1F D0 E3 EA 83 25 30 36 23 96 EE 2E 09 37>)
(   7,<2012-06-03 16:10:02.000 -0500>,<Administrator>,<TOPSPIN>,<proc1d>,<TOPSPIN 2.1>,
      <abs ABSG = 4 
       data hash MD5: 128K
       57 E6 4D 2B 55 F8 AA 18 E0 E7 3F 27 9C 07 15 C3>)
(   8,<2012-06-03 16:10:02.062 -0500>,<Administrator>,<TOPSPIN>,<proc1d>,<TOPSPIN 2.1>,
      <abs ABSG = 5 
       data hash MD5: 128K
       2D 44 F9 11 C6 15 AB B7 9C 2D D5 35 0C 53 B0 08>)
$$ ##END=
$$ 
$$ $$ hash MD5
$$ $$ D8 C6 3C 94 65 EF 04 AB 44 83 B3 F1 80 F7 79 28
##$RELAX= 
##$RELAX= 
##$RELAX= 
##$RELAX= 
##$RELAX= 
##$RELAX= 
##$RELAX= 
##$RELAX= 
$$ Bruker specific parameters
$$ [...]
##$TP07= 0
##$TPNAME0= <>
##$TPNAME1= <>
##$TPNAME2= <>
##$TPNAME3= <>
##$TPNAME4= <>
##$TPNAME5= <>
##$TPNAME6= <>
##$TPNAME7= <>
##$TPOAL= (0..7)
0.5 0.5 0.5 0.5 0.5 0.5 0.5 0.5
##$TPOFFS= (0..7)
0 0 0 0 0 0 0 0
##$TUNHIN= 0
##$TUNHOUT= 0
##$TUNXOUT= 0
##$USERA1= <user>
##$USERA2= <user>
##$USERA3= <user>
##$USERA4= <user>
##$USERA5= <user>
##$V9= 5
##$VALIST= <valist>
##$VCLIST= <CCCCCCCCCCCCCCC>
##$VD= 0
##$VDLIST= <DDDDDDDDDDDDDDD>
##$VPLIST= <PPPPPPPPPPPPPPP>
##$VTLIST= <TTTTTTTTTTTTTTT>
##$WBST= 2048
##$WBSW= 25
##$XGAIN= (0..3)
0 0 0 0
##$XL= 0
##$YL= 0
##$YMAX_a= 9296424
##$YMIN_a= -8509792
##$ZGOPTNS= <>
##$ZL1= 120
##$ZL2= 120
##$ZL3= 120
##$ZL4= 120
##$ABSF1= 14.96708
##$ABSF2= -5.58545
##$ABSG= 5
##$ABSL= 3
##$ALPHA= 0
##$AQORDER= 0
##$ASSFAC= 0
##$ASSFACI= 0
##$ASSFACX= 0
##$ASSWID= 0
##$AUNMP= <proc_prof1d_extract.lims>
##$AXLEFT= 0
##$AXNAME= <>
##$AXNUC= <1H>
##$AXRIGHT= 0
##$AXTYPE= 0
##$AXUNIT= <>
##$AZFE= 0.1
##$AZFW= 0.1
##$BCFW= 0
##$BC_mod= 0
##$BYTORDP= 0
##$COROFFS= 0
##$CY= 15
##$DATMOD= 1
##$DC= 0
##$DFILT= <>
##$DTYPP= 0
##$F1P= 0
##$F2P= 0
##$FCOR= 0.5
##$FTSIZE= 131072
##$FT_mod= 6
##$GAMMA= 0
##$GB= 0
##$INTBC= 1
##$INTSCL= 1
##$ISEN= 128
##$LB= 0.3
##$LEV0= 0
##$LPBIN= 0
##$MAXI= 10000
##$MC2= 0
##$MEAN= 0
##$ME_mod= 0
##$MI= 0
##$NCOEF= 0
##$NC_proc= -1
##$NLEV= 6
##$NOISF1= 0
##$NOISF2= 0
##$NSP= 0
##$NTH_PI= 0
##$NZP= 0
##$OFFSET= 14.96708
##$PC= 1
##$PHC0= 34.66187
##$PHC1= 0
##$PH_mod= 1
##$PKNL= yes
##$PPARMOD= 0
##$PPDIAG= 0
##$PPIPTYP= 0
##$PPMPNUM= 2147483647
##$PPRESOL= 1
##$PSCAL= 4
##$PSIGN= 0
##$PYNMP= <proc.py>
##$REVERSE= no
##$SF= 400.130005414046
##$SI= 131072
##$SIGF1= 0
##$SIGF2= 0
##$SINO= 400
##$SIOLD= 131072
##$SPECTYP= <>
##$SREGLST= <1H.CDCl3>
##$SSB= 0
##$STSI= 131072
##$STSR= 0
##$SW_p= 8223.68421052632
##$SYMM= 0
##$S_DEV= 0
##$TDeff= 65536
##$TDoff= 0
##$TI= <>
##$TILT= no
##$TM1= 0
##$TM2= 0
##$TOPLEV= 0
##$USERP1= <user>
##$USERP2= <user>
##$USERP3= <user>
##$USERP4= <user>
##$USERP5= <user>
##$WDW= 1
##$XDIM= 131072
##$YMAX_p= 115903709
##$YMIN_p= -315526646
##$CURPLOT= <Network HP LaserJet P1505>
##$CURPRIN= <$Network HP LaserJet P1505>
##$DFORMAT= <normdp>
##$LAYOUT= <+/1D_H.xwp>
##$LFORMAT= <normlp>
##$PFORMAT= <normpl>
##$SURQMSG= 1
$$ End of Bruker specific parameters
$$ ---------------------------------
##NTUPLES= NMR SPECTRUM
##VAR_NAME=  FREQUENCY,     SPECTRUM/REAL,   SPECTRUM/IMAG
##SYMBOL=    X,             R,               I
##VAR_TYPE=  INDEPENDENT,   DEPENDENT,       DEPENDENT
##VAR_FORM=  AFFN,          ASDF,            ASDF
##VAR_DIM=   131072,        131072,          131072
##UNITS=     HZ,            ARBITRARY UNITS, ARBITRARY UNITS
##FACTOR=    0.0627417313425165, 1,          1
##FIRST=     8223.62146879498, 923,          -21444
##LAST=      0,             1492,            -21478
##MIN=       0,             -315526646,      0
##MAX=       8223.62146879498, 115903709,    0
$$ Real data points
##PAGE= N=1
##DATA TABLE= (X++(R..R)), XYDATA
$$ [...]
63120C68039N213N194N509O088O572O652O256N585N003M725M533L970K915J781
$$ 368039 373252 378446 383955 390043 396615 403267 409523 415108 420111 424836 429369 433339 436254 438035
63106D38035R89M01m66j791l297m727o127p549q762r510r916j0314j0784j1032
$$ 438035 439024 439425 438959 437168 433871 429144 423017 415468 406706 397196 387280 376966 366182 355150
63092C55150j0815j0232r559q936q366p859p436o999o367n493m532l689l043k562
$$ 355150 344335 334103 324544 315608 307242 299383 291947 284948 278581 273088 268556 264867 261824 259262
63078B59262k213j998j915j892j790j458q70j70M34Q55J160J427J653J806J891
$$ 259262 257049 255051 253136 251244 249454 247996 247126 246956 247390 248245 249405 250832 252485 254291 256182
63063B56182J896J761J491J208J048J031J095J194J293J282J045O40K89J73K51
$$ 256182 258078 259839 261330 262538 263586 264617 265712 266906 268199 269481 270526 271166 271455 271628 271879
63048B71879L74M58N02M53K25j53m80n74m76l78l48k52J5L09L97K54O0lJ61O20
$$ 271879 272253 272711 273213 273666 273891 273738 273258 272684 272208 271830 271482 271230 271245 271554 271951 272205 272265 272262 272423 273043
63028B73043J314J901J986J621J341J570K108K493K599K644K747K818K877L126
$$ 273043 274357 276258 278244 279865 281206 282776 284884 287377 289976 292620 295367 298185 301062 304188
63014C04188L612M104M400M595M895N337N809O266O731P214P719Q293Q967R723
$$ 304188 307800 311904 316304 320899 325794 331131 336940 343206 349937 357151 364870 373163 382130 391853
63000C91853J0527J1377J2242J3111J4071J5222J6442J7397J7942J8340J8954
$$ 391853 402380 413757 425999 439110 453181 468403 484845 502242 520184 538524 557478
62989E57478J9803K0596K1108K1310K1160K0603J9804J9189J9030J9101J8916
$$ 557478 577281 597877 618985 640295 661455 682058 701862 721051 740081 759182 778098
62978G78098J8261J7406J6704J6210J5661J4797J3545J1923R887P387M497J349
$$ 778098 796359 813765 830469 846679 862340 877137 890682 902605 912492 919879 924376 925725
62966I25725j982n498r098j2480j5339j7592j9354k0661k1351k1307k0685j9832
$$ 925725 923743 918245 909147 896667 881328 863736 844382 823721 802370 781063 760378 740546
62954G40546j8869j7592j5776j3547j1279r229p336n377l210q92J321L155M606
$$ 740546 721677 704085 688309 674762 663483 654254 646918 641541 638331 637439 638760 641915 646521
62941F46521N967P443Q826R773J0341J0874J1350J1335J0726J0087R916R943R567
$$ 646521 652488 659931 668757 678530 688871 699745 711095 722430 733156 743243 753159 763102 772669
62928G72669Q716P775O821N525L769J790l25k809n689q548j1064j3395j5764j7972
$$ 772669 781385 789160 795981 801506 805275 807065 806740 803931 798242 789694 778630 765235 749471 731499
62914G31499j9658k0789k1584k2106k2227k1959k1504k0960k0206j9117j7796
$$ 731499 711841 691052 669468 647362 625135 603176 581672 560712 540506 521389 503593
62903E03593j6558j5680j5129j4573j3739j2728j1841j1142j0441r699r148q873
$$ 503593 487035 471355 456226 441653 427914 415186 403345 392203 381762 372063 362915 354042
62891C54042q623q207p794p581p414p016o424n900n502n058m511m054l831l753
$$ 354042 345419 337212 329418 321837 314423 307407 300983 295083 289581 284523 280012 275958 272127 268374
62877B68374l600l256k816k519k531k695k656k308j911j679j469j099p60p91j123
$$ 268374 264774 261518 258702 256183 253652 250957 248301 245993 244082 242403 240934 239835 239075 238284 237161
62862B37161j329j203j013j077j328j441j266j011r90j302j714j935j936j890
$$ 237161 235832 234629 233616 232539 231211 229770 228504 227493 226503 225201 223487 221552 219616 217726
62848B17726j849j680j354j069r27p50m09o5O9Q4J52J88J5k65l81l10k51k45j52
$$ 217726 215877 214197 212843 211774 210847 210097 209688 209623 209692 209776 209928 210116 210131 209866 209485 209175 208924 208679 208527
62829B08527L3J55K09L21M52M11J78o5k48m39n42l29J14L65J96j49l50m07m45
$$ 208527 208560 208715 208924 209245 209697 210108 210286 210221 209973 209534 208992 208663 208777 209142 209338 209189 208839 208432 207987
62810B07987m61m30m55n46m86j73R4k0l81n15k34J64L10J76NK8K93O77R32Q42
$$ 207987 207526 207096 206641 206095 205609 205436 205530 205510 205129 204614 204380 204544 204854 205030 205035 205063 205356 206033 206965 207807
62790B07807M08p9k53k6L09L66Q9k34l37k60j74j20o4n6j83l61m13l15j60M4L22
$$ 207807 208215 208136 207883 207857 208166 208532 208621 208387 208050 207790 207616 207496 207432 207376 207193 206832 206419 206104 205944 205988 206310
62769B06310N70O54O76Q74J227J439J388J291J360J510J582J624J762J957K071
$$ 206310 206880 207534 208210 209084 210311 211750 213138 214429 215789 217299 218881 220505 222267 224224 226295
62754B26295K088K129K297K589K901L080L081L059L208L480L658L720L888M297
$$ 226295 228383 230512 232809 235398 238299 241379 244460 247519 250727 254207 257865 261585 265473 269770
62740B69770M808N259N682O127O514O817P217P904Q863R962J1122J2295J3424
$$ 269770 274578 279837 285519 291646 298160 304977 312194 320098 328961 338923 350045 362340 375764
62727C75764J4591J5973J7556J9092K0498K2014K3802K5590K6994K7975K8704
$$ 375764 390355 406328 423884 442976 463474 485488 509290 534880 561874 589849 618553
62716F18553K9149K9137K8683K7878K6538K4331K1257J7663J3724R324M505l11
$$ 618553 647702 676839 705522 733400 759938 784269 805526 823189 836913 846237 850742 850431
62704H50431m750q863j2850j6626j9924k2666k4931k6681k7774k8280k8482k8451
$$ 850431 845681 836818 823968 807342 787418 764752 739821 713140 685366 657086 628604 600153
62692F00153k7888k6561k4804k3246k2132k1155j9978j8656j7377j6074j4606
$$ 600153 572265 545704 520900 497654 475522 454367 434389 415733 398356 382282 367676
62681C67676j3075j1726j0560r372q199p311o766o281n616m839m058l241k479
$$ 367676 354601 342875 332315 322943 314744 307433 300667 294386 288770 283931 279873 276632 274153
62668B74153k063j997j800j073j10M96O95J017J811K813L554L875L988M210M759
$$ 274153 272090 270093 268293 267220 267110 267606 268301 269318 271129 273942 277496 281371 285359 289569 294328
62653B94328N612O543P355Q138R105J0286J1508J2658J3796J4945J6035J7050
$$ 294328 299940 306483 313838 321976 331081 341367 352875 365533 379329 394274 410309 427359
62641D27359J8102J9267K0496K1705K2865K3900K4674K5049K4930K4226K2852
$$ 427359 445461 464728 485224 506929 529794 553694 578368 603417 628347 652573 675425
62630F75425K0824J8217J5077J1429P356L004j470n842r863j3405j6532j9266
$$ 675425 696249 714466 729543 740972 748328 751332 749862 744020 734157 720752 704220 684954
62618F84954k1438k2906k3850k4575k5110k5226k4861k4181k3276k2066k0589
$$ 684954 663516 640610 616760 592185 567075 541849 516988 492807 469531 447465 426876
62607D26876j9106j7836j6756j5783j4889j3980j2887j1635j0476r559q730p827
$$ 426876 407770 389934 373178 357395 342506 328526 315639 304004 293528 283969 275239 267412
62595B67412o989o391n918n311m594m048l851l846l768l502l132k794k539k299
$$ 267412 260423 254032 248114 242803 238209 234161 230310 226464 222696 219194 216062 213268 210729 208430
62581B08430k019j743j532j284q70m22k54l86m66l11k57o24j079j001l81J15R9
$$ 208430 206411 204668 203136 201852 200982 200560 200306 199920 199454 199143 198886 198262 197183 196182 195801 195916 196015
62564A96015j4L24R63J266J003O48P52J336J972K278K261K207K386K785L148L311
$$ 196015 196001 196325 197288 198554 199557 200205 200957 202293 204265 206543 208804 211011 213397 216182 219330 222641
62548B22641L438L832M544N266N721O009O479P314Q306R099R569R936J0530J1467
$$ 222641 226079 229911 234455 239721 245442 251451 257930 265244 273550 282649 292218 302154 312684 324151
62534C24151J2572J3521J4081J4183J3870J3253J2399J1242R615P486N116K847
$$ 324151 336723 350244 364325 378508 392378 405631 418030 429272 438887 446373 451489 454336
62522D54336Q11j118l062n039p066r082j0738j1589j1662j1586j1893j2362j2401
$$ 454336 455147 454029 450967 445928 438862 429780 419042 407453 395791 384205 372312 359950 347549
62509C47549j1900j1325j1018j0765j0194r231q088p012o207n750n483n153m751
$$ 347549 335649 324324 313306 302541 292347 283116 275028 268016 261809 256059 250576 245423 240672
62496B40672m499m367l935k973j860j180j030j009q24n23k17J42N90R70J066Q59
$$ 240672 236173 231806 227871 224898 223038 221858 220828 219819 218995 218472 218255 218397 218987 219957 221023 221882
62480B21882N80N35Q40J303J609J663J684J859K128K361K621L067L688M298M784
$$ 221882 222462 222997 223837 225140 226749 228412 230096 231955 234083 236444 239065 242132 245820 250118 254902
62465B54902N168N542O025O713P603Q627R802J1189J2586J3553J3937J4156J4684
$$ 254902 260070 265612 271637 278350 285953 294580 304382 315571 328157 341710 355647 369803 384487
62452C84487J5489J6234J6828J7344J7523J6897J5469J3779J2257J0827R296P699
$$ 384487 399976 416210 433038 450382 467905 484802 500271 514050 526307 537134 546430 554129
62440E54129O138M574L072J910J289J101J206J672K595L874N414P277R392J1283
$$ 554129 560267 564841 567913 569823 571112 572213 573419 575091 577686 581560 586974 594251 603643 614926
62426F14926J2499J3179J3903J4933J5865J6089J5351J3756J1434Q437M912J181
$$ 614926 627425 640604 654507 669440 685305 701394 716745 730501 741935 750372 755284 756465
62414G56465k454n979r598j3390j7105k0358k2950k4898k6254k7044k7320k7109
$$ 756465 754011 748032 738434 725044 707939 687581 664631 639733 613479 586435 559115 532006
62402E32006k6389k5218k3785k2191k0285j8023j5797j4073j2773j1380r761q343
$$ 532006 505617 480399 456614 434423 414138 396115 380318 366245 353472 342092 332331 323988
62390C23988p384o513n345m107l245k724k141j396p81m45j75K29O91J036J158
$$ 323988 316604 310091 304746 300639 297394 294670 292529 291133 290352 289907 289732 289961 290652 291688 292846
62375B92846J000N57l4o01j158j823k517k967l088l163l506m068m508m569m304
$$ 292846 293846 294403 294369 293768 292610 290787 288270 285303 282215 279052 275546 271478 266970 262401 258097
62360B58097l927l566l209k848k608k625k822k952k865k649k407k127j829j680
$$ 258097 254170 250604 247395 244547 241939 239314 236492 233540 230675 228026 225619 223492 221663 219983
62346B19983j704j602j075k87K85M40M06M40N36O32P75R82J087R64P67P89J150
$$ 219983 218279 216677 215602 215315 215600 216040 216446 216886 217422 218054 218829 219811 220898 221862 222629 223418 224568
62329B24568J728K323K742K833K568K203K132K555L294L966M298M270M074M003
$$ 224568 226296 228619 231361 234194 236762 238965 241097 243652 246946 250912 255210 259480 263554 267557
62315B67557M288M877N401N521N373N471O081O846P262P390P813Q900J0427J1952
$$ 267557 271845 276722 282123 287644 293017 298488 304569 311415 318677 326067 333880 342780 353207 365159
62301C65159J3280J4394J5261J5928J6645J7591J8542J9008J8684J7576J5828
$$ 365159 378439 392833 408094 424022 440667 458258 476800 495808 514492 532068 547896
62290E47896J3623J1241Q956O779M461J807r94l469n303o645p979r578j1167j2270
$$ 547896 561519 572760 581716 588495 592956 594763 593769 590300 584997 578352 570373 560795 549628 537358
62276E37358j2778j2988j3044j2753j2027j1174j0480r808q909p905p135o702
$$ 537358 524580 511592 498548 485795 473768 462594 452114 442306 433397 425492 418357 411655
62264D11655o497o515o785p055p020o781o738o958p073o844o460o215o160o215
$$ 411655 405158 398643 391858 384803 377783 371002 364264 357306 350233 343389 336929 330714 324554 318339
62250C18339o299o262n950n439m949m508l973l365k898k574k204j826j756j973
$$ 318339 312040 305778 299828 294389 289440 284932 280959 277594 274696 272122 269918 268092 266336 264363
62236B64363j984j525r69o82l95L38J326J929J930J684J512J369J154R78R68J131
$$ 264363 262379 260854 259885 259203 258808 259146 260472 262401 264331 266015 267527 268896 270050 271028 271996 273127
62220B73127J443J883K341K666K863L081L423L908M545N267N888O323O775P469
$$ 273127 274570 276453 278794 281460 284323 287404 290827 294735 299280 304547 310435 316758 323533 331002
62206C31002Q280Q906R359J0007J1045J2261J3377J4388J5434J6575J7761J8900
$$ 331002 339282 348188 357547 367554 378599 390860 404237 418625 434059 450634 468395 487295
62194D87295J9823K0302K0148J9230J7427J4784J1702Q724O058L481P43k119m891
$$ 487295 507118 527420 547568 566798 584225 599009 610711 619435 625493 628974 629717 627598 622707
62181F22707p416r665j1742j3840j5978j7756j8675j8761j8566j8446j8129j7199
$$ 622707 615291 605626 593884 580044 564066 546310 527635 508874 490308 471862 453733 436534
62169D36534j5748j4215j2853j1643j0558r623q758p843o927o133n408m604l797
$$ 436534 420786 406571 393718 382075 371517 361894 353136 345293 338366 332233 326825 322221 318424
62156C18424l276l159l193l028k540j822j014k13M60Q49R00P96Q99J377J938K109
$$ 318424 315148 311989 308796 305768 303228 301406 300392 300179 300639 301488 302388 303184 304083 305460 307398 309507
62140C09507J821J522J602J948K274K560K929L243L241L022K977L225L443L369
$$ 309507 311328 312850 314452 316400 318674 321234 324163 327406 330647 333669 336646 339871 343314 346683
62126C46683L167L105L150L096K922K820K920L169L448L667L812L942M163M513
$$ 346683 349850 352955 356105 359201 362123 364943 367863 371032 374480 378147 381959 385901 390064 394577
62112C94577M983N584O399P427Q538R564J0446J1207J1876J2443J2800J2744J2073
$$ 394577 399560 405144 411543 418970 427508 437072 447518 458725 470601 483044 495844 508588 520661
62099E20661J0734Q808O439L859J442m75j862k974m092n386o980q835j0555j1578
$$ 520661 531395 540203 546642 550501 551943 551468 549606 546632 542540 537154 530174 521339 510784 499206
62085D99206j1737j1438j1160j0981j0703j0220r549q692p712o848o307n971n536
$$ 499206 487469 476031 464871 453890 443187 432967 423418 414726 407014 400166 393859 387888 382352
62072C82352m901m237l729l399l165k962k744k473k088j476o29J60M65K40rJ79
$$ 382352 377451 373214 369485 366086 362921 359959 357215 354742 352654 351178 350549 350709 351174 351414 351405 351584
62056C51584O19O91Q6r12j830k392k510k252j921j921k375k988l377l455l423
$$ 351584 352203 352894 352980 352068 350238 347846 345336 343084 341163 339242 336867 333879 330502 327047 323624
62041C23624l502l729l942l895l435k617j618o18K09P27R62J087J168J084Q83
$$ 323624 320122 316393 312451 308556 305121 302504 300886 300268 300477 301204 302166 303253 304421 305505 306388
62026C06388R74J646K553L105L295L669M427N121N446N747O428P246P718P929
$$ 306388 307362 309008 311561 314666 317961 321630 326057 331178 336624 342371 348799 356045 363763 371692
62012C71692Q346Q984R303R066Q748Q883R412R880J0065J0077R991R656Q908P734
$$ 371692 380038 389022 398325 407391 416139 425022 434434 444314 454379 464456 474447 484103 493011 500745
61998E00745O223M491K699J006n67k174l914n646p126q338r521j0824j2069j2984
$$ 500745 506968 511459 514158 515164 514597 512423 508509 502863 495737 487399 477878 467054 454985 442001
61984D42001j3565j4025j4425j4553j4258j3657j2935j2117j1158j0183r394q785
$$ 442001 428436 414411 399986 385433 371175 357518 344583 332466 321308 311125 301731 292946
61972B92946q146p416o794o442o191n718m991m346m045l927l639l161k864l026
$$ 292946 284800 277384 270590 264148 257957 252239 247248 242902 238857 234930 231291 228130 225266 222240
61958B22240l453l692l519l068k617k319k132j896j493j023p12o02m61j56J19
$$ 222240 218787 215095 211576 208508 205891 203572 201440 199544 198051 197028 196316 195714 195253 195097 195216
61943A95216J49J23M11R69J330J201Q59P40R39J166J085O44J18j22n9j71q46j777
$$ 195216 195365 195488 195899 196868 198198 199399 200258 200998 201937 203103 204188 204832 204950 204828 204769 204598 203752 201975
61925B01975k232k003j626j605j797j803j592j382j206r70p83q19j001j084j054
$$ 201975 199743 197740 196114 194509 192712 190909 189317 187935 186729 185759 184976 184157 183156 182072 181018
61910A81018j094j199j139q15m29k34k42k67j49Q7K67K83K38L00M03K85k0m9N72
$$ 181018 179924 178725 177586 176771 176342 176108 175866 175599 175450 175537 175804 176087 176325 176625 177028 177313 177293 177244 177816
61891A77816J606K474K870K905K816K804L055L551L996M155M228M557N074N389
$$ 177816 179422 181896 184766 187671 190487 193291 196346 199897 203893 208048 212276 216833 221907 227296
61877B27296N410N456N706N896N753N385N073M882M675M310L656K630J412M50
$$ 227296 232706 238162 243868 249764 255517 260902 265975 270857 275532 279842 283498 286128 287540 287990
61863B87990K9m6j90n37q77j040j039r12n78k8N36R28J283J879K698L365L637
$$ 287990 288019 287973 287783 287246 286369 285329 284290 283378 282800 282772 283308 284236 285519 287398 290096 293461 297098
61846B97098L724L868L835L190K068J189R47R48O15o3p13j165j498j711j801j956
$$ 297098 300822 304690 308525 311715 313783 314972 315919 316867 317482 317419 316706 315541 314043 312332 310531 308575
61830C08575k300k562k419k092k100k518k923l106l319l678l861l626l253l170
$$ 308575 306275 303713 301294 299202 297102 294584 291661 288555 285236 281558 277697 274071 270818 267648
61816B67648l397l626l604l278k738k188j798j472r53k74K25M24O56J223J965
$$ 267648 264251 260625 257021 253743 251005 248817 247019 245547 244594 244320 244545 244969 245625 246848 248813
61801B48813K599L184L926M736N369N849O366O883P204P408P833Q540R132R211
$$ 248813 251412 254596 258522 263258 268627 274476 280842 287725 294929 302337 310170 318710 327842 337053
61787C37053Q833Q331P908P473O800N748M385L016J949J184M09n60j432j708j310
$$ 337053 345886 354217 362125 369598 376398 382146 386531 389547 391496 392680 393089 392529 391097 389389 388079
61772C88079p57o07p93p65k21N32J072J434J903K425K542J944Q50k85j212j946
$$ 388079 387322 386715 385922 385157 384936 385468 386540 387974 389877 392302 394844 396788 397638 397353 396141 394195
61756C94195k615l324m046m625m960n223n675o276o691o749o690o801p008p015
$$ 394195 391580 388256 384210 379585 374625 369402 363727 357451 350760 344011 337321 330520 323512 316497
61742C16497o673o129n656n447n466n459n214m796m370l849l029k098j624j883
$$ 316497 309824 303695 298039 292592 287126 281667 276453 271657 267287 263438 260409 258311 256687 254804
61728B54804k444k697k493k043j497r52o30o52p23m72J0K94K45J28J23J09N4J78
$$ 254804 252360 249663 247170 245127 243630 242678 242048 241396 240673 240201 240211 240505 240750 240878 241001 241110 241164 241342
61710B41342N96J022J150J111J332J954K649L015K998K879K916L085L164L008
$$ 241342 241938 242960 244110 245221 246553 248507 251156 254171 257169 260048 262964 266049 269213 272221
61696B72221K641K178J664J090M18l77j231j959k410k674k986l404l718l765l629
$$ 272221 274862 277040 278704 279794 280212 279835 278604 276645 274235 271561 268575 265171 261453 257688 254059
61681B54059l461l287l092k903k639k135j464j045j135j384j233o94l13m00o49
$$ 254059 250598 247311 244219 241316 238677 236542 235078 234033 232898 231514 230281 229587 229274 228874 228225
61666B28225o63m64l15k46o1K57M42K65j64n06n52l67j07J58L36J61n65j577k244
$$ 228225 227562 227098 226783 226537 226476 226733 227175 227440 227276 226770 226218 225851 225744 225902 226238 226399 225834 224257 222013
61647B22013k212j751j331j109j021j146j596k172k498k484k356k204j886j411
$$ 222013 219801 218050 216719 215610 214589 213443 211847 209675 207177 204693 202337 200133 198247 196836
61633A96836j113j201j440j463j235r79q20p35p28q64j097j262j282j224j151
$$ 196836 195723 194522 193082 191619 190384 189405 188585 187850 187122 186258 185161 183899 182617 181393 180242
61618A80242j031q32o18m35k21Q4L78M81L71K35J79N9k40m77k58L88Q99Q48M85
$$ 180242 179211 178379 177761 177326 177105 177189 177567 178048 178419 178654 178833 178892 178652 178175 177917 178305 179204 180052 180537
61599A80537M33R25J590J934J826J465J076P47M72K34K1j37j87p5K05N56Q01Q31
$$ 180537 180970 181895 183485 185419 187245 188710 189786 190533 191005 191239 191260 191123 190936 190861 191066 191622 192423 193254
61581A93254P58P80R38J079J080R61P31L77M1l5J00N1m06r83j301j487j895k430
$$ 193254 194012 194792 195730 196809 197889 198850 199581 199958 199999 199964 200064 200115 199709 198726 197425 195938 194043 191613
61563A91613k547k041j413j229j444j583j406j125j009j035r96q58q26j061j371
$$ 191613 189066 187025 185612 184383 182939 181356 179950 178825 177816 176781 175785 174927 174101 173040 171669
61548A71669j393j045o93p39j165j619j857j885j778j602j471j480j524j342q66
$$ 171669 170276 169231 168538 167799 166634 165015 163158 161273 159495 157893 156422 154942 153418 152076 151210
61533A51210l87l03p14j301j564j253o04j32o4j43l7J97K48L1k67n02o96q10o88
$$ 151210 150823 150520 149806 148505 146941 145688 145084 144952 144888 144745 144708 144905 145153 145184 144917 144415 143719 142909 142221
61514A42221l45o2n8k33k83o9K71M64L86K10K69O33R87J000P56N79N77N81N23
$$ 142221 141876 141814 141756 141523 141240 141171 141442 141906 142292 142502 142771 143404 144391 145391 146147 146726 147303 147884 148407
61495A48407N44P00Q42Q78R15J011J002P33L23L0J1K51O19Q94Q60N09Q9j21o1
$$ 148407 148951 149651 150493 151371 152286 153297 154299 155032 155355 155385 155396 155647 156266 157160 158020 158529 158618 158497 158436
61476A58436J17K29J70k1k08k78j95K0L02M49K48j82l78q0L64M38J28j55k36k84
$$ 158436 158553 158782 158952 158931 158723 158445 158250 158270 158572 159021 159269 159087 158709 158629 158993 159431 159559 159404 159168 158884
61456A58884l81m15m19n41n88j30P70J407J273O56J34j02j02K06Q26J374J445
$$ 158884 158503 158088 157669 157128 156540 156410 157180 158587 159860 160516 160650 160548 160446 160652 161478 162852 164297
61439A64297J170J025J189J441J562J510J273Q84N55N34P81J038J126J045Q38
$$ 164297 165467 166492 167681 169122 170684 172194 173467 174351 174906 175440 176221 177259 178385 179430 180268
61424A80268O15N60P28Q57O73K83Op2j34l04n48q08r81q06j92M27M29k12q56j015
$$ 180268 180883 181443 182171 183028 183701 183984 183990 183918 183784 183480 182932 182124 181143 180337 180145 180572 181001 180789 179933 178918
61404A78918q86r21j158j259j037o52l41j32J14M76P97Q40N81L21L52O28Q99J041
$$ 178918 178032 177111 175953 174694 173657 173005 172664 172532 172646 173122 173919 174759 175340 175661 176013 176641 177540 178581
61386A78581J083J006Q00O77Q72J225J285R42N98O03Q14R49J037J190J229R46
$$ 178581 179664 180670 181470 182147 183019 184244 185529 186471 187069 187672 188486 189435 190472 191662 192891 193837
61370A93837N37M48P18R51R05Q01Q65R62Q59O36O02Q79J283J518J351P49j1m53
$$ 193837 194374 194822 195540 196491 197396 198197 199062 200024 200883 201519 202121 203000 204283 205801 207152 207901 207890 207437
61352B07437l71r9j08l89m94k38K7p0l87m89k70j4Q2J46L48N82N96L36Nj82k61
$$ 207437 207066 206967 206859 206470 205976 205738 205765 205695 205308 204819 204549 204535 204617 204763 205111 205693 206289 206625 206630 206448 206187
61331B06187m24p35j006j025q16n77m28l52l51l89k71K02Q09J048P90N12O15Q92
$$ 206187 205763 205028 204022 202997 202181 201604 201176 200824 200473 200084 199813 200015 200824 201872 202662 203174 203789 204681
61313B04681R36Q29R34J199J175P27K34M9J31K70L42K86J55J98N64R15P63K55
$$ 204681 205617 206446 207380 208579 209754 210481 210715 210764 210895 211165 211507 211793 211948 212146 212710 213625 214388 214643
61295B14643R9O12J315J660J689J682J649J507J417J508J589J489J383J444J452
$$ 214643 214742 215354 216669 218329 220018 221700 223349 224856 226273 227781 229370 230859 232242 233686 235138
61280B35138J187R13J012J354J472J259R95Q22O30L97K31R6j38l95m72l78k64
$$ 235138 236325 237238 238250 239604 241076 242335 243330 244152 244782 245179 245410 245506 245368 244973 244501 244123 243859
61263B43859j26J07K95L03L84R03J698K204K237K161K274K490K749L182L723M016
$$ 243859 243733 243840 244135 244438 244822 245725 247423 249627 251864 254025 256299 258789 261538 264720 268443 272459
61247B72459L958L899M048M086L697L111K714K425J879J063K86l33r71j687k259
$$ 272459 276417 280316 284364 288450 292147 295258 297972 300397 302276 303339 303625 303292 302321 300634 298375
61232B98375k485k447k344k321k475k881l443l812l620k884k080j739j892k041
$$ 298375 295890 293443 291099 288778 286303 283422 279979 276167 272547 269663 267583 265844 263952 261911
61218B61911j745j101n01p8K91N89O15M10L42N79Q04O54K71J16M55J161J962K570
$$ 261911 260166 259065 258564 258486 258777 259366 259981 260391 260733 261312 262116 262770 263041 263157 263612 264773 266735 269305
61200B69305K770K568K284K197K186J892J261O80N34P52R22P75M22J47O7N7k2
$$ 269305 272075 274643 276927 279124 281310 283202 284463 285143 285677 286429 287351 288126 288548 288695 288762 288819 288797
61183B88797j27j43q0l5j5N8J38N7j95l63k31R0L40N18Q75J514K077K091J580
$$ 288797 288670 288527 288447 288412 288397 288455 288593 288650 288455 288092 287861 287951 288291 288809 289684 291198 293275 295366 296946
61164B96946J187J479K270K836K825K600K593K673K492K174K108K248K138J683
$$ 296946 298133 299612 301882 304718 307543 310143 312736 315409 317901 320075 322183 324431 326569 328252
61150C28252J312J280J308J193J249J749K331K426K073J838K056K587L190L744
$$ 328252 329564 330844 332152 333345 334594 336343 338674 341100 343173 345011 347067 349654 352844 356588
61136C56588M109M170M044L924L679K971J826P59J78o6l38p18j035j226j434j754
$$ 356588 360697 364867 368911 372835 376514 379485 381311 382070 382248 382182 381844 381126 380091 378865 377431 375677
61120C75677k109k406k685l045l473l748l636l160k687k652l131l793m228m263
$$ 375677 373568 371162 368477 365432 361959 358211 354575 351415 348728 346076 342945 339152 334924 330661
61106C30661m007l675l423l276l157k990k780k563k313j975j540j070n72j2N84
$$ 330661 326654 322979 319556 316280 313123 310133 307353 304790 302477 300502 298962 297892 297320 297308 297892
61091B97892J096J431J587J566J318Q61L80R6M6Q5J24K65N90R35J024Q62Q24J225
$$ 297892 298988 300419 302006 303572 304890 305751 306131 306227 306273 306358 306482 306747 307337 308272 309296 310158 310982 312207
61073C12207J968K717L313L830M327M795N328O061O913P606Q062Q530R231J0078
$$ 312207 314175 316892 320205 324035 328362 333157 338485 344546 351459 359065 367127 375657 384888 394966
61059C94966J0878J1579J2112J2298J2135J2005J2279J2819J3150J3053J2668
$$ 394966 405844 417423 429535 441833 453968 465973 478252 491071 504221 517274 529942
61048E29942J2149J1553J1041J0784J0582R924Q628P115N901M996M050K864J533
$$ 529942 542091 553644 564685 575469 586051 595975 604603 611718 617619 622615 626665 629529 631062
61035F31062J78j177k520l754m760n467n928o294o691p113p558q126q822r304
$$ 631062 631240 630063 627543 623789 619029 613562 607634 601340 594649 587536 579978 571852 563030 553726
61021E53726r193q654q293q334q308p792p073o635o366n841n131m739m697m441
$$ 553726 544533 535879 527586 519252 510944 503152 496079 489444 483078 477237 472106 467367 462670 458229
61007D58229l679k819k282j929j477j023p46m45J39Q05J176J362J831K756L885
$$ 458229 454550 451731 449449 447520 446043 445020 444274 443829 443968 444773 445949 447311 449142 451898 455783
60992D55783M975N955O688P080P410Q123R212J0221J0989J1847J2938J3857J4342
$$ 455783 460758 466713 473401 480481 487891 496014 505226 515447 526436 538283 551221 565078 579420
60979E79420J4865J6064J7865J9652K1161K2657K4266K5704K6813K7929K9457
$$ 579420 594285 610349 628214 647866 669027 691684 715950 741654 768467 796396 825853
60968H25853L1326L3177L4934L6880L9195M1758M4504M7718N1727N6440O1505
$$ 825853 857179 890356 925290 962170 1001365 1043123 1087627 1135345 1187072 1243512 1305017
60957A305017O6941P3230Q0686Q9217R8987J10920J26006J44320J65422J89437
$$ 1305017 1371958 1445188 1525874 1615091 1714078 1824998 1951004 2095324 2260746 2450183
60947B450183K17049K48491K83561L22647L66466M14569M65709N20163N78154
$$ 2450183 2667232 2915723 3199284 3521931 3888397 4302966 4768675 5288838 5866992
60938E866992O31616O58367O31002N37910L96741K45352J18736L4211n891o308
$$ 5866992 6498608 7156975 7787977 8325887 8722628 8967980 9086716 9120927 9115036 9108728
60928I108728K0126M6548L7080l3305j60522l13038m52225n52717o07906o23088
$$ 9108728 9128854 9175402 9212482 9179177 9018655 8705617 8253392 7700675 7092769 6469681
60918F469681o07747n72431n27364m79995m33478l88165l44265l02725k64451
$$ 6469681 5861934 5289503 4762139 4282144 3848666 3460501 3116236 2813511 2549060
60909B549060k29859j99307j73263j51814j34337j19780j07186r5998q6070p7447
$$ 2549060 2319201 2119894 1946631 1794817 1660480 1540700 1433514 1337516 1251446 1173999
60899A173999p0005o3376n7235n1525m6292m1527l7265l3670l0778k8364k6241
$$ 1173999 1103994 1040618 983383 931858 885566 844039 806774 773104 742326 713962 687721
60888F87721k4464k3095k1908k0655j9401j8330j7384j6403j5523j5007j4771
$$ 687721 663257 640162 618254 597599 578198 559868 542484 526081 510558 495551 480780
60877D80780j4363j3507j2366j1261j0372r744r348r083q870q739q701q548q052
$$ 480780 466417 452910 440544 429283 418911 409167 399819 390736 381866 373127 364426 355878 347826
60864C47826p334o726o315n881n368n022m960m937m749m562m558m497l996l135
$$ 347826 340492 333766 327451 321570 316202 311180 306220 301283 296534 291972 287414 282917 278921 275786
60850B75786k414k131k142k196k217k162j918j530j289j395j658j790j818j940
$$ 275786 273372 271241 269099 266903 264686 262524 260606 259076 257787 256392 254734 252944 251126 249186
60836B49186k081j941j531j328j687k316k598k311j809j502j436j391j216j005
$$ 249186 247105 245164 243633 242305 240618 238302 235704 233393 231584 230082 228646 227255 226039 225034
60822B25034j036j501k218k648k362j514o73k14l0J22K27J06k43n46m82L3P60
$$ 225034 223998 222497 220279 217631 215269 213755 213082 212868 212838 212960 213187 213293 213050 212504 212022 212055 212815
60805B12815J334J573J600J641J696J585J225P43L02Mo9Q4K68K18p6l60m74n11
$$ 212815 214149 215722 217322 218963 220659 222244 223469 224212 224514 224518 224449 224533 224801 225019 224943 224583 224109 223598
60787B23598n98p26q89j130j419j626j758j980k317k545k550k520k614k658k403
$$ 223598 223000 222274 221385 220255 218836 217210 215452 213472 211155 208610 206060 203540 200926 198268 195865
60772A95865j975j744j851k069k074j771j374j228j463j783j760j385j077j084
$$ 195865 193890 192146 190295 188226 186152 184381 183007 181779 180316 178533 176773 175388 174311 173227
60758A73227j184j135j075j180j219q63k31K00J71j74n80q41p72l70N6K21K64
$$ 173227 172043 170908 169833 168653 167434 166571 166340 166540 166711 166537 165957 165116 164344 163974 164030 164251 164515
60741A64515N01Q76J033Q77O70N83N04L53K06Q5r9k70k06Q7K89J98l1j70k25l08
$$ 164515 165016 165892 166925 167802 168472 169055 169559 169912 170118 170203 170104 169834 169628 169715 170004 170202 170171 170001 169776 169468
60721A69468m44o33q63r95q50n39m27o44q51o94k96r0k91p28j105j216r79m62
$$ 169468 169024 168391 167528 166533 165683 165144 164717 164073 163222 162528 162232 162142 161851 161123 160018 158802 157823 157361
60703A57361P5L27J88j44l12j03L29N59L70P7J78O84J018P40J23j82J13O90J073
$$ 157361 157436 157763 157951 157807 157495 157392 157721 158280 158650 158727 158905 159589 160607 161347 161470 161288 161401 162091 163164
60684A63164J056P20K33k50o04p60p95q74j080j258j200r10o02l72r4L01O10O40
$$ 163164 164220 164940 165173 164923 164319 163559 162764 161890 160810 159552 158352 157442 156840 156468 156374 156675 157285 157925
60666A57925N00M35M85N39O05P47Q36O95M49M41P03Q56N99O0m29o47n36j90R5
$$ 157925 158425 158860 159345 159884 160489 161236 162072 162767 163216 163657 164360 165216 165815 165875 165446 164799 164263 164073 164168
60647A64168qn01j024j253j163r08o42n13n65n97m11k15m42j014j273q54k57j47
$$ 164168 164160 163659 162635 161382 160219 159311 158669 158156 157591 156994 156583 156368 155926 154912 153639 152785 152528 152381
60629A52381m14m09N9M89M66K15K17N78R83J125R72O90M66M25N99Q99J120J071
$$ 152381 151967 151558 151617 152106 152572 152787 153004 153582 154565 155690 156662 157352 157818 158243 158842 159741 160861 161932
60611A61932P51L81J32n5k70l91k57m8j35n10p29n21j52K5M7J13J52Oj43Q1O89
$$ 161932 162683 163064 163196 163141 162871 162480 162223 162175 162040 161530 160801 160280 160128 160153 160200 160313 160465 160471 160328 160409 161098
60590A61098J233J317J004O33M69N05N26L13j20n38p90r66j145j183j014q75r83
$$ 161098 162331 163648 164652 165285 165754 166259 166785 167098 166978 166440 165650 164684 163539 162356 161342 160467 159484
60573A59484j055o49J05N43L13j68l50k11r1r6m1J95N27Q46J073J038O07n1n03
$$ 159484 158429 157780 157885 158428 158741 158573 158223 158012 157921 157825 157784 157979 158506 159352 160425 161463 162070 162019 161516
60554A61516m73j19J87K70K28K31L24M68O01O79O57N15L47L10M61O68P07N16K78
$$ 161516 161043 160924 161111 161381 161609 161840 162164 162632 163233 163912 164569 165084 165431 165741 166202 166870 167577 168093 168371
60535A68371K14L50N20O17O81P84Q82R20R53J063J197J198J030Q31P33P72R32
$$ 168371 168585 168935 169455 170072 170753 171537 172419 173339 174292 175355 176552 177750 178780 179611 180344 181116 182048
60518A82048J182J367J301J060J022J435K072K507K649K772L079L462L692L649
$$ 182048 183230 184597 185898 186958 187980 189415 191487 193994 196643 199415 202494 205956 209648 213297
60504B13297L319K783K244J907J743J498J009L97r1l45m37m61m28k36J90P79J349
$$ 213297 216616 219399 221643 223550 225293 226791 227800 228197 228106 227761 227324 226863 226435 226199 226389 227168 228517
60487B28517J835K345K942L494L896M296M848N410N730N899O265O894P488P844
$$ 228517 230352 232697 235639 239133 243029 247325 252173 257583 263313 269212 275477 282371 289859 297703
60473B97703Q064Q175P899P018N677M110K350M06j408k665l249l474l719m109
$$ 297703 305767 313942 321841 328859 334536 338646 340996 341402 339994 337329 334080 330606 326887 322778
60459C22778m427m338l746k961k359j950j459q24k62J85P67J567K356L087M163
$$ 322778 318351 314013 310267 307306 304947 302997 301538 300714 300452 300637 301404 302971 305327 308414 312577
60444C12577N833P654Q956R704J0460J1602J2925J4030J4754J5182J5462J5611
$$ 312577 318410 326064 335020 344724 355184 366786 379711 393741 408495 423677 439139 454750
60432D54750J5410J4583J3205J1766J0592R438P878N947L988J998m65l645p205
$$ 454750 470160 484743 497948 509714 520306 529744 537622 543569 547557 549555 549090 545445 538240
60419E38240j0575j3429j5735j7578j8978j9847k0045j9587j8713j7648j6416
$$ 538240 527665 514236 498501 480923 461945 442098 422053 402466 383753 366105 349689
60408C49689j5013j3653j2542j1590j0534r336q166p119o196n513n182n025m724
$$ 349689 334676 321023 308481 296891 286357 277021 268855 261736 255540 250027 244845 239820 235096
60395B35096m278l963l822l519k868k155j762j711j750j751j766j842j911j833
$$ 235096 230818 226855 223033 219514 216646 214491 212729 211018 209268 207517 205751 203909 201998 200165
60381B00165j494r94o61p65j143j294r52l64km7l00m31l13j33j66l71l74pL43
$$ 200165 198671 197677 197016 196251 195108 193814 192862 192498 192496 192449 192149 191718 191405 191272 191106 190735 190361 190354 190697
60362A90697K40j22j70J87M36K81L7J4P2O2K47P67J135Q32K13J43Q05J432J329
$$ 190697 190937 190815 190645 190832 191268 191549 191586 191600 191672 191734 191981 192748 193883 194715 194928 195071 195876 197308 198637
60343A98637P18L13M90J052J556J675J416J148J277J721J928J561R70P59J081
$$ 198637 199355 199668 200158 201210 202766 204441 205857 207005 208282 210003 211931 213492 214462 215221 216302
60328B16302J568J841J817J603J369J317J489J613J373Q57M87M79O33P30Q68J148
$$ 216302 217870 219711 221528 223131 224500 225817 227306 228919 230292 231149 231636 232115 232748 233478 234346 235494
60312B35494J399J436J390J493J649J596J332J079Q54M98R7J7M14J068J763K484
$$ 235494 236893 238329 239719 241212 242861 244457 245789 246868 247722 248220 248317 248334 248748 249816 251579 254063
60296B54063L141L468L395L203L120L034K801K541K345K017J399O87O7o32j587
$$ 254063 257204 260672 264067 267270 270390 273424 276225 278766 281111 283128 284527 285214 285281 284649 283062
60281B83062k489k882k796k645k568k371k052j869j885j846j629j388j227j087
$$ 283062 280573 277691 274895 272250 269682 267311 265259 263390 261505 259659 258030 256642 255415 254328
60267B54328j066j370j893k201k097j807j488r25k3Q43J299J515J895K450K861
$$ 254328 253262 251892 249999 247798 245701 243894 242406 241481 241458 242301 243600 245115 247010 249460 252321
60252B52321L046L251L594L863L824L519L202L030K949K778K421J971J564J153
$$ 252321 255367 258618 262212 266075 269899 273418 276620 279650 282599 285377 287798 289769 291333 292486
60238B92486O06o1p18j470k650m278n756o382o069n335m682m198l750l270k769
$$ 292486 293092 293031 292313 290843 288193 283915 278159 271777 265708 260373 255691 251493 247743 244473 241704
60223B41704k286j889j675j649j675j588j354j105j025j194j539j868j974j711
$$ 241704 239418 237529 235854 234205 232530 230942 229588 228483 227458 226264 224725 222857 220883 219172
60209B19172j126n37l25n40q06p73n60n04n80m48n8J72J0j82O4O23R55Q17M83
$$ 219172 218046 217509 217184 216644 215838 215065 214505 214001 213421 212973 212915 213087 213097 212915 212979 213602 214557 215374 215857
60190B15857K61J66J02R9K54N61R36J265J408J231P64K52l7n5L2J03K26N05Q22
$$ 215857 216118 216284 216386 216485 216739 217300 218236 219501 220909 222140 222904 223156 223119 223064 223096 223199 223425 223930 224752
60171B24752R14P27N34N80P42P78Q16J230K028K696K847K719K768L029L190L187
$$ 224752 225666 226393 226927 227507 228249 229027 229843 231073 233101 235797 238644 241363 244131 247160 250350 253537
60155B53537L244L390L316K904K531K578K863K890K542K249K388K826L153L160
$$ 253537 256781 260171 263487 266391 268922 271500 274363 277253 279795 282044 284432 287258 290411 293571
60141B93571K917K544K120J735J425J062N88K46L29O35N70q4q10j017p75n98p12
$$ 293571 296488 299032 301152 302887 304312 305374 305962 306208 306537 307172 307742 307658 306848 305831 305056 304458 303746
60124C03746r29j128j358j527j429j149j068j295j487j374j153j108j130r06m52
$$ 303746 302817 301689 300331 298804 297375 296226 295158 293863 292376 291002 289849 288741 287611 286705 286253
60109B86253j37k89q87j636k122k020j337m82L1l9n21j011j148q71m71l00l63
$$ 286253 286116 285827 284940 283304 281182 279162 277825 277343 277374 277335 276814 275803 274655 273784 273313 273013 272650
60092B72650l58j17J54K22J52J44K11J94O8k0N8K87N62P99R76J167J440J735J919
$$ 272650 272292 272175 272329 272551 272703 272847 273058 273252 273320 273300 273358 273645 274207 275006 275982 277149 278589 280324 282243
60073B82243J936J836J653J391J162J100J135J036P70O14P65J084J358J579J823
$$ 282243 284179 286015 287668 289059 290221 291321 292456 293492 294262 294876 295641 296725 298083 299662 301485
60058C01485K027K098K085K057J988J901J944K130K163J793J169O49L74K81L69
$$ 301485 303512 305610 307695 309752 311740 313641 315585 317715 319878 321671 322840 323489 323863 324144 324513
60043C24513O28Q27P03L36O1K8P3K7j16l00m44l99j22N9l21j289k294k776k728
$$ 324513 325141 325968 326671 327007 327068 327096 327169 327196 327080 326780 326336 325937 325815 325874 325553 324264 321970 319194 316466
60024C16466k591k730l113l442l474l249l025k958k927k748k448k236k232k368
$$ 316466 313875 311145 308032 304590 301116 297867 294842 291884 288957 286209 283761 281525 279293 276925
60010B76925k538k639k580k348k084j921j791j597j452j572j935k258k294j982
$$ 276925 274387 271748 269168 266820 264736 262815 261024 259427 257975 256403 254468 252210 249916 247934
59996B47934j359o17j72l44q61j046n89J25O16Q87J174J430J419J203J120J283
$$ 247934 246575 245958 245786 245442 244581 243535 242946 243071 243687 244574 245748 247178 248597 249800 250920 252203
59980B52203J422J314J088R50Q53O33L31J80K08J35k75q53j239j352j486j822
$$ 252203 253625 254939 256027 256977 257830 258463 258794 258974 259182 259317 259042 258189 256950 255598 254112 252290
59964B52290k171k280k273k472k849k958k518j827j394j402j606j724j673j503
$$ 252290 250119 247839 245566 243094 240245 237287 234769 232942 231548 230146 228540 226816 225143 223640
59950B23640j260r98p73n97m76m65o00q16r73j004r48q06n42k27l2j4l6L9J60
$$ 223640 222380 221382 220609 220012 219536 219071 218471 217655 216682 215678 214730 213924 213382 213155 213123 213109 213073 213112 213272
59931B13272K77M63P10P75N09K63N57J342J951J910J471J093Q09L51k94q30j044
$$ 213272 213549 214012 214722 215497 216006 216269 216826 218168 220119 222029 223500 224593 225402 225753 225459 224629 223585
59914B23585r33n95k19r9l27n84n33l17l20n25n81m19l36m08l25L1L11K55P0K9
$$ 223585 222652 222057 221838 221739 221412 220828 220295 219978 219658 219133 218552 218133 217797 217389 217064 217095 217406 217661 217731 217760
59894B17760N8N3J99O22J028J067Q75P82P35M66Q5J2L31O28O25N46P07J035J211
$$ 217760 217818 217871 218070 218692 219720 220787 221662 222444 223179 223645 223730 223742 224073 224701 225326 225872 226579 227614 228825
59875B28825J098Q86Q15R43J175J421J677J895J915J673J358J191J036N72j18
$$ 228825 229923 230809 231624 232567 233742 235163 236840 238735 240650 242323 243681 244872 245908 246480 246362
59860B46362n15l66n3J3J3L44R31J343J441J458J530J552J479J336J036M86p2
$$ 246362 245847 245481 245428 245441 245454 245798 246729 248072 249513 250971 252501 254053 255532 256868 257904 258390 258318
59843B58318k74j93k47n33o89n42m25n96p79n86j19K71N57R68J431J541J194Q71
$$ 258318 258044 257851 257604 257071 256382 255840 255415 254819 254040 253454 253335 253606 254163 255131 256562 258103 259297 260168
59825B60168J041J562J903J901J875K053K148J817J252R74J124J332J352J348
$$ 260168 261209 262771 264674 266575 268450 270503 272651 274468 275720 276694 277818 279150 280502 281850
59811B81850J467J446J015L78m3j27p2%J13K48L42M26N21N14L84M02Q17J478K006
$$ 281850 283317 284763 285778 286156 286113 285986 285914 285914 286027 286275 286617 287043 287564 288078 288462 288864 289681 291159 293165
59792B93165K245K288K226K195K461L045L414L038K110J269P30K15k88l76K8L88
$$ 293165 295410 297698 299924 302119 304580 307625 311039 314077 316187 317456 318186 318401 318113 317737 317765 318153
59776C18153K92k6k12l69p77j376j908k306k600k633k260j671j240j149j325j667
$$ 318153 318445 318419 318207 317838 317061 315685 313777 311471 308871 306238 303978 302307 301067 299918 298593 296926
59760B96926k078k370k351j971j328o12p8J05L5k9l1j20l02l34j49j4j16k74k98
$$ 296926 294848 292478 290127 288156 286828 286216 286138 286243 286278 286249 286218 286098 285796 285462 285313 285299 285183 284909 284611
59741B84611l54o38r63j010q53q30j003j051p96m45l21n08q79j255j474j451j242
$$ 284611 284257 283619 282656 281646 280793 279963 278960 277909 277113 276668 276347 275839 274960 273705 272231 270780 269538
59724B69538r92p84o17n09n61q25j181j355j134o00r1J28J26J86M23P26R60J090
$$ 269538 268546 267762 267145 266636 266075 265250 264069 262714 261580 260980 260889 261017 261143 261329 261752 262478 263438 264528
59706B64528J053Q04M82L63N57R43J451K183L099L831M024L728L313L090L112
$$ 264528 265581 266385 266867 267230 267787 268730 270181 272364 275463 279294 283318 287046 290359 293449 296561
59691B96561L275L404L378L211K972K597J978J279R33J102J438J539J465J489
$$ 296561 299836 303240 306618 309829 312801 315398 317376 318655 319588 320690 322128 323667 325132 326621
59677C26621J556J342Q25M33N00Q43R94P06J21m33p02o20k95L5J25j07m88p08
$$ 326621 328177 329519 330344 330777 331277 332120 333114 333820 333941 333508 332806 332186 331891 331926 332051 331944 331456 330748
59659C30748o07l50k22k82l24j43K54P08J046J171J141J217J622K272K833L091
$$ 330748 330141 329791 329569 329287 328963 328820 329074 329782 330828 331999 333140 334357 335979 338251 341084 344175
59643C44175L127L113L104L110L165L237L242L216L313L548L677L457K903K195
$$ 344175 347302 350415 353519 356629 359794 363031 366273 369489 372802 376350 380027 383484 386387 388582
59629C88582J481Q51L81P4j43k94l50m08o79j205j747k114k396k772l210l527
$$ 388582 390063 390914 391295 391369 391226 390932 390582 390174 389495 388290 386543 384429 382033 379261 376051 372524
59613C72524l606l448l094k673k374k244k105j827j506j257r63m51J64O01P98
$$ 372524 368918 365470 362376 359703 357329 355085 352980 351153 349647 348390 347427 346976 347140 347741 348539
59598C48539J004J417J944K368K625K764K725K283J353K29o21j044j371j955k744
$$ 348539 349543 350960 352904 355272 357897 360661 363386 365669 367022 367251 366630 365586 364215 362260 359516
59583C59516l465m045m581m977n017m771m603m620m496l987l328k926k885l059
$$ 359516 356051 352006 347425 342448 337431 332660 328057 323437 318941 314954 311626 308700 305815 302756
59569C02756l338l646l846l868l847l888l874l632l258l027l046l145l090k817
$$ 302756 299418 295772 291926 288058 284211 280323 276449 272817 269559 266532 263486 260341 257251 254434
59555B54434k470k254k220k187j980j645j293q64k73K38L19P6N3M41P90O35J20
$$ 254434 251964 249710 247490 245303 243323 241678 240385 239521 239248 239486 239805 239881 239934 240375 241165 241800 241920
59538B41920l14m82m63k96mK75M63O78R65J081Q31M00J04j6q2q9m0j06m03p03
$$ 241920 241606 241124 240661 240365 240361 240636 241099 241777 242742 243823 244654 245054 245158 245142 245060 244971 244931 244825 244422 243719
59518B43719p96r00j358k003k277j940j314p88m10n5L06N88O79M71Rm35n51k91
$$ 243719 242923 242023 240665 238662 236385 234445 233131 232343 231933 231878 232184 232772 233451 233922 233931 233496 232945 232654
59500B32654Q1K57J14k07l77j36M09Q84J117J269J445J481J301J222J539K069
$$ 232654 232735 232992 233106 232899 232522 232386 232795 233679 234796 236065 237510 238991 240292 241514 243053 245122
59484B45122K456K691L034L562M157M835N646O305O295N396L866K114M77q01j598
$$ 245122 247578 250269 253303 256865 261022 265857 271503 277808 284103 289499 293365 295479 295956 295155 293557
59469B93557j957j887j307l74L12K73k05m04j17J60Jm49q54j199j648k190k617
$$ 293557 291600 289713 288406 288032 288344 288617 288412 288008 287891 288051 288052 287603 286749 285550 283902 281712 279095
59452B79095k743k528k117j799j793k027k259k375k450k498k385k038j598j268
$$ 279095 276352 273824 271707 269908 268115 266088 263829 261454 259004 256506 254121 252083 250485 249217
59438B49217j089r02n18K0M10M16K20K08M28N70N36O58J121J570J647J520J516
$$ 249217 248128 247226 246708 246728 247138 247554 247774 247982 248410 248980 249516 250174 251295 252865 254512 256032 257548
59421B57548J533J274Q83P96J091J446J670J821J848J620J254R91P60K79l76p75
$$ 257548 259081 260355 261238 262034 263125 264571 266241 268062 269910 271530 272784 273775 274535 274814 274438 273663
59405B73663p14m07o2L50Q24J173J272J188J068J110J509K151K496K207J721J706
$$ 273663 272949 272542 272480 272830 273654 274827 276099 277287 278355 279465 280974 283125 285621 287828 289549 291255
59389B91255K076K122J569Q68L96O3j66r7J51rp77j543j663j244p47k72K64O52
$$ 291255 293331 295453 297022 297890 298286 298349 298183 298086 298237 298228 297451 295908 294245 293001 292254 291982 292246 292898
59371B92898O01K72J16K78N76R49J550K378L218L918M525N070N467N652N729N888
$$ 292898 293499 293771 293887 294165 294741 295690 297240 299618 302836 306754 311279 316349 321816 327468 333197 339085
59355C39085O269O925P857Q900R571R123P130M103J288m09j099j380j432j009
$$ 339085 345354 352279 360136 369036 378607 387730 394860 398963 400251 399842 398743 397363 395931 394922
59341C94922r0R80J914K497K227N86k153m845o480o991o932o769o644o483o103
$$ 394922 394832 395812 397726 400223 402450 403036 400883 396038 389558 382567 375635 368866 362222 355739 349636
59326C49636n377m450l626l001k470j995j626j247p33l35m05p75q52m60j3K27
$$ 349636 344259 339809 336183 333182 330712 328717 327091 325844 325111 324776 324371 323596 322744 322284 322271 322498
59310C22498M96R33J290J423J591J868J883J482J172J392J845K011J981K225K839
$$ 322498 322994 323927 325217 326640 328231 330099 331982 333464 334636 336028 337873 339884 341865 344090 346929
59295C46929L528M119M611M914M992N087N383N626N474N030M675M495M251L837
$$ 346929 350457 354576 359187 364101 369093 374180 379563 385189 390663 395693 400368 404863 409114 412951
59281D12951L346K858K414K090J788J123j07j502k480k989l462m121m756n120
$$ 412951 416297 419155 421569 423659 425447 426570 426463 424961 422481 419492 416030 411909 407153 402033
59267D02033n199n075m867m764m907n179n373n487n655n836n812n471m893m230
$$ 402033 396834 391759 386892 382128 377221 372042 366669 361182 355527 349691 343879 338408 333515 329285
59253C29285l631l226l004k808k591k470k454k274j729r41o5R73K196L268L801
$$ 329285 325654 322428 319424 316616 314025 311555 309101 306827 305098 304157 304092 305065 307261 310529 314330
59238C14330L746L259K330R68n22j779k771l613m168m207l856l411k886k074j067
$$ 314330 318076 321335 323665 324633 324111 322332 319561 315948 311780 307573 303717 300306 297420 295346 294279
59223B94279k25K99O65R88J262J593K125K742L166L402L697M082M299M246M107
$$ 294279 294054 294353 295018 296006 297268 298861 300986 303728 306894 310296 313993 318075 322374 326620 330727
59208C30727M001L879L828M077M506M543L819K669J745J300J082P52J62o57j505
$$ 330727 334728 338607 342435 346512 351018 355561 359380 362049 363794 365094 366176 366928 367090 366433 364928
59193C64928k046k051j665j335j347j570j665j532j389j440j612j787k051k515
$$ 364928 362882 360831 359166 357831 356484 354914 353249 351717 350328 348888 347276 345489 343438 340923
59179C40923k934k882k336j779j605j692j750j786j954k186k263k132j948j894
$$ 340923 337989 335107 332771 330992 329387 327695 325945 324159 322205 320019 317756 315624 313676 311782
59165C11782k085k517k939l029k802k661k779k768k224j390q56p82p99n82j80
$$ 311782 309697 307180 304241 301212 298410 295749 292970 290202 287978 286588 285732 284950 284151 283569 283389
59150B83389K34N38O47N34L57K92K93K02Q2J92O50J264J685J625J079M38K39N81
$$ 283389 283623 284161 284808 285342 285699 285991 286284 286486 286568 286760 287410 288674 290359 291984 293063 293501 293740 294321
59132B94321J012J102R16P03M54J52O6L53O28M21q5l31k52l01o47r32r02p64p67
$$ 294321 295333 296435 297351 298054 298508 298660 298726 299079 299707 300128 300043 299712 299460 299159 298512 297580 296678 295914 295147
59113B95147r25j244j747k172k099j560j102j042j061p85l17M6L09N69O51L33
$$ 295147 294222 292978 291231 289059 286960 285400 284298 283256 282195 281410 281093 281139 281448 282017 282668 283001
59097B83001k19o27q11j033j465j944k191k072j681j273j114j301j666j923j938
$$ 283001 282782 282155 281344 280311 278846 276902 274711 272639 270958 269685 268571 267270 265604 263681 261743
59082B61743j823j810j991k193k189j998j861j835j629j031l12Q1J22J82M24O16
$$ 261743 259920 258110 256119 253926 251737 249739 247878 246043 244414 243383 243071 243152 243274 243456 243880 244496
59066B44496N85N69Q91J543K271K902L394L697L734L549L335L286L430L631L729
$$ 244496 245081 245650 246541 248084 250355 253257 256651 260348 264082 267631 270966 274252 277682 281313 285042
59051B85042L664L481L219K923K706K690K814K818K477J784Q86nn88o78m80m73
$$ 285042 288706 292187 295406 298329 301035 303725 306539 309357 311834 313618 314504 314499 313911 313233 312753 312280
59035C12280q49j270j354j138r03p76p45q13r38r64q80r43j288j656j792j817
$$ 312280 311431 310161 308807 307669 306766 305990 305245 304432 303494 302530 301650 300707 299419 297763 295971 294154
59019B94154j949k103k108k037j966j696j165q16j030j462j529j340j473j930
$$ 294154 292205 290102 287994 285957 283991 282295 281130 280314 279284 277822 276293 274953 273480 271550
59005B71550k066j606j043q80j057j307j537j681j608j415j379j494j455j158
$$ 271550 269484 267878 266835 265955 264898 263591 262054 260373 258765 257350 255971 254477 253022 251864
58991B51864q64o85m24n4J54J57K74N87P01M28J89L77P19O81K11k95n39m83j75
$$ 251864 251000 250315 249891 249837 249991 250148 250422 251009 251710 252138 252327 252704 253423 254104 254315 254020 253481 252998 252823
58972B52823K57N94P90J072J548J955K030J914J908K019K109K266K716L379L869
$$ 252823 253080 253674 254464 255536 257084 259039 261069 262983 264891 266910 269019 271285 274001 277380 281249
58957B81249L902L517K913K278J707J155N02j95o42o31l52j67j93k08K9N36J107
$$ 281249 285151 288668 291581 293859 295566 296721 297223 297028 296386 295755 295403 295236 295043 294835 294864 295400 296507
58940B96507J468J473J232R77Q12O52M30K31J41J18O4j8p8j20j95l06l47j50L60
$$ 296507 297975 299448 300680 301657 302469 303121 303551 303782 303923 304041 304105 304087 304009 303889 303694 303388 303041 302891 303251
58921C03251J028J563J882K184K624L081L429L801M324M774M851M653M563M662
$$ 303251 304279 305842 307724 309908 312532 315613 319042 322843 327167 331941 336792 341445 346008 350670
58907C50670M705M572M370M045L364K392J536J062P80M28k0n26j153j910k621
$$ 350670 355375 359947 364317 368362 371726 374118 375654 376716 377496 377924 377904 377378 376225 374315 371694
58892C71694l172l653m184m751n278n628n594n148m641m440m354l852k849j902
$$ 371694 368522 364869 360685 355934 350656 345028 339434 334286 329645 325205 320851 316999 314150 312248
58878C12248j451j328j185j025j052j254j384j209o80K1N03N14K38L5m6k23m55
$$ 312248 310797 309469 308284 307259 306207 304953 303569 302360 301680 301701 302204 302718 302956 302991 302945 302722 302267
58861C02267m90l39k60k43JM10N27K51P9L88R41J448J969K533K830K757K718K990
$$ 302267 301777 301438 301178 300935 300936 301346 301873 302124 302203 302591 303532 304980 306949 309482 312312 315069 317787 320777
58843C20777L224L109L006L406M041M255M057M084M623N195N276M944M651M676
$$ 320777 324001 327110 330116 333522 337563 341818 345875 349959 354582 359777 365053 369997 374648 379324
58829C79324M962N286N491N582N594N408M879M165L667L475L192K484J593R84
$$ 379324 384286 389572 395063 400645 406239 411647 416526 420691 424358 427833 431025 433509 435102 436086
58815D36086P24N03J15l49p37j000j185j352j528j652j706j816k067k285k286
$$ 436086 436810 437313 437428 437079 436342 435342 434157 432805 431277 429625 427919 426103 424036 421751 419465
58800D19465k353k942l912m541m501m328m589n088n331n347n550o008o347o280
$$ 419465 417112 414170 410258 405717 401216 396888 392299 387211 381880 376533 370983 364975 358628 352348
58786C52348n857n266m760m564m660m656m207l422k713k341k311k482k613k474
$$ 352348 346491 341225 336465 331901 327241 322585 318378 314956 312243 309902 307591 305109 302496 300022
58772C00022k137j950k013j964j519r10n44m70m45l40j46J78N82Q43Q37P74R03
$$ 300022 297885 295935 293922 291958 290439 289529 288985 288515 288070 287730 287584 287762 288344 289187 290024 290798 291701
58755B91701J160J351J411J326J010M98L3k39m28o35q23j066j537k077k245k032
$$ 291701 292861 294212 295623 296949 297959 298457 298490 298251 297823 297188 296365 295299 293762 291685 289440 287408
58739B87408j991k355k614k361j988j984k031j558p74l46l23j57K97N74M47K88
$$ 287408 285417 283062 280448 278087 276099 274115 272084 270526 269752 269406 269083 268926 269223 269797 270244 270532
58723B70532M36P65J050J316J667K105K569K933K946K498J840J258O01m13j549
$$ 270532 270968 271733 272783 274099 275766 277871 280440 283373 286319 288817 290657 291915 292516 292103 290554
58708B90554k163k030j651j669k221k967l443l363k856k410k362k483k288j734
$$ 290554 288391 286361 284710 283041 280820 277853 274410 271047 268191 265781 263419 260936 258648 256914
58694B56914j274j250j451j409r19k14L02M66N14P60J162J401J383J336J418J553
$$ 256914 255640 254390 252939 251530 250611 250397 250699 251165 251679 252439 253601 255002 256385 257721 259139 260692
58678B60692J750K130K509K435J893J469J534J724J576J204R01O09K70K62P68
$$ 260692 262442 264572 267081 269516 271409 272878 274412 276136 277712 278916 279817 280426 280696 280958 281726
58663B81726J229J062O46P66J412J869J932K122K707L210L163K699K197J765J288
$$ 281726 282955 284017 284663 285429 286841 288710 290642 292764 295471 298681 301844 304543 306740 308505 309793
58648C09793O56j57j059j874k582l399m339m999n107n050n364n900o078n749n307
$$ 309793 310449 310292 309233 307359 304777 301378 297039 292040 286933 281883 276519 270619 264541 258792 253485
58633B53485m971m587m096l684l392l073k740k601k633k557k227j781j397j186
$$ 253485 248514 243927 239831 236147 232755 229682 226942 224341 221708 219151 216924 215143 213746 212560
58619B12560j183j203q92k31K46J45j60r9K39L72L61P21J489K107K200J950J623
$$ 212560 211377 210174 209282 209051 209297 209442 209282 209183 209422 209794 210155 210876 212365 214472 216672 218622 220245
58602B20245J347J283J516J701J375O48M5l07p63j395j777j703j581j842k318
$$ 220245 221592 222875 224391 226092 227467 228115 228160 227853 227090 225695 223918 222215 220634 218792 216474
58587B16474k536k291j787j371j207j143r76q39j055j449j319m69K89K22k24j82
$$ 216474 213938 211647 209860 208489 207282 206139 205163 204324 203269 201820 200501 200032 200321 200543 200319 200137
58571B00137K69L45o1k98j33l5j88k09J8O0k32m00j84J01K41N07J058J571J786
$$ 200137 200406 200751 200690 200392 200259 200224 200036 199827 199845 199905 199673 199273 199089 199190 199431 199938 200996 202567 204353
58552B04353J901K067K057J734J435J474J670J649J352R78O85N26M49K89j8k23
$$ 204353 206254 208321 210378 212112 213547 215021 216691 218340 219692 220670 221355 221881 222330 222619 222601 222378
58536B22378l9M58R67J366J634J622J320J210J738K586L033K945K815K944L208
$$ 222378 222339 222797 223764 225130 226764 228386 229706 230916 232654 235240 238273 241218 244033 246977 250185
58521B50185L540L966M217L983L544L470L743L844L673L619L724L605L309L418
$$ 250185 253725 257691 261908 265891 269435 272905 276648 280492 284165 287784 291508 295113 298422 301840
58507C01840M143M995N587O061O570P008P381P812Q083P777O949O077N265M206
$$ 301840 305983 310978 316565 322626 329196 336204 343585 351397 359480 367257 374206 380283 385548 389754
58493C89754K911J755P50m17j579k169k191k276k689l061l267l659m287m764n051
$$ 389754 392665 394420 395170 394753 393174 391005 388814 386538 383849 380788 377521 373862 369575 364811 359760
58478C59760n572o359o943p236p570p782p268o185n476n385n072m139l345l280
$$ 359760 354188 347829 340886 333650 326080 318298 311030 304845 299369 293984 288912 284773 281428 278148
58464B78148l425l158k769k714k761k542k258k158k035j762j637j679j355n51
$$ 278148 274723 271565 268796 266082 263321 260779 258521 256363 254328 252566 250929 249250 247895 247344
58450B47344%j73n44n22l36l34k97k7P9k17l86k0M41N08M82P39R14N58K2n9L50
$$ 247344 247344 247171 246627 246105 245769 245435 245138 245111 245190 244973 244587 244567 245008 245516 245998 246737 247651 248209 248231 248172 248522
58429B48522R52J675K406K768K770L014L725M243M130L934M186M459M188L719
$$ 248522 249474 251149 253555 256323 259093 262107 265832 270075 274205 278139 282325 286784 290972 294691
58415B94691L630L653L220K447J751R97m0r29j140r91j155j644j959j906j594
$$ 294691 298321 301974 305194 307641 309392 310389 310349 309420 308280 307289 306134 304490 302531 300625 299031
58400B99031j056m33q6N7O44J831K760K749K329K275K374J984J193M29m43j697
$$ 299031 297975 297542 297456 297513 298157 299988 302748 305497 307826 310101 312475 314459 315652 316081 315638 313941
58384C13941k883l394l455l664l969l871l356k777k221j714j530j634j352l73
$$ 313941 311058 307664 304209 300545 296576 292705 289349 286572 284351 282637 281107 279473 278121 277748
58370B77748N57P36O58J160K020K445K380K330K315K005J496J030L55p55j805
$$ 277748 278305 279041 279699 280859 282879 285324 287704 290034 292349 294354 295850 296880 297235 296480 294675
58355B94675k247k345k513k445j857j431j835k412k077j089o05q56j017o85k61
$$ 294675 292428 290083 287570 285125 283268 281837 280002 277590 275513 274424 273819 272963 271946 271261 271000
58340B71000L0L20M88L41K59O74J189J219J116J578K229K092J233P22R67J316
$$ 271000 271030 271350 271838 272179 272438 273112 274301 275520 276636 278214 280443 282535 283768 284490 285457 286773
58324B86773J336J297J345J251J158J542K309K772K676K455K415K425K447K654
$$ 286773 288109 289406 290751 292002 293160 294702 297011 299783 302459 304914 307329 309754 312201 314855
58310C14855K937K979K774K534K284K071K296L126L945M063L706L539L612L515
$$ 314855 317792 320771 323545 326079 328363 330434 332730 335856 339801 343864 347570 351109 354721 358236
58296C58236L221K993K776K445K220K185J849R87K99M51J010J222J233J575K097
$$ 358236 361457 364450 367226 369671 371891 374076 375925 376912 377211 377662 378672 379894 381127 382702 384799
58281C84799K429K836L594M124L917L612M004M648M668M343M484M879M700M069
$$ 384799 387228 390064 393658 397782 401699 405311 409315 413963 418631 422974 427458 432337 437037 441106
58267D41106L738L672L280K653K317K153J816J670K109K527K279J989K510L281
$$ 441106 444844 448516 451796 454449 456766 458919 460735 462405 464514 467041 469320 471309 473819 477100
58253D77100L348L205L922N094N497N277N554O276O407N990O075O780P220P240
$$ 477100 480448 483653 487575 492669 498166 503443 508997 515273 521680 527670 533745 540525 547745 554985
58239E54985P486P874P733P303P426P988Q260Q506R474J0690J1062J0814J1047
$$ 554985 562471 570345 578078 585381 592807 600795 609055 617561 627035 637725 648787 659601 670648
58226F70648J1689J1843J1774J2532J3931J4860J5342J6290J7534J8192J8690
$$ 670648 682337 694180 705954 718486 732417 747277 762619 778909 796443 814635 833325
58215H33325K0186K2339K3787K4584K5945K7825K9096K9824L1074L2714L3762
$$ 833325 853511 875850 899637 924221 950166 977991 1007087 1036911 1067985 1100699 1134461
58204A134461L4634L6549L9042M0544M1224M2586M4600M5897M6610M8126N0281
$$ 1134461 1169095 1205644 1244686 1285230 1326454 1369040 1413640 1459537 1506147 1554273 1604554
58193A604554N1644N2476N4439N7520O0205O2550O6005P0347P3999P7224Q1705
$$ 1604554 1656198 1708674 1763113 1820633 1880838 1943388 2009393 2079740 2153739 2230963 2312668
58182B312668Q7115R1533R5202J00279J06992J13689J20516J29158J39018J47788
$$ 2312668 2399783 2491316 2586518 2686797 2793789 2907478 3027994 3157152 3296170 3443958
58172C443958J55774J65480J76861J87447J97263K08916K22631K35996K48939
$$ 3443958 3599732 3765212 3942073 4129520 4326783 4535699 4758330 4994326 5243265
58163E243265K63998K81368K98831L16908L38557L63465L88371M13420M42169
$$ 5243265 5507263 5788631 6087462 6404370 6742927 7106392 7494763 7908183 8350352
58154H350352M74967N08915N44714N86411O33847O83067P35097P96151Q68441
$$ 8350352 8825319 9334234 9878948 10465359 11099206 11782273 12517370 13313521 14181962
58145A4181962R49687J042842J156663J295334J457839J648472J876274K143380
$$ 14181962 15131649 16174491 17331154 18626488 20084327 21732799 23609073 25752453
58137B5752453K448202K801692L223096L714907M257790M831689N423366O021315
$$ 25752453 28200655 31002347 34225443 37940350 42198140 47029829 52453195 58474510
58129E8474510O643891P366019Q223813R009363R204143Q249669N973511K758790
$$ 58474510 65118401 72484420 80708233 89717596 98921739 107171408 113144919 115903709
58121A15903709o96283l761034o071895p515602q157315q188278p851110p344442
$$ 115903709 115207426 111446392 105374497 97858895 89701580 81513302 73662192 66317750
58113F6317750o777657o195691n616709n045942m485148l947801l457742l029138
$$ 66317750 59540093 53344402 47727693 42681751 38196603 34248802 30791060 27761922
58105B7761922k658341k337116k061796j826720j621263j438929j280866j146679
$$ 27761922 25103581 22766465 20704669 18877949 17256686 15817757 14536891 13390212
58097A3390212j029711r24650q32213p53013o83504o20962n66247n18857m75001
$$ 13390212 12360501 11435851 10603638 9850625 9167121 8546159 7979912 7461055 6986054
58088F986054m33096l95881l64763l37094l11058k88185k68896k50371k31082
$$ 6986054 6552958 6157077 5792314 5455220 5144162 4855977 4587081 4336710 4105628
58079D105628k13167j98222j84846j72173j61732j53799j45808j36348j27302
$$ 4105628 3892461 3694239 3509393 3337220 3175488 3021689 2875881 2739533 2612231
58070B612231j20103j13411j06220r9884r5155r0383q4545p9173p5457p2177o8228
$$ 2612231 2492128 2378717 2272497 2172613 2077458 1987075 1902530 1823357 1747900 1675723 1607495
58059A607495o4584o2088n9733n6780n4242n2802n1422m9393m7614m6604m5326
$$ 1607495 1542911 1480823 1421090 1364310 1310068 1257266 1205844 1156451 1108837 1062233 1016907
58048A016907m3184m1116l9602l7663l4902l2457l0845k8950k6212k3730k2137
$$ 1016907 973723 932607 893005 855342 820440 787983 757138 728188 701976 678246 656109
58037F56109k0447j8152j6376j5758j5143j3645j2160j1543j1109j0126r203q940
$$ 656109 635662 617510 601134 585376 570233 556588 544428 532885 521776 511650 502447 493507
58025D93507q790q410q517r379r921r495r010r268r616r324q834q627q213p323
$$ 493507 484717 476307 467790 458411 448490 438995 429985 420717 411101 401777 392943 384316 376103 368780
58011C68780o773p052p328o850o124n773n502n047m937n384n623n233m906n081
$$ 368780 362007 354955 347627 340777 334653 328880 323378 318331 313394 308010 302387 297154 292248 287167
57997B87167n088m505m124m588n266n362n086m811m295l502l125l383l470k980
$$ 287167 282079 277574 273450 268862 263596 258234 253148 248337 244042 240540 237415 234032 230562 227582
57983B27582k708l142l426k772j857j665k007k178k213k433k617k510k436k628
$$ 227582 224874 221732 218306 215534 213677 212012 210005 207827 205614 203181 200564 198054 195618 192990
57969A92990k760k759l140l856l928l003k146k202k509k204j714j813k113j811
$$ 192990 190230 187471 184331 180475 176547 173544 171398 169196 166687 164483 162769 160956 158843 157032
57955A57032j088o77o17n23m86p35r31p14m16m19l96J1L74J81k25k98k22m02o07
$$ 157032 155944 155267 154650 154127 153641 152906 151975 151261 150845 150426 150030 150041 150415 150596 150371 150073 149851 149449 148842
57936A48842m60k35l34m98l54k31o15j250j564j557j539j417r94n10k46j0L40
$$ 148842 148382 148147 147813 147315 146961 146730 146115 144865 143301 141744 140205 138788 137794 137284 137038 137028 137368
57919A37368L98j49q09r35n86k19K7J50ok94j41N61J052Q21M05M45O31M05pj08
$$ 137368 137766 137617 136808 135873 135287 135068 135095 135245 135239 134945 134804 135365 136417 137238 137643 138088 138719 139124 139117 139009
57899A39009q2l26n65l56m6k82r57j479j714j897j918j500q71m80k95k3K73L81
$$ 139009 138927 138601 138036 137680 137634 137352 136395 134916 133202 131305 129387 127887 127016 126536 126241 126218 126491 126872
57881A26872M13N06M53K23L65J202K129K385K075J726J324O43J6j25o4l62q65
$$ 126872 127285 127791 128244 128467 128832 130034 132163 134548 136623 138349 139673 140316 140332 140207 140143 139781 138916
57864A38916j079j142j522k027k056j671j503j747k013k139k234k100j407m46
$$ 138916 137837 136695 135173 133146 131090 129419 127916 126169 124156 122017 119783 117683 116276 115830
57850A15830O4o4l62m96n12m28k07j23m54r36j078r24q33p32k92K67L43j03m90
$$ 115830 115894 115830 115468 114972 114460 114032 113825 113702 113248 112312 111234 110310 109477 108745 108453 108720 109063 108960 108470
57831A08470n04l87k81k6L32M44K05j16l70o04o77l81Jj05o77j017o72OM58N84
$$ 108470 107966 107579 107298 107272 107604 108048 108253 108137 107767 107163 106486 106105 106106 106001 105324 104307 103635 103641 104099 104683
57811A04683O01O39O90P50P69P09O79Q44J193J538J759J881J943J944J847J578
$$ 104683 105284 105923 106613 107363 108132 108841 109520 110364 111557 113095 114854 116735 118678 120622 122469 124047
57795A24047J155Q76J057J498J599J177P13N70M40m5o82j070j181j137r13o68
$$ 124047 125202 126078 127135 128633 130232 131409 132122 132692 133132 133087 132405 131335 130154 129017 128104 127436
57779A27436q48j423j585q78j5Q7l62n59m05l78m66k89k0j53m70k64M02O90L19
$$ 127436 126588 125165 123580 122702 122687 122774 122412 121853 121448 121070 120604 120315 120295 120142 119672 119408 119810 120500 120819
57760A20819m8O5L46M65O10R21J081Q17K71l56j035j611j836j816j902k050j886
$$ 120819 120771 120836 121182 121647 122257 123178 124259 125076 125347 124991 123956 122345 120509 118693 116791 114741 112855
57743A12855j442j238j474j756j778j667j495j114o36m97p71r70p80m58k91k07
$$ 112855 111413 110175 108701 106945 105167 103500 102005 100891 100255 99758 98987 98017 97237 96779 96488 96281
57727I6281j14j12j57mK86L55J78J74M32M87J12k57k58j54k61l74j97J07K63L46
$$ 96281 96167 96055 95898 95894 96180 96535 96713 96887 97319 97806 97918 97661 97403 97249 96988 96614 96417 96524 96787 97133
57707I7133M66L64j91r08j335j406j302j001m56M8J80P4J50N09P94O86K58j07
$$ 97133 97599 97963 97772 96864 95529 94123 92821 91820 91364 91412 91592 91666 91816 92325 93119 93805 94063 93956
57689I3956n7M18R02R54O49N05P77J144J214J013Q32Q34J058J504K013K248K043
$$ 93956 93899 94317 95219 96173 96822 97327 98104 99248 100462 101475 102307 103141 104199 105703 107716 109964 112007
57672A12007J593J152P95N68O04Q82J093J023Q08O50M97J90k15n05n68m10j60
$$ 112007 113600 114752 115547 116115 116719 117601 118694 119717 120525 121175 121672 121862 121647 121142 120574 120164 120004
57655A20004o0l09p53j019j021j055j293j496j433j192r39o67m28m66q08j028
$$ 120004 119944 119635 118882 117863 116842 115787 114494 112998 111565 110373 109434 108767 108339 107873 107065 106037
57639A06037p36r2M44O48N69K87l6r7K06N45N37K30m9j64j37J14O73J320J724
$$ 106037 105301 105209 105653 106301 106870 107157 107121 107024 107230 107775 108312 108542 108493 108329 108192 108306 108979 110299 112023
57620A12023J856J946K071K136K216K622L502M655N828O969Q122R242J0221J1013
$$ 112023 113879 115825 117896 120032 122248 124870 128372 133027 138855 145824 153946 163188 173409 184422
57606A84422J1608J1800J1084Q926N292Q65l418o967r584j1131j1539j1192j0781
$$ 184422 196030 207830 218914 227840 233132 233997 230579 223612 214028 202897 191358 180166 169385
57593A69385j0629j0403r743q778p801o765n534m325l512l085k739k362k086j911
$$ 169385 158756 148353 138610 129832 122031 115266 109732 105407 101895 98810 96071 93709 91623 89712
57579H9712j632j193p79m96k57l7Nk32n98q69r76j019j106j224j269j193j096
$$ 89712 88080 86887 86108 85612 85355 85318 85323 85091 84493 83624 82648 81629 80523 79299 78030 76837 75741
57562G5741j107j166j095r30r23j111j188r77p97r79j310j297r13o16o33o77m70
$$ 75741 74634 73468 72373 71443 70520 69409 68221 67244 66447 65468 64158 62861 61948 61332 60699 60022 59552
57545E9552j59j3o7k23n00r05j235j271j062q73q75j058j294j386j169p04l24
$$ 59552 59393 59380 59313 59090 58590 57685 56450 55179 54117 53244 52369 51311 50017 48631 47462 46758 46434
57528D6434l02n24o41n59n02o72r62j162j234j278j324j304j210j091r51p75o74
$$ 46434 46132 45608 44967 44408 43906 43234 42272 41110 39876 38598 37274 35970 34760 33669 32718 31943 31269
57511C1269q38j236j521j368q90n31o26j069j512j685j580j355j200j183j237
$$ 31269 30431 29195 27674 26306 25416 24885 24259 23190 21678 19993 18413 17058 15858 14675 13438
57496A3438j212j009o28j46L05N57M99J97j39k96k14%J66J90J43J52K16K13J01
$$ 13438 12226 11217 10589 10443 10748 11305 11804 12001 11862 11566 11352 11352 11518 11708 11851 12003 12219 12432 12533
57477A2533K1O1J04l7l63p42j055j175r78n47k92n32j046j281j048o61m43l38
$$ 12533 12554 12615 12719 12682 12319 11577 10522 9347 8369 7822 7530 6998 5952 4671 3623 2962 2519 2181
57459B181k19j85l59n94A35f04j032j606k220k670k985l231l264k849j996j089
$$ 2181 1962 1777 1418 824 135 -604 -1636 -3242 -5462 -8132 -11117 -14348 -17612 -20461 -22457 -23546
57443b3546o04o58r60j176j272j343j261p77K0O60Q04O64O87J038J458J595J319
$$ -23546 -24150 -24808 -25768 -26944 -28216 -29559 -30820 -31597 -31577 -30917 -30113 -29449 -28762 -27724 -26266 -24671 -23352
57426b3352P79K73l8k51n33p92p21k58K18K83j00o27r99j064p47j18N37R07R30
$$ -23352 -22573 -22300 -22338 -22589 -23122 -23914 -24635 -24893 -24675 -24392 -24492 -25119 -26118 -27182 -27929 -28047 -27510 -26603 -25673
57407b5673P60N22K42j8j57j72j85k67l67m24m74n95p95j001j121j102r69p99
$$ -25673 -24913 -24391 -24149 -24167 -24324 -24496 -24681 -24948 -25315 -25739 -26213 -26808 -27603 -28604 -29725 -30827 -31796 -32595
57389c2595o71o71q83j270j572j505j099p01n70n93n32m30n30q75j136r86m77
$$ -32595 -33266 -33937 -34820 -36090 -37662 -39167 -40266 -40967 -41537 -42130 -42662 -43092 -43622 -44497 -45633 -46619 -47096
57372d7096PJ48Nq9O0K91L09Q3j55k96m80p87j009r40p19o77q78j090j115r56
$$ -47096 -47089 -46941 -46936 -47025 -46965 -46674 -46365 -46282 -46437 -46733 -47213 -48000 -49009 -49949 -50668 -51345 -52223 -53313 -54428 -55384
57352e5384o80l72k15l80p77j092j166j148j210j294j271j195j194j221j108q63
$$ -55384 -56064 -56436 -56651 -57031 -57808 -58900 -60066 -61214 -62424 -63718 -64989 -66184 -67378 -68599 -69707 -70570
57336g0570p34r03j216j300r89n40l85o03q21o34j18L07M08L58L76M00K71L8j02
$$ -70570 -71304 -72207 -73423 -74723 -75712 -76252 -76637 -77240 -78061 -78695 -78813 -78506 -78098 -77740 -77364 -76964 -76693 -76655 -76757
57317g6757p3L4J34J87J19j14l77m92m69m76n95p53r28j184j493j697j719j644
$$ -76757 -76830 -76796 -76662 -76475 -76356 -76470 -76847 -77339 -77808 -78284 -78879 -79632 -80560 -81744 -83237 -84934 -86653 -88297
57299h8297j563j463j376j433j661j863j817j470r17l39m2k81q53j165r49o22
$$ -88297 -89860 -91323 -92699 -94132 -95793 -97656 -99473 -100943 -101860 -102199 -102241 -102522 -103375 -104540 -105489 -106111
57283a06111p18j101j192q18m12l84o90j081j407j588j554j382j248j163j007
$$ -106111 -106829 -107930 -109122 -109940 -110352 -110736 -111426 -112507 -113914 -115502 -117056 -118438 -119686 -120849 -121856
57268a21856q59r74j329j516j267q15n66n96o95p09o28n25n41p76j086j187j093
$$ -121856 -122715 -123689 -125018 -126534 -127801 -128616 -129182 -129778 -130473 -131182 -131810 -132335 -132876 -133652 -134738 -135925 -137018
57251a37018j147j480j728j542j136r72j087j133r63p76o83n42k88j51l84r37
$$ -137018 -138165 -139645 -141373 -142915 -144051 -145023 -146110 -147243 -148206 -148982 -149665 -150207 -150495 -150646 -151030 -151967
57235a51967j526j873j860j551j149q87q65r98j146j231j305j460j661j701j430
$$ -151967 -153493 -155366 -157226 -158777 -159926 -160813 -161678 -162676 -163822 -165053 -166358 -167818 -169479 -171180 -172610
57220a72610r84o31m15j58J47K98K83M99J245K295L155L590L674L483L066K548
$$ -172610 -173594 -174225 -174640 -174798 -174651 -174353 -174070 -173571 -172326 -170031 -166876 -163286 -159612 -156129 -153063 -150515
57204a50515K070J565Q60n7j001j763k252k561k930l497l996l960l390k895k979
$$ -150515 -148445 -146880 -146020 -146077 -147078 -148841 -151093 -153654 -156584 -160081 -164077 -168037 -171427 -174322 -177301
57189a77301l456l884m216m613m869m590l903l413l428l601l547l351l321l500
$$ -177301 -180757 -184641 -188857 -193470 -198339 -202929 -206832 -210245 -213673 -217274 -220821 -224172 -227493 -230993
57175b30993l705l866m061m251m205l805l343l309l825m430m601m394m283m416
$$ -230993 -234698 -238564 -242625 -246876 -251081 -254886 -258229 -261538 -265363 -269793 -274394 -278788 -283071 -287487
57161b87487m413l956l131k094q12O03J739K410L036M007N076N706N818N715N522
$$ -287487 -291900 -295856 -298987 -301081 -301893 -301290 -299551 -297141 -294105 -290098 -285022 -279316 -273498 -267783 -262261
57146b62261N172M828M786N005N136M983M639M259M059M347N079N554N074L888
$$ -262261 -257089 -252261 -247475 -242470 -237334 -232351 -227712 -223453 -219394 -215047 -209968 -204414 -199340 -195452
57132a95452K973K849L061K934K377J716J115M55l92j375k331l159l891m589n214
$$ -195452 -192479 -189630 -186569 -183635 -181258 -179542 -178427 -177972 -178364 -179739 -182070 -185229 -189120 -193709 -198923
57117a98923n711o256p163q497j0014j1584j3342j5332j7308j9079k0641k1881
$$ -198923 -204634 -210890 -218053 -226550 -236564 -248148 -261490 -276822 -294130 -313209 -333850 -355731
57105c55731k2489k2438k2097k1725k1289k1018k1499k2895k4596k6070k7477
$$ -355731 -378220 -400658 -422755 -444480 -465769 -486787 -508286 -531181 -555777 -581847 -609324
57094f09324k9083l0697l2200l4016l6434l9095m1704m4641m8172n1821n5172
$$ -609324 -638407 -669104 -701304 -735320 -771754 -810849 -852553 -897194 -945366 -997187 -1052359
57083a052359n8711o2936o7358p1249p4868p8968q3627q8542r3951j00247j07195
$$ -1052359 -1111070 -1174006 -1241364 -1312613 -1387481 -1466449 -1550076 -1638618 -1732569 -1832816 -1940011
57072a940011j14514j22700j32263j42698j53365j64820j78095j93177k09407
$$ -1940011 -2054525 -2177225 -2309488 -2452186 -2605551 -2770371 -2948466 -3141643 -3351050
57063c351050k26845k46004k66753k88781l12666l39181l68226l99743m34992
$$ -3351050 -3577895 -3823899 -4090652 -4379433 -4692099 -5031280 -5399506 -5799249 -6234241
57054f234241m75507n21540n73170o32128p00825p80361q71183r74763j092724
$$ -6234241 -6709748 -7231288 -7804458 -8436586 -9137411 -9917772 -10788955 -11763718 -12856442
57045a2856442j225545j374506j544165j741018j971393k243360k569149k962960
$$ -12856442 -14081987 -15456493 -17000658 -18741676 -20713069 -22956429 -25525578 -28488538
57037b8488538l438958m015414m718156n573682o598692p799321r175562j0716510
$$ -28488538 -31927496 -35942910 -40661066 -46234748 -52833440 -60632761 -69808323 -80524833
57029h0524833j2390762j4149484j5939755j7707879j9390080k0903472k2125839
$$ -80524833 -92915595 -107065079 -123004834 -140712713 -160102793 -181006265 -203132104
57022b03132104k2843542k2711311k1327422j8449272j4202724r090075l770196
$$ -203132104 -225975646 -248686957 -270014379 -288463651 -302666375 -311756450 -315526646
57015c15526646J212323N559629R185069J2111185J4396020J6107917J7323828
$$ -315526646 -314314323 -308754694 -299569625 -287458440 -273062420 -256954503 -239630675
57008b39630675J8123766J8569994J8683646J8446658J7838161J6876843J5633270
$$ -239630675 -221506909 -202936915 -184253269 -165806611 -147968450 -131091607 -115458337
57001a15458337J4209156J2708765J1220760R809807Q514390P351621O325860
$$ -115458337 -101249181 -88540416 -77319656 -67509849 -58995459 -51643838 -45317978
56994d5317978N434032M666904M011393L454315K983277K585258K247451J959921
$$ -45317978 -39883946 -35217042 -31205649 -27751334 -24768057 -22182799 -19935348 -17975427
56986a7975427J715607J507881J330119J177414J046520R33913Q35690P49382
$$ -17975427 -16259820 -14751939 -13421820 -12244406 -11197886 -10263973 -9428283 -8678901
56978h678901O74045O08493N50874M99888M54791M14314L77052L42937L12757
$$ -8678901 -8004856 -7396363 -6845489 -6345601 -5890810 -5476496 -5099444 -4756507 -4443750
56969d443750K86156K61414K37324K14265J93628J77211J66619J61697J59599
$$ -4443750 -4157594 -3896180 -3658856 -3444591 -3250963 -3073752 -2907133 -2745436 -2585837
56960b585837J56755J51748J45297J38013J29736J20785J12111J03914R5473Q6536
$$ -2585837 -2429082 -2277334 -2132037 -1994024 -1864288 -1743503 -1631392 -1527478 -1432005 -1345469
56950a345469P7643O9018O0340N1774M4007L7071L0239K3257J6698J0944N915
$$ -1345469 -1267826 -1198808 -1138468 -1086694 -1042687 -1005616 -975377 -952120 -935422 -924478 -918563
56939i18563J929k62n90JO30J115J474J685K022K850L929M633M946N466O426P475
$$ -918563 -916634 -916896 -917486 -917485 -916855 -915740 -914266 -912581 -910559 -907709 -903780 -899147 -894201 -888735 -882309 -874834
56923h74834Q403R326J0198J0869J1585J2626J3552J3704J3266J2970J2886J2481
$$ -874834 -866431 -857105 -846907 -836038 -824453 -811827 -798275 -784571 -771305 -758335 -745449 -732968
56911g32968J1797J1474J1518J1196J0339R657R547R544R286R038Q958Q709Q166
$$ -732968 -721171 -709697 -698179 -686983 -676644 -666987 -657440 -647896 -638610 -629572 -620614 -611905 -603739
56898f03739P734P599P440P123O974P058O963O596O414O575O642O450O506P084
$$ -603739 -596005 -588406 -580966 -573843 -566869 -559811 -552848 -546252 -539838 -533263 -526621 -520171 -513665 -506581
56884e06581P706P930Q010Q280Q541Q560Q612R004R478R577R284Q927Q783Q970
$$ -506581 -498875 -490945 -482935 -474655 -466114 -457554 -448942 -439938 -430460 -420883 -411599 -402672 -393889 -384919
56870c84919R377R474Q671P111N638M788M224L439K489J738J321J189J347J741
$$ -384919 -375542 -366068 -357397 -350286 -344648 -339860 -335636 -332197 -329708 -327970 -326649 -325460 -324113 -322372
56856c22372K210K696L212L555L467L138L076L345L500L351L222L288L229K893
$$ -322372 -320162 -317466 -314254 -310699 -307232 -304094 -301018 -297673 -294173 -290822 -287600 -284312 -281083 -278190
56842b78190K670K841L075K965K685K687L072L615M181M771N328N730N913N859
$$ -278190 -275520 -272679 -269604 -266639 -263954 -261267 -258195 -254580 -250399 -245628 -240300 -234570 -228657 -222798
56828b22798N663N561N696N825N598N008M277L391K215J002K24l6q0jL39Q01J111
$$ -222798 -217135 -211574 -205878 -200053 -194455 -189447 -185170 -181779 -179564 -178562 -178338 -178374 -178454 -178455 -178116 -177315 -176204
56811a76204J477K359L576M380M552M704N272N968O479O970P613Q234Q723R132
$$ -176204 -174727 -172368 -168792 -164412 -159860 -155156 -149884 -143916 -137437 -130467 -122854 -114620 -105897 -96765
56797i6765R094P928N670L313J578J86j220k216k291j795j416j200p09J47J110
$$ -96765 -87671 -79743 -74073 -70760 -69182 -68996 -70216 -72432 -74723 -76518 -77934 -79134 -79843 -79696 -78586
56782g8586K087L143M153N027N979P213Q518R589J0433J1158B85J1339J0207P986
$$ -78586 -76499 -73356 -69203 -64176 -58197 -50984 -42466 -32877 -22444 -11286 285 11624 21831 29817
56768B9817M652P95k479m560n765o523o668C231a931m705m511l941k833j533k28
$$ 29817 34469 35264 32785 28225 22460 15937 9269 3231 -1931 -6636 -11147 -15088 -17921 -19454 -19682
56753a9682J148K490L581M504b408D372P980Q872R103Q178N907K776m43l266n492
$$ -19682 -18534 -16044 -12463 -7959 -2408 4372 12352 21224 30327 38505 44412 47188 46745 43479 37987
56738C7987o957p637p799p664G58e571n475m774l945k768j608r17n14J49J206
$$ 37987 31030 23393 15594 7930 758 -5571 -11046 -15820 -19765 -22533 -24141 -25058 -25572 -25423 -24217
56723b4217K338L293M030M498M606a157B243J774k87A681a505m078m908n134m389
$$ -24217 -21879 -18586 -14556 -10058 -5452 -1157 2243 4017 3730 1681 -1505 -5583 -10491 -15625 -20014
56708b0014l358l010l319l546l388l115k767k136j402j038j059j061r42r56j079
$$ -20014 -23372 -26382 -29701 -33247 -36635 -39750 -42517 -44653 -46055 -47093 -48152 -49213 -50155 -51111 -52190
56693e2190j028q72r47j142r51l17K32L55K40J22J7K5K92O13O57O34J049J749
$$ -52190 -53218 -54090 -55037 -56179 -57130 -57447 -57215 -56860 -56620 -56498 -56481 -56456 -56164 -55551 -54894 -54260 -53211 -51462
56675e1462J889J138K19p4J70L67K76N3j37j68Q6N07P14N90N10P91J185J246R86
$$ -51462 -49573 -48435 -48216 -48290 -48120 -47753 -47477 -47424 -47561 -47729 -47643 -47136 -46422 -45832 -45322 -44531 -43346 -42100 -41114
56656d1114Q00Q77R97R34P30O12P21R73J196J311J385J431J323J020P07N69N46
$$ -41114 -40314 -39437 -38440 -37506 -36776 -36164 -35443 -34470 -33274 -31963 -30578 -29147 -27824 -26804 -26097 -25528 -24982
56639b4982N35O56J035J469J653J673J888K353K701K657K323J912J494J073O78
$$ -24982 -24447 -23791 -22756 -21287 -19634 -17961 -16073 -13720 -11019 -8362 -6039 -4127 -2633 -1560 -882
56624h82L32J19J90B79Q09P81O09O34Q28Q64O32L47J68M5o3j14j32j53p7J75M08
$$ -882 -550 -431 -241 279 1088 1869 2478 3112 3940 4804 5436 5783 5951 5996 5933 5819 5687 5534 5457 5632 6040
56603F040L50N2k42m96q40j210j395I06b43p46k03J30L2j33R9d90C61J082J739
$$ 6040 6390 6442 6200 5704 4864 3654 2259 906 -243 -989 -1192 -1062 -1030 -1163 -1064 -490 361 1443 3182
56584C182K697L244L191L083L213L095K359J398Q13O63O45N84L93l5n82r20r84
$$ 3182 5879 9123 12314 15397 18610 21705 24064 25462 26275 26938 27583 28167 28560 28525 27943 27023 26039
56567B6039j066j218j076n23n2j38n94r13r03o76l36K1K60M23O92R65Q45K92j54
$$ 26039 24973 23755 22679 22156 22104 21966 21372 20459 19556 18880 18544 18565 18825 19248 19940 20905 21750 22042 21888
56548B1888j09J16Q9n4M5K92K76q0m48n98n88n74o47q07r38r00p75p83q75p27
$$ 21888 21779 21895 21984 21930 21975 22267 22543 22463 22015 21417 20829 20255 19608 18801 17863 16963 16188 15405 14530 13803
56528A3803k74R4Q2j32k72l88n48n09n5N76R70J028R28P93P05P66R19Q78N29J83
$$ 13803 13529 13623 13705 13573 13301 12913 12365 11856 11801 12377 13347 14375 15303 16096 16801 17567 18486 19364 19893 20076
56508B0076J61M29P91J200J600J791J739J742J985K238K287K282K322K097J412
$$ 20076 20237 20666 21457 22657 24257 26048 27787 29529 31514 33752 36039 38321 40643 42740 44152
56493D4152P30O18R46J105Q53M46R8j88l81m69o20r42j137q99m47k77m48o38p20
$$ 44152 44882 45500 46446 47551 48404 48850 48948 48760 48379 47910 47290 46348 45211 44312 43865 43588 43140 42502 41782
56474D1782q48j010j023r43r83j056q87n61m80o80p29l94M3K92M14N29N25K79
$$ 41782 40934 39924 38901 37958 36975 35919 35032 34471 33991 33311 32582 32188 32231 32523 32937 33466 33991 34270
56456C4270j18n44r54j224j141p28l32k38l89o11q94j270j630j766j589j179p25
$$ 34270 34152 33608 32654 31430 30289 29561 29229 28991 28602 27991 27097 25827 24197 22431 20842 19663 18938
56439A8938m24l12j99J10N50Q87J010R94R46R25R70J006Q35M50J93L37O58P28
$$ 18938 18514 18202 18003 18113 18663 19550 20560 21554 22500 23425 24395 25401 26236 26686 26879 27216 27874 28602
56421B8602N50N09P18Q63P46N22L19k1n32q63o97k43L9Op0L9K66M00K88o4m79
$$ 28602 29152 29661 30379 31242 31988 32510 32829 32808 32276 31413 30716 30473 30512 30518 30448 30487 30753 31153 31441 31377 30898
56400C0898o51l86J70N96O25M17L21M02L57m5n68p46m28Q7M09L87Q7k88m48k41
$$ 30898 30247 29861 30031 30627 31252 31669 31990 32392 32749 32704 32136 31390 30962 31049 31458 31845 31932 31644 31196 30955
56380C0955J66M89P38J099J428J304P23K76L53O21O10M30M65O93Q05Q01R13J095
$$ 30955 31121 31610 32348 33447 34875 36179 36902 37178 37531 38152 38762 39192 39657 40350 41155 41956 42869 43964
56362D3964J081Q83P63P40N85K94J43J54Lm39q70r71q01o32o10p05p99p68n99
$$ 43964 45045 45928 46691 47431 48016 48310 48453 48607 48610 48171 47301 46330 45529 44897 44287 43582 42783 42015 41416
56343D1416m49m45m16q4N53J183J499J390R17L39M3J79M90O55P08Q24Q63N89J66
$$ 41416 40967 40522 40106 40022 40575 41758 43257 44647 45564 45903 45946 46125 46615 47270 47978 48802 49665 50254 50420
56324E0420L0K52M77M88M43M58L99J96N7J83N53J034J481J687J478R92N87M86
$$ 50420 50450 50702 51179 51667 52110 52568 52967 53163 53220 53403 53956 54990 56471 58158 59636 60628 61215 61701
56306F1701N84O64N86L16J4qL34P03P24M83L41L73M13M89P44J019R62O38N14P77
$$ 61701 62285 62949 63535 63851 63865 63857 64191 64894 65618 66101 66442 66815 67228 67717 68461 69480 70442 71080 71594 72371
56286G2371J081J090Q76O57M95M06M15L81J08k45k23L44J042J353J168P45L81
$$ 72371 73452 74542 75418 76075 76570 76976 77391 77772 77880 77635 77412 77756 78798 80151 81319 82064 82445
56269H2445K37K87L93N01P42J150J484J526J397J255R49L95N6M05J100J314Q84
$$ 82445 82682 82969 83362 83863 84605 85755 87239 88765 90162 91417 92366 92761 92817 93222 94322 95636 96520
56252I6520M89N95R36J147J284J428J388J101Q81R79J289J645K040K427K660K809
$$ 96520 97009 97604 98540 99687 100971 102399 103787 104888 105769 106748 108037 109682 111722 114149 116809 119618
56236A19618L075L343L263K914K829L217L683L864L867L847L774L782M169M821
$$ 119618 122693 126036 129299 132213 135042 138259 141942 145806 149673 153520 157294 161076 165245 170066
56222A70066N181N068M943N083N173N054N179N855O563O707O504O590P133P894
$$ 170066 175247 180315 185258 190341 195514 200568 205747 211602 218165 224872 231376 237966 245099 252993
56208B52993Q775R763J0586J1016J1321J1951J2994J4260J5688J7244J8749K0154
$$ 252993 261768 271531 282117 293133 304454 316405 329399 343659 359347 376591 395340 415494
56196D15494K1769K3815K6076K8279L0526L3003L5574L8040M0505M3070M5463
$$ 415494 437263 461078 487154 515433 545959 578962 614536 652576 693081 736151 781614
56185G81614M7335M8635M9365M9291M8268M6483M3979M0335L5246K9093K2497
$$ 781614 828949 877584 926949 976240 1024508 1070991 1114970 1155305 1190551 1219644 1242141
56174A242141J5629Q474J305n624j2513j9544k6163l1508l5375l8241m0485m2129
$$ 1242141 1257770 1266244 1267549 1261925 1249412 1229868 1203705 1172197 1136822 1098581 1058096 1015967
56162A015967m3229m3947m4226m3862m2882m1524l9899l7987l5891l3806l1778
$$ 1015967 972738 928791 884565 840703 797821 756297 716398 678411 642520 608714 576936
56151E76936k9781k7885k6136k4445k2782k1256j9825j8262j6610j5246j4257
$$ 576936 547155 519270 493134 468689 445907 424651 404826 386564 369954 354708 340451
56140C40451j3163j1670j0205r284q769q246p704p333o968o335n562m977m576
$$ 340451 327288 315618 305413 296129 287360 279114 271410 264077 257109 250774 245212 240235 235659
56127B35659m204l935l829l604l021k314j802j401r40n92m66k42K63N80K91j63
$$ 235659 231455 227520 223691 220087 217066 214752 212950 211549 210609 210017 209551 209309 209572 210152 210443 210280
56111B10280q3M38Q28R96J251J479J298R31J062J856K772L381L750M034M245M488
$$ 210280 210197 210635 211463 212459 213710 215189 216487 217418 218480 220336 223108 226489 230239 234273 238518 243006
56095B43006M894N356N719O121O759P539Q344R383J0755J2029J2830J3573J5025
$$ 243006 247900 253256 258975 265096 271855 279394 287738 297121 307876 319905 332735 346308 361333
56082C61333J7333K0054K2782K5194K6780K7211K6730K5614K3631K0641J7361
$$ 361333 378666 398720 421502 446696 473476 500687 527417 553031 576662 597303 614664
56071F14664J4721J2790J1073R507Q347P341N919M040K093J96j677l155l945m625
$$ 614664 629385 642175 653248 662755 671102 678443 684362 688402 690495 690691 689014 685859 681914 677289
56057F77289o130q677j1891j5565j9424k2541k4080k4401k4414k4148k2935k0818
$$ 677289 671159 662482 650591 635026 615602 593061 568981 544580 520166 496018 473083 452265
56045D52265j8576j6528j4451j2501j1153j0148q754p003n665m946m301l518k947
$$ 452265 433689 417161 402710 390209 379056 368908 360154 353151 347486 342540 338239 334721 331774
56032C31774k550j866r19k28J64O58J153J206J019J232J764J961J819J957K385
$$ 331774 329224 327358 326439 326211 326375 327033 328186 329392 330411 331643 333407 335368 337187 339144 341529
56017C41529K556K570L050L842M114L817L760M170M441M425M647N159N452N607
$$ 341529 344085 346655 349705 353547 357661 361478 365238 369408 373849 378274 382921 388080 393532 399139
56003C99139O216P070P322P007P011P460P563P199P098P319P126O602O725P543
$$ 399139 405355 412425 419747 426754 433765 441225 448788 455987 463085 470404 477530 484132 490857 498400
55989D98400P980P777P964Q981J0000J0539J1109J1836J2123J2156J2990J4630
$$ 498400 506380 514157 522121 531102 541102 551641 562750 574586 586709 598865 611855 626485
55977F26485J5799J6162J6897J8520J9996K0743K1601K2984K3982K4219K4791
$$ 626485 642284 658446 675343 693863 713859 734602 756203 779187 803169 827388 852179
55966H52179K6357K8032K9121L0263L1936L3475L4522L5779L7456L8716L9456
$$ 852179 878536 906568 935689 965952 997888 1031363 1065885 1101664 1139120 1177836 1217292
55955A217292M0828M3178M5354M6892M8849N1609N4014N5653N7855O1308O4875
$$ 1217292 1258120 1301298 1346652 1393544 1442393 1494002 1548016 1603669 1661524 1722832 1787707
55944A787707O7900P1350P5623P9527Q2743Q6873R2718R8901J04528J10683J17950
$$ 1787707 1855607 1926957 2002580 2082107 2164850 2251723 2344441 2443342 2547870 2658553 2776503
55933B776503J25045J31394J38395J46693J54974J62896J72208J83388J94419
$$ 2776503 2901548 3032942 3171337 3318030 3473004 3635900 3808108 3991496 4185915
55924D185915K04661K16504K31286K47146K62933K80474L00665L21362L41787
$$ 4185915 4390576 4607080 4838366 5085512 5348445 5628919 5929584 6250946 6592733
55915F592733L64928L92739M23193M54916M90301N30857N74428O20556O73473
$$ 6592733 6957661 7350400 7773593 8228509 8718810 9249667 9824095 10444651 11118124
55906A1118124P36045Q06529Q85800R81911J102744J250049J425081J632430J873162
$$ 11118124 11854169 12660698 13546498 14528409 15631153 16881202 18306283 19938713 21811875
55897B1811875K143772K449626K810002L241688L747766M329621M992921N728601
$$ 21811875 23955647 26405273 29215275 32456963 36204729 40534350 45527271 51255872
55889E1255872O507242P303766Q077945Q661874Q683120P711943N586864K612064
$$ 51255872 57763114 65066880 73144825 81806699 90489819 98201762 103788626 106400690
55881A06400690n88798l419975n547861o899843p555608p668588p420679o972276
$$ 106400690 105811892 102391917 96844056 89944213 82388605 74720017 67299338 60327062
55873F0327062o426813n838235n238127m647998m081748l553852l083090k681326
$$ 60327062 53900249 48062014 42823887 38175889 34094141 30540289 27457199 24775873
55865B4775873k344200k059178j817464j613018j437142j281901j145176j026721
$$ 24775873 22431673 20372495 18555031 16942013 15504871 14222970 13077794 12051073
55857A2051073r22735q29024p45594o73399o09801n51664m99666m55413m17119
$$ 12051073 11128338 10299314 9553720 8880321 8270520 7718856 7219190 6763777 6346658
55848F346658l82023l50478l23875l00894k79301k59279k41809k25815k09886
$$ 6346658 5964635 5614157 5290282 4989388 4710087 4450808 4208999 3983184 3773298
55839C773298j94860j81940j70122j58129j46901j37666j29446j20894j12797
$$ 3773298 3578438 3396498 3226376 3068247 2921346 2783680 2654234 2533340 2420543
55830B420543j06345j00721r4760q9173q4824q0545p5048o9384o5235o2253n9351
$$ 2420543 2314198 2213477 2118717 2029544 1944720 1864175 1789127 1719743 1654508 1592255 1532904
55819A532904n7016n6061n5449n3711n1426n0068m9483m8553m7326m6485m5640
$$ 1532904 1475888 1419827 1364378 1310667 1259241 1209173 1159690 1111137 1063811 1017326 971686
55808I71686m4059m2191m0713l9004l6268l3200l0874k8909k6420k3817k1968
$$ 971686 927627 885436 844723 805719 769451 736251 705377 676468 650048 626231 604263
55797F04263k0555j8803j7021j5788j4620j2954j1543j1291j1617j1517j1297
$$ 604263 583708 564905 547884 532096 517476 504522 492979 481688 470071 458554 447257
55786D47257j1623j1878j1160j0103r898j0262j0103r472r148q914q053o979o712
$$ 447257 435634 423756 412596 402493 392595 382333 372230 362758 353610 344696 336643 329664 322952
55773C22952p065o982o325n805n519n030m546m570m701m186l328k981l032k790
$$ 322952 315887 308905 302580 296775 291256 286226 281680 277110 272409 268223 264895 261914 258882 256092
55759B56092k507l017m119m730m566m279m085l593k887k494k353j959j442j377
$$ 256092 253585 250568 246449 241719 237153 232874 228789 225196 222309 219815 217462 215503 214061 212684
55745B12684j583j314n70q6m2J50P05J118R99M71k81j093j568j521j443j836k380
$$ 212684 211101 209787 209217 209131 209089 209239 209944 211062 212061 212532 212251 211158 209590 208069 206626 204790 202410
55728B02410k523k489k794l199l117k751k732k981k934k680k765l013k683j706
$$ 202410 199887 197398 194604 191405 188288 185537 182805 179824 176890 174210 171445 168432 165749 164043
55714A64043p82k86K6K92M24N53P78O09l70j558k038k010k447l436l986l574k788
$$ 164043 163261 162975 163001 163293 163717 164270 165048 165657 165287 163729 161691 159681 157234 153798 149812 146238 143450
55697A43450k335k281k460k778k902k464j704j289j416j681j799j827j714j391
$$ 143450 141115 138834 136374 133596 130694 128230 126526 125237 123821 122140 120341 118514 116800 115409
55683A15409j164j349j633j425p73k18M4J69M0n34j202j469j495j712j924j651
$$ 115409 114245 112896 111263 109838 109065 108847 108891 109060 109100 108566 107364 105895 104400 102688 100764 99113
55667I9113j131j000j147r47m83m65r21j103p66m85n00k79M39J109J251J110J117
$$ 99113 97982 96982 95835 94888 94405 93940 93019 91916 91150 90665 90165 89886 90325 91434 92685 93795 94912
55650I4912J294J433J337P66k69j203j425j092q21p45o25o09j052j637j692j327
$$ 94912 96206 97639 98976 99742 99473 98270 96845 95753 94932 94187 93562 92953 91901 90264 88572 87245
55634H7245j240j439j242o05l56q21j291j202q41n36q4N49Q92P60O31P94Q74O20
$$ 87245 86005 84566 83324 82719 82363 81542 80251 79049 78208 77672 77588 78137 79029 79789 80420 81214 82088 82708
55616H2708M25N88P55N59K13mk28n86q05o89m58l12p4L68P69R29R21P54L07k10
$$ 82708 83133 83721 84476 85035 85248 85244 85016 84430 83625 82936 82478 82166 82092 82460 83229 84158 85079 85833 86140 85930
55596H5930l42j22q1l54m35o6L35M04L08J67k78j016j493j410j217j353j619j706
$$ 85930 85588 85466 85385 85031 84596 84530 84865 85269 85577 85744 85466 84450 82957 81547 80330 78977 77358 75652
55578G5652j799k127k424k358k051j785j517j117p13m63l45l82o73r54p51j37
$$ 75652 73853 71726 69302 66944 64893 63108 61591 60474 59761 59298 58953 58571 57898 56944 56193 56056
55562E6056J74j44n50n27l13l18m01k49m2j44n23r14j177j192p94j86O2k22n29
$$ 56056 56230 56086 55536 55009 54696 54378 53977 53728 53686 53542 53019 52105 50928 49736 48942 48756 48818 48596 48067
55543D8067m79l56m24l85k6J62l06j033j265q99l97qK82L33K6l51m79m86n79n17
$$ 48067 47588 47232 46808 46423 46397 46559 46253 45220 43955 43056 42659 42651 42933 43266 43292 42941 42462 41976 41397 40880
55523D0880l6M79M67R2L4M07O52M74K67M27Q23J058J012Q79R52J345J809J862
$$ 40880 40844 41323 41790 41882 41916 42323 42975 43449 43716 44143 44966 46024 47036 47915 48867 50212 52021 53883
55505E3883J335O41K71K02R3j53l70n78r90j587k000j960j554j096q47q73r82
$$ 53883 55218 55859 56130 56332 56425 56272 55902 55324 54334 52747 50747 48787 47233 46137 45290 44417 43435
55488D3435r02o05l77m20n66n38l23p6J64M19N89N55L59J13j74m93p27p90p64
$$ 43435 42533 41928 41551 41131 40565 40027 39704 39628 39792 40211 40800 41355 41714 41827 41653 41160 40433 39643 38879
55469C8879p04n30k40n5j54m13n81n94n59n47n48n31m54l39k79k68o3M60R13P31
$$ 38879 38175 37645 37405 37350 37196 36783 36202 35608 35049 34502 33954 33423 32969 32630 32351 32083 32020 32480 33393 34124
55449C4124l9p50r94r58q50n75j90r6m51q10p42l91o3K83P29R65O87J33k68m48
$$ 34124 34085 33335 32341 31383 30533 29958 29768 29672 29221 28411 27669 27278 27215 27498 28227 29192 29879 30012 29744 29296
55429B9296n46m85j89M2j23m66n08j85J54K88K66J25j01k30j46JM9J31L53M60
$$ 29296 28750 28265 28076 28118 27995 27529 27021 26836 26990 27278 27544 27669 27568 27338 27192 27193 27242 27373 27726 28186
55409B8186K28m0Q4M15M01l1l52k12J16J75j53o22q67o63j88Q2l4j66O0L95L80
$$ 28186 28414 28374 28458 28873 29274 29243 28891 28679 28795 28970 28817 28195 27328 26665 26477 26559 26525 26359 26419 26814 27194
55388B7194J07P8L52M10on02n96l04N2L41O58J013J226J111O72J65j01q0jl3p3
$$ 27194 27301 27379 27731 28141 28135 27633 27037 26733 26785 27126 27784 28797 30023 31134 31806 31971 31870 31790 31789 31756 31683
55367C1683J7J75K73L35M00L41Q6j72k09m4K07N53R33J060P97M55L70L47l4o67
$$ 31683 31700 31875 32148 32483 32883 33224 33310 33138 32929 32885 33092 33645 34578 35638 36435 36890 37260 37607 37573 36906
55347C6906r92p84m03k16j66o6M9O2mn8j06j90k90l60m11n02o82q54p89l76J21
$$ 36906 35914 35130 34727 34511 34345 34279 34328 34390 34386 34328 34222 34032 33742 33382 32971 32469 31787 30933 30144 29768 29889
55326B9889K98J80K17N58P08K36m95p74m67p2O5P1J10Q4p1j49Q1N32Q43O78O0
$$ 29889 30187 30367 30584 31142 31850 32086 31591 30817 30350 30278 30343 30414 30524 30608 30537 30388 30469 31001 31844 32522 32582
55305C2582n47n93o2M20L15k07n88o42o27o70n70k03J81K26j32n87p14l52J79
$$ 32582 32035 31442 31380 31800 32115 31908 31320 30678 30051 29381 28811 28608 28789 29015 28883 28296 27582 27230 27409
55286B7409L56K6m18n73m74l00l0L63N86L67k4p0K84N38L55q1m10m93l68j35R0
$$ 27409 27765 27791 27373 26800 26326 26026 25996 26359 26945 27312 27288 27218 27502 28040 28395 28314 27904 27411 27043 26908 26998
55265B6998K31L29M37M63K63j32n21p08o21l52j77k86m45j85M90R87R19O22N60
$$ 26998 27229 27558 27995 28458 28721 28589 28068 27360 26739 26387 26210 25924 25479 25294 25784 26771 27690 28312 28872
55246B8872N82L04j62l93l29k00pL28M68Np54j037o92l51m24n95n06l18k90l36
$$ 28872 29454 29758 29596 29203 28874 28674 28667 28995 29463 29468 28714 27677 26985 26634 26210 25615 25109 24791 24501 24165
55226B4165l22l42l76r8N96J170J054M53J04L32P19P36L43p4k24j58r3j38k51
$$ 24165 23843 23501 23125 23027 23623 24793 25847 26300 26404 26736 27455 28191 28534 28460 28236 28078 27985 27847 27596
55207B7596l85m88m07rN31P81N75K72K62M05K53k73p51p69l41K01N09M53K04O4
$$ 27596 27211 26723 26316 26307 26838 27619 28194 28466 28728 29133 29386 29113 28362 27593 27252 27453 27962 28415 28619 28683
55187B8683R1K4l03p10r17q73o35k20J93K29j78n06k77L19P44Q54Q24O63K90o4
$$ 28683 28774 28798 28495 27785 26868 25995 25360 25140 25333 25562 25384 24878 24601 24920 25664 26518 27342 28005 28295 28231
55167B8231r7mj64m51l76N5L02J13j82l09m30o76q00n53l6M69P71P44M34J58K30
$$ 28231 28134 28130 27966 27515 27139 27194 27496 27609 27427 27118 26688 26012 25212 24659 24623 25092 25863 26607 27041 27199 27429
55146B7429M86N21L11K09K78J88j92n49o40n77m79k99r7o0j43p8J08Q8j33j29
$$ 27429 27915 28436 28747 28956 29234 29422 29230 28681 28041 27464 26985 26686 26589 26529 26386 26308 26416 26504 26371 26242
55126B6242K12M06J85K7M15R90R95L46k72l13L5K19Ol72n70n40m54l64j10K97
$$ 26242 26454 26860 27045 27072 27487 28477 29472 29818 29546 29233 29268 29487 29493 29121 28551 28011 27557 27193 27083 27380
55106B7380N25L81J84L05N46M45M8j77j08r5k48j98K11N74M93J05k30m04n08n60
$$ 27380 27905 28286 28470 28775 29321 29766 29814 29637 29529 29434 29186 28988 29199 29773 30266 30371 30141 29737 29229 28669
55086B8669n18l59o0K99M71L28J64L24O24N57J03k70l52m05n30m49r5J70J56J34
$$ 28669 28151 27792 27732 28031 28502 28830 28994 29318 29942 30499 30602 30332 29980 29575 29045 28596 28501 28671 28827 28961
55066B8961K72L23J18q3m2P9P3K2J8m9j66j06J48L05K93M17P53Q72N08K7j07Q3
$$ 28961 29233 29556 29674 29591 29549 29628 29701 29723 29741 29692 29526 29420 29568 29873 30166 30583 31336 32208 32716 32743 32636 32719
55044C2719K77L26K16k4k06j22K4j39m13j79N62J002P71N16P75J062P23Q3j08
$$ 32719 32996 33322 33538 33514 33308 33186 33210 33071 32658 32479 33041 34043 34814 35330 36105 37167 37890 37973 37865
55025C7865J36K23Kj99k94m70o39n18j65R9J99K51K11N3N5L97O69L50l78q33p23
$$ 37865 38001 38224 38226 38027 37733 37263 36624 36106 35941 36040 36239 36490 36701 36754 36809 37206 37875 38225 37847 37014 36291
55004C6291l21J10N25Q18Q30O55N23L95O4m34q33j010j012q29m77j64q5j27r2
$$ 36291 35970 36080 36605 37423 38253 38908 39431 39826 39890 39456 38623 37613 36601 35772 35295 35131 35046 34919 34827
54985C4827lKp0j84l96o25n92l03j52k90k86J53O27P04N86N82L97k85r13o89J79
$$ 34827 34824 34826 34756 34572 34176 33551 32959 32656 32504 32214 31928 32081 32708 33412 33998 34580 34977 34692 33779 33090 33269
54964C3269P05M95R5J2J55L15N02O41N68L71K66J35k79p67q41m87j68l7J65M38
$$ 33269 33974 34469 34564 34576 34731 35046 35548 36189 36757 37128 37394 37529 37250 36483 35642 35155 34987 34950 35115 35553
54944C5553L96o3n28o70m90m2O14J058Q40K18n5J74K65j25m82l43q7l06q30r76
$$ 35553 35949 35886 35358 34688 34198 34156 34770 35828 36668 36886 36831 37005 37270 37145 36663 36320 36233 35927 35097 34121
54924C4121m91K00N99O08M63L92L92K89J02J38N57R98R48M19j27m13m64k73J77
$$ 34121 33630 33830 34429 35037 35500 35892 36284 36573 36675 36813 37370 38368 39316 39735 39608 39195 38731 38458 38635
54905C8635N40L87j37m09k01J03J79J44J38M2j15o6K26M21L88M22O69Q22O32K98
$$ 38635 39175 39562 39425 39016 38815 38918 39097 39241 39379 39421 39306 39240 39466 39887 40275 40697 41366 42188 42820 43118
54885D3118N9j61m17m87k78j09k40m70n11m48m70m87k99J6K78M84P21R54J156
$$ 43118 43177 43016 42599 42112 41834 41725 41485 41015 40504 40056 39586 39099 38800 38816 39094 39578 40299 41253 42409
54866D2409J389J601J592J385J342J660K044K113J922J770J729J641J415J049
$$ 42409 43798 45399 46991 48376 49718 51378 53422 55535 57457 59227 60956 62597 64012 65061
54852F5061N36q0o55j067j278j247j024r16j204j673j781j444j205j418j720j617
$$ 65061 65597 65517 64862 63795 62517 61270 60246 59330 58126 56453 54672 53228 52023 50605 48885 47268
54836D7268j148o66k94J9K15K19J59J60J39N9J11L94O99Q59J014J278J465J502
$$ 47268 46120 45454 45160 45179 45394 45613 45772 45932 46071 46130 46241 46635 47334 48193 49207 50485 51950 53452
54818E3452J700K238K714K683K328K091J872J240K59n30r30j312j888k333k308
$$ 53452 55152 57390 60104 62787 65115 67206 69078 70318 70577 70047 69117 67805 65917 63584 61276
54803F1276j921j501j219j132j270j538j699j670j578j455j132n73j23j55n65
$$ 61276 59355 57854 56635 55503 54233 52695 50996 49326 47748 46293 45161 44588 44465 44310 43745
54788D3745q80p69l77p4n0k00l02k52o6K16N08O11L41k22p11q36o65m53l17k29
$$ 43745 42865 42096 41719 41645 41595 41395 41093 40841 40775 40991 41499 42110 42451 42229 41518 40682 40017 39564 39247 39018
54768C9018k13l65o31p65n98k59k1jo7q4q1j15r3R2L13L17J25P7L29N75M44M2
$$ 39018 38805 38440 37809 37044 36446 36187 36166 36165 36098 36014 35933 35818 35725 35817 36130 36447 36572 36649 36978 37553 37997 38039
54746C8039k24j49J52M93P09O00J91j31l1K52K47MJ0L77O38M87K42K72M39M09
$$ 38039 37815 37666 37818 38311 39020 39620 39811 39680 39649 39901 40148 40152 40162 40539 41177 41664 41906 42178 42617 43026
54726D3026J62q3k23k60j64J9Q3j7j3L06P38R27Q26P09P87J070J427J683J710
$$ 43026 43188 43105 42882 42622 42458 42477 42560 42543 42530 42836 43574 44501 45327 46036 46823 47893 49320 51003 52713
54707E2713J584J517J613J787J944K040J956J537Q60K16k49o26r77j254j488j745
$$ 52713 54297 55814 57427 59214 61158 63198 65154 66691 67551 67767 67518 66892 65915 64661 63173 61428
54691F1428j839j487q55n32p84j220j402j339j149p52j75K08J76j5p9j42k83j38
$$ 61428 59589 58102 57247 56715 55931 54711 53309 51970 50821 50069 49894 50102 50278 50263 50184 50042 49759 49621
54673D9621N12J110R55K56j08K20P14Q35O71N97P80J191J749K247K415K153J584
$$ 49621 50133 51243 52198 52454 52346 52566 53280 54115 54786 55383 56163 57354 59103 61350 63765 65918 67502
54656F7502Q40j5q60j514j905k060j980j676j272r22p13p24j033j470j610j267
$$ 67502 68342 68327 67467 65953 64048 61988 60008 58332 57060 56138 55425 54701 53668 52198 50588 49321
54640D9321q28p52r30q88n36k20j38j40j29k39m72n82m22j96j50k52l08k33o6
$$ 49321 48493 47741 46811 45923 45387 45167 45029 44889 44760 44521 44049 43467 43045 42849 42699 42447 42139 41906 41840
54621D1840J13J37j81q13j407j559j186n73n4K45L76L44P1l57o02m25MK74K57
$$ 41840 41953 42090 41909 41096 39689 38130 36944 36371 36317 36562 36938 37282 37353 36996 36394 35969 35973 36247 36504
54602C6504J38L8r9k16j34O9R2m0O7N00P11L05k72l02K68Q66J071Q60L46k97o92
$$ 36504 36642 36680 36581 36365 36231 36300 36392 36352 36419 36919 37630 37935 37663 37361 37629 38495 39566 40426 40772 40475 39783
54581C9783o08l08k01k50j31J34K13O7K8K28M15L83K11j8l20n67m93p9L83O16
$$ 39783 39175 38867 38666 38416 38285 38419 38632 38699 38727 38955 39370 39753 39964 39946 39626 39059 38566 38487 38870 39486
54561C9486O15M71K91K17K56J73j74m95m34j58j31l62m20k05j18l53n52m21j55
$$ 39486 40101 40572 40863 41080 41336 41509 41335 40840 40406 40248 40117 39755 39335 39130 39012 38659 38107 37686 37531
54542C7531k1N8K14L19K93L84P44J061R38M94J81K00L85N52O10M63O8l69n52m18
$$ 37531 37510 37568 37782 38101 38394 38778 39522 40583 41521 42015 42196 42396 42781 43333 43943 44406 44474 44105 43553 43135
54522D3135j69J0O9j5k37m69m98k64M7J67K7j89k43j37q0j92l06k04L7J46P9R1
$$ 43135 42966 42976 43045 43030 42793 42324 41826 41562 41609 41776 41803 41614 41371 41234 41154 40962 40656 40452 40489 40635 40714 40805
54500D0805L55P04Q57P30M35J06j49k28j34mJ2q5j15Q7M76P52O23J51k48k46O5
$$ 40805 41160 41864 42721 43451 43886 43992 43843 43615 43481 43477 43489 43404 43289 43376 43852 44604 45227 45378 45130 44884 44949
54479D4949L41L92K69Q4o5q4Kpk76o73r21r13p05l28J80O17P37N70L59K25R9p2
$$ 44949 45290 45682 45951 46035 45970 45886 45888 45881 45605 44932 44011 43098 42393 42065 42245 42862 43599 44169 44528 44753 44852 44780
54457D4780k41l47l19p0L25N48M21K17K70M15K23k56m62j32L49N12L71K00P3p8
$$ 44780 44539 44192 43873 43803 44128 44676 45097 45314 45584 45999 46222 45966 45504 45372 45721 46233 46604 46804 46877 46799
54437D6799k09j85JK12K97K20J00J35L50M85L44J05O0J18l4l63m92l01q4j6Q2
$$ 46799 46590 46405 46406 46618 46915 47135 47235 47370 47720 48205 48549 48654 48714 48832 48798 48435 47943 47642 47558 47542 47624
54416D7624L17M45K86M3JJ01J51J40J66K43L61N70Q13Q79O75L70J16r6k22p8L20
$$ 47624 47941 48386 48672 48715 48716 48817 48968 49108 49274 49517 49878 50448 51261 52140 52815 53185 53301 53205 52983 52905 53225
54395E3225O17N45K46l8l43p58j051q99l66J13K19Lk56l45k69k57m51o30m71j02
$$ 53225 53842 54387 54633 54595 54252 53494 52443 51544 51178 51291 51510 51513 51257 50912 50643 50386 49935 49305 48834 48732
54375D8732l9m13o43k53M21P04N52M96P65R77P92L78O4j11k63l49k51n8J0n2M8
$$ 48732 48693 48280 47637 47384 47805 48509 49061 49557 50322 51299 52091 52469 52533 52422 52159 51810 51559 51501 51511 51459 51507
54354E1507M84R74J027N23j20m53m81m62m25j88K02L80J31l04m95k23M03J066
$$ 51507 51991 52965 53992 54515 54395 53942 53461 52999 52574 52386 52588 52968 53099 52795 52300 52077 52480 53546
54336E3546J401J280J018J031J252J180O04m7l03k97m63q80j177j046n41M2L75
$$ 53546 54947 56227 57245 58276 59528 60708 61312 61265 60962 60665 60202 59322 58145 57099 56558 56600 56975
54319E6975K64j60m61l01K21P21R82J087J192J348J507J572J429J041N41J61N1
$$ 56975 57239 57079 56618 56317 56538 57259 58241 59328 60520 61868 63375 64947 66376 67417 67958 68119 68170
54302F8170J35J21k35p74r91n92P7M19K87J8j90m21o48o25l63k82n99r89j054
$$ 68170 68305 68426 68191 67417 66426 65834 65911 66330 66617 66635 66445 66024 65376 64751 64388 64106 63507 62518 61464
54283F1464q75p92q87j012j075j056r16p08n89n50l51N1L22K33L5O9K67L74L64
$$ 61464 60589 59797 58910 57898 56823 55767 54851 54143 53554 53004 52653 52704 53026 53259 53294 53363 53630 54004 54368
54264E4368L39K29mp2K92Q24R91O82K60L1k5k9p6k82o41q91q28o33n99o42m47
$$ 54368 54707 54936 54932 54860 55152 55976 56967 57649 57909 57940 57915 57886 57810 57528 56887 55996 55168 54535 53936 53294 52847
54243E2847j9K90K83J09j00l70o70q42q08o09k38L02P85R71R31R04Q66N66M5l13
$$ 52847 52828 53118 53401 53510 53410 53040 52370 51528 50720 50111 49873 50175 50960 51931 52862 53766 54632 55198 55243 54930
54223E4930l00j27k5M0J42J96J37O3K4o5j68o4K88N52M35J06m9M4J32R0J02L18
$$ 54930 54630 54503 54478 54518 54660 54856 54993 55056 55080 55015 54847 54783 55071 55623 56058 56164 56115 56159 56291 56381 56483 56801
54201E6801N44M51J5l61l06J09M94O24O62Q06R99J019P84L68j08n16p29p71q13
$$ 56801 57345 57796 57811 57450 57144 57253 57747 58371 59033 59839 60838 61857 62641 63009 62901 62385 61656 60885 60072
54182F0072r00q04l70J91M98M63K38n6l90o31o23m51l74m58n40n05m06k68j9L26
$$ 60072 59172 58368 57998 58189 58687 59150 59388 59332 58942 58311 57688 57237 56863 56405 55865 55360 54954 54686 54667 54993
54162E4993N96O62N46L71K48K38K64J35k03n13n50m33m83p29q04m31K06O61O86
$$ 54993 55589 56251 56797 57168 57416 57654 57918 58053 57850 57337 56787 56354 55871 55142 54338 53907 54113 54774 55460
54143E5460M11J45L3m2k44m71m44j44J04R6L7J58K67L1m57p39n76j57K49N14N92
$$ 55460 55871 56016 56049 56007 55763 55292 54848 54704 54808 54904 54941 55099 55366 55397 54940 54201 53625 53468 53717 54231 54823
54122E4823N08M47N66P36O75L55J1j76j92qL69O78N91J42k64l94l91m52n17m76
$$ 54823 55331 55778 56344 57080 57755 58110 58121 57945 57753 57745 58114 58792 59383 59525 59261 58867 58476 58024 57507 57031
54102E7031l73k88j92o2M7P3O2P7J32K21K86K10l5k50k21k8K7j62l82m13k77j39
$$ 57031 56658 56370 56178 56116 56163 56236 56298 56375 56507 56728 57014 57224 57189 56939 56718 56690 56717 56555 56173 55760 55483 55344
54080E5344j12j53j04J56N24O93N35K80K11L15L92L97L65K17m7j30K31Q05J096
$$ 55344 55232 55079 54975 55131 55655 56348 56883 57163 57374 57689 58081 58478 58843 59060 59013 58883 59114 59919 61015
54061F1015R70P46O99Q23J024J209J247J136J127J331J353P85j00o06n81n28p67
$$ 61015 61985 62731 63430 64253 65277 66486 67733 68869 69996 71327 72680 73465 73365 72759 72178 71650 70883
54044G0883j008r24n97k69m1k2k83n73n10j68k9k13l04j07kk30l98r3M31O31L99
$$ 70883 69875 68951 68354 68085 68044 68022 67739 67166 66656 66488 66459 66246 65942 65835 65833 65603 65205 65112 65543 66174 66573
54023F6573M4k05l04k16j3J15J20J94M10N76N98O45P34N79J28j56P9N49Q17Q55
$$ 66573 66617 66412 66108 65892 65879 65994 66114 66308 66718 67294 67892 68537 69271 69850 69978 69822 69901 70450 71267 72122
54003G2122P97N28M6j86J94P65Q20L78Q9K55N27N40L87L21M60Q04J245J554J602
$$ 72122 72919 73447 73493 73307 73501 74266 75086 75464 75553 75808 76335 76875 77262 77583 78043 78847 80092 81646 83248
53984H3248J581J716J913J983K054K362K778K928K796K724K825K861K700K517
$$ 83248 84829 86545 88458 90441 92495 94857 97635 100563 103359 106083 108908 111769 114469 116986
53970A16986K428K314K136K045K093K074J849J551J357J219R95O33J93j88l10
$$ 116986 119414 121728 123864 125909 128002 130076 131925 133476 134833 136052 137047 137680 137873 137685 137375
53955A37375r8J75N0o31j504k051k076j804j591j626j846k086k277k388k282j826
$$ 137375 137277 137452 137502 136871 135367 133316 131240 129436 127845 126219 124373 122287 120010 117622 115340 113514
53939A13514j234r97j317j798j965j809j615j448j178q54o39m87k25P0J74J51
$$ 113514 112280 111283 109966 108168 106203 104394 102779 101331 100153 99299 98660 98173 97948 98018 98192 98343
53923I8343L41Q30J287J430J405J493J702J758J391N88l79j132j501j633j725
$$ 98343 98684 99514 100801 102231 103636 105129 106831 108589 109980 110568 110189 109057 107556 105923 104198
53908A04198j740j557j217q96o65n53o76j041j353j269q12k51K75P68J100J084
$$ 104198 102458 100901 99684 98788 98123 97570 96894 95853 94500 93231 92419 92168 92443 93211 94311 95395
53892I5395Q14N67M29L52M48Q92J490J817J805J806J980K052J772J297R67R67
$$ 95395 96209 96776 97205 97557 98005 98897 100387 102204 104009 105815 107795 109847 111619 112916 113883 114850
53876A14850J307J792J990J643J151J234J963K622K695K510K569K755K660K347
$$ 114850 116157 117949 119939 121582 122733 123967 125930 128552 131247 133757 136326 139081 141741 144088
53862A44088K242K471K744K835K759K558K300K223K539L069L396L344L110K914
$$ 144088 146330 148801 151545 154380 157139 159697 161997 164220 166759 169828 173224 176568 179678 182592
53848A82592K804K801K906K916K498J607O17j01n30q77j226j488j593j602j618
$$ 182592 185396 188197 191103 194019 196517 198124 198741 198640 198110 197233 196007 194519 192926 191324 189706
53833A89706j730k036k590l253l721l801l634l539l612l635l468l304l384l555
$$ 189706 187976 185940 183350 180097 176376 172575 168941 165402 161790 158155 154687 151383 147999 144444
53819A44444l460l057k732k723k809k639k245j947j905j937j827j582j393j390
$$ 144444 140984 137927 135195 132472 129663 127024 124779 122832 120927 118990 117163 115581 114188 112798
53805A12798j524j663j749j806j837j788j666j556j479j335j109r96j131j297
$$ 112798 111274 109611 107862 106056 104219 102431 100765 99209 97730 96395 95286 94290 93159 91862
53791I1862j193q56n70l99j48J42J20l34p80p02j07N23P35L95k62p35o37j37J65
$$ 91862 90669 89813 89243 88844 88696 88838 88958 88624 87844 87142 87035 87558 88293 88688 88426 87691 87054 86917 87082
53772H7082L3p0K97Q18Q16K57k24k24jP0M1J25L00M36N89Q39J075J136J121J196
$$ 87082 87115 87045 87342 88160 88976 89233 89009 88785 88784 88854 88895 89020 89320 89756 90345 91184 92259 93395 94516 95712
53752I5712J251J026O35N54J046J797K299K419K345K212K024J890K013K391K772
$$ 95712 96963 97989 98624 99178 100224 102021 104320 106739 109084 111296 113320 115210 117223 119614 122386
53737A22386K966L000K883K496J866J312J079J025Q88O90O10N96M37J58j3l1q7
$$ 122386 125352 128352 131235 133731 135597 136909 137988 139013 139901 140591 141201 141797 142234 142392 142379 142348 142261
53720A42261k71n29r39j649k452k869k807k709k848k926k624k190k022k026j873
$$ 142261 141990 141461 140522 138873 136421 133552 130745 128036 125188 122262 119638 117448 115426 113400 111527
53705A11527j630j623j776j694j332j073j038q56l62Jk49r26j416j407j109q26
$$ 111527 109897 108274 106498 104804 103472 102399 101361 100505 100143 100144 99895 98969 97553 96146 95037 94211
53689I4211o20l97j55n0k35o29q77o81j59K89M54M62M31K68m2k28p9K00K38lk23
$$ 94211 93591 93194 93039 92989 92754 92125 91248 90567 90408 90697 91151 91613 92044 92312 92270 92042 91963 92163 92401 92398 92175
53668I2175k04K7L39N53M35o9n68n29Q9P40R39P59N56M94N16N73O46O46N28M49
$$ 92175 91971 91998 92337 92890 93325 93256 92688 92159 92248 92988 93927 94686 95242 95736 96252 96825 97471 98117 98645 99094
53648I9094N99R38J263J437J442J261R15O01N60P93J058J174J200J288J450J557
$$ 99094 99693 100631 101894 103331 104773 106034 106949 107550 108110 108903 109961 111135 112335 113623 115073 116630
53632A16630J440J079O82N44O60O33J85l68l99K01Q74J060P74L82Q5j34k56k23
$$ 116630 118070 119149 119831 120375 121035 121668 121853 121485 121086 121287 122161 123221 123995 124377 124462 124328 124072 123849
53614A23849q4K0Rp5j25j0K97O07O74N03L28K32N1k56m47l90l10m06m86l06j9
$$ 123849 123765 123785 123794 123719 123594 123584 123881 124488 125162 125665 125993 126225 126276 126020 125573 125183 124873 124467 123981 123675 123656
53593A23656O6k0l1K9k2n9K41Q02J120R32N44L56L77M13M42N62P51Q68Q21O17
$$ 123656 123722 123702 123671 123700 123678 123619 123860 124662 125782 126714 127258 127614 127991 128404 128846 129408 130159 131027 131848 132465
53573A32465L65K79N26R75J299J270R27M62R6P6M83J043J342J303J196J190J196
$$ 132465 132830 133109 133635 134610 135909 137179 138106 138568 138664 138740 139223 140266 141608 142911 144107 145297 146493
53556A46493J131J086J073R57P57P54J067J439J594J548J413J162Q08N74O21Q25
$$ 146493 147624 148710 149783 150740 151497 152251 153318 154757 156351 157899 159312 160474 161282 161856 162477 163302
53540A63302J055J373J739J762J152K04n15q69j108j278j080m23L17P06O78M15
$$ 163302 164357 165730 167469 169231 170383 170587 170072 169203 168095 166817 165737 165314 165631 166337 167015 167430
53524A67430O4l43p62j084j202j053p16m18l39m21m57l53j81o6p1j81k78j95J07
$$ 167430 167494 167151 166389 165305 164103 163050 162334 161916 161577 161156 160699 160346 160165 160099 160028 159847 159569 159374 159481
53505A59481M57O50O51N18K44j21l91m15l28l54m31k55K43P53R02O65L39K29M14
$$ 159481 159938 160588 161239 161757 162001 161880 161489 161074 160746 160392 159961 159706 159949 160702 161604 162269 162608 162837 163251
53486A63251O81P92P65Q51J140J356J243J010J083J525J953K083K068K164K413
$$ 163251 163932 164724 165489 166340 167480 168836 170079 171089 172172 173697 175650 177733 179801 181965 184378
53471A84378K731L120L586L994M233M420M752N193N495N533N489N605N888O137
$$ 184378 187109 190229 193815 197809 202042 206462 211214 216407 221902 227435 232924 238529 244417 250554
53457B50554O233O291O471O748O973P124P355P782Q365R010R632J0048J0018R550
$$ 250554 256787 263078 269549 276297 283270 290394 297749 305531 313896 322906 332538 342586 352604 362154
53443C62154R029Q835Q927Q993Q915Q853Q890Q892Q751Q533Q290P935P415O923
$$ 362154 371183 380018 388945 397938 406853 415706 424596 433488 442239 450772 459062 466997 474412 481335
53429D81335O741O936P285P496P461P273P053O813O538O281O118N974N719N412
$$ 481335 488076 495012 502297 509793 517254 524527 531580 538393 544931 551212 557330 563304 569023 574435
53415E74435N253N163M736L773K673J970J638J167K68q59j923k835l579m133m573
$$ 574435 579688 584851 589587 593360 596033 598003 599641 600808 601076 600217 598294 595459 591880 587747 583174
53400E83174n026n400n473n308n274n557n918o122o289o599o922p017o895o738
$$ 583174 578148 572748 567275 561967 556693 551136 545218 539096 532807 526208 519286 512269 505374 498636
53386D98636o593o422o291o266o133n622m809m080l651l352k925k318j589p76
$$ 498636 492043 485621 479330 473064 466931 461309 456500 452420 448769 445417 442492 440174 438585 437809
53372D37809L3O39R02R57J136J623K293K859L209L490L900M453M991N439N891
$$ 437809 437842 438481 439383 440340 441476 443099 445392 448251 451460 454950 458850 463303 468294 473733 479624
53357D79624O491P270Q113Q863R377R663R929J0436J1206J1967J2472J2739J2939
$$ 479624 486115 493385 501498 510361 519738 529401 539330 549766 560972 572939 585411 598150 611089
53344F11089J3167J3488J4073J5077J6347J7461J8104J8373J8629J9099J9666
$$ 611089 624256 637744 651817 666894 683241 700702 718806 737179 755808 774907 794573
53333G94573K0022K0030J9903J9967K0281K0554K0472K0028J9479J9068J8817
$$ 794573 814595 834625 854528 874495 894776 915330 935802 955830 975309 994377 1013194
53322A013194J8519J7873J6692J5109J3515J2212J1178J0179R026P643O023M240
$$ 1013194 1031713 1049586 1066278 1081387 1094902 1107114 1118292 1128471 1137497 1145140 1151163 1155403
53310A155403K429O23j294l338n270o872q312r993j2019j4052j5728j6995j7967
$$ 1155403 1157832 1158455 1157161 1153823 1148553 1141681 1133369 1123376 1111357 1097305 1081577 1064582 1046615
53297A046615j8681j9103j9288j9380j9481j9569j9460j8931j7975j7007j6542
$$ 1046615 1027934 1008831 989543 970163 950682 931113 911653 892722 874747 857740 841198
53286H41198j6625j6746j6471j5975j5740j5880j5992j5698j5028j4206j3313
$$ 841198 824573 807827 791356 775381 759641 743761 727769 712071 697043 682837 669524
53275F69524j2301j1259j0441r987r722r310q598p740o943o250n645n307n499
$$ 669524 657223 645964 635523 625536 615814 606504 597906 590166 583223 576973 571328 566021 560522
53262E60522o110o560o385n795n401n424n434m947m026l162k675k419k019j285
$$ 560522 554412 547852 541467 535672 530271 524847 519413 514466 510440 507278 504603 502184 500165 498880
53248D98880l96K88N72O45Q60J371K029K654L239L794M214M474M797N411O189
$$ 498880 498484 498772 499344 499989 500849 502220 504249 506903 510142 513936 518150 522624 527421 532832 539021
53233E39021O760O998P167P513P934Q184Q259Q362Q541Q557Q122P219O106N102
$$ 539021 545781 552779 559946 567459 575393 583577 591836 600198 608739 617296 625418 632637 638743 643845
53219F43845M353L797L228K477J538N51l32j126j970k945l932m774n483o209o976
$$ 643845 648198 651995 655223 657700 659238 659789 659457 658331 656361 653416 649484 644710 639227 633018 626042
53204F26042p668q261q880r501r864r877r890j0268j0830j1138j1157j1225j1346
$$ 626042 618374 610113 601233 591732 581868 571991 562101 551833 541003 529865 518708 507483 496137
53191D96137j1095j0399r876j0003j0406j0405j0002r742r792r756r445r207r315
$$ 496137 485042 474643 464767 454764 444358 433953 423951 414209 404417 394661 385216 376009 366694
53178C66694r465r213q574p904p368o894o454o109n817n466n088m872m926n111
$$ 366694 357229 348016 339442 331538 324170 317276 310822 304713 298896 293430 288342 283470 278544 273433
53164B73433n164m924m509m240m322m556m528m215m140m716n584n955n553m921
$$ 273433 268269 263345 258836 254596 250274 245718 241190 236975 232835 228119 222535 216580 211027 206106
53150B06106m631m608m422l982l612l537l598l561l410l267l146k985k842k865
$$ 206106 201475 196867 192445 188463 184851 181314 177716 174155 170745 167478 164332 161347 158505 155640
53136A55640l039l149l016k743k611k759l002l032k763k392k133j970j731j393
$$ 155640 152601 149452 146436 143693 141082 138323 135321 132289 129526 127134 125001 123031 121300 119907
53122A19907j130j055j037q98o94o57q49j060j073r12p46o93q11j130j503j560
$$ 119907 118777 117722 116685 115787 115093 114436 113587 112527 111454 110542 109796 109103 108292 107162 105659 104099
53106A04099j041k27K05r3p68j164j050p00m27k69j41m9KQ7J91J21k33n85n38
$$ 104099 103058 102831 103036 102943 102175 101011 99961 99261 98834 98565 98424 98375 98377 98464 98655 98776 98543 97958 97420
53087I7420j44Q9j83p07r59p50k84J68M58N18M12L65M92N89L50j20l71j88J26
$$ 97420 97276 97365 97182 96475 95516 94766 94482 94650 95108 95626 96038 96403 96895 97484 97834 97714 97343 97155 97281
53068I7281J73l2j68qM00Q49J119J123J027J074J223J155P68M28M98Q02Q48M81
$$ 97281 97454 97422 97254 97246 97646 98495 99614 100737 101764 102838 104061 105216 105984 106412 106910 107712 108560 109041
53050A09041j4l52n24n92n59m60m02m01l65l01l27m70o20p49q97r16n53N5K95
$$ 109041 109027 108675 108151 107559 107000 106540 106138 105737 105372 105071 104744 104274 103654 102905 102008 101092 100539 100594 100889
53031A00889k06r91j251p98j86Q0N2m9k90p80j220j162o23q4J65K65L15P5n52
$$ 100889 100683 99692 98441 97643 97457 97537 97589 97540 97250 96470 95250 94088 93465 93381 93546 93811 94126 94201 93649
53012I3649j061q93k64N0k22n15k97J88L54P9k80m62m72l45j17j0k26n62n70j56
$$ 93649 92588 91695 91431 91481 91259 90744 90447 90635 90989 91068 90788 90326 89854 89509 89392 89382 89156 88594 88024 87868
52992H7868K59K95N8r3J5K90N66P12O71M89K73O9j31k38j30J01J40j84o04o46
$$ 87868 88127 88422 88480 88387 88402 88692 89258 89970 90641 91130 91403 91472 91341 91103 90973 91074 91214 91030 90426 89780
52972H9780j33N67Q50M76j42l23J14O13N95K06K8K02K57j17n66n87j89K13L48
$$ 89780 89647 90214 91064 91540 91398 91075 91189 91802 92397 92603 92631 92833 93090 92973 92407 91820 91631 91844 92192
52953I2192K31j6k30k37l5J19N3n2P6L73N40M86L99L85L59K89K74L20K78R4q1
$$ 92192 92423 92407 92177 91940 91905 92024 92077 92025 92101 92474 93014 93500 93899 94284 94643 94932 95206 95526 95804 95898 95817
52932I5817r9%J29L07N48P52P97O89N14L32J93J65K37L10K99K34J33m8k67l18
$$ 95817 95718 95718 95847 96154 96702 97454 98251 98940 99454 99786 99979 100144 100381 100691 100990 101224 101357 101309 101042 100724
52912A00724q3K31L06J58Q4J78J66r8k85j7N06O58K04l90n41k43K3r8m97q07q12
$$ 100724 100641 100872 101178 101336 101420 101598 101764 101666 101381 101364 101870 102528 102732 102342 101801 101558 101581 101483 100986 100179 99367
52891I9367n86l20j16M4J00j41o76j064q36j29L95L59O6p2j00k56m35l73j19N1
$$ 99367 98781 98461 98345 98389 98489 98348 97672 96608 95772 95643 96038 96397 96463 96391 96291 96035 95600 95227 95108 95159
52871I5159R6K11L76L66J47n3j11j24j44j07n3q6j17RJ56K9k91l91j68J7OR1M52
$$ 95159 95255 95466 95842 96208 96355 96302 96191 96067 95923 95816 95763 95677 95560 95569 95725 95754 95463 95072 94904 94921 94927 95018 95470
52848I5470P34N92K44J04J87K51K67L15K35j86p49r85p55l74j66j67k29k33j18
$$ 95470 96204 96796 97040 97144 97331 97582 97849 98164 98399 98213 97464 96479 95724 95350 95184 95017 94788 94555 94437
52829I4437M6J22Q7J16L09N13N48M93M84M30J83j42k59q5K15M79O18N74M26L97
$$ 94437 94483 94605 94692 94808 95117 95630 96178 96671 97155 97585 97768 97626 97367 97282 97497 97976 98594 99168 99594 99991
52809I9991N66O75M75J17p8o5k5k3k9j25l65n49n22n01p41j004q85n47n88j133
$$ 99991 100557 101232 101707 101824 101746 101681 101656 101633 101604 101479 101114 100565 100043 99542 98801 97797 96912 96365 95777 94644
52789I4644j585j449r57o04n36o18p42q44q10o10l50p4K62N56O23N10M51M02O5
$$ 94644 93059 91610 90653 90049 89513 88895 88153 87309 86499 85889 85539 85465 85727 86283 86906 87416 87867 88269 88334
52770H8334m42m68K87J167J291O15j65n35n29l04M0K49L5m49o19j42N78Q88O62
$$ 88334 87892 87424 87711 88878 90169 90784 90619 90084 89555 89251 89291 89540 89575 89126 88507 88365 88943 89831 90493
52751I0493L78M29O11M33j87p43p77m50k89m32m83j79J82J68k00n27n92n09m26
$$ 90493 90871 91300 91911 92344 92157 91414 90637 90187 89898 89466 88983 88804 88986 89154 88954 88427 87835 87326 86900
52732H6900l31k02j07j10j48j01J09M00N47L84N4q5J16L88L85P6k97n39n72l58
$$ 86900 86569 86367 86260 86150 86002 85901 86010 86410 86957 87341 87395 87310 87426 87814 88199 88275 87978 87439 86867 86509
52712H6509N4M49O15N56M06J67j59l83k66P9K67J48j6L0J58J11o2j07M2J78J59
$$ 86509 86563 87012 87627 88183 88589 88756 88597 88214 87948 88027 88294 88442 88426 88456 88614 88725 88663 88556 88598 88776 88935
52691H8935J12K23M70O79P99R28J110J195J014O02J79m0RK12L38K40O2J29N30
$$ 88935 89047 89270 89740 90419 91218 92146 93256 94451 95465 96067 96246 96206 96215 96427 96765 97005 97067 97196 97726
52672I7726R27R79Q25Q13Q61N53r2m48j43L24K70k78p66j007j247j458j209m08
$$ 97726 98653 99632 100457 101270 102131 102684 102592 102144 102001 102325 102595 102317 101551 100544 99297 97839 96630 96222
52654I6222L60N65M06L96N75N52J80k16l15j77l1K7O3J13J66K11K21J25j58n69
$$ 96222 96582 97147 97553 97949 98524 99076 99256 99040 98725 98548 98517 98544 98607 98720 98886 99097 99318 99443 99285 98716
52634I8716q87q74n17r7O4m2j00R3L02J14m89r79q78k77L04N33N39N71O15M72
$$ 98716 97829 96955 96438 96341 96405 96363 96263 96356 96658 96772 96283 95304 94426 94149 94453 94986 95525 96096 96711 97183
52614I7183R3l19n15m10j08J79K49P3j70k57j61k9O3J77L31M35M42M34M54L70
$$ 97183 97276 96957 96442 96032 95924 96103 96352 96425 96255 95998 95837 95808 95871 96048 96379 96814 97256 97690 98144 98514
52594I8514J00j45n7L55P46Q14N76K34n2j92j39LQk31n24n83l60n4J67L17M34
$$ 98514 98614 98469 98412 98767 99513 100327 100903 101137 101085 100893 100754 100757 100765 100534 100010 99427 99067 99013 99180 99497 99931
52573I9931M34K71J08K03N73R26J005Q84P91P29M51j25o82q44o42m64n38p20p77
$$ 99931 100365 100636 100744 100947 101520 102446 103451 104335 105126 105855 106306 106181 105499 104655 104013 103549 103011 102291 101514
52554A01514p08o38n53l48l0K66M68N59M68J16l68o61n90l14p4Q8K27K95J94p
$$ 101514 100806 100168 99615 99267 99237 99503 99971 100530 100998 101114 100746 100085 99495 99181 99107 99195 99422 99717 99911 99904
52534I9904j39j43p2R9L98O51O39M21L12M02M45L20L14O79J141J185P32J68k20
$$ 99904 99765 99622 99550 99649 100047 100698 101337 101758 102070 102472 102917 103237 103551 104230 105371 106556 107288 107456 107236
52515A07236m82o77o99n13l26l24m08l99k71j02R1K71K83Qm51q68j126j191r98
$$ 107236 106754 106077 105378 104865 104539 104215 103807 103408 103137 103035 103126 103397 103680 103688 103237 102369 101243 100052 99054
52496I9054n44q1O2j34l08j31L13O51O20K72j36l29j59K83O64O66K94r7j73M9
$$ 99054 98510 98429 98491 98357 98049 97918 98231 98882 99502 99774 99638 99309 99150 99433 100097 100763 101057 100960 100787 100836
52476A00836L10M51N02M72K52j20l07k1N16P37L83j38k64N1L12J18l68o40m05
$$ 100836 101146 101597 102099 102571 102823 102703 102396 102375 102891 103628 104011 103873 103609 103660 103972 104090 103722 103082 102677
52457A02677J57O47P91N86K27k8jK61N12N77N38N64O10M63Q8k64l73k79j37l8
$$ 102677 102834 103481 104272 104858 105085 105057 105056 105317 105829 106406 106944 107508 108118 108581 108669 108405 108032 107753 107616 107578
52437A07578m5k42n31n99l10N1J24m6j43j48l18o65p83m11J54L92J76j47j96M0
$$ 107578 107533 107291 106760 106161 105851 105902 106026 105980 105837 105689 105371 104706 103923 103512 103666 104058 104234 104087 103891 103931
52417A03931K87L09J75J67M45Q49J081R95O64K63J5J18N14Q61R46R43J056J079
$$ 103931 104218 104527 104702 104869 105314 106163 107244 108239 108903 109166 109181 109299 109813 110674 111620 112563 113619 114698
52399A14698P13J87P7M99R42R94P30K68m74j352j821j637j308j398j692j572r61
$$ 114698 115411 115598 115675 116174 117116 118110 118840 119108 118634 117282 115461 113824 112516 111118 109426 107854 106893
52382A06893l55m5J06J94Q8k20m84n64n48m55j77K18M02K40J2M4K79M26L53K17
$$ 106893 106538 106493 106599 106793 106881 106661 106177 105613 105065 104610 104433 104651 105053 105293 105305 105349 105628 106054 106407 106624
52362A06624K37N13R41J244J160P27K98K39O05J101J339J157P32M21M37P23J174
$$ 106624 106861 107374 108315 109559 110719 111446 111744 111983 112588 113689 115028 116185 116917 117338 117775 118498 119672
52345A19672J736K268K426K008J286P24M21J01l72p80r67j086j264j266q17j47
$$ 119672 121408 123676 126102 128110 129396 130120 130541 130642 130270 129490 128523 127437 126173 124907 124090 123943
52329A23943J33k04o52n38J55P38O78K03l0K26N93O62N01M30N73Q03J013J169
$$ 123943 124076 123872 123220 122682 122837 123575 124253 124456 124426 124652 125245 125907 126408 126838 127411 128214 129227 130396
52311A30396J227J172J090J045R69Q01O24N10L67J27m2O1L65O71R20J052Q46K54
$$ 130396 131623 132795 133885 134930 135899 136700 137324 137834 138201 138328 138286 138347 138712 139383 140303 141355 142201 142455
52293A42455k15J2P66J253J099P86Q87J308J578J498J235R91Q87J015J362J760
$$ 142455 142240 142252 143018 144271 145370 146156 147043 148351 149929 151427 152662 153653 154540 155555 156917 158677
52277A58677K049K236K367K461K617K969L417L669L697L845M370N113N778O263
$$ 158677 160726 162962 165329 167790 170407 173376 176793 180462 184159 188004 192374 197487 203265 209528
52263B09528O517O421O112O078O576P178P298O972O665O498O251O001O151O726
$$ 209528 216045 222466 228578 234656 241232 248410 255708 262680 269345 275843 282094 288095 294246 300972
52249C00972P201P207O984O886O879O764O606O529O392N992N445N020M721M339
$$ 300972 308173 315380 322364 329250 336129 342893 349499 356028 362420 368412 373857 378877 383598 387937
52235C87937L866L469L128K562J685P68O4n21j135j620j696j416j164j173j278
$$ 387937 391803 395272 398400 400962 402647 403415 403479 402958 401823 400203 398507 397091 395927 394754 393476
52220C93476j211r44n93j98K31N40N52L83L89P48J287J784K270K885L548M023
$$ 393476 392265 391321 390728 390530 390761 391301 391853 392236 392625 393373 394660 396444 398714 401599 405147 409170
52204D09170M210M259M323M446M608M810N007N119N137N157N218N218N064M811
$$ 409170 413380 417639 421962 426408 431016 435826 440833 445952 451089 456246 461464 466682 471746 476557
52190D76557M567M275L745K909J970J183N64j08r52j787k326k538k682k953l256
$$ 476557 481124 485399 489144 492053 494023 495206 495770 495662 494710 492923 490597 488059 485377 482424 479168
52175D79168l424l520l743m061m194l979l606l372l347l372l314l142k868k506
$$ 479168 475744 472224 468481 464420 460226 456247 452641 449269 445922 442550 439236 436094 433226 430720
52161D30720k122j773j424j052p83p40p62n09Q7O61Q87Q60R08J084J164J051R31
$$ 430720 428598 426825 425401 424349 423566 422826 422064 421555 421642 422303 423190 424050 424958 426042 427206 428257 429188
52144D29188R89J193J425J654J900K139K334K452K414K175J888J822K049K282
$$ 429188 430177 431370 432795 434449 436349 438488 440822 443274 445688 447863 449751 451573 453622 455904
52130D55904K192J742J101M23j95o15p74q44j083j492j800j834j760j893k321
$$ 455904 458096 459838 460939 461362 461167 460552 459778 458934 457851 456359 454559 452725 450965 449072 446751
52115D46751k807l028k874k468j982j478j018p78q65j089j086p49l33j12n2N5
$$ 446751 443944 440916 438042 435574 433592 432114 431096 430318 429453 428364 427278 426529 426196 426084 426032 426087
52099D26087L43P77J170J231Q43L33K13N28P46N12J75K34N86P17N14L46M80P74
$$ 426087 426430 427207 428377 429608 430451 430784 430997 431525 432271 432783 432958 433192 433778 434495 435009 435355 435835 436609
52081D36609J029J216J320J283J149J045R82R45J079J505J986K219K365K896L859
$$ 436609 437638 438854 440174 441457 442606 443651 444633 445578 446657 448162 450148 452367 454732 457628 461487
52066D61487M778N348N780O294O799P261P889Q670R143R055Q823Q933R236R234
$$ 461487 466265 471613 477393 483687 490486 497747 505636 514306 523449 532504 541327 550260 559496 568730
52052E68730Q802Q208P655P236P084P110O800N798M547L834L749L627L059K315
$$ 568730 577532 585740 593395 600631 607715 614825 621625 627423 631970 635804 639553 643180 646239 648554
52038F48554J748J234N60j88q14j358j952k587l271m149n200o028o244n938n530
$$ 648554 650302 651536 652096 651908 651094 649736 647784 645197 641926 637777 632577 626549 620305 614367 608837
52023F08837n236m934m530m143l868l570l051k303j511q47l30J53P00J325J929
$$ 608837 603601 598667 594137 589994 586126 582556 579505 577202 575691 574844 574514 574667 575367 576692 578621
52008E78621K384K622K714K831L091L487L953M417M757M779M434L993L835M006
$$ 578621 581005 583627 586341 589172 592263 595750 599703 604120 608877 613656 618090 622083 625918 629924
51994F29924M155L972L473K796J944Q80k70j357k399l411m225m722n102n645o236
$$ 629924 634079 638051 641524 644320 646264 647144 646874 645517 643118 639707 635482 630760 625658 620013 613777
51979F13777o495o367o260o473o822o923o682o294n993n895o006o190o234o083
$$ 613777 607282 600915 594655 588182 581360 574437 567755 561461 555468 549573 543567 537377 531143 525060
51965E25060n872n680n434n136n014n191n394n259m861m631m711m728m365l880
$$ 525060 519188 513508 508074 502938 497924 492733 487339 482080 477219 472588 467877 463149 458784 454904
51951D54904l829m344n020n460n686n912o214o530o857p205p454p485p392p336
$$ 454904 451075 446731 441711 436251 430565 424653 418439 411909 405052 397847 390393 382908 375516 368180
51937C68180p238o817o057n340n017n015n036m963m863m794m786m960n358n742
$$ 368180 360942 354125 348068 342728 337711 332696 327660 322697 317834 313040 308254 303294 297936 292194
51923B92194n781n477n169n070n012m774m451m311m388m389m076l535l026k599
$$ 292194 286413 280936 275767 270697 265685 260911 256460 252149 247761 243372 239296 235761 232735 230136
51909B30136k066j323n60m5K54O38J254J842K021J685J114P05O75R00J022Q07
$$ 230136 228070 226747 226187 226142 226396 227034 228288 230130 232151 233836 234950 235655 236330 237230 238252 239059
51893B39059M20K60M53P32Q72J054J616K608L723M636N287N850O496P075P102
$$ 239059 239479 239739 240192 240924 241796 242850 244466 247074 250797 255433 260720 266570 273066 280141 287243
51878B87243O199M642L153K099J182O2j119k132l124m250n121n279n007n127n878
$$ 287243 293442 298084 301237 303336 304518 304580 303461 301329 298205 293955 288834 283555 278548 273421 267543
51863B67543o647o841o583o323o260o344o458o318n588m346l198k628k485k347
$$ 267543 260896 254055 247472 241149 234889 228545 222087 215769 210181 205835 202637 200009 197524 195177
51849A95177k094j829j524j103p13n61n49m09r1K18M45O68Q13O16n4r97j831k297
$$ 195177 193083 191254 189730 188627 187914 187353 186804 186395 186304 186522 186967 187635 188448 189064 189010 188013 186182 183885
51831A83885k363k154j860j633j534j535j532j366r73n27k65j42J40P01J278J604
$$ 183885 181522 179368 177508 175875 174341 172806 171274 169908 168935 168408 168143 168001 168141 168842 170120 171724
51815A71724J757J905J948J718J371J215J242J115O82J50k88p07j142j335j064
$$ 171724 173481 175386 177334 179052 180423 181638 182880 183995 184677 184827 184539 183832 182690 181355 180291
51800A80291n16j29o2n7J73N59Q05P40M64J52j52m53o74p42p66r57j324j664j841
$$ 180291 179775 179646 179584 179527 179700 180259 181064 181804 182268 182420 182268 181815 181141 180399 179633 178676 177352 175688 173847
51781A73847j961k126k230k160k056k067k039j604p09K32P33O85L35Jj50j52j42
$$ 173847 171886 169760 167530 165370 163314 161247 159208 157604 156895 157127 157860 158545 158880 158881 158731 158579 158437
51764A58437k03k78k81k21j49o9J3lj73l21j88J89M51L50N2j02K0K64M36M49L05
$$ 158437 158234 157956 157675 157454 157305 157236 157249 157246 157073 156752 156564 156753 157204 157554 157606 157504 157524 157788 158224 158673 158978
51743A58978J07J3J09K76L06J35r6k49l50n01o50n67j63K64K52k20n81l34K61
$$ 158978 159085 159098 159207 159483 159789 159924 159828 159579 159229 158728 158078 157511 157348 157612 157864 157644 157063 156729 156990
51724A56990M53rn36n16q7J94K03K93N73O38K39k27j40N86J433J896J882J656
$$ 156990 157443 157434 156898 156382 156295 156489 156692 156985 157558 158196 158435 158208 158068 158654 160087 161983 163865 165521
51706A65521J574J811K177K214J716J047P45Q12P07Q3p61j315j456j461j570j774
$$ 165521 167095 168906 171083 173297 175013 176060 176805 177617 178324 178407 177646 176331 174875 173414 171844 170070
51690A70070j950j991j865j671j572j572j474j166p98n09j39M89J124J320J069
$$ 170070 168120 166129 164264 162593 161021 159449 157975 156809 156011 155502 155363 155852 156976 158296 159365
51675A59365Q84J161J736K189K306K079J550Q73L81K97M86O68P94R71J119R76
$$ 159365 160249 161410 163146 165335 167641 169720 171270 172143 172524 172821 173307 173975 174769 175740 176859 177835
51659A77835M47k60r21j447j745j635j079m10q3k30n54p10o59o20p67j023j141
$$ 177835 178282 178022 177101 175654 173909 172274 171195 170785 170702 170472 169918 169208 168549 167929 167162 166139 164998
51642A64998r28m01K20O61P58N31J16l11n64n05j97L5j28o48j112j169q88n85
$$ 164998 164070 163669 163889 164550 165308 165839 165955 165644 165080 164575 164378 164413 164285 163637 162525 161356 160468 159883
51624A59883m26l60l26l49m11l55o4L98Q07R59Q49O84O82P86P04L70J76N59J408
$$ 159883 159457 159097 158771 158422 158011 157656 157592 157990 158797 159756 160605 161289 161971 162757 163461 163831 164007 164566 165974
51605A65974K136K373K285K159J963J504Q03J07m31q36j123j208j008o07k30m6
$$ 165974 168110 170483 172768 174927 176890 178394 179197 179304 178873 178037 176914 175706 174698 174091 173861 173815
51589A73815J9K23O65J043R47L88j84m18m69p34j311j950k376k496k381k171k013
$$ 173815 173834 174057 174722 175765 176712 177100 176916 176498 176029 175295 173984 172034 169658 167162 164781 162610 160597
51572A60597j981k007j954j738j360q75l88l0J14L6k00n07p93j039j296j530j511
$$ 160597 158616 156609 154655 152917 151557 150682 150294 150264 150378 150414 150214 149707 148914 147875 146579 145049 143538
51555A43538j115o10l87m36l86j63j52n14p41k85O30J269J281R78P36O46P41J135
$$ 143538 142423 141813 141426 140990 140604 140441 140289 139775 139034 138749 139379 140648 141929 142907 143643 144289 145030 146165
51537A46165J781K383K749K995L253L356L033K274J380O59J82j98o11r30q39k58
$$ 146165 147946 150329 153078 156073 159326 162682 165715 167989 169369 170028 170210 170012 169401 168471 167632 167374
51521A67374M02O49N36O52J346K283K889L013K903K721K436K144K152K590L172
$$ 167374 167776 168425 168961 169613 170959 173242 176131 179144 182047 184768 187204 189348 191500 194090 197262
51506A97262L520L588L620L734L810L825M058M785N817O606O841O779O832P006
$$ 197262 200782 204370 207990 211724 215534 219359 223417 228202 234019 240625 247466 254245 261077 268083
51492B68083O893O197N058L848K765J764P60j90r86j689k518l630m906o029o776
$$ 268083 274976 281173 286231 290079 292844 294608 295368 295178 294192 292503 289985 286355 281449 275420 268644
51477B68644p163p336p446p588p747p721p280o465n609m966m444l855l278k971
$$ 268644 261481 254145 246699 239111 231364 223643 216363 209898 204289 199323 194879 191024 187746 184775
51463A84775k978l010k795k334j835j468j245j116j099j271j604j831j647j084
$$ 184775 181797 178787 175992 173658 171823 170355 169110 167994 166895 165624 164020 162189 160542 159458
51449A59458n12k07j14j17k97o77r50q37n45m60m84j81M34P40L90j66l17j11n
$$ 159458 158946 158739 158625 158508 158211 157534 156584 155747 155202 154742 154258 154077 154511 155251 155641 155475 155158 155047 155042
51430A55042n7R3M83O00Q9o74j003p40l73l74p10j029j161j198j252j296j298
$$ 155042 154985 155078 155561 156161 156250 155576 154573 153833 153460 153086 152376 151347 150186 148988 147736 146440 145142
51413A45142j317j359j293j008o20l53l02m15o54r75j211j129o90j45K06K70J97
$$ 145142 143825 142466 141173 140165 139545 139192 138890 138475 137821 136846 135635 134506 133816 133671 133877 134147 134344
51396A34344K16M00N98O10M85N54R89J547J890K042K253K512K588K552K825L523
$$ 134344 134560 134960 135558 136168 136653 137207 138196 139743 141633 143675 145928 148440 151028 153580 156405 159928
51380A59928M093L925L042J979J096L96j77n88q86j194j527j772j931k148k447
$$ 159928 164021 167946 170988 172967 174063 174459 174282 173694 172808 171614 170087 168315 166384 164236 161789
51365A61789k648k579k266j847j431j128j041j120j116q04k30L20N88N18K43p
$$ 161789 159141 156562 154296 152449 151018 149890 148849 147729 146613 145809 145579 145899 146487 147005 147248 147241
51349A47241l0K16N78Q41R45R98J104J239J320J343J415J611J843J932J805J613
$$ 147241 147211 147427 148005 148846 149791 150789 151893 153132 154452 155795 157210 158821 160664 162596 164401 166014
51333A66014J602J833K108K218K230K426K924L519L936M140M331M690N289O143
$$ 166014 167616 169449 171557 173775 176005 178431 181355 184874 188810 192950 197281 201971 207260 213403
51319B13403P146P999Q471Q720R175R948J0579J0480R474P822N888L974K271P40
$$ 213403 220549 228548 237019 245739 254914 264862 275441 285921 295395 303217 309105 313079 315350 316090
51305C16090q67k692m510o021p244q401r488j0243j0565j0634j0556j0134r195
$$ 316090 315223 312531 308021 302000 294756 286355 276867 266624 256059 245425 234869 224735 215540
51292B15540p947o821o030n397m664l829l176k951l038l064k849k588k492k444
$$ 215540 207593 200772 194742 189345 184681 180852 177676 174725 171687 168623 165774 163186 160694 158250
51278A58250k228j948j901k074k112j844j504j348j300j172r62p92o83o01n92
$$ 158250 156022 154074 152173 150099 147987 146143 144639 143291 141991 140819 139857 139065 138382 137781 137189
51263A37189o89p94p57n60k75K4K70M04M36M32L96K83J63K02M24O09N46K58r3
$$ 137189 136500 135706 134949 134389 134114 134138 134408 134812 135248 135680 136076 136359 136522 136724 137148 137757 138303 138561 138468
51244A38468l66m54l34j42m7J8K78O75P72L35k72n08k99oJ36J97L09M91P59J118
$$ 138468 138102 137648 137314 137172 137125 137143 137421 138096 138868 139203 138931 138423 138124 138118 138254 138451 138760 139251 140010 141128
51224A41128J427J493J338J210J250J326J229R13M90J14j25k50l35l73k55J7K33
$$ 141128 142555 144048 145386 146596 147846 149172 150401 151314 151804 151918 151793 151543 151208 150835 150580 150597 150830
51207A50830K39J97L65O78P87N75K98J83O6l36r24j258j088o58l91l86m25l54
$$ 150830 151069 151266 151631 152309 153096 153671 153969 154152 154218 153882 152958 151700 150612 149954 149563 149177 148752 148398
51189A48398l18m95q02j008j033r22o59k09K55M52L20K3l38p34r45p19k59j14
$$ 148398 148080 147585 146783 145775 144742 143820 143161 142952 143207 143659 143979 144002 143664 142930 141985 141266 141007 140893
51171A40893l78m72k1M70L18l61q71q87o24k23L61R12J005O30K82K81M49N54O26
$$ 140893 140515 140043 140022 140492 140810 140449 139578 138691 138067 137844 138205 139117 140122 140752 141034 141315 141764 142318 142944
51152A42944O98O60N47N80P68Q30O93O53Q21Q66N69K14J16J43J03J94N99R72Q35
$$ 142944 143642 144302 144849 145429 146197 147027 147720 148373 149194 150060 150629 150843 150959 151102 151205 151399 151998 152970 153805
51133A53805L27j1o0k05n82q32o69k72K5R8l7l47p00r01r18q40o15j27M41O70
$$ 153805 154132 154121 154061 153856 153274 152442 151773 151501 151526 151624 151587 151240 150540 149639 148721 147881 147266 147139 147580 148250
51113A48250M48J55J18J71J7k86m32l47k31k63m04m77k44M08J234J669J363N77
$$ 148250 148698 148853 148971 149142 149159 148873 148441 148094 147863 147600 147196 146719 146475 146883 148117 149786 151149 151726
51095A51726j19m62n70n24k40K36N76N11J90%J07K83J96k03o34q20p88p74q42
$$ 151726 151607 151145 150575 150051 149811 150047 150623 151134 151324 151324 151431 151714 151910 151707 151073 150253 149465 148691 147849
51076A47849p66l79J34M47M83L84J95j31m32l74R7O04P95P67Q64J193J551J700
$$ 147849 147083 146704 146838 147285 147768 148152 148347 148216 147784 147410 147507 148111 148906 149673 150537 151730 153281 154981
51058A54981J530J046M07m2m5K45L81J25k86m18q8M94R40R77O36K19O0K49N90
$$ 154981 156511 157557 157964 157922 157877 158122 158503 158628 158342 157924 157836 158330 159270 160247 160883 161102 161162 161411 162001
51039A62001Q17Q28P04O07O31P47Q17P24M67J75K0J10M09P32Q63P60N66M36L94
$$ 162001 162818 163646 164350 164957 165588 166335 167152 167876 168343 168518 168538 168648 169057 169789 170652 171412 171978 172414 172808
51020A72808M18N17O50O80N74N68Q99J416J680J501J163J058J223J398J453J581
$$ 172808 173226 173743 174393 175073 175647 176215 177114 178530 180210 181711 182874 183932 185155 186553 188006 189587
51004A89587K068K923L803M334M505M665N091N618N780N266M194K996K143J888
$$ 189587 191655 194578 198381 202715 207220 211885 216976 222594 228374 233640 237834 240830 242973 244861
50990B44861K090K333K271J901J368P51J25l30o17j112k088l112l419k878k131
$$ 244861 246951 249284 251555 253456 254824 255575 255700 255370 254753 253641 251553 248441 245022 242144 240013
50975B40013j666j319r17q16j315k021k299k170k159k417k522k185j603j042n00
$$ 240013 238347 237028 236111 235295 233980 231959 229660 227490 225331 222914 220392 218207 216604 215562 215062
50960B15062Q8O22J043J447J917K369K743L071L326L368L186K973K833K619K189
$$ 215062 215150 215772 216815 218262 220179 222548 225291 228362 231688 235056 238242 241215 244048 246667 248856
50945B48856J671J317J207J222J259J284J273J209J115J012Q96Q05Q84J271J925
$$ 248856 250527 251844 253051 254273 255532 256816 258089 259298 260413 261425 262321 263126 264010 265281 267206
50930B67206K609L093L357L591M011M657N400O127O799P378P753P859P762P532
$$ 267206 269815 272908 276265 279856 283867 288524 293924 300051 306850 314228 321981 329840 337602 345134
50916C45134P211O963P102P818Q942J0178J1430J2697J3792J4538J5134J6058
$$ 345134 352345 359308 366410 374228 383170 393348 404778 417475 431267 445805 460939 476997
50904D76997J7471J9003K0258K1185K1889K2339K2457K2350K2186K1901K1217
$$ 476997 494468 513471 533729 554914 576803 599142 621599 643949 666135 688036 709253
50893G09253J9951J8194J6220J4245J2324J0422Q606P035N722M458L141K034J413
$$ 709253 729204 747398 763618 777863 790187 800609 809215 816250 821972 826430 829571 831605 833018
50880H33018J056M64m27j184j613k140l156m403n376o088p002q328r794j1120
$$ 833018 834074 834538 834111 832927 831314 829174 826018 821615 816239 810151 803149 794821 785027 773907
50866G73907j2358j3623j4830j5815j6563j7182j7773j8365j8936j9372j9484
$$ 773907 761549 747926 733096 717281 700718 683536 665763 647398 628462 609090 589606
50855E89606j9108j8229j7031j5871j5023j4417j3674j2537j1187r968r024q325
$$ 589606 570498 552269 535238 519367 504344 489927 476253 463716 452529 442561 433537 425212
50843D25212p908p784p651p058n976m918m362m242m097l591k743j841j221j006
$$ 425212 417304 409520 401869 394811 388835 383917 379555 375313 371216 367625 364882 363041 361820 360814
50829C60814r29n82O9O05P62Q24J187J765K193K508L082L939M591M740M727N008
$$ 360814 359885 359303 359372 359977 360739 361563 362750 364515 366708 369216 372298 376237 380828 385568 390295 395303
50813C95303N492N828O047O534P419Q405R187R739J0201J0709J1400J2343J3425
$$ 395303 400795 406623 412670 419204 426623 435028 444215 453954 464155 474864 486264 498607 512032
50800E12032J4559J5880J7521J9250K0706K2034K3813K6241K8788L0929L2844
$$ 512032 526591 542471 559992 579242 599948 621982 645795 672036 700824 731753 764597
50789G64597L5061L7740M0623M3480M6136M8301M9745N0633N1285N1626N1198
$$ 764597 799658 837398 878021 921501 967637 1015938 1065683 1116316 1167601 1219227 1270425
50778A270425M9660M7059M3521L9112L3995K8474K2823J7221J1910P131K955o95
$$ 1270425 1320085 1367144 1410665 1449777 1483772 1512246 1535069 1552290 1564200 1571331 1574286 1573591
50766A573591l785o182p824q696q726p960o755n540m502l801l922n352p927j0994
$$ 1573591 1569806 1563624 1555800 1547104 1538378 1530418 1523663 1518123 1513621 1509820 1505898 1500546 1492619 1481625
50752A481625j4265j7992k2275k6697l0856l4756l8412m1503m3745m5200m5988
$$ 1481625 1467360 1449368 1427093 1400396 1369540 1334784 1296372 1254869 1211124 1165924 1119936
50741A119936m6027m5331m4164m2584m0275l7179l3948l1197k8713k5874k2644
$$ 1119936 1073909 1028578 984414 941830 901555 864376 830428 799231 770518 744644 722000
50730G22000j9609j7135j5048j3091j1227r488p922o687n878n259m540l833l481
$$ 722000 702391 685256 670208 657117 645890 636402 628480 621793 615915 610656 606116 602283 598802
50717E98802l505l600l655l817m068m218m334m745n436n909n824n452n275n477
$$ 598802 595297 591697 588042 584225 580157 575939 571605 566860 561424 555515 549691 544239 538964 533487
50703E33487n939o466o825o807o421n821m987l794k474j548j142p48P9J185K249
$$ 533487 527548 521082 514257 507450 501029 495208 490221 486427 483953 482405 481263 480515 480594 481779 484028
50688D84028L383M821O349P469Q093Q600R320J0300J1531J2988J4504J5875J7184
$$ 484028 487411 492232 498581 506050 514143 522743 532063 542363 553894 566882 581386 597261 614445
50675F14445J8656K0248K1676K2912K4201K5523K6445K6649K6362K6028K5773
$$ 614445 633101 653349 675025 697937 722138 747661 774106 800755 827117 853145 878918
50664H78918K5457K4950K4125K2775K0837J8570J6204J3509J0049N830J434k523
$$ 878918 904375 929325 953450 976225 997062 1015632 1031836 1045345 1055394 1061224 1062658 1060135
50652A060135n770q254r904j0710j0811j0355r435q238p024n881m660l354k257
$$ 1060135 1054365 1046111 1036207 1025497 1014686 1004331 994896 986658 979634 973753 969093 965739 963482
50639I63482j653j547j944l123n293q139j1101j3984j6889j9618k1679k2925k3695
$$ 963482 961829 960282 958338 955215 949922 941783 930682 916698 899809 880191 858512 835587 811892
50626H11892k4149k3906k2684k0851j9018j7326j5533j3563j1523r358o927m391
$$ 811892 787743 763837 741153 720302 701284 683958 668425 654862 643339 633981 627054 622663
50614F22663k139k90J433L252N015O434P369P887Q155Q346Q491Q453Q189P954
$$ 622663 620524 620234 621667 624919 629934 636368 643737 651624 659779 668125 676616 685069 693258 701212
50600G01212P978Q062P832P378P216P559P996Q036P698P320P102P046P194P598
$$ 701212 709190 717252 725084 732462 739678 747237 755233 763269 770967 778287 785389 792435 799629 807227
50586H07227Q194Q925R820J0840J1743J2394J3033J3971J5101J5960J6285J6238
$$ 807227 815421 824346 834166 845006 856749 869143 882176 896147 911248 927208 943493 959731
50574I59731J6060J5772J5255J4463J3418J2145J0755R448Q364P416O332M770
$$ 959731 975791 991563 1006818 1021281 1034699 1046844 1057599 1067047 1075411 1082827 1089159 1093929
50562A093929K492m93l789o727q763r802j0082r842r137p997o629n346m355l597
$$ 1093929 1096421 1095928 1092139 1085412 1076649 1066847 1056765 1046923 1037786 1029789 1023160 1017814 1013459 1009862
50548A009862k837j948j126q30j451l006n230p849j0714j3628j6326j8686k0856
$$ 1009862 1007025 1005077 1003951 1003121 1001670 998664 993434 985585 974871 961243 944917 926231 905375
50535I05375k2907k4541k5411k5649k5775k5978k5861k4985k3438k1638j9845
$$ 905375 882468 857927 832516 806867 781092 755114 729253 704268 680830 659192 639347
50524F39347j8125j6565j5202j3863j2378j0868r559q352o951n379l978k862j768
$$ 639347 621222 604657 589455 575592 563214 552346 542787 534435 527484 522105 518127 515265 513497
50511E13497n28O19J449K195L246M582N771O493O868P254P875Q661R374R844J0127
$$ 513497 512969 513588 515037 517232 520478 525060 530831 537324 544192 551446 559321 567982 577356 587200 597327
50496E97327J0439J0940J1618J2344J2973J3383J3582J3722J3995J4386J4678
$$ 597327 607766 618706 630324 642668 655641 669024 682606 696328 710323 724709 739387
50485G39387J4718J4585J4489J4621J5082J5850J6814J7898J9154K0617K2155
$$ 739387 754105 768690 783179 797800 812882 828732 845546 863444 882598 903215 925370
50474I25370K3648K5264K7229K9386L1295L2850L4408L6190L7941L9404M0734
$$ 925370 949018 974282 1001511 1030897 1062192 1095042 1129450 1165640 1203581 1242985 1283719
50463A283719M2116M3222M3521M2890M1541L9490L6538L2784K8630K4261J9434
$$ 1283719 1325835 1369057 1412578 1455468 1497009 1536499 1573037 1605821 1634451 1658712 1678146
50452A678146J3936P908J577m939j1390j7282k2263k6410k9915l2610l4121l4299
$$ 1678146 1692082 1699990 1701567 1696628 1685238 1667956 1645693 1619283 1589368 1556758 1522637 1488338
50440A488338l3278l1160k8010k4115j9971j5854j1625p109k571J367M212N863
$$ 1488338 1455060 1423900 1395890 1371775 1351804 1335950 1324325 1317216 1314645 1316012 1320224 1326087
50428A326087O403N789L824M04m287r791j5609k1403k7004l2174l6493l9578m1429
$$ 1326087 1332490 1338279 1342103 1342507 1338220 1328429 1312820 1291417 1264413 1232239 1195746 1156168 1114739
$$ [...]
##END NTUPLES=NMR SPECTRUM
##END=
