
##TITLE=UV1145_M6-1005-1000_6278956_mZORSG78Rj
##JCAMPDX= 6.0         $$ Bruker NMR JCAMP-DX V2.0
##DATA TYPE= NMR SPECTRUM
##DATA CLASS= NTUPLES
##ORIGIN= BRUKER
##OWNER= Administrator
$$ 1.72 TOPSPIN		Version 2.1
$$ 2012-06-03 14:45:15.953 -0500  Administrator@TOPSPIN
$$ Compression mode = diff/dup
##.OBSERVE FREQUENCY= 400.13188235
##.OBSERVE NUCLEUS= ^1H
##.ACQUISITION MODE= SIMULTANEOUS (DQD)
##.ACQUISITION SCHEME= undefined
##.AVERAGES= 8
##.DIGITISER RES= 22
##SPECTROMETER/DATA SYSTEM= spect
##.PULSE SEQUENCE= zg30
##.SOLVENT NAME= COFFEE_meoh
##.SHIFT REFERENCE= INTERNAL, COFFEE_meoh, 1, 14.98061
##AUDIT TRAIL= $$ (NUMBER, WHEN, WHO, WHERE, PROCESS, VERSION, WHAT)
$$ ##TITLE= Audit trail, TOPSPIN		Version 2.1
$$ ##JCAMPDX= 5.01
$$ ##ORIGIN= Bruker BioSpin GmbH
$$ ##OWNER= Administrator
$$ $$ C:\Bruker\TOPSPIN/data/COFFEE/nmr/UV1145_M6-1005-1000_6278956_mZORSG78Rj/10/pdata/1/auditp.txt
$$ ##AUDIT TRAIL=  $$ (NUMBER, WHEN, WHO, WHERE, PROCESS, VERSION, WHAT)
(   1,<2012-06-03 14:45:08.671 -0500>,<Administrator>,<TOPSPIN>,<go>,<TOPSPIN 2.1>,
      <created by zg
	started at 2012-06-03 14:44:02.203 -0500,
	POWCHK enabled, PULCHK disabled,
       configuration hash MD5:
       D5 CA 7A 23 FE 6B EE E2 50 67 74 61 24 F7 5E 3B
       data hash MD5: 64K
       FA BA AD B7 D3 1D 6A D5 05 07 59 DA 86 4F 15 C7>)
(   2,<2012-06-03 14:45:11.671 -0500>,<Administrator>,<TOPSPIN>,<proc1d>,<TOPSPIN 2.1>,
      <Start of raw data processing
       efp LB = 0 FT_mod = 6 PKNL = 1 PHC0 = 0 PHC1 = 0 SI = 32K 
       data hash MD5: 32K
       C3 B9 05 5F 2D E3 E1 BE 18 3D 5B 38 E3 48 62 B1>)
(   3,<2012-06-03 14:45:12.078 -0500>,<Administrator>,<TOPSPIN>,<proc1d>,<TOPSPIN 2.1>,
      <pk PHC0 = 212.1295 PHC1 = 0 
       data hash MD5: 32K
       09 30 3B 2A C3 02 16 4F 8E E5 B1 98 BA B8 F1 45>)
(   4,<2012-06-03 14:45:12.140 -0500>,<Administrator>,<TOPSPIN>,<proc1d>,<TOPSPIN 2.1>,
      <abs ABSG = 1 
       data hash MD5: 32K
       DB 80 47 CA EA 2B 10 FF 2D CD AE 66 D7 61 4C 10>)
(   5,<2012-06-03 14:45:12.171 -0500>,<Administrator>,<TOPSPIN>,<proc1d>,<TOPSPIN 2.1>,
      <abs ABSG = 2 
       data hash MD5: 32K
       98 68 8F 4F 89 B7 7C 01 C7 04 33 87 EB 55 0B 0A>)
(   6,<2012-06-03 14:45:12.203 -0500>,<Administrator>,<TOPSPIN>,<proc1d>,<TOPSPIN 2.1>,
      <abs ABSG = 3 
       data hash MD5: 32K
       98 70 E0 E6 C2 CE DE 32 A5 7F CD B7 E0 CA FB B7>)
(   7,<2012-06-03 14:45:12.234 -0500>,<Administrator>,<TOPSPIN>,<proc1d>,<TOPSPIN 2.1>,
      <abs ABSG = 4 
       data hash MD5: 32K
       44 76 48 96 85 8E D6 2D E8 11 EF 1D 03 CA 10 EF>)
(   8,<2012-06-03 14:45:12.265 -0500>,<Administrator>,<TOPSPIN>,<proc1d>,<TOPSPIN 2.1>,
      <abs ABSG = 5 
       data hash MD5: 32K
       0F AA AB 84 72 98 D0 BE F5 A2 D0 03 29 42 A9 67>)
$$ ##END=
$$ 
$$ $$ hash MD5
$$ $$ 6B 54 F2 74 85 F3 FE 4C 0D ED F3 4C B3 96 80 FB
##$RELAX= 
##$RELAX= 
##$RELAX= 
##$RELAX= 
##$RELAX= 
##$RELAX= 
##$RELAX= 
$$ Bruker specific parameters
$$ --------------------------
$$ [...]
150 150 150 150 150 150 150 150
##$TP07= 0
##$TPNAME0= <>
##$TPNAME1= <>
##$TPNAME2= <>
##$TPNAME3= <>
##$TPNAME4= <>
##$TPNAME5= <>
##$TPNAME6= <>
##$TPNAME7= <>
##$TPOAL= (0..7)
0.5 0.5 0.5 0.5 0.5 0.5 0.5 0.5
##$TPOFFS= (0..7)
0 0 0 0 0 0 0 0
##$TUNHIN= 0
##$TUNHOUT= 0
##$TUNXOUT= 0
##$USERA1= <user>
##$USERA2= <user>
##$USERA3= <user>
##$USERA4= <user>
##$USERA5= <user>
##$V9= 5
##$VALIST= <valist>
##$VCLIST= <CCCCCCCCCCCCCCC>
##$VD= 0
##$VDLIST= <DDDDDDDDDDDDDDD>
##$VPLIST= <PPPPPPPPPPPPPPP>
##$VTLIST= <TTTTTTTTTTTTTTT>
##$WBST= 2048
##$WBSW= 25
##$XGAIN= (0..3)
0 0 0 0
##$XL= 0
##$YL= 0
##$YMAX_a= 537182
##$YMIN_a= -646845
##$ZGOPTNS= <>
##$ZL1= 120
##$ZL2= 120
##$ZL3= 120
##$ZL4= 120
##$ABSF1= 14.98061
##$ABSF2= -5.57192
##$ABSG= 5
##$ABSL= 3
##$ALPHA= 0
##$AQORDER= 0
##$ASSFAC= 0
##$ASSFACI= 0
##$ASSFACX= 0
##$ASSWID= 0
##$AUNMP= <proc_prof1d_extract_pilot.lims>
##$AXLEFT= 0
##$AXNAME= <>
##$AXNUC= <1H>
##$AXRIGHT= 0
##$AXTYPE= 0
##$AXUNIT= <>
##$AZFE= 0.1
##$AZFW= 0.1
##$BCFW= 0
##$BC_mod= 0
##$BYTORDP= 0
##$COROFFS= 0
##$CY= 15
##$DATMOD= 1
##$DC= 0
##$DFILT= <>
##$DTYPP= 0
##$F1P= 0
##$F2P= 0
##$FCOR= 0.5
##$FTSIZE= 32768
##$FT_mod= 6
##$GAMMA= 0
##$GB= 0
##$INTBC= 1
##$INTSCL= 1
##$ISEN= 128
##$LB= 0
##$LEV0= 0
##$LPBIN= 0
##$MAXI= 10000
##$MC2= 0
##$MEAN= 0
##$ME_mod= 0
##$MI= 0
##$NCOEF= 0
##$NC_proc= -8
##$NLEV= 6
##$NOISF1= 0
##$NOISF2= 0
##$NSP= 0
##$NTH_PI= 0
##$NZP= 0
##$OFFSET= 14.98061
##$PC= 1
##$PHC0= 212.1295
##$PHC1= 0
##$PH_mod= 1
##$PKNL= yes
##$PPARMOD= 0
##$PPDIAG= 0
##$PPIPTYP= 0
##$PPMPNUM= 2147483647
##$PPRESOL= 1
##$PSCAL= 4
##$PSIGN= 0
##$PYNMP= <proc.py>
##$REVERSE= no
##$SF= 400.13
##$SI= 32768
##$SIGF1= 0
##$SIGF2= 0
##$SINO= 400
##$SIOLD= 32768
##$SPECTYP= <>
##$SREGLST= <1H.CDCl3>
##$SSB= 0
##$STSI= 32768
##$STSR= 0
##$SW_p= 8223.68421052632
##$SYMM= 0
##$S_DEV= 0
##$TDeff= 65536
##$TDoff= 0
##$TI= <>
##$TILT= no
##$TM1= 0
##$TM2= 0
##$TOPLEV= 0
##$USERP1= <user>
##$USERP2= <user>
##$USERP3= <user>
##$USERP4= <user>
##$USERP5= <user>
##$WDW= 1
##$XDIM= 32768
##$YMAX_p= 464349446
##$YMIN_p= -737814
##$CURPLOT= <Network HP LaserJet P1505>
##$CURPRIN= <$Network HP LaserJet P1505>
##$DFORMAT= <normdp>
##$LAYOUT= <+/1D_H.xwp>
##$LFORMAT= <normlp>
##$PFORMAT= <normpl>
##$SURQMSG= 1
$$ End of Bruker specific parameters
$$ ---------------------------------
##NTUPLES= NMR SPECTRUM
##VAR_NAME=  FREQUENCY,     SPECTRUM/REAL,   SPECTRUM/IMAG
##SYMBOL=    X,             R,               I
##VAR_TYPE=  INDEPENDENT,   DEPENDENT,       DEPENDENT
##VAR_FORM=  AFFN,          ASDF,            ASDF
##VAR_DIM=   32768,         32768,           32768
##UNITS=     HZ,            ARBITRARY UNITS, ARBITRARY UNITS
##FACTOR=    0.250966925370066, 1,           1
##FIRST=     8223.43324360095, 50607,        -369828
##LAST=      0,             94119,           -164871
##MIN=       0,             -737814,         0
##MAX=       8223.43324360095, 464349446,    0
$$ Real data points
##PAGE= N=1
##DATA TABLE= (X++(R..R)), XYDATA
$$ [...]
19536E5966i577m29201a97560K1065B219L88089b53607J06997f2725l0893K49
$$ 55966 -9577 -438778 -197560 -176495 2219 390308 -253607 -146610 -62725 -93618 -93369
19525i3369F7421c04557i7660E949a44948r2328B5745K58898a21941A11931c9543
$$ -93369 67421 -304557 -97660 5949 -144948 -237276 25745 284643 -121941 111931 -39543
19513b36856m9816a10904A27528a44673C675h7901a2302m1943j10711B0230f7608
$$ -236856 -286672 -110904 127528 -144673 3675 -87901 -12302 -54245 -164956 20230 -67608
19501a35968e1980j55965i6913M3464c49k0395B4485L0067d3263A1250O9535b25722
$$ -135968 -51980 -207945 -96913 -53449 -349 -20744 24485 54552 -43263 11250 80785 -225722
19488e5952j22541J8472d0084a5181A64538i8588a938E0564n38N8009a62137K0105
$$ -55952 -178493 -160021 -40084 -15181 164538 -98588 -1938 50564 50026 108035 -162137 -142032
19476a42032M4688o0328O720j83121J145d9024P719A3911i5750k14982R8624c969
$$ -142032 -97344 -157672 -150952 -334073 -332928 -49024 -41305 13911 -95750 -310732 -212108 -3969
19463c05363a41944A84017P3350A14969a42027p8152A62827a01981B79954a72469
$$ -305363 -141944 184017 257367 114969 -142027 -220179 162827 -101981 279954 -172469
19452a25103A44706a72956C0749c27253A8020J87842P327b26297c8139A35994
$$ -125103 144706 -172956 30749 -327253 18020 205862 213189 -226297 -38139 135994
19441a6842A05180a32856J4517A20375f9732r0123r9178L7177P2014A02890g7497
$$ -16842 105180 -132856 -118339 120375 -69732 -159855 -259033 -221856 -149842 102890 -77497
19429C228h2611j02626m9450a06223B57484e6356K0638A49624E5514K97496E0992
$$ 3228 -82611 -185237 -234687 -106223 257484 -56356 -35718 149624 55514 353010 50992
19417d2893j36207c3013k16994E8300a98639j7238n5000I6725b10028B1450r78
$$ -42893 -179100 -33013 -250007 58300 -198639 -215877 -270877 96725 -210028 21450 20472
19406B0472a26598A71153c9201j0303l7082k88133a23630J3713q8099J7249A15136
$$ 20472 -126598 171153 -39201 -49504 -86586 -374719 -123630 -109917 -198016 -180767 115136
19394a96171o5268R12i0022J4969A7088J5564a6218a96l443k39898k13066b28010
$$ -196171 -261439 -260527 -90022 -75053 17088 32652 -16218 -196 -3639 -243537 -456603 -228010
19381C7037O3007A3223b44169A27134F2755L32555A51277e5005k8887e609n31926
$$ 37037 100044 13223 -244169 127134 62755 395310 151277 -55005 -83892 -5609 -537535
19370e37535h9744D8054a32466k41928A97193b62040A48382d4164m92573A7464
$$ -537535 -89744 48054 -132466 -374394 197193 -262040 148382 -44164 -536737 17464
19359e0845b0372D5715e80606B42886b35616f81A54439k4024g4620l73956b17883
$$ -50845 -20372 45715 -580606 242886 -235616 -681 154439 130415 -74620 -448576 -217883
19347d6778k30693A8240J69793h9669o0166A81674a85210E6205j2809J52072m8507
$$ -46778 -277471 18240 188033 -89669 -149835 181674 -185210 56205 43396 195468 146961
19336A46961j0592k0874J38694a60879A503J28967G656O6002J29303b42011d645
$$ 146961 136369 115495 254189 -160879 1503 130470 7656 73658 202961 -242011 -4645
19324a21527j37613F7292b60371b5911l27431H4697b92853F7150l377b81416J33578
$$ -121527 -259140 67292 -260371 -25911 -353342 84697 -292853 67150 63773 -281416 -147838
19313a47838d1917l6044k63351A21495b06307a00014A00565c569B45334a56631
$$ -147838 -41917 -77961 -341312 121495 -206307 -100014 100565 -3569 245334 -156631
19302F449b75279J26616D5014e8190B25910F9428a27236A47244a06291B69237
$$ 6449 -275279 -148663 45014 -58190 225910 69428 -127236 147244 -106291 269237
19291b38879L2961i9317o1566k08030a34917j09397j06031A4683c7783B89927
$$ -238879 -205918 -99317 -160883 -368913 -134917 -244314 -350345 14683 -37783 289927
19280i5737j25694c1007j83539p2911A36034e0191F7446d8812j96052A78704l4278
$$ -95737 -221431 -31007 -214546 -287457 136034 -50191 67446 -48812 -244864 178704 144426
19269A44426l0466b54795A6540J19130g5404k81315B96098a72245B15539j04061
$$ 144426 113960 -254795 16540 135670 -75404 -356719 296098 -172245 215539 111478
19259A11478J06431e285p3717B40377e8321r2913L1686C03568n7348a30584k5329
$$ 111478 217909 -5285 -79002 240377 -58321 -151234 -119548 303568 246220 -130584 -155913
19248a55913d9438r8474d3327j76609c3236n625G5128b45801J00733j50807B628
$$ -155913 -49438 -147912 -43327 -219936 -33236 -38861 75128 -245801 -145068 -295875 2628
19236F8655a65515e7177D9006h8676j2671l71295I844c06478C20880c19778D1982
$$ 68655 -165515 -57177 49006 -88676 -101347 -472642 9844 -306478 320880 -319778 41982
19224b85270g8732A19763c39951A63397p9336c62944g6604G5192J6457B129a70225
$$ -285270 -78732 119763 -339951 163397 84061 -362944 -76604 75192 91649 2129 -170225
19212D7275g5630K3583A21109a99676B4871g2726o5477d475k06146b8652a2554
$$ 47275 -75630 -52047 121109 -199676 24871 -72726 -138203 -4475 -210621 -28652 -12554
19200a18318B44041F9172L9132r554i7661Q773C697K2829c12127J48654M771n2380
$$ -118318 244041 69172 108304 98750 -97661 -88888 3697 26526 -312127 -163473 -158702 -211082
19188b11082Q6667B8249L01188B9850J09832a07792B36727c97936J61595j51203
$$ -211082 -124415 28249 329437 29850 139682 -107792 236727 -397936 -236341 -387544
19178c87544B25621i703B0121d1706n9527B50216b10511k24781i2306a3195k132
$$ -387544 225621 -9703 20121 -41706 -101233 250216 -210511 -435292 -92306 -13195 -15327
19167a5327j26291B03963a78187J0360E2490b02391A66919c96623a82675I3564
$$ -15327 -141618 203963 -178187 -167827 52490 -202391 166919 -396623 -182675 93564
19156C23736a67945N9895j66769A3431J29967c74031J09056A8586P7383b29906
$$ 323736 -167945 -108050 -274819 13431 143398 -374031 -264975 18586 95969 -229906
19145a40784q396K3748e2811J9899J1609B02228b08947q2909k5462g9608B7278
$$ -140784 -149180 -125432 -52811 -32912 -21303 202228 -208947 -291856 -317318 -79608 27278
19133D82406b01515A32199a12505j97409c5877A7967e7117A87341E2639a91131
$$ 482406 -201515 132199 -112505 -309914 -35877 17967 -57117 187341 52639 -191131
19122H0048B5570a37602A01817f98614a11736H5407b26920G6023a73077A14625
$$ 80048 25570 -137602 101817 -698614 -111736 85407 -226920 76023 -173077 114625
19111d57097a90410H8112a4958F802e8831n7206D73043a77994P0903A47387m3928
$$ -457097 -190410 88112 -14958 6802 -58831 -116037 473043 -177994 -107091 147387 103459
19100A03459M6920m6520c49414B229L2280d8521J0189F0097e17442G0561c17469
$$ 103459 150379 103859 -349414 2229 34509 -48521 -38332 60097 -517442 70561 -317469
19088e5485H8521a1661A34197a39203j53962B3455O1546d19560J70930M154B59779
$$ -55485 88521 -11661 134197 -139203 -293165 23455 85001 -419560 -248630 -244476 259779
19076a932j19458H3017e9193F9715d8934E1864b51285J3002a10952k45939a14729
$$ -1932 -121390 83017 -59193 69715 -48934 51864 -251285 -238283 -110952 -356891 -114729
19064B84120b4298q5818e0574l4373r3956h5988C59266h300B94768a53505j81471
$$ 284120 -24298 -110116 -50574 -84947 -178903 -85988 359266 -8300 294768 -153505 -334976
19053c34976D4572J9185g1553o367j0586j2755K0503P408G2241c48479b6901l0649
$$ -334976 44572 63757 -71553 -77920 -88506 -101261 -80758 -73350 72241 -348479 -26901 -57550
19041e7550l0094p8620O5540M6318I2123b20459J2751b5688j94271r655J09432
$$ -57550 -87644 -166264 -100724 -54406 92123 -220459 -207708 -25688 -219959 -229614 -120182
19030a20182G9897e5479r4469o4476A67588a61441A72704l3931C6525L1604a7752
$$ -120182 79897 -55479 -149948 -214424 167588 -161441 172704 138773 36525 68129 -17752
19018e0494A31274e9782F7717d4000A39967m6612j2956J40886n9496a04845A29557
$$ -50494 131274 -59782 67717 -44000 139967 93355 80399 221285 161789 -104845 129557
19006b93160K6300D63638b86476a00830C6732a08839H3969C6246J00856k0918
$$ -293160 -266860 463638 -286476 -100830 36732 -108839 83969 36246 137102 116184
18996A16184c7623D21638c3137n8383o4218P3222o264d577r0727Q294j73559L4452
$$ 116184 -37623 421638 -33137 -91520 -155738 -82516 -88780 -4577 -95304 -87010 -260569 -226117
18984b26117A34791a87612H0198h5350I4908D285P9924e5880o9833b3344k45800
$$ -226117 134791 -187612 80198 -85350 94908 4285 84209 -55880 -125713 -23344 -269144
18973b69144B5990M235b24761c5845H6493f8665C3177O1130d76997c8774j76802
$$ -269144 25990 30225 -224761 -35845 86493 -68665 33177 94307 -476997 -38774 -215576
18962b15576c2962A13622J10322G7462a12529o5215j40119d0875F6472K3702p035
$$ -215576 -32962 113622 223944 77462 -112529 -177744 -317863 -40875 66472 90174 83139
18951H3139g2691K9635j67541g9749k11454d0240p1634k26509P1144F0286H320
$$ 83139 -72691 -43056 -210597 -79749 -291203 -40240 -111874 -338383 -267239 60286 8320
18939a29641j2768A43021b20008h1377L7841k67113j38a2563B8002a8435H9581
$$ -129641 -142409 143021 -220008 -81377 -43536 -310649 -310787 -12563 28002 -18435 89581
18927a90286b5337j16062A00255b6154m53536B26875b61826H4030M9256J01800
$$ -190286 -25337 -141399 100255 -26154 -479690 226875 -261826 84030 133286 235086
18917B35086G8282J76449M6615j28285J06058h3242A74612l0513C2868b50253
$$ 235086 78282 254731 301346 173061 279119 -83242 174612 144099 32868 -250253
18906B6757c43038f639B2221f9491k1589G5077e26902c3902k75913B61932c43726
$$ 26757 -343038 -6639 22221 -69491 -91080 75077 -526902 -33902 -309815 261932 -343726
18894c1972k06719R8816F7937a55005C7565c88977B4328g5049F0951i1906l8362
$$ -31972 -238691 -139875 67937 -155005 37565 -388977 24328 -75049 60951 -91906 -130268
18883a30268A02626a53906A45116a11168B7857J11450d2900b441F3348O5743c2212
$$ -130268 102626 -153906 145116 -111168 27857 139307 -42900 -2441 63348 129091 -32212
18871b45472i0404k74969d2151j26139I0923a53670A46806e4482j66740j43424
$$ -245472 -90404 -365373 -42151 -168290 90923 -153670 146806 -54482 -221222 -364646
18861c64646a36611k8746C71967B7509j1633J20296a31626L0146k25304A23982
$$ -364646 -136611 -165357 371967 27509 15876 136172 -131626 -101480 -326784 123982
18850a9429B18896a58932m510C0994g566F7650g2035A47958b04229b8649k82321
$$ -19429 218896 -158932 -163442 30994 -7566 67650 -72035 147958 -204229 -28649 -310970
18839c10970A07187a79316C34724A24760a22025A3343K9689a85961C0391q716
$$ -310970 107187 -179316 334724 124760 -122025 13343 43032 -185961 30391 21675
18829B1675b82590q6087A14740c15329g372r2813a7442n0055o3634k29528i1578
$$ 21675 -282590 -368677 114740 -315329 -7372 -100185 -17442 -67497 -131131 -360659 -91578
18817a48104F9373a14409j3114B6651f3781B26772O765a65918R089O8417D8797
$$ -148104 69373 -114409 -127523 26651 -63781 226772 233537 -165918 -156829 -88412 48797
18805b8936j02187B18852H216f73j95602C152J31041a26443C29700P6864A3153
$$ -28936 -131123 218852 8216 -673 -196275 3152 134193 -126443 329700 406564 13153
18793a03801A39763a41710B52963J40375a76569d533n3376j82705k5939A02253
$$ -103801 139763 -141710 252963 393338 -176569 -4533 -57909 -240614 -266553 102253
18782a15865B11805R1261c41065A32143b44044F8462a82B48402j00416l961a83057
$$ -115865 211805 303066 -341065 132143 -244044 68462 -182 248402 147986 144025 -183057
18770D62834a91589a7385j25682G1092e3598C08650i8587L9792F0229R6790a30480
$$ 462834 -191589 -17385 -143067 71092 -53598 308650 -98587 -58795 60229 157019 -130480
18758B751a16084q3585K4557j09766A17556b09196a9604k60205k7925k0934D5315
$$ 2751 -116084 -199669 -175112 -284878 117556 -209196 -19604 -279809 -307734 -328668 45315
18746a07266n1293q7221F4186J3598a75322K6479j26580g7328l38379P9525a6581
$$ -107266 -158559 -245780 64186 77784 -175322 -148843 -275423 -77328 -415707 -336182 -16581
18734E0026d31958F1159a58767k34891f6639L0365l4604j59675A08718P9025E4550
$$ 50026 -431958 61159 -158767 -393658 -66639 -36274 -70878 -230553 108718 187743 54550
18722B26185o0390j1207m1223b87878h3971B88457d03211f9312o2887r7301J00346
$$ 226185 165795 154588 113365 -287878 -83971 288457 -403211 -69312 -132199 -229500 -129154
18711a29154A79215c71660J35647c6588G9607a99619k0506f2479j36142h7281
$$ -129154 179215 -371660 -236013 -36588 79607 -199619 -220125 -62479 -198621 -87281
18700B62523b86740j3592o3818j51116a26319l55907a42942I2771M42316E2432
$$ 262523 -286740 -300332 -364150 -515266 -126319 -482226 -142942 92771 535087 52432
18689A3953K48852a206k63259a6267j42945L0020C4009c06917F9483f5925C28544
$$ 13953 262805 -1206 -264465 -16267 -159212 -129192 34009 -306917 69483 -65925 328544
18677a33072k20596A3369J7562N6632L2139a5397A55636d76753K37046E3311b15493
$$ -133072 -353668 13369 30931 87563 119702 -15397 155636 -476753 -239707 53311 -215493
18665a90449B148O3222M3739n0205K03759a22074l3289k73095J62827j48685A47016
$$ -190449 2148 65370 109109 58904 262663 -122074 -155363 -428458 -265631 -414316 147016
18653b81028d0505G6068a22643B12198c14549a27497C9009Q7379m0926c4770j45648
$$ -281028 -40505 76068 -122643 212198 -314549 -127497 39009 126388 85462 -34770 -180418
18642a80418l4062O5642I0874c35256k64260J61955A65332b6552q8606e0173n3836
$$ -180418 -214480 -148838 90874 -335256 -599516 -437561 165332 -26552 -115158 -50173 -104009
18631a04009D3622a66607H516i5611r754A6000J38940l4786g6811a5371l71843
$$ -104009 43622 -166607 8516 -95611 -105365 16000 154940 120154 -76811 -15371 -387214
18620c87214A69556J36967C1284h589l2813G205i8807M7131B38100c856B05941
$$ -387214 169556 306523 31284 -8589 -41402 7205 -98807 -51676 238100 -3856 205941
18608A0991c71628i6290J4463C4005a5145F9217b13516D5698L47a511k31968P7969
$$ 10991 -371628 -96290 -81827 34005 -15145 69217 -213516 45698 46045 -1511 -233479 -155510
18596a55510g6120j7836F0638P5530C4865K18629g9767l38484H7758d38317g1423
$$ -155510 -76120 -93956 60638 136168 34865 253494 -79767 -418251 87758 -438317 -71423
18584A53251b18116l15012a02123j02225j23846a6263b615o6105j55277C01397
$$ 153251 -218116 -533128 -102123 -204348 -328194 -16263 -2615 -68720 -223997 301397
18573e6559a8737B00292b80720P1533B14337B8213a31865K7914M0378H369a09189
$$ -56559 -18737 200292 -280720 -209187 214337 28213 -131865 -103951 -63573 8369 -109189
18561D2206K49163b55145O8567Q4679B29871a29916j21970b9701j9171j17210
$$ 42206 291369 -255145 -186578 -101899 229871 -129916 -251886 -29701 -48872 -166082
18551a66082e1087H099b30962M6228C1855a03431D1602b38234a17194j80086h2672
$$ -166082 -51087 8099 -230962 -184734 31855 -103431 41602 -238234 -117194 -297280 -82672
18539b6664j37494a6544p7223C53660I3060a03602p5389d8175j62780j3936i1424
$$ -26664 -164158 -16544 -93767 353660 93060 -103602 -178991 -48175 -210955 -224891 -91424
18527e9992A76190n7012h3711j86331A19504a38155A21753c14829e9108j75667
$$ -59992 176190 119178 -83711 -270042 119504 -138155 121753 -314829 -59108 -234775
18517b34775A48208a97266p3850I6871J00177a73273E8386J13786a12901l18102
$$ -234775 148208 -197266 -271116 96871 197048 -173273 58386 172172 -112901 -431003
18507d31003a94971f4958k15150G3144M4344b9131q0086D325c33734f4513f02
$$ -431003 -194971 -64958 -280108 73144 117488 -29131 -109217 4325 -333734 -64513 -602
18495c0986j20473A8772b76621g9849B67424d8753A00101k7153P8263c97736e4800
$$ -30986 -151459 18772 -276621 -79849 267424 -48753 100101 72948 151211 -397736 -54800
18483A4391L2033J02389c61679c499j01292B63859G5587l4234b20010A19649b3428
$$ 14391 46424 148813 -361679 -3499 -104791 263859 75587 41353 -220010 119649 -23428
18471a08157j7980A78075L4620e9399n0963A33219c42656N0014F2774a99740G0424
$$ -108157 -126137 178075 212695 -59399 -110362 133219 -342656 -292642 62774 -199740 70424
18459a15202A50931J16686C9564J5689b44970R644j65281a36325k2407G4388a44212
$$ -115202 150931 267617 39564 55253 -244970 -235326 -400607 -136325 -158732 74388 -144212
18447a36031H7106a62333E8117a34776L165G8729a64946f3722A06011a35829d1798
$$ -136031 87106 -162333 58117 -134776 -131611 78729 -164946 -63722 106011 -135829 -41798
18435c64814a04430F6401a70657B83868A14174i6505r838j65941J02763j08986
$$ -364814 -104430 66401 -170657 283868 114174 -96505 -106343 -272284 -169521 -278507
18425b78507e4476k33005f2005i2k15202A45179d4168a8997C16505a43932j5892
$$ -278507 -54476 -287481 -62005 -92 -215294 145179 -44168 -18997 316505 -143932 -159824
18414a59824g4286D2969L04379a35957j5397D5414P1432d9137C9070P2199A0789
$$ -159824 -74286 42969 347348 -135957 -151354 45414 116846 -49137 39070 111269 10789
18402e9475B01886g493G095f0896g144H2484J2747i7365G6641L9014L5191b31913
$$ -59475 201886 -7493 7095 -60896 -7144 82484 95231 -97365 76641 115655 150846 -231913
18389A37663b7433j33447n4998A16619a07105O033a1060A65207K03283H7359a70450
$$ 137663 -27433 -160880 -215878 116619 -107105 -101072 -11060 165207 368490 87359 -170450
18377A1474b31944j39123C4676d15459F0550a59859g88r4776m3526R127q5624
$$ 11474 -231944 -371067 34676 -415459 60550 -159859 -788 -95564 -139090 -129963 -215587
18366b15587j48292b2193B3230K5729k2517J59198p2515a21139B19509j01465
$$ -215587 -363879 -22193 23230 48959 26442 185640 113125 -121139 219509 118044
18356A18044A6462R276Q6588I113a76497d6828i1j7957A171b63797O9663J8235
$$ 118044 16462 25738 112326 9113 -176497 -46828 -91 -18048 1171 -263797 -194134 -175899
18344a75899k8438l03237A12350L9828m0720f0741j5596A52091i8907L0761A00211
$$ -175899 -204337 -507574 112350 152178 111458 -60741 -76337 152091 -98907 -68146 100211
18332b53463F1344a12526l2136A09509a05855j49757G6847P9267o9462a53008
$$ -253463 61344 -112526 -144662 109509 -105855 -255612 76847 156114 86652 -153008
18321i8221n2919A40563i7410J7073E9324j1487L5195e953j91468L1634A00918
$$ -98221 -151140 140563 -97410 -80337 59324 47837 83032 -5953 -197421 -165787 100918
18309E8605a37282K3337o3816k40416d3563j01975b0572A86916b36448A55039
$$ 58605 -137282 -113945 -177761 -418177 -43563 -145538 -20572 186916 -236448 155039
18298b50197I545i6614l0424k14130c5583F7990f6105B84074b71519B45282a83646
$$ -250197 9545 -96614 -127038 -341168 -35583 67990 -66105 284074 -271519 245282 -183646
18286a10706P68C6585b98096A72890b09631q068B7836M4139b63481H9859b37215
$$ -110706 -109938 36585 -298096 172890 -209631 -217699 27836 71975 -263481 89859 -237215
18274A07650a59871G3668J57812c81717I9316N0484a53153j67576C21012f2066
$$ 107650 -159871 73668 231480 -381717 99316 149800 -153153 -320729 321012 -62066
18263A60426J24145e1652O26j98329c4555m3863A50775a5575l09294g7796n2928
$$ 160426 284571 -51652 -51026 -249355 -34555 -78418 150775 -15575 -324869 -77796 -130724
18252a30724p2909e2421L058B87338b0215k36246a19770M4955D1092c833j38372
$$ -130724 -203633 -52421 -49363 287338 -20215 -256461 -119770 -74815 41092 -3833 -142205
18241a42205B9222j0155J00628b08550c9081l55876J57937D2767b9044B55437
$$ -142205 29222 19067 119695 -208550 -39081 -394957 -237020 42767 -29044 255437
18230A28529E5634b56528i0383D863b63453a2872j86662G0521a48704G9490J40513
$$ 128529 55634 -256528 -90383 4863 -263453 -12872 -199534 70521 -148704 79490 220003
18219B20003K1782b28128B20444b83570q7832D1110d714r4975E1335i5753a7932
$$ 220003 241785 -228128 220444 -283570 -371402 41110 -4714 -99689 51335 -95753 -17932
18207b40778A66284d2989k89563J20032e464r0945A64987b09903h9954j8478B35474
$$ -240778 166284 -42989 -332552 -212520 -5464 -96409 164987 -209903 -89954 -108432 235474
18195A88151a44220f9392r3780q0895L3402r4167f2178j55240d7386F5634K29332
$$ 188151 -144220 -69392 -163172 -244067 -210665 -304832 -62178 -217418 -47386 65634 294966
18184B94966A10600k5211P405b72672B20673b15481d560k68967a7604D6595J36727
$$ 294966 110600 85389 92794 -272672 220673 -215481 -4560 -273527 -17604 46595 183322
18173A83322C4932b62591B00805G5959i9459b6858l6708m35386C9837e0424D6618
$$ 183322 34932 -262591 200805 75959 -99459 -26858 -63566 -498952 39837 -50424 46618
18161b34796C54796j70173K34881a94126D675L03719h7366B60428d1603l70588
$$ -234796 354796 184623 419504 -194126 4675 308394 -87366 260428 -41603 -412191
18151d12191J41973d4851C05286f2546k21378B7133b47508J02089C1513J16609
$$ -412191 -270218 -44851 305286 -62546 -283924 27133 -247508 -145419 31513 148122
18141A48122o3141i4786k7631A72571q3542a36710A4287c2698a5284j65914A89656
$$ 148122 84981 -94786 -122417 172571 89029 -136710 14287 -32698 -15284 -181198 189656
18129A3974e8321D30224F9543L7129Q0608b9088B5932R0808J31133i4144j37308
$$ 13974 -58321 430224 69543 106672 187280 -29088 25932 116740 247873 -94144 -231452
18118b31452I8171h8828G051c52514G5964k6813J01998m3797a68890r2358J29937
$$ -231452 98171 -88828 7051 -352514 75964 49151 151149 107352 -168890 -261248 -131311
18107a31311B12287j03967e9003k34056J12291A28618o1026a46019L5168n5420
$$ -131311 212287 108320 -59003 -293059 -180768 128618 67592 -146019 -110851 -166271
18097a66271A57193D8564i1056c4211A15857a25864C7412b46905P7949M8821c571
$$ -166271 157193 48564 -91056 -34211 115857 -125864 37412 -246905 -168956 -120135 -3571
18085C5927M5724b17690p8655a20322e4346B07546b67293b7229Q506E0123P0496
$$ 35927 81651 -217690 -296345 -120322 -54346 207546 -267293 -27229 -18723 50123 120619
18074A20619m9684a25191j5166F4997i3B45640j17496d27536a24234c7026j8256
$$ 120619 70935 -125191 -140357 64997 -93 245640 128144 -427536 -124234 -37026 -55282
18063e5282I1423c71797e0366I654J35441e1145B2207i9212A85746a10614C8585
$$ -55282 91423 -371797 -50366 9654 145095 -51145 22207 -99212 185746 -110614 38585
18051f2724C36889H4982f9945C8714b57097B48195C8422K54427g0725A82371e3699
$$ -62724 336889 84982 -69945 38714 -257097 248195 38422 292849 -70725 182371 -53699
18039c48548R5944e0803D5279h2376m2546F096d9860j13576l7373A01597Q1949
$$ -348548 -252604 -50803 45279 -82376 -124922 6096 -49860 -163436 -200809 101597 183546
18028A83546h1089B12569D3366J70204f5681A83986K3088a93485R5667m3071j58847
$$ 183546 -81089 212569 43366 213570 -65681 183986 207074 -193485 -97818 -140889 -299736
18017b99736b9760H8771K92954F846J50598a38738J559o8741A91021d0899p5540
$$ -299736 -29760 88771 381725 6846 157444 -138738 -137179 -205920 191021 -40899 -116439
18006a16439A96767B1671a73811Q6433a5285k91796I7024a81732F8552b19345
$$ -116439 196767 21671 -173811 -87378 -15285 -307081 97024 -181732 68552 -219345
17995a12445D7485a07584r548A08218B351L1976a55670J0923B49829a19934c8040
$$ -112445 47485 -107584 -117132 108218 2351 34327 -155670 -144747 249829 -119934 -38040
17983i6399j33875H1360c23836h406A19171K8921f4046H169g7476j68513g7463
$$ -96399 -230274 81360 -323836 -8406 119171 148092 -64046 8169 -77476 -245989 -77463
17971D7621a01691B8915J20706k8798Q6004i545j28713a6357A90664a92479d2035
$$ 47621 -101691 28915 149621 120823 206827 -9545 -138258 -16357 190664 -192479 -42035
17959B2047A868b054I3205i5456j5759d9845e076k14644H694M00375e6888A67479
$$ 22047 1868 -2054 93205 -95456 -111215 -49845 -5076 -219720 8694 409069 -56888 167479
17946A96405b50659f5245j55999A3529p54i6512B91104p6899a90989J8228J9217
$$ 196405 -250659 -65245 -221244 13529 12775 -96512 291104 214205 -190989 -172761 -153544
17935a53544A5656a40704o2172j03045J45637H5328a91301a8112B54827M5075
$$ -153544 15656 -140704 -202876 -305921 -160284 85328 -191301 -18112 254827 299902
17925B99902D8639a4689F3228H607b58784F5007J29486Q8107A7785a45922I1437
$$ 299902 48639 -14689 63228 8607 -258784 65007 194493 282600 17785 -145922 91437
17913c6231k97553J62692A38941a30867H4468i2071H8554b02293I5645B8205a69250
$$ -36231 -333784 -171092 138941 -130867 84468 -92071 88554 -202293 95645 28205 -169250
17901a75373a1810C88187b6576j48852F8112J45585b16684P5746l1722N869N6010
$$ -175373 -11810 388187 -26576 -175428 68112 213697 -216684 -140938 -172660 -166791 -110781
17890a10781c2880j43033a548j91909A93284b28853N8548B4528n552J9755g9807
$$ -110781 -32880 -175913 -1548 -193457 193284 -228853 -170305 24528 18976 38731 -79807
17878B00589m7492J98613a109A88045a44285E8229J07688J74013a32449c6493
$$ 200589 153097 351710 -1109 188045 -144285 58229 165917 339930 -132449 -36493
17867h5983F1614d6110A3448K5526b49522g6336k5824E2654J12435b4519B14317
$$ -85983 61614 -46110 13448 38974 -249522 -76336 -102160 52654 165089 -24519 214317
17855b3558m6299B8807L4635a05538A1831a81727B08637c02003A9813J82954d79817
$$ -23558 -69857 28807 63442 -105538 11831 -181727 208637 -302003 19813 202767 -479817
17843b43333a06167k19587e1121J072B88579g8245b1911F0723a96642A00818c95686
$$ -243333 -106167 -325754 -51121 -50049 288579 -78245 -21911 60723 -196642 100818 -395686
17831a62157j05178F5560g4672b3143A31404f1065B7805J32596n5227i1831C4549
$$ -162157 -267335 65560 -74672 -23143 131404 -61065 27805 160401 105174 -91831 34549
17819c3795j02302B7006a3094D1464e9144D5379K17775d33756B38565f2459d351
$$ -33795 -136097 27006 -13094 41464 -59144 45379 263154 -433756 238565 -62459 -4351
17807H4163e0274j77792A43690b29164C0538J65104H9260i6648A60319a17182
$$ 84163 -50274 -228066 143690 -229164 30538 195642 89260 -96648 160319 -117182
17796a74418A01447J26381i544C4086b2290F5560J25268c2751A94234E7830e8641
$$ -174418 101447 227828 -9544 34086 -22290 65560 190828 -32751 194234 57830 -58641
17784g7788L4219l6817m9773H7965A8713g183j67928h0191B34376k6744a1476
$$ -77788 -43569 -80386 -130159 87965 18713 -7183 -175111 -80191 234376 207632 -11476
17772F5957a20138A64172b14438A55231A2736K09783a63569A87692b50366d4637
$$ 65957 -120138 164172 -214438 155231 12736 222519 -163569 187692 -250366 -44637
17761I3379h9122r6582B72703C4529b98963M5076B88058j40615a71771A08812
$$ 93379 -89122 -185704 272703 34529 -298963 -253887 288058 147443 -171771 108812
17750A19058B6379K4390a47216A62700b1690j4820j05133E61510F3426h7851D2670
$$ 119058 26379 50769 -147216 162700 -21690 -36510 -141643 561510 63426 -87851 42670
17738B09698c6692k18728A43680E8817L4031J01266a56958n1204B9781M7164d8546
$$ 209698 -36692 -255420 143680 58817 92848 194114 -156958 -208162 29781 76945 -48546
17726A32338J70125A49067a3291G955c58868a39256b2266D0909J08161E3248G671
$$ 132338 302463 149067 -13291 7955 -358868 -139256 -22266 40909 149070 53248 7671
17714a78753d553A23200B1791J38946a15353B21006b0095F6440K0293A7539O6972
$$ -178753 -4553 123200 21791 160737 -115353 221006 -20095 66440 86733 17539 84511
17703H4511J74971d9131B00697g4817B5148D665d0356F2988M5335a42586A64989
$$ 84511 259482 -49131 200697 -74817 25148 4665 -40356 62988 108323 -142586 164989
17691c34468H8321M4568m9194J59369c114A53534n4706b9559j07378N2388E8525
$$ -334468 88321 132889 83695 243064 -3114 153534 98828 -29559 -136937 -84549 58525
17679B25859a33476C48111b44926c3656I7774J7814a05910r9194C2472I977g7157
$$ 225859 -133476 348111 -244926 -33656 97774 115588 -105910 -205104 32472 9977 -77157
17667a64430j25289A70762e1605j71702G6373K23243b86063K4233g1638B74299
$$ -164430 -289719 170762 -51605 -223307 76373 299616 -286063 -261830 -71638 274299
17656A45102a17428j71447J32543A29165a7434A93643L0863j04723J1145n1919
$$ 145102 -117428 -288875 -156332 129165 -17434 193643 224506 119783 130928 79009
17646G9009J02622n3813o3501J3624a77317F5151K10510F9620M38681A55672J2225
$$ 79009 181631 127818 64317 77941 -177317 65151 275661 69620 508301 155672 167897
17635A67897f5696R149J2000H4475m1242c1627B19277b14809B04073E4239F904
$$ 167897 -65696 -56547 -44547 84475 43233 -31627 219277 -214809 204073 54239 6904
17623B7111a8658j13621A52606J65881b23119f6044b3227A57867J5826a57047
$$ 27111 -18658 -132279 152606 318487 -223119 -66044 -23227 157867 173693 -157047
17612D9302a71872l0546i4552j07238H7210j7572b41168a07229j00959i5343n428
$$ 49302 -171872 -202418 -94552 -201790 87210 69638 -241168 -107229 -208188 -95343 -100771
17601a00771A28435b8633F8895J90456B3870J09863a18401A44153a93844I010
$$ -100771 128435 -28633 68895 259351 23870 133733 -118401 144153 -193844 9010
17590C87380j66125o6842h3712B8833a5648k63307A01182d50l8216D608K49029
$$ 387380 221255 154413 -83712 28833 -15648 -278955 101182 -450 -38666 4608 253637
17579B53637j8592C1523J07524f0788C11448a25752n6818C87401A67665a11740
$$ 253637 235045 31523 139047 -60788 311448 -125752 -182570 387401 167665 -111740
17568a48243D5175J85036d5117j10685E45368E6910N0348K94442D2695L15089
$$ -148243 45175 230211 -45117 -155802 545368 56910 107258 401700 42695 357784
17558C57784j818a21935B07721q0449a8395A53405E3005g518B77540a77930b4728
$$ 357784 355966 -121935 207721 127272 -18395 153405 53005 -7518 277540 -177930 -24728
17546A92537c182j73138A23183a45048p451m5079B02016c7679j70030A88975e5077
$$ 192537 -3182 -176320 123183 -145048 -152499 -197578 202016 -37679 -207709 188975 -55077
17534I369d8041B89200a52272g0663r2299D4716L60970a472k1276F7286g3520
$$ 9369 -48041 289200 -152272 -70663 -162962 44716 405686 -1472 -22748 67286 -73520
17522B396d8191l0752J3389A00854C6390R1849g1363E2153d990A28601K07432
$$ 2396 -48191 -78943 -65554 100854 36390 128239 -71363 52153 -4990 128601 336033
17511C36033A788a67797B82519H9531K09007j14953c6495I4665J38125K4820J24346
$$ 336033 1788 -167797 282519 89531 298538 183585 -36495 94665 232790 257610 381956
17500C81956a70557A57913l3015K16007a34793D7189b10513B54960j19204a24564
$$ 381956 -170557 157913 124898 340905 -134793 47189 -210513 254960 135756 -124564
17489A75927J5685D8143J34131j7191J61831a2251A97728F1747J79663j9188G8328
$$ 175927 191612 48143 182274 165083 326914 -12251 197728 61747 241410 222222 78328
17477C7966b01282b8601k1182k16242B80065D9050K6699C6029Q4045J06389e7293
$$ 37966 -201282 -28601 -49783 -266025 280065 49050 75749 36029 120074 226463 -57293
17465G1376d1389a0175j19922B51996J4952j06873A2451L54668A20924D2206K17315
$$ 71376 -41389 -10175 -130097 251996 266948 160075 12451 367119 120924 42206 259521
17454B59521m5253A266M29995B01013k5637C6804J69320o2679l3603J03573C4111
$$ 259521 214268 1266 431261 201013 175376 36804 206124 143445 109842 213415 34111
17442B70028G0766J4766K47493A47705M32354a68369C8819K52333p5947K5819
$$ 270028 70766 85532 333025 147705 580059 -168369 38819 291152 215205 241024
17432B41024M32164a2292D25757c2643B90048j4986A01553P9743J08342q6232
$$ 241024 673188 -12292 425757 -32643 290048 275062 101553 181296 289638 203406
17422B03406O5440A19783Q1586K17654O4712k14178K38620k43242j29475J54319
$$ 203406 268846 119783 201369 419023 483735 269557 508177 264935 135460 289779
17412B89779C2090O3438J87803L7182J03627j01944P7682A24660h4188A55431
$$ 289779 32090 95528 283331 320513 424140 322196 399878 124660 -84188 155431
17401D94523B11180J83143J0620A28951J10439N3481E4069h8132k0868A82738
$$ 494523 211180 394323 404943 128951 239390 292871 54069 -88132 -109000 182738
17390C70756j68768F9178f3390A10542b44660E324L98241D3820K0530J23094l3503
$$ 370756 201988 69178 -63390 110542 -244660 5324 403565 43820 64350 187444 153941
17379A53941B516J60391d2178G1070a0405A76569J91750I5471J29587P464m7535
$$ 153941 2516 162907 -42178 71070 -10405 176569 368319 95471 225058 232522 184987
17368A84987l5347M3507l2396K51494g4418L3908A81874a63847C23242C6041a27179
$$ 184987 149640 193147 160751 412245 -74418 -40510 181874 -163847 323242 36041 -127179
17356B01325q3912m884B0313J96994p7395J75242m7213H0587N7660P0589i6596
$$ 201325 117413 112529 20313 217307 139912 315154 267941 80587 138247 208836 -96596
17344A51802J66199e2785A32553D2152J08296n5422J91267F9325A0972M6466Q3241
$$ 151802 318001 -52785 132553 42152 150448 95026 286293 69325 10972 57438 140679
17333A40679b4987G764P8424j9912j7225b8782A9879e2861A60271E3778J69917
$$ 140679 -24987 7764 86188 66276 49051 -28782 19879 -52861 160271 53778 223695
17322B23695C6574K24079J8661B0882K5973E178K38658a36949n7443M1564H4119
$$ 223695 36574 260653 279314 20882 46855 5178 243836 -136949 -194392 -152828 84119
17310B75257A30181k8739l278m5433c5334E5397M3395R6331H630J03068C7934
$$ 275257 130181 101442 98164 52731 -35334 55397 98792 195123 8630 111698 37934
17298C36994K5601A17823K23077j03531K22366G6846P2585a78914C47042J25495
$$ 336994 362595 117823 340900 237369 459735 76846 149431 -178914 347042 472537
17288D72537A11419B5426K79054A3502J03332K51187A04482j8135d3484I0639
$$ 472537 111419 25426 304480 13502 116834 368021 104482 86347 -43484 90639
17277A38527K26985g4586C91487A26321M2861K01263I5148b23332B01532J13072
$$ 138527 365512 -74586 391487 126321 169182 370445 95148 -223332 201532 314604
17267C14604l9726b15124C58005A64743K49869A52936N7985B2733R2090b3424
$$ 314604 274878 -215124 358005 164743 414612 152936 210921 22733 114823 -23424
17256i927B4938L71853A87421J12358o5105i8376I8962K02720J904r9883L25969
$$ -9927 24938 396791 187421 299779 234674 -98376 98962 301682 303586 203703 529672
17245E29672i3945D0324J69718L11232k10018R2280E7859L8280M50441B33736
$$ 529672 -93945 40324 210042 521274 311256 403536 57859 96139 546580 233736
17234B18902J1053a17675A35663K6415M82365l17432a20289B91313A09377K33942
$$ 218902 229955 -117675 135663 162078 644443 327011 -120289 291313 109377 343319
17224C43319j59906R6753A04934J39151m9646C2155P9817M77383k57707E5364
$$ 343319 183413 280166 104934 244085 194439 32155 111972 589355 331648 55364
17213G925K66218I8985a47593B58735G2469J29275J54294I0530K89162j7304f97
$$ 7925 274143 98985 -147593 258735 72469 201744 356038 90530 379692 362388 -697
17201B28566M619J10236j8791G3886A0001L56189o9182b45949C03690b60667C54838
$$ 228566 233185 343421 324630 73886 10001 366190 297008 -245949 303690 -260667 354838
17189D01582A67170R3814J43874A76193l8403M15998j53268A84461f1553F39344
$$ 401582 167170 260984 404858 176193 137790 553788 400520 184461 -61553 639344
17178A32591o3357J43221N7244K0756K86477q6993k25659J83881C6233L97233
$$ 132591 69234 212455 269699 290455 576932 489939 264280 448161 36233 433466
17168D33466K19C7040L59278K26207B38655J75596A44045K33291A75506B6342
$$ 433466 433685 37040 396318 622525 238655 414251 144045 377336 175506 26342
17157B49531q0584K43582A63915J62706r1802a48980D93066A12472K84927J30075
$$ 249531 168947 412529 163915 326621 234819 -148980 493066 112472 397399 527474
17147E27474k36354J51228j81143K06892A79080J99630H0390k1487L95759o5832
$$ 527474 291120 442348 261205 468097 179080 378710 80390 58903 454662 388830
17137C88830m3655j5309o7485K93540B72869J61918K8475j48728K15698B05398
$$ 388830 345175 329866 262381 555921 272869 434787 463262 314534 530232 205398
17126B10870n3151D7029K43787J14179n1096J57456A68300J80335A5428Q094M62119
$$ 210870 157719 47029 290816 404995 353899 511355 168300 348635 15428 23522 485641
17115D85641k33394j4661L44419B82978A31156L3574J63826K50247C7458N49353
$$ 485641 252247 237586 582005 282978 131156 164730 328556 578803 37458 586811
17105E86811A33922M33840j97103K61909p5321A55802L12655B21224J57764J63645
$$ 586811 133922 567762 370659 632568 557247 155802 468457 221224 378988 542633
17095E42633k26243q512K38781q0019j94817R6737J4356L42050m5464k90120J72170
$$ 542633 316390 307878 546659 466640 271823 368560 382916 724966 679502 389382 561552
17084E61552m2792k01452J8970L80030I5017M60531B4584N97618J2261j94150
$$ 561552 518760 317308 336278 716308 95017 555548 24584 622202 634463 440313
17074D40313A84987P04621l11192k33474K4530A54075K52303o2348J58555Q1589
$$ 440313 184987 889608 578416 344942 369472 154075 406378 344030 502585 584174
17064E84174J8337B38426K6148K3477L1313N00744C57150M73879k59374K70496
$$ 584174 602511 238426 264574 288051 319364 820108 357150 831029 571655 842151
17054H42151j94958q3750n1529K56826j80922n118B01234L37421j09030J94556
$$ 842151 647193 563443 511914 768740 587818 582700 201234 538655 429625 624181
17044F24181J39525j79431j38902K46552j71964P9298R9947l01978J24652B16732
$$ 624181 763706 584275 445373 691925 519961 599259 699206 397228 521880 216732
17033E23047P8004j86676L4732L16159j86692O3752j40787L49769k61026J17973
$$ 523047 601051 414375 449107 765266 578574 642326 501539 851308 590282 708255
17023G08255n9709L97195l04775r6117M1950k08345J7614r643J05887L25816L8149
$$ 708255 648546 1045741 740966 644849 686799 478454 496068 486425 592312 918128 956277
17012I56277j91856k48636J32136p6683B71808R6210L47286o3021l8598j27228
$$ 956277 764421 515785 647921 571238 271808 368018 715304 652283 613685 486457
17002D86457j20582L15607K87817j15777r976O1744j89998l2393K75247l56688
$$ 486457 365875 681482 969299 853522 843546 905290 715292 682899 958146 601458
16992F01458K57716j85017M88163m02083k83316R6166J24522J64505k70820P04867
$$ 601458 859174 674157 1162320 760237 476921 573087 697609 862114 591294 1296161
16982A296161n24000l13396L50489P7406L0513R9453K70025l61821p9088P2059
$$ 1296161 772161 458765 809254 886660 917173 1016626 1286651 924830 845742 917801
16972I17801K18634j93198p7358J50326m6602m00367J90698L34266m86919M36026
$$ 917801 1136435 943237 865879 1016205 969603 569236 759934 1094200 607281 1043307
16962A043307k19863J98342j48724l11791M70980J00384j48196j90487M82759
$$ 1043307 823444 1021786 873062 561271 1032251 1132635 984439 793952 1276711
16953A276711j71500L39P2059o1072j15244M8231J27191q2379M01028m09004J6681
$$ 1276711 1105211 1105550 1177609 1116537 1001293 1049524 1176715 1094336 1495364 1086360 1103041
16942A103041M76176j72329j86135J53045k59181L18762J02201k52184k46411
$$ 1103041 1579217 1406888 1220753 1373798 1114617 1433379 1535580 1283396 1036985
16933A036985L2680L26837M926k01542q2573k83199M37383N3064K51048r5773
$$ 1036985 1069665 1396502 1401428 1199886 1117313 834114 1271497 1324561 1575609 1479836
16923A479836J19036k29511P1998k71865K58996K9268k56587K41765j02256K66623
$$ 1479836 1598872 1369361 1441359 1169494 1428490 1457758 1201171 1442936 1340680 1607303
16913A607303k09870o6103J74316J3250r3793j38599J29216q0229M76355J5354
$$ 1607303 1397433 1331330 1505646 1518896 1425103 1286504 1415720 1335491 1811846 1827200
16903A827200l57055o734J02342M37786n53977K50475J66843q5432j58633P9572
$$ 1827200 1470145 1463411 1565753 2003539 1449562 1700037 1866880 1781448 1622815 1702387
16893A702387L3084K62700j32502L25777k13398j0823l8135K92569j84028o7301
$$ 1702387 1735471 1998171 1865669 2191446 1978048 1967225 1929090 2221659 2037631 1970330
16883A970330Q0281J65013r4692l5210M1706m6248L0541J13706K24982j46406
$$ 1970330 2050611 2215624 2120932 2085722 2127428 2081180 2111721 2225427 2450409 2304003
16873B304003k62875J02838K89304J93665k90443J65279k14107K62509J04817
$$ 2304003 2041128 2143966 2433270 2626935 2336492 2501771 2287664 2550173 2654990
16864B654990k00078J43605k30992M15805j5968M0533m1872L60696L9225N4705
$$ 2654990 2454912 2598517 2367525 2783330 2767362 2807895 2766023 3126719 3165944 3220649
16854C220649m36972J55743J69219J84048p0152K0261j90135L58841k86328K24917
$$ 3220649 2783677 2939420 3108639 3292687 3222535 3242796 3052661 3411502 3125174 3350091
16844C350091N70841m93510Q8025m25458L36629N77361l18557k3556L64603j58929
$$ 3350091 3920932 3427422 3515447 3089989 3426618 4003979 3685422 3661866 4026469 3867540
16834C867540J92219J45717J54355l54849K68483p3657J0117K34755K64728L46310
$$ 3867540 4059759 4205476 4359831 4004982 4273465 4199808 4209925 4444680 4709408 5055718
16824E055718l05963J49148M1498m21444L52786J60519j70747Q3481N96493P1562
$$ 5055718 4749755 4898903 4940401 4518957 4871743 5032262 4861515 4944996 5541489 5613051
16814E613051k46919J79771J62641K90109J9646R7023R2173O5371K76930J01329
$$ 5613051 5366132 5545903 5708544 5998653 6018299 6115322 6207495 6272866 6549796 6651125
16804F651125o8360K26443J98266q6110L0501K12661K79650J79826J54225K19258
$$ 6651125 6582765 6809208 7007474 6921364 6951865 7164526 7444176 7624002 7778227 7997485
16794G997485J00642L34521L8212J00296J72707L73121M96999k50791L96622K39750
$$ 7997485 8098127 8432648 8470860 8571156 8743863 9116984 9613983 9363192 9759814 9999564
16784I999564J36033L84634K24408N02833J08768M50557L57308K78240L48729
$$ 9999564 10135597 10520231 10744639 11247472 11356240 11806797 12164105 12442345 12791074
16775A2791074K67049L11088P45455L7234K39152M92873Q80792J99449M37574
$$ 12791074 13058123 13369211 14114666 14151900 14391052 14883925 15764717 15964166 16401740
16766A6401740M30687M41447P55527L24975P04750N56082O27990N58210Q64037
$$ 16401740 16832427 17273874 18029401 18354376 19059126 19615208 20243198 20801408 21665445
16757B1665445J154322N57150P55565R72856R80366Q23855Q72142J350349J156375
$$ 21665445 22819767 23376917 24132482 25105338 26085704 26909559 27781701 29132050 30288425
16748C0288425J155416J236958J486449J730470R89283J843751J597886J923361
$$ 30288425 31443841 32680799 34167248 35897718 36887001 38730752 40328638 42251999
16740D2251999J564671K423433K259694K160536K364165K533766K891146K826947
$$ 42251999 43816670 46240103 48499797 50660333 53024498 55558264 58449410 61276357
16732F1276357L143968L355851L717966L688750L743486M413226M127988M989842
$$ 61276357 64420325 67776176 71494142 75182892 78926378 83339604 87467592 92457434
16724I2457434M804743N023643N523350N584504N688342N896875O401705N994629
$$ 92457434 97262177 102285820 107809170 113393674 119082016 124978891 131380596 137375225
16716A37375225O336340N714075N889913N602098M741718M871187L996050L318511
$$ 137375225 143711565 149425640 155315553 160917651 165659369 170530556 174526606 177845117
16708A77845117K269836J502062N08839k83052j564858k411315k625606m457896
$$ 177845117 180114953 181617015 182125854 181842802 180277944 177866629 175241023 170783127
16700A70783127m528203n213621n791802n532364o270498o590139n960069o668200
$$ 170783127 166254924 161041303 155249501 149717137 143446639 136856500 130896431 124228231
16692A24228231n976716o225485n568290n709037n164706n365029m774954m630360
$$ 124228231 118251515 112026030 106457740 100748703 95583997 90218968 85444014 80813654
16684H0813654m449777l914002m151178l474413l327452l072861l134638k694175
$$ 80813654 76363877 72449875 68298697 64824284 61496832 58423971 55289333 52595158
16676E2595158k737512k454813k357701k075811j985577j455740k458631j314433
$$ 52595158 49857646 47402833 45045132 42969321 40983744 39528004 37069373 35754940
16668C5754940j679670j102557j867915j054627j171824j276230j098868q99095
$$ 35754940 34075270 32972713 31104798 30050171 28878347 27602117 26503249 25604154
16660B5604154q48811j291701q01638j046444n49048o32567j102905m27689o80075
$$ 25604154 24755343 23463642 22662004 21615560 21066512 20433945 19331040 18903351 18223276
16651A8223276m14184q92305m67730p73297l22129k54094o53066n80514j62047
$$ 18223276 17809092 16916787 16449057 15675760 15353631 15099537 14446471 13865957 13703910
16642A3703910k55948m14407m67523n13242l58462k46177q0774m89592m03142
$$ 13703910 13447962 13033555 12566032 12052790 11694328 11448151 11367377 10877785 10474643
16633A0474643l92742r0816k32552m83810J5802K02170q57017M0229k37690k28898
$$ 10474643 10081901 9991085 9758533 9274723 9290525 9492695 8635678 8675907 8438217 8209319
16623H209319n88292K41400m64289m7791j83018p5582m3086l04020j7550j34843
$$ 8209319 7621027 7862427 7398138 7350347 7167329 7091747 7048661 6744641 6727091 6592248
16613F592248k18213J05039l23725k5832m85372j58079P310j79329k37204j47058
$$ 6592248 6374035 6479074 6155349 6129517 5644145 5486066 5493376 5314047 5076843 4929785
16603D929785N6889K5104j98061q6457J59419O0218l89790K73514k98879J72073
$$ 4929785 4986674 5011778 4813717 4727260 4886679 4946897 4557107 4830621 4531742 4703815
16593D703815p20935L57048l17491m6634O6368o7969p3848k01119r0257k25912
$$ 4703815 3982880 4339928 4022437 3975803 4042171 3974202 3900354 3699235 3608978 3383066
16583C383066L40927j83659o7376r3802K16841k80879k75402J45329M4057m5487
$$ 3383066 3723993 3540334 3472958 3379156 3595997 3315118 3039716 3185045 3229102 3183615
16573C183615J17999m90754L99311k20202J41494l46842K47463k30707m1971j28179
$$ 3183615 3301614 2810860 3210171 2989969 3131463 2784621 3032084 2801377 2759406 2631227
16563B631227j75125K49792l12693J17619P6804j40343N397j38085q4968O7130
$$ 2631227 2456102 2705894 2393201 2510820 2587624 2447281 2452678 2314593 2229625 2296755
16553B296755R8892K179j40139j4937l21254j0604L81733n45362Q2740M18659
$$ 2296755 2395647 2397826 2257687 2242750 1921496 1910892 2292625 1747263 1830003 2248662
16543B248662l01133j4571j04225Q9237k33141L30427k82788L41810k57525R9113
$$ 2248662 1947529 1932958 1828733 1917970 1684829 2015256 1732468 2074278 1816753 1915866
16533A915866j80865j45304K02229O0903j22511n3322j76170R3812M644k59158
$$ 1915866 1735001 1589697 1791926 1852829 1730318 1676996 1500826 1594638 1599282 1340124
16523A340124M23161k62689k56146J45997N49391n25843J11769J4570j48482j12823
$$ 1340124 1763285 1500596 1244450 1390447 1939838 1413995 1525764 1540334 1391852 1279029
16513A279029N201K66736l34201R1093J10899j59122n1994J78571O477k50162
$$ 1279029 1284230 1550966 1216765 1307858 1418757 1259635 1207641 1386212 1392689 1142527
16503A142527k64465N07048p2213p3256m4966o3018n7917K52728l13063j13046
$$ 1142527 878062 1385110 1312897 1239641 1194675 1131657 1073740 1326468 1013405 900359
16493I00359O5097K13210l72795K08441J06295K9109j69368k53788N14390o7105
$$ 900359 965456 1178666 805871 1014312 1120607 1149716 980348 726560 1240950 1173845
16483A173845l90765K44604j6289m0304j43184R7374J0278O6647k6802o9299K35727
$$ 1173845 783080 1027684 1011395 971091 827907 925281 935559 1002206 975404 906105 1141832
16472A141832k96673k7123q6614L14376J30123l45425J16484O9127j07208l7004
$$ 1141832 845159 818036 731422 1045798 1175921 830496 946980 1016107 908899 871895
16462H71895D11676O71863j83433J19285j42218K2821P277j67545k39054J14938
$$ 871895 411676 1083539 900106 1019391 877173 899994 907271 739726 500672 615610
16452F15610L0166J31214j44646J33727K03439J56735D67950M54060k75574k63230
$$ 615610 645776 776990 632344 766071 969510 1126245 467950 922010 646436 383206
16442C83206K02193R3885j31257j3544j47773J37402N88139k83107p7097p4071
$$ 383206 585399 679284 548027 534483 386710 524112 1112251 829144 752047 677976
16432F77976k5088k43452J10836O08460D80064K67782J4433l49303L62476l11287
$$ 677976 652888 409436 520272 1128732 480064 747846 762279 412976 775452 464165
16422D64165K00181j67257m1726J78261j37907L2526A77440E3283O98009l8947
$$ 464165 664346 497089 455363 633624 495717 528243 177440 53283 751292 712345
16412G12345k70689M35239m34971j2094C9184M34025m5023J25402k74581f8188
$$ 712345 441656 876895 441924 429830 39184 473209 428186 553588 279007 -68188
16401E57650R815O728K49010C79312K27500j21322K51044l25511J05972J07509
$$ 557650 567465 574193 823203 379312 606812 485490 736534 411023 516995 624504
16391F24504E1264O74651m0265C25619J33536j76454M48799j96664l7554k38825
$$ 624504 51264 725915 685650 325619 459155 282701 731500 534836 497282 258457
16381B58457M34967B82721K45190A94207L7970R4881J28401r7703D0716M86884
$$ 258457 693424 282721 527911 194207 232177 327058 455459 357756 40716 527600
16371E27600l2510j05091J84872j74884m264j91953H3318J85140c4730A11507
$$ 527600 495090 389999 574871 399987 395723 203770 83318 268458 -34730 111507
16360B29538J86769n7699m493A03813J37118p5930n425J85419J62578B52491K43721
$$ 229538 416307 358608 354115 103813 240931 165001 159576 344995 507573 252491 496212
16349D96212M4701k08369E9583P1787L27030J44089j51440p0587J25150k15141
$$ 496212 540913 332544 59583 131370 458400 602489 451049 380462 505612 290471
16339B90471m6656N079J36312r202C1012J29723K28323J24698k38063g0051B86582
$$ 290471 243815 248894 385206 376004 31012 160735 389058 513756 275693 -70051 286582
16327h0249B85828a29567C5774d5248B05999G7081j0554M84084B26863l200J82919
$$ -80249 285828 -129567 35774 -45248 205999 77081 66527 550611 226863 223663 406582
16316D06582A75067l3689L72969B22782f0919A69161J66695M9710A78566o5021
$$ 406582 175067 141378 514347 222782 -60919 169161 335856 385566 178566 113545
16306A13545q577J78463b0511E05102m3118k29272J24211c9340A01475L63701
$$ 113545 104968 283431 -20511 505102 461984 232712 356923 -39340 101475 465176
16296D65176r5185j2761A68504a07231a3711M026H9638J00611J62749j09056j2675
$$ 465176 369991 357230 168504 -107231 -13711 -9685 89638 190249 352998 243942 231267
16285B31267J59883j70922b3828A63212C0682A3622L36064A11214c21298B75442
$$ 231267 391150 220228 -23828 163212 30682 13622 349686 111214 -321298 275442
16274A87437c0277C19684A7438L58883j16069h9866B44206A15583P0536b6618
$$ 187437 -30277 319684 17438 376321 260252 -89866 244206 115583 186119 -26618
16263B72099F7567I485J76985j9888J74512b58937C57877a25504C50542q708A05115
$$ 272099 67567 9485 186470 166582 341094 -258937 357877 -125504 350542 341834 105115
16251A95402J08975r8642J52058j39067l5308J91412P8518L9579I641K5454M8920
$$ 195402 304377 205735 357793 218726 183418 374830 453348 492927 9641 35095 84015
16240H4015f3430A27600l1921c4501l81580d3445B5485b050A80089m7561b1020
$$ 84015 -63430 127600 95679 -34501 -416081 -43445 25485 -2050 180089 132528 -21020
16228G3370b76963A58445F8881A9868K14049r8178M15324A80794a38950A08384
$$ 73370 -276963 158445 68881 19868 233917 135739 551063 180794 -138950 108384
16217B74465C212f0795A93816m5905f6876B47831G5300h6491A26105b58956C13125
$$ 274465 3212 -60795 193816 147911 -66876 247831 75300 -86491 126105 -258956 313125
16205A80327d6997A246N0586J16834b562l9425E5334Q8595A3276K14678b18747
$$ 180327 -46997 1246 51832 168666 -2562 -41987 55334 143929 13276 227954 -218747
16193B39052H4545f3194A46833c0524A65616n9890O7503J56204e1934B78141F7950
$$ 239052 84545 -63194 146833 -30524 165616 105726 173229 329433 -51934 278141 67950
16181D2545J12438R6987A05726Q1494K05634b8363q451k95830C42215e1464B17492
$$ 42545 154983 251970 105726 187220 392854 -28363 -36814 -332644 342215 -51464 217492
16169A30967B1491f5984C25726j50562a28493F0253K49212m6467j25399d8448
$$ 130967 21491 -65984 325726 175164 -128493 60253 309465 262998 137599 -48448
16158C05048j28496b85048M3088C6102d6740m5805A57643b20267j20581C27845
$$ 305048 176552 -285048 -241960 36102 -46740 -92545 157643 -220267 -340848 327845
16147I7401J39688C6423Q5207b14848i2501k40219c9054A84006e6324k31710F0019
$$ 97401 237089 36423 121630 -214848 -92501 -332720 -39054 184006 -56324 -288034 60019
16135c8304j27071I4376J94126A6440L0271J09268E6886E620P1393b063j50815
$$ -38304 -165375 94376 288502 16440 46711 155979 56886 5620 77013 -2063 -152878
16124a52878A83894a30114B39727a20520H8062B0231Q1920l6472J1864C1101L92218
$$ -152878 183894 -130114 239727 -120520 88062 20231 102151 65679 77543 31101 423319
16113D23319E3454j8898f1096J0242j18085F8312N9467a60847q6150h5936F3675
$$ 423319 53454 34556 -61096 -50854 -168939 68312 127779 -160847 -246997 -85936 63675
16101I1603a63830d8597B5668J81808K3356J97195a2341G7933Q9263j1352E4254
$$ 91603 -163830 -48597 25668 207476 230832 428027 -12341 77933 167196 155844 54254
16089b0606A53649B3017L20468C5480K26527I1264a13569L5168B72604a89081
$$ -20606 153649 23017 343485 35480 262007 91264 -113569 -78401 272604 -189081
16078i9730A35943g7257j98202A15180J76623b07978h5397J9945C26984C5300
$$ -99730 135943 -77257 -275459 115180 291803 -207978 -85397 -65452 326984 35300
16067I7746d0261r0258L2454J7315c2627B48344b27988A69552c4314A26097a38953
$$ 97746 -40261 -130519 -98065 -80750 -32627 248344 -227988 169552 -34314 126097 -138953
16055C6210d0149j37891N3471A62529B2a82957A11102g9918j74332j29829B51617
$$ 36210 -40149 -178040 -124569 162529 22 -182957 111102 -79918 -254250 -384079 251617
16043C85510g6550j91276p2732a7124C05567A25591D894a22184d1943j14625A63661
$$ 385510 -76550 -267826 -340558 -17124 305567 125591 4894 -122184 -41943 -156568 163661
16031A73938b0531A77480M3878a08145L4968j2721j5230p4480g88j68326E9876
$$ 173938 -20531 177480 221358 -108145 -73177 -85898 -101128 -175608 -788 -169114 59876
16019B3122i4902q4508B12720a34915A61750a86994D5371J83723m2465H7430a76334
$$ 23122 -94902 -179410 212720 -134915 161750 -186994 45371 229094 186629 87430 -176334
16007H3929M8949c63655A46209f6403B31442e3941C40193a9832l28261a67936
$$ 83929 132878 -363655 146209 -66403 231442 -53941 340193 -19832 -348093 -167936
15996A93483a06936J1184R053J0464l9502B13253A6419b65825D670J8289R5138
$$ 193483 -106936 -95752 -86699 -76235 -115737 213253 16419 -265825 4670 22959 118097
15985A18097B6198O7706c17161A94059J8764k5113G1383R932N5310K02974a14157
$$ 118097 26198 93904 -317161 194059 212823 187710 71383 81315 136625 339599 -114157
15973B8445a96084H5476R6161R8305r2161a21434A53466o4385J75057L0953G9118
$$ 28445 -196084 85476 181637 279942 187781 -121434 153466 89081 264138 295091 79118
15961A1069L7294N9118A1213Q4549K5178h829q5901A3228e5974I5021M9974m5794
$$ 11069 48363 107481 11213 95762 120940 -8829 -94730 13228 -55974 95021 144995 99201
15949I9201k8084e5081A19421q195O418h7828A42149d6154j5055k99939a16543
$$ 99201 71117 -55081 119421 111226 117644 -87828 142149 -46154 -61209 -361148 -116543
15937A56335C4424p91a4273p8909k42883J23077h1499m3103E09660f0976B08740
$$ 156335 34424 33633 -14273 -93182 -336065 -212988 -81499 -124602 509660 -60976 208740
15925a423r5401A61007g0654k78510a16530B4254b92995P5126P1321c9991A03485
$$ -1423 -96824 161007 -70654 -349164 -116530 24254 -292995 -217869 -146548 -39991 103485
15913A35550K22329d7394m1232D0932c6880j9341B23343a03180j66297a34284
$$ 135550 357879 -47394 -88626 40932 -36880 -56221 223343 -103180 -269477 -134284
15902B802b84369c6232k06846J19663A57339b19246A49423a70898m0330J7622
$$ 2802 -284369 -36232 -243078 -123415 157339 -219246 149423 -170898 -211228 -193606
15892a93606h4877k8112H0193a04505b532I6803a03282B18184L4903b64643A76694
$$ -193606 -84877 -112989 80193 -104505 -2532 96803 -103282 218184 253087 -264643 176694
15880b81004I0920b8150n9127A81998K2770p6719b08678A9092i7645M4457B0845
$$ -281004 90920 -28150 -87277 181998 204768 128049 -208678 19092 -97645 -53188 20845
15868a20361G1616a26742j3409e6090b3729h241A59646b5526n6573k10342a21231
$$ -120361 71616 -126742 -140151 -56090 -23729 -8241 159646 -25526 -82099 -292441 -121231
15856e3443F73c10949e8590L231k12019l7080c6136m03844A27516a03794j56523
$$ -53443 673 -310949 -58590 -55359 -267378 -304458 -36136 -439980 127516 -103794 -260317
15845b60317A77625d6658H8581d1903A28450b66506A71942k2144f8618B19354
$$ -260317 177625 -46658 88581 -41903 128450 -266506 171942 149798 -68618 219354
15834A79063b96687D4887J13510J03896b00116O1479B66802a43867I0247H973
$$ 179063 -296687 44887 158397 262293 -200116 -138637 266802 -143867 90247 8973
15823b35400G5564a76573A11790d7067p1104M1075h382A72853c27872A84060b23154
$$ -235400 75564 -176573 111790 -47067 -118171 -77096 -8382 172853 -327872 184060 -223154
15811b58160A14380b57528A06023E610a8813H3134J11697f2887A01020J53938
$$ -258160 114380 -257528 106023 5610 -18813 83134 194831 -62887 101020 254958
15801B54958B2470K1237a53292k7176l2685j54970H560K7134Q0521a12621A55219
$$ 254958 22470 43707 -153292 -180468 -213153 -368123 8560 35694 116215 -112621 155219
15789c4377B7349J179a70421c6341E2737d80381f7735B26897a10656j23428A2414
$$ -34377 27349 28528 -170421 -36341 52737 -480381 -67735 226897 -110656 -234084 12414
15777A61188b13583p3890E21549a68790L5157a7332j21930B34442b0643k3448
$$ 161188 -213583 -287473 521549 -168790 -133633 -17332 -139262 234442 -20643 -44091
15767d4091E0386A8273d1800k0291q0196c0711r0031K3351k07410J09201j274
$$ -44091 50386 18273 -41800 -62091 -142287 -30711 -120742 -97391 -304801 -195600 -196874
15756a96874A63736D879J24542c58415J21520L6436n5433E093a91416h8807j14410
$$ -196874 163736 4879 129421 -358415 -236895 -200459 -255892 5093 -191416 -88807 -203217
15745b03217c8002H1121K85412E506J2339P489L9960b44659l1843e9644B42523
$$ -203217 -38002 81121 366533 5506 17845 25334 65294 -244659 -276502 -59644 242523
15733c4267p6062c8545j87357a01838L8286k015n8195M1762O061A43282d5159
$$ -34267 -110329 -38545 -225902 -101838 -63552 -65567 -123762 -82000 -75939 143282 -45159
15721B56470b71672A14225b24429j93789e0180I2733a60239n6779O6833a3371
$$ 256470 -271672 114225 -224429 -418218 -50180 92733 -160239 -217018 -150185 -13371
15710c33993a42776A74509B4475b4056m5945A51256a65511r883L9476m8183H3065
$$ -333993 -142776 174509 24475 -24056 -70001 151256 -165511 -175394 -135918 -184101 83065
15698I5303g82A05567c52968R4352A41978h4309e134l1523k01021B24548D69a00068
$$ 95303 -782 105567 -352968 -258616 141978 -84309 -5134 -36657 -237678 224548 469 -100068
15685a60123e8393j98564A33327d2748A5543K36347m2799p9279a79005B16718
$$ -160123 -58393 -256957 133327 -42748 15543 251890 209091 129812 -179005 216718
15674d7447a4070k15721a04256d8355j76453C4746J9641g108m4977A3846Q8105
$$ -47447 -14070 -229791 -104256 -48355 -224808 34746 54387 -7108 -52085 13846 101951
15663A01951J59936e0559A07116j4251b1151j08610H656h43A47825c1253A70018
$$ 101951 261887 -50559 107116 92865 -21151 -129761 8656 -843 147825 -31253 170018
15651b03047j1665e2604C74951a45109p5556C00291H3232a56012A19693R7936
$$ -203047 -214712 -52604 374951 -145109 -220665 300291 83232 -156012 119693 217629
15641B17629h0655B43152A14902K868J6182a90120A30653O450c78575A83152g8852
$$ 217629 -80655 243152 114902 117770 133952 -190120 130653 137103 -378575 183152 -78852
15629A79096e1534j33781j8600M8171A96371a30469C51610e2607A56356a03322
$$ 179096 -51534 -185315 -203915 -155744 196371 -130469 351610 -52607 156356 -103322
15618A16485A5418a21700n4345A03555R3018e6717j37277j55116R0739a17363
$$ 116485 15418 -121700 -176045 103555 196573 -56717 -193994 -349110 -258371 -117363
15607C67235g1513H9123J64845a39634H1824N0182c93178A51202c91098H0701
$$ 367235 -71513 89123 253968 -139634 81824 132006 -393178 151202 -391098 80701
15596h9676H471i8703A57514r587N6225d9758J5346A64779O509a9482o5428k4510
$$ -89676 8471 -98703 157514 147927 204152 -49758 -34412 164779 171288 -19482 -84910 -109420
15584a09420e1676j88449a00117B55102F8387b7999A36555Q7564M6782B4299L22379
$$ -109420 -51676 -240125 -100117 255102 68387 -27999 136555 224119 270901 24299 346678
15573C46678D8019M3976A4992J24599a91434B9641J90365I873a61536A68141a34482
$$ 346678 48019 91995 14992 139591 -191434 29641 220006 9873 -161536 168141 -134482
15561e3153B08960a2157C03258j41805a03610o5207O7452j60522C23586c6088
$$ -53153 208960 -12157 303258 161453 -103610 -168817 -101365 -261887 323586 -36088
15550b85671B35330A04783b22123O0946A50942c58149f7605D0477a60301N7155
$$ -285671 235330 104783 -222123 -161177 150942 -358149 -67605 40477 -160301 -103146
15540a03146j5771C45507f8279k3266C81630b86527d8850m21730I1812a66004
$$ -103146 -118917 345507 -68279 -91545 381630 -286527 -48850 -470580 91812 -166004
15529C00381l0982r4330C1642J01106d7023A13620q191g6257r8160A93059m4297
$$ 300381 269399 175069 31642 132748 -47023 113620 105429 -76257 -174417 193059 148762
15518A48762d9400j70528E4051c02802a12483A61379b1188F5695c20298J54917
$$ 148762 -49400 -219928 54051 -302802 -112483 161379 -21188 65695 -320298 -165381
15508a65381E3126d8273C24249j53621c9365j05708c5389n0776B61076b37672
$$ -165381 53126 -48273 324249 170628 -39365 -145073 -35389 -86165 261076 -237672
15497A30146J57798C5771b35666B8936b8270C1606f0569j3940m16674E4720K06829
$$ 130146 287944 35771 -235666 28936 -28270 31606 -60569 -74509 -491183 54720 261549
15486B61549g4166j75858B39602c8627k75143A62016C1288a41940j92754P9487
$$ 261549 -74166 -250024 239602 -38627 -313770 162016 31288 -141940 -334694 -255207
15476b55207f6238b6108j99791G138b83983A2279J81530D9576b480A47023E9125
$$ -255207 -66238 -26108 -225899 7138 -283983 12279 193809 49576 -2480 147023 59125
15464i3608A31353k1714A0401a67277b1728e488A36184f3140A32281o0566f8848
$$ -93608 131353 109639 10401 -167277 -21728 -5488 136184 -63140 132281 71715 -68848
15452A0204b0597k13548a08342G1352G278K10002A4817f0030K3889q3082M0577
$$ 10204 -20597 -234145 -108342 71352 7278 217280 14817 -60030 -36141 -119223 -78646
15441g8646I9454K0475a45408j03516n6731A11531a2349m651A99092c3371A0130
$$ -78646 99454 119929 -145408 -248924 -305655 111531 -12349 -17000 199092 -33371 10130
15429B48239j17730a27713c9946A66694d9991C34961A13304d910B54213j03953
$$ 248239 130509 -127713 -39946 166694 -49991 334961 113304 -4910 254213 150260
15419A50260J77341A0015Q807c0330B91548E1896J66551F2321J00744D4644J8880
$$ 150260 327601 10015 18822 -30330 291548 51896 218447 62321 163065 44644 63524
15408F3524a67683A51755b97579h7944m0363I1077a46682l5800A07821g6875l707
$$ 63524 -167683 151755 -297579 -87944 -128307 91077 -146682 -182482 107821 -76875 -80582
15397h0582j12076A44133h598A29964a04725j5148j93960q8097B24156a87441
$$ -80582 -192658 144133 -8598 129964 -104725 -119873 -313833 -401930 224156 -187441
15386B09869b638B21489d663C81618F9420c401o0651l803B97987C528a22915k4422
$$ 209869 -2638 221489 -4663 381618 69420 -3401 -64052 -67855 297987 3528 -122915 -147337
15374a47337A5072d8271p7500A61880F2024a71016f3232C6110i4941B46883J03013
$$ -147337 15072 -48271 -125771 161880 62024 -171016 -63232 36110 -94941 246883 349896
15363C49896a02675c6063n1990j63184A87991E9621M82481a29154B9697A058a43526
$$ 349896 -102675 -36063 -88053 -251237 187991 59621 542102 -129154 29697 1058 -143526
15351A2869a26451B06847g6821Q253I9775P5535L1694m4737i9300K8741B43593
$$ 12869 -126451 206847 -76821 -68568 99775 175310 207004 162267 -99300 -70559 243593
15339c4683j27258A16382R4846b40387A42795b0381j70924A869a52769o947K4300
$$ -34683 -161941 116382 211228 -240387 142795 -20381 -191305 1869 -152769 -159716 -135416
15328a35416D0978a37764e207j45098B47859N1189e9145A68740a24456B8350a57860
$$ -135416 40978 -137764 -5207 -150305 247859 299048 -59145 168740 -124456 28350 -157860
15316I8490b0591B2182R545O6660J02217N6017b17781c0222k17923L7927c0004
$$ 98490 -20591 22182 31727 98387 200604 256621 -217781 -30222 -248145 -210218 -30004
15304a88651A32291a7654j01868d8544j04613J0655m9480E54076e717j33891E0281
$$ -188651 132291 -17654 -119522 -48544 -153157 -142502 -191982 554076 -5717 -139608 50281
15292a52724H6145l3641J45739H7092K25855a9094j71184A28853m9786J02183
$$ -152724 86145 52504 198243 87092 312947 -19094 -190278 128853 79067 181250
15282A81250B6224a46901b4562F9605a02933j4112A6352a70314j9005A99369p8234
$$ 181250 26224 -146901 -24562 69605 -102933 -117045 16352 -170314 -189319 199369 121135
15271A21135b17235B7363J71412a6041j18824B50287A0687L3337a7311A8474N4878
$$ 121135 -217235 27363 198775 -16041 -134865 250287 10687 44024 -17311 18474 73352
15260G3352L18964j9604a91892C7071a51173A32882D0214L86878H2901M7348b4817
$$ 73352 392316 372712 -191892 37071 -151173 132882 40214 427092 82901 130249 -24817
15248b3191A8132J43040b2104E6129M1100K84414j84791j0923G6378O1038m0092
$$ -23191 18132 161172 -22104 56129 97229 381643 196852 185929 76378 137416 97324
15237I7324R8976M9577L47039M99756J88543l44982L91912l60764l40095B06148
$$ 97324 196300 245877 592916 1092672 1281215 936233 1328145 967381 627286 206148
15226H507L44192A69442J28437c0343j29453E0781a53658A42126O9257a7454k3495
$$ 8507 352699 169442 297879 -30343 -159796 50781 -153658 142126 211383 -17454 -40949
15215d0949J0617A54567D0120b53045B8705a75607F5283O6175l3408m5771a58841
$$ -40949 -30332 154567 40120 -253045 28705 -175607 65283 131458 98050 52279 -158841
15203i02B88064o7426b37390i2949D2203P2240J45838A24429E7442e0795o4694
$$ -902 288064 220638 -237390 -92949 42203 114443 260281 124429 57442 -50795 -115489
15192a15489F6177b6548B931a02121h461A69566J1103h5535B78301e6024I2022
$$ -115489 66177 -26548 2931 -102121 -8461 169566 180669 -85535 278301 -56024 92022
15180B16674b28696B19382d07155B73964f081B14947L5741p2950E0460d1397B57926
$$ 216674 -228696 219382 -407155 273964 -6081 214947 250688 177738 50460 -41397 257926
15168a20325H9035c8052a0248j80995M8585n1580R2260j47988A85496G3320J42165
$$ -120325 89035 -38052 -10248 -191243 -142658 -194238 -101978 -249966 185496 73320 215485
15157B15485a24133c9785o6497d5370A92358a12646K2493C1449J7212K89197e565
$$ 215485 -124133 -39785 -106282 -45370 192358 -112646 -90153 31449 48661 337858 -5565
15145A97111O3713G8932B9705H5J82616h1731A22416J77683i0974B4050a13812
$$ 197111 260824 78932 29705 85 182701 -81731 122416 300099 -90974 24050 -113812
15133h7526A85930d507k9211F3818k2099k0382f47C54498H2137g7261B15965D6940
$$ -87526 185930 -4507 -33718 63818 41719 21337 -647 354498 82137 -77261 215965 46940
15120B35740L7843A629e8278r2142A26898B8995M34339b70818A96061a21167A45556
$$ 235740 273583 1629 -58278 -150420 126898 28995 463334 -270818 196061 -121167 145556
15108A36068k9483b9960B80085a23696B27307L6784b13439A3964f0754j1000C4323
$$ 136068 106585 -29960 280085 -123696 227307 264091 -213439 13964 -60754 -71754 34323
15096H7042J37565n657b0144C73436k669A3084N2835a30303K8571l444F1144c6696
$$ 87042 224607 218950 -20144 373436 370767 13084 65919 -130303 -101732 -105176 61144 -36696
15083A2358J68077m2506m1073M6125R3745L7539Q3141r6937d5663A03009I910
$$ 12358 180435 137929 96856 142981 236726 274265 357406 260469 -45663 103009 9910
15071A11259O1262F4495K25395d2623A60145K86936j5694E5639P5697J1121L02921
$$ 111259 172521 64495 289890 -42623 160145 447081 431387 55639 131336 142457 445378
15060D45378C0820a51636D60228r9960H4712M77630k74363C1003Q944a34633D52094
$$ 445378 30820 -151636 460228 360268 84712 562342 287979 31003 39947 -134633 452094
15048I7640K0551J22846J53509n3211b8759m0649K1761B01889q5272n7009K46240
$$ 97640 118191 241037 394546 341335 -28759 -69408 -47647 201889 116617 59608 305848
15037C05848g062C20246A36782O5946M1351a17707A47944M3854m4188B2152a41015
$$ 305848 -7062 320246 136782 202728 244079 -117707 147944 191798 147610 22152 -141015
15025a750H9210J87926H8964e8110o7509A21682L57388A04590J44013G4508J9429
$$ -1750 89210 277136 88964 -58110 -125619 121682 479070 104590 248603 74508 93937
15014I3937K66176A75127K30305I9391h3326D51291F9111P8023J30255M250J19564
$$ 93937 360113 175127 405432 99391 -83326 451291 69111 147134 277389 281639 401203
15003D01203j55826l0207Q1109O0981q8768j5594G5089J52463J97028j1456d6757
$$ 401203 245377 215170 296279 357260 268492 252898 75089 227552 424580 413124 -46757
14991D69378f4264B44874J86178d4915C74511K13325G3194K11014j3293E2938
$$ 469378 -64264 244874 431052 -44915 374511 587836 73194 284208 270915 52938
14980B34382R4268A48440A7608J49408K37011H0465j7865J69678k7475L3802j6729
$$ 234382 328650 148440 17608 167016 404027 80465 62600 232278 204803 238605 221876
14969B21876m2102N598L2864n4093K18786H5091J72077N3440A50675G3719L32535
$$ 221876 179774 185372 218236 164143 382929 85091 257168 310608 150675 73719 406254
14958D06254j26657J0474p9045O3956C0284J40424C506K17035l373n2016k1244
$$ 406254 279597 290071 211026 274982 30284 170708 3506 220541 217168 165152 143908
14947A43908L35682j39435q3707r0387K1365q3072K7313B3098J98254j8584N8886
$$ 143908 479590 340155 256448 166061 187426 104354 131667 23098 221352 202768 261654
14936B61654R8619m4267J38883B20637K04075A32440J18317L4720o4309J59201
$$ 261654 360273 316006 454889 220637 424712 132440 250757 285477 221168 380369
14926C80369P8120E2852K10610J16467j22246j11779K8745c3619G19908A24213
$$ 380369 458489 52852 263462 379929 257683 145904 174649 -33619 719908 124213
14915D7066A6249K65287J19405B00427L58452k54050A28322J53811l285I9576
$$ 47066 16249 281536 400941 200427 558879 304829 128322 282133 278848 99576
14904G8185K25515K30258L9191k50697A22144K14911n2216L46196B56466J75211
$$ 78185 303700 533958 573149 322452 122144 337055 284839 631035 256466 431677
14894D31677K08316J6786A65557K22637A02522L88888j77422q123l5187H4555
$$ 431677 639993 656779 165557 388194 102522 491410 313988 305865 270678 84555
14883B84929D0553L39271j32450j17164L94349A27448k4645K79715j58288C9426
$$ 284929 40553 379824 247374 130210 524559 127448 102803 382518 224230 39426
14872B61971J8592K6649o5020k5224J89478A31213L90087M750j92239K86875H9963
$$ 261971 280563 307212 242192 216968 406446 131213 521300 526050 333811 620686 89963
14860B45619J01100j55295O1198M7571J88646j22563C7993O11784k75476j81581
$$ 245619 346719 191424 252622 300193 488839 366276 37993 649777 374301 192720
14850A92720K26611j12368b2908E34710r9431J68571J58684C41799E6559M30400
$$ 192720 419331 306963 -22908 534710 435279 603850 762534 341799 56559 486959
14840D86959O1946B3018L86575K25521k02460K1713k09909K43677j92527L2264
$$ 486959 548905 23018 409593 635114 432654 454367 244458 488135 295608 327872
14830C27872J61735q6107L25474C05666M7511J38830j75811J05900o7502J74945
$$ 327872 489607 403500 728974 305666 353177 492007 316196 422096 354594 529539
14820E29539o5210J34741B53948K99106j87106M4467p2206K16696k66852r6011
$$ 529539 464329 599070 253948 553054 365948 410415 338209 554905 288053 192042
14810A92042K45715p494J14321O2617B33966C4060K50662J7691Q9072P1751J21566
$$ 192042 437757 430263 544584 607201 233966 34060 284722 302413 391485 463236 584802
14799E84802k02687J78261o7019l1872j7751j92817M68738j43548O2497j41681
$$ 584802 382115 560376 493357 461485 443734 250917 719655 576107 638604 496923
14789D96923K2272M40594D75733k0591J32673l1416m0837k44211J03852j2178
$$ 496923 519195 959789 475733 455142 587815 556399 515562 271351 375203 363025
14779C63025O1725K91533k07559J575A16147K59029N3864K20799m6487B09627
$$ 363025 424750 716283 508724 510299 116147 375176 429040 649839 603352 209627
14768G0345J29839N85070k66830j4107J45887M7260J81934k59278J18287C54227
$$ 70345 200184 785254 518424 504317 650204 697464 879398 620120 738407 354227
14757C15049N40418p3778j94442L27260k55691C23087J76819J88794k1470N3147
$$ 315049 855467 781689 587247 914507 658816 323087 499906 688700 667230 720377
14747G20377B77788O86399D34343K93177k27215K22687B67704K42983M4094J06102
$$ 720377 277788 964187 434343 727520 500305 722992 267704 510687 554781 660883
14737F60883P5795j41928L72085k63450K47119k69794J44154k14098k61496L37795
$$ 660883 736678 594750 966835 703385 950504 680710 824864 610766 349270 687065
14727F87065Q8330k94390k9779O2154J48286J61250M4915L65198n01785k32446
$$ 687065 775395 481005 451226 513380 661666 822916 867831 1233029 731244 498798
14717D98798R0471J0733J22502j6375J12076l00226K43863J43346n8234o671r008
$$ 498798 589269 600002 722504 706129 818205 517979 761842 905188 846954 840283 831275
14706H31275P3182k96992J83262J19285l56249O9312L11459N648j1414J38262
$$ 831275 904457 607465 790727 910012 553763 623075 934534 940182 928768 1067030
14696A067030k50566O8715J71020j48833j64669J5458K31171k41474p0125L11709
$$ 1067030 816464 885179 1056199 907366 742697 758155 989326 747852 677727 989436
14686I89436j08902q5820K6884l63342L86187j90272L26741j70577p7542o6053
$$ 989436 880534 794714 821598 458256 844443 654171 980912 810335 732793 666740
14676F66740J76377J12509j8659K1903Q0247Q707j26622R1448J21744l37607j9142
$$ 666740 843117 955626 936967 958870 1039117 1047824 921202 1012650 1134394 796787 777645
14665G77645M32846k26459K27361j97401l018J12648l19477J23843j03555L58231
$$ 777645 1210491 984032 1211393 1013992 1010974 1123622 804145 927988 824433 1182664
14655A182664j56241J87236k15407R0450j13423N3779j34047Q0198L81068j62992
$$ 1182664 1026423 1213659 998252 1088702 975279 1029058 895011 975209 1356277 1193285
14645A193285j17182o5253j34493L15479j50136n0854j1118M13049l92481K39783
$$ 1193285 1076103 1010850 876357 1191836 1041700 990846 979728 1392777 1000296 1240079
14635A240079R3542o8765k33994J08516l6904J96228j01993j10423J57762K27605
$$ 1240079 1333621 1264856 1030862 1139378 1102474 1298702 1196709 1086286 1244048 1471653
14625A471653j14887j81991M03123M4068l36775K71944k38687K596j99712j46158
$$ 1471653 1356766 1174775 1577898 1621966 1285191 1557135 1318448 1321044 1121332 975174
14615I75174O74184l72620J846J00261p7858M97449k25027l15571J31707J5708
$$ 975174 1649358 1276738 1278584 1378845 1300987 1798436 1573409 1257838 1389545 1405253
14605A405253J56057p8038l04428J28127J29826k29876K08325K42995J2848k2757
$$ 1405253 1561310 1483272 1178844 1306971 1436797 1206921 1415246 1658241 1671089 1648332
14595A648332k8603k50832J31148j02195J54995J80210k37880K39854j48086M9206
$$ 1648332 1619729 1368897 1500045 1397850 1552845 1733055 1495175 1735029 1586943 1636149
14585A636149M01097k42319j07075k15454K4557L0881L92821m33403J23147k4643
$$ 1636149 2037246 1794927 1687852 1472398 1496955 1527836 1920657 1487254 1610401 1585758
14575A585758K65690N03202o64107L2006J16588j3391K73128M9768K88559n92271
$$ 1585758 1851448 2354650 1690543 1722549 1839137 1825746 2098874 2148642 2437201 1844930
14565A844930K91729j80561p7372J92172N4961J38066p9382l79756M03784J90011
$$ 1844930 2136659 1956098 1878726 2070898 2125859 2263925 2184543 1804787 2208571 2398582
14555B398582j94596N27050k80017K59760o4669j37683J43720J03760J50108j02384
$$ 2398582 2203986 2731036 2451019 2710779 2646110 2508427 2652147 2755907 2906015 2803631
14545B803631p7691N98351l1992K79316L148M20413L04061K94236R90235J001127
$$ 2803631 2725940 3324291 3292299 3571615 3574763 3995176 4299237 4593473 5583708 6584835
14535F584835J846486K806678M090139O061072J0528550j91674j1967041q721646
$$ 6584835 8431321 11237999 15328138 21389210 31917760 31726086 19759045 11037399
14527A1037399l902847k100291j250937k43552p88985k48877k22762l7791K46212
$$ 11037399 7134552 5034261 3783324 3539772 2750787 2501910 2279148 2241357 2487569
14518B487569j63741k4975L4391J73654m85312L82485J06879l78099M21134r7611
$$ 2487569 2323828 2298853 2333244 2506898 2021586 2404071 2510950 2132851 2553985 2456374
14508B456374J20721k77458M676Q3806J24966Q0926k79522M87991j51315L6687
$$ 2456374 2577095 2299637 2304313 2388119 2513085 2594011 2314489 2802480 2651165 2687852
14498B687852J34450K57013l82287J37810K62131j93377o2883L23663l50209N94643
$$ 2687852 2822302 3079315 2697028 2834838 3096969 2903592 2840709 3164372 2814163 3408806
14488C408806l26203J12865j7620J16008K11917l69772J81709k77114O19529k44643
$$ 3408806 3082603 3195468 3177848 3293856 3505773 3136001 3317710 3040596 3660125 3415482
14478C415482p4562l7175K03495J44903k25867K49864n4596N67792n36301K47815
$$ 3415482 3340920 3303745 3507240 3652143 3426276 3676140 3621544 4189336 3653035 3900850
14468C900850q5948n7849J94923Q4846J03121k35590J65725p2477K56228l2487
$$ 3900850 3814902 3757053 3951976 4036822 4139943 3904353 4070078 3997601 4253829 4221342
14458D221342K61232M9508l13618M67928m13584J23819Q4497J75573L25197o6336
$$ 4221342 4482574 4532082 4218464 4686392 4272808 4396627 4481124 4656697 4981894 4915558
14448D915558n6279M45498o08719L72978j29923P967k0184O93008n66279L22661
$$ 4915558 4859279 5304777 4696058 5069036 4939113 4947080 4926896 5619904 5053625 5376286
14438E376286J42041j38437J67732q6979L52786j80781M76110k53446K38145m43789
$$ 5376286 5518327 5379890 5547622 5460643 5813429 5632648 6108758 5855312 6093457 5649668
14428E649668M17159K1997K59398m2721J8128K77863j3403J33785j79196P19186
$$ 5649668 6066827 6088824 6348222 6305501 6323629 6601492 6588089 6721874 6542678 7261864
14418G261864J26172m51689J93827K01322k10133K41779J9143J70418K62340J40215
$$ 7261864 7388036 6936347 7130174 7331496 7121363 7363142 7382285 7552703 7815043 7955258
14408G955258p1478J09890J10268P5291L49736l1393P7118Q50L19590P3956O48007
$$ 7955258 7883780 7993670 8103938 8179229 8528965 8497572 8574690 8575540 8895130 8969086 9617093
14397I617093l84908J01893J01193M33147l2861J77071K28096J80776L47769j72346
$$ 9617093 9232185 9334078 9435271 9868418 9835557 10012628 10240724 10421500 10769269 10596923
14387A0596923K96600n1309K22609j37410O36781J65034M89955l59218N44134
$$ 10596923 10893523 10842214 11064823 10927413 11564194 11729228 12219183 11859965 12404099
14378A2404099J54204j3033J54899L33237J14081L68620N06794j86065M50450
$$ 12404099 12558303 12545270 12700169 13033406 13147487 13516107 14022901 13836836 14287286
14369A4287286J98762L21603M44693K072O25875K37288L20547K23518K95804M64374
$$ 14287286 14486048 14807651 15252344 15254416 15880291 16117579 16438126 16661644 16957448 17421822
14359A7421822j62967O53219J14324M59594P04592j39782P58319P5696O41057
$$ 17421822 17258855 17912074 18026398 18485992 19190584 19050802 19809121 19884817 20525874
14350B0525874K53896J070483M8375P56334M57707K87128O11770N93225P20780
$$ 20525874 20779770 21850253 21898628 22654962 23112669 23399797 24011567 24604792 25325572
14341B5325572O37946K84759P24624M77179Q69897Q33730O39272K67849J088889
$$ 25325572 25963518 26248277 26972901 27450080 28319977 29153707 29792979 30060828 31149717
14332C1149717O62153O61123R99380J048421J099154P09595Q19608R24400J224078
$$ 31149717 31811870 32472993 33472373 34520794 35619948 36329543 37149151 38073551 39297629
14323C9297629J049510J682117J158332J181933R19200J684286J413550J603744
$$ 39297629 40347139 42029256 43187588 44369521 45288721 46973007 48386557 49990301
14315D9990301J572681J820626J601226J819760K009855J902273J724314K346884
$$ 49990301 51562982 53383608 54984834 56804594 58814449 60716722 62441036 64787920
14307F4787920K003642K257414L061927K286120K982133K781979K912068L027335
$$ 64787920 66791562 69048976 72110903 74397023 77379156 80161135 83073203 86100538
14299H6100538L399637L657710L904887L722950L881217M546272M711988M873631
$$ 86100538 89500175 93157885 97062772 100785722 104666939 109213211 113925199 118798830
14291A18798830N170597N383419N521856O074817O531494O758358P193273P460472
$$ 118798830 123969427 129352846 134874702 140949519 147481013 154239371 161432644 168893116
14283A68893116Q261750Q922153Q841458R143155J0097206J0899273J0912883
$$ 168893116 177154866 186077019 194918477 204061632 214158838 225058111 235970994
14276B35970994J1871775J2188165J2872893J3390781J3493980J3868957J4234230
$$ 235970994 247842769 260030934 272903827 286294608 299788588 313657545 327891775
14269C27891775J4367097J3957851J3976761J3246006J3124118J2307968J1547639
$$ 327891775 342258872 356216723 370193484 383439490 396563608 408871576 420419215
14262D20419215J0876489J0337957Q251694N458402J963613J575281J934877L531918
$$ 420419215 431295704 441633661 449885355 455343757 457307370 458882651 460817528 464349446
14254D64349446j629240n338305n172066p772329q604283j0707993j2069672j2936206
$$ 464349446 462720206 457381901 452209835 444437506 435833223 425125230 413055558 400119352
14246D00119352j3723398j3352351j4126961j4729489j4854047j4162141j3645764
$$ 400119352 386395954 373043603 358916642 344187153 329333106 315170965 301525201
14239C01525201j4424798j3472928j3209505j3357925j2838627j2436913j1640842
$$ 301525201 287100403 273627475 260417970 247060045 234221418 221784505 210143663
14232B10143663j0432769r774818r541185q574624q126850p993753p215668p080477
$$ 210143663 199710894 189936076 180394891 171820267 163693417 155699664 148483996 141403519
14224A41403519o217547n791083n692994n795967m781889m732999m632814m191953
$$ 141403519 135185972 129394889 123701895 117905928 113124039 108391040 103758226 99566273
14216I9566273m057654l543306l804913l182439l255388l379995l248193k060836
$$ 99566273 95508619 91965313 88160400 84977961 81722573 78342578 75094385 73033549
14208G3033549l013009k136631k318269k326048j908457j796864k315917j838841
$$ 73033549 70020540 67883909 65565640 63239592 61331135 59534271 57218354 55379513
14200E5379513j626395j899195j340885j409895j561134j319270j287051j098320
$$ 55379513 53753118 51853923 50513038 49103143 47542009 46222739 44935688 43837368
14192D3837368j115884q61352j823510j168990r48218j227430m77604o67846j506511
$$ 43837368 42721484 41860132 40036622 38867632 37919414 36691984 36214380 35546534 34040023
14183C4040023o04987r60505p95752p68455m72810j242762r59005k65248o65685
$$ 34040023 33435036 32474531 31678779 30910324 30437514 29194752 28235747 27970499 27304814
14174B7304814p63694p25950k53402o44945n64689o26230m34900o79089l03547
$$ 27304814 26541120 25815170 25561768 24916823 24352134 23725904 23291004 22611915 22308368
14165B2308368p81797J08872r46205l21104k49289l87680n50701j69391q84704
$$ 22308368 21526571 21635443 20689238 20368134 20118845 19731165 19180464 19011073 18126369
14156A8126369K78741r89325K00098n39528o0664m53070j15160o48408k68459
$$ 18126369 18405110 17415785 17615883 17076355 17015691 16562621 16447461 15799053 15530594
14147A5530594r1555m52793m04712p9033j38113l89159m9795m52868J18895p38889
$$ 15530594 15439039 14986246 14581534 14502501 14364388 13975229 13925434 13472566 13591461 12852572
14137A2852572L7579p2335m62567k6789j1312l53219K2744o21160r4099l50652
$$ 12852572 12890151 12817816 12355249 12328460 12317148 11963929 11986673 11365513 11271414 10920762
14127A0920762O3086l04959K28173j9065m79405j98673l68244K40288l13725j34684
$$ 10920762 10983848 10678889 10907062 10887997 10408592 10209919 9841675 10081963 9768238 9633554
14117I633554K2711k02049m307l79420j20956o8133K80235m43667k93126J22828
$$ 9633554 9656265 9454216 9449909 9070489 8949533 8881400 9161635 8717968 8424842 8547670
14107H547670k72018l13659L01902q1269k80522J3363k68721k43775j10542K86300
$$ 8547670 8275652 7961993 8263895 8182626 7902104 7915467 7646746 7402971 7292429 7578729
14097G578729l83556O4460K7082k26043n46607J35438J95890j50678j09653k36545
$$ 7578729 7195173 7259633 7286715 7060672 6514065 6649503 6845393 6694715 6585062 6348517
14087F348517l2280m1621M07894n84166j45722l1243M68694m08454M0011p0179
$$ 6348517 6316237 6274616 6682510 6098344 5952622 5921379 6390073 5981619 6021630 5951451
14077E951451l12294L73243n48149K86430m53756L45063j60048j18393k05845
$$ 5951451 5639157 6012400 5464251 5750681 5296925 5641988 5481940 5363547 5157702
14068E157702K32894j88499K8949k46708l50993M22630r6917j66789K34175l58031
$$ 5157702 5390596 5202097 5231046 4984338 4633345 5055975 4959058 4792269 5026444 4668413
14058D668413J08783k66114P81062p70607L24688l47249J28224l89597L18235
$$ 4668413 4777196 4511082 5292144 4521537 4846225 4498976 4627200 4237603 4555838
14049D555838o27793K44569j07064L07097J48317n23529M6509j5590j41855o8582
$$ 4555838 3928045 4172614 4065550 4372647 4520964 3997435 4043944 4028354 3886499 3817917
14039C817917M35737k93423K439r7118j07061k44203r3159J88076P4072J86609
$$ 3817917 4253654 3960231 3962670 3865552 3758491 3514288 3421129 3609205 3683277 3869886
14029C869886k14547l56380o4306O120K65184k76475J57108K4712J71996n85434
$$ 3869886 3655339 3298959 3234653 3240773 3505957 3229482 3386590 3411302 3583298 2997864
14019B997864L771L05495k20247K48606P9532n9425l03810J84632j19202J53326
$$ 2997864 3001635 3307130 3086883 3335489 3415021 3355596 3051786 3236418 3117216 3270542
14009C270542l02362k01148r9948L7152j37299K42551o7303K9480P6456j6443
$$ 3270542 2968180 2767032 2667084 2704236 2566937 2809488 2742185 2771665 2848121 2831678
13999B831678m1868m885J55699l13466l18141L06400O9773j68007j32474n2316
$$ 2831678 2789810 2784925 2940624 2627158 2309017 2615417 2685190 2517183 2384709 2332393
13989B332393l0613J31796P77135o93026J70911m67078J62494J82515L15041Q6275
$$ 2332393 2301780 2433576 3210711 2517685 2688596 2221518 2384012 2566527 2881568 2967843
13979B967843l3887J19248L72670M94837J199333K226577L439935N447435J0589251
$$ 2967843 2933956 3053204 3425874 3920711 5120044 7346621 10786556 16233991 26823242
13970B6823242N704560j0034022p886305m526807k477123j446236r26681q61029
$$ 26823242 32527802 22493780 14607475 10080668 7603545 6157309 5230628 4369599
13962D369599n49401k943m66674l78138j37511L6402J5464m12598L7929j04111
$$ 4369599 3820198 3817255 3350581 2972443 2834932 2871334 2886798 2474200 2512129 2408018
13952B408018N15709l33537P800l1710j50873J11815j08850m91996N29067n61369
$$ 2408018 2923727 2590190 2597990 2566280 2415407 2527222 2418372 1926376 2455443 1894074
13942A894074j03549K86171J37023Q6099n81258P8525K89531j1184o785o3074
$$ 1894074 1790525 2076696 2213719 2299818 1718560 1797085 2086616 2075432 2068647 2005573
13932B005573j12357J32565j25819j40253K34300K43419m98999P2265M7853m5645
$$ 2005573 1893216 2025781 1899962 1759709 1994009 2237428 1738429 1810694 1858547 1812902
13922A812902q9962k09546M67226n3276k41388j79701L45404J84971l62301K22949
$$ 1812902 1722940 1513394 1980620 1927344 1685956 1506255 1851659 2036630 1674329 1897278
13912A897278l08254J48347j0928l38558L81779j99559K74007J18738l79114j33017
$$ 1897278 1589024 1737371 1726443 1387885 1769664 1570105 1844112 1962850 1583736 1450719
13902A450719P3033L55788k98018N9795j40549K78896k42669m2566P7427k6248
$$ 1450719 1523752 1879540 1581522 1641317 1500768 1779664 1536995 1494429 1571856 1545608
13892A545608M5639P485L4261l98967M10293m1319K37888l64455J54695j41843
$$ 1545608 1591247 1598732 1632993 1234026 1644319 1603000 1840888 1476433 1631128 1489285
13882A489285J6882j81767m358L61131o70272N37521k65725j0893K55468l93848
$$ 1489285 1506167 1324400 1320042 1681173 1010901 1548422 1282697 1271804 1527272 1133424
13872A133424J82936J0114j94069K62466J11331j37729m66533N48010J3365l03572
$$ 1133424 1316360 1326474 1132405 1394871 1506202 1368473 901940 1449950 1463315 1159743
13862A159743L57320k85036R5947n54264N66799j34359J8708J8957k56017K72703
$$ 1159743 1517063 1232027 1327974 773710 1340509 1206150 1224858 1243815 987798 1260501
13852A260501j61725K09833K9486l19925J38390K83864n14481L25489J9973r5222
$$ 1260501 1098776 1308609 1338095 1018170 1156560 1440424 925943 1251432 1271405 1176183
13842A176183j02952L36868k17758k423J32847j92411o1117j97850L26616J0380
$$ 1176183 1073231 1410099 1192341 1189918 1322765 1130354 1069237 871387 1198003 1208383
13832A208383j54920L8652j18787J63412K0927j02982r5048n2809L8873L45536
$$ 1208383 1053463 1092115 973328 1136740 1157667 1054685 959637 906828 945701 1291237
13822A291237m06069Q9373m1122M3061R977Q023M32875n13219P6351K74842l28489
$$ 1291237 885168 974541 933419 976480 986457 994480 1427355 914136 990487 1265329 936840
13811I36840L39221k98690j88992L55522J09985J69777o05885L26641k92969J36587
$$ 936840 1276061 977371 788379 1143901 1253886 1423663 817778 1144419 851450 988037
13801I88037J34783j99348J79082j15086l0741J95747k29510J59159j08588Q4849
$$ 988037 1122820 923472 1102554 987468 956727 1152474 922964 1082123 973535 1058384
13791A058384K15187m27576r1124j8225m9972J01174J28422m51392N63528j68647
$$ 1058384 1273571 845995 754871 736646 686674 787848 916270 464878 1028406 859759
13781H59759j55124j41432K28255M6940J01891j1383K61457m24256M7316k58357
$$ 859759 704635 563203 791458 838398 940289 928906 1190363 766107 813423 555066
13771E55066L24401J18178l13888K64534k56029j13958L58114L9623j48993k10008
$$ 555066 879467 997645 683757 948291 692262 578304 936418 976041 827048 617040
13761F17040L60836k69789j43971K21904j18561P1168J8097K94245j31986k98260
$$ 617040 977876 708087 564116 786020 667459 738627 756724 1050969 918983 620723
13751F20723R9309L17164j37039k89554M9868L0971k8627J4724N7285j06459k3510
$$ 620723 720032 1037196 900157 610603 660471 691442 662815 677539 734824 628365 604855
13740F04855J37839Q834J13923J73815j77947j12831m0353j87434j76521M49569
$$ 604855 742694 751528 865451 1039266 861319 748488 708135 520701 344180 793749
13730G93749m0135L8122k92916J40614l9744m8602J84875k04153R4758j15888
$$ 793749 753614 791736 498820 639434 599690 551088 735963 531810 626568 510680
13720E10680N48639k17479J05064l16572N0761k04959J53136J20773j08650Q58
$$ 510680 1059319 841840 946904 630332 681093 476134 629270 750043 641393 642251
13710F42251k10489L66808j00228J53970l09277O5288J53940k1485j52391p0710
$$ 642251 431762 798570 698342 852312 543035 608323 762263 740778 588387 517677
13700E17677p0879J75685N9608K00564j93457k58927M25511D13802N6814J48810
$$ 517677 446798 622483 682091 882655 689198 430271 855782 413802 470616 619426
13690F19426j86674J33493k63408M29655j52748j60193K71583J5024k9471k48349
$$ 619426 432752 566245 302837 732492 579744 419551 691134 706158 676687 428338
13680D28338K46959o8185j35592P5178J51867j22823p0356R2719J62495j30078
$$ 428338 675297 607112 471520 546698 698565 575742 505386 598105 760600 630522
13670F30522A49333m8326L19690R7002j27960K96275k07103n8795K0753L16343
$$ 630522 149333 101007 420697 517699 389739 686014 478911 420116 440869 757212
13660G57212A18508J56246J34488j02300K91613K03736l43553o0350J13865J46428
$$ 757212 118508 274754 409242 306942 598555 802291 458738 398388 512253 658681
13650F58681j80325J85747j89093j43751C1600N10749j26145j42584K92718J70909
$$ 658681 478356 664103 475010 331259 31600 542349 416204 273620 566338 737247
13640G37247k10316M2078J49025k11837j6704J91195k81118J06344l7878p2452
$$ 737247 526931 569009 718034 506197 489493 680688 399570 505914 468036 395584
13630C95584O4060m507o3830j25166j4163K02356j8385M7894k32495I0214K90544
$$ 395584 459644 455137 391307 266141 251978 454334 435949 483843 251348 90214 380758
13619C80758n3817J26813p305J30220j86793J30201q5790J10604l2313k17834
$$ 380758 326941 453754 446449 576669 389876 520077 434287 544891 512578 294744
13609B94744q1647Q3491O1537K06346A06893K41905P614n2999H7591M52236p065
$$ 294744 213097 296588 358125 564471 106893 348798 356412 303413 87591 539827 532762
13598E32762j61254j8998K16416j32449j00968M5440J90233n9125J38857B35716
$$ 532762 371508 352510 568926 436477 335509 380949 571182 512057 650914 235716
13587F48722j66897Q8440j5450B65558K44133j02533N6999J25817m4238k31100
$$ 648722 481825 570265 554815 265558 509691 407158 464157 589974 545736 314636
13577C14636N00272C07204k6827j7238B3832K25995K90472J61346o5673r4031
$$ 314636 814908 307204 280377 263139 23832 249827 540299 701645 635972 541941
13567E41941k30810q4276L09126j73225j71127J51381J8667J95734k29164A60726
$$ 541941 311131 226855 535981 362756 191629 343010 361677 557411 328247 160726
13556D25201R7916K1148j81694A19378Q4611N222J2732A07395L93263G6472O95865
$$ 425201 523117 544265 362571 119378 203989 209211 221943 107395 500658 76472 772337
13545G72337j45902k17812M7124l0503F4777L08140J57070j26158A28896M0962
$$ 772337 626435 408623 455747 425244 64777 372917 529987 403829 128896 169858
13535A69858M01896j34216B13267K19750j39308O5064q0124K39256j1556N7038
$$ 169858 571754 437538 213267 433017 293709 358773 278649 517905 506349 563387
13525E63387A39655O9301J62221m7621o8081j12660J61077K57603k06441l3160
$$ 563387 139655 208956 371177 323556 255475 142815 303892 561495 355054 321894
13515C21894p5099P6579K32863A18354K7059m1667K80267F7157L72013J80258
$$ 321894 246795 323374 556237 118354 145413 103746 384013 67157 439170 619428
13505F19428k82732m0180j04761B3243K48288J8058J58721j91220J23139O5768
$$ 619428 336696 296516 191755 23243 271531 289589 448310 257090 380229 445997
13495D45997A65747J00822E2935L05212A65221B356M52045k04528L9963j43470
$$ 445997 165747 266569 52935 358147 165221 2356 454401 249873 289836 146366
13485A46366K94352B0781L64537p5081M51196B80136n5637J51918n5470J32675
$$ 146366 440718 20781 385318 310237 761433 280136 224499 376417 320947 453622
13475D53622B02052i4561D36857R1673j04591J44735A25853J40468K61685j06443
$$ 453622 202052 -94561 436857 528530 423939 568674 125853 266321 528006 421563
13465D21563J650H5916K68621a8253C37159N2561j48069K31173m7158C5896L21199
$$ 421563 423213 85916 354537 -18253 337159 389720 241651 472824 425666 35896 357095
13454C57095j47325m9280B2175J97558K75928A68426d8955J7203A26213P3099
$$ 357095 209770 160490 22175 219733 495661 168426 -48955 -31752 126213 199312
13444A99312M8245K03307j90078J15900r2268Q7758D4816r036D292J30047k0965
$$ 199312 247557 450864 260786 376686 284418 372176 44816 35780 4292 134339 113374
13433A13374i276B26560n4204M6845A04731k1168K12309A39255J23702J47940
$$ 113374 -9276 226560 172356 219201 104731 83563 295872 139255 262957 410897
13423D10897L5696R8105j85625J11960G479K44314j5004c6760C75737C8245q277
$$ 410897 446593 544698 359073 471033 7479 251793 236789 -36760 375737 38245 29968
13412B9968K47669j0583j19024O1633N0318J5846j26968K50497j62515F9438M43543
$$ 29968 277637 267054 148030 209663 259981 275827 148859 399356 236841 69438 512981
13401E12981p7430A41382K54172j05447J84778A4504J18317K83144h2204H1163
$$ 512981 435551 141382 395554 290107 474885 14504 132821 415965 -82204 81163
13390C69681j24899q8511m6306L57488p0720n8460j09346K70641j01236L7035
$$ 369681 244782 156271 109965 467453 396733 338273 228927 499568 398332 435367
13380D35367d9189C69290j48260Q4420M2600r0545L0745O9214C4717O6898N17731
$$ 435367 -49189 369290 221030 305450 348050 257505 288250 357464 34717 101615 619346
13369F19346c9900C94823j37033A19587M2456Q9779n8820Q2293I3460K94747l4376
$$ 619346 -39900 394823 257790 119587 162043 251822 193002 275295 93460 388207 353831
13358C53831G5459L07368H7764K90537m1536j10939M4416J23301c676C23743J83948
$$ 353831 75459 382827 87764 378301 336765 225826 270242 393543 -3676 323743 507691
13347E07691A13749N9154R8174m2618P468L76805B26675k7883M8924n5366J42039
$$ 507691 113749 172903 271077 228459 235927 612732 226675 198792 247716 192350 334389
13336C34389n1821Q4207j22103Q5999r4157L52229B30316J78097j82153A01690
$$ 334389 282568 366775 244672 330671 236514 588743 230316 408413 226260 101690
13325C92731m1348l6668A11517M61409B19369k1304J52793j34944A04715L09345
$$ 392731 351383 314715 111517 572926 219369 198065 350858 215914 104715 414060
13315D14060j93549K31786J22230A12401N6754b35473e806G3216J31996o5686
$$ 414060 220511 452297 574527 112401 169155 -235473 -5806 73216 205212 139526
13305A39526J58920j31287K48757A03650J53357B0626J96768D4122a18749j30895
$$ 139526 298446 167159 415916 103650 257007 20626 217394 44122 -118749 -249644
13295b49644B28572Q3093A50778N043a77484A29239K26603a10122D57654j97204
$$ -249644 228572 311665 150778 155821 -177484 129239 355842 -110122 457654 260450
13285B60450m7724r22J47103l0683I6110B5007K59730C8615i3411o8123D12304
$$ 260450 212726 211804 358907 328224 96110 25007 284737 38615 -93411 -161534 412304
13273B30705B9628a4895C2753J77864M6603D2235G90L33206r8111Q2725j54525
$$ 230705 29628 -14895 32753 210617 257220 42235 790 333996 235885 318610 164085
13262A64085a16075B67142A5611J22082J87863L80627g9918A0647J53586l5279
$$ 164085 -116075 267142 15611 137693 325556 706183 -79918 10647 164233 128954
13252A28954J41683b53053Q9344A72408E6801A6329Q3528K65973A37138D3378
$$ 128954 270637 -253053 -163709 172408 56801 16329 99857 365830 137138 43378
13241B97741B7586b88277F9727K71229A64455A4191K02705r2527K38112A7594
$$ 297741 27586 -288277 69727 340956 164455 14191 216896 124369 362481 17594
13230B11949j9430m2256J46527f5498A34797O3663p2098g687j6051D9742J42716
$$ 211949 192519 150263 296790 -65498 134797 198460 126362 -7687 -23738 49742 192458
13219A92458c0423G2831K75977A15972q883J12762A1051J40127g5184B08662B7210
$$ 192458 -30423 72831 348808 115972 107089 219851 11051 151178 -75184 208662 27210
13207i2205G228K96331j41396j9592l6195m3538a54564B46528d793A92707c6402
$$ -92205 7228 303559 162163 142571 106376 62838 -154564 246528 -4793 192707 -36402
13195C25017A33078a72753M4473c8930q0926E7579J97361k3039m4338O2466I0408
$$ 325017 133078 -172753 -128280 -38930 -119856 57579 254940 231901 187563 250029 90408
13183A38445k8923a56879G4157a26524E2852L26046F076J08864J78984a16260
$$ 138445 109522 -156879 74157 -126524 52852 378898 6076 114940 293924 -116260
13172B9516J29315J03319j1682j12423C0970M4010J50649k3342K5069J16487L2125
$$ 29516 158831 262150 250468 138045 30970 74980 225629 202287 227356 343843 375968
13161C75968a57637A02990N2580J63597e026A25211k1219M193b0337A82809a37290
$$ 375968 -157637 102990 155570 319167 -5026 125211 103992 108185 -20337 182809 -137290
13149a13897B85577A5714J87503n3013l800J585i6469I1181K39240N4670H4313
$$ -113897 285577 15714 203217 150204 146404 147989 -96469 91181 330421 385091 84313
13137A33196o4530J19851i3156H0157K8236P9463R0258p5060K2100K0982j06986
$$ 133196 68666 188517 -93156 80157 108393 187856 278114 203054 225154 246136 139150
13126A39150I604J65887i8467K3020D7718a43463B58547q8014E3819k5344R8181
$$ 139150 9604 175491 -98467 -75447 47718 -143463 258547 170533 53819 28475 126656
13115A26656A0187h0288p6753C03055j44617o7777M1097K1065L01212n1081A55939
$$ 126656 10187 -80288 -157041 303055 158438 90661 131758 152823 454035 402954 155939
13103B20275J49050A05891b07331B71949a48226A66350F8047o277P7174N1946
$$ 220275 369325 105891 -207331 271949 -148226 166350 68047 61770 138944 190890
13093A90890d3946i781A22207g3740F8517M4711e8755C40658G715i272l2190K47
$$ 190890 -43946 -9781 122207 -73740 68517 113228 -58755 340658 7715 -9272 -41462 -41215
13081d1215C04579F0013O0121E7586a66990B26851r7137O1693b1407j43076f8724
$$ -41215 304579 60013 120134 57586 -166990 226851 129714 191407 -21407 -164483 -68724
13069I1313b17740f8558g256A23542D5059j4970i9997E2228R8797k4531M3418
$$ 91313 -217740 -68558 -7256 123542 45059 30089 -99997 52228 151025 126494 169912
13058A69912N9870I8956a55270C9517K4802L18729q9048e7007A19077l4704N2944
$$ 169912 229782 98956 -155270 39517 64319 383048 294000 -57007 119077 84373 137317
13047A37317M61749P2793c253A26858L0796n7722M8653c5294A54405N4233I4280
$$ 137317 599066 671859 -3253 126858 157654 99932 148585 -35294 154405 208638 94280
13035a84884C41453e3429A48325K26448a39455I5357a11261A40086K53798A03081
$$ -184884 341453 -53429 148325 374773 -139455 95357 -111261 140086 393884 103081
13024H9800K6741A5582K19680B8247J90687j0180p0035g5762a2770l4024D16054
$$ 89800 116541 15582 235262 28247 218934 208754 138719 -75762 -12770 -46794 416054
13012c624C98799j59521N9138c5165E62749e063A07914J65041E2249j8671M186
$$ -3624 398799 239278 298416 -35165 562749 -5063 107914 272955 52249 33578 37764
13001C7764K57771K4455A06584L1627J2965Q8449A06461M3619d1476A47302J27737
$$ 37764 295535 319990 106584 138211 151176 239625 106461 150080 -41476 147302 275039
12990B75039b62485H8122K59153j72015p2892K2529E7710K8388k6231L89281A70614
$$ 275039 -262485 88122 347275 175260 102368 124897 57710 86098 59867 449148 170614
12978i856n5989B77260r7788g2373H5439B056K08904D1485a4290D05342b29975
$$ -9856 -65845 277260 179472 -72373 85439 2056 210960 41485 -14290 405342 -229975
12966E7155b14549B43505A12213K5192e2844A37642J05189G1233j1681e391A16144
$$ 57155 -214549 243505 112213 137405 -52844 137642 242831 71233 59552 -5391 116144
12954a51571H7949d9653n6121A45731D5670N7583C204c97782A41076g8099B47130
$$ -151571 87949 -49653 -105774 145731 45670 103253 3204 -397782 141076 -78099 247130
12942a15737H5794A1110Q4080c53281J32946B59772e1065B06790g6708k5806A2348
$$ -115737 85794 11110 95190 -353281 -220335 259772 -51065 206790 -76708 -102514 12348
12930h9735j20358B96986b40646N4927B26514K15395c5043B30059m9103a46098
$$ -89735 -210093 296986 -240646 -185719 226514 441909 -35043 230059 180956 -146098
12919A72257K3100J70328c0212E8012L08900j82179N1731o9529d2540j73905J05622
$$ 172257 195357 365685 -30212 58012 366912 184733 236464 166935 -42540 -216445 -110823
12908a10823G3025c85306B90044I0041R1137r338i3919D1401M0049c75231A9352
$$ -110823 73025 -385306 290044 90041 181178 171840 -93919 41401 81450 -375231 19352
12896D5367e6516C52183b582B45610r0925a83064D9522b11764A85446F4780f8276
$$ 45367 -56516 352183 -2582 245610 154685 -183064 49522 -211764 185446 64780 -68276
12884A5583K11263b03853c4221I626J6890J89679c6181B32459i3555A61963l6891
$$ 15583 226846 -203853 -34221 9626 26516 216195 -36181 232459 -93555 161963 125072
12873A25072n637d6436j02590B47761c23642e5080B30781A6113K51147A09211
$$ 125072 119435 -46436 -149026 247761 -323642 -55080 230781 16113 267260 109211
12862B29554b08484A9763a18102A40023C5554i960I3414O9967b5729B62094A3497
$$ 229554 -208484 19763 -118102 140023 35554 -9960 93414 163381 -25729 262094 13497
12850C40722A18434c3677q847C89342j68459a76666k6968A19706b48024B04766
$$ 340722 118434 -33677 -42524 389342 220883 -176666 -203634 119706 -248024 204766
12839a43759C37701I0262R9323G8133j6768a57074A12689L19695o4860A40456
$$ -143759 337701 90262 189585 78133 61365 -157074 112689 432384 367524 140456
12828F3955J62310b71231A31885N6645J86008j40342d327j35225A08441b43282
$$ 63955 226265 -271231 131885 188530 374538 234196 -4327 -139552 108441 -243282
12817a27303B79155a6886A76624a88566A41596G430b07990d6515k82361a47074
$$ -127303 279155 -16886 176624 -188566 141596 7430 -207990 -46515 -328876 -147074
12806F317c5222k83574E3821a04093q3360l6126b1232C9322O1178J05337h8446
$$ 6317 -35222 -318796 53821 -104093 -187453 -223579 -21232 39322 100500 205837 -88446
12794b31980C6289a03922A05769a66606a094E39260b12938r4256B30793D0824
$$ -231980 36289 -103922 105769 -166606 -1094 539260 -212938 -307194 230793 40824
12783e1796H9242b70723A77006c471A55460c54751A43974P3759M2818j11455a34040
$$ -51796 89242 -270723 177006 -3471 155460 -354751 143974 217733 260551 149096 -134040
12771f6594j26098c0712p61C39055b05605n7723A41555a03249A2549J58541a4635
$$ -66594 -192692 -30712 -31473 339055 -205605 -263328 141555 -103249 12549 171090 -14635
12759b71629A07056K22241g9806j95191a5653A81288I213M6924d04483J68881
$$ -271629 107056 329297 -79806 -274997 -15653 181288 9213 56137 -404483 -235602
12749b35602E6172O9903a15916j44220a9117B3644J80624L38792e8183D9909L9758
$$ -235602 56172 126075 -115916 -260136 -19117 23644 204268 543060 -58183 49909 89667
12738H9667K85133A30178E8705a86241f0845J3482B1469I264Q6707c5841p2894
$$ 89667 374800 130178 58705 -186241 -60845 -47363 21469 9264 95971 -35841 -108735
12727a08735C76653c8048j01482f3895K9692A11801B8318a85694B01921h2542
$$ -108735 376653 -38048 -139530 -63895 -34203 111801 28318 -185694 201921 -82542
12716B08818p5639o2540J3325P9690K72755c7845A11127b7309k43841a31954A42980
$$ 208818 133179 70639 83964 163654 436409 -37845 111127 -27309 -271150 -131954 142980
12704F2948j193i0840K0443l90621N0638a96393g9335B0418L40604J10459C8377
$$ 62948 61755 -90840 -70397 -461018 -410380 -196393 -79335 20418 361022 471481 38377
12692F4455L3359N8489K30971q2460f049A87767A652a60022C89373j53042M2183
$$ 64455 97814 156303 387274 304814 -6049 187767 1652 -160022 389373 236331 278514
12681B78514d9008k3958L1046I3055P5971a25100A69646a38687b3435j01387A69632
$$ 278514 -49008 -72966 -41920 93055 169026 -125100 169646 -138687 -23435 -124822 169632
12669a68284e7300D9767P1373J13027M8136a6114C43846H6429J96364d6197B68282
$$ -168284 -57300 49767 121140 234167 282303 -16114 343846 86429 282793 -46197 268282
12657c0637A60148J35780j02873l2270J37373J39183F904M56940C307K12243a20381
$$ -30637 160148 295928 193055 160785 298158 437341 6904 463844 3307 215550 -120381
12645a19043A81825o7123o079P6065J4093C5164M6339N421L55249j16906A36482
$$ -119043 181825 114702 108623 184688 198781 35164 81503 86924 442173 325267 136482
12633C04467A11057K9059k3705K8802D9941c41592C625K58637C1226K00041o7750
$$ 304467 111057 140116 116411 145213 49941 -341592 3625 262262 31226 231267 163517
12622A63517P677K18295e7152A96015C531e3752B62041k7295p3903G3664r084
$$ 163517 171194 389489 -57152 196015 3531 -53752 262041 234746 160843 73664 64580
12611F4580R8602n2856J49633m2739q0365L8795B6190Q0321J32119J09899J45333
$$ 64580 163182 110326 259959 217220 136855 175650 26190 106511 238630 348529 493862
12600D93862a04975A1954K33668a114D7227R5194o0605k6384b3795B549K56939
$$ 493862 -104975 11954 245622 -1114 47227 142421 81816 55432 -23795 2549 259488
12589B59488a67825j78803a27697b1111M597A35345f3620J3256A88958h272j34517
$$ 259488 -167825 -346628 -127697 -21111 -16514 135345 -63620 -50364 188958 -8272 -142789
12578a42789m9014a1924l7835A28617f8568B3810H684a1713j66650F587J83977
$$ -142789 -191803 -11924 -49759 128617 -68568 23810 8684 -11713 -178363 6587 190564
12567A90564k5203i3895A72012M9924J0641a7416A66593J08655a08660G0680h5885
$$ 190564 165361 -93895 172012 221936 232577 -17416 166593 275248 -108660 70680 -85885
12555A21067L7479O3370o9566h567A86568d9964H0756K968M0052D8403N9156a65585
$$ 121067 158546 221916 152350 -8567 186568 -49964 80756 83724 123776 48403 107559 -165585
12542A78224a46041l9758A33641g8880c2780A37583k5980a92808B0932a65121
$$ 178224 -146041 -185799 133641 -78880 -32780 137583 111603 -192808 20932 -165121
12531A20378h504j93325M523G1169K17171h477F110d2361F3034a15977j3303A21680
$$ 120378 -8504 -201829 -197306 71169 288340 -8477 6110 -42361 63034 -115977 -129280 121680
12518a44935F1304K14294a73595E2093a39976A46580B6814J03195O5590P5878
$$ -144935 61304 275598 -173595 52093 -139976 146580 26814 130009 195599 271477
12508B71477A5434c54043E3595b31572l7545E9156b73135B16706H9534K3369j8321
$$ 271477 15434 -354043 53595 -231572 -269117 59156 -273135 216706 89534 112903 94582
12497I4582A9487Q7157r838B1690a51025F3408O7885i6612j51499b5181B53376
$$ 94582 19487 106644 96806 21690 -151025 63408 131293 -96612 -248111 -25181 253376
12485f6046A44653o2893a99767k5435J01940b5062I0851O4776c63198B08792J6496
$$ -66046 144653 81760 -199767 -225202 -123262 -25062 90851 155627 -363198 208792 225288
12474B25288b15413a7353j94509C2397c1172n5123j25964b0144n168A44150P440
$$ 225288 -215413 -17353 -211862 32397 -31172 -86295 -212259 -20144 -25312 144150 151590
12463A51590h8800A23604P2353e6808A35705d2007l05755B26919p6549I563c5153
$$ 151590 -88800 123604 195957 -56808 135705 -42007 -347762 226919 150370 9563 -35153
12451H0888J04271G2898j7766A4868M6214J19028J62527A52675p5772b93382N3249
$$ 80888 185159 72898 55132 14868 61082 180110 342637 152675 76903 -293382 -240133
12440b40133h6323G8606c9099l89321e6231A80757b87801g2453A38716O7540J06153
$$ -240133 -86323 78606 -39099 -428420 -56231 180757 -287801 -72453 138716 206256 312409
12429C12409c9963k9550A16265J37041C3344b4665j1374D6437J1369g6499K0998
$$ 312409 -39963 -69513 116265 253306 33344 -24665 -36039 46437 57806 -76499 -55501
12418e5501a8122p3387r0986j34154q009J35568c5783G8113d7553A72269c0475
$$ -55501 -18122 -91509 -182495 -316649 -324658 -189090 -35783 78113 -47553 172269 -30475
12406C6304c4546A14371J40720j05586F1893d4390A10157b22001J09168B76525
$$ 36304 -34546 114371 255091 149505 61893 -44390 110157 -222001 -112833 276525
12395a15232A28297f9319B71277J4406a3783j10624c9748F8316b0797n8537A81922
$$ -115232 128297 -69319 271277 285683 -13783 -124407 -39748 68316 -20797 -79334 181922
12383e7057k04171O3462H6012C5258R0115a86826G9278a3599D1764i7251a0163
$$ -57057 -261228 -197766 86012 35258 125373 -186826 79278 -13599 41764 -97251 -10163
12371A31350e1271E9399h9439l9516D0570Q6331h7013o1956k52957A44161a8106
$$ 131350 -51271 59399 -89439 -128955 40570 126901 -87013 -148969 -401926 144161 -18106
12359B44168A14935a09099J7482k72459C0543J66157a35035B20759d3222A24204
$$ 244168 114935 -109099 -91617 -364076 30543 196700 -135035 220759 -43222 124204
12348a11579A14118a30450d2162F8475J62186a55815L2622G7413L7051A0547b50934
$$ -111579 114118 -130450 -42162 68475 230661 -155815 -123193 77413 114464 10547 -250934
12336b88382A23603J7779h4113d264A95482a11231K6926k8063A46590c7568A41665
$$ -288382 123603 141382 -84113 -4264 195482 -111231 -84305 -112368 146590 -37568 141665
12324a60308o3006E8748J24934n2680a6212b596I5129h960l5474j4920J1529J0286
$$ -160308 -223314 58748 183682 131002 -16212 -2596 95129 -8960 -44434 -59354 -47825 -37539
12312c7539C20507b00272E2700b40134j42935f5026m8772D0070J73124h2477j6756
$$ -37539 320507 -200272 52700 -240134 -383069 -65026 -113798 40070 213194 -82477 -99233
12301i9233o4743P1087A39521d29636F2517B9799c3774l17445B84256i5564P857
$$ -99233 -163976 -92889 139521 -429636 62517 29799 -33774 -351219 284256 -95564 -87707
12290h7707B01039F6878a8922D8662N8290B0462P0762K51012j48997I3433J6862
$$ -87707 201039 66878 -18922 48662 106952 20462 91224 342236 193239 93433 110295
12279A10295D3974J22999C046Q5106O5137L6822f0840A48993m3919A7909R5486
$$ 110295 43974 166973 3046 88152 153289 190111 -60840 148993 105074 17909 113395
12268A13395a72728F2257M8556M2631K60387H9362O4945L5735m3920K00609r2659
$$ 113395 -172728 62257 110813 153444 413831 89362 154307 190042 146122 346731 254072
12257B54072p1357J57540m9144r8201E7624J70588o9910n7191j411K0284J10827
$$ 254072 182715 340255 291111 192910 57624 228212 158302 101111 99700 119984 230811
12246B30811a7364l19748I9074J43005a7424l1005k10903D2001L247J92270m9002
$$ 230811 -17364 -337112 99074 242079 -17424 -48429 -259332 42001 45248 237518 188516
12235A88516b620A49713j2709f6335D3379a36652B28992F261f4617A6186J5752
$$ 188516 -2620 149713 137004 -66335 43379 -136652 228992 6261 -64617 16186 31938
12224C1938J88679d7931A89062B3608K22866k5488K09456A9079M33309B18540
$$ 31938 220617 -47931 189062 23608 246474 220986 430442 19079 452388 218540
12213A30505a42611b9895I0340l3749J96002O801m257J40808j40259K8442p2632
$$ 130505 -142611 -29895 90340 56591 252593 259394 255137 395945 255686 284128 211496
12202B11496C7683c1968C93743G2490M1664M8165K5501P1394a31064C79361d35
$$ 211496 37683 -31968 393743 72490 114154 162319 187820 259214 -131064 379361 -435
12190G5746K64932r0930M8971q9542J01570G1265P1483a1657B09131l1844G8780
$$ 75746 340678 249748 298719 209177 310747 71265 142748 -11657 209131 177287 78780
12178A56592K85424A58974g6759A88171I2949N3631D3808K03896c8119A26392
$$ 156592 442016 158974 -76759 188171 92949 146580 43808 247704 -38119 126392
12167a06182M4728E97003c0080D399a24056c705A97092n639K6801B4015K09533
$$ -106182 -61454 597003 -30080 4399 -124056 -3705 197092 191453 218254 24015 233548
12156B33548I0004K58023G8821K72479d032A77819Q751J92148A24442n7584L19673
$$ 233548 90004 348027 78821 351300 -4032 177819 186570 378718 124442 66858 386531
12145C86531C8257J06336K15836d3374l1636A22374n7899a33940K0036r9802L4089
$$ 386531 38257 144593 360429 -43374 -75010 122374 64475 -133940 -113904 -213706 -179617
12134a79617I7095C7787J64279a42230H229J14712K66563C0445a31293c0933n2376
$$ -179617 97095 37787 202066 -142230 8229 122941 389504 30445 -131293 -30933 -83309
12123h3309A73703a33258A61360L4927I4411f3899F9684N1840a15169F9643b3705
$$ -83309 173703 -133258 161360 196287 94411 -63899 69684 121524 -115169 69643 -23705
12111h4451A14953a37166C34195q7316q8949n2906J97564f8906l7565B92884b01996
$$ -84451 114953 -137166 334195 246879 157930 105024 302588 -68906 -106471 292884 -201996
12099H9220P6166Q6699c72679B62682c49928A15899b37291k8576f8351n6612A75638
$$ 89220 165386 252085 -372679 262682 -349928 115899 -237291 -265867 -68351 -124963 175638
12087A5351J98511G4099a07349j17595a3589B12932b32350J13249e5407j2016
$$ 15351 213862 74099 -107349 -224944 -13589 212932 -232350 -119101 -55407 -67423
12077f7423A6285J09195E468J38649n6682a72098j15994A62796F8727J06549C8154
$$ -67423 16285 125480 5468 144117 87435 -172098 -288092 162796 68727 175276 38154
12065B13295p3705K26950L83866Q38006p61905A99017i545B58386d6863Q116D9099
$$ 213295 139590 366540 750406 1588412 826507 199017 -9545 258386 -46863 -38747 49099
12053a54319a3023A31548a68408f8883o892C9176b18048B4441b28813L968c250
$$ -154319 -13023 131548 -168408 -68883 -75775 39176 -218048 24441 -228813 -224845 -3250
12041A1088R1373L13366A83128C1319A2488K5068a21059b0675A93769a7249A8345
$$ 11088 102461 415827 183128 31319 12488 37556 -121059 -20675 193769 -17249 18345
12029C599K74860J15342F9450e1759l6467J8710H670J13774A7820b88043A37026
$$ 3599 278459 393801 69450 -51759 -88226 -69516 8670 122444 17820 -288043 137026
12017g1082c0075A33494c3404j97742C05840a60818C4661b42628A42979c40593
$$ -71082 -30075 133494 -33404 -231146 305840 -160818 34661 -242628 142979 -340593
12006a43300o3542E6540M8256b32795D97832a47709C78708a0063B20995M6345
$$ -143300 -206842 56540 104796 -232795 497832 -147709 378708 -10063 220995 267340
11996B67340d1823j14299A19247e5789j60523O0383c9479C77110A1926K13733
$$ 267340 -41823 -156122 119247 -55789 -216312 -155929 -39479 377110 11926 225659
11986B25659p0831E1399g4635A17241b96407c2065j73298I6218b95639A99921
$$ 225659 154828 51399 -74635 117241 -296407 -32065 -205363 96218 -295639 199921
11975A31697c27093I5543c4352d030G6687c25676c8154j89563A67353d8999q5773
$$ 131697 -327093 95543 -34352 -4030 76687 -325676 -38154 -227717 167353 -48999 -134772
11964a34772B0271a81007A90010P593M3757j20634R128P4310a84779k37916I9861
$$ -134772 20271 -181007 190010 197603 241360 120726 129854 204164 -184779 -422695 99861
11952E1597g3808B36281c07282A5473K69085A02987d3447r7275k73001C46989
$$ 51597 -73808 236281 -307282 15473 284558 102987 -43447 -140722 -413723 346989
11941a06087n9364L1826D2479J03784a40376L7476A47837f7395h521q1359B17617
$$ -106087 -165451 -133625 42479 146263 -140376 -102900 147837 -67395 -8521 -89880 217617
11929B50986B8122g8389B68955g5133k9772d3476A18120e903G5946a43196d0382
$$ 250986 28122 -78389 268955 -75133 -104905 -43476 118120 -5903 75946 -143196 -40382
11917C68364G2284i0005q5827P6830D7218a10133j12419R3588M8502a5809B23706
$$ 368364 72284 -90005 -175832 -99002 47218 -110133 -222552 -128964 -80462 -15809 223706
11905e0129k16824A08692O2329m8541J13758A16037b82809f6423A03219b081j14691
$$ -50129 -266953 108692 171021 122480 236238 116037 -282809 -66423 103219 -2081 -116772
11894a16772A75978f8619j12022n7217I5823k2936o4b05761C0419R9989p125K14929
$$ -116772 175978 -68619 -180641 -237858 95823 72887 72823 -205761 30419 130408 123283 338212
11882C38212e4833k71212P9257M2677c4381a4673l9120B52195o3469o3252c59238
$$ 338212 -54833 -326045 -246788 -204111 -34381 -14673 -53793 252195 188726 125474 -359238
11870B22256c11715A31609a8021m08954i004A53044n7660C1760e7919A3967a31904
$$ 222256 -311715 131609 -18021 -426975 -9004 153044 95384 31760 -57919 13967 -131904
11858A04128a86860e6373C2006a36052r7836F7358K5981l7676O1806n5233d696
$$ 104128 -186860 -56373 32006 -136052 -233888 67358 93339 55663 117469 62236 -4696
11846f0985k53169C04334G9121k1446i9812J8951j33862M6938h3310K5837j17144
$$ -60985 -314154 304334 79121 57675 -99812 -80861 -214723 -167785 -83310 -57473 -174617
11835a74617k43163A37395J45474E2571h2432A52645J69654C0325Q870a67319
$$ -174617 -417780 137395 282869 52571 -82432 152645 322299 30325 39195 -167319
11824D3910a31989N3182l16020N0028A3859J6896A85R9643a56587M4168k3476
$$ 43910 -131989 -78807 -394827 -344799 13859 30755 185 99828 -156587 -112419 -135895
11813a35895f7901C3119a36354j31325C20679a2211m2446b6435r6951K2589q5910
$$ -135895 -67901 33119 -136354 -267679 320679 -12211 -54657 -26435 -123386 -100797 -186707
11802a86707o7942A70700l4054b076C4590i1513I5088N5758c4334F0955j7020
$$ -186707 -254649 170700 136646 -2076 34590 -91513 95088 150846 -34334 60955 43935
11791D3935b473B05807a42152e4964j59423j59904D9374b17020A64695a77685
$$ 43935 -2473 205807 -142152 -54964 -214387 -374291 49374 -217020 164695 -177685
11780g6081B54209i2538B0032J7024K57644b20136C1623R299J33832G1871c48090
$$ -76081 254209 -92538 20032 37056 294700 -220136 31623 40922 174754 71871 -348090
11768A95796a49873q8055E8735a09344j96617A36642a92387a9516B77868a48660
$$ 195796 -149873 -237928 58735 -109344 -305961 136642 -192387 -19516 277868 -148660
11757b51522D51923b440p4108L3087D950K28080G9558N0587D895c069p4827G1100
$$ -251522 451923 -2440 -76548 -43461 4950 233030 79558 130145 4895 -3069 -77896 71100
11744b34739A08148L06558j06486c7438A57749l1172b11869B96813a22835i537
$$ -234739 108148 414706 308220 -37438 157749 126577 -211869 296813 -122835 -9537
11733d524l72042A24460k5868a27504F7645L2558a65429a5101C48426G3229g972
$$ -4524 -376566 124460 98592 -127504 67645 100203 -165429 -15101 348426 73229 -7972
11721H6640g9283b548o7627k03364A42297d19606g0355j3949A56627b32966d3493
$$ 86640 -79283 -2548 -70175 -273539 142297 -419606 -70355 -84304 156627 -232966 -43493
11709B21196m6193g0863j5753H8264J6087j7436L32543E16J27863J89664B1292
$$ 221196 175003 -70863 -86616 88264 104351 86915 419458 516 128379 318043 21292
11697a86765f0966E9713i213k44967e8322A78353J97797H6185l9064a10288B47894
$$ -186765 -60966 59713 -9213 -254180 -58322 178353 376150 86185 47121 -110288 247894
11685h3368C8287K36355A8364a54671F1280b18875A27372A3271a49022D5919J42896
$$ -83368 38287 274642 18364 -154671 61280 -218875 127372 13271 -149022 45919 188815
11674A88815i4850C32719B2794K5516J09801J91844A15P5763Q3036q299a36037
$$ 188815 -94850 332719 22794 48310 158111 349955 115 75878 158914 150615 -136037
11662A80047b1534o4771B8363K84394a00109I7991A1878R2674N9187J63720A06722
$$ 180047 -21534 -86305 28363 312757 -100109 97991 11878 104552 163739 327459 106722
11650a07992H3928a38632K6768C3168J22282G0932a43208G7077J90939d9512B72658
$$ -107992 83928 -138632 -111864 33168 155450 70932 -143208 77077 268016 -49512 272658
11638A53363A5570L36788I6547B5081a91040j46458B3208J58646f8051j26807
$$ 153363 15570 352358 96547 25081 -191040 -337498 23208 181854 -68051 -194858
11628a94858J1398C7534J51100C1863J03831M3086c14621J11518g344A23876e8829
$$ -194858 -183460 37534 188634 31863 135694 178780 -314621 -203103 -7344 123876 -58829
11616C42898J82004b2926B75661b4658J432j63225f7642B8160b05204d7688j94918
$$ 342898 524902 -22926 275661 -24658 -23226 -186451 -67642 28160 -205204 -47688 -242606
11605b42606J12962M6143C0718J61638a87863A78567a49227q4624A45714h9106
$$ -242606 -129644 -83501 30718 192356 -187863 178567 -149227 -233851 145714 -89106
11594B38311I7576j5731f3407i247A0984a58567D0575i194C08571b70775b0235
$$ 238311 97576 81845 -63407 -9247 10984 -158567 40575 -9194 308571 -270775 -20235
11582B79739a8583j95455A55053J08755q9653b12640B3746R3356A2862J26240
$$ 279739 -18583 -214038 155053 263808 174155 -212640 23746 117102 12862 139102
11572A39102m1214J10264o1427d4462k5167A53890k2928a27715A32795R7790f8519
$$ 139102 97888 208152 146725 -44462 -69629 153890 130962 -127715 132795 230585 -68519
11560c410j45225A96462a05057A35711J98039a02966E2221K5198O2957D5051K13711
$$ -3410 -148635 196462 -105057 135711 333750 -102966 52221 77419 140376 45051 258762
11549B58762A08786n409j6362J55041j09167k499M3180J26503N6562A25263m8120
$$ 258762 108786 103377 87015 242056 132889 130390 173570 300073 356635 125263 77143
11538G7143b861I1686C4322c2835l0640J2122B59244d2558A23811N1054a21247
$$ 77143 -2861 91686 34322 -32835 -63475 -51353 259244 -42558 123811 174865 -121247
11526C5755h9168j87481A7796M28559A15158P3389a32543a1919A5857e272I8741
$$ 35755 -89168 -276649 17796 446355 115158 188547 -132543 -11919 15857 -5272 98741
11514b8550C95191A07304I80O78M32944j86603e9269B0307J73859P9815k1066
$$ -28550 395191 107304 980 1658 434602 247999 -59269 20307 194166 273981 252915
11503B52915G6777b79443A08329a18804c8903G9648f8576B6935h5061A7620J23966
$$ 252915 76777 -279443 108329 -118804 -38903 79648 -68576 26935 -85061 17620 141586
11492A41586c90216B73125A10988q715a9773B98293h6078p5983C6863J26353O1888
$$ 141586 -390216 273125 110988 102273 -19773 298293 -86078 -162061 36863 163216 225104
11481B25104a9434k39909A59735G9079d1899J6587r8007C96639d0512A15720a15768
$$ 225104 -19434 -259343 159735 79079 -41899 -25312 -123319 396639 -40512 115720 -115768
11469G6528N7832n4485L3436C3885K30478a58638C39097A12005a34085A27439
$$ 76528 134360 79875 113311 33885 264363 -158638 339097 112005 -134085 127439
11458F8277K6785C2144Q017L28153j22751D9524K19276F6734a55491H8869O0615
$$ 68277 95062 32144 40161 368314 245563 49524 268800 66734 -155491 88869 149484
11447A49484j3181j6179a9608B54147K12331E023e9888B51409a38006C25621a65475
$$ 149484 136303 120124 -19608 254147 466478 5023 -59888 251409 -138006 325621 -165475
11435A46790L13420B3238a00652B08402b33545d4785j08674E56315b92348N6059
$$ 146790 460210 23238 -100652 208402 -233545 -44785 -153459 556315 -292348 -236289
11425b36289E2549b16537C9398b9641A11325B8653K02324n0586b06815e1758k52164
$$ -236289 52549 -216537 39398 -29641 111325 28653 230977 180391 -206815 -51758 -303922
11414c03922e6091J9379o1952k16341h1651f57k76234e7072A0045K48635j22355
$$ -303922 -56091 -36712 -98664 -315005 -81651 -657 -276891 -57072 10045 258680 136325
11403A36325a15587L2159n7595A77092g767C01871a77685B8682E68a93455A64064
$$ 136325 -115587 -83428 -141023 177092 -7767 301871 -177685 28682 568 -193455 164064
11391A7768a19111D17544A59039L751j1784J07162p1447c3978C2614a97173A00090
$$ 17768 -119111 417544 159039 162790 151006 258168 186721 -33978 32614 -197173 100090
11379B78991a42551f7361A9634d412A60355n4725k9055A8261b88563J22137D5864
$$ 278991 -142551 -67361 19634 -4412 160355 105630 76575 18261 -288563 -166426 45864
11367b24306B81544A33069F5757q729K9279R1521a38040B18796a43087J6818f1226
$$ -224306 281544 133069 65757 57028 86307 177828 -138040 218796 -143087 -126269 -61226
11355a64317P3582b3154A6625a11392H9696J92391M1533b52131A75088i5721A8596
$$ -164317 -90735 -23154 16625 -111392 89696 282087 323620 -252131 175088 -95721 18596
11343F4599L7395a80737L88N4955A08171c25306P049a9809q5995d8344K1247j09298
$$ 64599 101994 -180737 -180349 -125394 108171 -325306 -318257 -19809 -105804 -48344 -27097 -136395
11331a36395D6709M2727O0349L62209G3134d4647n0354c7617B33042D3676a16203
$$ -136395 46709 89436 149785 511994 73134 -44647 -95001 -37617 233042 43676 -116203
11319d26013A14539L3933C2939K683P5676e2928C5844R2466C0095J48661a35716
$$ -426013 114539 148472 32939 35622 111298 -52928 35844 128310 30095 178756 -135716
11307F1006h4202a3903A87501b53575g7012I8163a18443I7230B4185a50911B95107
$$ 61006 -84202 -13903 187501 -253575 -77012 98163 -118443 97230 24185 -150911 295107
11295A14308a07861K5616c8007C3133J21199a36326M8734A32572a31122d1869
$$ 114308 -107861 -82245 -38007 33133 154332 -136326 -87592 132572 -131122 -41869
11284a8781A11356E5326f5403m641A03889K7964b03774o1668f7488b3361m56516
$$ -18781 111356 55326 -65403 -70044 103889 131853 -203774 -265442 -67488 -23361 -479877
11273d79877a3242l10178H9028J06739C2181b14912H6226b16680j3858b6072A49321
$$ -479877 -13242 -323420 89028 195767 32181 -214912 86226 -216680 -230538 -26072 149321
11261G4966a03019d528k41556f5363B6237b03777a01647K9349j0519I3154M0903
$$ 74966 -103019 -4528 -246084 -65363 26237 -203777 -101647 -72298 -82817 93154 134057
11250A34057B7108b83981A5688K4455O9037b37665A28289j0798c8278A32666Q3800
$$ 134057 27108 -283981 15688 40143 109180 -237665 128289 117491 -38278 132666 216466
11239B16466G6450b2076C37889b23193B24578F1346k2827a21353P746F6238c6750
$$ 216466 76450 -22076 337889 -223193 224578 61346 38519 -121353 -113607 66238 -36750
11227B39598o9385a38749j4249L6506K7958A39573h9086o1166C16384A05500J07991
$$ 239598 170213 -138749 -152998 -116492 -88534 139573 -89086 -150252 316384 105500 213491
11216B13491a84318p0880i9269k433M9664b0678j16558d0408j65711A9532J97152
$$ 213491 -184318 -255198 -99269 -101702 -52038 -20678 -137236 -40408 -206119 19532 216684
11205B16684c4264l25171g8119p7969A06304c32278E2917a77001j61450k00859
$$ 216684 -34264 -359435 -78119 -156088 106304 -332278 52917 -177001 -338451 -539310
11195e39310a75458j8306l7018F2936J754a35828C3130J57469b04126F0245a67160
$$ -539310 -175458 -193764 -230782 62936 64690 -135828 33130 190599 -204126 60245 -167160
11183F7133b13138a9441n8988j7370K809A39852a72459J1673A2931a09837A3407
$$ 67133 -213138 -19441 -78429 -95799 -92990 139852 -172459 -160786 12931 -109837 13407
11171b96411A68141a97555k9154A12259c6879j64554O7585l8028e0923a5287p9572
$$ -296411 168141 -197555 -226709 112259 -36879 -201433 -133848 -171876 -50923 -15287 -94859
11160i4859A527L9256K5104a9928C5634c23462A10030n302A6535a99484b7914
$$ -94859 1527 40783 65887 -19928 35634 -323462 110030 104728 16535 -199484 -27914
11148A44483E8760A0811J69783F643d43747h3264B04527o3369a98138q6107b5578
$$ 144483 58760 10811 180594 6643 -443747 -83264 204527 141158 -198138 -284245 -25578
11136C2310O494A8818a56375r4088G0844C3640f4552B16073A858L68325j26054
$$ 32310 38804 18818 -156375 -250463 70844 33640 -64552 216073 1858 370183 244129
11125B44129C0009R2549b50956D02431d993j81483A04116L1613h6015A22596d7855
$$ 244129 30009 122558 -250956 402431 -4993 -186476 104116 135729 -86015 122596 -47855
11113b74296B3615a75849B0106K9812L14300j12596j24758J3553a26367D8566
$$ -274296 23615 -175849 20106 49918 364218 251622 126864 140417 -126367 48566
11102a5445A04497K18136F4758J85609b91577A4640b48647a11042A31125L9393
$$ -15445 104497 322633 64758 250367 -291577 14640 -248647 -111042 131125 170518
11092A70518O5218k900l0927K85735e5168D09372a76747B26012K5119m9474g425
$$ 170518 235736 232836 201909 487644 -55168 409372 -176747 226012 251131 201657 -7425
11080C81811a37880A77042o7121L7368M6345F6633Q2917K34683j88225J47222
$$ 381811 -137880 177042 109921 147289 193634 66633 149550 384233 196008 343230
11070C43230a17801l1174f8844A33841J94552G1620L3500K9259J31896O3744R3940
$$ 343230 -117801 -148975 -68844 133841 328393 71620 105120 134379 266275 330019 423959
11059D23959J68501q1668j83318R5819K31300B11457J51256j18457L9981o9996
$$ 423959 592460 510792 327474 423293 654593 211457 362713 244256 284237 214241
11049B14241o5772J16489K49963B36541K38340B32134L24733o8190J99098C33451
$$ 214241 148469 264958 514921 236541 474881 232134 556867 488677 687775 333451
11038E18793K24071K26899l41258K19456j45471K3240j15456n654j55867N82520
$$ 518793 742864 969763 628505 847961 702490 725730 610274 604620 448753 1031273
11028A031273m33919k07406O25217j48498K05156m82547N6858K68503J77194D72206
$$ 1031273 597354 389948 1015165 866667 1071823 589276 646134 914637 1091831 472206
11017I63708m45041K52766k49861M10042C51063K71976J31896J8676Q3343l90779
$$ 963708 518667 771433 521572 931614 351063 623039 754935 773611 856954 466175
11007D66175K09084N206J673m4839j65004K51648k07917L08778l87766K0192j0752
$$ 466175 675259 680465 682138 637299 472295 723943 516026 824804 437038 457230 446478
10996D46478N13K05423j7746J84907l51208L19045l88204L75402l29830Q1941
$$ 446478 446991 652414 634668 819575 468367 787412 399208 774610 444780 526721
10986E26721L47425D05356J69562J35234J77044l53040J79887p9784k05668O00059
$$ 526721 874146 405356 574918 710152 887196 534156 714043 634259 428591 1028650
10976A028650P3525j71611k21930J41250J34446m67425L15689M15444k32453j89244
$$ 1028650 1102175 930564 708634 849884 984330 516905 832594 1248038 1015585 826341
10966H26341K70693l1301M09226j80906J59321P3343K15390M89786j37936K91320
$$ 826341 1097034 1065733 1474959 1294053 1453374 1526717 1742107 2231893 2093957 2385277
10956B385277O8036k9823N6453Q3074l31719k19765j27178r7670k86598J21119
$$ 2385277 2453313 2423490 2479943 2563017 2231298 2011533 1884355 1786685 1500087 1621206
10946A621206J90595j31252K2177j53087K27958M3869r3783p1140N323k92578
$$ 1621206 1811801 1680549 1702726 1549639 1777597 1821466 1727683 1656543 1661866 1369288
10936A369288l86406o1516M9643D55545K30966j69631k9105K9788B35649N1117
$$ 1369288 982882 921366 971009 455545 686511 516880 487775 517563 235649 286766
10926B86766P8282R928A64148P9115J74788A35722O616Q3015L8199B6296f560
$$ 286766 365048 374976 164148 243263 418051 135722 142338 225353 263552 26296 -6560
10914i3603B69502q8618D1810l985a61609F256a0926j19792g151j07270n9157
$$ -93603 269502 180884 41810 37825 -161609 6256 -10926 -130718 -7151 -114421 -173578
10903a73578I9715l9881a02255B2724O688J55581h5390C2973J17240a00225m0301
$$ -173578 99715 59834 -102255 22724 29412 184993 -85390 32973 150213 -100225 -140526
10892a40526l8521P5543B928K00049A5997b58946j0060B02798g4306k4932J07
$$ -140526 -179047 -103504 2928 202977 15997 -258946 -269006 202798 -74306 -99238 -99131
10881i9131d1237A60793l9740L46589A04083f962A92188b35285i0077B51514A02467
$$ -99131 -41237 160793 121053 467642 104083 -6962 192188 -235285 -90077 251514 102467
10869c0492D1465j6961K5215a23295F295a17020F7118h5408B11886C5714K25012
$$ -30492 41465 24504 49719 -123295 6295 -117020 67118 -85408 211886 35714 260726
10858B60726d1352l58021i5425H9326a15719C8079f9946B5007a1755B06273h0582
$$ 260726 -41352 -399373 -95425 89326 -115719 38079 -69946 25007 -11755 206273 -80582
10846A32456E3252a58329a753A51079b48718G2023Q8447b33222A06663h1495B09799
$$ 132456 53252 -158329 -1753 151079 -248718 72023 160470 -233222 106663 -81495 209799
10834b91985C09427C4229d8791B4404e516j961B37224b81628J03241A48912c47581
$$ -291985 309427 34229 -48791 24404 -5516 -7477 237224 -281628 -178387 148912 -347581
10822a51103E1454B1715N0936M6605a03086E4561g8759r7219m1272G755J467a04636
$$ -151103 51454 21715 72651 119256 -103086 54561 -78759 -175978 -217250 7755 9222 -104636
10809a60235B63446h6922k3355C32766a25335j34736a07747A75425A2263i1910
$$ -160235 263446 -86922 -110277 332766 -125335 -260071 -107747 175425 12263 -91910
10798B5818f2842j87320C2301a68283L1392j40145A17039E1075k1845K20729k9517
$$ 25818 -62842 -250162 32301 -168283 -136891 -277036 117039 51075 29230 249959 220442
10787B20442b82334E547K42655a97626h461F8286a24999F6072a76837m5685i5323
$$ 220442 -282334 5547 248202 -197626 -8461 68286 -124999 66072 -176837 -222522 -95323
10775A33037b47874f9491j14903N8969K7501k18637F3085e09501A0317a10799
$$ 133037 -247874 -69491 -184394 -125425 -97924 -316561 63085 -509501 10317 -110799
10764b67884r2994b9569D8550a55721f8805g749k76905A86840P536h2719H30a23385
$$ -267884 -360878 -29569 48550 -155721 -68805 -7749 -284654 186840 194376 -82719 830 -123385
10751a895C65038I9971c26894J46802J4581f3194B20194a40969K3728A03459l7673
$$ -1895 365038 99971 -326894 -180092 -165511 -63194 220194 -140969 -117241 103459 65786
10740F5786Q5201b46480A18930b38602j4275A26284J7510h9863n596B40377C7415
$$ 65786 150987 -246480 118930 -238602 -252877 126284 143794 -89863 -95459 240377 37415
10728G4222a03714m444F6941a71018j29379H1069K18424G8261b55088I5086d08756
$$ 74222 -103714 -108158 66941 -171018 -300397 81069 299493 78261 -255088 95086 -408756
10716A31882g9795m16A09913a13314a2528o7808A2244a8812j0956j38670b1019
$$ 131882 -79795 -80211 109913 -113314 -12528 -80336 12244 -18812 -29768 -168438 -21019
10704f8926k43673e8908j75025p7149g5404C7831Q312b6658j98993A38745K00082
$$ -68926 -312599 -58908 -233933 -311082 -75404 37831 46143 -26658 -225651 138745 338827
10693C38827d9168m4360j76203A38898a78432A54480J15603b68715C4369J801
$$ 338827 -49168 -93528 -269731 138898 -178432 154480 270083 -268715 34369 36170
10683C6170A7570b5224B23272b20419i6853A15737E1003p749J890a45831C6463
$$ 36170 17570 -25224 223272 -220419 -96853 115737 51003 43254 45144 -145831 36463
10671B73435n5895a64799G4598k5939b04582H2470d8219n4463l5979B79829E650
$$ 273435 217540 -164799 74598 48659 -204582 82470 -48219 -102682 -138661 279829 5650
10659B38928j9366e1458B61436d79153D9190a26248H5073e9252q1686j040g0874
$$ 238928 219562 -51458 261436 -479153 49190 -126248 85073 -59252 -140938 -141978 -70874
10647D3910b06216c0513A60984l7235j9790a06762G5643l7751d4584E1955a65406
$$ 43910 -206216 -30513 160984 123749 103959 -106762 75643 37892 -44584 51955 -165406
10635b45429F5713b92675A2650a44112C292J30396A1677b09393J01473A0080a94454
$$ -245429 65713 -292675 12650 -144112 3292 133688 11677 -209393 -107920 10080 -194454
10623e153A56974b73112a17169M5817B2771b17082r2115a6171A53469n8495N7475
$$ -5153 156974 -273112 -117169 -71352 22771 -217082 -309197 -16171 153469 94974 152449
10612A52449c9673m57503A71909c12509h8266H8707C6358L5224h0040j34216O2341
$$ 152449 -39673 -497176 171909 -312509 -88266 88707 36358 71582 -80040 -214256 -151915
10601a51915c2870k59881b2993H4562a24100j8097O1344A494P9834b74570J07403
$$ -151915 -32870 -292751 -22993 84562 -124100 -142197 -80853 1494 81328 -274570 -167167
10590a67167A35584K07315c00397D1216A7686b50349j51456A37990a393j57052
$$ -167167 135584 342899 -300397 41216 17686 -250349 -401805 137990 -1393 -158445
10580a58445O6344A36194a5962B4092h3030G4130k2c09394R2049A04087a17926
$$ -158445 -92101 136194 -15962 24092 -83030 74130 74108 -309394 -217345 104087 -117926
10568E5725L8546b56756A0400a68823J4918a4027B66765D671a22209A32801e29800
$$ 55725 94271 -256756 10400 -168823 -153905 -14027 266765 4671 -122209 132801 -529800
10556f730H6520a95824A33758C839K4609M4071c35455a42506B059J59628l9674
$$ -6730 86520 -195824 133758 3839 28448 72519 -335455 -142506 2059 161687 122013
10545A22013a33872J6309L1382G8885a7185p8022k29315B61745H8080e18573G8657
$$ 122013 -133872 -117563 -86181 78885 -17185 -95207 -324522 261745 88080 -518573 78657
10533c14689F1898b05009I9137d4516a2919j3497j89143f5463J5036j64822j16051
$$ -314689 61898 -205009 99137 -44516 -12919 -26416 -215559 -65463 -50427 -215249 -331300
10522c31300h1840n3753j81038F3333e9194E9737f8067A00196a88385j00344i5590
$$ -331300 -81840 -135593 -316631 63333 -59194 59737 -68067 100196 -188385 -288729 -95590
10510C22681a89412r5905B30841d2222A0841b22941N0940b8747j25550e0141a0177
$$ 322681 -189412 -285317 230841 -42222 10841 -222941 -172001 -28747 -154297 -50141 -10177
10498d21578G3838i8095j6518m1950K2642A56416m8576k5208a7135l04829a53286
$$ -421578 73838 -98095 -114613 -156563 -133921 156416 107840 82632 -17135 -321964 -153286
10486b7161j33463j3996d9789j25698j45290A61361E030b39052D02986D0563b64003
$$ -27161 -160624 -174620 -49789 -175487 -320777 161361 5030 -239052 402986 40563 -264003
10474g1001C58720j02806b08733C9409K72529A49912J74758j27456A833L6377
$$ -71001 358720 255914 -208733 39409 311938 149912 324670 197214 1833 38210
10464C8210M84667j15718M7442j61862a17167C25690e4675C22975i3886K6691
$$ 38210 522877 407159 454601 292739 -117167 325690 -54675 322975 -93886 -67195
10454f7195j84804c3528G8810a9302A99497I9600J46683a17420j01527c6564E7116
$$ -67195 -251999 -33528 78810 -19302 199497 99600 246283 -117420 -218947 -36564 57116
10442a71576E7850b57428a7458j57410F6113b5827A4917J712b6456n2212E4197
$$ -171576 57850 -257428 -17458 -174868 66113 -25827 14917 16629 -26456 -78668 54197
10430b5329B31946b2280A30700B8985J85536M8430i7528M2454B07870f2333A68115
$$ -25329 231946 -22280 130700 28985 214521 262951 -97528 -55074 207870 -62333 168115
10418a17504C64876e4439A04353k1575c9743A59056b22067i0948J6877g402B50388
$$ -117504 364876 -54439 104353 82778 -39743 159056 -222067 -90948 -74071 -7402 250388
10406G7068a90580N7057E8206b22564p8762G6266J36426O8812E580L80978A05711
$$ 77068 -190580 -133523 58206 -222564 -301326 76266 212692 281504 5580 386558 105711
10394h0519I5584K42031D5351J05213K0541e5309m88496b60697R2159q5658B92062
$$ -80519 95584 337615 45351 150564 171105 -55309 -543805 -260697 -168538 -254196 292062
10382A35465M0961c6963a970F992b34787C41873G546K16940J01231I1149B7363
$$ 135465 176426 -36963 -1970 6992 -234787 341873 7546 224486 325717 91149 27363
10370C13439G5570M718j9471K97353b46219f1437A47280J41507j02738a384r7832
$$ 313439 75570 80288 60817 358170 -246219 -61437 147280 288787 186049 -1384 -99216
10359i9216d3551A49740K17347a46892B10547l827K31211j32593N4257J90788
$$ -99216 -43551 149740 367087 -146892 210547 206720 437931 305338 359595 550383
10349E50383k59482J78741j02019D5123N56585B27914K12551A56110L1881O023
$$ 550383 290901 469642 367623 45123 601708 227914 440465 156110 187991 194014
10339A94014J94703j22717B7815L73988j89196J1946L23326j83903j73116J04476
$$ 194014 388717 266000 27815 401803 212607 224553 547879 363976 190860 295336
10329B95336j26405P9703J82799k8636N3888j99566N4114r1526k3659I6653J6770
$$ 295336 168931 248634 431433 402797 456685 257119 311233 219707 196048 96653 113423
10318A13423L8168b76167a1898p5439j9355k43614A87655f3731A04343l2440Q2082
$$ 113423 151591 -276167 -11898 -87337 -106692 -350306 187655 -63731 104343 71903 153985
10307A53985J6651J14250j41444L2113P5549E3863J51794Q2770b23647b0014G5650
$$ 153985 170636 284886 143442 175555 251104 53863 205657 288427 -223647 -20014 75650
10295d5224H4906f7403G995h8733c6837A91568b06798A91997b98647O6115e6050
$$ -45224 84906 -67403 7995 -88733 -36837 191568 -206798 191997 -298647 -232532 -56050
10283h8912A46718q185a85457e3956A64690e2391C2077J6474a61895k98091A43339
$$ -88912 146718 138533 -185457 -53956 164690 -52391 32077 48551 -161895 -459986 143339
10271A9845c24383J46744A11270a45431K4142b7231A62555d38575a82661B81522
$$ 19845 -324383 -177639 111270 -145431 -121289 -27231 162555 -438575 -182661 281522
10260a80611p5775c0931A02667a10118E6535k3503c48155B01750b32077A88833
$$ -180611 -256386 -30931 102667 -110118 56535 33032 -348155 201750 -232077 188833
10249c223p3348G1822J27733G6054l0273J95830j15888L76110b7758A434L7380
$$ -3223 -76571 71822 199555 76054 45781 241611 125723 501833 -27758 1434 38814
10238C8814C868N7492j5756j3041b26350A19111c5843a5949B11865l6435N0942
$$ 38814 3868 61360 45604 32563 -226350 119111 -35843 -15949 211865 175430 226372
10227B26372j09553F531M9036b53593C9529e0688H7883R199a83839A76666H6783
$$ 226372 116819 6531 55567 -253593 39529 -50688 87883 97082 -183839 176666 86783
10215b26341F6960b4091K166B52700p4497a07511k8746l35369f5032A45364a8328
$$ -226341 66960 -24091 -21925 252700 178203 -107511 -136257 -471626 -65032 145364 -18328
10203b24223A4554M6236b45078c7953j47444j94387I8261h5765r4348d7866D1492
$$ -224223 14554 60790 -245078 -37953 -185397 -379784 98261 -85765 -180113 -47866 41492
10191a65842D1641d20155b01531B4198J0489J54115c2904A62823A6818K13243
$$ -165842 41641 -420155 -201531 24198 34687 188802 -32904 162823 16818 230061
10181B30061b75930A68806f1822b1406l1941A46704p3344b06867B221a63689b9269
$$ 230061 -275930 168806 -61822 -21406 -53347 146704 73360 -206867 2221 -163689 -29269
10169a14330k4140L3116A7527a590l47164L0219B49133n6888a06907B2366N77
$$ -114330 -138470 -105354 17527 -1590 -348754 -318535 249133 192245 -106907 22366 22943
10158B2943i9915B8862c8247r3104E8634a4677A413a26248o9214d7234a1369k82683
$$ 22943 -99915 28862 -38247 -131351 58634 -14677 1413 -126248 -195462 -47234 -11369 -294052
10146b94052j17886a17367r3352A99877p3289A6629M57181i8874A77525C5437
$$ -294052 -411938 -117367 -210719 199877 126588 16629 473810 -98874 177525 35437
10135a1892A70129c69447f3131D3901J1036a02137j43389C3771O085c11284e6309
$$ -11892 170129 -369447 -63131 43901 54937 -102137 -245526 33771 39856 -311284 -56309
10123b26874A46942G0575a71331j94277e1024k56147e2545H5754a75806j08486
$$ -226874 146942 70575 -171331 -365608 -51024 -307171 -52545 85754 -175806 -284292
10113b84292k7091Q1197F7542b15551P1071m4902q9865R9537Q6361k30508B40782
$$ -284292 -311383 -230186 67542 -215551 -144480 -189382 -279247 -179710 -93349 -323857 240782
10101a13509B05887H5424b56630m995R8963B8576O2808b6145A15318N7430I826
$$ -113509 205887 85424 -256630 -261625 -162662 28576 91384 -26145 115318 172748 9826
10089H5935J1162b69951l3069B76786a06675r7449k0998J8674N8389j34819d1686
$$ 85935 97097 -269951 -303020 276786 -106675 -204124 -225122 -206448 -148059 -282878 -41686
10077B23658G3708K04443q1350f8080k74720J41530A18529a07804C3491a08667
$$ 223658 73708 278151 196801 -68080 -342800 -201270 118529 -107804 33491 -108667
10066B29015B4858b34632C3263L4982c9453E9224d545k38859K6637j70070A46840
$$ 229015 24858 -234632 33263 68245 -39453 59224 -4545 -243404 -216767 -386837 146840
10054b01806j8395L5220i2380j01729g3886q2902j19644o0957A25657f305A89036
$$ -201806 -220201 -184981 -92380 -194109 -73886 -156788 -276432 -337389 125657 -6305 189036
10042c88215J53685D4881a32839f494j338k7962l4474m3910A06987i2530k42145
$$ -388215 -234530 44881 -132839 -6494 -7832 -35794 -70268 -114178 106987 -92530 -334675
10031c34675a05927j09801J01687n790A10686A9148i2387A25538O3749K6082b11769
$$ -334675 -105927 -215728 -114041 -119831 110686 19148 -92387 125538 189287 215369 -211769
10019B33255j04318f8875j04240B2573g2900A66704b9138j34264A37326L9609
$$ 233255 128937 -68875 -173115 22573 -72900 166704 -29138 -163402 137326 176935
10009A76935a76079h2108j60063J11355l1488O1329f682I3647a7018j84382D1420
$$ 176935 -176079 -82108 -242171 -130816 -162304 -100975 -6682 93647 -17018 -201400 41420
9997A76703b50372B12389H2233b99321I8051b4594l03799a54769e2695A57219
$$ 176703 -250372 212389 82233 -299321 98051 -24594 -328393 -154769 -52695 157219
9986A53877j640d27507J13082A25904D2525a33395l39358C43532j33489A1360
$$ 153877 152237 -427507 -314425 125904 42525 -133395 -472753 343532 210043 11360
9975b75459c6697m7546j12963r0114J37475p2244B14855e4511n542l50019E9647
$$ -275459 -36697 -84243 -197206 -287320 -149845 -222089 214855 -54511 -60053 -410072 59647
9963c00958B00822q1417c00816J21050h284E6205b22545n5831e2074I3942l2491
$$ -300958 200822 119405 -300816 -179766 -8284 56205 -222545 -278376 -52074 93942 61451
9952F1451a97565o9900k70451c7106p4197c2569k2583n75498D4276b4766C0310
$$ 61451 -197565 -267465 -537916 -37106 -111303 -32569 -55152 -630650 44276 -24766 30310
9940f040p4661C6545J47073n921b26676K4818L7642J2920e030G0896k5336a89084
$$ -6040 -80701 36545 183618 177697 -226676 -201858 -164216 -151296 -5030 70896 45560 -189084
9927a21315A23252J7673b34703J07708l50298e703H6281a88931k44071K02752
$$ -121315 123252 140925 -234703 -126995 -477293 -5703 86281 -188931 -433002 -230250
9917b30250J6038p1484a13837a1920j7728l3516D9624a81297O3743J6137D7922
$$ -230250 -214212 -285696 -113837 -11920 -29648 -63164 49624 -181297 -117554 -101417 47922
9905A16950i3384A36164m2558a51161C507b86529h7369k38741A94581a30255A89461
$$ 116950 -93384 136164 93606 -151161 3507 -286529 -87369 -326110 194581 -130255 189461
9893G4283a60402A28434d07935A06573k3108c98177a3155m4633A14233a8918o0700
$$ 74283 -160402 128434 -407935 106573 83465 -398177 -13155 -57788 114233 -18918 -79618
9882g9618k8261o5760l0324e428r4419k77356a1874j409r9703D7244a71534A03443
$$ -79618 -107879 -173639 -203963 -5428 -99847 -377203 -11874 -13283 -112986 47244 -171534 103443
9869A05513l1568J61358j16398h9489A36818n5259J31332b8893r152j94010A76349
$$ 105513 73945 235303 118905 -89489 136818 81559 212891 -28893 -38045 -232055 176349
9857A70573g4199k4124M2981D5886c18903P7931a0365F5445B6468c70955C2223
$$ 170573 -74199 -98323 -55342 45886 -318903 -240972 -10365 65445 26468 -370955 32223
9845d37655A4848J24774B5370a20263N0346r9368H2271J58068a48868A0508R5722
$$ -437655 14848 139622 25370 -120263 -69917 -169285 82271 240339 -148868 10508 106230
9834A06230N2876b83802C0308J07729I652a74369B55627E449a33602f2210I5185
$$ 106230 159106 -283802 30308 138037 9652 -174369 255627 5449 -133602 -62210 95185
9822d4226J1703m22667d7104C9513a08829n3501j33709N1493B1767b62499I1797
$$ -44226 -32523 -455190 -47104 39513 -108829 -162330 -296039 -244546 21767 -262499 91797
9810c49704A18195L04910j4096c35073P8080r6642c89j34176q6799D79145e2261
$$ -349704 118195 423105 409009 -335073 -256993 -353635 -389 -134565 -221364 479145 -52261
9798c0881o7322m9071A21376f9162D4622A4297a66304A83056f3713q8451A41955
$$ -30881 -98203 -147274 121376 -69162 44622 14297 -166304 183056 -63713 -152164 141955
9786i1512L682j6189E9313q937J63280C6814J08524b24666B26398a53266H772
$$ -91512 -87830 -104019 59313 50376 213656 36814 145338 -224666 226398 -153266 8772
9774C8704c37492e7090D394K83951l7008B2547b02781J00442A68269a79189A81685
$$ 38704 -337492 -57090 4394 288345 251337 22547 -202781 -102339 168269 -179189 181685
9762A17546c51980J14683i4419K0861R756j17519N5244A04229c04572A84780b51730
$$ 117546 -351980 -237297 -94419 -73558 -63802 -181321 -126077 104229 -304572 184780 -251730
9750f9299a0195k27897l0231B89666a32769j40128c2228a0932r0456m03318A56377
$$ -69299 -10195 -238092 -268323 289666 -132769 -272897 -32228 -10932 -101388 -504706 156377
9738h3178a8317C76605i0269p1730L2182M2526j70647J27078n7911j528B0268
$$ -83178 -18317 376605 -90269 -161999 -129817 -87291 -257938 -130860 -188771 -190299 20268
9726b09215F5035e9146l92260C0101b60693n2005a50427A2313R3513a12948l6401
$$ -209215 65035 -59146 -451406 30101 -260693 -312698 -150427 12313 105826 -112948 -149349
9715a49349p0214d2787J9423B07681p2922a49831D6315c56078a11191r869A09821
$$ -149349 -219563 -42787 -23364 207681 134759 -149831 46315 -356078 -111191 -121060 109821
9703A04786a44312A90240a40705F7374b52981C5314a08382H9322f5530A56992
$$ 104786 -144312 190240 -140705 67374 -252981 35314 -108382 89322 -65530 156992
9692G7739a61354L6370k22187k14312d0954j93936b8434H8032g8128j4295A14417
$$ 77739 -161354 -124984 -347171 -561483 -40954 -234890 -28434 88032 -78128 -92423 114417
9680a7100j14983B60400a39358D4237c05078G866a10663A40969f4190n2512B42468
$$ -17100 -132083 260400 -139358 44237 -305078 7866 -110663 140969 -64190 -116702 242468
9668c00189O2106h4265b7043r4330I3893b1284k33098J2525k1085f0832G9527
$$ -300189 -238083 -84265 -27043 -121373 93893 -21284 -254382 -241857 -262942 -60832 79527
9656B69974a89424Q1617C13206a25035C4022j5673P7056a107C00231d04897i611
$$ 269974 -189424 -107807 313206 -125035 34022 18349 95405 -1107 300231 -404897 -9611
9644A37224a27827c4452A07569A217a55245f0168A19159a7823l02617a27902I9412
$$ 137224 -127827 -34452 107569 1217 -155245 -60168 119159 -17823 -320440 -127902 99412
9632b81627C81730a7998A25736J4098A6691c58475c9892D0007a09587N4780n6736
$$ -281627 381730 -17998 125736 139834 16691 -358475 -39892 40007 -109587 -54807 -111543
9621a11543j55193H4064b09630E2854a68752B40828h4577B9046K3053d05207D9251
$$ -111543 -266736 84064 -209630 52854 -168752 240828 -84577 29046 52099 -405207 49251
9609B84532A04447d370j08444j28898e7605A58597i9332j62494q9285a70983m459
$$ 284532 104447 -4370 -112814 -241712 -57605 158597 -99332 -261826 -351111 -170983 -175442
9598a75442j70612H245a43454d3562r0811E0671b6929A64502d15678b8671q6005
$$ -175442 -346054 8245 -143454 -43562 -134373 50671 -26929 164502 -415678 -28671 -114676
9587a14676j3010e4122B4908a56852J004e9452q1424c8173F5885a05581K2412
$$ -114676 -127686 -54122 24908 -156852 -155848 -59452 -140876 -38173 65885 -105581 -83169
9576h3169k66098a67997E7883b53520h715k66355J06503M9448c4664p1020k98287
$$ -83169 -349267 -167997 57883 -253520 -8715 -275070 -168567 -119119 -34664 -105684 -403971
9565d03971i7385l290L049L0064B66808E9539h1893j3773A09799d28572a20196
$$ -403971 -97385 -100675 -97626 -67562 266808 59539 -81893 -95666 109799 -428572 -120196
9553I9979c21537c0580k19862J09646C5638Q587i8470A18338c4544q4198n9933
$$ 99979 -321537 -30580 -250442 -140796 35638 44225 -98470 118338 -34544 -118742 -178675
9542a78675Q0248j24092B2838d6893j80160Q8896N8413r52j98557b6037j07895
$$ -178675 -98427 -222519 22838 -46893 -227053 -138157 -79744 -80696 -279253 -26037 -133932
9531a33932L9713B12024c34411C5262A1646M7593a14093B30362b88495J00061
$$ -133932 -94219 212024 -334411 35262 11646 59239 -114093 230362 -288495 -188434
9521a88434A88520b69745g79j34658f5199j53143B2923g2480A31957d7577D7295
$$ -188434 188520 -269745 -779 -135437 -65199 -218342 22923 -72480 131957 -47577 47295
9509G9928a13029c9345o480B11925h4845D8589a98678F8889K9893O9273a37369
$$ 79928 -113029 -39345 -45825 211925 -84845 48589 -198678 68889 98782 168055 -137369
9497a45135A85063b17242g1295A7500d51551N0210B70246e381p1558k93297a45880
$$ -145135 185063 -217242 -71295 17500 -451551 -401341 270246 -5381 -76939 -370236 -145880
9485B0136P2028c74870f2734J6980C3748J31006b01661K9161A13110c31265H1646
$$ 20136 92164 -374870 -62734 -45754 33748 164754 -201661 -172500 113110 -331265 81646
9473c06155b1871l4819k0507B14799c38964P6970c2174j59323A15751a03851B35986
$$ -306155 -21871 -56690 -77197 214799 -338964 -261994 -32174 -191497 115751 -103851 235986
9461B7560b7339j52838a1174j72538h2313l37068J91805c2050k224A00426a75880
$$ 27560 -27339 -180177 -11174 -183712 -82313 -419381 -227576 -32050 -34274 100426 -175880
9449H8668D802i661j29660j0345f6590r3122j19694j0444h4473j4274A69307c1977
$$ 88668 4802 -9661 -139321 -149666 -66590 -159712 -279406 -289850 -84473 -98747 169307 -31977
9436b29375h1018A23169B1961a34733A4298a35896l98875c6487l18073I6406c19841
$$ -229375 -81018 123169 21961 -134733 14298 -135896 -534771 -36487 -354560 96406 -319841
9424b7067j05744C03473i3020k929n1794e2710k46963a36517l7384Q110H8562
$$ -27067 -132811 303473 -93020 -95949 -147743 -52710 -299673 -136517 -173901 -165791 88562
9412C26004c7269A67780P6743d3365H9330D0160d15498i8492n9605o4547G3527
$$ 326004 -37269 167780 244523 -43365 89330 40160 -415498 -98492 -158097 -222644 73527
9400e3495C74843a94503e7716j05398P8659j7910j23189r8088O9010M3195B91582
$$ -53495 374843 -194503 -57716 -163114 -84455 -102365 -225554 -323642 -254632 -211437 291582
9388B70990G4373G419b13612a5932A34423f3599A34052d1948A85270b74012O7421
$$ 270990 74373 7419 -213612 -15932 134423 -63599 134052 -41948 185270 -274012 -206591
9377b06591k6784I4822b18201I7632e905j49856j15217A85849g2942j27469C77447
$$ -206591 -233375 94822 -218201 97632 -5905 -155761 -270978 185849 -72942 -200411 377447
9365a8097o7499B60285I8182i1081p6832G6138d2003k46764d4720l48184A47816
$$ -18097 -85596 260285 98182 -91081 -167913 76138 -42003 -288767 -44720 -392904 147816
9353B507N0597b06745K4214c9066a782A58996b47554e9375j42293q2631E639f8058
$$ 2507 53104 -206745 -182531 -39066 -1782 158996 -247554 -59375 -201668 -284299 5639 -68058
9340d9152o3816j72974N6090N0718e5622A14051a19662n7342b1899B08353b27311
$$ -49152 -112968 -285942 -229852 -179134 -55622 114051 -119662 -177004 -21899 208353 -227311
9328A75209B2311b31825e1753k35395j94622B32079a52639Q325O3120A32593a01167
$$ 175209 22311 -231825 -51753 -287148 -481770 232079 -152639 -144314 -81194 132593 -101167
9316F9679Q509O1604d04388B80888h438l59922A19024R749c22361I5869m4148
$$ 69679 78188 139792 -404388 280888 -8438 -368360 119024 128773 -322361 95869 51721
9305E1721e061j95974B49751a22424a3392p2435A4810a21590q9991F6435a79934
$$ 51721 -5061 -201035 249751 -122424 -13392 -85827 14810 -121590 -211581 66435 -179934
9293a50872A14561D594a23647c6855j09548k06770P9444A43983a39409b3499f420
$$ -150872 114561 4594 -123647 -36855 -146403 -353173 -273729 143983 -139409 -23499 -6420
9281c5954k63778j81249b7307b776C49969A66190A197a09513p9329e3542A05380
$$ -35954 -299732 -480981 -27307 -2776 349969 166190 1197 -109513 -188842 -53542 105380
9269a71359B36421J81378a80072B18038J31133a75968F3575h8292A48919c79017
$$ -171359 236421 417799 -180072 218038 349171 -175968 63575 -88292 148919 -379017
9258A3219J2461a60104A18418c71317G2252O685J04113J46615e9576A46164a57670
$$ 13219 25680 -160104 118418 -371317 72252 78937 183050 329665 -59576 146164 -157670
9246f3055B88904a15272l8862n2699M8021M206m088r4409a09106N2240k33378
$$ -63055 288904 -115272 -154134 -206833 -158812 -154606 -158694 -253103 -109106 -56866 -290244
9235b90244J44835e916r5793a5993m7526K1073A08152a10853l18375a22498j06464
$$ -290244 -145409 -5916 -101709 -15993 -63519 -42446 108152 -110853 -429228 -122498 -228962
9224b28962i2235I1041c64202a34993C36500a55958j97481f2529k91746A63035
$$ -228962 -92235 91041 -364202 -134993 336500 -155958 -353439 -62529 -354275 163035
9213A7040c63030A19886O693c14120p3103J86753j30861a5869j1134k1919j1433
$$ 17040 -363030 119886 126579 -314120 -387223 -200470 -331331 -15869 -27003 -48922 -60355
9202f0355K1848H4356b26568b3936j74666I5523o443k582b6140l0086C31318a01617
$$ -60355 -38507 84356 -226568 -23936 -198602 95523 89080 86498 -26140 -56226 331318 -101617
9189A0881c0638A60453a03983C31911a1581j49199P659A7167a16879d0470j80742
$$ 10881 -30638 160453 -103983 331911 -11581 -160780 -153121 17167 -116879 -40470 -221212
9178b21212L5650e5179m9043n4679j5935e6242k22028A75007d8648m6715j1518
$$ -221212 -185562 -55179 -104222 -158901 -174836 -56242 -278270 175007 -48648 -95363 -106881
9167a06881A43591a3354q4970k43357A25339d4605D1219a2690A41281o3961a96224
$$ -106881 143591 -13354 -98324 -341681 125339 -44605 41219 -12690 141281 77320 -196224
9155b6482j80152h9747K4388q0702l4816L2553E5362a78635M3032C6155f4896
$$ -26482 -206634 -89747 -65359 -146061 -180877 -148324 55362 -178635 -135603 36155 -64896
9143a0245j73084B58728H090J87073G7973a90984E7088f6183q4435A6110O9091
$$ -10245 -183329 258728 8090 195163 77973 -190984 57088 -66183 -150618 16110 85201
9132H5201c15489b5297j14755G2406a96935I7891i9963j46841B08135f8333J6694
$$ 85201 -315489 -25297 -140052 72406 -196935 97891 -99963 -246804 208135 -68333 -51639
9121e1639o1283k4461K4409K2445M1705I5001e756B13936b50882l91A37779a42034
$$ -51639 -112922 -137383 -112974 -90529 -48824 95001 -5756 213936 -250882 -251273 137779 -142034
9108c33124N0433A42568G35a06878A10173c2807k39011a22070A99207a49550d9764
$$ -333124 -282691 142568 735 -106878 110173 -32807 -271818 -122070 199207 -149550 -49764
9096a93107i1057B44703F1267J9988a83964b1724A21825M3526C4963a01229K3780
$$ -193107 -91057 244703 61267 81255 -183964 -21724 121825 165351 34963 -101229 -77449
9085g7449P691k21913j4793A27375k9769M7757a3648B66012A1628J14698a35014
$$ -77449 -69758 -291671 -306464 127375 97606 145363 -13648 266012 11628 126326 -135014
9073I2261d8079j15360O9200D3678f6180l51913B4167a50640d6255A19830a76587
$$ 92261 -48079 -163439 -94239 43678 -66180 -418093 24167 -150640 -46255 119830 -176587
9061C09506g0178k7165d0163k67923J49404D5884J59840b16205D241K4374b82156
$$ 309506 -70178 -97343 -40163 -308086 -158682 45884 205724 -216205 4241 28615 -282156
9049B05426J65029A8613c6687A16860E4105d5244l00504c3706k23433b7915B41639
$$ 205426 370455 18613 -36687 116860 54105 -45244 -345748 -33706 -257139 -27915 241639
9037b23347h17j05816L0791F3515B2160a78535A44671c52333H8380c14828A2391
$$ -223347 -817 -106633 -75842 63515 22160 -178535 144671 -352333 88380 -314828 12391
9025c1465k18213K8550C58417H2673O7395c8950a9026p434l40122a01683k96087
$$ -31465 -249678 -221128 358417 82673 150068 -38950 -19026 -26460 -366582 -101683 -397770
9014c97770A1743K0245d7785A67208a7530k53204B75914a09873o0262e6962D7488
$$ -397770 11743 31988 -47785 167208 -17530 -270734 275914 -109873 -170135 -56962 47488
9002C1260J09751B2668a42689A71604b64451B16377c89962j7144a16976B95667
$$ 31260 141011 22668 -142689 171604 -264451 216377 -389962 -407106 -116976 295667
8991a46208E5560B0237d16572D6296a54750C19176F747J13131P0963b24337j94692
$$ -146208 55560 20237 -416572 46296 -154750 319176 6747 119878 190841 -224337 -419029
8980d19029F0725K4326b32115C17334a44350A3772Q3650a58767n3457A44495B4573
$$ -419029 60725 85051 -232115 317334 -144350 13772 97422 -158767 -212224 144495 24573
8968b49680J20528A1289a17892A41659a22523G9406c6740m2568k81905f3332M575
$$ -249680 -129152 11289 -117892 141659 -122523 79406 -36740 -79308 -361213 -63332 -58757
8957e8757g433l80704D008b21935m3152N9021d829k02256G916a08604A49157Q7474
$$ -58757 -7433 -388137 4008 -221935 -265087 -206066 -4829 -207085 7916 -108604 149157 236631
8945B36631a8859R160k80208C1393J89147F6966a12131j60932J09700C3859L36293
$$ 236631 -18859 -9699 -289907 31393 220540 66966 -112131 -273063 -163363 33859 370152
8934C70152b57856F5116R1963B5531O4231e2773I6174c9445D8983O2485a5415
$$ 370152 -257856 65116 157079 25531 89762 -52773 96174 -39445 48983 111468 -15415
8922a45885f246j63812A35981N5520k6279n4274j5125c5481B25920d7910C55507
$$ -145885 -6246 -170058 135981 191501 165222 110948 95823 -35481 225920 -47910 355507
8910C57865J22364O52957P44885J248325K678620M517775D964456B445724r13176
$$ 357865 480229 1133186 1878071 3126396 5805016 10322791 4964456 2445724 1532548
8901A532548m84206m45983A82983R9801o9417L3736a14265A07186J22819J06865
$$ 1532548 1048342 602359 182983 282784 213367 247103 -114265 107186 230005 336870
8891C36870K1350B7988a7044j39708A73496c44040a03881j29043f6840j14187
$$ 336870 358220 27988 -17044 -156752 173496 -344040 -103881 -232924 -66840 -181027
8881a81027r360R0484q2720B94526b25709Q5380k0139B49657A1097R5238a90942
$$ -181027 -190387 -99903 -182623 294526 -225709 -140329 -160468 249657 11097 106335 -190942
8869a32061P678c466H9675m3205h9854B4124J02005b7901l00423A42285F4764
$$ -132061 -124383 -3466 89675 46470 -89854 24124 126129 -27901 -328324 142285 64764
8857C16835g6769n0258j0777j88379J59766k901f2823l37540i3138F8194J71093
$$ 316835 -76769 -127027 -137804 -326183 -166417 -169318 -62823 -400363 -93138 68194 239287
8846B39287b81473d4499p105C5925c34716A98824f9770K3494r0596d9594k33933
$$ 239287 -281473 -44499 -51604 35925 -334716 198824 -69770 -46276 -136872 -49594 -283527
$$ [...]
##END NTUPLES=NMR SPECTRUM
##END=
