
##TITLE=UV1145_M6-1005-1000_6278956_mZORSG78Rj
##JCAMPDX= 6.0         $$ Bruker NMR JCAMP-DX V2.0
##DATA TYPE= NMR SPECTRUM
##DATA CLASS= NTUPLES
##ORIGIN= BRUKER
##OWNER= Administrator
$$ 1.72 TOPSPIN		Version 2.1
$$ 2012-06-03 14:58:19.359 -0500  Administrator@TOPSPIN
$$ Compression mode = diff/dup
##.OBSERVE FREQUENCY= 400.13188235
##.OBSERVE NUCLEUS= ^1H
##.ACQUISITION MODE= SIMULTANEOUS (DQD)
##.ACQUISITION SCHEME= undefined
##.AVERAGES= 64
##.DIGITISER RES= 22
##SPECTROMETER/DATA SYSTEM= spect
##.PULSE SEQUENCE= noesygpps1d.comp
##.SOLVENT NAME= COFFEE_meoh
##.SHIFT REFERENCE= INTERNAL, COFFEE_meoh, 1, 14.96707
##AUDIT TRAIL= $$ (NUMBER, WHEN, WHO, WHERE, PROCESS, VERSION, WHAT)
$$ ##TITLE= Audit trail, TOPSPIN		Version 2.1
$$ ##JCAMPDX= 5.01
$$ ##ORIGIN= Bruker BioSpin GmbH
$$ ##OWNER= Administrator
$$ $$ C:\Bruker\TOPSPIN/data/COFFEE/nmr/UV1145_M6-1005-1000_6278956_mZORSG78Rj/12/pdata/1/auditp.txt
$$ ##AUDIT TRAIL=  $$ (NUMBER, WHEN, WHO, WHERE, PROCESS, VERSION, WHAT)
(   1,<2012-06-03 14:58:14.250 -0500>,<Administrator>,<TOPSPIN>,<go>,<TOPSPIN 2.1>,
      <created by zg
	started at 2012-06-03 14:46:43.937 -0500,
	POWCHK enabled, PULCHK disabled,
       configuration hash MD5:
       D5 CA 7A 23 FE 6B EE E2 50 67 74 61 24 F7 5E 3B
       data hash MD5: 64K
       16 BF 76 3B EE 5E 3E 2E 84 D0 8E 35 AB 62 F2 CF>)
(   2,<2012-06-03 14:58:17.187 -0500>,<Administrator>,<TOPSPIN>,<proc1d>,<TOPSPIN 2.1>,
      <Start of raw data processing
       efp LB = 0.3 FT_mod = 6 PKNL = 1 PHC0 = 0 PHC1 = 0 SI = 128K 
       data hash MD5: 128K
       60 69 6F 14 1A 3D B0 B8 CF 25 A6 B8 2B 2E E1 87>)
(   3,<2012-06-03 14:58:18.359 -0500>,<Administrator>,<TOPSPIN>,<proc1d>,<TOPSPIN 2.1>,
      <pk PHC0 = 34.30481 PHC1 = 0 
       data hash MD5: 128K
       A4 CE E6 3F D5 E7 4C 20 0C 08 9E 9E 01 6C A2 65>)
(   4,<2012-06-03 14:58:19.015 -0500>,<Administrator>,<TOPSPIN>,<proc1d>,<TOPSPIN 2.1>,
      <abs ABSG = 1 
       data hash MD5: 128K
       CE C5 26 98 99 10 A5 95 8C 77 08 7A 28 E9 0C F0>)
(   5,<2012-06-03 14:58:19.093 -0500>,<Administrator>,<TOPSPIN>,<proc1d>,<TOPSPIN 2.1>,
      <abs ABSG = 2 
       data hash MD5: 128K
       BA DE B8 95 53 E4 12 26 09 B5 ED 99 96 79 1F A6>)
(   6,<2012-06-03 14:58:19.140 -0500>,<Administrator>,<TOPSPIN>,<proc1d>,<TOPSPIN 2.1>,
      <abs ABSG = 3 
       data hash MD5: 128K
       12 15 6C B9 C2 D7 3C 8A DE 99 FB 8D F1 8E 70 07>)
(   7,<2012-06-03 14:58:19.203 -0500>,<Administrator>,<TOPSPIN>,<proc1d>,<TOPSPIN 2.1>,
      <abs ABSG = 4 
       data hash MD5: 128K
       B9 84 DD 6E F0 EA 93 C8 44 B6 24 69 F8 A6 3E A9>)
(   8,<2012-06-03 14:58:19.265 -0500>,<Administrator>,<TOPSPIN>,<proc1d>,<TOPSPIN 2.1>,
      <abs ABSG = 5 
       data hash MD5: 128K
       94 7F 0D D8 5C C6 D1 3F 03 79 5C 50 3D 19 E8 5B>)
$$ ##END=
$$ 
$$ $$ hash MD5
$$ $$ 19 71 AB 34 0B 19 D4 31 69 9B 07 46 06 DC 0E 12
##$RELAX= 
##$RELAX= 
##$RELAX= 
##$RELAX= 
##$RELAX= 
##$RELAX= 
##$RELAX= 
##$RELAX= 
$$ Bruker specific parameters
$$ [...]
##$TP07= 0
##$TPNAME0= <>
##$TPNAME1= <>
##$TPNAME2= <>
##$TPNAME3= <>
##$TPNAME4= <>
##$TPNAME5= <>
##$TPNAME6= <>
##$TPNAME7= <>
##$TPOAL= (0..7)
0.5 0.5 0.5 0.5 0.5 0.5 0.5 0.5
##$TPOFFS= (0..7)
0 0 0 0 0 0 0 0
##$TUNHIN= 0
##$TUNHOUT= 0
##$TUNXOUT= 0
##$USERA1= <user>
##$USERA2= <user>
##$USERA3= <user>
##$USERA4= <user>
##$USERA5= <user>
##$V9= 5
##$VALIST= <valist>
##$VCLIST= <CCCCCCCCCCCCCCC>
##$VD= 0
##$VDLIST= <DDDDDDDDDDDDDDD>
##$VPLIST= <PPPPPPPPPPPPPPP>
##$VTLIST= <TTTTTTTTTTTTTTT>
##$WBST= 2048
##$WBSW= 25
##$XGAIN= (0..3)
0 0 0 0
##$XL= 0
##$YL= 0
##$YMAX_a= 9204721
##$YMIN_a= -8317485
##$ZGOPTNS= <>
##$ZL1= 120
##$ZL2= 120
##$ZL3= 120
##$ZL4= 120
##$ABSF1= 14.96707
##$ABSF2= -5.585461
##$ABSG= 5
##$ABSL= 3
##$ALPHA= 0
##$AQORDER= 0
##$ASSFAC= 0
##$ASSFACI= 0
##$ASSFACX= 0
##$ASSWID= 0
##$AUNMP= <proc_prof1d_extract.lims>
##$AXLEFT= 0
##$AXNAME= <>
##$AXNUC= <1H>
##$AXRIGHT= 0
##$AXTYPE= 0
##$AXUNIT= <>
##$AZFE= 0.1
##$AZFW= 0.1
##$BCFW= 0
##$BC_mod= 0
##$BYTORDP= 0
##$COROFFS= 0
##$CY= 15
##$DATMOD= 1
##$DC= 0
##$DFILT= <>
##$DTYPP= 0
##$F1P= 0
##$F2P= 0
##$FCOR= 0.5
##$FTSIZE= 131072
##$FT_mod= 6
##$GAMMA= 0
##$GB= 0
##$INTBC= 1
##$INTSCL= 1
##$ISEN= 128
##$LB= 0.3
##$LEV0= 0
##$LPBIN= 0
##$MAXI= 10000
##$MC2= 0
##$MEAN= 0
##$ME_mod= 0
##$MI= 0
##$NCOEF= 0
##$NC_proc= -1
##$NLEV= 6
##$NOISF1= 0
##$NOISF2= 0
##$NSP= 0
##$NTH_PI= 0
##$NZP= 0
##$OFFSET= 14.96707
##$PC= 1
##$PHC0= 34.30481
##$PHC1= 0
##$PH_mod= 1
##$PKNL= yes
##$PPARMOD= 0
##$PPDIAG= 0
##$PPIPTYP= 0
##$PPMPNUM= 2147483647
##$PPRESOL= 1
##$PSCAL= 4
##$PSIGN= 0
##$PYNMP= <proc.py>
##$REVERSE= no
##$SF= 400.130005417477
##$SI= 131072
##$SIGF1= 0
##$SIGF2= 0
##$SINO= 400
##$SIOLD= 131072
##$SPECTYP= <>
##$SREGLST= <1H.CDCl3>
##$SSB= 0
##$STSI= 131072
##$STSR= 0
##$SW_p= 8223.68421052632
##$SYMM= 0
##$S_DEV= 0
##$TDeff= 65536
##$TDoff= 0
##$TI= <>
##$TILT= no
##$TM1= 0
##$TM2= 0
##$TOPLEV= 0
##$USERP1= <user>
##$USERP2= <user>
##$USERP3= <user>
##$USERP4= <user>
##$USERP5= <user>
##$WDW= 1
##$XDIM= 131072
##$YMAX_p= 112883747
##$YMIN_p= -305354973
##$CURPLOT= <Network HP LaserJet P1505>
##$CURPRIN= <$Network HP LaserJet P1505>
##$DFORMAT= <normdp>
##$LAYOUT= <+/1D_H.xwp>
##$LFORMAT= <normlp>
##$PFORMAT= <normpl>
##$SURQMSG= 1
$$ End of Bruker specific parameters
$$ ---------------------------------
##NTUPLES= NMR SPECTRUM
##VAR_NAME=  FREQUENCY,     SPECTRUM/REAL,   SPECTRUM/IMAG
##SYMBOL=    X,             R,               I
##VAR_TYPE=  INDEPENDENT,   DEPENDENT,       DEPENDENT
##VAR_FORM=  AFFN,          ASDF,            ASDF
##VAR_DIM=   131072,        131072,          131072
##UNITS=     HZ,            ARBITRARY UNITS, ARBITRARY UNITS
##FACTOR=    0.0627417313425165, 1,          1
##FIRST=     8223.62146879498, -1333,        -23940
##LAST=      0,             -632,            -24500
##MIN=       0,             -305354973,      0
##MAX=       8223.62146879498, 112883747,    0
$$ Real data points
##PAGE= N=1
##DATA TABLE= (X++(R..R)), XYDATA
$$ [...]
63057B83649P92O26O58P91R15Q40M87M0k90m46m12j06L69O07L35j29k24J18M12
63038B89032L05qj51n4J23K93N06P65J009J238J490J681J653J408J203J331J792
63021C03616K294K566K594K589K774L203L737M138M261M221M282M555M909N249
63007C54988N733O534P494Q262Q740R187R855J0753J1755J2766J3687J4448J5177
62994D89379J6108J7267J8399J9277J9915K0385K0659K0772K0916K1142K1177
62983G05396K0746J9971J9208J8599J8034J7424J6825J6245J5605J4849J3913
62972H96815J2608J0734Q349N697K902j23l396o686r722j2436j4947j7329j9434
62959H53032k0891k1358k0868j9913j9011j8191j7032j5186j2745j0115p714n730
$$ plain form
63057 283649 284441 285067 285725 286516 287431 288271 288758 288798 288508 288062 287650 287544 287913 288520 288855 288726 288502 288620 289032
63038 289032 289337 289329 289178 289124 289247 289540 290046 290811 291820 293058 294548 296229 297882 299290 300493 301824 303616
63021 303616 305910 308476 311070 313659 316433 319636 323373 327511 331772 335993 340275 344830 349739 354988
63007 354988 360721 367255 374749 383011 391751 400938 410793 421546 433301 446067 459754 474202 489379
62994 489379 505487 522754 541153 560430 580345 600730 621389 642161 663077 684219 705396
62983 705396 726142 746113 765321 783920 801954 819378 836203 852448 868053 882902 896815
62972 896815 909423 920157 928506 934203 937105 936982 933586 926900 917178 904742 889795 872466 853032
62959 853032 832141 810783 789915 770002 750991 732800 715768 700582 687837 677722 670008 664278
62947F64278m066k408m92J629L694N521P072Q299R166R826J0501J1099J1283J1008
62933G46410J0706J0677J0598R986Q931P961P275O509N311L733J891l42l111o245
62919H20290r443j2546j5389j7616j9009j9895k0873k2032k2845k2870k2290k1565
62907E93917k0843j9993j8981j7961j6990j5993j4954j3987j3189j2546j1991
62896D16489j1427j0766j0042r496r287r222q908q247p535p083o893o816o737
62883C04030o512n952n090m283l857l722l569l338l187l098k769k069j343j051
62869B54190j202j385j281j048j028j270j470j374j048p19n22n34q80j540k130
62854B36759k184j671j096r32j166j454j543j372j003o18m44n01m98k06J90L01
$$ plain form
62947 664278 660212 657804 657312 658941 662635 668156 675228 683527 692693 702519 713020 724119 735402 746410
62933 746410 757116 767793 778391 788377 797308 805269 812544 819053 824364 828097 829988 829646 826535 820290
62919 820290 810847 798301 782912 765296 746287 726392 705519 683487 660642 637772 615482 593917
62907 593917 573074 553081 534100 516139 499149 483156 468202 454215 441026 428480 416489
62896 416489 405062 394296 384254 374758 365471 356249 347341 339094 331559 324476 317583 310767 304030
62883 304030 297518 291566 286476 282193 278336 274614 271045 267707 264520 261422 258653 256584 255241 254190
62869 254190 252988 251603 250322 249274 248246 246976 245506 244132 243084 242365 241843 241309 240429 238889 236759
62854 236759 234575 232904 231808 230876 229710 228256 226713 225341 224338 223720 223276 222775 222277 222071 222261 222562
62838B22562N9k32l53m06n38o34n02j98j4j06k85k37Q7M00L87M7l42n01l60k8
62818B18806K70K90l0m44o23n65n19n51m12k4K28rn06p03m55j17K5N6Q7Lk98n90
62796B13919n86k73J09L91N81P05O96N21L06K36L06K67q3n69p36m01N4J15j85
62777B15373l55j31J71J70KJ20O15J033R52N12K32L93Q03J155J361J487J523J470
62759B26886J499J759K073K104J884J834K165K534K602K573K839L314L571L566
62745B61203L695M130M531M632M721N183N858O216O098N992O463P549Q754R671
62731C44696J0396J1339J2660J4064J5233J6270J7548J9180K0917K2497K3865
62720E28665K5049K6027K6842K7604K8249K8500K8163K7273K5834K3615K0434
$$ plain form
62838 222562 222621 222389 222036 221630 221092 220458 219956 219758 219744 219638 219353 219116 219203 219603 219990 220037 219695 219194 218834 218806
62818 218806 219076 219366 219336 218892 218269 217704 217185 216634 216222 216198 216426 216417 215911 215208 214753 214636 214661 214717 214804 214807 214509 213919
62796 213919 213333 213060 213169 213560 214141 214846 215542 216063 216369 216605 216911 217178 217095 216526 215790 215389 215443 215558 215373
62777 215373 215018 214887 215058 215228 215230 215350 215965 216998 217950 218462 218694 219087 219890 221045 222406 223893 225416 226886
62759 226886 228385 230144 232217 234321 236205 238039 240204 242738 245340 247913 250752 254066 257637 261203
62745 261203 264898 269028 273559 278191 282912 288095 293953 300169 306267 312259 318722 326271 335025 344696
62731 344696 355092 366431 379091 393155 408388 424658 442206 461386 482303 504800 528665
62720 528665 553714 579741 606583 634187 662436 690936 719099 746372 772206 795821 816255
62709H16255J6504J2310Q168M063j07m338q570j2762j6822k0501k3466k5509k6717
62696G18508k7372k7705k7758k7482k6939k6267k5526k4627k3445k1912k0109
62685D39366j8277j6705j5425j4169j2750j1365j0344r600q712p536o398n594
62673C02491m963m186l308k638k304k066j664j109n74r7M84J283K108K612K740
62658B88809K869L360M142M920N688O685P904Q995R701J0151J0631J1346J2422
62645C87623J3874J5442J6755J7752J8739J9914K1156K2307K3343K4184K4630
62634F05719K4667K4444K3811K2305J9833J6937J4043J0868O995K652j604n632
62622G65038r666j3608j7067j9886k2198k3946k4958k5422k5784k6088k5907k5041
$$ plain form
62709 816255 832759 845069 853237 857300 857193 852855 844285 831523 814701 794200 770734 745225 718508
62696 718508 691136 663431 635673 608191 581252 554985 529459 504832 481387 459475 439366
62685 439366 421089 404384 388959 374790 362040 350675 340331 330731 322019 314483 308085 302491
62673 302491 297528 293342 290034 287396 285092 283026 281362 280253 279679 279582 280066 281349 283457 286069 288809
62658 288809 291678 295038 299180 304100 309788 316473 324377 333372 343073 353224 363855 375201 387623
62645 387623 401497 416939 433694 451446 470185 490099 511255 533562 556905 581089 605719
62634 605719 630386 654830 678641 700946 720779 737716 751759 762627 769622 772274 770670 765038
62622 765038 755372 741764 724697 704811 682613 658667 633709 608287 582503 556415 530508 505467
62610E05467k3793k2460k1027j9541j8274j7269j6133j4606j2996j1736j0799
62599C16833r893q984q257p711p150o533o007n641n302m896m489m206m029l790
62585B29945l328k683k109j833j776j681j457j253j177j127r96q57q30q98r47
62570B06993r16q02o34m40k04J43N50P55N91L53N21J126J707J972K116K348K516
62553B18695K459K366K451K545K428K342K747L705M869N998P071P953Q424Q617
62539B82670Q944R563J0218J0777J1512J2581J3594J4018J3847J3501J3132J2384
62527D26741J0915Q922O976N420M043K322k4k730n251p259q862j0306j1592j2473
62513D06842j2794j2758j2722j2797j2747j2306j1490j0506r463q389p438o850
$$ plain form
62610 505467 481674 459214 438187 418646 400372 383103 366970 352364 339368 327632 316833
62599 316833 306940 297956 289699 281988 274838 268305 262298 256657 251355 246459 241970 237764 233735 229945
62585 229945 226617 223934 221825 219992 218216 216535 215078 213825 212648 211521 210525 209668 208838 207940 206993
62570 206993 206077 205275 204641 204201 203997 204140 204690 205445 206036 206389 206910 208036 209743 211715 213831 216179 218695
62553 218695 221154 223520 225971 228516 230944 233286 236033 239738 244607 250605 257676 265629 274053 282670
62539 282670 291614 301177 311395 322172 333684 346265 359859 373877 387724 401225 414357 426741
62527 426741 437656 446578 453554 458974 463017 465339 465315 462585 457334 450075 441213 430907 419315 406842
62513 406842 394048 381290 368568 355771 343024 330718 319228 308722 299259 290870 283432 276582
62501B76582o561o149n359m492m032l999l974l665l161k551j744q16k32l33p88
62486B28726q74l33L66O83O63P23R90J173J068R00J005J367J693J864K064K488
62470B44566L080L677M217M732N235N745O371P247Q361R490J0298J0620J0711
62457C34350J1169J2345J3854J4933J5348J5614J6242J7052J7527J7503J7119
62446E03056J6346J5012J3228J1333R447P513N729M432L548K656J742J360J814
62433E97216K698L539M490N924P747R496J0962J2198J3188J3901J4549J5261J5576
62420G26745J4737J2527R427O028K613p01l910p301j1199j5393j9174k2095k4300
62407F68004k6023k7125k7412k7044k6341k5437k4365k3222k1970k0301j8067
$$ plain form
62501 276582 270021 263872 258513 254021 249989 245990 242016 238351 235190 232639 230895 230079 229847 229514 228726
62486 228726 227852 227519 227885 228568 229231 229954 230944 232117 233185 234085 235090 236457 238150 240014 242078 244566
62470 244566 247646 251323 255540 260272 265507 271252 277623 284870 293231 302721 313019 323639 334350
62457 334350 345519 357864 371718 386651 401999 417613 433855 450907 468434 485937 503056
62446 503056 519402 534414 547642 558975 568422 575935 581664 586096 589644 592300 594042 595402 597216
62433 597216 599914 603453 607943 613867 621614 631110 642072 654270 667458 681359 695908 711169 726745
62420 726745 741482 754009 763436 769464 772077 771376 767466 760165 748966 733573 714399 692304 668004
62407 668004 641981 614856 587444 560400 534059 508622 484257 461035 439065 418764 400697
62396D00697j5611j3480j1844j0519r342q241p083n805m590l692l086k523j857
62383C03024j105l27L00M68J51j45M6M26K67n11j157j140q86j149k030k991l625
62366B89616l973m214m349m275l957l498l117k994l088l156l079k960k854k622
62352B41480k178j777j719j883j842j437r80q08q34o91k06M10Q46J034J096J080
62336B31591R13O61O48J056J611J862J766J692J867K136K383K765L358L828L836
62321B61973L551L462L765M238M659N028N411N796O170O514O777O976P334Q029
62307C39683Q901R602J0081J0675J1656J2924J4209J5346J6298J7091J7856J8751
62295E03073J9664K0065J9367J7469J4848J2167R748P502N209K858N83j604l828
$$ plain form
62396 400697 385086 371606 359762 349243 339901 331660 324577 318772 314182 310490 307404 304881 303024
62383 303024 301919 301592 301892 302360 302511 302366 302412 302838 303105 302594 301437 300297 299411 298262 296232 293241 289616
62366 289616 285643 281429 277080 272805 268848 265350 262233 259239 256151 252995 249916 246956 244102 241480
62352 241480 239302 237525 235806 233923 232081 230644 229664 228856 228022 227331 227125 227535 228381 229415 230511 231591
62336 231591 232504 233165 233813 234869 236480 238342 240108 241800 243667 245803 248186 250951 254309 258137 261973
62321 261973 265524 268986 272751 276989 281648 286676 292087 297883 304053 310567 317344 324320 331654 339683
62307 339683 348584 358186 368267 378942 390598 403522 417731 433077 449375 466466 484322 503073
62295 503073 522737 542802 562169 579638 594486 606653 616401 623903 629112 631970 632553 630949 627121
62282F27121o062q042r664j1158j2715j4029j4617j4482j4081j3670j3082j2230
62270D83289j1427j0971j0715j0303r644q894q187p566p108o904o891o888o763
62257C71028o508o189n909n683n370m846m261l938l900l797l382k887k645k616
62243C09097k518k332k319k565k771k595k000j243o44l78m08n13m81k45J36N74
62227B88795R49J139J153J169J374J771K226K589K735K649K557K814L499M262
62213C19681M743N033N486O223O986P499P790Q185R052J0415J1799J2626J2946
62200D28464J3527J4929J6758J8198J9028J9629K0115K0032J9039J7363J5360
62189F22442J3093J0537P880N255K484o10l798o620q879j0756j2541j4411j6348
$$ plain form
62282 627121 621059 613017 603353 592195 579480 565451 550834 536352 522271 508601 495519 483289
62270 483289 471862 460891 450176 439873 430229 421335 413148 405582 398474 391570 384679 377791 371028
62257 371028 364520 358331 352422 346739 341369 336523 332262 328324 324424 320627 317245 314358 311713 309097
62243 309097 306579 304247 301928 299363 296592 293997 291997 290754 290110 289732 289324 288811 288330 288085 288221 288795
62227 288795 289744 290883 292036 293205 294579 296350 298576 301165 303900 306549 309106 311920 315419 319681
62213 319681 324424 329457 334943 341166 348152 355651 363441 371626 380678 391093 402892 415518 428464
62200 428464 441991 456920 473678 491876 510904 530533 550648 570680 589719 607082 622442
62189 622442 635535 646072 653952 659207 661691 661081 657283 650663 641784 631028 618487 604076 587728
62176E87728j8079j9234j9664j9533j9016j8137j6994j5856j4831j3670j2186
62165D00528j0635r429q577p803p026o385n826n117m267l592l251l038k722k346
62151C20514k036j714j235o40j11K67O00J080J794K590L125L165K886K717K868
62136C35870L159L335L389L470L614L729L750L710L667L707L940M369M809M990
62122C89508M790M326L836L497L364L408L609L988M543N222N964O759P592Q393
62108D58799R094R738J0437J1234J2016J2566J2686J2292J1433J0190Q513O340
62096E85338L857J464o31k593m574o342p603q523r561j0816j1924j2579j2838
62083E02675j2800j2399j1639j0705r678q456p148o186n814n720n465n052m724
$$ plain form
62176 587728 569649 550415 530751 511218 492202 474065 457071 441215 426384 412714 400528
62165 400528 389893 380464 371887 364084 357058 350673 344847 339730 335463 331871 328620 325582 322860 320514
62151 320514 318478 316764 315529 314889 314778 315045 315645 316725 318519 321109 324234 327399 330285 333002 335870
62136 335870 339029 342364 345753 349223 352837 356566 360316 364026 367693 371400 375340 379709 384518 389508
62122 389508 394298 398624 402460 405957 409321 412729 416338 420326 424869 430091 436055 442814 450406 458799
62108 458799 467893 477631 488068 499302 511318 523884 536570 548862 560295 570485 578998 585338
62096 585338 589195 590659 590028 587435 582861 576519 568916 560393 550832 540016 528092 515513 502675
62083 502675 489875 477476 465837 455132 445454 436998 429850 423664 417850 412130 406665 401613 396889
62070C96889m471m080l531k998k519k035j656j555j626j539j097l43O23J583K064
62055C73709J662N74n06j150j511j897k261k345k083j677j439j597k172k950l641
62040C50716m066m104l633k762j941j561j438j105n48k00j40J74J114K277L019
62025C35802L294L570M069M554M762M780M932N459O268O992P338P456P765Q371
62011D15412Q896R060R096R366R820J0107J0090R936R790R644R402Q819P536N474
61997E42448L133J179k67j622l227n013o770q394r827j0992j1921j2742j3475
61984D62510j3993j4233j4311j4325j4195j3750j2961j2012j1201j0637j0090
61973C20802r199p941o738o015n788n769n705n439m877m154l635l509l520l340
$$ plain form
62070 396889 392418 388338 384807 381809 379290 377255 375599 374044 372418 370879 369782 369439 370062 371645 373709
62055 373709 375371 375945 375439 374289 372778 370881 368620 366275 364192 362515 361076 359479 357307 354357 350716
62040 350716 346650 342546 338913 336151 334210 332649 331211 330106 329558 329358 329218 329392 330506 332783 335802
62025 335802 339096 342666 346735 351289 356051 360831 365763 371222 377490 384482 391820 399276 407041 415412
62011 415412 424308 433368 442464 451830 461650 471757 481847 491783 501573 511217 520619 529438 536974 542448
61997 542448 545581 546760 546493 544871 541644 536631 529861 521467 511640 500648 488727 475985 462510
61984 462510 448517 434284 419973 405648 391453 377703 364742 352730 341529 330892 320802
61973 320802 311603 303662 296924 290909 285121 279352 273647 268208 263331 259177 255542 252033 248513 245173
61959B45173l028k863k843k742k533k401k369k260k034j814j587j222p59l90j58
61944B16170K7J61K29M31Q73J163Q19P9k51R6M73K48l92r06j140j306j519j780
61926B13475k127k495k629k401k023j725j511j340j296j348j232q55m97l85l66
61911A91245k70k57m28m79j27L68N61M40K95J81Jp6K08P12J068J231J425J617
61893A97715J605J543J874K600L188L303L237L429L903M404M784N067N338N724
61879B47714O289O879P205P153O840O410N977N680N514N168M402L507L019K923
61865C24680K630J814Q27R8m14r02j223j154q13m78j80K31P50J244J715K267K901
61848C33993L518M058M452M559M315L848L252K410J272J28o26r75j254j695k218
$$ plain form
61959 245173 242145 239282 236439 233697 231164 228763 226394 224134 222100 220286 218699 217477 216718 216328 216170
61944 216170 216197 216358 216587 217018 217891 219054 219873 219952 219701 219797 220270 220518 220126 219220 218080 216774 215255 213475
61926 213475 211348 208853 206224 203823 201800 200075 198564 197224 195928 194580 193348 192493 191996 191611 191245
61911 191245 190975 190718 190290 189811 189684 190052 190613 191053 191348 191529 191530 191454 191662 192374 193442 194673 196098 197715
61893 197715 199320 200863 202737 205337 208525 211828 215065 218494 222397 226801 231585 236652 241990 247714
61879 247714 254003 260882 268087 275240 282080 288490 294467 300147 305661 310829 315231 318738 321757 324680
61865 324680 327310 329124 329951 330049 329635 328733 327510 326356 325543 325065 324885 325116 325866 327110 328825 331092 333993
61848 333993 337511 341569 346021 350580 354895 358743 361995 364405 365677 365805 365179 364204 362950 361255 359037
61833C59037k672l001l168l140k990k909k991l170l361l540l689l802l959m274
61819C12371m691n000n037m818m416l900l373k938k518j905j059k70K10N30J062
61804B74248J881K671L191L604M180M872N421N770O162O761P477Q195Q966R814
61790C53213J0521J0770J0536J0089R650R149Q375P282O051M869L695K355Q76
61777D47431l88j132j512j925k435k626k167j237k79M83J095J636K152K631K897
61762D44624K649J824P03m93j860l393m653n261n538o119p064p868q291q603q942
61747C81715r039q744q309p904p353o587n963n753n746n603n329n022m544l839
61733B91980l261l151l276l167k794k507k384k145j682j258j147j346j671j852
$$ plain form
61833 359037 356365 353364 350196 347056 344066 341157 338166 334996 331635 328095 324406 320604 316645 312371
61819 312371 307680 302680 297643 292825 288409 284509 281136 278198 275680 273775 272716 272446 272656 273186 274248
61804 274248 276129 278800 281991 285595 289775 294647 300068 305838 312000 318761 326238 334433 343399 353213
61790 353213 363734 374504 385040 395129 404779 413928 422303 429585 435636 440505 444200 446555 447431
61777 447431 447043 445911 444399 442474 440039 437413 435246 434009 433730 434213 435308 436944 439096 441727 444624
61762 444624 447273 449097 449800 449307 447447 444054 439401 434140 428602 422483 415419 407551 399260 390657 381715
61747 381715 372676 363932 355623 347719 340366 333779 327816 322063 316317 310714 305385 300363 295819 291980
61733 291980 288719 285568 282292 279125 276331 273824 271440 269295 267613 266355 265208 263862 262191 260339
61719B60339j579p85J19N92N79M83N50O52O84Q19J174J595J920K233K682L196
61703B75253L616L907M079M040L715L231K830K592K353J860R83j44j208j968k495
61688C02644l019l595m019m159m177m296m468m402l917l164k504k184k145k113
61674B54482j894j522j121p36m02k79m60p46q04o05m40m31l37K0L67L21m9l18
61656B45046l21l55o64j026j057p70o32r91j609j921j674j267j269j747k215k296
61640B25232k169k217k400k343j957j660j799k157k258k000j642j336r37l99k0
61625A99938j14o06j097j248j030o77n01o20q16p52l90n6K2k5k0o1k52l25K9N61
61605A91960O85L14L9K91P88J086J249J575J937J885J344P48M57L75K84K12L10
$$ plain form
61719 260339 258760 257975 258094 258686 259265 259748 260298 260950 261634 262453 263627 265222 267142 269375 272057 275253
61703 275253 278869 282776 286855 290895 294610 297841 300671 303263 305616 307476 308459 308315 307107 305139 302644
61688 302644 299625 296030 292011 287852 283675 279379 274911 270509 266592 263428 260924 258740 256595 254482
61674 254482 252588 251066 249945 249209 248807 248528 248068 247322 246518 245913 245473 245042 244705 244725 245092 245413 245364 245046
61656 245046 244725 244370 243706 242680 241623 240853 240221 239230 237621 235700 234026 232759 231490 229743 227528 225232
61640 225232 223063 220846 218446 216103 214146 212486 210687 208530 206272 204272 202630 201294 200357 199958 199938
61625 199938 199824 199218 198121 196873 195843 195166 194665 194045 193229 192477 192087 192031 192053 192028 192008 191947 191695 191370 191399 191960
61605 191960 192645 192959 192998 193289 194077 195163 196412 197987 199924 201809 203153 203901 204358 204733 205017 205229 205539
61588B05539M89M78K00l8J19O71J210J361J171J002J038J092R08N15J55j7o3j44
61570B15686l88q23j344j781k064k260k430k536k537k422k096j489p97m23m67
61555A91829n18k32R7j05q68j595j811j649j510j552j679j819j952k013j924j729
61539A70970j601j699j961k085j768j091n50n20p80q15n16k67l33n13n33m69m62
61522A55007l76l3L43L62Q3J1L23N03N9o98r56m62J83L53J58J01L24N39O17P45
61502A57186R88J098Q97N66L70L78N63R37J343J421J028M72J23l9j85k30l2K33
61484A67117K61R4pMJ1J15M78Q43P67L49J52L84N98M53J94J44J78N4j00o0O4j4
61462A72079l29p16j045j135p57jN53M94J72K43P37J061Q54L76R4J89N78J028
$$ plain form
61588 205539 206028 206506 206706 206668 206787 207458 208668 210029 211200 212202 213240 214332 215240 215755 215910 215893 215830 215686
61570 215686 215298 214475 213131 211350 209286 207026 204596 202060 199523 197101 195005 193516 192719 192296 191829
61555 191829 191311 191079 191176 191071 190203 188608 186797 185148 183638 182086 180407 178588 176636 174623 172699 170970
61539 170970 169369 167670 165709 163624 161856 160765 160215 159695 158915 158100 157584 157317 156984 156471 155938 155469 155007
61522 155007 154631 154598 154941 155303 155386 155397 155720 156223 156282 155584 154628 154166 154349 154702 154860 154961 155285 155824 156441 157186
61502 157186 158174 159272 160169 160735 161105 161483 162046 162983 164326 165747 166775 167247 167370 167331 167146 166916 166884 167117
61484 167117 167378 167472 167465 167469 167480 167595 168073 168916 169683 170032 170184 170568 171166 171619 171813 171957 172135 172189 172089 172029 172093 172079
61462 172079 171750 171034 169989 168854 168097 168096 168649 169143 169315 169558 170295 171356 172210 172586 172680 172869 173447 174475
61444A74475J240J095R13J112J617J889J642J225J119J374J687J820J694J317
61430A94219Q42N64O32Q40Q94P90P06O05K50l41p25n46k2K82Q2l84p69r84j055
61411A95880r10n24j23L3J8Q0J39j93r48j560j507r52m57k35o3K14M28M06K03
61392A89929k6j72j44J05M29N96O16P57J150J521J546J250R39P98P51O79N62M60
61374B01746M30N24P60J042J201J158J027J007J164J364J403J208Q86O45O16P72
61358B16953R52R85Q40O19M21K55J37J43K29J25l51r01r91n31l1O0r5j03K2m5
61338B18693l15m16j19L48O58P53P76Q32R33J034J017Q03N21M40N85O65M63J66
61320B27837J19L40N14M22J85Q3K24M75O32N99M44L14K98L48L55K72J86K07L05
$$ plain form
61444 174475 175715 176810 177723 178835 180452 182341 183983 185208 186327 187701 189388 191208 192902 194219
61430 194219 195061 195625 196257 197097 197991 198781 199487 200092 200342 200001 199276 198730 198708 198990 199072 198688 197919 196935 195880
61411 195880 194970 194446 194323 194356 194374 194454 194593 194400 193452 191892 190385 189433 188976 188741 188678 188892 189320 189726 189929
61392 189929 189903 189731 189587 189692 190121 190717 191333 192090 193240 194761 196307 197557 198496 199294 200045 200724 201286 201746
61374 201746 202176 202700 203460 204502 205703 206861 207888 208895 210059 211423 212826 214034 214920 215565 216181 216953
61358 216953 217905 218890 219730 220349 220770 221025 221162 221305 221534 221659 221308 220407 219416 218885 218854 218914 218819 218716 218738 218693
61338 218693 218378 217962 217843 218191 218849 219602 220378 221210 222143 223177 224194 224997 225518 225958 226543 227208 227671 227837
61320 227837 227956 228296 228810 229232 229417 229500 229724 230199 230831 231430 231874 232188 232486 232834 233189 233461 233647 233854 234159
61301B34159L23K05J47L81Q08J061R77Q18Q98J194J514J822K131K226J856J210
61285B51730P81P22P01N01L71N74R21J064R70Q15O40L89J89K14L59L69K31J55
61267B61696J62R5j5J10N52J010J209J223J250J316J400J612K034K511K860L138
61251B82163L502L852L945L784L681L851M164M395M419M133L354K068O38m60j073
61236C26416j419j703j888j908j923k214k809l372l518l198k745k514k525k540
61222B92140k420k281k229k137j823j316p84k48L84R85J196R10M77L03L67L97
61206B83921L47M73R52J691K488L140L432L270K874K593K456K165J607J108R96
61191C13513J124J085P15J87k98o47p68o19l75l30n56q41r82j001j017j057j047
$$ plain form
61301 234159 234482 234687 234834 235215 236023 237084 238061 238879 239777 240971 242485 244307 246438 248664 250520 251730
61285 251730 252511 253233 253934 254435 254806 255380 256301 257365 258335 259150 259790 260179 260368 260582 260941 261310 261541 261696
61267 261696 261858 261953 261938 262048 262600 263610 264819 266042 267292 268608 270008 271620 273654 276165 279025 282163
61251 282163 285665 289517 293462 297246 300927 304778 308942 313337 317756 321889 325243 327311 327949 327489 326416
61236 326416 324997 323294 321406 319498 317575 315361 312552 309180 305662 302464 299719 297205 294680 292140
61222 292140 289720 287439 285210 283073 281250 279934 279150 278902 279286 280271 281467 282377 282854 283157 283524 283921
61206 283921 284268 284741 285693 287384 289872 293012 296444 299714 302588 305181 307637 309802 311409 312517 313513
61191 313513 314637 315722 316437 316624 316326 315679 314911 314292 313917 313587 313031 312190 311208 310207 309190 308133 307086
61174C07086q99n57m8N02R72J327J583J717J770J947K346K708K675K355K284K681
61158C30449L061K875K290J970K190K538K531K163J752J495J313J045O73M41P34
61143C57520J657K728L240L058K769K922L378L681L796L985M168L884L021K071
61129D01878J443R05P3q72j373j309j147j315j801k408l022l529l726l573l315
61114C76909l207l300l565m022m483m495l858l083k929l499m128m242l935l629
61100C24534l439l146k620j967j330p72l00R8M83Q69J165J240J073P31K80k23
61084C16676o90j048j311j529j625j411q03K8P87J317J707K114K537K842L035
61069C22626L381M155N318O532P475P985Q030P745P518P790Q600R530J0190J0577
$$ plain form
61174 307086 306187 305630 305582 306084 307056 308383 309966 311683 313453 315400 317746 320454 323129 325484 327768 330449
61158 330449 333510 336385 338675 340645 342835 345373 347904 350067 351819 353314 354627 355672 356345 356786 357520
61143 357520 359177 361905 365145 368203 370972 373894 377272 380953 384749 388734 392902 396786 399807 401878
61129 401878 403321 404226 404299 403427 402054 400745 399598 398283 396482 394074 391052 387523 383797 380224 376909
61114 376909 373702 370402 366837 362815 358332 353837 349979 346896 343967 340468 336340 332098 328163 324534
61100 324534 321095 317949 315329 313362 312032 311260 310960 311058 311541 312410 313575 314815 315888 316619 316899 316676
61084 316676 315986 314938 313627 312098 310473 309062 308259 308287 309074 310391 312098 314212 316749 319591 322626
61069 322626 326007 330162 335480 342012 349487 357472 365502 373247 380765 388555 397155 406685 416875 427452
61055D27452J0851J0991J0914J0756J0751J0875J0874J0587J0075R477Q888Q336
61043E50827P714O833N717M712M053L479K613J599R96R56J040Q78O74P48J006
61028E93845J131J059R52Q46O25K73q4l67n70p08q13r80j267j607j918k169k330
61011E85918k405k562l007l586l850l642l395l514l756l543k763j886j321r96
60997E45692o26q4N76J246J837K368K993L871M935N945O731P353Q037Q997J0270
60982F10141J1669J2964J4131J5246J6219J6899J7501J8539K0160K1907K3388
60971G98764K4815K6580K8675L0859L3074L5276L7197L8861M0996M4391M8982
60960A188470N4157N9724O5974P3026Q0856Q9813J00397J12595J26233J41807
$$ plain form
61055 427452 438303 449294 460208 470964 481715 492590 503464 514051 524126 533603 542491 550827
61043 550827 558541 565374 571091 575803 579856 583335 585948 587547 588543 589499 590539 591417 592091 592839 593845
61028 593845 594976 596035 596987 597833 598458 598731 598647 598280 597710 597002 596189 595209 593942 592335 590417 588248 585918
61011 585918 583513 580951 577944 574358 570508 566866 563471 559957 556201 552658 549895 548009 546688 545692
60997 545692 545066 544982 545558 546804 548641 551009 554002 557873 562808 568753 575484 582837 590874 599871 610141
60982 610141 621810 634774 648905 664151 680370 697269 714770 733309 753469 775376 798764
60971 798764 823579 850159 878834 909693 942767 978043 1015240 1054101 1095097 1139488 1188470
60960 1188470 1242627 1302351 1368325 1441351 1522207 1612020 1712417 1825012 1951245 2093052
60950B093052J60017J80651K02966K27185K54346K84660L17614L54007L96102
60941D470600M45066N00207N61099O25829O82025P01775O54464N32177L62777
60932I536019J94581O6490q054l3874k1278J3612M0966K2392o5893k12833l77830
60921I154298n17779o10216o55120o62500o42583o04272n55713n03019m49663
60912C953433l98027l50345l07621k69204k34477k04037j78522j57217j38763
60903A715220j22571j08724r7071q7222p8961p1930o5313n8543n2003m6377m1653
60892H84852l7410l3735l1055k9257k7782k6454k5504k4770k3662k2071k0587
60881E82565j9614j8777j7593j6200j5076j4320j3631j2848j2118j1583j1125
$$ plain form
60950 2093052 2253069 2433720 2636686 2863871 3118217 3402877 3720491 4074498 4470600
60941 4470600 4915666 5415873 5976972 6602801 7284826 7986601 8641065 9173242 9536019
60932 9536019 9730600 9797090 9789036 9755162 9733884 9747496 9788462 9810854 9744961 9532128 9154298
60921 9154298 8636519 8026303 7371183 6708683 6066100 5461828 4906115 4403096 3953433
60912 3953433 3555406 3205061 2897440 2628236 2393759 2189722 2011200 1853983 1715220
60903 1715220 1592649 1483925 1386854 1299632 1220671 1148741 1083428 1024885 972882 926505 884852
60892 884852 847442 813707 782652 753395 725613 699159 673655 648885 625223 603152 582565
60881 582565 562951 544174 526581 510381 495305 480985 467354 454506 442388 430805 419680
60870D19680j0558r925r480r273q951q111o883n833n244m812m242l779l819m208
60856C24562m429m287m036l839l595l254k932k672k418k276k399k604k514k136
60842B81171j925k082k217j974j606j620k067k553k780k796k760k772k819k789
60828B48411k548k147j867j905k118k244k226k132j885j428j009r96j335j519
60814B23052j232p44m80l62J4P04J223J194Q75Q02J108J437J556J649J900K088
60798B34784J879J375J010R23P64K67l23n39k64J95M65L63q7o93j163j341j357
60781B36258j463j722k008k251k502k754k869k808k688k597k484k337k274k348
60767B03153k384k233k015j926j850j517r99p43r80j404j615j612j635j676j501
$$ plain form
60870 419680 409122 399197 389717 380444 371493 363382 356499 350666 345422 340610 336368 332589 328770 324562
60856 324562 320133 315846 311810 307971 304376 301122 298190 295518 293100 290824 288425 285821 283307 281171
60842 281171 279246 277164 274947 272973 271367 269747 267680 265127 262347 259551 256791 254019 251200 248411
60828 248411 245863 243716 241849 239944 237826 235582 233356 231224 229339 227911 226902 225906 224571 223052
60814 223052 221820 221076 220596 220234 220248 220952 222175 223369 224244 225046 226154 227591 229147 230796 232696 234784
60798 234784 236663 238038 239048 239971 240735 241002 240679 240140 239876 240071 240536 240899 240812 240119 238956 237615 236258
60781 236258 234795 233073 231065 228814 226312 223558 220689 217881 215193 212596 210112 207775 205501 203153
60767 203153 200769 198536 196521 194595 192745 191228 190229 189486 188506 187102 185487 183875 182240 180564 179063
60752A79063j086o86m74l67k81k66l24k97j37j4n1q8R1M30P13Q36Q05N78K31R0
60732A78766M20R60J120P49L31L20N58N62J56m09q35r56p20k61O6m3m86q97j058
60713A78343j044r47p94p16q94j248j419j192p21k11L10P57Q34M60P1J13L78L09
60695A72389j31l93j87J05R4l3R8L85M33K01K9R8K25K11N8j85n16q14q38n52k51
60674A70426k16l84n24n80o85q43q27m57J40O24P95P62P75Q96R77Q78O45M37L47
60655A73186L67M36M81M97N90Q51J134J120O88R4l66o43q08p93n74m03n49q63
60637A74445r34o96n41p47j087j174r67p44o91p20o23l18O1L19M48O55J039J363
60619A69088J341J051Q04P04O13N58P21R71Q52K23m36o17m17k80l77n72p34q01
$$ plain form
60752 179063 177977 177291 176817 176450 176169 175903 175579 175282 175145 175131 175080 174992 175083 175513 176226 177062 177867 178445 178676 178766
60732 178766 179186 180146 181266 182015 182346 182666 183224 183786 183942 183533 182698 181742 181022 180761 180827 180784 180298 179401 178343
60713 178343 177299 176352 175558 174842 173948 172700 171281 170089 169368 169157 169467 170224 171058 171518 171589 171702 172080 172389
60695 172389 172258 171865 171678 171783 171877 171844 171942 172327 172760 172961 172990 173088 173313 173524 173582 173397 172881 172067 171229 170677 170426
60674 170426 170210 169826 169302 168722 168037 167194 166367 165910 166050 166674 167469 168231 169006 169902 170879 171757 172402 172839 173186
60655 173186 173553 173989 174470 174967 175557 176408 177542 178662 179350 179444 179078 178435 177627 176834 176260 175857 175308 174445
60637 174445 173511 172815 172274 171527 170440 169266 168299 167555 166864 166144 165521 165203 165264 165583 166031 166686 167725 169088
60619 169088 170429 171480 172284 172988 173601 174159 174880 175851 176703 176926 176490 175873 175456 175176 174799 174227 173493 172692
60601A72692o48k49J65L56M17N46O49N37L64M75Q19R58P13M20L91M53K67j34m39
60582A78752n05m81n22o19p02p60p84p39o35n78o48p51o60l19O6K70L63N77Q96
60563A72221R95O90K58J02K61M30M18L14K58K45K52L11M12M39L25J88J89L24M04
60544A79036L10J56J65L57M74L21J19K59P57J198J280J171J114J014P00M23O37
60527A89491J275J695J450Q39M75N35O96O60N40O43J037J470J656J649J802K353
60511B08266L098L584L625L488L535L797L985L903L693L574L459K985K032R88
60497B54012L13l7m53r62j093n94J14M98O28R90J686K292K505K587L041M080N436
60480B75043O564O994O746O424O715P705Q803R379R256Q608P595O201M394K300
$$ plain form
60601 172692 172044 171795 171960 172316 172733 173279 173928 174465 174829 175304 176123 177081 177794 178214 178605 179058 179325 179191 178752
60582 178752 178247 177766 177244 176625 175923 175163 174379 173640 173005 172427 171779 171028 170368 170049 170115 170385 170748 171325 172221
60563 172221 173216 173906 174164 174266 174527 174957 175375 175689 175947 176192 176444 176755 177167 177606 177931 178119 178308 178632 179036
60544 179036 179346 179502 179667 180024 180498 180819 180938 181197 181954 183152 184432 185603 186717 187731 188431 188854 189491
60527 189491 190766 192461 193911 194750 195225 195760 196456 197116 197656 198299 199336 200806 202462 204111 205913 208266
60511 208266 211364 214948 218573 222061 225596 229393 233378 237281 240974 244548 248007 250992 253024 254012
60497 254012 254325 254288 253835 252873 251780 251186 251300 251798 252426 253416 255102 257394 259899 262486 265527 269607 275043
60480 275043 281607 288601 295347 301771 308486 316191 324994 334373 343629 352237 359832 366033 370427 372727
60466C72727K80j262k237k961l718m355m534m282l997l873l665l096k260j404
60452C31363n94K07R16J463K047L016M436N962P170Q006Q825R996J1516J3031
60438D07360J4283J5337J6308J7038J7255J6950J6324J5414J4066J2324J0530
60427E73189Q932P429N858M243K600O52j951n260q987j2741j6146j8859k0681
60414E18278k1714k2209k2282k1870k0934j9588j8011j6334j4617j2927j1388
60403C16404j0154r271q585p848o979o141n548n203m910m483l913l348k951k764
60389B34306k714k695k600k323j868j448j315j421j408j052n76l23l44m86p13
60374B13020j048j293j199q75o78p09p01m86k44j64j90k04j98j70n2J12J78J63
$$ plain form
60466 372727 373007 371745 369508 366547 362829 358474 353940 349658 345661 341788 338123 335027 332767 331363
60452 331363 330769 330976 331892 333355 335402 338418 342854 348816 355986 363992 372817 382813 394329 407360
60438 407360 421643 436980 453288 470326 487581 504531 520855 536269 550335 562659 573189
60427 573189 582121 589550 595408 599651 602251 602903 600952 595692 586705 573964 557818 538959 518278
60414 518278 496564 474355 452073 430203 409269 389681 371670 355336 340719 327792 316404
60403 316404 306250 296979 288394 280546 273567 267426 261878 256675 251765 247282 243369 240021 237070 234306
60389 234306 231592 228897 226297 223974 222106 220658 219343 217922 216514 215462 214886 214563 214219 213733 213020
60374 213020 211972 210679 209480 208605 207927 207218 206517 206031 205787 205623 205433 205229 205031 204861 204809 204921 205099 205262
60356B05262K76N55P75Q11Q17Q94R00P40O09O59P28O34N05N19N89N31M46N27P34
60337B17511Q94J034J271J495J528J484J646J971K071J768J320J059J029J088
60323B37169J152J227J316J428J559J647J626J540J489J493J482J429J365J264
60309B57186J066Q20P05Q92J354J846K042J797J359J159J364J723J966K159K491
60294B79929K865L020K932K856K892K830K436J754R78K56l73r66j619k313k771
60279B94706k678k128j672j769k264k581k410k045j934k098k126j776j304j103
60265B66818j183j249j188j145j122q29j43O14J074J322J733K449L237L855M260
60250B78503M509M610M532M225L691L115K807K874L006K779K099J190K09q55j958
$$ plain form
60356 205262 205538 206093 206868 207679 208496 209390 210290 211030 211639 212298 213026 213660 214165 214684 215273 215804 216250 216777 217511
60337 217511 218405 219439 220710 222205 223733 225217 226863 228834 230905 232673 233993 235052 236081 237169
60323 237169 238321 239548 240864 242292 243851 245498 247124 248664 250153 251646 253128 254557 255922 257186
60309 257186 258252 259072 259777 260669 262023 263869 265911 267708 269067 270226 271590 273313 275279 277438 279929
60294 279929 282794 285814 288746 291602 294494 297324 299760 301514 302492 302748 302375 301409 299790 297477 294706
60279 294706 292028 289900 288228 286459 284195 281614 279204 277159 275225 273127 271001 269225 267921 266818
60265 266818 265635 264386 263198 262053 260931 260102 259959 260573 261647 262969 264702 267151 270388 274243 278503
60250 278503 283012 287622 292154 296379 300070 303185 305992 308866 311872 314651 316750 317940 318149 317294 315336
60235C15336k923l696m452n336o167o530o176n297m355l649l098k507j974j781
60221B57395j949k136k097j941j834j706j512j455j707k029k032j703j356j196
60207B32742j184j245j350j338j022m28J85N70O19L67K5j20j3R6Q8K13O01Q56
60189B29662N65L3o3L70P58P30N21M61N40O61Q36R89R62Q15P95Q83Q08N85N28
60170B41439O38N51L11N65J573K614K908K624K451K500K375K058K029K506L153
60155B70295L610L848L920L778L460L144K949K845K800K728K468K043J836K132
60141C11856K570K522J997J644J766J895J558R85O41M57J0p44j376j569j470j345
60125C21397j248j136j080j219j530j782j711j276p16l76m12o86r69j151j190
$$ plain form
60235 315336 312413 308717 304265 298929 292762 286232 280056 274759 270404 266755 263657 261150 259176 257395
60221 257395 255446 253310 251213 249272 247438 245732 244220 242765 241058 239029 236997 235294 233938 232742
60207 232742 231558 230313 228963 227625 226603 226175 226360 226930 227549 227916 227941 227821 227808 227904 227992 228205 228806 229662
60189 229662 230227 230260 230197 230567 231325 232055 232576 233037 233577 234238 235074 236063 237025 237840 238635 239518 240326 240911 241439
60170 241439 242077 242628 242939 243504 245077 247691 250599 253223 255674 258174 260549 262607 264636 267142 270295
60155 270295 273905 277753 281673 285451 288911 292055 295004 297849 300649 303377 305845 307888 309724 311856
60141 311856 314426 316948 318945 320589 322355 324250 325808 326793 327434 327891 327901 327157 325781 324212 322742 321397
60125 321397 320149 319013 317933 316714 315184 313402 311691 310415 309699 309323 308911 308225 307256 306105 304915
60110C04915j009n54l3J41k70j025j568j571j204r07q74r36q49o06l42j14O6R6
60092B93356j29m63n94l92oM15Q58J211J179P20K77L07O70Q70Q26R63J484J973
60074C03525J975J585J216J011Q53P51Q27J029J196J383J734K068J975J448R94
60059C23570R96J271J473J592J794K017K119K170K317K423K244J867J593J436
60045C48882J102N34J31K67Q23J348J528J316Q31K57k19n62r00j306j639j702
60029C50691j541j427j568j919k278k545k779l048l266l313l263l319l503l605
60015C13317l551l577l852m063l753k988k343k186k277k192j871j604j610j818
60001B75632j977j860j470j079r66j068j060q17n66n04m75k12K43N63N77M62M89
$$ plain form
60110 304915 303906 303352 303319 303460 303190 302165 300597 299026 297822 296915 296041 295105 294256 293650 293308 293194 293260 293356
60092 293356 293227 292764 292170 291778 291772 292187 293045 294256 295435 296155 296432 296739 297409 298279 299105 300068 301552 303525
60074 303525 305500 307085 308301 309312 310165 310916 311743 312772 313968 315351 317085 319153 321128 322576 323570
60059 323570 324566 325837 327310 328902 330696 332713 334832 337002 339319 341742 343986 345853 347446 348882
60045 348882 349984 350518 350649 350916 351739 353087 354615 355931 356762 357019 356800 356238 355338 354032 352393 350691
60029 350691 349150 347723 346155 344236 341958 339413 336634 333586 330320 327007 323744 320425 316922 313317
60015 313317 309766 306189 302337 298274 294521 291533 289190 287004 284727 282535 280664 279060 277450 275632
60001 275632 273655 271795 270325 269246 268280 267212 266152 265335 264769 264265 263790 263578 263821 264384 264961 265423 265912
59984B65912O78Q05P05N65P22J203J540J290O44J92J50R4l37q90j088r37q59j098
59966B69291j455j672j717j689j668j707j857k046k115j989j758j531j328j180
59952B45579j161j260j308j181j003j013j242j468j475j271r68o11k37j3j00l96
59936B30872n93n43l54j07K85Q28J263J353J233J252J474J653J601J354J000N74
59920B43145J84RM4L7j83m87o12n18m72p82j420j930j779r48J0N48O31N37L50
59901B36364L0k36j58J66K99J14nK45O53P85M81j10o68q17l60M25R87J145J190
59882B40530J285J151O34J14K6K49M13M90P12J054J286J385J541J780J956K061
59866B56667K198K298K196J939J707J427Q83J81k10n7L16M71L87M24Q27J427J753
$$ plain form
59984 265912 266590 267395 268100 268665 269387 270590 272130 273420 274064 274256 274406 274500 274163 273273 272185 271248 270389 269291
59966 269291 267836 266164 264447 262758 261090 259383 257526 255480 253365 251376 249618 248087 246759 245579
59952 245579 244418 243158 241850 240669 239666 238653 237411 235943 234468 233197 232229 231618 231381 231368 231268 230872
59936 230872 230279 229736 229382 229275 229560 230388 231651 233004 234237 235489 236963 238616 240217 241571 242571 243145
59920 243145 243329 243338 243382 243419 243236 242749 242137 241619 241147 240365 238945 237015 235236 234288 234298 234846 235477 236014 236364
59901 236364 236394 236158 236000 236166 236465 236579 236574 236819 237472 238257 238738 238628 237960 237143 236783 237208 238195 239340 240530
59882 240530 241815 242966 243600 243714 243740 243989 244402 244892 245604 246658 247944 249329 250870 252650 254606 256667
59866 256667 258865 261163 263359 265298 267005 268432 269315 269496 269286 269229 269545 270016 270403 270827 271654 273081 274834
59849B74834J526J015Q06J099J398J137M19j89m60p19j195j625j623j197o76k92
59833B74258l8K20N67R61J244J311J214J077R72R84J289J887K417K490K200J984
59817B95037K002J993J787J571J492J361J018O40M58L86K51K09M88Q68Q39L17
59801C10717j51n9M70R62J215J382J573J699J750J862K091K259K276K335K608
59786C32989K814K468J518M58k51o02p76p74n10r9K05K11j79r95k020k732k766
59769C28959k314j868j643j511j424j530j850k148k242k149j882j310m53L17N66
59754C07518K65j66l25j92o7j70l67m02k80k93n81r15r92q38o75n66m30l15m04
59735B99805p02j022j236j382j469j438j377j497j808k032j937j611j321j211
$$ plain form
59849 274834 276360 277375 278181 279280 280678 281815 282234 282045 281585 280866 279671 278046 276423 275226 274550 274258
59833 274258 274220 274440 275007 275968 277212 278523 279737 280814 281786 282770 284059 285946 288363 290853 293053 295037
59817 295037 297039 299032 300819 302390 303882 305243 306261 306901 307359 307745 307996 308205 308693 309561 310400 310717
59801 310717 310566 310507 310977 311939 313154 314536 316109 317808 319558 321420 323511 325770 328046 330381 332989
59786 332989 335803 338271 339789 340247 339996 339394 338618 337844 337334 337235 337440 337651 337472 336477 334457 331725 328959
59769 328959 326645 324777 323134 321623 320199 318669 316819 314671 312429 310280 308398 307088 306635 306952 307518
59754 307518 307783 307617 307292 307100 307033 306863 306496 306094 305814 305521 304940 304025 303033 302195 301520 300954 300524 300209 299805
59735 299805 299103 298081 296845 295463 293994 292556 291179 289682 287874 285842 283905 282294 280973 279762
59721B79762j224j226j113r13p75p71p30m20J19O08Q81J018J133J261J481J919
59705B81010K477K817K753K510K426K570K788L026L370L811M148M169L871L471
59691C25217L218L151L062K740K284J999K018K068J734R50J18k45k5L64M49K44
59675C49346J56L55N00K58j81m00l53l09l36k44k4R6N4N6J92L30M41O82R48Q41
59655C52408K83j59N9P74J419J764K017K333K639K881L083L212L217L243L511
59640C82684M021M529M835M862M518L735K736J980J742J830J846J556R94K86m35
59625D21719j016j339j456j592j937k433k832k975k979l063l262l351l130k625
59611C87729k066j658j468j415j363j223r80o49k32K10N75Q52J201J734K300K614
$$ plain form
59721 279762 278538 277312 276199 275286 274511 273740 273010 272590 272709 273317 274198 275216 276349 277610 279091 281010
59705 281010 283487 286304 289057 291567 293993 296563 299351 302377 305747 309558 313706 317875 321746 325217
59691 325217 328435 331586 334648 337388 339672 341671 343689 345757 347491 348441 348559 348314 348289 348653 349102 349346
59675 349346 349502 349857 350357 350615 350434 350034 349681 349372 349036 348792 348768 348864 348918 348974 349166 349496 349937 350619 351567 352408
59655 352408 352691 352532 352591 353365 354784 356548 358565 360898 363537 366418 369501 372713 375930 379173 382684
59640 382684 386705 391234 396069 400931 405449 409184 411920 413900 415642 417472 419318 420874 421868 422154 421719
59625 421719 420703 419364 417908 416316 414379 411946 409114 406139 403160 400097 396835 393484 390354 387729
59611 387729 385663 384005 382537 381122 379759 378536 377556 376907 376675 376885 377460 378312 379513 381247 383547 386161
59595C86161K587K352K035J639J194P85L96j09q28j732k739l730m500m916n086
59580C73509n193n181m885m486m438m818n114m848m187l648l468l499l571l662
59566C12511l781l896l998m068m037l875l662l471l346l362l545l650l296k460
59552B62064j615j167r87p57n05m60n65n04k28K0J41L02N56O49M08N8k0K64O54
59533B58308Q48P69N45L20Q3k60o71r02p79m42k17k57m60o89r17j106j153r99
59515B52021p40n33m56m69m69l68j55P8K43L25L37K36j5l23n00m67l28k35j95
59496B47987p7K14N89Q39Q37O94O90J044J729K453K840K774K624K960L895M845
59480B76937N194N071N150N653N958N308L674J692N3r32j329j390j324j135p71
$$ plain form
59595 386161 388748 391100 393135 394774 395968 396753 397149 397040 396212 394480 391741 388011 383511 378595 373509
59580 373509 368316 363135 358250 353764 349326 344508 339394 334546 330359 326711 323243 319744 316173 312511
59566 312511 308730 304834 300836 296768 292731 288856 285194 281723 278377 275015 271470 267820 264524 262064
59552 262064 260449 259282 258295 257538 257033 256573 256008 255504 255276 255296 255437 255739 256295 256944 257352 257410 257390 257654 258308
59533 258308 259156 259925 260470 260790 260873 260613 259942 259040 258261 257819 257602 257345 256885 256196 255279 254173 253020 252021
59515 252021 251281 250748 250292 249823 249354 248986 248831 248909 249152 249477 249814 250050 250035 249712 249212 248745 248417 248182 247987
59496 247987 247910 248124 248713 249552 250389 251083 251773 252817 254546 256999 259839 262613 265237 268197 272092 276937
59480 276937 282131 287202 292352 298005 303963 309271 312945 314637 314690 313758 312429 311039 309715 308580 307809
59465C07809m07l12m26l78r3kl88r35j201j319j739k462l003l085k901k710k546
59448B83902k443k540k781k830k455j864j429j270j213j109r78r25r49r04o50
59433B59562k02K98P56J187J548J679J526J295J256J429J619J684J633J525J409
59418B78204J334J310J303J300J286J125O64P4j47J94O34O14K08j9J74M42M20
59401B89120J62o8q5K08Q61J733K505K913K905K574K104J751J666J699J543J129
59385C12720O35J87k64p10j009j111j149j240j322j281j092p64l18J66N87R35
59369C04970J223J420J561J844K338K766K912L093L761M694N188N102N159N900
59355C51931O971P827Q583R513J0091R269O751L421M79j442k282k261j748j091
$$ plain form
59465 307809 307402 307090 306664 306286 306193 306191 305803 304868 303667 302348 300609 298147 295144 292059 289158 286448 283902
59448 283902 281459 278919 276138 273308 270853 268989 267560 266290 265077 263968 262990 262065 261116 260212 259562
59433 259562 259360 259658 260414 261601 263149 264828 266354 267649 268905 270334 271953 273637 275270 276795 278204
59418 278204 279538 280848 282151 283451 284737 285862 286526 286600 286453 286647 287281 287895 288103 288084 288258 288700 289120
59401 289120 289282 289214 289129 289337 290198 291931 294436 297349 300254 302828 304932 306683 308349 310048 311591 312720
59385 312720 313355 313542 313278 312568 311559 310448 309299 308059 306737 305456 304364 303600 303282 303448 304035 304970
59369 304970 306193 307613 309174 311018 313356 316122 319034 322127 325888 330582 335770 340872 346031 351931
59355 351931 358902 366729 375312 384825 394916 404185 410936 414357 414836 413394 411112 408851 407103 406012
59341D06012l10P94K066K821K423Q88j254l471n407o757p301p097o449n647m865
59326C66446m261l925l713l295k529j679j150j044j128j148j007o79j59L91O91
59311C41811O80O81J013J486J599J219Q41J009J694K407K782K851K800K744K806
59296C68423L175L902M733N311N547N643N785N914N930N872N829N689N255M579
59282D41587L998L718L543L080K174J012j05r92j639k173k792l588m481n268n784
59267D32290o004o035o062o187o322o348o336o462o644o502n823m921m312m142
59253C50190m138l998l678l260k841k493k227j938j507r25k57M70J224J930K607
59238C29159L388M167M355L355J294r65k645l615m115m284m118l690l113k423
$$ plain form
59341 406012 405702 406496 408562 411383 413806 414694 413440 409969 404562 397805 390504 383407 376958 371311 366446
59326 366446 362185 358260 354547 351252 348723 347044 345894 344850 343722 342574 341567 340888 340729 341120 341811
59311 341811 342491 343172 344185 345671 347270 348489 349330 350339 352033 354440 357222 360073 362873 365617 368423
59296 368423 371598 375500 380233 385544 391091 396734 402519 408433 414363 420235 426064 431753 437008 441587
59282 441587 445585 449303 452846 455926 458100 459112 459007 458015 456376 454203 451411 447823 443342 438074 432290
59267 432290 426286 420251 414189 408002 401680 395332 388996 382534 375890 369388 363565 358644 354332 350190
59253 350190 346052 342054 338376 335116 332275 329782 327555 325617 324110 323185 322928 323398 324622 326552 329159
59238 329159 332547 336714 341069 344424 345718 344753 342108 338493 334378 330094 325976 322286 319173 316750
59224C16750j638q79k91J49N70J024J448J852K334K934L527L952M214M457M761
59209C45164N009N026M799M433L991L496L074K851K688K274J569R15N21J36m93
59194C85453j152j436j400j484j866k272k428k368k219j976j671j429j305j235
59180C61212j283j619k191k615k594k259j974j951k156k434k568k419k081j881
59166C31187k006k284k396k253k053k005k137k290k271k039j768j638j596j431
59152C03020j050n63r5K89N15N20L88L05L32L94M98P52J085J277J320J470J819
59135C12276K024J758J197Q29Q64J095J239J252J218J189J105Q62L96k07p50j099
59119C25248j268j299j193r90q51r06j119j347j518j627j671j636j560j476j328
$$ plain form
59224 316750 315112 314233 313942 314091 314661 315685 317133 318985 321319 324253 327780 331732 335946 340403 345164
59209 345164 350173 355199 359998 364431 368422 371918 374992 377843 380531 382805 384374 385289 385810 385946 385453
59194 385453 384301 382865 381465 379981 378115 375843 373415 371047 368828 366852 365181 363752 362447 361212
59180 361212 359929 358310 356119 353504 350910 348651 346677 344726 342570 340136 337568 335149 333068 331187
59166 331187 329181 326897 324501 322248 320195 318190 316053 313763 311492 309453 307685 306047 304451 303020
59152 303020 301970 301407 301312 301601 302116 302636 303024 303329 303661 304055 304553 305305 306390 307667 308987 310457 312276
59135 312276 314300 316058 317255 318084 318948 320043 321282 322534 323752 324941 326046 326908 327304 327097 326347 325248
59119 325248 323980 322681 321488 320498 319647 318741 317622 316275 314757 313130 311459 309823 308263 306787 305459
59104C05459j048p35o31q46j121j035n44j95n53j450k073j930j422j266j605k016
59088B86989k164k055j750j322j101j494k395l129l176k659k022j526j245j214
59074B59737j274j032l06N20Q59O03K34K77Q06J490J958K098K078K119K321K717
59058B75205L341M103M682M802M577M350M230M034L698L394L183K895K463K054
59044C27011J757J402R25N70M95M80K56j08l88n86q09r77r84r79j182j502j610
59027C23771j431j212j134j129j136j287j682k153k401k358k222k169k115j908
59013B99434j680j745k101k278j928j354j138j350j508j268p48k18J57J68l54
58998B82089j179j760j867j811j857j835j569j283j224j190q38k57J92L88M85
$$ plain form
59104 305459 304411 303676 303045 302199 301078 300043 299499 299304 298751 297301 295228 293298 291876 290610 289005 286989
59088 286989 284825 282770 281020 279698 278597 277103 274708 271579 268403 265744 263722 262196 260951 259737
59074 259737 258463 257431 257125 257645 258504 259107 259341 259618 260424 261914 263872 265970 268048 270167 272488 275205
59058 275205 278546 282649 287331 292133 296710 301060 305290 309324 313022 316416 319599 322494 324957 327011
59044 327011 328768 330170 331095 331665 332160 332640 332896 332788 332400 331814 331005 330028 329044 328065 326883 325381 323771
59027 323771 322340 321128 319994 318865 317729 316442 314760 312607 310206 307848 305626 303457 301342 299434
59013 299434 297754 296009 293908 291630 289702 288348 287210 285860 284352 283084 282336 282118 282275 282443 282089
58998 282089 280910 279150 277283 275472 273615 271780 270211 268928 267704 266514 265676 265419 265611 265999 266484
58983B66484N40M70K86J26L8j5k4J4N9J53M59R48J313J373J350J515J805K058
58965B78952K410L060L813M248M252M081L953L870L754L481K814J713N50j86m21
58950C20344m19l65k86l05n55q48p72k24M50Q77R98R98J051J202J306J103N77
58933C25132J12O7K86L08nl54m93m90m32k47J02M75P99J188J718K197K405K410
58915C35178K561L116L956M658M880M705M526M551M540M117L290K471K055K054
58901C86658K133J895J196K74n03j018j477k057k684l241l760m295m727m941n009
58886C58444n066n063m870m459l911l347k907k631k333j829j327j226j400j217
58872C16858m57K18J74k69l73p1Q8r5k41j05J08K12L19M52M02J11j15J1M04P80
$$ plain form
58983 266484 267024 267494 267780 267906 267944 267929 267905 267919 267978 268131 268590 269538 270851 272224 273574 275089 276894 278952
58965 278952 281362 284422 288235 292483 296735 300816 304769 308639 312393 315874 318688 320401 320951 320765 320344
58950 320344 319925 319560 319274 318969 318414 317566 316794 316570 317020 317897 318895 319893 320944 322146 323452 324555 325132
58933 325132 325244 325311 325597 325905 325900 325546 325053 324563 324131 323884 323986 324461 325260 326448 328166 330363 332768 335178
58915 335178 337739 340855 344811 349469 354349 359054 363580 368131 372671 376788 380078 382549 384604 386658
58901 386658 388791 390686 391882 392156 391653 390635 389158 387101 384417 381176 377416 373121 368394 363453 358444
58886 358444 353378 348315 343445 338986 335075 331728 328821 326190 323857 322028 320701 319475 318075 316858
58872 316858 316401 316619 316793 316524 316151 316080 316168 316073 315832 315727 315835 316047 316366 316818 317220 317331 317216 317227 317631 318411
58852C18411R67R75R14R95J362J936K474K859L148L433L754M136M526M801M954
58837C59645N136N374N418N144M862M933N251N444N420N389N438N466N451N412
58823D33783N221M768M251L883L423K497J290M61K94L90K71j09n67r88j282j358
58807D56228j346j567k108k685l017l191l473l940m416m692m758m808n012n274
58793D05941n381n380n561n939o122n873n433n073m679m157l856m060m414m399
58779C35614m138m065m097l795l236k940k964k788k179j533j169r06n54k47j27
58764C00876p0N5K64O25J177J654J694J352R83O58K21j46n3L91O15M17J48k5l53
58745C10483r02j342j566j853k222k282j980j814k000k058j668j237j209j369
$$ plain form
58852 318411 319378 320353 321267 322262 323624 325560 328034 330893 334041 337474 341228 345364 349890 354691 359645
58837 359645 364781 370155 375573 380717 385579 390512 395763 401207 406627 412016 417454 422920 428371 433783
58823 433783 439004 443772 448023 451906 455329 457826 459116 459577 459871 460261 460532 460423 459856 458868 457586 456228
58807 456228 454882 453315 451207 448522 445505 442314 438841 434901 430485 425793 421035 416227 411215 405941
58793 405941 400560 395180 389619 383680 377558 371685 366252 361179 356500 352343 348487 344427 340013 335614
58779 335614 331476 327411 323314 319519 316283 313343 310379 307591 305412 303879 302710 301804 301250 301003 300876
58764 300876 300806 300861 301125 301750 302927 304581 306275 307627 308610 309268 309489 309343 309290 309681 310296 310713 310861 310836 310483
58745 310483 309581 308239 306673 304820 302598 300316 298336 296522 294522 292464 290796 289559 288350 286981
58731B86981j314j124r93p04MQ23J246J289J369J671K004K208K338K494K700K806
58715C03798K523J764R87P48Q91O36l15j348j863k032k263k490k446k275k277
58700B94038k414k450k431k524k668k688k564k312j861j280q45n74j06O78J338
58685B71337J479J334J316J377J251R92Q19O95N32N57J034J792K445K865L097
58670B92922L038K609K062J708J479J102N58P6j45PN77J308J702J604J469J722
58654C13798K125K155J713J105N67J42j49m10r30j805k740l477m137m872n502
58639B97583n829n999o125n952n301m599m391m597m704m542m329m112l668k964
58625B30471k293j908j790j763j625j307j033j068j217r20r4O07O85M81N82R33
$$ plain form
58731 286981 285667 284543 283550 282846 282850 283673 284919 286208 287577 289248 291252 293460 295798 298292 300992 303798
58715 303798 306321 308085 309072 309820 310711 311347 311032 309684 307821 305789 303526 301036 298590 296315 294038
58700 294038 291624 289174 286743 284219 281551 278863 276299 273987 272126 270846 270001 269427 269321 269999 271337
58685 271337 272816 274150 275466 276843 278094 279086 279905 280600 281132 281689 282723 284515 286960 289825 292922
58670 292922 295960 298569 300631 302339 303818 304920 305478 305554 305409 305416 305993 307301 309003 310607 312076 313798
58654 313798 315923 318078 319791 320896 321463 321605 321456 321046 320116 318311 315571 312094 307957 303085 297583
58639 297583 291754 285755 279630 273678 268377 263778 259387 254790 250086 245544 241215 237103 233435 230471
58625 230471 228178 226270 224480 222717 221092 219785 218752 217684 216467 215547 215453 216060 216745 217226 217808 218741
58609B18741J133J194J410J731J881J913K117K445K554K314J831J119J96o36j077
58594B38866j287j638k141k473k476k272j978j655j412j255j017o90n76q19j129
58579B16048j270j450j793j921j516r30o20m13O7N41M41r4m11l47l28m91m63q3
58561B04967L34N24N92O51O62O45P49R96J331J761K199K306J930J423J150R44
58545B23164N66L66Q20J623J985J682J184Q34N78M61O87J116J318J198J045J005
58529B39632J011J202J802K603L155L435L757M079M058L770L711L967M109L941
58515B84232L764L733L652L505L640M143M645M909N141N538N932O194O479O950
58501C52457P486P858P887P465O642N714M870L917K654J371M73j38q48j645k281
$$ plain form
58609 218741 219874 221068 222478 224209 226090 228003 230120 232565 235119 237433 239264 240383 240579 239943 238866
58594 238866 237579 235941 233800 231327 228851 226579 224601 222946 221534 220279 219262 218572 217996 217177 216048
58579 216048 214778 213328 211535 209614 208098 207168 206548 206135 206202 206743 207184 207090 206679 206332 206004 205513 205050 204967
58561 204967 205301 205825 206417 207068 207730 208375 209124 210120 211451 213212 215411 217717 219647 221070 222220 223164
58545 223164 223730 224096 224916 226539 228524 230206 231390 232224 232802 233263 233950 235066 236384 237582 238627 239632
58529 239632 240643 241845 243647 246250 249405 252840 256597 260676 264734 268504 272215 276182 280291 284232
58515 284232 287996 291729 295381 298886 302526 306669 311314 316223 321364 326902 332834 339028 345507 352457
58501 352457 359943 367801 375688 383153 389795 395509 400379 404296 406950 408321 408794 408656 407808 406163 403882
58486D03882k864l621m261m322m092m332n117n774o032o329o889p283p246p112
58472C28608p095o851o135n279m656m174l668l288l162l107k957k769k504j964
58458B70999j280r46j150j477j507j271r75p20o44q33r78o39MK37j47n21l80m0
58440B57732J8o4J02M55O60O93Q29J161J483J560J366J120J168J644K245K616
58424B74788K840L265L884M366M616M882N242N416N211M699L991L163K413J839
58410C30615J144rj343k176k243j907j574j398j419j488j135j31R58J403J337
58395C20634J504K076K532K636K677K692K285J375L58o12j737k866l478l514l445
58380C23117l409l070k483k232k417k413j859j163o90k66K26N31O46J003J690
$$ plain form
58486 403882 401018 397397 393136 388814 384722 380390 375273 369499 363467 357138 350249 342966 335720 328608
58472 328608 321513 314662 308527 303248 298592 294418 290750 287462 284300 281193 278236 275467 272963 270999
58458 270999 269719 268773 267623 266146 264639 263368 262393 261673 261029 260196 259218 258579 258583 258820 258673 258152 257772 257732
58440 257732 257750 257686 257788 258243 258903 259596 260425 261586 263069 264629 265995 267115 268283 269927 272172 274788
58424 274788 277628 280893 284777 289143 293759 298641 303883 309299 314510 319209 323200 326363 328776 330615
58410 330615 331759 331750 330407 328231 325988 324081 322507 321109 319690 318202 317067 316936 317894 319297 320634
58395 320634 322138 324214 326746 329382 332059 334751 337036 338411 338769 338157 336420 333554 330076 326562 323117
58380 323117 319708 316638 314155 311923 309506 307093 305234 304071 303381 303115 303341 303872 304518 305521 307211
58365C07211K214K295K202K013J425N67J47L43L61m02j462k024k035j918j867
58350C09070j853j855j744j386j054j175j544j461p87j47J15L67Q66J329J595
58335C00336J874K080J766J043O77R55J330J471J722K171K282J889J600J762J954
58320C24912J963K221K790K993K594K360K782L277L311L321L735M026L642L041
58306C66968K912L126L255L432L890M290M265M091M157M285M133L738L227K560
58292D18329J951J795J893J636J172J329K127K571K343K384L150L745L558L416
58278D51399M098M960N153N064N416N939O074O105O465O772O539O107N881N496
58264E31468M668M005M012M170L906L603L790M224M610N245O142O559O268O161
$$ plain form
58365 307211 309425 311720 313922 315935 317360 317927 318074 318417 318778 318376 316914 314890 312855 310937 309070
58350 309070 307217 305362 303618 302232 301178 300003 298459 296998 296211 296064 296179 296546 297412 298741 300336
58335 300336 302210 304290 306056 307099 307776 308731 310061 311532 313254 315425 317707 319596 321196 322958 324912
58320 324912 326875 329096 331886 334879 337473 339833 342615 345892 349203 352524 356259 360285 363927 366968
58306 366968 369880 373006 376261 379693 383583 387873 392138 396229 400386 404671 408804 412542 415769 418329
58292 418329 420280 422075 423968 425604 426776 428105 430232 432803 435146 437530 440680 444425 447983 451399
58278 451399 455497 460457 465610 470674 476090 482029 488103 494208 500673 507445 513984 520091 525972 531468
58264 531468 536136 540141 544153 548323 552229 555832 559622 563846 568456 573701 579843 586402 592670 598831
58250E98831O726P170P019P155Q167R084R025Q775R321J0142J0382J0451J0949
58237G13197J1178J0378R330R161R555R722J0044J1122J2226J2446J2353J2848
58225H43560J3410J3201J2927J3737J5153J5911J6125J6810J8029J9127K0157
58214A018147K1425K2397K2597K2785K3774K4964K5527K6003K7208K8747L0114
58203A293688L2017L4956L7828L9667M1355M3750M5773M6406M6946M8982N1649
58192A763017N3344N4655N7057O0068O2430O4801O8506P2872P6492Q0016Q4901
58181B498159R0596R5689J00727J07041J13994J20193J26177J33202J40654J47532
58171C673964J54953J64280J74445J84124J94724K07981K22584K36696K51573
$$ plain form
58250 598831 605557 612727 619746 626901 635068 644152 653177 661952 671273 681415 691797 702248 713197
58237 713197 724375 734753 744083 753244 762799 772521 782565 793687 805913 818359 830712 843560
58225 843560 856970 870171 883098 896835 911988 927899 944024 960834 978863 997990 1018147
58214 1018147 1039572 1061969 1084566 1107351 1131125 1156089 1181616 1207619 1234827 1263574 1293688
58203 1293688 1325705 1360661 1398489 1438156 1479511 1523261 1569034 1615440 1662386 1711368 1763017
58192 1763017 1816361 1871016 1928073 1988141 2050571 2115372 2183878 2256750 2333242 2413258 2498159
58181 2498159 2588755 2684444 2785171 2892212 3006206 3126399 3252576 3385778 3526432 3673964
58171 3673964 3828917 3993197 4167642 4351766 4546490 4754471 4977055 5213751 5465324
58162E465324K68990K87352L04508L22119L42959L66259L90349M17339M50188
58153H615387M87794N28341N74715O30811O95370P65748Q44878R37755J044267
58144A5125066J162846J297766J454462J631061J823678K037306K282450K564376
58136B9379011K883974L242484L634540M045927M474788M947972N501417O156586
58128F4266699O926265P786920Q554243Q787258P949813N808831K700483o43056
58120A12137456l549369n705276p104786p848831q048643p838010p369366o769285
58112E7903890o118881n472004m866033m315547l818182l372473k980501k637015
58104B4323254k330662k056293j815543j606280j421531j258121j117136r96101
$$ plain form
58162 5465324 5734314 6021666 6326174 6648293 6991252 7357511 7747860 8165199 8615387
58153 8615387 9103181 9631522 10206237 10837048 11532418 12298166 13143044 14080799 15125066
58144 15125066 16287912 17585678 19040140 20671201 22494879 24532185 26814635 29379011
58136 29379011 32262985 35505469 39140009 43185936 47660724 52608696 58110113 64266699
58128 64266699 71192964 78979884 87534127 96321385 104271198 110080029 112780512 112137456
58120 112137456 108588087 102882811 95778025 87929194 79880551 72042541 64673175 57903890
58112 57903890 51785009 46313005 41446972 37131425 33313243 29940770 26960269 24323254
58104 24323254 21992592 19936299 18120756 16514476 15092945 13834824 12717688 11721587
58096A1721587q88845p92858p09777o38965n77193n23956m80718m45270m12703
58087F251302l81615l54101l30169l07282k84958k64774k46202k27068k07898
58078C647235j91395j77908j65502j54006j44981j38029j31080j24021j18321
58069B301992j13487j07506j00512r4432q9403q3947p8270p3900p0409o5915o0697
58058A363514n6861n4599n2016m8650m5938m4174m2064l9454l7526l6144l3879
58047H72209l0792k8497k7237k5649k3520k2123k1592k0623j9061j8203j8179
58036F16733j7564j5984j4716j4198j3330j1760j0644j0520j0443r867r457r517
58024D68733r387q917q813r089q817p839p099o978o860o571o689p169p264p029
$$ plain form
58096 11721587 10832742 10039884 9330107 8691142 8113949 7589993 7109275 6664005 6251302
58087 6251302 5869687 5515586 5185417 4878135 4593177 4328403 4082201 3855133 3647235
58078 3647235 3455840 3277932 3112430 2958424 2813443 2675414 2544334 2420313 2301992
58069 2301992 2188505 2080999 1980487 1886055 1796652 1712705 1634435 1560535 1490126 1424211 1363514
58058 1363514 1306653 1252054 1200038 1151388 1105450 1061276 1019212 979758 942232 906088 872209
58047 872209 841417 812920 785683 760034 736514 714391 692799 672176 653115 634912 616733
58036 616733 599169 583185 568469 554271 540941 529181 518537 508017 497574 487707 478250 468733
58024 468733 459346 450429 441616 432527 423710 415871 408772 401794 394934 388363 381674 374505 367241 360212
58010C60212p304q000q027p184o468o278n902n082m488m279l756k838k394k746
57996B85466l183l335l639m136m203l765l507l594l426k876k470k228j626q89
57982B42589q84j591k046j957j951k150j972j536j662k245k237j574j438k205
57968B17141k775k537k321k718k990k497j862j773j904j798j763k031k139j847
57954A86186j680j859j745j047m92o34r44q72p96j097j249p11J7J37k52n28m97
57937A71937l80k33o3m3j66j55K8L3k14l62l34m58o87n18LJ04n34j251j454j358
57917A63895j222q11o9M15K99P6K24M68M27L16M06M54K30J8O2Q4j41l15k05j47
57897A64464m42q17r71j090j372j550j370j055q53o66m69n71r98j187p69j43J86
$$ plain form
58010 360212 352908 344908 336881 329697 323229 316951 311049 305967 301479 297200 293444 290606 288212 285466
57996 285466 282283 278948 275309 271173 266970 263205 259698 256104 252678 249802 247332 245104 243478 242589
57982 242589 241705 240114 238068 236111 234160 232010 230038 228502 226840 224595 222358 220784 219346 217141
57968 217141 214366 211829 209508 206790 203800 201303 199441 197668 195764 193966 192203 190172 188033 186186
57954 186186 184506 182647 180902 179855 179363 178729 177785 176913 176117 175020 173771 173060 173077 173214 172962 172434 171937
57937 171937 171557 171324 171261 171218 171052 170897 170925 170958 170744 170382 170048 169590 168903 168385 168388 168492 167958 166707 165253 163895
57917 163895 162673 161862 161793 162208 162507 162583 162807 163275 163702 164018 164424 164878 165108 165126 165188 165272 165131 164816 164611 164464
57897 164464 164022 163205 162234 161144 159772 158222 156852 155797 154944 154278 153809 153238 152240 151053 150284 150141 150327
57880A50327L26O37J044J240J187J038R18R83J293J487J067K13l25l26m34j072
57864A59603j811k116k091k040j969j914k085k320k045j225n98n59n70j73J78
57849A38265n1n47p32o55o08m29M3L88J66l42o13o73p80p48l10K20L59K19K33
57830A33405M15M62L78L60L91M14O40J156J553J439J058Q38P31M76J63l5k86o87
57812A42871q08l26K73L62J90M60J154J589J518J356J300J088O62L99M85O42O39
57795A53854N69N39M79M41O21R44R90N18k26q44j158j208j090r33q37p57n45j74
57777A51183J67K54M3k47l04n7K09K26J72M27R42J234J092Q64Q84J034J077J018
57759A60218Q76N28J7k67j45M9m7l10m83o74j114j655j978k068k116k131j995
$$ plain form
57880 150327 150653 151290 152334 153574 154761 155799 156717 157700 158993 160480 161547 161760 161435 161109 160675 159603
57864 159603 157792 155676 153585 151545 149576 147662 145577 143257 141212 139987 139389 138830 138260 138087 138265
57849 138265 138214 137667 136935 136280 135672 135243 135286 135674 135840 135498 134885 134212 133432 132684 132374 132594 132953 133172 133405
57830 133405 133820 134282 134660 135020 135411 135825 136465 137621 139174 140613 141671 142509 143240 143716 143879 143844 143558 142871
57812 142871 142063 141737 142010 142372 142562 143022 144176 145765 147283 148639 149939 151027 151689 152088 152573 153215 153854
57795 153854 154423 154962 155441 155882 156503 157447 158437 158955 158729 157885 156727 155519 154429 153496 152659 151902 151357 151183
57777 151183 151350 151604 151647 151400 151096 151039 151248 151474 151646 152073 153015 154249 155341 156205 157089 158123 159200 160218
57759 160218 161094 161622 161639 161372 161227 161276 161229 160919 160436 159762 158648 156993 155015 152947 150831 148700 146705
57742A46705j793j716j742j671j416j033o22l74m91r39j426j732j788j493q09
57727A27660j07J05o8K8N86J006Q84O44P64J030J088J155J521J824J589J086R43
57710A41738J137J098O45N9n29j197j719j697j217p84o39n92m90l54j30J98L40
57693A35867M9l01r9N77J013Q93P10R76J562K023K192K163J995J673J201O45J59
57676A53298l7R7K91K45J7j11o2l1j58m12o95q75q01m75j33M4J35K17J16l08q25
57655A49537j080j026q40n91l01j19j25r7J80N22N71L10L0n7Q7M28Q22J008R41
57636A50200R05J012R72O11L21M68P40N81O2k59j83JJ51M28Q77J327J749K224
57618A62187K594K634K515K732L504M635N906P217Q421R408J0299J1217J1912
$$ plain form
57742 146705 144912 143196 141454 139783 138367 137334 136712 136338 135847 134908 133482 131750 129962 128469 127660
57727 127660 127553 127658 127590 127618 128204 129210 130094 130738 131502 132532 133620 134775 136296 138120 139709 140795 141738
57710 141738 142875 143973 144618 144677 144148 142951 141232 139535 138318 137534 136895 136303 135813 135459 135329 135527 135867
57693 135867 135916 135615 135516 136093 137106 137999 138709 139685 141247 143270 145462 147625 149620 151293 152494 153139 153298
57676 153298 153261 153358 153649 153894 153911 153800 153738 153707 153549 153137 152442 151567 150766 150291 150158 150202 150337 150554 150670 150362 149537
57655 149537 148457 147431 146591 146000 145699 145580 145455 145358 145538 146060 146631 146941 146971 146914 147001 147429 148251 149259 150200
57636 150200 151105 152117 153089 153700 154021 154489 155229 155810 155872 155613 155430 155431 155582 156010 156887 158214 159963 162187
57618 162187 164781 167415 169930 172662 176166 180801 186707 193924 202345 211753 222052 233269 245181
57605B45181J1901J0807Q349M328q38n826r336j1173j1953j2057j1425j0279r143
57592A98536q178p118n925m884m018l083k186j737j678j465r59o32p44r23q76
57577A54130q01q23o05K1O06O72L67J14j9k33n49q28j028j203j343j393j275q86
57559A44924k96P4j28n93o47j89K00J68K0N6N0k37n49n40k81jK93O09P28N47L49
57538A44557L70L62k2o37j000q65l84R9K46j03o59q49n21j66k47n66o76o10o95
57519A37634r24r37o22k80j57j47l1J79K73Q6k93n78n69l92l19l38j59K85O94
57500A33405Q39Q88J055J205J092P91O04O49P74P98O45L60J38K24O08R49R77P89
57482A46790O53O44P02Q68J204J579J733J580J254R40P37O50N84M49L07L54O31
$$ plain form
57605 245181 257082 267889 276238 280566 279728 273902 264566 253393 241440 229383 217958 207679 198536
57592 198536 190358 183240 177315 172431 168413 165330 163144 161407 159729 158264 157305 156673 155929 155006 154130
57577 154130 153329 152506 151901 151922 152528 153200 153567 153681 153662 153429 152880 152052 151024 149821 148478 147085 145810 144924
57559 144924 144628 144702 144574 143981 143334 143145 143345 143513 143533 143589 143639 143402 142853 142313 142032 142031 142324 142933 143661 144208 144557
57538 144557 144927 145289 145267 144630 143630 142765 142381 142480 142726 142623 141964 141115 140594 140428 140181 139615 138939 138329 137634
57519 137634 136710 135773 135151 134871 134714 134567 134536 134715 134988 135074 134781 134203 133634 133242 132923 132585 132426 132711 133405
57500 133405 134244 135132 136187 137392 138484 139275 139879 140528 141302 142100 142745 143105 143243 143467 144075 145024 146001 146790
57482 146790 147443 148087 148789 149657 150861 152440 154173 155753 157007 157947 158684 159334 159918 160367 160674 161028 161659
57465A61659R35J022Q70O29M75N48Q65J225J397J406J468J597J606J502J553J835
57449A80592K053K018J940J988J928J571J248J389J817J976J764J691K093K590
57435B06658K540J802Q71L51M20P45R15Q36P06O58O13N21M98N71N11J77j59r8
57417B19136L52P85R30Q78P94P03O73R33J596K358K728K585K302K286K492K581
57401B44112K401K142J979J884J827J917K177K386K385K306K312K258J967J654
57387B73707J669J919K027J994K200K682K965K778K455K336K266K000J729J767
57373C04494K023K172K206K366K659K839K792K684K703K874L103L271L304L303
57359C42793L409L506L250K600K058K112K652L182L477L665L814L819L686L572
$$ plain form
57465 161659 162594 163616 164486 165115 165590 166138 167003 168228 169625 171031 172499 174096 175702 177204 178757 180592
57449 180592 182645 184663 186603 188591 190519 192090 193338 194727 196544 198520 200284 201975 204068 206658
57435 206658 209198 211000 211871 212222 212642 213387 214302 215138 215844 216502 217115 217636 218134 218705 219216 219393 219234 219136
57417 219136 219488 220273 221203 222081 222875 223578 224251 225184 226780 229138 231866 234451 236753 239039 241531 244112
57401 244112 246513 248655 250634 252518 254345 256262 258439 260825 263210 265516 267828 270086 272053 273707
57387 273707 275376 277295 279322 281316 283516 286198 289163 291941 294396 296732 298998 300998 302727 304494
57373 304494 306517 308689 310895 313261 315920 318759 321551 324235 326938 329812 332915 336186 339490 342793
57359 342793 346202 349708 352958 355558 357616 359728 362380 365562 369039 372704 376518 380337 384023 387595
57345C87595L568L625L711L810L805L649L554L778M200M420M305M140M182M347
57331D42689M478M627M874N056M938M586M404M711N409O023O067N437M510L872
57317E11681L883M435N093N489N579N532N470N365N192N026M958M987N113N411
57303E83214N888O317O458O329O168O042N830N512N334N491N888O269O465O464
57289F67669O388O451O792P269P618P857Q262Q872R291R212Q874Q745Q893Q991
57275G81184Q821Q516Q309Q251Q234Q131P832P336O795O419O283O280O290O290
57261H84971O329O423O548O675O820O960O976O795O575O630P004P323P247O933
57247I80209O785O867O872O649O415O330O211N864N428N215N328N588N742N691
$$ plain form
57345 387595 391163 394788 398499 402309 406114 409763 413317 417095 421295 425715 430020 434160 438342 442689
57331 442689 447167 451794 456668 461724 466662 471248 475652 480363 485772 491795 497862 503299 507809 511681
57317 511681 515564 519999 525092 530581 536160 541692 547162 552527 557719 562745 567703 572690 577803 583214
57303 583214 589102 595419 601877 608206 614374 620416 626246 631758 637092 642583 648471 654740 661205 667669
57289 667669 674057 680508 687300 694569 702187 710044 718306 727178 736469 745681 754555 763300 772193 781184
57275 781184 790005 798521 806830 815081 823315 831446 839278 846614 853409 859828 866111 872391 878681 884971
57261 884971 891300 897723 904271 910946 917766 924726 931702 938497 945072 951702 958706 966029 973276 980209
57247 980209 986994 993861 1000733 1007382 1013797 1020127 1026338 1032202 1037630 1042845 1048173 1053761 1059503 1065194
57233A065194N577N680O085O501O566O333O172O239O315O241O170O211O170N809
57219A151263N169M459L822L366L202L264L279L059K751K595K665K858K987K800
57205A197539K181J409R32P97N77K0o08j021j395k012k700l042k947k656k252
57190A184822j581o64J58N74O55P81J235J928K475K593K393K148J858J254K54
57175A200883q64j785k436k845l076l345l926m764n506o010o503p072p462p573
57161A137716p757q220q528q165p290o461n821n056m039l052k309j669q91J07
57147A068565J263K401L257L689L856M021M195M195M024L978M339N118O084O956
57133A125941P586Q058Q558R092R460R568R555R522R310Q766Q049P440O960O388
$$ plain form
57233 1065194 1070771 1076451 1082536 1089037 1095603 1101936 1108108 1114347 1120662 1126903 1133073 1139284 1145454 1151263
57219 1151263 1156432 1160891 1164713 1168079 1171281 1174545 1177824 1180883 1183634 1186229 1188894 1191752 1194739 1197539
57205 1197539 1199720 1201129 1202061 1202858 1203435 1203455 1202847 1201826 1200431 1198419 1195719 1192677 1189730 1187074 1184822
57190 1184822 1183241 1182577 1182735 1183309 1183964 1184745 1185980 1187908 1190383 1192976 1195369 1197517 1199375 1200629 1200883
57175 1200883 1200019 1198234 1195798 1192953 1189877 1186532 1182606 1177842 1172336 1166326 1159823 1152751 1145289 1137716
57161 1137716 1129959 1121739 1113211 1105046 1097756 1091295 1085474 1080418 1076379 1073327 1071018 1069349 1068458 1068565
57147 1068565 1069828 1072229 1075486 1079175 1083031 1087052 1091247 1095442 1099466 1103444 1107783 1112901 1118985 1125941
57133 1125941 1133527 1141585 1150143 1159235 1168695 1178263 1187818 1197340 1206650 1215416 1223465 1230905 1237865 1244253
57119A244253N584M579L380J844k40l002o437j0459j5028k0195k5929l1938l7790
57106A108622m3179m7878n1536n3807n4719n4648n3936n2771n1444n0375m9791
57095E44538m9682n0090n1284n3539n6977o1479o6516p1130I242f7757p8843q0244
57083b26844q1069q1607q2452q3714q5057q6537q8673r1535r4592r7712j01610
57072a201402j06896j13380j20573j28306j36516j45113j54366j64870j76804
57063b448226j89793k03729k19072k36100k54611k74679k96983l21980l49454
57054d794627l79229m11696m47324m86507n30172n79884o37030p02719p78763
57045i747951q67871r72836j096710j244154j421381j634382j888286k188775
$$ plain form
57119 1244253 1249837 1254416 1257796 1259640 1259400 1256398 1249961 1239502 1224474 1204279 1178350 1146412 1108622
57106 1108622 1065443 1017565 966029 912222 857503 802855 748919 696148 644704 594329 544538
57095 544538 494856 444766 393482 339943 282966 221487 154971 83841 9242 -67757 -146600 -226844
57083 -226844 -307913 -389520 -471972 -555686 -640743 -727280 -815953 -907488 -1002080 -1099792 -1201402
57072 -1201402 -1308298 -1421678 -1542251 -1670557 -1807073 -1952186 -2106552 -2271422 -2448226
57063 -2448226 -2638019 -2841748 -3060820 -3296920 -3551531 -3826210 -4123193 -4445173 -4794627
57054 -4794627 -5173856 -5585552 -6032876 -6519383 -7049555 -7629439 -8266469 -8969188 -9747951
57045 -9747951 -10615822 -11588658 -12685368 -13929522 -15350903 -16985285 -18873571 -21062346
57037b1062346k542537k956016l435712l991259m637295n392324o278703p326749
57029e7622941q577518j0075261j1848571j3890643j6152134j8544995k0930745
57022a57642808k3068954k4559548k4877009k3559615k0465876j5896593j0465146
57015c00535549m819424N65962N418389R591054J3003142J5627066J7482708J8619704
57007b25046948J9106315J9031534J8502354J7628770J6511073J5238338J3888865
57000a05139699J2525711J1193840R924112Q738175P649416O663669N782516N005427
56992c7656833M328468L743604L241116K811607K445390K132094J862399J629257
56984a5462898J427109J251283J098623R67188Q54636P57862O74493O03310N42802
$$ plain form
57037 -21062346 -23604883 -26560899 -29996611 -33987870 -38625165 -44017489 -50296192 -57622941
57029 -57622941 -66200459 -76275720 -88124291 -102014934 -118167068 -136712063 -157642808
57022 -157642808 -180711762 -205271310 -230148319 -253707934 -274173810 -290070403 -300535549
57015 -300535549 -305354973 -304789011 -299370622 -289779568 -276776426 -261149360 -243666652 -225046948
57007 -225046948 -205940633 -186909099 -168406745 -150777975 -134266902 -119028564 -105139699
57000 -105139699 -92613988 -81420148 -71496036 -62757861 -55108445 -48444776 -42662260 -37656833
56992 -37656833 -33328365 -29584761 -26343645 -23532038 -21086648 -18954554 -17092155 -15462898
56984 -15462898 -14035789 -12784506 -11685883 -10718695 -9864059 -9106197 -8431704 -7828394 -7285592
56975g285592M90689M45298M06137L72488L42544L14474K87422K61028K34866
56966d130646K08883J83717J60470J40775J26726J19396J17174J16684J15530
56957b841291J13264J09802J04476R7020Q8206P8891O9421O0305N2403M5965M0386
56946a981152L5377L1389K8588K6415K4671K3987K4647K5869K6905K7952K9444
56935a675908L1165L2739L4272L5889L7241L8047L8564L8984L8916L8016L6634
56924a275441L5365L4392L3677L3261L2927L2120L0656K9089K7979K7199K6309
56913i32467K5181K3900K2461K0959J9695J8777J7998J7280J6804J6542J6138
56902g16732J5524J5073J4913J4633J3986J3297J2785J2088J0855R360Q120P287
$$ plain form
56975 -7285592 -6794903 -6349605 -5943468 -5570980 -5228436 -4913962 -4626540 -4365512 -4130646
56966 -4130646 -3921763 -3738046 -3577576 -3436801 -3310075 -3190679 -3073505 -2956821 -2841291
56957 -2841291 -2728027 -2618225 -2513749 -2416729 -2328523 -2249632 -2180211 -2119906 -2067503 -2021538 -1981152
56946 -1981152 -1945775 -1914386 -1885798 -1859383 -1834712 -1810725 -1786078 -1760209 -1733304 -1705352 -1675908
56935 -1675908 -1644743 -1612004 -1577732 -1541843 -1504602 -1466555 -1427991 -1389007 -1350091 -1312075 -1275441
56924 -1275441 -1240076 -1205684 -1172007 -1138746 -1105819 -1073699 -1043043 -1013954 -985975 -958776 -932467
56913 -932467 -907286 -883386 -860925 -839966 -820271 -801494 -783496 -766216 -749412 -732870 -716732
56902 -716732 -701208 -686135 -671222 -656589 -642603 -629306 -616521 -604433 -593578 -584218 -576098 -568811
56890e68811O782O589O567O401O117O183O805P540P957Q189Q461Q556Q279Q001
56876d66384Q208Q834R438R801R971R923R653R308Q877P987O433M622L189K342
56862c57798J857J531J299J117J018J168J648K324L023L650M065M125M012M094
56848c22867M368M370L860L202K862K873L005L119L139L010K924L224L829M173
56834b74909L975L708L969M702N390N739N861O012O371O899P235O986O202N275
56820a96585M386L402K467K074K358K818K975K917K920L011L204L687M440N099
56806a50827N546O149P101Q045Q664R207R934J0535J0508R719Q208N891L034M86
56792d7800j085j887k412k571k059j161m59L5P78J895L107M349N792P329Q598
$$ plain form
56890 -568811 -562029 -555440 -548873 -542472 -536355 -530172 -523367 -515827 -507870 -499681 -491220 -482664 -474385 -466384
56876 -466384 -458176 -449342 -439904 -430103 -420132 -410209 -400556 -391248 -382371 -374384 -367951 -363329 -360140 -357798
56862 -357798 -355941 -354410 -353111 -351994 -350976 -349808 -348160 -345836 -342813 -339163 -335098 -330973 -326961 -322867
56848 -322867 -318499 -314129 -310269 -307067 -304205 -301332 -298327 -295208 -292069 -289059 -286135 -282911 -279082 -274909
56834 -274909 -270934 -267226 -263257 -258555 -253165 -247426 -241565 -235553 -229182 -222283 -215048 -208062 -201860 -196585
56820 -196585 -192199 -188797 -186330 -184256 -181898 -179080 -176105 -173188 -170268 -167257 -164053 -160366 -155926 -150827
56806 -150827 -145281 -139132 -132031 -123986 -115322 -106115 -96181 -85646 -75138 -65419 -57211 -51320 -48286 -47800
56792 -47800 -48885 -50772 -53184 -55755 -57814 -58975 -59434 -59399 -58621 -56726 -53619 -49270 -43478 -36149 -27551
56777b7551R560g440D253J2783J3607J4039J3674J1960Q825M833O66l215o386
56764G5039q346q832q107o831n655m885m316l524k385j232l66L58J317K676M340
56749B9251O070P506Q297Q442Q204P505N777K736j003m418o921q410q918q633
56735D5485q037p474o785n746m614l766l100k272j320m94L63J582K963L910M297
56720A4992M528M692M215K674M80j551k981l937m692n317n664A857c285m618m165
56705a2068l737l310k979k662k055j129m23l98p86r51p61o21p32q53p52n10l12
56688c5039k31k91m43n13l76j52m0n0r8k09l94m70k95kK41M77O95O44K36r4O1
56667c6343M32N22M18N98J043J219R13N04K85J36q6k41k05m0K05N51Q70R80R97
$$ plain form
56777 -27551 -17991 -7440 4253 17036 30643 44682 58356 70316 79141 83974 84640 81425 75039
56764 75039 66693 57861 49754 42923 37268 32383 28067 24543 22158 20926 20560 20918 22235 24911 29251
56749 29251 35321 42827 51124 59566 67770 75275 81052 83788 82785 78367 71446 63036 54118 45485
56735 45485 37448 29974 23189 17443 12829 9063 5963 3691 2371 1877 2240 3822 6785 10695 14992
56720 14992 19520 24212 28427 31101 31581 30030 27049 23112 18420 13103 7439 1857 -3285 -7903 -12068
56705 -12068 -15805 -19115 -22094 -24756 -26811 -27940 -28363 -28761 -29547 -30498 -31259 -31880 -32612 -33465 -34217 -34727 -35039
56688 -35039 -35270 -35561 -36004 -36517 -36893 -37045 -37085 -37135 -37233 -37442 -37836 -38306 -38601 -38603 -38362 -37885 -37190 -36546 -36310 -36404 -36343
56667 -36343 -35911 -35389 -34971 -34373 -33330 -32111 -31198 -30694 -30409 -30273 -30359 -30600 -30805 -30845 -30640 -30089 -29219 -28239 -27242
56648b7242J173J380J235P82N63Q51J231J164O32L3l09k82N3M53O04M30J47n6
56630a7158j92l41m88n59n08l28j05L7J42M46R72J332J190P94O20O77N48J30j62
56611a2953K5N16Q31O83J92k23k00J39K56r5m67l52N7K02J0p8J24L46M07M43N45
56590i592O03O06O61O96N19K26J44L37N19M86K72p3m75o20k50L81P29O72N72O54
56570b933Q01R11b37F42M75L5m8J65L30M81Q71J260J149O80N12P25O99K58M1M12
56550H687Q46Q67P87R87J187R92N94L18M0l81n77k22L10M26J69k1k0P3L41Q08
56530A6211J054P37K61K95Q38J308J428J364J160O42n0m51l84j29O8K59M80N92
56512B5683N41N01O26Q87J178J381J354J100R32J179J778K351K668K809K855K731
$$ plain form
56648 -27242 -26069 -24689 -23454 -22672 -22109 -21258 -20027 -18863 -18231 -18198 -18507 -18789 -18736 -18283 -17679 -17249 -17102 -17158
56630 -17158 -17350 -17691 -18179 -18738 -19246 -19574 -19679 -19642 -19500 -19054 -18082 -16750 -15560 -14766 -14146 -13469 -12921 -12791 -12953
56611 -12953 -12928 -12412 -11581 -10898 -10706 -10929 -11129 -10990 -10734 -10829 -11296 -11648 -11591 -11389 -11379 -11457 -11333 -10987 -10580 -10137 -9592
56590 -9592 -8989 -8383 -7722 -7026 -6507 -6281 -6137 -5800 -5281 -4795 -4523 -4596 -5071 -5691 -5941 -5560 -4831 -4159 -3587 -2933
56570 -2933 -2132 -1221 -237 642 1117 1152 1104 1269 1599 2080 2951 4211 5360 6040 6552 7277 7976 8234 8275 8687
56550 8687 9533 10400 11187 12174 13361 14353 14947 15265 15305 14924 14347 14125 14435 14861 15030 15009 14989 15062 15403 16211
56530 16211 17265 18002 18263 18558 19396 20704 22132 23496 24656 25298 25248 24797 24413 24284 24352 24611 25091 25683
56512 25683 26224 26725 27351 28238 29416 30797 32151 33251 34183 35362 37140 39491 42159 44968 47823 50554
56496E0554K369J849J313Q55N40M13M71O75R29J061R05M97N7k42l89m10l28l01
56478F0818n12q25q54n26k84m66q01q03m87k73l45m64m09k81k49k70j74L7J67
56459E2999M2k59m56m05k50j90j88j26q4j83k60m1L19L39j01n52o21m31k72j85
56439D9095j17j68m05o92r16j126j281j161p82n61p60j079j090q35o38n81n37
56422C6366n16o14o90m86m1L32M41L97L79M16L95K06r8k88j96K2P2l9oK62M79
56401C6793M08J99J35L06O13Q77Q50M31n0j05K75O04O27N74N93M74K10K19O79
56382D4712J136J159R26P63N52J13k46j67J32J76m5j97k01k08j73L4K56K86K29
56363D9237L05L74J76j62k95j36J62N47R50J079Q18N17M97M83J31k03P0P44R87
$$ plain form
56496 50554 52923 54772 56085 56940 57480 57893 58364 59039 59968 61029 61934 62431 62488 62246 61857 61447 61119 60818
56478 60818 60306 59481 58627 58101 57817 57351 56550 55747 55260 54987 54642 54178 53769 53488 53239 52969 52795 52832 52999
56459 52999 53041 52782 52326 51921 51671 51481 51293 51167 51083 50900 50640 50599 50918 51257 51156 50604 49983 49552 49280 49095
56439 49095 48978 48810 48405 47713 46797 45671 44390 43229 42447 41886 41126 40047 38957 38122 37484 36903 36366
56422 36366 35850 35236 34546 34060 34019 34351 34792 35189 35568 35984 36379 36585 36487 36199 36003 36025 36097 36058 36052 36314 36793
56401 36793 37201 37400 37535 37841 38454 39331 40181 40612 40562 40457 40732 41336 41963 42537 43130 43604 43814 44033 44712
56382 44712 45848 47007 47933 48696 49248 49361 49115 48948 49080 49256 49211 49014 48813 48605 48432 48466 48722 49008 49237
56363 49237 49542 49916 50092 49930 49635 49499 49661 50208 51158 52237 53055 53572 54069 54552 54683 54480 54550 55294 56281
56344E6281N40j7j79j04o2l2M1%j86k93k27j97l16m25m33m84o25o53m77l04k73
56323E1575j87J72O51Q93P82N12L07K16J97K86N73R82J219J095Q47Q62J114J188
56305F3284R30O68O32N58K20r8nL44M89L24J18Q5K35N59R43J106R59Q27R55J032
56285G4165O60J06QM93J017J143R84Q01O24M10K90M41Q42J234J342J150R72J111
56267H7793J438J547J335J091R88R44J021J382J746J532Q46N88J135J686J484
56252A06556R56R04J195J217J081J366J988K314K262K318K563K580K316K172K226
56237A34014K145J904J895K207K552K862L325L807L953L859M006M442M716M632
56223A80319M447M306M128M108M554N291N800O030O368O854P175P437Q120R177
$$ plain form
56344 56281 56821 56804 56625 56521 56459 56427 56468 56468 56282 55989 55762 55565 55249 54824 54391 53907 53282 52629 52152 51848 51575
56323 51575 51388 51560 52211 53104 53886 54398 54705 54921 55118 55404 55977 56959 58178 59273 60120 60982 62096 63284
56305 63284 64214 64882 65514 66072 66292 66194 66189 66533 67022 67346 67464 67549 67784 68343 69286 70392 71351 72178 73133 74165
56285 74165 74825 74931 74939 75432 76449 77592 78576 79377 80001 80411 80701 81142 81984 83218 84560 85710 86682 87793
56267 87793 89231 90778 92113 93204 94192 95136 96157 97539 99285 100817 101663 102251 103386 105072 106556
56252 106556 107512 108416 109611 110828 111909 113275 115263 117577 119839 122157 124720 127300 129616 131788 134014
56237 134014 136159 138063 139958 142165 144717 147579 150904 154711 158664 162523 166529 170971 175687 180319
56223 180319 184766 189072 193200 197308 201862 207153 212953 218983 225351 232205 239380 246817 254937 264114
56209B64114R984J0373J0876J1765J2638J3249J4007J5267J6778J8200J9624K1265
56197D38140K3066K4914K6849K8911L1118L3677L6757M0008M2793M4942M6819
56186H17994M8652N0286N1528N2203N1932N0431M7935M4748M0601L5068K8429
56175A319807K1266J3559N086l451j0940j7399k3771l0110l5319l8919m1757m4459
56163A113593m6422m7032m6771m6356m5701m4482m2956m1451l9712l7432l4909
56152F40369l2582l0450k8437k6747k5401k3982k2261k0487j8739j6720j4585
56141C79978j3114j2581j2210j1314j0230r524q996q185p154o217n358m588m228
56128B66279m305m238l716l230l188l148k579j783j332j150p98k66J91N42P86
$$ plain form
56209 264114 274098 284471 295347 307112 319750 332999 347006 362273 379051 397251 416875 438140
56197 438140 461206 486120 512969 541880 572998 606675 643432 683440 726233 771175 817994
56186 817994 866646 916932 968460 1020663 1072595 1123026 1170961 1215709 1256310 1291378 1319807
56175 1319807 1341073 1354632 1359718 1356267 1345327 1327928 1304157 1274047 1238728 1199809 1158052 1113593
56163 1113593 1067171 1020139 973368 927012 881311 836829 793873 752422 712710 675278 640369
56152 640369 607787 577337 548900 522153 496752 472770 450509 430022 411283 394563 379978
56141 379978 366864 354283 342073 330759 320529 311005 302009 293824 286670 280453 275095 270507 266279
56128 266279 261974 257736 254020 250790 247602 244454 241875 240092 238760 237610 236812 236546 236737 237279 238065
56113B38065P26M08L36P42J200J364J527J935K274K367K675L432M040M019L914
56098B69024M473N475O204O556O900P292P608Q111R115J0393J1559J2699J4069
56085C79478J5513J6827J8278K0201K2420K4549K6527K8318K9516K9769K9161
56074F40557K7770K5375K2118J8897J6505J4854J3470J2195J0851Q879O007K785
56062H20263l2k223l862m980o003p790j0694j4167j7683k1270k4664k6959k7725
56049F52211k7607k7105k5744k3207k0344j8068j6148j4021j1949j0354q887p161
56037D41616n699m994m397l086j447l74J66P48J281J359J329J831K658L175L369
56022D37535L647L970M166M492N072N359N072M925N502O191O274O243O851P638
$$ plain form
56113 238065 238791 239199 239535 240277 241477 242841 244368 246303 248577 250944 253619 257051 261091 265110 269024
56098 269024 273497 278972 285176 291732 298632 305924 313532 321643 330758 341151 352710 365409 379478
56085 379478 394991 411818 430096 450297 472717 497266 523793 552111 581627 611396 640557
56074 640557 668327 693702 715820 734717 751222 766076 779546 791741 802592 811471 817478 820263
56062 820263 820231 818008 814146 809166 803163 795373 784679 770512 752829 731559 706895 679936 652211
56049 652211 624604 597499 571755 548548 528204 510136 493988 479967 468018 457664 448777 441616
56037 441616 435917 430923 426526 423440 421993 421619 421785 422533 423814 425173 426502 428333 430991 434166 437535
56022 437535 441182 445152 449318 453810 458882 464241 469313 474238 479740 485931 492205 498448 505299 512937
56008E12937P741P473P737Q491Q988R089R124Q993Q584Q389Q706Q873Q436Q191
55994F31752Q886R781R889R708J0224J1052J1171J0778J0821J1284J1539J1768
55982G58653J2484J3288J3621J4035J5259J6702J7463J7954J8968J9975K0157
55971I38559K0222K1315K2965K4017K4771K6219K7997K9143L0153L2081L4393
55960A231835L5885L7031L9101M1657M3269M4137M5637M7892N0057N2404N5737
55949A724642N9377O2190O4854O8639P2769P5714P8265Q2448Q8066R3340R8294
55938B568598J04341J11063J16652J21219J26502J32689J38678J45024J53306
55929C718072J63021J72394J81824J93145K06149K19321K33265K49616K67381
$$ plain form
56008 512937 520678 528151 535888 544379 553367 562456 571580 580573 589157 597546 606252 615125 623561 631752
55994 631752 640638 650419 660308 670016 680240 691292 702463 713241 724062 735346 746885 758653
55982 758653 771137 784425 798046 812081 827340 844042 861505 879459 898427 918402 938559
55971 938559 958781 980096 1003061 1027078 1051849 1078068 1106065 1135208 1165361 1197442 1231835
55960 1231835 1267720 1304751 1343852 1385509 1428778 1472915 1518552 1566444 1616501 1668905 1724642
55949 1724642 1784019 1846209 1911063 1979702 2052471 2128185 2206450 2288898 2376964 2470304 2568598
55938 2568598 2672939 2784002 2900654 3021873 3148375 3281064 3419742 3564766 3718072
55929 3718072 3881093 4053487 4235311 4428456 4634605 4853926 5087191 5336807 5604188
55920E604188K84406L01626L21674L44310L67768L93582M25040M61948N02257
55911I006799N47744O02243O65243P33781Q09891Q99483J004754J125070J264457
55902A6659465J429836J621818J835428K069682K328244K612310K922858L267938
55894C4747579L656788M090564M572988N123889N760565O468637P210756P937385
55886G9569151Q513233Q610290P773022N729171K688880p00015l728506n979986
55878A02475240p388375q077698q214764p962155p466546o839554o155035n467494
55870D4903619m819427m232170l707799l245252k845719k503875k207266j947390
55862A9394721j722676j529857j361351j212450j083054r71001q70684p79475
$$ plain form
55920 5604188 5888594 6190220 6511894 6856204 7223972 7617554 8042594 8504542 9006799
55911 9006799 9554543 10156786 10822029 11555810 12365701 13265184 14269938 15395008 16659465
55902 16659465 18089301 19711119 21546547 23616229 25944473 28556783 31479641 34747579
55894 34747579 38404367 42494931 47067919 52191808 57952373 64421010 71631766 79569151
55886 79569151 88082384 96692674 104465696 110194867 112883747 112183732 108455226 102475240
55878 102475240 95086865 87009167 78794403 70832248 63365702 56526148 50371113 44903619
55870 44903619 40084192 35852022 32144223 28898971 26053252 23549377 21342111 19394721
55862 19394721 17672045 16142188 14780837 13568387 12485333 11514332 10643648 9864173
55854I864173o99092o29643n68187n13909m68853m32459m00635l71207l45445
55845E434743l23428l02569k81696k62211k44393k26526k08507j92428j78840
55836C214145j66008j53506j42971j34700j26944j19173j12723j07590j01840
55827B048690r4908q8407q3046p7675p1959o7146o3498n9754n5736n2831n1285
55816A282445m9691m7700m6589m6532m5826m3649m1135l9077l6877l4440l2757
55805H18172l1860l0387k7945k5805k4607k3446k1869k0704k0196j9371j7967
55794E54015j7051j6984j6606j5277j3912j3233j2703j1951j1571j1777j1779
55783D01171j1239j0803j0657j0066q858p863p307o494n508n539o783p721p349
$$ plain form
55854 9864173 9165081 8535438 7967251 7453342 6984489 6552030 6151395 5780188 5434743
55845 5434743 5111315 4808746 4527050 4264839 4020446 3793920 3585413 3392985 3214145
55836 3214145 3048137 2894631 2751660 2616960 2490016 2370843 2258120 2150530 2048690
55827 2048690 1953782 1865375 1782329 1704654 1632695 1565549 1502051 1442297 1386561 1333730 1282445
55816 1282445 1232754 1185054 1138465 1091933 1046107 1002458 961323 922246 885369 850929 818172
55805 818172 786312 755925 727980 702175 677568 654122 632253 611549 591353 571982 554015
55794 554015 536964 519980 503374 488097 474185 460952 448249 436298 424727 412950 401171
55783 401171 389932 379129 368472 358406 349548 341685 334378 327884 322376 316837 310054 302333 294984
55770B94984o501o130n850n117m400m170l911l163k424k196k124j855j781k179
55756B43183k639k875l176l495l164k097j182r44q22l93j41m06n73r6O98J350
55740B23228J986K650K882K485J911J344L35j205k561l252l587l778l486k750
55726B16202k315k501k665k361k095k371k888l225l446l534l092k145j356r58
55712A81250l55P17J593J740J448R73j0j500k727l235l500l884l959l499l132
55697A61920l266l333k857k378k442k628k417k179k370k538k125j557j563j959
55683A28308k095j970j964j907j363n56j55l44p88j268j695j834j590j358j513
55668A07908j800j759j420j105q88p18p09q80r39p40n55n38l77R0M35K90m0o5
$$ plain form
55770 294984 288483 282353 276503 271386 266986 262816 258905 255742 253318 251122 248998 247143 245362 243183
55756 243183 240544 237669 234493 230998 227834 225737 224555 223611 222789 222396 222255 221849 221276 221180 221878 223228
55740 223228 225214 227864 230746 233231 235142 236486 236821 235616 233055 229803 226216 222438 218952 216202
55726 216202 213887 211386 208721 206360 204265 201894 199006 195781 192335 188801 185709 183564 182208 181250
55712 181250 180895 181612 183205 184945 186393 187366 187356 185856 183129 179894 176394 172510 168551 165052 161920
55697 161920 158654 155321 152464 150086 147644 145016 142599 140420 138050 135512 133387 131830 130267 128308
55683 128308 126213 124243 122279 120372 119009 118453 118298 117954 117166 115898 114203 112369 110779 109421 107908
55668 107908 106108 104349 102929 101824 100936 100218 99509 98629 97690 96950 96395 95857 95480 95570 96005 96295 96255 96190
55650I6190K00N00Q17J112J032M25k96o96q73j060j139j013r66j214j507j603
55634H9909j683j875j903j612j367j433j432r70k76K09M77P15Q75R18J049J310
55618H2911J416J339J459J796J739R87J30k55l92o84r22q29p01q11p41q9P10R92
55600H8055Q61P87P56N52M35P10J009Q03K87L8J0k50p31j018j048j077j106r79
55582H8094q76j076j443j733k078k579k800k390j818j743j978j855j414j250j403
55567F1658j287p17j79j0m9j62m50q28r66p76n11l26k02j98l61m82l63k24l67
55548E3200o31o16l35j58k30m26o61q07o00q3J61k43p65o73j52K9l24p13q34p73
55528D4366n19QM61L90L5RK95L32P6J29O97J171J075P00N31O23P79R00R54R49
$$ plain form
55650 96190 96390 96890 97707 98819 99851 100276 99980 99284 98411 97351 96212 95199 94233 93019 91512 89909
55634 89909 88226 86351 84448 82836 81469 80036 78604 77634 77358 77567 78044 78759 79634 80552 81601 82911
55618 82911 84327 85666 87125 88921 90660 91647 91777 91522 91130 90446 89524 88695 87994 87183 86442 86353 87063 88055
55600 88055 88916 89703 90459 91011 91446 92156 93165 93968 94255 94293 94303 94053 93322 92304 91256 90179 89073 88094
55582 88094 87218 86142 84699 82966 80888 78309 75509 73119 71301 69558 67580 65725 64311 63061 61658
55567 61658 60371 59654 59475 59465 59416 59254 58804 57976 57010 56234 55723 55397 55195 54997 54636 54154 53791 53567 53200
55548 53200 52569 51953 51618 51460 51230 50804 50143 49336 48736 48653 48814 48571 47806 47133 46981 47010 46686 45973 45139 44366
55528 44366 43847 43855 44316 44706 44741 44750 45045 45377 45453 45582 46279 47450 48525 49225 49756 50379 51158 52058 53012 53961
55508E3961J044J313J429J047M26J53K93L69J75n5k66p12j348j696j534j168q81
55491E2550o18l71l33n28p16p87q08o58j68L48L08k39n71k69K89O29P25O46K82
55472D9711k61m99k01K52M13K69m2n49j170j506j300q07m63m33o58j019j278j186
55454C9273q81p93r76r44m20K18M57L16R4j20l54m42j84K63N37M92K58m6l80o67
55434C5701p65n74j31L41N29L24l9k62l70n64p83p39l76J7J61Nl88q24r24m73
55414B9866J88N25N22O04Q36Q02L23k10m43m72m95m95m99o55q01m95K32P20N58
55395C0611J90J99M55N13M31N94R52J050P51L75J76M5j84m72o92p72o68l90n9
55376C3105K08M22O13O99O04M17K72J65Qk06m31o40p65o81m02j47o8n0Q1K48K45
$$ plain form
55508 53961 55005 56318 57747 58794 59220 59373 59666 60035 60210 60155 59889 59177 57829 56133 54599 53431 52550
55491 52550 51932 51561 51228 50700 49984 49197 48389 47731 47563 47911 48219 47980 47409 47140 47429 48058 48783 49429 49711
55472 49711 49450 48951 48750 49002 49415 49684 49642 49093 47923 46417 45117 44310 43847 43414 42756 41737 40459 39273
55454 39273 38392 37599 36623 35679 35259 35477 35934 36250 36344 36224 35870 35428 35244 35507 36044 36536 36794 36748 36368 35701
55434 35701 34936 34362 34231 34572 35101 35425 35386 35124 34754 34190 33407 32668 32292 32309 32470 32475 32087 31263 30339 29866
55414 29866 30054 30579 31101 31705 32541 33343 33666 33456 33013 32541 32046 31551 31052 30397 29596 29101 29333 30053 30611
55395 30611 30801 31000 31455 31968 32399 32993 33945 34995 35746 36121 36297 36342 36158 35686 34994 34222 33554 33164 33105
55376 33105 33313 33735 34348 35047 35651 36068 36340 36505 36513 36307 35876 35236 34471 33790 33388 33241 33173 33123 33204 33452 33697
55355C3697J02Q4L50P34R08P00K16k69n25n17l55j76j03k20m78o60n67k30J31
55336C2822L04J70k59p81j071r88o94l74MM17N92L58L9M0K24J02l72p24o75m72
55316B8662m05m41m25l11j04J59K42k6l45k00L62P06N03J99L15P08Q87P21M45
55297C1652K17k3k98m97m89k68l3q9m55o88l97J14J95j92m21j99M3k4o7K41N14
55276B8836K53l07n28k98m0M9K12N63Q31P42L58o7l21l38k42k63m76o75o59m78
55256B7152k33J18N62P79M88j11n45o34n98o33o73n88m04k56k38l00k35J48P12
55237B4511J051R11M99J83Q1O7P3J52L06M57N40N21M01K59J73O7j69l91k60K52
55217B9684O98O80K99j04l60m37k81MO4k46n50m05N7L20J86p3j88j34O0L87O84
$$ plain form
55355 33697 33799 33883 34233 34967 35875 36575 36791 36522 35997 35480 35125 34949 34846 34626 34148 33488 32921 32691 32822
55336 32822 33126 33296 33037 32256 31185 30197 29503 29129 29133 29550 30142 30500 30539 30579 30803 30905 30533 29809 29134 28662
55316 28662 28257 27816 27391 27080 26976 27135 27377 27351 27006 26806 27168 27874 28377 28576 28891 29599 30486 31207 31652
55297 31652 31869 31846 31548 31051 30562 30294 30261 30172 29717 29029 28632 28746 28941 28749 28328 28129 28172 28148 28081 28322 28836
55276 28836 29089 28782 28254 27956 27916 27965 28177 28740 29571 30313 30671 30604 30283 29945 29703 29440 28964 28289 27630 27152
55256 27152 26919 27037 27599 28378 28866 28755 28210 27576 26978 26345 25672 25084 24680 24424 24186 23886 23651 23799 24511
55237 24511 25562 26473 26972 27155 27236 27303 27376 27528 27834 28291 28831 29352 29753 30012 30185 30252 30083 29692 29432 29684
55217 29684 30382 31062 31361 31257 30897 30460 30179 30183 30247 30001 29451 29046 29103 29423 29609 29536 29348 29214 29274 29661 30345
55196C0345P21M93K34Q7KkK03N87Q43O98K57j23k12j33j91n33r64j157j004o74
55176B9477l27RK83L71K65J45N9j47m64n24q0M93N75Q0m48n22j87K15M50M59K87
55155C0469Q7M9K00L24K27p6l86n53n57m71l80l38l28k74j03J41L09L17K84M10
55135B9351O34O42K98r7j76K3K16L45N32O60M16j63n93n41k22m0j01k58l85m40
55115C0101m16l54k53L4N75J036R47L58j33j54R5L06N08P44Q02N54K48J26O6r1
55095C5099k09j80k29m95o77m57r0Nj01j9K46L39K11J55K17Q2l60p24o61k93R
55074C1868Q4L4j7p3j70k42j35J53L28J24k59l47q3O0j76m30l24p1n9j77o4K61
55052C0285M77N09M87L36r0n11m66j4K78J92J77O37J298J534J094L21k64m24l12
$$ plain form
55196 30345 31066 31559 31793 31880 31882 31880 32083 32670 33513 34211 34468 34345 34133 34000 33809 33276 32312 31155 30151 29477
55176 29477 29150 29159 29442 29813 30078 30223 30282 30135 29671 29147 29067 29560 30135 30215 29767 29245 29058 29273 29723 30182 30469
55155 30469 30556 30605 30805 31129 31356 31280 30894 30341 29784 29313 28933 28595 28267 27993 27890 28031 28340 28657 28941 29351
55135 29351 29985 30627 30925 30828 30652 30675 30891 31236 31768 32428 32844 32681 32088 31547 31325 31285 31184 30926 30541 30101
55115 30101 29685 29331 29078 29112 29687 30723 31670 32028 31895 31741 31836 32142 32650 33394 34196 34750 34998 35124 35190 35099
55095 35099 34890 34710 34481 33986 33309 32852 32762 32767 32666 32647 32893 33232 33443 33598 33815 33897 33537 32813 32152 31859 31868
55074 31868 31952 31986 31969 31896 31726 31484 31349 31502 31830 31954 31695 31348 31265 31325 31149 30719 30395 30324 30265 30088 30024 30285
55052 30285 30762 31271 31758 32094 32004 31493 31027 31013 31291 31483 31660 32297 33595 35129 36223 36544 36280 35856 35544
55033C5544j88o0K61P27R51O90J92j35k04j53j9K00L91M70N43O06M25lk27RK24
55012D0244j30p71r49n23n2P4l2k40n28o48l16K18L95K15K15M85M53j14o26n38
54992C6832j45j8j37j33J5J6j36j52O9K68J97j13m20m87k87mJ79K64L20K79M1
54971C6448k55l79l39k64q2L59Q22Q23K98k70n13n47n76n25l46k22k96m05l48
54952C3383j36J57N02P43O26K02r3j7J64J05r1r6J53M32N54M78K52J3n1R5L01
54931C7676M57N47N22L13N9j3L6j08m52o04l50J5J87K65M53O43O75O67P24O14
54911D2326J27m24n25j81J15Q6m7j1J25J42M7K3J63L62M77M97M55K99p0n41p67
54890D2678n62k00r1k35k87p0K26M08M74M69L95L54M66N98M43k7m32m18L0O87
$$ plain form
55033 35544 35356 35296 35557 36284 37235 37925 38117 37982 37778 37625 37606 37806 38197 38667 39210 39816 40241 40238 40011 40020 40244
55012 40244 40114 39343 38394 37871 37819 37893 37861 37621 37093 36445 36129 36347 36742 36957 37172 37657 38110 37996 37370 36832
54992 36832 36687 36669 36532 36399 36414 36430 36294 36142 36211 36479 36676 36563 36143 35656 35369 35365 35544 35808 36128 36407 36448
54971 36448 36193 35814 35475 35211 35129 35488 36310 37133 37431 37161 36648 36101 35525 35000 34654 34432 34136 33731 33383
54952 33383 33247 33404 33906 34649 35275 35477 35384 35367 35531 35636 35545 35449 35602 36034 36588 37066 37318 37331 37280 37375 37676
54931 37676 38133 38680 39202 39515 39574 39561 39597 39489 39037 38433 38083 38098 38285 38550 39003 39646 40321 40988 41712 42326
54911 42326 42453 42029 41504 41323 41438 41524 41477 41466 41591 41733 41780 41803 41966 42328 42805 43302 43757 44056 43986 43445 42678
54890 42678 42116 41916 41825 41590 41303 41233 41459 41867 42341 42810 43205 43559 44025 44623 45066 45039 44607 44189 44219 44906
54870D4906J254J430J153P70O84Q43R63J120J624K323K639K439K185K101J774
54855F8208R72J43k45l60n75q79j177j632k220k438k008j425j240j188p40r1J15
54838E3220j50l38k59k45l80l31mK32J44o1j24l4K09O07R44R67Q04Q61J236J616
54818E8914J806J906J969J927J889K022K076J560M94m75r39j171j509j803j811
54803F6855j722j847k086k134j989j882j857j726j458j186r23n17M1M82N18J16
54787D8685m90r90j204j118q04l48R5K96J71lJ34N17O78L65q7k21m8O6m7k13l40
54766D5094n93j061j473j460j002m03O5L12L07N8j94q1L92P45O07K67K70O07P28
54747D3185L91OkK26L54L64L90K78j65o82p66l28K29N97Q04Q79O66K03r8O6M60
$$ plain form
54870 44906 46160 47590 48743 49513 50197 51040 52003 53123 54747 57070 59709 62148 64333 66434 68208
54855 68208 69180 69323 69078 68718 68143 67264 66087 64455 62235 59797 57789 56364 55124 53936 53196 53105 53220
54838 53220 53070 52732 52473 52228 51848 51517 51513 51745 51889 51828 51704 51670 51879 52486 53430 54397 55201 56062 57298 58914
54818 58914 60720 62626 64595 66522 68411 70433 72509 74069 74563 74088 73149 71978 70469 68666 66855
54803 66855 65133 63286 61200 59066 57077 55195 53338 51612 50154 48968 48045 47528 47569 48051 48569 48685
54787 48685 48195 47205 46001 44883 44079 43731 43826 44122 44293 44290 44424 44941 45619 45984 45897 45676 45628 45694 45647 45434 45094
54766 45094 44501 43440 41967 40507 39505 39102 39167 39479 39786 39844 39650 39569 39961 40706 41313 41580 41850 42457 43185
54747 43185 43576 43582 43580 43806 44160 44524 44914 45192 45027 44345 43579 43251 43480 44077 44881 45760 46426 46629 46531 46597 47057
54726D7057N92K97j34l77l39q1L14P26J018J125J111J050R44Q36Q89J189J516
54709E7733J541J329J377J948K599K654K085J476J209J076Q11N43M22K11m17j279
54693G5318j858j911j704j600j715j921k021j869j488j073p97o37n28n18o70q72
54677E4136q84n60P5Q48J484J727J541J107O08J45j29LM91J013J352J622J928
54660F6507K075J868J451J096Q05L73k63r67j552j831j729j511j615k048k256
54645F0403j896j371j242j407j399j206j180j302j158o83l04k22j70K5J01j27
54629D6862l69l22j32j16k61l11k29k43m82p61p52l69J08K71Pl58m40j85K14O03
54609D2735Q63Q21M64P7p8j25l32n96n65k10J47L29M51N58M91K40M7L9M6q8k73
$$ plain form
54726 47057 47649 47946 47812 47435 47096 47015 47329 48055 49073 50198 51309 52359 53303 54139 55028 56217 57733
54709 57733 59274 60603 61980 63928 66527 69181 71266 72742 73951 75027 75838 76381 76803 77014 76597 75318
54693 75318 73460 71549 69845 68245 66530 64609 62588 60719 59231 58158 57361 56724 56196 55678 55008 54136
54677 54136 53252 52692 52767 53615 55099 56826 58367 59474 60082 60227 60098 60101 60592 61605 62957 64579 66507
54660 66507 68582 70450 71901 72997 73802 74175 73912 72945 71393 69562 67833 66322 64707 62659 60403
54645 60403 58507 57136 55894 54487 53088 51882 50702 49400 48242 47559 47255 47033 46863 46888 46989 46862
54629 46862 46493 46171 46039 45923 45662 45351 45122 44879 44397 43636 42884 42515 42623 42894 42901 42543 42103 41918 42132 42735
54609 42735 43598 44419 44883 44960 44882 44757 44425 43829 43264 43054 43201 43530 43981 44539 45030 45270 45317 45356 45402 45314 45041
54588D5041l62l47k79j38J06M47Q39J064P94N2n83n61j21O9j34k55r1n6m40q73
54568D4172q68m50L9M09N92N07K33P3J13O6k59n58m90j86rK4J85N37P99O81J83
54547D5793l99o58m07N0J76j67n36n21k28PJ01J32K9k52m61l17Q6M14N76P22Q80
54526D5020Q80O57L65J16j20l47m38l01qK61L43J63j68l73k13K40O21N83J10m82
54506D6909p90o69l13j2J22K03L64O21Q42Q29N04R9L7M39R12J053R32Q54P73M49
54486E4158pj91m9L9j04k23j94k40m35m21k9L55L51J82K39L86J85l92q73r00n47
54465E1290j10J84K66K31K13J82J1k29k81j69k63p20j132j060o28k13R6L91N65
54446D8624M56K19J17R7k4j29L5L46M62L53K85L29L12K23K14J95q2m86n32j00
$$ plain form
54588 45041 44679 44332 44053 43915 44021 44468 45307 46371 47165 47217 46634 46073 45952 46021 45887 45632 45541 45485 45045 44172
54568 44172 43304 42854 42893 43302 43894 44401 44634 44707 44820 44886 44627 44069 43579 43393 43384 43408 43593 44130 44929 45610 45793
54547 45793 45394 44736 44329 44379 44555 44388 43852 43331 43103 43110 43211 43343 43372 43120 42659 42342 42428 42842 43418 44140 45020
54526 45020 45900 46557 46922 47038 46918 46571 46133 45832 45824 46085 46428 46591 46423 46050 45837 46077 46698 47281 47391 46909
54506 46909 46119 45450 45137 45125 45247 45450 45814 46435 47277 48106 48610 48709 48746 49185 50097 51150 52082 52936 53709 54158
54486 54158 54151 53960 53911 53950 53846 53623 53429 53189 52754 52333 52304 52659 53010 53192 53431 53817 54002 53610 52737 51837 51290
54465 51290 51180 51364 51630 51861 52074 52256 52267 52038 51757 51588 51325 50605 49473 48413 47785 47572 47668 48059 48624
54446 48624 49080 49299 49416 49513 49489 49360 49395 49741 50203 50556 50841 51170 51482 51705 51919 52114 52032 51546 51014 50914
54426E0914L17K91L7L8L59O76P46O25N02N25P50J086J304J217Q44L74J1j41r9
54407F0376N0K28L95N07N02L82K14Qk60m89m53j46J22O6k27m79n60m94l10j31
54387E9301k05n72q59p30l57j36j05j7P0j10m48m71r2J73l3l69l57q4M0l3NK55
54365E4866M73N09N02N22L96M1k43j05K72K79l23r74r25j87M69M71P8q1J60M52
54345E6652N03L80K49J58J12J76L62N59O36N65M06K63K22K79L09K03M4NJ34L01
54325F2518L36J58j88n27o23l51J58O30Q78Q82O95M12J73Q9J64L30N35P32Q91
54306F7892J045J241J368J200O87J20j49p4R9R2j93o31r54r77q05p07p34o69m57
54287F7394l61n92r59j120r42m94R5N34M65r0o11o98n31m55m05j66J18J52K3K2
$$ plain form
54426 50914 51231 51522 51559 51597 51956 52632 53378 54003 54505 55030 55780 56866 58170 59387 60231 60605 60616 60475 60376
54407 60376 60426 60654 61049 61556 62058 62440 62654 62662 62402 61913 61460 61314 61436 61502 61275 60796 60236 59742 59432 59301
54387 59301 59096 58524 57665 56935 56578 56442 56337 56320 56390 56280 55832 55361 55269 55442 55409 55040 54683 54599 54639 54606 54611 54866
54365 54866 55339 55848 56350 56872 57268 57309 57066 56961 57233 57512 57189 56215 55290 55103 55572 56043 56121 56040 56200 56652
54345 56652 57155 57535 57784 57942 58054 58230 58592 59151 59787 60352 60758 61021 61243 61522 61831 62034 62078 62083 62217 62518
54325 62518 62854 63012 62824 62297 61674 61323 61481 62111 62989 63871 64566 64978 65151 65240 65404 65734 66269 67001 67892
54306 67892 68937 70178 71546 72746 73433 73553 73404 73330 73429 73521 73328 72697 71743 70766 69961 69254 68520 67851 67394
54287 67394 67033 66441 65482 64362 63420 62926 63021 63555 64020 63930 63319 62621 62090 61635 61230 61064 61182 61334 61357 61379
54267F1379R4l4l06m31m00l86k67J88O36M27l72q94o16l1J85P7Q2K36K33L1j06
54246E9725o6m7j98m19n12l90j33J10K59L60M29L55P5k02k52j81k60m30l23J46
54226E8046N61N54K45rp4o3q1j01l8J63L48K53j11l01J1M37L59j27l03Q2M52L27
54204F0630J8K3K74M02L77M11N18N93O57P08N52J71o8Q9L08J20l64o51n95m72
54184F3701m33l58j95q0m1M7J98K97L29L86M25K96J8j99k21j21m7j01l16n88p07
54163F2290o05m46l56k15Q8L63L63J51m0j65k97l52k23j20l13o55o96l32P9K12
54143E8731R6j47m52o29l93K20P64Q75O53L77J45n4j49o7P7J35J48K91O07R10
54123F2138R33N69M1j89J42P08Q68L93k40m36j47J67J35j98n68q09r19r15p86
$$ plain form
54267 61379 61473 61439 61133 60702 60302 59916 59649 59837 60473 60900 60528 59634 59018 58987 59172 59249 59331 59567 59800 59831 59725
54246 59725 59659 59612 59414 58995 58483 58093 57960 58070 58329 58689 59118 59473 59548 59346 59094 58913 58653 58223 57900 58046
54226 58046 58607 59161 59406 59397 59323 59260 59179 59078 59040 59203 59551 59804 59693 59392 59403 59840 60199 60072 59769 59851 60303 60630
54204 60630 60648 60671 60945 61347 61724 62135 62653 63246 63903 64611 65163 65334 65266 65355 65663 65783 65419 64768 64173 63701
54184 63701 63268 62910 62715 62635 62594 62641 62839 63136 63465 63851 64276 64572 64590 64391 64170 64049 64002 63901 63585 62997 62290
54163 62290 61685 61239 60883 60668 60756 61119 61482 61633 61593 61428 61131 60779 60556 60436 60123 59468 58772 58440 58519 58731
54143 58731 58827 58680 58228 57599 57206 57426 58190 59065 59718 60095 60240 60186 60037 59970 60047 60182 60330 60621 61228 62138
54123 62138 63071 63640 63681 63492 63634 64342 65210 65603 65363 64927 64780 64947 65082 64884 64316 63507 62588 61673 60887
54104F0887n48k82n2K18O25J063J199Q65K97j30l70o40r11q49l40J82K12j85m67
54085F0774l06N5J89M4qL35R02J193R54M61J87K29K87J58PM9J70J16o9r0J63M26
54063F6226M41K96K37L19L96M35N59P94J004J081J109J182J248J246J280J441
54047G9294J523J150K50p57j340j337j024p94q17r65j014r21q16p66o19k77M8
54030G0818M3k53m57l46r9Q0K78O14Q88Q19M91K93L73M61K68p5k08oK88M34M88
54009G5192O45Q58Q60N74L12L54N22M36R3j42q7L4K3J4J80M62P31R84J182J152
53989H4379R16Q41J154J562J656J529J590J854J937J696J495J690K223K852L443
53974A10817L873L898L429K753K306K223K319K385K366K286K107J784J390J089
$$ plain form
54104 60887 60339 60057 60005 60223 60848 61911 63110 63975 64272 64142 63772 63132 62221 61372 61032 61214 61426 61241 60774
54085 60774 60468 60523 60712 60756 60748 61083 61985 63178 64132 64593 64780 65009 65296 65454 65461 65510 65680 65796 65727 65637 65800 66226
54063 66226 66667 66963 67200 67519 67915 68350 68909 69703 70707 71788 72897 74079 75327 76573 77853 79294
54047 79294 80817 81967 82217 81460 80120 78783 77759 76965 76148 75183 74169 73248 72432 71666 71047 70770 70818
54030 70818 70861 70608 70151 69805 69706 69786 70064 70678 71566 72385 72876 73169 73542 74003 74271 74196 73988 73982 74270 74704 75192
54009 75192 75837 76695 77555 78129 78441 78795 79317 79753 79846 79704 79617 79651 79674 79688 79868 80330 81061 82045 83227 84379
53989 84379 85295 86136 87290 88852 90508 92037 93627 95481 97418 99114 100609 102299 104522 107374 110817
53974 110817 114690 118588 122017 124770 127076 129299 131618 134003 136369 138655 140762 142546 143936 145025
53960A45025R55Q29M68j34o96r80j048j119j244j347j411j500j611j696j807k045
53944A30639k331k432k224j845j532j426j512j615j520j205r57j074j447j645
53930A07874j418r50n66l62k43j46o9K9K12M17M71K89N9J38P23J626K390K658
53912A13132K358J618O32l35j044j451j724j940j937j584j071o99n33m54m31n06
53896A04031n70m41j50O6J02J41M16R16J373J471J144P16O57J054J500J650J664
53879A15740J840K102K200K221K417K624K464K060J956K225K280J814J340J402
53865A44685J802K073K290K816L525L863L646L261L084L132L297L515L675L658
53851A88322L545L501L461L215K777K342J912J314O51K98L13K62j46n96p13o99
$$ plain form
53960 145025 145980 146809 147277 147143 146447 145467 144419 143300 142056 140709 139298 137798 136187 134491 132684 130639
53944 130639 128308 125876 123652 121807 120275 118849 117337 115722 114202 112997 112040 110966 109519 107874
53930 107874 106456 105506 104940 104578 104335 104189 104120 104149 104361 104778 105249 105538 105597 105735 106458 108084 110474 113132
53912 113132 115490 117108 117740 117405 116361 114910 113186 111246 109309 107725 106654 105955 105422 104968 104537 104031
53896 104031 103461 103020 102870 102936 103038 103179 103595 104511 105884 107355 108499 109215 109872 110926 112426 114076 115740
53879 115740 117580 119682 121882 124103 126520 129144 131608 133668 135624 137849 140129 141943 143283 144685
53865 144685 146487 148560 150850 153666 157191 161054 164700 167961 171045 174177 177474 180989 184664 188322
53851 188322 191867 195368 198829 202044 204821 207163 209075 210389 211040 211338 211651 211913 211767 211171 210458 209759
53835B09759j079j927k787l318l642l968m237m282m115l904l777l786l896l979
53821A61062l849l496l125k916k823k713k570k478k433k389k352k335k252k049
53807A23282j883j974k255k368k082j565j162j073j224j348j181p46m26n54q95
53792A02546r18n82m50q22j187r46l36q5l24m91k75n1k03n04n38l17j62j93k41
53773I3921j46Q7L52M83L49R6O2L31N40L67L8N8N20R80J029P26M18L71O13R74
53753A02169J210J219J165J267J479J518J298J109J255J701K186K570K884L075
53739A26105K968K555K116J947K015K085K017J860J643J355J110J101J283J307
53725A51467R63M86K34K04J03k03o25j158j884k632l025k981k855k900k875k490
$$ plain form
53835 209759 208680 206753 203966 200648 197006 193038 188801 184519 180404 176500 172723 168937 165041 161062
53821 161062 157213 153717 150592 147676 144853 142140 139570 137092 134659 132270 129918 127583 125331 123282
53807 123282 121399 119425 117170 114802 112720 111155 109993 108920 107696 106348 105167 104421 103995 103441 102546
53792 102546 101628 101046 100596 99774 98587 97641 97305 97220 96896 96405 96130 96079 95876 95372 94834 94517 94355 94162 93921
53773 93921 93775 93862 94214 94697 95046 95142 95204 95535 96075 96442 96480 96538 97058 98038 99067 99793 100211 100582 101195 102169
53753 102169 103379 104598 105763 107030 108509 110027 111325 112434 113689 115390 117576 120146 123030 126105
53739 126105 129073 131628 133744 135691 137706 139791 141808 143668 145311 146666 147776 148877 150160 151467
53725 151467 152430 152916 153150 153354 153457 153254 152629 151471 149587 146955 143930 140949 138094 135194 132319 129829
53709A29829j954j721j812j828j592j404j543j836j898j661j393j325j395j375
53695A07092j137p69m55l01k93m17p07j082j240r28l63j17m46r16r11m01P0J38
53677I6817pl7K2j6p7P2L59M11P2l53m80k47J84O50J005J081Q68N90M50M14M04
53656A02182N17Q28J107J056P38N06N35O97R04J223J581J697J464J121R46R32
53640A18034R80J138J415J567J342R21P87J120J564J623J211O31K00K5O1J96K59
53623A33074O2l66o75n19l0K70J06j71p4L15M18m1o47p60k24N30R13O91J09l46
53603A32635l74q6K10L70M51M76L28k5l83m57j56L58P90R26P78N05K18p1k82k38
53583A35973M1K38J61P7L15P27Q85P35O15O90Q23R96J352J748J753J361J107J269
$$ plain form
53709 129829 127875 126154 124342 122514 120922 119518 117975 116139 114241 112580 111187 109862 108467 107092
53695 107092 105955 105186 104731 104430 104137 103720 103013 101931 100691 99763 99400 99283 98837 97921 97010 96609 96679 96817
53677 96817 96810 96773 96795 96779 96702 96774 97133 97544 97616 97263 96783 96536 96720 97370 98375 99456 100324 100914 101364 101778 102182
53656 102182 102699 103527 104634 105690 106428 106934 107469 108166 109070 110293 111874 113571 115035 116156 117102 118034
53640 118034 119014 120152 121567 123134 124476 125397 126184 127304 128868 130491 131702 132333 132533 132558 132619 132815 133074
53623 133074 133136 132770 132095 131576 131546 131816 131922 131751 131677 131992 132410 132369 131722 130962 130738 131268 132181 132872 132981 132635
53603 132635 132261 132175 132385 132755 133206 133682 134010 133985 133602 133145 132989 133347 134137 135063 135841 136346 136564 136493 136211 135973
53583 135973 136014 136252 136413 136490 136805 137532 138417 139152 139767 140457 141280 142276 143628 145376 147129 148490 149597 150866
53565A50866J406J096O73P29J182J411J165Q12P21Q30R26R82J097J300J490J504
53549A68190J281J044J139J570J908J832J516J256J039P63O22Q12J058R67O92
53534A85689P00R21P83J76k65r5K40P9m96q64p74o00o82q85r48r20j041j317j451
53515A78250j271r39p01n22k47lj04n31q16o62l46k97m58m67k61r9o9J8K46M69
53495A71190O16P71R22R77J022J247J502J353P36J66Q9L89P37J107J610K111K372
53478A88917K428K469K490K375K266K492L133L881M356M412M145L851L894M378
53464B35487M979N317N462N767O263O524O318O044O246O936P669Q153Q505Q896
53450C28566R259R474R627R908J0327J0711J0893J0811J0453R862R214Q753Q611
$$ plain form
53565 150866 152272 153368 154041 154770 155952 157363 158528 159340 160061 160891 161817 162799 163896 165196 166686 168190
53549 168190 169471 170515 171654 173224 175132 176964 178480 179736 180775 181538 182160 182972 184030 184997 185689
53534 185689 186389 187310 188093 188269 188004 187909 188149 188228 187732 186868 186094 185494 184812 183927 182979 182059 181018 179701 178250
53515 178250 176979 176040 175339 174817 174570 174567 174463 173932 173116 172454 172108 171811 171353 170886 170625 170526 170457 170475 170721 171190
53495 171190 171806 172577 173499 174476 175498 176745 178247 179600 180336 180502 180591 180980 181717 182824 184434 186545 188917
53478 188917 191345 193814 196304 198679 200945 203437 206570 210451 214807 219219 223364 227215 231109 235487
53464 235487 240466 245783 251245 257012 263275 269799 276117 282161 288407 295343 303012 311165 319670 328566
53450 328566 337825 347299 356926 366834 377161 387872 398765 409576 420029 429891 439105 447858 456469
53437D56469Q698Q851Q978R086R177R174Q980Q603Q225Q090Q223Q337Q127P648
53423E76666P237P100P137P177P183P144O968O561N942N138M167L218K596K320
53409F56554J964J136o2j254k285l217l967m374m610n077n833o409o391n936n597
53394F04642n736o281o898p301p458p569p771p932p840p564p389p406p335o888
53380E03274o091n178m309l509k748k027j419r89o71k33M43J139J576J837K262
53365D83357K883L376L598L855M452N314O206P077P939Q705R349J0012J0695J1123
53351E77941J1226J1463J2242J3239J3768J3768J3904J4663J5796J6788J7484
53340G32282J8026J8468J8834J9299K0054K1029K1906K2433K2560K2423K2265
$$ plain form
53437 456469 465167 474018 482996 492082 501259 510433 519413 528016 536241 544331 552554 560891 569018 576666
53423 576666 583903 591003 598140 605317 612500 619644 626612 633173 639115 644253 648420 651638 654234 656554
53409 656554 658518 659654 659592 658338 656053 652836 648869 644495 639885 634808 628975 622566 616175 610239 604642
53394 604642 598906 592625 585727 578426 570968 563399 555628 547696 539856 532292 524903 517497 510162 503274
53380 503274 497183 492005 487696 484187 481439 479412 477993 477004 476333 476100 476543 477682 479258 481095 483357
53365 483357 486240 489616 493214 497069 501521 506835 513041 520118 528057 536762 546111 556123 566818 577941
53351 577941 589167 600630 612872 626111 639879 653647 667551 682214 698010 714798 732282
53340 732282 750308 768776 787610 806909 826963 847992 869898 892331 914891 937314 959579
53329I59579K2308K2523K2626K2361K1761K1009K0193J9335J8529J7819J6987
53318A185030J5724J4054J2355J0890R499P916O193M594L166J634l10k756n564
53305A262425q416j0894j2745j4175j5656j7409j9141k0430k1174k1563k1727
53294A079095k1659k1388k1044k0742k0494k0268k0015j9639j9070j8374j7739
53283H58663j7328j7154j7105j6997j6705j6256j5773j5277j4629j3720j2611
53272F85108j1469j0428r594r012q519p817o891o167o009o166o103n745n561n810
53258E79817o128o028n497m873m356l858l284k646j981j278n15L13J146J814K160
53243E44806K242K345K706L286L927M597N333O048O565O905P300P892Q499Q833
$$ plain form
53329 959579 981887 1004410 1027036 1049397 1071158 1092167 1112360 1131695 1150224 1168043 1185030
53318 1185030 1200754 1214808 1227163 1238053 1247552 1255468 1261661 1266255 1269421 1271055 1270745 1267989 1262425
53305 1262425 1254009 1243115 1230370 1216195 1200539 1183130 1163989 1143559 1122385 1100822 1079095
53294 1079095 1057436 1036048 1015004 994262 973768 953500 933485 913846 894776 876402 858663
53283 858663 841335 824181 807076 790079 773374 757118 741345 726068 711439 697719 685108
53272 685108 673639 663211 653617 644605 636086 628269 621378 615211 609202 603036 596933 591188 585627 579817
53258 579817 573689 567661 562164 557291 552935 549077 545793 543147 541166 539888 539373 539686 540832 542646 544806
53243 544806 547048 549393 552099 555385 559312 563909 569242 575290 581855 588760 596060 603952 612451 621284
53229F21284Q885Q914R075R167Q962Q582Q284P987P289O118M968M284L869L212
53215G20880K202J099Pj221k556l696m535n301o168p043p852q707r638j0421j0884
53200F46166j1134j1319j1445j1568j1894j2414j2755j2646j2341j2261j2383
53189E14006j2260j1645j0769j0081r878j0142j0572j0806j0724j0524j0425j0378
53177C85802j0208r822r258q580p892p292o770o271n915n877n978n742n071m493
53163B86633m496m868n118n184n282n308m987m514m482n049n659n778n476n102
53149B15330m785m512m376m428m460m199l693l231l000k919k862k832k903l071
53135A64059l223l275l282l345l392l185k640k028j722j781j958k044j999j843
$$ plain form
53229 621284 630169 639083 648158 657325 666287 674869 683153 691140 698429 704547 709515 713799 717668 720880
53215 720880 723082 724181 724188 722967 720411 716715 712180 706879 700711 693668 685816 677109 667471 657050 646166
53200 646166 635032 623713 612268 600700 588806 576392 563637 550991 538650 526389 514006
53189 514006 501746 490101 479332 469251 459373 449231 438659 427853 417129 406605 396180 385802
53177 385802 375594 365772 356514 347934 340042 332750 325980 319709 313794 307917 301939 296197 291126 286633
53163 286633 282137 277269 272151 266967 261685 256377 251390 246876 242394 237345 231686 225908 220432 215330
53149 215330 210545 206033 201657 197229 192769 188570 184877 181646 178646 175727 172865 170033 167130 164059
53135 164059 160836 157561 154279 150934 147542 144357 141717 139689 137967 136186 134228 132184 130185 128342
53121A28342j595j354j224j210j263j402j587j594j246p42n25p27j039j125r52
53106A10757o44l15j31k85p20j075j072p43k15M47J035J136N87j97o11n24k65
53089A07165j05n9j21l17n15m50r8K57L82L23J87n6m01o34n86l83k29p6K25N52
53069A05061O07M08L32N94R34R79P21M15K49K48L88N84O45N23M35N83Q11Q27O59
53050A16003N40M44J11l93n99k88J19O4m71j068j422j511j406j189r79p92m79
53033A06684PL44J66m16q66q47n47l80m89p18q64r03r15r03p41l49J20M15M51
53014I9249L24P7k95o33o47k96J43M59P21R21P90K16m39p54p67p66p50n09p6K55
52994I7223L01J29j29k91j47K76O04N82M42M71M55Q4l57l20Q5J85k18n84n34l30
$$ plain form
53121 128342 126747 125393 124169 122959 121696 120294 118707 117113 115867 115125 114600 113873 112834 111709 110757
53106 110757 110113 109798 109667 109382 108662 107587 106515 105772 105557 106004 107039 108175 108762 108565 107954 107430 107165
53089 107165 107060 107001 106880 106563 106048 105598 105500 105757 106139 106462 106649 106593 106192 105558 104972 104589 104360 104284 104509 105061
53069 105061 105668 106076 106408 107002 107936 108915 109636 110051 110300 110548 110936 111520 112165 112688 113123 113706 114517 115344 116003
53050 116003 116543 116987 117098 116705 116106 115818 115937 116001 115530 114462 113040 111529 110123 108934 107955 107163 106684
53033 106684 106691 107035 107201 106785 105919 105072 104525 104145 103656 102938 102074 101171 100256 99353 98612 98263 98383 98798 99249
53014 99249 99573 99650 99355 98722 98075 97779 97922 98381 99102 100023 100813 101029 100590 99836 99069 98303 97553 97044 96968 97223
52994 97223 97524 97653 97524 97233 97086 97362 97966 98548 98990 99461 99916 100000 99643 99323 99408 99593 99375 98791 98257 97927
52974I7927k23LM60P32M73Pj71j36k67n29m89j4N66Q48O64R8m75n81j40L41L61
52953I9455M6j18j6M8n4p4J94N80P66O03K02j30r6K76N58L82n6k34LK85K82J18
52931A03020J42M39P83Q75N76J8m44m79r9L40M99M00L41M99P34P40M46J29J32
52912A09091M44P27P46O00M46K16j65m73l47K15P72Q99N81J02k96n47o97q23r78
52893A10513j122j134r44o45m41m28m92m49k80j28r6j23j33j86l39n09n88n93
52875A01883n31k25L84R12Q46K33l11m00k64k50l04k61k24l16k84J29O52P40L65
52856A02774O7J90M52M36J45j10j83j96k86l84l28j07N6m6k72k59O6L00Q3l53
52836A02045m50m8M52O07L84M5j64j22J60N36Q23Q98O93K02l90p04n48k09j58
$$ plain form
52974 97927 97704 97707 98167 98899 99372 99379 99208 99072 98805 98276 97787 97773 98339 99187 99851 99949 99474 98893 98753 99094 99455
52953 99455 99501 99383 99367 99415 99361 99287 99481 100061 100827 101430 101632 101502 101406 101682 102240 102622 102566 102332 102335 102620 102902 103020
52931 103020 103162 103601 104384 105259 105835 105853 105409 104930 104831 105171 105670 106070 106411 106910 107644 108384 108830 108959 109091
52912 109091 109535 110262 111008 111608 112054 112270 112105 111632 111285 111500 112272 113171 113752 113854 113558 113011 112314 111491 110513
52893 110513 109391 108257 107313 106668 106227 105799 105307 104858 104578 104450 104354 104231 104098 103912 103573 103064 102476 101883
52875 101883 101352 101127 101511 102423 103269 103502 103191 102791 102527 102277 101973 101712 101488 101172 100888 101017 101669 102409 102774
52856 102774 102841 103031 103483 103919 104064 103954 103771 103575 103289 102905 102577 102470 102526 102480 102208 101949 102015 102315 102398 102045
52836 102045 101595 101547 101999 102606 102990 103035 102871 102749 102909 103445 104268 105166 105859 106061 105671 104967 104419 104210 104052
52817A04052m31n91k90L36R01J141J019O90L97K94L09L17L75N92P98O84K61j01
52799A10753k08k97n81r07j036j032j116j263j256j020o92m47m26p19j222j594
52783I6937j568j257r27n86p6M91P08M23L1J1L17M89K64j28l25k56j17n7l6P5
52763I4413L28O40P97O35K49k3J6J60R5q9j6L59N98M43K65N26J038J191P45J6
52743A02386o69j230j587j556j198q63p31n99k78O2J60K4j65l00l31k19p3j24
52725I2709l59m21j03L00L97K50J98L48N34O82P95O86J89m06n28q7L65L57Q7N
52705I5998J44J67n3k34o1M00Q00Q89P39N67M34K03j36k98n4L96O28N62N05O35
52685A02231P30N93L84L46M28M72N09O16O34L75jj70r9k8L3K97O85P42K77k78
$$ plain form
52817 104052 103621 103030 102740 103076 103977 105118 106137 106827 107224 107518 107827 108144 108519 109111 109909 110593 110854 110753
52799 110753 110545 110248 109667 108760 107724 106692 105576 104313 103057 102037 101345 100898 100472 99753 98531 96937
52783 96937 95369 94112 93185 92599 92523 93014 93722 94145 94176 94187 94504 94993 95257 95129 94804 94548 94431 94374 94338 94413
52763 94413 94741 95381 96178 96813 97062 97039 97055 97215 97310 97221 97205 97564 98162 98605 98870 99396 100434 101625 102370 102386
52743 102386 101717 100487 98900 97344 96146 95283 94552 93953 93675 93737 93897 93921 93756 93456 93125 92906 92833 92709
52725 92709 92350 91929 91826 92126 92523 92773 92971 93319 93853 94535 95330 96016 96205 95799 95271 95184 95549 95906 95993 95998
52705 95998 96142 96309 96256 96022 95961 96361 97161 98050 98789 99356 99790 99993 99857 99559 99505 99901 100529 101091 101596 102231
52685 102231 102961 103554 103938 104284 104712 105184 105693 106309 106943 107318 107317 107147 107048 107020 107053 107350 108035 108777 109054 108776
52665A08776m43l10k86m47n29m52l92l86k73p8m6k16k66j7K36J68q5j54k0L3r0
52644A04723j67n5J31K75L97M23J43m19q54p91l52P5L12M15L67J08j90k34l9N9
52624A04327o9j26Q6K70L2m95p89n86j17K55L46J27l18p15p71m88j11K69P60J250
52604A03137J308P32n2m19k39J46M67P49J022J179J168J088R85P87M48O9k09l24
52586A12042k93k02j87k97m34n00n20m97k99P6L26J88q5m5K44K77m3j68K89R13
52566A10785J032N69j0l77n90q08j045j177j012m40L04P32O31L27J59Pl43o59
52548A08085n37q7J24j39n23o68o14n04k97M6L10K49p5l14j57L99R49R88M66l2
52528A07669O6N88Q39N78K48K55L92K99J3k18l32l84k51J28M72M33J38J6J48J66
$$ plain form
52665 108776 108333 108023 107737 107290 106761 106309 105917 105531 105258 105180 105134 104918 104652 104635 104871 105039 104954 104800 104780 104813 104723
52644 104723 104556 104501 104632 104907 105304 105727 105870 105451 104597 103806 103454 103529 103841 104256 104623 104731 104541 104307 104268 104327
52624 104327 104258 104132 104218 104488 104520 104025 103236 102650 102533 102788 103134 103261 102943 102228 101457 100969 100858 101127 101887 103137
52604 103137 104445 105177 105125 104706 104467 104613 105080 105829 106851 108030 109198 110286 111271 112058 112506 112575 112366 112042
52586 112042 111749 111547 111360 111063 110629 110129 109609 109112 108813 108889 109215 109403 109318 109273 109517 109794 109751 109583 109872 110785
52566 110785 111817 112386 112376 111999 111409 110601 109556 108379 107367 106927 107231 107963 108594 108921 109080 109087 108744 108085
52548 108085 107548 107461 107585 107446 106923 106255 105641 105137 104840 104886 105196 105445 105370 105056 104899 105298 106247 107235 107701 107669
52528 107669 107735 108323 109162 109740 109988 110243 110635 110934 110947 110729 110397 110013 109762 109890 110362 110795 110933 110949 111097 111263
52508A11263j35m31l00J92N43L79k09q15j088r58o24l61l06l84l97k06J27L43
52490A06633K27j71n19m97r3L55M71J59l12n67m54r7L21P18J019J080Q33M56K13
52471A09775J58J34J0j88l74m60l58n8K30K44m3l71m59k23K23O47Q40P68O20N80
52451A11695O32P26R13J174J217Q52L89K87M51L30k40p80q79p12n97n30m13l80
52433A14135n07n29k53K7r2n01p80q04p26n29q8M12N76M19L73O08P62N36J59N0
52413A13248K41M08L56K11K18M81Q83J161J121Q11N03M25N60O84N91L39J73K17
52395A22631K23j63q62j356j302r07n52l02r4r2m20p54o59k35J4m9j00oo1l36
52375A14618m39j33K18K31J22K60M19J10n37p80k67M90Q23O94N22N08N13M53M81
$$ plain form
52508 111263 111128 110697 110397 110589 111132 111511 111302 110487 109399 108441 107817 107456 107150 106766 106369 106163 106290 106633
52490 106633 106860 106689 106170 105673 105580 105935 106406 106565 106253 105686 105232 105135 105456 106174 107193 108273 109106 109562 109775
52471 109775 109933 110067 110077 109889 109515 109055 108697 108639 108869 109113 109070 108699 108240 108017 108240 108887 109727 110495 111115 111695
52451 111695 112327 113053 113966 115140 116357 117209 117598 117885 118336 118666 118426 117646 116767 116055 115458 114928 114515 114135
52433 114135 113628 113099 112846 112873 112781 112280 111500 110696 109970 109441 109353 109765 110341 110760 111133 111741 112503 113039 113198 113248
52413 113248 113489 113897 114253 114464 114682 115163 116046 117207 118328 119139 119642 120067 120627 121311 121902 122241 122414 122631
52395 122631 122854 122691 121829 120473 119171 118264 117712 117410 117316 117224 116804 116050 115391 115156 115170 115121 115021 115015 114954 114618
52375 114618 114179 114046 114264 114495 114617 114877 115296 115406 114869 114089 113822 114312 115135 115829 116351 116859 117372 117825 118306
52356A18306O85Q67P93N44M61P49J228J600J801K001K257K371K180J818J524J297
52340A40482R13K83l70p94r95j151j328j448j444j336j120p68l92k20k99l52j24
52323A29537K55M46L67K33J74J10K6Q0L56P10J011J272J449J416J276J410J947
52306A42075K433K347J748J095O29L30K35M26O91P10N40N04O30O52N59O67J033
52289A57304J244J013N94L59L55M70P19J048J221J178J254J705K272K544K518
52274A75798K502K631K860L249L859M457M714M656M618M774N033N342N725O079
52260B36297O268O449O926P588P872P457O746O422O699P214P481P309O863O495
52246C34086O467O741P009P005O739O391O105N895N684N410N093M784M406L779
$$ plain form
52356 118306 118991 119858 120651 121195 121656 122405 123633 125233 127034 129035 131292 133663 135843 137661 139185 140482
52340 140482 141395 141678 141308 140514 139519 138368 137040 135592 134148 132812 131692 130924 130532 130312 130013 129661 129537
52323 129537 129792 130238 130605 130838 131012 131122 131148 131228 131584 132294 133305 134577 136026 137442 138718 140128 142075
52306 142075 144508 146855 148603 149698 150327 150657 150892 151318 152009 152719 153259 153763 154393 155045 155604 156271 157304
52289 157304 158548 159561 160155 160514 160869 161339 162058 163106 164327 165505 166759 168464 170736 173280 175798
52274 175798 178300 180931 183791 187040 190899 195356 200070 204726 209344 214118 219151 224493 230218 236297
52260 236297 242565 249014 255940 263528 271400 278857 285603 292025 298724 305938 313419 320728 327591 334086
52246 334086 340553 347294 354303 361308 368047 374438 380543 386438 392122 397532 402625 407409 411815 415594
52232D15594K881K023J519J263Q45J09o85j280j687j976k061j880j620j453j263
52217D10329q00j18M38O47O52P81J225J925K658L186L419L477L588L844M099M114
52201D43464L835L548L663M298N103N573N583N469N573N834N871N415M552L641
52187E11422K986K588K132J355L74l97p71r87j373j933k467k879l211l440l528
52172D99871l611l898m350m664m642m377l996l452k730k045j679j634j662j564
52158D55567j358j133q96o26l20NL26N84P01P19P98J026J239J185Q82P13J050
52141D60462J796K414K424J840J116P12P49J028J333J627J976K268K218J708J038
52126D84709O37N57M72J84j69n31j170k204l113l222k588j973j901k141k254k199
$$ plain form
52232 415594 418475 420498 422017 423280 424125 424234 423549 422269 420582 418606 416545 414665 413045 411592 410329
52217 410329 409529 409411 409849 410496 411148 411929 413154 415079 417737 420923 424342 427819 431407 435251 439350 443464
52201 443464 447299 450847 454510 458808 463911 469484 475067 480536 486109 491943 497814 503229 507781 511422
52187 511422 514408 516996 519128 520483 520857 520460 519689 518702 517329 515396 512929 510050 506839 503399 499871
52172 499871 496260 492362 488012 483348 478706 474329 470333 466881 464151 462106 460427 458793 457131 455567
52158 455567 454209 453076 452180 451554 451234 451239 451565 452149 452850 453569 454367 455393 456632 457817 458699 459412 460462
52141 460462 462258 464672 467096 468936 470052 470764 471513 472541 473874 475501 477477 479745 481963 483671 484709
52126 484709 485346 485903 486375 486559 486390 485859 484689 482485 479372 476150 473562 471589 469688 467547 465293 463094
52110D63094k138j991j595j069o79m46k00M8J64K20M39P63Q48N51J78R3L22O25
52092D59227P88P27M72J88P4J70L78O27Q66R18O47K71K15N35Q05P76P42J000J301
52073D70727J254J040J219J961K899L757M602N439O010O244O471O976P605Q069
52059E34273Q380Q691Q952R022Q993R059R149R017Q670Q383Q239P948P290O440
52045F52506N687N056M389L728L271L024K746K292J779J303P57%r03j812k741
52030F81082l740m631n182n452n715o004o021n600n022m627m374l989l371k682
52016F14672k120j813j752j675j152p3J080J769K065K461L086L585L757L836M039
52001F31765M185M060L799L664L693L785L931M089M005L490K704J996J480J006
$$ plain form
52110 463094 460956 458965 457370 456301 455622 455176 454976 455024 455188 455408 455847 456610 457458 458009 458187 458280 458602 459227
52092 459227 460015 460742 461214 461402 461476 461646 462024 462651 463517 464435 465082 465353 465568 466103 466908 467684 468426 469426 470727
52073 470727 471981 473021 474240 476201 479100 482857 487459 492898 498908 505152 511623 518599 526204 534273
52059 534273 542653 551344 560296 569318 578311 587370 596519 605536 614206 622589 630828 638776 646066 652506
52045 652506 658193 663249 667638 671366 674637 677661 680407 682699 684478 685781 686538 686538 685635 683823 681082
52030 681082 677342 672711 667529 662077 656362 650358 644337 638737 633715 629088 624714 620725 617354 614672
52016 614672 612552 610739 608987 607312 606160 606087 607167 608936 611001 613462 616548 620133 623890 627726 631765
52001 631765 635950 640010 643809 647473 651166 654951 658882 662971 666976 670466 673170 675166 676646 677652
51987F77652L83n38j819l243m319m775m940n345o009o489o565o568o853p295p478
51972F05799p202o642o073n663n459n460n648n908o033n889n596n399n316n101
51958E24410m708m505m799n336n605n507n370n341n229m979m869n079n444n805
51944D51834o325p119p912q344q436q418q287p852p144o436n921n637n638n949
51930C52416o319o374o093n849n859n881n624n248n162n441n748n828n766n699
51916B71525n496m961m222l651l356l032k416j674j130p50k03N84J254J533J588
51901B45593J704J816J666J250Q56O64N54L66J45Q1L10P82J255J486J511J705
51885B61744K370L364M339N243O235P174P623P493P231P098O626N209K999P63
$$ plain form
51987 677652 678035 677497 675678 672435 668116 663341 658401 653056 647047 640558 633993 627425 620572 613277 605799
51972 605799 598597 591955 585882 580219 574760 569300 563652 557744 551711 545822 540226 534827 529511 524410
51958 524410 519702 515197 510398 505062 499457 493950 488580 483239 478010 473031 468162 463083 457639 451834
51944 451834 445509 438390 430478 422134 413698 405280 396993 389141 381997 375561 369640 364003 358365 352416
51930 352416 346097 339723 333630 327781 321922 316041 310417 305169 300007 294566 288818 282990 277224 271525
51916 271525 266029 261068 256846 253195 249839 246807 244391 242717 241587 240837 240634 241218 242472 244005 245593
51901 245593 247297 249113 250779 252029 252885 253549 254103 254469 254614 254695 255005 255787 257042 258528 260039 261744
51885 261744 264114 267478 271817 277060 283295 290469 298092 305585 312816 319914 326540 331749 334748 335511
51871C35511j059k645m162n376o047o391o773p238p579p737p805p771p530p140
51857B50258o775o419n849n001m122l447k936k441k013j801j731j535j105o39
51843B04444l48j85NK13K70J28p6k19l90p52j373k169k964l495l462k796j825
51826A85006j036n94k53K13P00R40Q98P87P71Q33R33J129J447J768J899J748J379
51809A98568R24M93J25j55k65j48M8k2n06j078j221q19k28J89M09M98L64n2n14
51790A96610p46q13j002j386j714j810j770j769j815j817j734j580j394j270j283
51775A74707j329j182p85l28kK10L76M30K92Q3MO5J01Rj54l36n60p87q57o51k40
51754A69066J83M74O11O22N68N04M50L68K00k9j88j67j7Q1M1m2k8R5K77N09P33
$$ plain form
51871 335511 334452 331807 327645 322269 316222 309831 303058 295820 288241 280504 272699 264928 257398 250258
51857 250258 243483 237064 231215 226214 222092 218645 215709 213268 211255 209454 207723 206188 205083 204444
51843 204444 204096 203911 203916 204129 204399 204527 204451 204232 203842 203090 201717 199548 196584 193089 189627 186831 185006
51826 185006 183970 183376 183123 183336 184036 184976 185874 186661 187432 188265 189198 190327 191774 193542 195441 197189 198568
51809 198568 199492 199985 200110 199955 199690 199542 199590 199568 199062 197984 196763 195944 195716 195905 196314 196812 197176 197124 196610
51790 196610 195864 195051 194049 192663 190949 189139 187369 185600 183785 181968 180234 178654 177260 175990 174707
51775 174707 173378 172196 171411 171083 171081 171291 171667 172097 172389 172472 172476 172541 172642 172651 172497 172161 171601 170814 169957 169306 169066
51754 169066 169249 169723 170334 170956 171524 172028 172478 172846 173046 173017 172829 172662 172645 172726 172767 172725 172697 172792 173069 173578 174311
51733A74311P12K20n82j175j216q55m45j30J49L57L78K18J4j38k28j98PK76M02
51714A72077L66L81O59J229J962K592K782K403J754J309J196J174J074R48P58
51699A92664K88m41j052j346j603k063k420k269j806j569j620j548j265j174j408
51684A71368j440q46J6M88M75M45O82J029J276J450J629J757J736J547J210Q32
51668A83654O44Q34J233J422J205Q49O74O57N37K24j46m62p50r87j044q68o03
51651A87073m59n11p38j107j511j690j436q71l48o3J30L80N46M01K7k49l08l39
51633A78927n01o53o15m69m37n80p89j044j384j664j534q86q8L34K64P2J74N87
51615A69714J005J190J172J117J109J109J079J074J196J484J834K094K209K255
$$ plain form
51733 174311 175023 175243 174661 173486 172270 171415 170970 170840 170989 171346 171724 171942 171956 171818 171590 171392 171399 171675 172077
51714 172077 172443 172824 173483 174712 176674 179266 182048 184451 186205 187514 188710 189884 190958 191906 192664
51699 192664 192952 192511 191459 190113 188510 186447 184027 181758 179952 178383 176763 175215 173950 172776 171368
51684 171368 169928 169082 169098 169586 170061 170506 171188 172217 173493 174943 176572 178329 180065 181612 182822 183654
51668 183654 184298 185132 186365 187787 188992 189841 190515 191172 191709 191933 191787 191325 190575 189588 188544 187676 187073
51651 187073 186614 186103 185365 184258 182747 181057 179621 178750 178402 178339 178469 178849 179395 179796 179823 179574 179266 178927
51633 178927 178426 177773 177158 176689 176252 175672 174883 173839 172455 170791 169257 168371 168283 168617 168881 168953 169127 169714
51615 169714 170719 171909 173081 174198 175307 176416 177495 178569 179765 181249 183083 185177 187386 189641
51601A89641K254K011J304K52o90j195j374j481j498j219o71j10L45P59J028Q06
51585A90162L2p99j101q67n85o19q83j108j187j220j358j667k068k392k559k629
51569A69152k626k403j842j140o98o85q47q16n00j33Kj62m39o23p02p99r07q86
51551A52946o85m71l54k21K6K69L91N51R19J296J343J165J260J805K415K723K869
51534A68247L140L405L279K683J932J275O67L8m52n88m16k41k60k96K3P92J662
51517A84890K210K421K621K988L344L478L478L591L876M165M274M142L811L403
51503B32692L115L135L528M208N006N802O556P282P890Q165P963P354O453N230
51489C14379L626J841K58r61j969k910l712m332m920n576o138o424o529o666o850
$$ plain form
51601 189641 191895 193906 195210 195462 194772 193577 192203 190722 189224 188005 187334 187224 187569 188328 189356 190162
51585 190162 190194 189395 188294 187427 186842 186223 185340 184232 183045 181825 180467 178800 176732 174340 171781 169152
51569 169152 166526 164123 162281 161141 160443 159758 158911 158095 157595 157462 157464 157302 156863 156240 155538 154739 153832 152946
51551 152946 152261 151790 151436 151215 151241 151510 151901 152452 153371 154667 156010 157175 158435 160240 162655 165378 168247
51534 168247 171387 174792 178071 180754 182686 183961 184628 184666 184214 183626 183210 182969 182709 182413 182436 183228 184890
51517 184890 187100 189521 192142 195130 198474 201952 205430 209021 212897 217062 221336 225478 229289 232692
51503 232692 235807 238942 242470 246678 251684 257486 264042 271324 279214 287379 295342 302696 309149 314379
51489 314379 318005 319846 320104 319143 317174 314264 310552 306220 301300 295724 289586 283162 276633 269967 263117
51474B63117o913o781o528o227n930n699n514n206m662m027l521l185k932k767
51460A93225k706k607k303j927j768j850j902j772j621j615j666j616j474j338
51446A67060j181r28o01l43k33k28j88L2M70R19J070P84K76r1j08J83N65P56N50
51427A68764L0m46n82m54m02o02r16j190j403j512j333q47m53n98j160j516j339
51410A54041j002r95j212j176q03n33o57r12q85n32j22J83M01N70O50O26N78O38
51392A48858Q89J260J555J661J721J908K148K214K143K259K736L395L959M233
51378A80939L978L023J654N42L2k14o10j003j088j087j533k445l190l246k734
51363A73018k158j890j940k050j943j578j152p31j90L95N97K39j94j55K03L26
$$ plain form
51474 263117 256204 249423 242895 236668 230738 225039 219525 214319 209657 205630 202109 198924 195992 193225
51460 193225 190519 187912 185609 183682 181914 180064 178162 176390 174769 173154 171488 169872 168398 167060
51446 167060 165879 164951 164350 164007 163774 163546 163358 163390 163860 164779 165849 166633 166909 166818 166710 166893 167458 168214 168764
51427 168764 168794 168348 167766 167312 166910 166308 165392 164202 162799 161287 159954 159107 158654 158056 156896 155380 154041
51410 154041 153039 152044 150832 149656 148853 148320 147663 146751 145866 145334 145212 145395 145796 146366 147016 147642 148220 148858
51392 148858 149747 151007 152562 154223 155944 157852 160000 162214 164357 166616 169352 172747 176706 180939
51378 180939 184917 187940 189594 190136 190168 189954 189344 188341 187253 186166 184633 182188 178998 175752 173018
51363 173018 170860 168970 167030 164980 163037 161459 160307 159576 159386 159781 160378 160617 160423 160268 160471 160797
51347A60797J99L27Q50J301J315J089R92J174J661K333K757K511J856J557J878
51332A82597K259K252K169K486L118L676M077M433M735N043N684O752P763Q239
51318B45283Q403Q783R427J0019J0480J0861J0775R655P634N519L787K147K27
51305C43000j827l698n375o969q361r391j0161j0822j1237j1162j0665j0090r631
51292B33611r164q494p661o832o055n221m330l614l270l096k663j891j210j029
51278A69081j213j386j466j650j915j958j649j243j058j141j334j436j277q41
51264A49514l62j69l06n16o30p26q48q28n84l52l44l61j3O75J214J227Q86O34
51246A48111O49P05N27J32k04k32N7M38O08M04n9m19m21j66Pq0k71l30j99P5M82
$$ plain form
51347 160797 160996 161323 162173 163474 164789 165878 166870 168044 169705 172038 174795 177306 179162 180719 182597
51332 182597 184856 187108 189277 191763 194881 198557 202634 207067 211802 216845 222529 229281 237044 245283
51318 245283 253686 262469 271896 281915 292395 303256 314031 323686 331320 336839 340626 342773 343000
51305 343000 341173 337475 332100 325131 316770 307379 297218 286396 275159 263997 253332 243242 233611
51292 233611 224447 215953 208292 201460 195405 190184 185854 182240 178970 175874 173211 171320 170110 169081
51278 169081 167868 166482 165016 163366 161451 159493 157844 156601 155543 154402 153068 151632 150355 149514
51264 149514 149152 148983 148677 148161 147531 146805 145957 145129 144545 144193 143849 143488 143475 144150 145364 146591 147477 148111
51246 148111 148760 149465 149992 150124 149920 149688 149745 150183 150791 151195 151136 150717 150296 150130 150137 150057 149786 149456 149257 149332 149814
51225A49814R39J205J054O28L84O72J382K036K176J732J047N27K50M5j44j59k4
51208A63564o1l97o23k88M27R20R54Q01O13J69o11j328j587j503j424j366j121
51191A57139p32n26o25p48n83j81J58K56K15J81J48nk98n51n82m40l57m48n76
51172A51445n49l53j59j10j96k98l38l23k86j86K7K72L65K85K71N16Q23Q42N91
51153A52639M80P50J146J258J028P55P03Q60J044J102J033R85J080J215J129P35
51137A67942K47q7k52l87n25n99o26p03q31q88p84n61l01l9K44N51Q01Q47O08
51118A64657K26J0R2K56J95r1l48m13l53k60r8J19K05J6k85l87k09J%j61k30q1
51096A62861J32J77k8l37n10m47k53j19o8K9K12K79N8k39j79L41Q74R18M79rk37
$$ plain form
51225 149814 150753 151958 153012 153640 154024 154696 156078 158114 160290 162022 163069 163596 163846 163891 163747 163588 163564
51208 163564 163503 163106 162483 162195 162622 163542 164496 165297 165910 166079 165468 164140 162553 161050 159626 158260 157139
51191 157139 156407 155881 155256 154508 153925 153744 153902 154158 154373 154554 154702 154697 154399 153848 153266 152826 152469 152021 151445
51172 151445 150896 150543 150384 150274 150078 149780 149442 149119 148833 148647 148674 148946 149311 149596 149867 150383 151206 152048 152639
51153 152639 153119 153869 155015 156273 157301 158056 158759 159619 160663 161765 162798 163783 164863 166078 167207 167942
51137 167942 168189 168102 167850 167463 166938 166339 165713 165010 164179 163291 162507 161946 161645 161606 161850 162401 163202 164049 164657
51118 164657 164883 164893 164985 165241 165436 165345 164997 164584 164231 163971 163873 163992 164197 164213 163928 163541 163332 163333 163333 163172 162942 162861
51096 162861 162993 163170 163142 162805 162295 161848 161595 161476 161408 161437 161649 161928 161986 161747 161568 161909 162783 163701 164180 164171 163934
51075A63934k83l53m61m57k84o2J8j04k69k26J31O49J090J314J289R97N17J07
51057A67547M2L11O46Q11P92O84N93O21P75Q68P05M14L62O18P45L96j46k60J98
51038A76722P37R02P27N01K89K2j67rM94R73J096R55Q51Q62P57L69q2k05J38O71
51018A86603J002R98Q21O70N80N21N66Q44J265J508J408J261J532K287L107L662
51002B08635M056M515M935N061M967N001N226N217M621L672K929K613K479K339
50988B66266K352K628K799K286J062k12r52j316j867k700l280l157k499j761j202
50973B58447q96r73j484k151k557k605k565k650k746k622k168j460o48J36Q49
50958B33907J500K039K361K535K821L296L655L584L218K945K859K731K495K332
$$ plain form
51075 163934 163651 163298 162837 162380 162096 162034 162052 161948 161679 161453 161584 162233 163323 164637 165926 166923 167440 167547
51057 167547 167589 167900 168546 169357 170149 170833 171426 172047 172822 173690 174395 174809 175171 175789 176534 176930 176784 176524 176722
51038 176722 177459 178361 179088 179589 179878 179900 179733 179724 180218 181191 182287 183242 184093 184955 185712 186081 185999 185794 185932 186603
51018 186603 187605 188603 189424 190094 190674 191195 191761 192605 193870 195378 196786 198047 199579 201866 204973 208635
51002 208635 212691 217206 222141 227202 232169 237170 242396 247613 252234 255906 258835 261448 263927 266266
50988 266266 268618 271246 274045 276331 277393 277181 276229 274913 273046 270346 267066 263909 261410 259649 258447
50973 258447 257551 256578 255094 252943 250386 247781 245216 242566 239820 237198 235030 233570 232922 233058 233907
50958 233907 235407 237446 239807 242342 245163 248459 252114 255698 258916 261861 264720 267451 269946 272278
50944B72278K237J966J492J178J239J379J219Q54O67P77R79J112J238J469J805
50929B91889K228K769L454M220M940N501N968O571P413Q234Q630Q559Q401Q427
50915C77204Q535Q590Q772R316J0153J1058J2071J3412J5004J6442J7513J8446
50903E26516J9568K0841K1931K2664K3167K3573K3744K3417K2578K1486K0313
50892G69798J8927J7163J5139J3127J1185R182P116N152L429K032J161R34J048
50879H75393R00K00q70k070l349m532n321n782o474p762r332j0701j1843j2945
50865G95512j3954j4820j5893j7432j8957j9668j9520j9264j9410j9683j9615
50854E97296j9090j8203j6983j5578j4315j3309j2318j1192j0149r409q826q180
$$ plain form
50944 272278 274515 276481 277973 279151 280390 281769 282988 283842 284509 285286 286265 287377 288615 290084 291889
50929 291889 294117 296886 300340 304560 309500 315001 320969 327540 334953 343187 351817 360376 368777 377204
50915 377204 385739 394329 403101 412417 422570 433628 445699 459111 474115 490557 508070 526516
50903 526516 546084 566925 588856 611520 634687 658260 682004 705421 727999 749485 769798
50892 769798 788725 805888 821027 834154 845339 854521 861637 866789 870218 872250 873411 874345 875393
50879 875393 876293 876493 875623 873553 870204 865672 860351 854569 848095 840333 831001 820300 808457 795512
50865 795512 781558 766738 750845 733413 714456 694788 675268 656004 636594 616911 597296
50854 597296 578206 560003 543020 527442 513127 499818 487500 476308 466159 456750 447924 439744
50842D39744p564p150o808o259n508m839m379l938l280k398j494q20n09m58m34
50827C83906l04r6J91O97J456K227K682K763K733K910L429M208M997N592O035
50812D23426O540P220P958Q654R396J0240J1035J1667J2318J3211J4218J5065
50800E50948J5815J6830J8219J9729K1280K3203K5692K8362L0725L2887L5357
50789H19047L8237M1033M3325M5224M7008M8671N0023N1038N1740N1874N1027
50778A338247M9048M6152M2574L8348L3456K8055K2452J6951J1746O910K449j490
50766A634898m562o497p430p766p700p127o065m941m297m374n136o624r004j2312
50752A541063j6295k0557k4805k8973l3081l6999m0395m3023m5009m6609m7691
$$ plain form
50842 439744 432180 425030 418222 411963 406455 401616 397237 393299 390019 387621 386127 385307 384798 384340 383906
50827 383906 383602 383506 383697 384394 385850 388077 390759 393522 396255 399165 402594 406802 411799 417391 423426
50812 423426 429966 437186 445144 453798 463194 473434 484469 496136 508454 521665 535883 550948
50800 550948 566763 583593 601812 621541 642821 666024 691716 720078 750803 783690 819047
50789 819047 857284 898317 941642 986866 1033874 1082545 1132568 1183606 1235346 1287220 1338247
50778 1338247 1387295 1433447 1476021 1514369 1547825 1575880 1598332 1615283 1627029 1633939 1636388 1634898
50766 1634898 1630336 1623839 1616409 1608643 1600943 1593816 1587751 1582810 1578513 1574139 1569003 1562379 1553375 1541063
50752 1541063 1524768 1504211 1479406 1450433 1417352 1380353 1339958 1296935 1251926 1205317 1157626
50741A157626m7741m6488m4287m1751l9156l6444l3557l0573k7547k4515k1551
50730G64016j8669j5779j2918j0445q695p540o524n437m502l980l872l985m114
50717F57556m110l958l833l910m145m356m532m846n363n947o484o972p352p492
50703E84256p432p392p458p390o921o108n246m564m029l462k711j778p49L62J653
50688E21031L129M607N979P442R203J1028J2369J3042J3462J4197J5472J7161
50676F48122J8957K0452K1383K2016K2984K4514K6051K6921K7112K7071K6920
50665I12503K6366K5307K4103K3029K1881K0284J8149J5548J2406Q614M446N29
50653A113165k700n301p555r484j0817j1293j0880r744q141o353m624l150k133
$$ plain form
50741 1157626 1109885 1063397 1019110 977359 938203 901759 868202 837629 810082 785567 764016
50730 764016 745347 729568 716650 706205 697510 689970 683446 678009 673507 669527 665655 661670 657556
50717 657556 653446 649488 645655 641745 637600 633244 628712 623866 618503 612556 606072 599100 591748 584256
50703 584256 576824 569432 561974 554584 547663 541555 536309 531745 527716 524254 521543 519765 519016 519378 521031
50688 521031 524160 528767 534746 542188 551391 562419 574788 587830 601292 615489 630961 648122
50676 648122 667079 687531 708914 730930 753914 778428 804479 831400 858512 885583 912503
50665 912503 938869 964176 988279 1011308 1033189 1053473 1071622 1087170 1099576 1108190 1112636 1113165
50653 1113165 1110465 1105164 1097609 1088125 1077308 1066015 1055135 1045391 1037250 1030897 1026273 1023123 1020990
50640A020990j737j886k269k781l804n830q757j1942j4946j7787k0410k2344k3228
50627H83269k3331k3133k2638k1558j9928j8094j6142j3854j1249q730o560m593
50615F93459k619o77J173L051N073P074Q745R893J0515J0753J0816J0830J0748
50602G78834J0518J0256J0049R749R221Q673Q403Q262P867P298P069P339P665
50589H91203P727P760Q008Q276Q422Q811R798J1087J2142J2950J3873J4907J5662
50576A030626J6000J6148J6142J5646J4502J3071J1832J0948J0286R644Q787P524
50564A181156N900M099K090m56l661p004r598j0905j1051j0503r614q537p383
50551A114533o301n369m529l695k884k298k298l224n082p396r632j1790j4308
$$ plain form
50640 1020990 1019253 1017367 1015098 1012317 1008513 1002683 993926 981984 967038 949251 928841 906497 883269
50627 883269 859938 836805 814167 792609 772681 754587 738445 724591 713342 704612 698052 693459
50615 693459 690840 690163 691336 694387 699460 706534 715279 725172 735687 746440 757256 768086 778834
50602 778834 789352 799608 809657 819406 828627 837300 845703 853965 861832 869130 876199 883538 891203
50589 891203 898930 906690 914698 922974 931396 940207 950005 961092 973234 986184 1000057 1014964 1030626
50576 1030626 1046626 1062774 1078916 1094562 1109064 1122135 1133967 1144915 1155201 1164845 1173632 1181156
50564 1181156 1187056 1191155 1193245 1192789 1189128 1182124 1172526 1161621 1150570 1140067 1130453 1121916 1114533
50551 1114533 1108232 1102863 1098334 1094639 1091755 1089457 1087159 1083935 1078853 1071457 1061825 1050035 1035727
50538A035727j7278k0123k2305k3963k5486k6757k7385k7452k7382k7116k6157
50527G64323k4496k2799k1433j9995j8088j5965j4048j2334j0751r548q795p943
50515E78128o468m617k992j643j79J465K916L913M483M776N150O111P705R201
50501F07949R920J0148J0602J1301J1693J1778J2174J3115J4142J4969J5857J6861
50489G60509J7470J7330J6835J6586J6704J6970J7249J7510J7793J8379J9607
50478I52942K1308K2870K4060K5362K7196K9272L1065L2548L4061L5703L7305
50467A273692L8772M0108M1295M2381M3499M4507M4851M4066M2228L9666L6502
$$ plain form
50538 1035727 1018449 998326 976021 952058 926572 899815 872430 844978 817596 790480 764323
50527 764323 739827 717028 695595 675600 657512 641547 627499 615165 604414 594866 586071 578128
50515 578128 571660 567043 564051 562408 562229 563694 566610 570523 575006 579782 584932 591043 598748 607949
50501 607949 617869 628017 638619 649920 661613 673391 685565 698680 712822 727791 743648 760509
50489 760509 777979 795309 812144 828730 845434 862404 879653 897163 914956 933335 952942
50478 952942 974250 997120 1021180 1046542 1073738 1103010 1134075 1166623 1200684 1236387 1273692
50467 1273692 1312464 1352572 1393867 1436248 1479747 1524254 1569105 1613171 1655399 1695065 1731567
$$ [...]
##END NTUPLES=NMR SPECTRUM
##END=
