
##TITLE=UV1146_M6-1005-1000_6279139_5uGItLd4f7
##JCAMPDX= 6.0         $$ Bruker NMR JCAMP-DX V2.0
##DATA TYPE= NMR SPECTRUM
##DATA CLASS= NTUPLES
##ORIGIN= BRUKER
##OWNER= Administrator
$$ 1.72 TOPSPIN		Version 2.1
$$ 2012-06-03 09:58:00.656 -0500  Administrator@TOPSPIN
$$ Compression mode = diff/dup
##.OBSERVE FREQUENCY= 400.13188235
##.OBSERVE NUCLEUS= ^1H
##.ACQUISITION MODE= SIMULTANEOUS (DQD)
##.ACQUISITION SCHEME= undefined
##.AVERAGES= 8
##.DIGITISER RES= 22
##SPECTROMETER/DATA SYSTEM= spect
##.PULSE SEQUENCE= zg30
##.SOLVENT NAME= COFFEE_meoh
##.SHIFT REFERENCE= INTERNAL, COFFEE_meoh, 1, 14.98061
##AUDIT TRAIL= $$ (NUMBER, WHEN, WHO, WHERE, PROCESS, VERSION, WHAT)
$$ ##TITLE= Audit trail, TOPSPIN		Version 2.1
$$ ##JCAMPDX= 5.01
$$ ##ORIGIN= Bruker BioSpin GmbH
$$ ##OWNER= Administrator
$$ $$ C:\Bruker\TOPSPIN/data/COFFEE/nmr/UV1146_M6-1005-1000_6279139_5uGItLd4f7/10/pdata/1/auditp.txt
$$ ##AUDIT TRAIL=  $$ (NUMBER, WHEN, WHO, WHERE, PROCESS, VERSION, WHAT)
(   1,<2012-06-03 09:57:52.546 -0500>,<Administrator>,<TOPSPIN>,<go>,<TOPSPIN 2.1>,
      <created by zg
	started at 2012-06-03 09:56:45.921 -0500,
	POWCHK enabled, PULCHK disabled,
       configuration hash MD5:
       D5 CA 7A 23 FE 6B EE E2 50 67 74 61 24 F7 5E 3B
       data hash MD5: 64K
       A3 59 88 C4 71 0C 38 CF 8E 17 AA 23 F4 68 C8 EC>)
(   2,<2012-06-03 09:57:55.656 -0500>,<Administrator>,<TOPSPIN>,<proc1d>,<TOPSPIN 2.1>,
      <Start of raw data processing
       efp LB = 0 FT_mod = 6 PKNL = 1 PHC0 = 0 PHC1 = 0 SI = 32K 
       data hash MD5: 32K
       83 E4 C9 89 FC 0D B4 FB 94 68 FA 07 47 F9 32 7E>)
(   3,<2012-06-03 09:57:56.203 -0500>,<Administrator>,<TOPSPIN>,<proc1d>,<TOPSPIN 2.1>,
      <pk PHC0 = 212.2943 PHC1 = 0 
       data hash MD5: 32K
       4E 8F 9E CC 82 5B BB 51 75 E2 AC EB 63 1B CF D9>)
(   4,<2012-06-03 09:57:56.375 -0500>,<Administrator>,<TOPSPIN>,<proc1d>,<TOPSPIN 2.1>,
      <abs ABSG = 1 
       data hash MD5: 32K
       90 74 AA BF BF D0 7C 99 51 A4 04 72 B8 BF 4B C0>)
(   5,<2012-06-03 09:57:56.500 -0500>,<Administrator>,<TOPSPIN>,<proc1d>,<TOPSPIN 2.1>,
      <abs ABSG = 2 
       data hash MD5: 32K
       7F 14 FF E0 AB 57 18 2F BD 9A F0 5E 8B BC 31 0A>)
(   6,<2012-06-03 09:57:56.531 -0500>,<Administrator>,<TOPSPIN>,<proc1d>,<TOPSPIN 2.1>,
      <abs ABSG = 3 
       data hash MD5: 32K
       81 96 56 C8 23 B2 8E C4 B8 F7 50 A5 4F 78 4B 37>)
(   7,<2012-06-03 09:57:56.562 -0500>,<Administrator>,<TOPSPIN>,<proc1d>,<TOPSPIN 2.1>,
      <abs ABSG = 4 
       data hash MD5: 32K
       DD 95 C7 5A E8 11 FB F4 62 0D 9A 1B 93 4F 48 5E>)
(   8,<2012-06-03 09:57:56.593 -0500>,<Administrator>,<TOPSPIN>,<proc1d>,<TOPSPIN 2.1>,
      <abs ABSG = 5 
       data hash MD5: 32K
       78 A1 E9 A9 09 3F E5 30 C5 4A 19 3C A8 DC 01 53>)
$$ ##END=
$$ 
$$ $$ hash MD5
$$ $$ C8 F2 EE 32 37 86 2E 15 DD 4C 7C 3A 60 46 7A 08
##$RELAX= 
##$RELAX= 
##$RELAX= 
##$RELAX= 
##$RELAX= 
##$RELAX= 
##$RELAX= 
$$ Bruker specific parameters
$$ --------------------------
$$ [...]
##$TP= (0..7)
150 150 150 150 150 150 150 150
##$TP07= 0
##$TPNAME0= <>
##$TPNAME1= <>
##$TPNAME2= <>
##$TPNAME3= <>
##$TPNAME4= <>
##$TPNAME5= <>
##$TPNAME6= <>
##$TPNAME7= <>
##$TPOAL= (0..7)
0.5 0.5 0.5 0.5 0.5 0.5 0.5 0.5
##$TPOFFS= (0..7)
0 0 0 0 0 0 0 0
##$TUNHIN= 0
##$TUNHOUT= 0
##$TUNXOUT= 0
##$USERA1= <user>
##$USERA2= <user>
##$USERA3= <user>
##$USERA4= <user>
##$USERA5= <user>
##$V9= 5
##$VALIST= <valist>
##$VCLIST= <CCCCCCCCCCCCCCC>
##$VD= 0
##$VDLIST= <DDDDDDDDDDDDDDD>
##$VPLIST= <PPPPPPPPPPPPPPP>
##$VTLIST= <TTTTTTTTTTTTTTT>
##$WBST= 2048
##$WBSW= 25
##$XGAIN= (0..3)
0 0 0 0
##$XL= 0
##$YL= 0
##$YMAX_a= 552378
##$YMIN_a= -666328
##$ZGOPTNS= <>
##$ZL1= 120
##$ZL2= 120
##$ZL3= 120
##$ZL4= 120
##$ABSF1= 14.98061
##$ABSF2= -5.57192
##$ABSG= 5
##$ABSL= 3
##$ALPHA= 0
##$AQORDER= 0
##$ASSFAC= 0
##$ASSFACI= 0
##$ASSFACX= 0
##$ASSWID= 0
##$AUNMP= <proc_prof1d_extract_pilot.lims>
##$AXLEFT= 0
##$AXNAME= <>
##$AXNUC= <1H>
##$AXRIGHT= 0
##$AXTYPE= 0
##$AXUNIT= <>
##$AZFE= 0.1
##$AZFW= 0.1
##$BCFW= 0
##$BC_mod= 0
##$BYTORDP= 0
##$COROFFS= 0
##$CY= 15
##$DATMOD= 1
##$DC= 0
##$DFILT= <>
##$DTYPP= 0
##$F1P= 0
##$F2P= 0
##$FCOR= 0.5
##$FTSIZE= 32768
##$FT_mod= 6
##$GAMMA= 0
##$GB= 0
##$INTBC= 1
##$INTSCL= 1
##$ISEN= 128
##$LB= 0
##$LEV0= 0
##$LPBIN= 0
##$MAXI= 10000
##$MC2= 0
##$MEAN= 0
##$ME_mod= 0
##$MI= 0
##$NCOEF= 0
##$NC_proc= -8
##$NLEV= 6
##$NOISF1= 0
##$NOISF2= 0
##$NSP= 0
##$NTH_PI= 0
##$NZP= 0
##$OFFSET= 14.98061
##$PC= 1
##$PHC0= 212.2943
##$PHC1= 0
##$PH_mod= 1
##$PKNL= yes
##$PPARMOD= 0
##$PPDIAG= 0
##$PPIPTYP= 0
##$PPMPNUM= 2147483647
##$PPRESOL= 1
##$PSCAL= 4
##$PSIGN= 0
##$PYNMP= <proc.py>
##$REVERSE= no
##$SF= 400.13
##$SI= 32768
##$SIGF1= 0
##$SIGF2= 0
##$SINO= 400
##$SIOLD= 32768
##$SPECTYP= <>
##$SREGLST= <1H.CDCl3>
##$SSB= 0
##$STSI= 32768
##$STSR= 0
##$SW_p= 8223.68421052632
##$SYMM= 0
##$S_DEV= 0
##$TDeff= 65536
##$TDoff= 0
##$TI= <>
##$TILT= no
##$TM1= 0
##$TM2= 0
##$TOPLEV= 0
##$USERP1= <user>
##$USERP2= <user>
##$USERP3= <user>
##$USERP4= <user>
##$USERP5= <user>
##$WDW= 1
##$XDIM= 32768
##$YMAX_p= 462351868
##$YMIN_p= -737332
##$CURPLOT= <Network HP LaserJet P1505>
##$CURPRIN= <$Network HP LaserJet P1505>
##$DFORMAT= <normdp>
##$LAYOUT= <+/1D_H.xwp>
##$LFORMAT= <normlp>
##$PFORMAT= <normpl>
##$SURQMSG= 1
$$ End of Bruker specific parameters
$$ ---------------------------------
##NTUPLES= NMR SPECTRUM
##VAR_NAME=  FREQUENCY,     SPECTRUM/REAL,   SPECTRUM/IMAG
##SYMBOL=    X,             R,               I
##VAR_TYPE=  INDEPENDENT,   DEPENDENT,       DEPENDENT
##VAR_FORM=  AFFN,          ASDF,            ASDF
##VAR_DIM=   32768,         32768,           32768
##UNITS=     HZ,            ARBITRARY UNITS, ARBITRARY UNITS
##FACTOR=    0.250966925370066, 1,           1
##FIRST=     8223.43324360095, -180519,      -93449
##LAST=      0,             -195880,         93103
##MIN=       0,             -737332,         0
##MAX=       8223.43324360095, 462351868,    0
$$ Real data points
##PAGE= N=1
##DATA TABLE= (X++(R..R)), XYDATA
$$ [...]
23790 131692 73731 14341 320240 217103 -158774 90432 49259 294086 69685 34294 -334944
23778 7120 -11498 -57239 184636 -82110 -333146 177303 45042 129149 63247 331704 79188
23766 189613 -178739 354767 4170 153448 -160492 93357 -56367 311598 -182992 -308063
23756 -308063 36309 229176 14510 326184 167169 71001 8888 53435 -49405 -172850 174007
23744 185465 91353 -268711 -71187 -93982 -185029 -146703 95821 -93718 139777 80469 166096
23733 166096 -53892 -217285 -25385 -346201 -335737 80346 -207475 -149 -274867 66091 -74477
23721 -274007 93448 30222 -62537 21678 -2228 -105645 28377 91391 -390583 -27054 -139452
23710 -139452 101043 189177 -46436 82827 -163755 -143594 123733 116668 56139 -10093 159128
23698 114662 221475 -247133 92686 -134914 -103444 70070 262562 74122 -205711 -282069
23688 -282069 -101465 -114099 -106065 -357516 -149198 44443 73870 79017 46193 -230580 -118619
23677 -118619 -43459 417817 -114631 -188154 -340549 -129108 -41607 -242441 -207331 20814
23666 -34250 78337 -9400 74711 236702 -68712 50575 -317851 303555 -73746 -163599 -5447
23654 -73799 222699 50833 -140718 -50623 197456 60453 -36692 21300 271354 302533 -157905
23642 79768 106418 -201692 -22639 62388 -158615 -59354 -94800 -155760 -45303 48663 -205462
23630 -26892 68351 156346 65953 -79712 178562 139126 -425114 73911 168655 78609 14252
23618 101869 214694 41690 222393 889 36787 -168330 36639 164869 168925 145232 122658
23607 122658 -105884 -6153 -46076 22661 30975 -291795 -215534 116859 -172548 55358 359620
23596 359620 47680 -95477 67949 123758 -178330 330364 35593 145161 160313 -276340 -27491
23584 -1791 -100908 -85447 120001 5559 133983 142558 -123055 36695 200881 145195 -101861
23572 166266 -265039 -281463 23925 84552 -330595 -313112 182551 -232881 -366215 -126879
23561 -238754 7004 -98668 35358 -36546 -203391 -137680 309747 125483 67919 -150273 -74920
23549 74888 117095 2530 -262635 155962 34144 48056 -180688 -200327 -89405 16872 -55853
23537 -170384 -243175 45466 142593 83442 251927 -192792 -114435 -14812 -30929 72070 117237
23526 117237 -67782 108688 -237812 236874 -60544 199159 -22381 116780 -96808 -198714
23516 -198714 -110042 -261027 -474351 79734 115291 2246 122811 198839 -138323 93276 -197899
23504 125025 207308 -63236 74361 -291031 -228658 -106776 223375 -84831 49764 164560 235891
23493 235891 266157 208148 19522 233128 8152 111270 -377736 -464667 -290602 -69233 286625
23481 219520 -413020 -159725 -248505 228959 45122 -325824 -143112 36221 -126538 138608
23470 -143011 166051 -246597 -1230 200934 1601 -383309 -174443 -134268 58032 6097 -26108
23458 -34627 338235 75957 186360 167672 -89222 40069 -11019 68233 -77171 -191907 -224825
23447 -224825 -127443 -37083 -236065 109237 -235204 -143438 218898 216306 -107175 -60633 134829
23435 -187816 -94177 -53447 -102381 -142367 -144555 102082 -119249 -153584 -26803 -304778 -76889
23423 67392 127573 -15242 -124866 411957 -133942 72686 3585 74616 180340 -59131 -97558
23412 -97558 -47423 -59864 -129350 -67087 -57266 40158 -192130 120824 33051 107671 -112538
23400 -140408 -94690 -438535 120288 268257 -246446 -88034 -164664 -104492 -151359 -64423 84384
23388 -357584 143579 40194 274538 154319 63956 79094 219918 -162826 -48973 292252
23377 128178 -206358 -181691 -101908 -51248 -153986 15588 -115324 62132 -111036 77561 91241
23366 91241 -587951 -236663 -74898 -106897 -16262 -64099 -19603 72864 118941 -169935 -16789
23354 -289543 7509 -125500 -35925 -226774 56033 126215 169598 -184400 -101029 -151386 -253898
23343 -253898 -259618 -345406 297656 -333234 75638 208597 -227080 184015 101147 -203385
23332 -147493 131064 56780 -91609 38524 43631 -76154 159790 -72103 -121714 75608 151950
23321 151950 27992 77528 986 129336 433008 -61665 195008 -91110 -31050 -232637 -76440
23309 -87662 291179 134985 68349 274209 438619 -246246 130695 -12241 -274566 175141
23298 152315 -183850 57486 -331836 399490 -136148 -492059 -65622 113148 87614 -361821
23287 -57404 129933 -53357 -138942 212668 -44655 47431 277799 -361618 -92983 -134740 158260
23275 525141 -140059 112631 127016 -18688 -82293 153479 -53411 -121770 -185532 166627 -102589
23263 -108882 99640 113263 -22675 -327305 191468 109474 -78877 271734 -205487 21292 -131093
23251 -303936 -20574 -252168 -103437 -307481 -432268 162294 -202677 333382 90135 221728
23241 221728 93736 -369627 -23453 261561 99747 30156 252851 -77892 328617 -34997 331730
23229 -205951 -186308 -307426 246535 65934 167816 -152415 -307806 -50799 -12159 46680
23218 -131513 -312784 -126461 -55127 211764 33817 22066 219601 -66658 276584 -279589
23207 -63408 116499 -164287 17070 -316434 -107100 -151470 -144396 116909 84641 2140 -39844
23195 54291 150512 -29718 245286 -202789 -29668 187194 -114517 -54878 254832 50992 168486
23184 168486 275193 -61487 -124617 8905 33968 -105919 -288843 -20678 130140 -89670 183835
23172 311302 -66629 61136 137172 -99132 -218347 117266 -140655 -156621 -136646 91194 -148373
23160 231595 114623 21136 44972 -54736 81870 -155094 129679 -87055 197091 -101015
23149 -57724 -77224 -173488 -258671 -31437 -182352 -244780 56555 -102266 1328 242003 -228926
23137 51588 343013 53316 -111040 -317282 -449735 213698 65946 -6400 -192468 209598
23126 117550 -61043 211558 250567 -73951 175312 -44556 202813 150013 10011 -25285 100294
23114 -100388 -291986 -25938 -189033 111874 -87526 199787 -180159 -162972 18825 -72768
23103 -74043 -175389 138825 136001 -169073 -103584 -167944 180767 -58367 111055 -61378 -40854
23092 -40854 137641 -46002 434026 29012 -4754 -150658 200598 266579 28085 107489 -213616
23080 97064 -205946 294838 -246987 -107404 26350 -105694 -117424 -353374 15159 -99908
23069 -158443 99981 -150740 -187018 166147 -25643 -52606 -110219 449204 -202365 -60004 -99807
23058 -99807 -54920 -289467 -133587 -17809 173829 -23983 -164637 -48316 -284603 145181
23047 228044 70482 -36627 -339600 -139942 -228588 214912 68516 63890 -242464 -290872 -157629
23036 -157629 2273 263591 -369479 26313 -92382 2178 -200604 18479 131229 67753 -281958
23024 60913 39937 -31942 -148361 49531 -101907 -46050 -247719 -15962 124123 268132 -96276
23012 20839 -156323 101954 225874 -15781 -393381 -40098 94090 488717 -186988 -539 259280
23000 211526 -120226 -212966 132726 -268397 9955 -94736 -93730 109799 255578 120812 94538
22989 94538 -124672 -10521 -186445 117026 77670 -99714 -161584 -57748 -16201 19345 -328649
22977 -5651 -234024 -5734 -88496 -115289 -222881 44828 258813 176115 -80254 -39758 126278
22965 49835 17687 -137773 104688 67402 -30447 82527 256160 -380335 111862 -556807
22954 -253062 116533 100661 -171842 -34331 -120237 -298148 -154192 108555 -27534 12647
22943 -187139 195046 -216465 234177 -39261 -24010 -38512 91898 268288 263572 117628 99306
22932 99306 -14384 -71291 -93165 220926 415528 -61087 -222084 87199 -179808 207596 -285542
22920 -47681 4576 -14390 -341898 -37231 49922 -10302 -304053 -56935 261881 -145670 151791
22908 -17949 -202108 20335 -188454 -10833 -205777 93698 -126130 -4403 -275099 45940 -152025
22896 66556 185961 19010 -89218 -150769 -288836 -100583 -276838 -105843 156914 -6175 225376
22884 311122 -203124 -55879 -336742 52409 -301876 28203 -85482 -84684 -158861 72584 -185347
22872 -243605 -120977 156878 392649 48145 -301694 42121 -59445 18022 -87229 169996
22861 48940 -16087 136655 96687 188087 23483 -42725 -263234 298842 261404 -23105 28381
22849 -274020 -314307 534578 -28347 -319617 -349065 -181112 71889 55407 -224713 -126464 -50974
22837 153882 -45954 -350032 -37071 124894 140794 -253429 -73956 6941 3534 121050 -74656
22825 -28036 120949 -56703 -278039 319897 192773 216075 57628 -24414 -15610 -216720 93892
22813 -41053 61911 107055 -53855 -153975 -265234 -56810 -89715 -2765 -102884 -40192 -176096
22802 -176096 -42812 184682 -295415 -5931 -22344 45364 234382 5191 -136327 183627 -35114
22790 149387 -116310 43681 -232516 -82269 -155416 20816 -78255 17528 79750 58904 18707
22778 -266201 -88571 -228541 31963 -58093 -327845 -57583 121560 299381 -140276 -191484
22768 -191484 -97806 -3923 -383580 100471 -249743 50498 -327338 -304595 -31942 -5312 -188524
22757 -188524 -73387 -162769 -203739 -147443 -55706 106560 347234 249041 210437 77143 -11246
22745 105127 -88504 126354 -57975 28062 -12910 110830 -47964 23758 -259814 10085 43008
22734 43008 152466 -387965 -216835 -264572 92377 -293537 -115870 318843 -55748 480839
22723 138811 231543 -190046 -161865 -98295 -354646 -175818 77769 -72975 -3706 181605 236880
22712 236880 116606 -46814 -94810 151370 -90933 154861 41461 -263208 -63326 252291
22701 -113405 -22635 -141824 -274453 -102660 -147286 -172511 -52304 -264114 221212 -439825
22690 74278 -129601 -131890 118271 1829 -21414 142986 -91247 42204 -69490 -14426 24233
22678 -418007 272540 -154483 -8169 -73408 -116769 -116505 22421 -98724 271404 134158 -228616
22666 16330 33529 -10207 -63170 -142857 71164 -296333 5791 10437 229166 16560 22221 -85895
22653 -15937 -169552 198908 411579 -257761 412267 -173889 -201240 -111975 2717 9008 246844
22642 246844 14424 -306361 139332 -199382 -194978 65380 67815 -48134 -40066 -326068 79842
22630 23376 24634 61193 15639 246317 -5775 -332639 -8866 49711 -52988 -334627 70311 -232286
22617 69436 -451195 54625 -8226 -159055 -86455 210816 -43042 -193048 -129762 70460 190900
22606 190900 110171 138544 262492 -105022 -266831 -19564 216407 39775 205799 101606
22595 252545 -124976 -69245 -38583 98601 -136405 -110723 213581 -33643 -162546 118405
22584 -193832 -76417 425112 -115833 88858 -6256 189838 354844 -415721 -170949 30917
22573 80156 -106138 -184873 -295483 -161375 -152787 -236773 -44225 -212414 -381262 116829 373307
22562 373307 -163543 -106797 144190 -63638 198242 -111117 212941 234470 173208 -121480
22551 215164 213612 -414623 128480 -128230 3492 40014 -328962 189903 43481 -127874 207500
22539 2592 -116293 -265420 -68175 189996 -108303 154632 -290812 -286820 90957 -275014 26552
22527 250946 132087 -36315 4333 -281170 -1364 53420 96228 -61299 160541 -4725 8090 9511
22515 9511 140605 -2245 256905 60990 190343 487789 -44 -151759 -258628 -222965 130797
22503 -65636 -251892 -171945 -144494 -101175 -349797 268123 -192155 218137 43400 133740 109550
22492 109550 -67949 82111 -79573 2591 145691 234909 56526 -34490 -301606 -285829 48577
22480 58568 -114129 -302226 48831 -142986 -154636 105512 177788 -102403 -29706 264877
22469 -69047 -240107 443436 -110506 110050 -88976 -252875 40960 -106306 -101673 -129156 -138185
22458 -138185 -118915 58095 -143487 180872 79307 52404 44036 -146328 61276 125235 117960
22447 117960 -174726 -63037 128997 136696 -35074 -153624 -345873 -1743 -357351 38264 -154997
22435 -122193 -93857 -7009 -144440 43743 -71963 -285161 -194144 -85597 -49107 43850 186813
22424 186813 -51356 -356357 72147 242085 249546 -128211 -271589 -14006 -58604 16222 -253550
22412 90265 -421178 -132388 31083 10084 -130447 -235798 38937 -2699 -292927 -117089 -14994
22400 -41481 116316 -415257 -27711 -106704 -97367 5371 -92688 54586 -142745 -103689 39300
22388 -56358 -159971 47419 -7114 70599 157124 44353 130225 -243079 177686 -157258 171908
22376 -152483 292878 5787 209065 -37356 -128437 17043 -310979 -200776 49462 39700 245667
22365 245667 -48847 -92926 -234667 6800 85321 27653 -128522 163962 111894 402 -299549
22353 -130560 -218568 -197069 -199105 -149053 174785 345345 -89618 -130649 -8980 -176067 -187295
22342 -187295 184140 -61101 -479407 298503 -12174 -47995 -277452 30535 160376 274023
22332 274023 248714 257579 232242 -153183 -131497 53386 85225 208300 242047 -245122 -280506
22321 -280506 -473995 -30959 -27445 -218294 48322 69839 71429 193571 -88588 -136044 -31464
22309 -35825 141282 53653 81659 -28570 333702 -48759 -1543 -172303 -195762 -348346 -344696
22298 -344696 25979 -181889 -138338 226606 363537 -103140 18432 -3992 -256036 -207779 -750
22286 153238 -106674 58283 271509 -176866 20632 123555 -131965 83554 33459 -181053
22275 83465 85237 -57255 -140900 61454 229144 34138 -35425 191823 151099 -15065 -394986
22264 -394986 -61821 -7679 161361 332968 -50252 52336 -142500 331563 -198802 -258269 -82139
22252 -138736 142510 30986 53047 -3378 -357543 10032 35528 -9415 44598 142912 36631
22240 -229151 -182207 -57342 -41174 105231 294249 -304763 -19504 32862 -163436 -139233 71136
22228 -170898 -2942 -241947 -179840 -311304 -145711 -85813 -172913 -101069 194900 119533 -215104
22216 110394 263462 -216603 -198298 236191 -213646 -282973 46075 -66449 -26833 -168273
22206 -168273 150270 -79202 83409 -550055 -51466 156510 -25046 5511 157886 31624 -207239
22194 -144016 -26487 -109424 -274014 135779 72695 -84896 -274133 198321 -276292 225118
22183 -135010 -2590 230815 101742 -101727 110996 -132687 140993 -73600 -255310 -201685
22173 -201685 -280826 -124812 -128085 -43098 -8388 260704 288808 -343746 5913 222175 -249289
22161 -436309 2742 -275052 156553 -95034 -39227 -38590 -225160 -51691 -115914 -452077 -72011
22149 -210439 -109895 182482 26012 22751 -84522 35470 -175518 -29456 20502 -36413 -111481
22138 -111481 -1907 -172892 76568 -537547 -207427 99027 27426 200799 108233 -63542 149215
22126 -359709 80688 -81730 30091 -125918 165759 -33212 265264 -137831 485805 -196608
22115 -178139 -50882 -165364 49321 -101400 -344984 -155973 -87803 150694 -7701 -169355
22105 -169355 -100248 -73628 -266304 206883 137856 181419 78298 133069 -50491 -35855 -63172
22094 -63172 -213094 346924 -163567 -194007 262314 201608 38755 175766 106423 -146737
22083 17643 -60947 -49305 111057 13510 220221 -81180 -17969 64076 -173911 118389 -216965
22071 6440 112608 -197586 -2806 -114002 -78747 -1387 -105505 156385 -139748 233025 96134
22059 84712 48041 -41964 152980 74886 128605 156861 79114 84234 -64239 -32631 -78564 -260398
22047 -260398 141092 -31493 -171277 -7918 -9106 -85436 116435 64789 -153330 -133547 -170023
22036 -170023 -259452 -19591 182104 -143652 115201 -343509 -15940 -177648 -182174 224428
22025 -144114 -395044 31676 -263454 -54060 -74057 137306 -244904 -12458 -103829 59568 -35449
22013 -36182 -314213 -26911 -58018 -122687 -50695 21580 -18021 208069 -4613 -478855 219119
22001 -65558 -91266 -97620 82590 -35369 -292586 101709 -96825 -184953 64229 170118 97797
21990 97797 289749 -272984 -98671 -100651 -268659 -96607 58374 -34603 -46694 83543 19573
21978 6962 36868 90539 206952 148315 28762 19375 114127 -386342 28816 -59826 -68162 16652
21965 -50643 -117656 -23626 -52862 -93930 -24173 117402 10336 -365966 282960 -277676 -237364
21954 -237364 -397670 277633 328057 -304562 -148625 61387 269689 -40516 -47169 138711
21943 -107718 -274852 20612 -63792 84766 -157130 -174452 -416577 73205 238769 114158
21932 -49223 -15516 -409110 -173361 57654 -166833 5691 -65075 -47317 -317831 -237389 -224835
21921 -224835 40030 -77277 -286516 -207203 -193670 -17176 -8296 -152177 -130426 42055 6811
21909 130013 -212647 -5702 75295 66377 199414 -118968 -5755 -93419 -318656 -138617 -222836
21898 -222836 280484 74176 -352421 -143755 -144238 -188349 55652 -352690 -31162 -88989 -7845
21886 12801 -72598 -182451 -61656 -127387 -68992 -81981 233456 -375495 76366 -53354 -83290
21875 -83290 100701 13082 218451 79811 -346112 -29370 -4124 -168637 76438 15062 193644
21864 193644 144676 25821 -79704 -269739 -228876 456778 -2309 8380 -106159 151588 -46068
21852 -75380 -83015 -53403 -41449 78777 147812 -118574 -41480 -25027 -42291 57971 32842 -365493
21839 -89066 -129393 -381439 40360 7816 -26007 -54331 190599 150464 240690 -212779 -48236
21827 -221002 -220563 -71119 -217119 -50160 2579 37835 28727 66257 100223 -95791 -322697 -55453
21814 -286439 201018 62628 -70756 -205955 -72059 163360 43978 138522 -228169 -429159
21804 -429159 31767 -107046 -194667 -177719 -125903 -231606 37227 -34452 55994 -248189 -274923
21793 -274923 -254035 -390991 -61530 -102833 123123 146885 11594 -37957 -198664 -27007 98141
21781 467545 -309659 -62055 13140 137052 53478 319735 -19514 -13762 -208349 220740 207054
21770 207054 255976 -117213 47728 -131031 -203600 554630 51450 160969 74767 198132
21760 198132 117899 88686 -222329 -16275 240643 133935 41918 -171313 45837 -252155
21749 -162664 55453 101893 -239943 -12705 -274303 -81420 -49394 84401 -57955 -292188 -172823
21738 -172823 -316606 -131588 -143656 77167 34122 -225743 84326 -246545 29715 -228534
21727 -46671 18795 203082 -21976 -53355 -306193 6970 -17015 -144315 -268842 -121718 211238
21715 -70870 -14071 -66782 132264 215170 -260076 -160270 340837 -68186 167515 -55363 -185086
21704 -185086 -71582 -142042 -154871 173427 52586 -243429 341231 10043 363468 254086
21694 254086 164782 -37536 125009 -395162 39079 -617 -35213 -73039 244311 133056 243854
21683 243854 -116977 191740 12839 -344592 175193 312490 -234938 -84215 -407206 23831
21672 123450 -22327 -369684 8787 200382 91068 114572 -11540 199087 -132893 130431 -110270
21660 -221801 -252523 -5754 222767 169335 273855 -17785 158376 -337903 142776 99531 192487
21649 192487 -100723 -89510 33879 -133565 -31323 170479 -95448 34502 -198276 101029
21638 -276073 -144570 -384776 -17952 -6541 -401669 64090 33254 -170805 21057 -22058 -105066
21627 -105066 -391430 -159759 141808 -211290 125266 101208 -309430 -223821 -28429 -65420
21617 -65420 92244 169766 121969 95623 -130842 -1616 -66214 17781 -452776 -378944 -26567
21605 -17101 -5806 209148 256524 36107 175659 188580 -85965 -69393 -267540 104461 55320
21594 55320 -139567 124220 -138671 -193261 -193255 -166893 -12548 -129626 -316319 -256610 -153599
21583 -153599 -109952 -65396 45938 -83220 148855 -46742 78608 -124268 -165417 141871 -160292
21571 -173279 5297 -142291 -37965 -25300 -216262 231120 4214 -243224 -108256 37083 69878
21560 69878 -374737 68966 -192216 -111779 -173372 47695 -340073 -166943 -172723 -53773 -15932
21548 76188 10177 -73335 -14871 120753 -5800 -71433 69477 60751 16511 97446 87800 56712
21536 56712 -220895 -6796 -134301 -903 49641 -138228 -22738 35605 -97476 -215604 -157638
21525 -157638 -226777 -79895 -37294 -221739 -194190 133550 247394 -171098 -297998 -94824
21514 -318479 -34521 362070 69135 29628 45755 71646 120750 -103137 200574 135374 31255
21502 71073 -106954 -75512 -160150 -250786 53412 196674 -257667 -87870 -58329 -277127 -38815
21490 -42286 218525 -170789 14270 15361 -44118 288966 -130936 217503 -139538 87443 289754
21479 289754 -244636 -62302 -247259 -67301 53116 155367 -488 32252 -282908 -58240 -80369
21468 -80369 -210445 312885 65266 -99470 -18144 71274 -190856 51363 -149967 -161846 55037
21456 52108 -79874 -201410 68234 267456 201474 108511 -104224 34133 -85004 -91133 -464731
21445 -464731 -243785 -119052 -199468 -125990 -141044 -35670 -27213 150338 -113171 46113 -274053
21433 43487 -217951 46412 172694 304288 110493 -221221 -116523 101847 164249 -139850
21422 224153 371507 137033 -106145 -78303 219277 141653 74633 -22094 -137269 -288252
21412 -288252 -368505 85399 -148976 138623 -35756 256322 -62807 -83954 -69639 54829 -270286
21400 13161 -69405 150477 337899 -142430 20914 1590 -289625 -96586 28010 -185817 -176639
21389 -176639 390666 -72675 20820 -26062 -245985 -33834 -47227 -107292 -44257 -323248 51845
21377 68933 -18107 -27734 124003 -26479 -102419 -367571 -329221 -61286 -208110 127105 -32352
21365 -305312 -104574 -64955 150913 36984 -52967 -92574 62470 229679 15616 -57048 52876
21353 370725 189369 -123126 -233930 -13196 -213158 -13565 132287 113447 -51138 228502
21342 59709 34485 -60801 -94848 -314502 -6562 -55854 -9970 -151602 -92376 47736 13059 205676
21330 205676 235888 78348 114364 -212868 151558 -100138 -101650 -179878 -13661 -20925 3799
21318 -67562 -39558 221172 -2272 22887 -40500 16350 -420922 -59161 -242891 -35130 -120125
21307 -120125 -181799 -9 -59373 -3850 -327574 -169900 -20497 12295 -21749 -117995 -234720 -322822
21295 -322822 -112273 195240 172494 16405 178076 67190 -115946 -178995 47300 -62461 -28476
21283 88508 -202568 80662 102949 -11755 -34372 -352233 -151680 253159 -290163 45343 -260135
21271 -166271 8488 63993 -69731 -44482 145541 96611 119603 82079 -321636 87625 -89104
21259 -21234 -10583 -72251 14656 -311775 34249 -221222 349700 2492 -53420 -201445 -337041
21248 -337041 -154380 -160363 -124648 48066 -248563 -39331 -20200 158788 -200830 -358887 -174926
21236 34042 247517 -102160 -16713 11859 140304 -296295 -190672 115033 -177140 20465
21225 182820 -207849 -100652 68568 -20751 133179 -118486 -44536 -91970 -65675 276699
21214 -399234 -171563 10015 164549 -163095 -32600 -260579 178849 -200110 184486 -40769
21203 97429 115634 -35532 -141209 -162212 -282834 -8979 159735 -201516 -145758 -130220 81955
21191 -161029 -26654 -255302 -124381 -23089 -17228 -35755 15180 -179504 -110774 148522 -119243
21179 -289730 538718 -292871 49123 -100103 64477 -196820 -93531 -57070 -148461 188791
21168 -23753 3419 -139340 227339 207492 -38400 396182 -160283 -1296 31179 75177 28308
21156 179362 -34384 -118825 -190572 -290713 -56489 242316 58099 -165018 -97286 -93141 -14160
21144 -246698 -162765 -164911 221702 -5918 57155 -159213 -159831 -301854 -292461 -5302 163527 91312
21132 91312 -36327 -120057 -336140 -56909 -206738 -54851 -104335 -137861 -132128 -285197 -421454
21121 -421454 -39927 84268 118478 -35851 12796 204342 -289061 -163187 69200 -33371 -101680
21110 -101680 -85418 56583 84683 145505 -284691 -324821 -127734 190912 154400 -95555 -158117
21099 -158117 -115031 -84171 73389 22071 -229462 -182638 108934 -99221 1226 -182584 15608
21087 -65160 -103108 -58418 114154 74534 -40047 -108703 -55583 -324196 -124177 103680 128991
21076 128991 -23773 -84261 -99916 -21901 -486531 -70495 -30924 -72717 -72981 96863 -178585
21064 -80540 122069 -144131 61422 218546 -149962 -11369 -145762 5494 181482 -361890
21053 -212364 -112257 24051 -105144 -97896 55284 -147808 -210895 -60119 24459 -55081 -180835
21042 -180835 203667 -36240 242500 92746 60410 -169490 -56555 -7376 -162750 -395234 -274663
21031 -274663 -122315 -192034 -77256 45199 -184845 -114034 -187690 -110416 -77671 -305444 76304
21019 -241764 31083 -70681 -79813 154949 194691 36110 -32404 215905 90121 -153691 35441
21007 62407 -90276 -105020 -204798 -28176 -6031 -173857 -88085 154261 -203915 -154027 7874
20995 110740 100227 60006 -360930 6077 345500 -58866 -451004 161978 -322128 37815 113692
20984 113692 -264370 92054 17848 -152328 -204392 31779 87537 5803 171057 -143065 -69060
20972 -193725 -124036 71320 -137031 -28118 26354 -146908 405026 24155 501390 186557
20961 -222796 -378035 -323847 -265951 6978 -469407 203578 -23464 -11091 -117236 143855 1766
20949 142664 -382445 81654 947 29241 -260932 -90429 -151498 -254340 112171 179013 53233
20937 58600 -29303 170504 -125541 -390139 232281 -187472 225559 -141074 169824 28151
20926 -3047 -80720 -63137 15714 -130682 104759 -229527 -227712 22030 30544 13537 -113548
20914 -375663 -287857 -17966 -243667 25521 42271 218888 110317 -188645 -234933 7206 -237187
20902 170239 -157447 -148156 -127593 139509 53071 256260 -131814 103384 -87647 -202230
20892 -202230 63434 -95832 -66599 -185427 -129460 -91701 -67551 -270036 -4470 -39286 -86396
20881 -86396 101586 -71334 -9284 -386857 9559 -292644 -25447 -39357 58068 204680 -425222
20869 90661 102438 27976 -13348 183727 -66568 57878 -288387 49616 47079 149550 -48680
20857 -215404 95239 -55629 -48312 -13275 284128 5742 -65550 -221155 120989 98532 -74955
20845 -2722 -399099 -6152 -153944 27305 -40244 147013 140062 -291935 -5355 -173811 155034
20833 -7169 -106615 -174211 -68953 -195924 -183159 152496 -63806 150387 -257073 -209353 -311115
20822 -311115 174060 -191478 -77423 -135330 -15134 -2639 -35858 -327176 70456 335023 -108655
20810 -142091 -131869 8083 -95636 -105182 49830 90496 103874 262760 89741 -268199 4740 38740
20798 38740 -152372 -197908 -213681 -202284 8055 136267 -336340 -168904 122993 346828 122994
20786 -271055 169582 -194407 -553478 -137858 231749 -80702 -71625 -16965 105888 271247
20776 271247 101284 -110948 -61779 -291230 -267056 -102838 -73460 -287131 201376 -164654
20765 21971 160282 74730 -332293 330598 55675 151744 -90249 -151831 141516 -59577 210381
20753 435252 112444 -154647 -158752 -90035 -95825 -46543 -275025 259676 -50409 163076 -134957
20741 54294 -286494 -102477 -82322 160105 79061 70247 -105595 134454 325818 31741 -110655
20729 -2122 -45554 255735 -7401 -27333 16230 -224109 41504 -394058 -161755 -208163 -37294
20717 31789 -29730 100991 -152102 -27570 -241757 -138312 152919 -73299 -208853 -120018
20707 -120018 -252967 -423879 45074 8349 57941 -94331 1740 -235551 182943 32407 -66196
20695 15763 47583 -280890 92581 -109461 -148741 -57927 203814 -40023 107293 -130725 -68445
20684 -68445 54581 1018 -154085 191710 -137153 -102795 -163779 -91179 -146066 8923 -212025
20672 -339399 -197402 -17048 -147116 -11221 -203321 166785 -258176 -38239 -47167 14408 -62829
20660 -173428 -87603 -16046 -169895 -52372 -83426 -86598 -105150 -168907 56134 99618 -118983
20648 -29038 -298378 -106101 127541 111490 81803 -199651 -169237 243032 97766 -215077
20637 67038 -89020 -29176 -359543 -248568 -374168 102015 -319412 93172 111228 20634 -92374
20625 41759 -115429 -47327 177261 -16552 -59234 -205021 217935 -143831 -268067 120190
20614 -85194 51983 -259132 161589 -236748 89946 -152650 -59577 224607 -238181 159120
20603 5389 -471 -171606 236867 -429069 -65225 -99832 118072 144466 92092 -211922 -56435
20591 -155636 -422442 319400 328181 -344294 -48024 -342651 436710 -259133 -197472 49057
20580 -202352 -219270 152968 35987 48964 -39563 205360 -207867 42648 -351999 96427 -207173
20568 -31219 77495 177997 96816 275507 59531 -32995 -34667 13612 -188994 -4132 -110034
20557 -110034 -114483 163712 -252541 81307 65811 57291 5792 -207756 7951 -88346 -330314
20546 -330314 95983 -131479 85096 56872 -227791 -29490 256281 155733 -475173 -141839
20535 60044 -221575 163711 -144139 -125247 108227 -394575 -51103 -112002 -43200 -25383 -23368
20524 -23368 222220 -62406 -188517 258156 -225480 -85875 -102430 148132 -52561 -38853 78363
20512 220704 120584 5335 -178196 9537 -225378 -20214 354623 47125 108113 180713 -137541
20500 171989 -460211 239337 -76323 -183424 45759 15851 34650 36817 119025 -161097 -459450
20489 -459450 22582 247565 358232 -136922 65617 -205229 -61520 50078 -10893 243590
20478 -11061 -189516 117021 -347274 10381 -524650 134919 -103243 -428593 -15678 92722
20467 -271786 -21748 246981 244725 9836 131822 156646 -26547 -154262 -22752 35014 -226053
20455 48007 112180 298169 17366 38817 -345277 24731 -99574 22979 -171215 109190 1900
20443 178378 320357 58840 -211697 -221287 -340653 150711 10082 230809 -383317 -35847
20432 164888 -8366 -107245 -290256 42674 -365832 -10038 44553 -243656 -273629 72514 63232
20421 63232 -22360 -90464 204280 -213281 177814 137792 142517 -163196 95315 -142201 86334
20409 71955 -218580 51040 -217700 -237712 -202719 -45264 -130699 -382612 -69738 132925 77234
20398 77234 -74457 20657 106074 -5363 183308 68630 -109086 112352 -140997 46125 -142563
20386 40420 -157527 -188437 -5941 -11164 -313103 321216 -52699 -358081 107984 -269812 -26586
20374 221 -384080 31171 47685 -269867 70286 91285 77812 112319 -138835 -161631 -329540
20363 -329540 38206 8244 -89186 -337900 -309663 84196 31855 -6095 62199 -152730 -209136
20352 -209136 -63546 -134268 -279805 -284730 10203 -169283 -149412 -34814 -437245 -166269 -29498
20340 -167877 -69802 -152053 -200968 71559 -134296 -320194 -277986 201970 115925 7390 -336252
20328 47048 -44972 -302598 15595 -184427 31547 -89322 555 56537 -86837 -279560 101684
20316 -62360 -16184 238625 -234260 -188872 154673 -137061 -57394 10320 -280372 17678 -270254
20304 -137056 39231 115504 -113053 167299 76106 205260 -19824 -123272 31542 -289253
20293 284975 -226320 80796 -293680 -144773 41497 -252950 -49857 -16280 -125249 161997
20282 -164817 -379927 -133037 323683 9961 -199943 -70305 158466 -173161 -71989 138767
20271 153736 200649 -79343 168424 34483 -245779 21223 56796 -34159 75839 -192644 164584
20259 28300 34738 -224388 -162463 -173511 -389 109179 -139841 -36122 -267282 39872 -69676
20247 -270557 -97610 -226850 -124949 -281569 234171 -177099 349434 31694 -149311 34499
20236 -190140 56691 -123582 -186936 -101575 992 44798 -20737 7567 -155315 167157 12422
20224 -250609 -326025 81403 -146144 -72110 19578 201026 91950 18012 -34908 100390 169842
20213 169842 -345861 84876 -23396 154755 -68825 -413879 -216524 81458 -89730 135582
20202 -212119 -32967 -305270 -135299 44018 -45667 -247975 -18525 199352 -153022 319109
20191 73040 271347 26933 -412629 155146 -139931 -61552 -555250 184058 -180404 -212049
20181 -212049 1604 -186435 140140 -123481 -41837 -129724 2604 148971 65095 -299298 19515
20169 44949 -20673 -168034 43541 -119040 -207397 -255337 20612 -68734 84602 -63106 -270024
20158 -270024 -22032 -131163 -227935 -216510 244857 -139092 240257 -99854 -3008 372035 -226525
20146 -146245 -277508 49501 8227 38894 -217956 206706 382696 112065 -15759 20858 28634
20135 28634 184966 -71236 201026 85181 134106 -24495 -34668 -44231 -444240 -226458 124310
20123 -5083 -75925 -92542 -22422 116550 -104186 -140037 99276 39135 -82542 31727 242820
20112 242820 120651 255046 -50755 -67020 -196561 -110301 124160 -123815 -62606 -403637
20102 -403637 -380860 -399231 -14150 389470 67524 -337790 159674 -55156 -322137 -266032 157437
20090 15237 151152 -299272 -138110 -294098 175375 -74876 191600 -53452 -14929 -238474
20080 -238474 280752 -171090 -299488 -17489 52754 -291258 -57640 139468 116841 -234481
20069 -164343 -186911 -360550 -159841 32246 -238998 142093 -215536 -14928 -109421 -209402
20059 -209402 -497096 4948 42466 -249675 -206635 163801 67011 20493 -306292 101026 78696
20048 78696 105582 245387 75107 -151944 120893 104319 -170008 -212924 18253 -131673 -222013
20037 -222013 37768 114753 -137244 -284081 44295 56170 -131138 -171172 103212 -45059 -88048
20026 -88048 -22405 -144522 -152241 -199962 -175599 18143 4742 142988 221814 -102919 -91814
20015 -91814 21822 193939 153713 -27928 38597 -79763 -7386 169212 -95049 4483 -278994
20003 235969 132346 59886 87164 -45842 -330530 -179848 48672 -15212 213970 196583 125035
19992 125035 -65151 -66236 -41983 -168644 -195045 95887 -128118 -22383 -506415 -70271 -102356
19981 -102356 311062 208193 229465 -99043 153234 -13105 -110705 -188389 199708 -36006 -74262
19970 -74262 76112 141653 135136 127787 -32695 276138 -146396 -106442 -182925 78108 -106663
19958 -80116 147911 -258900 -95285 -69816 -71797 -99468 137256 -179727 -200179 -348029 -63460
19946 -175288 -138197 -31664 -162989 191607 -202002 -176988 -32153 -202861 -76168 -73081 -78847
19935 -78847 96512 -213111 -56520 74447 -344733 -129511 130623 -61369 9485 -26895 -268604
19924 -268604 -318018 23010 29834 -277814 80705 -9200 199768 137428 -108173 135042 -106646
19912 227136 39750 81608 -156795 -157846 -189322 -51995 -255275 -284243 -14447 -248551 163875
19900 -39359 -382056 80950 62508 -45286 41220 -78905 -247698 94914 -136134 -65284 98938
19888 340739 -176215 -42502 -257084 -175219 45691 103492 -92560 -23255 136215 -180390 6891
19876 -267830 9846 -4567 128334 -24763 -334679 -318502 -54695 130412 40584 -4783 -67570
19865 -67570 -273547 -56490 -58446 -121263 -6869 -102459 -197263 41262 77669 -135427 -7724 -84196
19853 -84196 -144491 -217427 -149619 19863 70774 51147 204514 -67202 -105327 -36297 -567643
19842 -567643 -48297 -9568 291125 56144 108039 -291397 -280548 -176048 -97365 240223 40887
19830 -34608 26588 227385 95697 -88085 -182584 -213216 -134715 39408 11743 -250933 -193500
19819 -193500 -283309 51309 337769 -335550 -173966 129032 273144 -158095 -24855 223 -32786
19807 -182170 -98649 -29843 30728 -245882 -93627 79723 -291472 -318664 -57064 43460 -391355
19795 32495 287467 -196129 -18605 -126198 -82672 151858 8757 -42824 -159250 134876 -133844
19783 -4900 -379485 -76467 255782 -144790 135887 -44448 142387 -357221 132639 90853
19773 90853 -202331 -6960 167833 -147160 5852 -39494 -382670 -218777 -18788 -80955 -28346
19761 -310492 -107608 -13335 -3116 -163483 99632 69804 -80755 -256115 -60674 94362 131878
19750 131878 -116264 -40205 80758 -152722 -182098 100485 262620 346317 -97055 21597 125462
19739 125462 -115732 -20146 -118739 151441 82594 -183070 -374539 -168023 271604 72198
19728 -242326 -114398 157366 182094 236613 -147423 80500 17759 -158592 -417129 -292840
19718 -292840 -321851 -147501 -108740 -78094 223520 -73702 816 -110928 33687 73874 -10374
19706 9044 113200 -80680 177520 -197893 -142295 -151518 244030 -243840 -73740 -328071 -294189
19695 -294189 -355778 -413219 75545 219714 -323176 80415 -91276 86231 134773 7952 64130
19684 64130 14471 -373235 -344366 305393 18041 -23044 62321 74399 193446 -94436 58018
19672 -54309 -235702 -143119 -57799 -14621 -70758 -273198 -210908 -172490 -74443 30931 -85251
19660 -281540 -147598 -351831 -423719 -21688 77678 220655 99440 162035 13137 -187589 104433
19648 -278900 173139 -393374 70403 -186098 184030 -82276 -124718 210398 -160344 -40658
19637 -214654 94995 -41902 -378197 120057 -66851 -95372 55755 -87113 209508 -23026 -154205
19626 -154205 -187286 13912 44201 -74368 53770 -73750 -203111 324311 -239661 71750 -238201
19614 -200949 -262530 45016 -187710 -290462 28231 -155736 -177235 -388816 131839 66120
19604 66120 -270260 14588 -169375 -129801 25016 -282438 -39117 -2321 -272338 -51314 -228858
19593 -228858 -138852 97398 -173206 -155695 -187384 -89149 24702 -71368 113762 -85267 114179
19581 -64904 77589 -15164 31294 -252890 -200742 183152 -181851 -159638 -146920 -191706 -122760
19570 -122760 72688 -106381 7898 -46468 -8751 -200057 180174 71299 -211977 -1340 -56897
19559 -56897 281959 -26255 -33724 -418 21552 31578 -458043 -88653 197856 -71986 -185328
19548 -185328 80240 77173 -210881 197178 197544 -190595 -273981 88100 10687 110114 35432
19536 38066 55050 -241112 -2535 181755 -227131 33198 -372099 -168705 2471 -498902 -440038
19525 -440038 -437181 114242 112445 -40349 -47138 -179742 -79423 -73364 -369715 -83444 -110417 478777
19512 -89527 1027 -170961 65344 -93653 -310303 310047 -226099 110250 34856 -107309 -313152
19501 -313152 -7161 327568 -231488 -147549 -321196 -80903 88619 -94145 66751 -134408 -17111
19489 -77826 135821 -62156 -124850 -140756 113713 -86114 90684 238163 142671 161627 -8826
19477 93358 -222630 -195249 5629 122057 129209 -141023 43869 -189532 -1295 46479 349485
19466 349485 326444 -57986 -9056 -238393 -271256 -30742 -6019 183764 -248810 -241420 319937
19454 190150 -207631 117659 75025 -127808 163225 -222977 -72165 -414303 -23987 -103914
19444 -103914 -57244 221335 -120753 98750 49260 -125004 -215995 93390 -150591 -222939 111311
19432 -52600 83123 -80074 71100 -395463 21615 -115226 -220806 148792 171906 -78 77981
19420 28656 121839 -95436 -203105 -35257 -15014 -79231 -118778 -168652 -205934 28940 -81976
19408 -199882 245023 -4271 -231725 -84546 -26354 -253472 -129329 -96515 -233546 19690 -211503
19396 -274033 -237035 84835 42964 13334 -42574 -255566 -341627 28347 -36243 -204095 -99389
19384 171998 194990 -295093 307 -273546 -290176 187470 -69274 -265774 123454 -142114 -173066
19373 -173066 -109498 126383 -18927 -54448 -103087 -257190 252575 -335874 -29450 68169 -174268
19361 -229696 65412 -212877 -146655 205024 102300 -233587 -199373 -323100 -19404 -173619
19351 -173619 -109924 -114565 -152992 143979 -155295 -490901 -182667 173332 -213215 4577 -247566
19339 -147509 -60020 -161850 -6315 160057 -67462 -130801 59055 -411100 -186437 -234986 -67896
19327 206676 163360 -149806 -65679 -61090 10047 51796 -235479 -236921 111949 -81106 -89646
19316 -89646 118237 -87967 136306 -466197 -80921 -267380 -176294 -172788 48199 51618 -146728
19304 -154266 -131784 -140332 -30646 -130979 42483 -94897 -218634 -11245 18754 126670 -55347
19292 -102629 -454340 -100428 -101847 -547409 28380 -198286 48682 83848 -382300 -198730
19282 -198730 127034 -162456 39206 147229 -76314 -279608 -197971 -61108 -43763 96934 150581
19271 150581 -2003 -231534 -186577 237901 147394 -114465 -1901 -132911 92166 -73765 23898
19259 -271650 -154886 -117806 116403 -5623 182612 -62025 23368 166516 9651 -41956 -304974
19248 -304974 149496 -137473 54660 -190415 -80859 -382489 -140739 -382199 -169027 -193574
19238 -193574 -163366 109981 -25813 -182025 112627 98393 -32821 -156757 67450 -150827
19227 -6530 272800 113561 -1184 -84113 -162976 -77461 7221 -356153 -83595 -45915 201990
19215 -102018 87149 -295275 -307389 355295 -28595 -29564 -174215 -251956 -117362 -160414 -42118
19203 -170387 178574 -376917 -70212 -22427 167263 -160552 38805 -191047 187203 -23812
19192 79266 -8759 -179256 -145141 76027 -88370 20501 -71017 -129665 -53764 40671 -249837
19180 -46725 -598998 3334 -90299 91039 -14013 -281608 -118173 -171926 -280385 -58695 -7670
19168 -281923 -264287 -86570 -156882 -30085 -213059 -111238 122781 311116 -169121 207639
19157 325448 -289392 -120276 93586 -199404 -93450 -345039 112556 -393515 108473 -383132
19146 101600 27264 31945 172008 -105781 288889 146486 -239931 -193457 -358871 -215377
19136 -215377 316547 -120593 -175878 -83289 -22244 96788 -342354 -48093 -185526 76188 31043
19124 96811 120279 -194527 131070 124151 10502 156129 -306413 96017 -69607 114745 308622
19113 308622 480790 -124210 40487 -217405 -106986 -96875 -98707 22664 -55204 11195 -449282
19101 -222170 -5536 -82949 -45028 112415 -134633 183524 156941 153252 102916 25402 -108956
19089 -94347 -482378 -74018 -232434 -31527 -85030 -396831 -293804 -40501 91793 152580 12294
19077 -308984 -243626 -111083 -303413 -16067 -33447 -18784 -216954 -71669 214157 -254155
19066 140970 -120420 142341 -337149 88318 141459 -694 -180480 135829 -81187 -38977 -102274
19055 -102274 239940 240996 -175085 -23148 81984 -246191 251214 -115216 -147466 -36596 57489
19043 -39877 428172 213929 8388 68475 -141957 -139619 46286 -120565 -155086 44146 51552
19032 51552 76750 -36645 -55535 129247 -324364 -128588 -343170 -2405 266148 -26435 460874
19020 244049 -89363 -120928 177419 111981 248493 353860 -49592 94073 284898 -84197 -43223
19009 -43223 -52363 -73614 95582 -117841 -51619 244819 -169591 -315365 392044 31058 -76620
18997 -152151 54240 -75397 -126095 69958 84601 15852 124886 250362 -257432 50 -388750
18985 -182058 -36023 -180389 45946 89976 -54538 50428 -217681 -141882 -29752 51874 -246632
18973 -105691 -309808 16999 -25999 -61127 -32243 -171944 214793 -317334 -263530 -166533 -91471
18962 -91471 -206382 -28886 13814 188565 67118 -20549 157444 -248035 142177 -145026
18951 -232947 -138486 -54449 -52442 -134916 109252 -155748 134312 -173033 74213 -30811 194537
18939 -177179 -390764 12172 -67179 -61850 260753 -106031 130012 67816 103591 117768 -187515
18927 -162437 -126142 -230511 -280852 -37807 -144107 3429 -37144 157197 8117 -110393 166114
18915 -102672 408810 276983 -185517 -178398 -124791 -95884 138790 65733 -205432 -414552
18905 -414552 -203936 -118337 -182297 -29214 -81914 -205916 103262 -126706 -67401 -265794
18895 -265794 -119280 -112378 -490489 388184 -132781 -39783 69933 -79378 -114452 134461 -15936
18883 -193958 -487419 247699 112282 -144763 103908 -123244 -168248 42347 -149578 -402416
18873 -402416 -202145 88351 -313244 -82882 -93323 -157272 240209 -173137 -215406 -350213
18863 -350213 198128 -185115 -240762 -71977 -25442 -517421 -103070 -59816 4526 32265 -35920
18851 -75960 -86661 -35846 -26701 -56715 -21571 6396 -19738 -82517 -121719 37463 -32443 -287220
18839 -287220 10960 357563 -156080 -178700 31278 23726 -110892 361886 204055 -191537
18828 -244372 -239427 148890 84628 364427 124195 100353 76054 -7348 41616 224360 102125
18816 145867 -1936 -95140 25253 -350277 -48518 -54378 48371 -60703 134180 -12732 -138810
18805 -138810 194938 37073 -72862 3891 74507 -78116 -656 -121334 321643 217816 -219832
18793 38430 79051 82247 253365 107033 -139846 59814 -20908 67860 -4264 62646 -166545
18781 -96724 9066 41941 240478 214847 -107529 -44508 -26775 55201 -339675 -277687 -110553
18769 11969 39359 -24276 -526273 -414594 -256075 -252945 -204928 -209648 18491 141463 -48048
18757 8373 -27313 -114739 3316 88298 -56231 -197906 -280830 433875 -155709 182804 200638
18746 200638 -303326 310050 -242768 101351 187930 101851 38647 98896 73146 126135 -205679
18734 -223524 -242189 64433 -315752 -260329 -73090 -247271 23968 -180434 -91406 331893 179330
18723 179330 41756 -100844 -210722 -2915 202015 -134682 294874 -192377 -225796 -85881
18712 -126592 -98861 -214746 60117 99941 49918 348531 -75865 72629 -124392 -104812 -225820
18701 -225820 -100704 -1614 -11528 -99823 66763 -103181 -123298 -134831 76899 19598 -325126
18689 -5827 -375227 -168837 -359973 -113712 157342 -199387 -231167 -38344 -113978 38556 -219091
18677 142452 128808 -177096 -261248 -141656 -320378 -137809 102709 150299 63012 -32437
18666 423391 131940 56730 -204673 82374 64703 -18137 -56722 157400 -160640 7772 -156796
18654 -267949 -18793 221272 -165247 -222335 -26407 27427 -179659 -211099 1267 140361 -323807
18642 -736 -434706 160055 -737332 23778 -78532 183524 72756 51465 90376 135157 148813
18631 148813 110146 174124 -27626 -8882 355950 -60323 -118635 -399581 -146844 316870 -272320
18619 10184 -190682 37795 -269056 14810 -45766 10373 56942 197454 -140935 -306839 62392
18607 6163 -277225 -144879 -103085 -504188 69824 74874 383008 -183259 -95413 -282251 134881
18595 -356410 -342844 -98512 46703 -168333 -393450 -280720 14822 -65649 -245606 -96122 -396904
18584 -396904 77941 114536 8432 -117081 33740 -132470 -89167 43956 -347406 -97514 -17342
18572 -18397 329992 25162 -315458 -266576 3008 -9237 -85217 -107476 -220745 -153338 -117194
18561 -117194 132119 -223143 -372914 -166714 204320 -351941 47713 -58063 12376 118990
18551 118990 -52363 -17888 -223894 -275935 100217 19862 25333 230810 39060 20338 41134
18540 41134 -37439 -138937 -63798 -44974 -99931 72075 -223360 -369504 201327 118298 215954
18529 215954 34430 61785 307421 -147280 104745 -181938 -79775 206117 -47332 -145443
18519 -145443 195548 -74271 -311253 -280853 -338606 -342793 174360 -183851 226207 122122
18509 122122 -323025 109863 -23418 220426 10510 -148432 307617 -61554 -108723 -22493
18498 76649 -129006 92550 -85239 -91568 -14651 -24376 5049 -245935 -109834 -41260 9808 -242804
18485 114589 -104002 169285 -9028 189094 -423961 53677 -468586 -231213 -206280 -186813
18475 -186813 39567 47894 -218246 -292918 46691 -190684 -77922 -246887 -63833 -37778 -190283
18464 -190283 -70475 51929 -78540 -237553 327129 70124 -86060 -296116 -33038 -203222 -580321
18453 -580321 102742 -314901 59263 325329 -134530 166183 224784 -102969 -102811 -201585 179713
18441 -118885 358153 73802 -118446 -122674 -23552 64926 181157 -190175 161520 -172751
18430 -390167 105024 -198715 -95465 120720 119832 108496 8214 -35187 -97389 -223049 72422
18418 -141246 -296038 70451 -249073 -24383 -230859 -101464 -41778 -29070 -94625 38485 -188801
18406 60799 -24179 200058 -46451 -252417 23716 -112962 184867 -123149 6276 34642 -191474
18394 -346747 139396 -108194 -180157 -113992 -3070 64037 -199954 -230737 -139002 24632 225384
18383 225384 106224 -210265 -95331 -14865 130340 -278245 18203 -6713 154089 -9281 -21076
18372 -21076 -287623 -105252 21523 64096 -222638 -112441 87584 164249 -48753 -406414 -5195
18360 16961 212674 -134747 -11140 -6533 -134425 -165456 80664 169904 -109601 -190475 280572
18348 51020 -140197 120906 74489 -44958 88594 -137312 156316 36983 -141204 -299573
18338 -299573 -453089 322785 -28801 -234512 47000 -2951 -21455 -363976 -367330 -6360 -189336
18327 -189336 90983 123363 114834 81176 -322752 2422 47354 -29718 -218667 -177428 35893
18315 -7260 -332496 240074 85719 -21487 -54182 -74235 150570 -109553 -135729 118484 -9296
18303 -98781 -19762 -251175 331336 -199968 9549 -256604 -210480 69543 -177155 -18022 -195163
18292 -195163 -176150 -88354 -68680 -142388 164479 -81742 -273108 -128569 -52226 -31283 289449
18280 -106799 132193 -186190 149109 -30319 -5529 113308 -141297 -64930 -201030 -82362
18269 -231135 54990 -145359 3583 -406084 -50459 -104580 -34162 -10872 155789 -73340 -190447
18258 -190447 54040 -105638 -284346 -385778 -12002 -76107 -192533 -245139 -47163 -137725 -127241
18247 -127241 -138870 62901 -215166 -246727 57609 178566 -332424 -62497 -247692 -208373 -85607
18235 -143346 203855 45432 -341771 129528 -31446 1069 -99988 -180014 -205361 -63266 12996
18223 88803 -45595 -94695 23536 32246 -147529 124470 -180880 -88673 -116555 -218170 23072
18211 178826 4893 -266291 -437105 161311 7472 59772 -161117 -264176 -148175 110173
18200 204057 -359765 -179671 96501 -201090 -114845 284843 -321570 2028 167092 131237
18190 131237 -235296 336398 48376 74917 34315 53141 198155 55358 5445 -41010 -247342
18179 -247342 -384806 -221464 152281 -48176 -229329 369259 248427 173102 -142263 -229468
18169 -229468 -190836 -204222 123014 -1817 27877 -359584 -261048 -174374 -54644 -169210 98707
18157 -113553 -343456 2690 227052 319734 -64464 133482 38675 -210362 -83698 -307981 47392
18145 74321 34334 30268 -66168 -98511 -109072 43699 232967 -357957 -36982 82839 -44257
18133 -57002 164123 -237177 -238724 -7793 -194754 -169035 -260262 -61231 89075 -32815 -16878
18122 -16878 292670 -198901 186023 -320131 268720 -88560 -142171 -5849 -224098 -204308 -191246
18111 -191246 100900 -60528 209119 -25058 -130265 270814 -202145 -78058 -163865 176255
18100 -13652 -422104 148747 -86290 -164954 -57915 -21725 63106 -177876 -442252 -83516 -66373
18089 -66373 88133 197969 75009 -43610 -126508 -157258 -149771 -176497 -78541 -206074 -421557
18078 -421557 30658 185031 -382688 254955 9001 -189826 32399 -78437 23584 382636 -91468
18066 170487 -62205 -132061 276187 6629 66467 -179096 -87457 234950 -10750 -228867 120133
18054 315367 16291 141442 176444 110419 37938 25869 7932 -82696 41451 -227923 -42405
18042 -7677 -158235 -11735 108999 -91631 -134247 116902 -90778 -65597 -234234 358329 -7137
18030 -163077 -8812 -13615 -9509 -214711 194292 -118747 -30010 -155450 60591 -40814 26535
18018 217711 -243257 195756 -273032 -1850 144967 -231409 74482 -52305 251280 -70157
18007 46359 58630 188144 -22285 -161096 -330581 -107920 79003 46351 -183580 122678
17996 -97188 17846 -149603 21444 -77775 -33966 -170123 274612 319038 -373867 -41601 79146
17984 -85292 -373140 3638 151843 220372 -40444 -138721 338789 -202934 109778 49623 -196157
17972 4664 -10105 -31726 -255433 82741 127088 -164808 80156 -282490 202052 -99071 -122047
17961 -122047 -170597 -149120 -266837 79978 -61606 -68693 15930 54943 -287139 -235916 -82406
17949 -187681 266699 -213930 -77679 168809 135628 -4320 130531 -86537 86960 223684 -217188
17937 -191497 -5580 252233 137463 44979 -63792 -152067 -235403 227923 -209858 170151 109098
17926 109098 -237150 -60618 -160247 -211298 -270812 90520 -79433 76730 -33014 -208137 -317427
17915 -317427 268288 25861 -75486 65972 -293304 -173400 23655 -121587 133707 20417
17904 -119484 -130931 139157 -44790 -127779 -210517 175531 97015 -103054 149815 -668 391723
17892 333626 181655 82954 52405 354829 29943 -208164 -121082 -97979 -213795 296629
17881 -174361 77721 143632 -162118 154996 -156210 134329 66705 -17464 -23047 -93943 -161684
17870 -161684 74958 -340079 -118713 60341 -232736 -34176 -224356 152650 238007 -51242
17859 35579 74894 -228005 -147593 90237 -16987 -162645 -28171 -42489 -154838 -256284 -41773
17847 234042 19474 184490 64155 -175532 -206589 32581 95313 -39974 -249401 333222 12548
17835 -35216 -290054 65467 -277331 -90794 -179996 191936 -19445 28354 -13989 -76972 232737
17823 -45150 -88679 -182331 90978 -76771 113265 13416 -44659 187436 157187 -106809 -192840
17812 -192840 24009 78851 68740 187048 -448172 -176949 179539 -209720 -89915 182808
17801 -29591 273290 -185693 -217739 125878 -21185 76373 -286487 78426 -62499 138685 102747
17790 102747 -75135 -301385 -258694 -43530 -274186 -54692 184884 -156943 183148 175661 -256742
17778 342739 -50703 104691 -53204 -122373 62309 -180974 442957 -37050 -54133 -76596 233501
17766 152726 -414709 -157591 171957 65297 -82208 -167394 -146952 -75382 -159657 -19720 27457
17754 344142 189287 5743 -208416 162162 -249448 26886 -477510 7900 -532837 91175 28207
17742 260658 172648 91913 -115816 163243 34185 194057 -291381 77072 78908 -345443 -57960
17730 71856 143400 -59383 -367303 38466 -208486 13982 -253367 298304 61360 156235 86663
17719 86663 -231950 358217 39675 148692 224 -42966 -152811 -78294 -46203 71372 111040
17708 111040 -122463 159212 -205987 -96523 -296640 -26537 80739 -116103 -112894 -78387 -76130
17697 -76130 -352353 32327 95509 242298 280571 -91345 -212031 -109688 78384 -478843 62898
17685 -307383 272955 -60719 194039 -49349 -78529 -48944 25637 157527 71728 173349 62031
17673 108170 -24858 -101641 26526 226490 -36605 -188198 113399 -45291 233787 44506 -22158
17661 62391 100399 78629 -182256 -51575 -59600 67909 154801 1574 38760 -304742 81192 251033
17649 251033 56179 -631 272027 139187 384429 -59151 187227 174256 75411 -16401 287110
17637 72220 385689 -180814 17614 -270680 207711 158176 -178679 97163 201745 7611 -8655
17625 118718 -157148 121001 -54621 -185840 227740 78081 53041 118531 -125486 -119826 -161495
17614 -161495 -113136 -100773 220629 177606 -38775 9838 6889 -15565 215858 -96971 62805
17602 17235 136847 215623 -49814 276210 157984 227863 43697 -126380 138839 -113843
17591 188407 -193251 124228 278868 31807 145858 201108 -48141 56267 250155 1375 -45765
17579 -153885 37192 173926 3012 -199907 -70795 115419 178653 140439 -26816 258596 86928
17567 -173411 -100996 141329 -263449 54278 -23978 138372 102508 -187730 -605302 -9087 161643
17555 153987 -226160 97049 -122256 162125 216214 177552 214993 -299862 -328931 -228946 167051
17543 -73031 56334 167411 329116 259682 251084 322256 -166148 115368 36880 207205 -73641
17531 76834 -60587 159931 -96864 9239 368850 265827 122714 -106938 27161 175489 102667
17520 102667 -139404 83049 -191702 -25189 159963 112986 266752 -36782 111864 177201
17510 177201 -177720 158130 96614 334954 34061 19119 207128 -106126 112698 132356
17500 132356 -226904 59061 112749 121240 262910 -44595 197733 -18852 112813 131169 43145
17488 304330 203597 -12946 -343726 -305825 125907 48405 249968 420783 -32581 274927
17477 136221 11128 250441 198857 117541 207344 12514 186716 224960 243897 140842 301380
17466 301380 397016 197355 464417 -27750 -185363 -129785 296650 289966 89687 283570 227844
17455 227844 385024 -193109 18571 -73448 -6083 123627 242913 219998 -54203 82749 61448
17444 61448 262944 417540 165055 154706 170279 303689 322864 -84178 327611 421413 303437
17433 303437 183468 -137981 554756 275739 567335 100883 -151373 286514 528506 464984
17423 464984 69629 150344 497701 242261 174243 229790 41791 146422 173726 301688 79719
17411 299405 442274 339657 293667 66806 264446 178594 458578 30887 136450 555842
17401 555842 224740 203573 312111 280103 145610 253594 79617 264001 313667 -9758 221727
17389 131341 215785 326035 396125 -127315 181445 408023 298800 247481 198816 242539
17379 242539 -313743 155703 498201 76283 -74385 99604 152979 165347 602624 325569
17369 325569 278074 262622 -44328 314260 63967 -72454 -116300 215212 30223 549688 -155685
17357 -49470 382431 -73177 -234551 229656 293226 97066 192884 309101 70297 140300 395542
17346 395542 205018 6381 11346 341193 -68245 104104 279769 213855 216567 19410 30150
17335 30150 279993 -153802 72906 273079 272635 350058 317919 -68938 157216 130409 -25406
17323 173728 432481 275046 313100 242920 -101586 63292 280497 270162 254014 -270092
17312 -173922 35773 209549 -128595 223733 168750 222621 186275 102468 529903 -2056 289675
17300 247266 187341 151412 330707 285818 142872 271571 502803 23802 166402 361625
17290 361625 42714 196985 298065 260815 271758 35466 243453 238163 219727 42162 -224412
17278 214251 115661 266279 452069 52549 291754 -20727 288216 983 228982 525630 259625
17266 251788 710625 -22546 242895 127069 349529 320233 145587 215181 104632 190786
17256 190786 54382 258809 251428 331116 357349 237168 135591 156907 100636 293515 202156
17245 202156 259054 -146621 156460 -119650 233738 72829 416203 368504 650395 -135098
17234 285011 459079 33585 513594 -132421 235943 328414 392531 -90259 310146 296133
17224 296133 97898 431912 283024 325746 181403 450925 310583 362792 220798 202306
17214 202306 381107 211516 191551 210361 114833 70663 255017 309081 103149 129016 319792
17203 319792 381212 155952 440713 357031 20032 -33290 176465 254043 239532 296911 292454
17192 292454 322069 285977 215350 488686 333548 223368 330129 80582 309208 -210772
17181 143496 432062 227080 249382 189001 257311 394703 123212 522324 698786 105484
17170 398591 427270 158250 396841 297782 567463 616757 138844 101363 39868 905127
17160 905127 224573 229718 678820 437089 249044 243345 5923 704086 370582 177703 412918
17149 412918 250858 223702 26810 237539 -43387 213692 317886 303744 381965 395284 447234
17138 447234 319746 358677 1963 225846 455393 347405 213766 458966 78162 253520
17128 253520 305990 621762 269263 242261 480698 449836 384894 390256 426999 436745 355957
17117 355957 255651 411832 324434 456855 386226 365437 438125 490696 216277 441429
17107 441429 276528 386464 388382 370455 341773 209131 453091 621840 96666 473249
17097 473249 345126 260387 418006 380194 516490 578260 -5762 575908 454571 917699
17087 917699 186579 363789 427393 418720 484865 504939 730925 567328 518390 438444 548346
17076 548346 631357 303534 511995 146414 430564 331331 683958 719114 434426 503180
17066 503180 323148 144430 871154 385940 299310 201759 643818 436233 692531 951224
17056 951224 557394 684532 387491 603454 409804 718700 445807 720405 480455 592004
17046 592004 490682 836422 586626 375329 569418 805325 377483 611316 643243 901060
17036 901060 643084 745403 403653 511180 698360 452147 558979 386987 505505 496057
17026 496057 743643 696219 265839 1048578 662753 611602 832826 813160 558302 722568
17016 722568 935512 616686 679953 749074 601107 681479 602315 767701 419695 889211
17006 889211 719631 735434 891089 655793 911168 708226 806743 885356 613821 875341
16996 875341 1012446 532786 925981 946222 1002585 672370 787100 869384 1067643 821127
16986 821127 772864 628712 1096484 1036037 1098789 1102946 870495 1063563 689388 890134
16976 890134 982202 1102937 994087 916995 790321 983223 1167570 772446 967995 853753
16966 853753 866477 1011176 1122147 1008563 958746 902947 1052949 1154344 1307051 1017329
16956 1017329 1294068 1160406 1295147 756977 924922 1332497 1298347 887681 1225439 1053306
16946 1053306 1132542 1091166 1256107 1075121 991272 967281 1313101 1215917 1138296 1193345 1060011
16935 1060011 1374165 962811 1177812 1501192 1737539 951276 1258480 1285356 1441420 1584517
16925 1584517 1549444 1198392 1358762 1404652 1586918 1358473 1346912 1802483 1507700 1799616
16915 1799616 1433818 1727382 1733298 1716587 1500636 1713611 1618111 1568123 1773023 1640773
16905 1640773 1705524 1854290 1571723 1922730 1717637 1770945 1720037 1893970 2084418 1977679
16895 1977679 1955944 2195314 2022912 2161789 1678217 2050783 1907771 2317603 2154906 1744480
16885 1744480 2171535 2165048 2120755 2270136 2462906 2437486 2564419 2315179 2676307 2438927
16875 2438927 2500407 2673813 2385827 2481770 2570629 2219520 2657980 2520696 2541223 3011427
16865 3011427 2582231 2894203 2624723 3186216 2856635 3043327 2751818 2798775 3021183 3272940
16855 3272940 3121390 3470599 2769070 3204890 3510759 3239639 3541589 3718324 3185567
16846 3185567 3499790 3815412 3501356 3429966 3395469 4026549 3998562 3775200 4096864 4299946
16836 4299946 3842701 4175173 4023842 4265437 4287186 4081043 4250537 4416532 4532802 4782751
16826 4782751 4558716 4774353 4913654 5011558 5471337 4949618 5287791 5185276 5573589 5359468
16816 5359468 5639442 5783864 5934368 5978345 6068443 6104536 6285069 6325734 6661612 6705342
16806 6705342 6935183 6805168 7250743 7239155 7191249 7699829 7783600 7673788 8153228 7594668
16796 7594668 8549262 8631522 8551841 8925986 8878134 9427191 9534022 9506829 9939583 10327254
16786 10327254 10399834 10495255 10666163 11115448 11340421 11995176 11921494 12582612 12415442 13320249
16776 13320249 13669093 14092783 14016494 14609740 15209052 15723978 15740755 16812454 16744022 17304146
16766 17304146 18002643 18468306 18889918 19565152 20506554 21138397 21682025 22384893 23430330
16757 23430330 24105007 24747580 25751311 26897455 27818694 28895260 30093067 31477001
16749 31477001 32171489 33754621 35457376 36799852 38505509 39986934 41717306 43684663
16741 43684663 45865486 47401052 50106097 52540345 55003048 57937193 60813822 63799107
16733 63799107 67325222 70888638 74737120 78669360 82714590 87101279 92238441 96917319
16725 96917319 102173691 107760770 113672529 119466028 125530592 131786908 138192511 144557162
16717 144557162 150810212 157110361 163101970 168488739 173504073 177924153 181347273 185016044
16709 185016044 186602191 187634926 188105809 187089781 185055176 182587427 178785228 174303027
16701 174303027 169410769 163676125 157875805 151979582 145211420 138382425 132208396 125795781
16693 125795781 119723231 113551844 107698250 102142638 96598989 91594182 86688246 81557129
16685 81557129 77685908 73862167 69641988 65893497 62532642 59589628 56291174 53584623
16677 53584623 50904097 48415833 45955980 43777733 41728512 39951786 37845549 36182608
16669 36182608 34738791 33412596 31835232 30358720 29182511 27819765 26794270 25688578
16661 25688578 24968136 24024100 23308359 22304503 21462918 20378006 19695506 19010843 18523101
16652 18523101 17944887 17227964 16700181 16220216 15508071 15247407 14685968 14170979 13928968
16643 13928968 13399213 13139791 13035777 12346288 11901587 11579159 11274738 11126397 10602917
16634 10602917 10539092 9909780 9599573 9179392 9279486 9258509 8814026 9048907 8440995 8195663
16624 8195663 8057047 7943089 7705248 7255803 7305993 7069740 7335415 6634705 6932808 6401385
16614 6401385 6183985 6157120 6119113 5873514 6057426 5852731 5758827 5390355 5313763 5374867
16604 5374867 4963696 5160389 5215342 4971766 5074168 4635822 5045108 4520579 4339165 4327772
16594 4327772 4267890 4517713 4154913 3988628 4279861 3847007 3720179 3883105 3923834 3596969
16584 3596969 3690865 3476734 3477227 3532029 3371184 3278994 3258339 3518816 3340503 3185169 3129678
16573 3129678 3045897 2960706 3127043 2655972 2721529 2821004 2873919 2574810 2378874 2797076
16563 2797076 2603894 2406881 2564141 2581890 2742384 2534185 2316774 2136801 2137581 2124428
16553 2124428 2132905 2411563 2226776 2267146 2218036 2028654 2140215 1903658 2286976 2013205
16543 2013205 1979347 1898172 1768331 2366928 1631472 2066386 1883548 1730933 1833587 1651800
16533 1651800 1942718 1652195 1984283 1374498 1787112 1588339 1239746 1699021 1367263
16524 1367263 1313496 1666120 1690181 1498853 1579462 1434568 1566897 1575070 1466305 1388307
16514 1388307 1257896 1292911 1449955 1245015 1661889 1348188 1447562 1564902 1119211 956874
16504 956874 1489783 1253791 1351441 1079677 1148543 993257 877097 853948 968757 1179247
16494 1179247 1023786 1183381 1087643 954733 1029337 1134680 1063305 950903 978054 945086
16484 945086 1042195 879365 841637 923286 1189464 1025046 1065002 954723 1072422 1001375
16474 1001375 844455 996593 849572 1109492 728425 982704 674460 907355 676910
16465 676910 686391 592368 846163 716720 1032221 862720 903476 786399 707107 875468
16455 875468 421839 1011302 414256 1077653 493288 763944 719122 654814 352257 453882
16445 453882 759029 610619 346023 785401 658969 532918 696979 641172 355561 565584
16435 565584 513101 731222 481048 773671 412501 531649 810433 470301 659833 418593
16425 418593 687272 542154 387952 524334 472253 441639 730440 487677 568019 803502
16415 803502 216929 406688 240097 544472 496172 663219 437936 212714 746675 729756
16405 729756 223360 60919 367054 655893 600169 728269 528101 760006 358771 552745
16395 552745 222180 162607 715069 703362 550135 18366 250073 121930 537730 409504
16385 409504 360753 517533 161304 381453 528642 647369 307180 469526 499266 90099
16374 382666 290478 500873 295250 215624 262153 156075 106194 66583 164393 181679 113354
16363 113354 510011 548616 160525 90846 73834 424432 24523 432620 270261 174444
16353 174444 387718 475975 576184 137624 442429 389543 580316 -179782 237342 -12468
16342 202793 205470 -26814 403924 109596 619066 56924 -43088 603641 281326 192301 382907
16331 382907 -149609 514410 155533 299832 406551 1176 247930 423331 61588 -99991
16320 84304 117871 274719 354119 198145 126057 399186 81158 435138 315502 233936 434819
16309 434819 366252 487959 182216 498395 201591 278512 -27155 79630 232224 383394
16299 383394 516548 424522 -171547 457361 88200 206456 7778 67227 306097 88381 80664
16288 80664 49629 1031 306234 556843 -32985 -70617 187233 282742 326100 278623 73933
16276 156357 -28407 164497 259939 241427 209705 484287 560685 -261115 64415 -56167 -48032
16265 -48032 219703 46557 13451 97133 -50608 88339 -314560 -93141 60938 408300 142108
16253 421288 -135862 112658 56484 371140 37449 330695 315693 133639 96268 -5306 -244553
16242 -244553 114981 178984 429633 181056 410122 92651 146053 14332 -6468 125417 181719
16231 181719 -58113 319881 -89298 291784 319811 120372 184700 -145485 -2474 99208 515884
16220 515884 127866 8841 220932 131578 182421 362473 215179 -20563 -23196 -262822 -113603
16208 175910 -225079 169781 15447 -12350 36670 -155771 51938 189443 605589 238198
16197 -291512 -215021 170772 -28866 -104142 100198 87596 -190774 155820 30921 116922 336952
16186 336952 -138499 298408 129091 71016 181744 64408 289478 193020 107611 -38283
16175 -51384 131664 129926 -245294 245994 186219 -141969 -123856 -81279 -43105 -102515 47381
16163 289642 305100 392075 -236966 22722 77112 -112157 -59772 -326332 -283765 65486 -294767
16151 89662 -18861 38051 -1668 140040 34442 286303 177814 -286163 -373932 -90345 -212987
16140 -212987 175733 -97814 272057 -139908 296963 -109443 -249952 62913 197575 11967
16129 54389 -103709 71608 259886 355451 -156371 -195421 252685 24192 3979 34729 -175335
16117 -12355 -295659 -89503 236990 -232921 43399 9255 29828 -45378 -48290 -55601 128645
16105 175946 244334 161209 65356 -131457 -258515 -32814 73547 -103262 39778 -46954 -49655
16094 -49655 -137724 103062 122677 309959 -19734 198440 53993 222379 289413 108508 150287
16083 150287 81857 64922 286942 203671 -143699 367060 -7219 -43985 183282 6433 -245375
16071 -317711 249142 39150 -26931 -39309 71198 87679 -42969 -300289 422539 -26710 -155989
16060 -155989 169266 68428 -91584 -33245 57935 -113260 9952 -142469 89718 20880 222341
16049 222341 -171042 159275 214400 168542 -215788 -114134 -7569 -226715 28984 -101598
16038 139052 -222097 -62269 -11589 334453 144582 -25871 -120986 -102156 -39867 -54694 167480
16026 -101530 60543 -188599 -194961 44516 -233433 -59672 -28194 -170850 -102685 -191366 83574
16014 -42654 387552 -239263 -52540 -258014 -332337 -102976 -38555 74668 90122 -105794 -23623
16002 -169451 -69937 126241 -380218 -348445 -17461 -117529 179152 -24084 -119098 8878 330924
15991 330924 126500 -151647 -146304 -57307 -102128 -2685 -270233 -363571 226855 47003 90397
15980 90397 218769 -131794 -278880 245369 -90380 161964 -354844 29442 97601 98975 144183
15969 144183 482153 119847 205997 451671 260660 65808 131458 284372 -47221 -223959
15959 -223959 68720 -291008 -225864 215796 116719 -1865 1165 -38049 510095 212477 -190554
15947 3651 481776 73515 103380 -292387 -273141 -136271 -156257 208655 -130759 196891 24961
15935 -277197 -284725 -71623 91359 -31892 -120059 156427 31242 268529 -193960 -433945 -58623
15923 -54478 -47003 -220177 -36661 -135121 168988 -75981 -208548 -198028 -43147 -179084 -120460
15912 -120460 223370 37415 -553261 -4017 -154601 -133221 37234 330662 87414 134863 14903
15900 148675 -242468 -76929 -80751 -118241 115195 -281513 231822 -93256 -248990 -97557 -175900
15889 -175900 -69587 72665 -162812 194748 26489 -218940 -198603 214980 115129 86681 66634
15878 66634 -26882 196191 183137 -323493 -149287 -47345 335703 241784 -66564 187887 -314811
15866 -257984 28779 179605 243387 -204640 115189 -29291 306568 56623 -169098 216956
15855 -100663 -252181 -18410 171883 -417975 24414 -232920 -95427 58688 -392832 24278
15844 -173558 87535 -152579 -27238 -106610 154328 133710 -76407 99183 -256568 -261942 72704
15832 317731 -105860 -28302 13292 90709 211622 -402900 -30636 -412041 -35390 -33665 264874
15820 277624 -156569 -9585 241292 -229961 -154657 36639 66286 -354346 -41977 -10405 -101528
15809 -101528 -97905 344182 -6745 41511 -56772 -29752 -89383 -203712 189498 -210702 -55874
15797 -199984 -105921 45991 245036 -226672 -149573 -212082 -125171 189876 -198508 -142343 -115742
15786 -115742 -587492 184674 -73244 -212936 -171177 -123532 -79623 -96599 176592 31847 67767
15775 67767 -61864 139293 -5852 -15734 4003 2114 126202 -232466 29059 44935 -78294 -88525
15763 -88525 40112 -132214 -76095 -178071 60869 186988 -13608 -128521 -17854 -6055 -297127
15752 -297127 -101064 83527 -233136 -166588 -57047 156860 -175017 -37015 -172665 326370
15741 41572 134931 235278 -68156 -162891 80698 539603 71265 -231699 326661 -31835 324991
15729 71513 348590 -114830 -213399 -224770 -138706 -137067 -53177 -250359 -11977 -419199 -127491
15717 -331551 -223341 -123282 -450238 -168947 -342272 -93672 -6610 -156356 148294 35852
15706 131574 265083 -53994 84868 89449 125342 -239969 -118317 84093 -21169 214 83774
15695 83774 158534 -104529 -72328 24839 -285695 -248801 279417 253803 254812 244471 62749
15683 -42420 14499 145393 -136701 353791 94663 360821 57315 -220753 22650 19836 318685
15672 318685 162803 -119003 117868 -201720 -37772 -344565 -110763 -134204 -59357 42658
15661 -146373 -67936 -84320 -273016 -115848 495772 -299133 16697 49877 170716 268111
15651 268111 245166 1470 208664 -3373 6051 -281577 -304892 -181195 -182612 -136616 7481 -166280
15638 -192920 -19923 216849 -32457 102876 -126096 249794 -131204 -208404 -155693 -77828
15627 -191510 50094 -99495 -109884 -97562 -254212 -7088 119458 129223 143329 -169030 -88049
15616 -88049 -220016 114781 -306798 67178 222104 28278 -200754 118609 234853 -11091
15605 -106288 -190201 -205489 192266 -316354 137194 -108814 352070 -192691 -153180 -132397
15595 -132397 62 25941 71512 38577 341297 35824 123886 -302983 -129502 79036 132384
15584 132384 -6940 -45199 331678 7651 8707 -151212 414111 -69154 -385736 -241215 -195114
15573 -195114 141106 -14464 235891 37916 -192105 -22293 -261162 95132 -102626 70438
15562 -68083 -248147 -92295 -258889 -62479 52726 30866 -132930 -59479 391663 203531 84484
15550 49020 280908 -96965 -205486 -91087 -232800 122975 -7040 -132477 189818 -459850
15539 -17295 -84004 116626 -141907 -127934 55463 143181 299248 -196520 -67623 -57949 305476
15527 2118 27868 164613 171430 -21372 277477 81931 -172382 317256 -52934 -90779 -110384
15516 -110384 1775 -78699 -114243 -4793 -284278 75591 -56545 28596 77485 -12918 251938
15504 71836 13518 -186519 262216 -6424 -83474 264234 92797 102168 -145771 124022 -77889
15492 160449 -234554 -8322 327239 15043 -134380 -359883 18766 13622 91455 -87843 -159896
15481 -159896 -203209 32278 133265 -287097 87712 13756 -44856 247445 136113 13645 -70903
15469 100782 -307284 -13662 225442 -187786 -165698 -114401 -23217 -11038 -205940 151826
15458 -53122 -258731 39697 192450 -159046 144383 -111135 17065 -34621 43147 -187487
15447 -52449 -132711 -93522 119475 83489 94807 -73177 -61123 262952 -135069 294983 -132260
15435 69398 85711 -100805 -28355 254377 -181102 -69672 -201638 -274228 -119366 -286199
15425 -286199 51775 169694 -211321 -278389 284838 61081 -390700 59496 -81869 8869 37626
15414 37626 367914 438255 279659 219387 -71507 108199 -413540 -5652 89424 320404 64183
15402 -178097 -152736 -27557 -182422 -52786 -78605 -243789 215869 -98387 16183 144821 116879
15391 116879 122849 211298 -87282 143869 77568 102443 202200 157026 -45034 158456 -14865
15379 -381887 -155723 -115500 173290 -143464 113461 -26306 212377 -70005 -69061 9611 -14119
15367 287593 60801 -218604 55665 141427 -280264 -98824 -79810 154877 -54243 -320466 -125657
15355 -57981 -202883 16091 84587 67634 202247 165320 127582 -68310 -9747 -61196 -62906 -51462
15343 -51462 28511 -158710 147512 -46168 -190883 -141077 173265 157133 288653 -89079 -13365
15331 51453 41046 57972 54993 -154110 -146433 89222 131049 143565 -55478 -128947 -14350 274778
15318 -25393 149685 192833 -233795 -321155 -252917 -59147 -203362 27454 -112265 29543 -159649
15306 -46314 150405 -72901 140110 -225474 219976 -312295 152128 22340 32969 156564
15296 156564 173498 -125885 -10336 128047 -261422 8043 47923 365891 145882 -301391
15285 98917 -59631 199635 158525 143484 28168 198659 145370 112608 164718 -155228 12306
15273 252082 72506 -404895 -69262 313016 252835 -147867 -52785 -19659 84960 283058 224844
15262 224844 -102782 232518 -11694 -80917 403937 288279 -8792 -113237 598 369194 29547
15250 206659 30536 178604 530820 -122112 109114 160934 -38359 250471 -23644 -35586
15240 -35586 338585 7314 188845 470596 530262 338844 408489 807610 1657326 1217368
15230 1217368 1318151 1001296 409003 104195 151973 274334 246815 205166 111180 342104
15220 342104 -44936 277163 -71647 434591 9648 -210430 133742 -15775 107445 176608 5760
15208 265368 71237 449073 -306623 229443 -59357 -351017 -209704 168250 -13101 106568
15197 -11381 -38227 193895 -188746 -307183 5596 -93537 292509 -68798 -89446 -45621 74208
15185 549096 228930 -85709 -182484 -146579 174348 108951 235102 118284 222904 114497
15175 114497 329173 -68779 -8207 92790 -121791 275485 -61821 45326 67813 11518 337000
15164 337000 -52230 80699 49178 -341934 59384 -141288 91294 -149983 225509 266912 60711
15152 141346 311971 -10227 124200 93597 292077 297813 -66385 58300 116703 43517 44211
15141 44211 -66758 136300 -31443 35305 -41638 90002 254859 -84353 22312 256693 -131756
15129 49203 -95769 -40393 196722 384940 -57451 3891 169785 9388 220720 94816 243055
15118 243055 302765 375939 34574 200414 222736 336997 26469 230174 -36553 173433 244361
15107 244361 -107354 296693 -25502 187672 142443 6334 -30577 60367 -143285 299522 -97844
15095 332091 274228 196727 271807 16171 105543 273391 263744 -33754 69536 204083 128149
15084 128149 -338387 2765 -151943 338615 236503 64812 287704 189218 210885 70459 373294
15073 373294 98062 121854 134635 190813 -81393 324329 278660 357205 -87635 332744 -52909
15061 80257 -80518 -243021 -196990 536962 23689 76928 8265 89300 -17701 507686 65282
15049 755065 293407 -87110 -4501 188366 85860 296909 14953 119833 -232971 -124069
15039 -124069 90048 281146 159885 302162 186611 353975 319524 -135602 182885 137790
15029 137790 131099 252404 125583 332356 -154938 248410 188737 299880 48337 -46417
15018 36227 116363 -25170 195515 284145 -86749 -36005 207706 97491 -82916 454746 369182
15007 369182 139964 205324 134727 193604 390311 385261 378543 172935 -94990 -123361 234849
14995 267878 45334 363953 241091 -113072 256907 275091 172983 133467 136679 625815
14985 625815 25710 265081 222930 46206 -83227 564319 300984 114703 193049 122215 340392
14974 340392 526844 341215 251441 388134 401186 519 500099 63414 158377 358621 503497
14963 503497 386185 243257 495455 138695 278770 386547 358357 360472 228354 246567
14953 246567 61440 482625 237279 361917 234851 211422 329687 44326 55354 392536
14943 392536 469505 395572 391746 369083 543176 -57013 253884 303701 308394 459619 511874
14932 511874 391857 235749 283001 247400 275608 43264 422278 281415 291194 231755 134077
14921 134077 235696 408386 495 405707 259123 634389 483851 374965 414294 434986
14911 434986 262017 548221 237788 435177 217298 191387 420318 -89323 341778 397151
14901 397151 226433 394171 897919 600644 588552 426008 504472 163618 46061 318687
14891 318687 269983 377369 32656 381156 229805 314637 855064 345533 127073 352347
14881 352347 90426 627811 502756 484894 299221 502820 469704 218513 357814 337201
14871 337201 33272 336820 108155 433385 70878 153529 340336 -185678 557644 422864
14861 422864 293368 675679 186703 569253 500134 181303 264143 286439 -56467 668421
14850 262945 267669 561818 486660 443347 619379 537209 244303 336216 602888 376059 524337
14839 524337 208079 315294 434329 461751 405354 233663 391494 949251 481914 486156
14829 486156 258948 235093 543866 607351 474739 -3313 480031 613832 606889 658354 352055
14818 352055 531372 696348 523611 335043 660877 508086 724260 406590 505569 393923
14808 393923 384412 653775 523625 248869 603686 564163 752959 650852 641972 472849
14798 472849 258219 626494 582274 613220 779943 237317 456544 410871 378910 383208 917994
14787 917994 574498 628023 702420 666181 173082 415603 691955 423753 170479 789323
14777 789323 640106 679905 596311 809804 725104 512000 303205 705232 519553 597113
14767 597113 604858 617326 663563 569142 664069 651512 371059 248016 523548 802485 574064
14756 574064 675778 1029282 626996 746081 407932 789082 536292 566191 630147 789652
14746 789652 919628 730642 586795 657589 780077 562628 814482 404898 962552 643281
14736 643281 416244 911162 778104 676239 557115 489036 764724 766185 1010712 686576
14726 686576 587318 758804 996867 514923 746826 826801 679101 1132564 1020460 839251
14716 839251 557519 876347 615300 963431 793939 860915 735262 963311 1016185 816528
14706 816528 538737 1061069 725931 962892 815593 706768 692246 1246741 892117 766299
14696 766299 986816 1172595 1218236 1190033 928674 797725 942307 852926 999407 588719
14686 588719 819480 1102018 1110742 893515 611119 1045458 1003739 1076189 1300264 1234515
14676 1234515 1155030 721798 958277 937092 991443 1037211 998051 1058474 967549 1127775 1546792
14665 1546792 912369 1326341 839466 1230163 1089201 993749 1019227 1175331 1191532 1402314
14655 1402314 1003889 1213892 1102041 1230894 1288318 796925 1374605 1299193 1359313 1010246
14645 1010246 1205319 1363551 1062690 1154428 1175481 1482827 1274543 1445736 1370333 1167515
14635 1167515 1045114 1152646 1344725 1133892 1096435 1319084 1233696 1409164 1289702 1443803
14625 1443803 1512038 1404029 1272687 1415153 1649030 1013824 1114551 1478266 1315758 1224935
14615 1224935 1553922 1305527 1457782 1707642 1207257 1430015 1599253 1439278 1673085
14606 1673085 1538193 1674043 1700225 1587052 1425030 1599481 1802317 1424311 1745028 1734202
14596 1734202 1551555 1771237 1744350 1749992 1775124 1853145 1617528 1939393 1779096 1916121
14586 1916121 1961094 1688973 1970664 1751050 1821035 2088318 1913913 2081470 1703252 2235596
14576 2235596 2074131 1934713 2369582 2032124 2126705 2198881 1999003 2367268 2218089 1804957
14566 1804957 1950662 2280604 2396368 2325877 2165369 2582057 2477217 2382534 2491806 2280811
14556 2280811 2364553 2438365 2435272 3087832 2594651 2850054 2820465 2912684 2963025 3194969 2773776
14545 2773776 2992087 3163858 3469498 3527469 3578848 4279215 4719269 5060321 5862374 6654687
14535 6654687 8179253 10542397 14493087 21450472 33182487 34903218 20746463 13460834
14527 13460834 8110576 5601461 4071273 3246757 2933435 2857069 2844716 2512714 2634118
14518 2634118 2758425 2457750 2626694 2455435 2772712 2532412 2446861 2435401 2742748 2640526
14508 2640526 2760849 2806963 2727536 2904354 2873043 3168952 2951757 3302271 2923272 2742643
14498 2742643 3159656 3377346 3043126 3025481 3257598 3426700 3297372 3389378 3338284 3395005
14488 3395005 3171666 3027849 3289621 3458699 3579296 3352409 3744799 3590775 3509017 3839364
14478 3839364 3862634 3477150 3817349 4005892 4132461 3990721 3747471 3993512 4171221 4018072
14468 4018072 4194328 4170668 4255083 4545729 4431510 4331242 4510254 4420488 4377263 4842465
14458 4842465 4662664 4679766 4714812 4906550 4874625 4737310 5089716 4703899 4975825 5276649
14448 5276649 5044651 5288001 5198965 5442705 5765039 5586349 5695941 5428494 6202882 5765915
14438 5765915 5658646 6034877 5766301 6119279 6242534 6202036 6253047 6304490 6359445 6806467
14428 6806467 6687428 6625783 6513019 6739963 6885012 7025930 6907540 7439858 7121091 7370300
14418 7370300 7516587 7843956 7540039 7848294 7541872 8015584 8099644 8412940 8563213 8784769
14408 8784769 8555869 8879421 8817035 9159902 8802612 9040314 8971421 9317778 9605421 9660480
14398 9660480 9982133 10060420 10040452 10358424 10279700 10762637 10661716 11119432 10945999 11209177
14388 11209177 11589500 11450575 11926643 11951014 12015195 12178671 12238152 12552019 12898745 13177630
14378 13177630 13442348 13682442 13553876 14200177 14196469 14509413 14798490 15137234 15441046 15569318
14368 15569318 15994584 15952859 16387720 16826915 17001064 17075632 17769894 18262046 18628514 18956804
14358 18956804 19039947 19574253 19596306 20379071 20884932 21080868 21615570 21793345 22397818 23017109
14348 23017109 23540782 23883915 24351273 25254552 25395928 26376389 26779039 27445442 28158096
14339 28158096 28540781 29241180 29984400 30807373 31573417 32297454 33203968 33865651 34932366
14330 34932366 35415825 36516516 37412678 38597392 39422448 40383736 41918510 42817474 44113965
14321 44113965 45234186 46555336 47994865 49504701 50896432 52438878 54269119 55533178
14313 55533178 57440178 59447811 60918309 63110856 65104950 67445778 69801365 72295331
14305 72295331 74857295 77429745 80371474 83055799 85991710 89487919 93129030 96910981
14297 96910981 100383020 104404239 108947470 113330197 118020388 123156166 128137234 133344428
14289 133344428 139743187 145673366 152260124 159158487 166411286 174045992 182439294 191121094
14281 191121094 200259488 209650220 220085888 230574269 241820260 253777140 265602862
14274 265602862 278623660 291859426 305944775 320350193 335333871 350057212 364425756
14267 364425756 377878600 390155831 401962261 412640518 422573152 431400229 439752863
14260 439752863 447261626 453078870 456575315 458974106 460532558 462351868 461275261 454540130
14252 454540130 450089690 442301701 432962994 422845430 411019288 398489002 385726347
14245 385726347 372362808 358765649 345631359 332652641 319175014 306254946 293291288
14238 293291288 280706042 268342647 256669558 244999382 233601195 222867581 212186847
14231 212186847 202173232 192535220 182999390 174219324 165653103 158095103 150521082 143849834
14223 143849834 137683021 131584435 126105489 120710155 115294723 110884627 106269817 102344299
14215 102344299 98434030 94370100 90820803 87492997 84173247 80866983 78008781 75280539
14207 75280539 72511408 70080624 67701662 65854439 63377698 61302416 59388068 57546649
14199 57546649 55747902 54100787 52610662 50900052 49043300 47868051 46825184 45645722
14191 45645722 44501842 42889487 41510226 40494666 39680573 38903005 37563908 36561062
14183 36561062 35505365 34988527 33927797 33376149 32441901 31616147 30768868 30185047 29191399
14174 29191399 28480350 27926208 27520015 26426392 26401932 25578901 25082667 24218905 23706105
14165 23706105 23115814 22805038 22368684 22274079 21394117 20971402 20765341 20474828 20040925
14156 20040925 19489410 19162501 18922490 18375899 18070577 17618779 17362650 17142112 16933264
14147 16933264 16492506 16511332 16489740 15422990 15313377 15307657 14941203 14780902 14406977 14245441
14137 14245441 14001703 13546995 13533185 13404465 12864760 12766155 12591609 12600602 12410466 12079439
14127 12079439 11825306 11832300 11724613 11325006 10898540 10981051 11138001 10996431 10565438 10497376
14117 10497376 10397455 10077035 9972315 10299172 9738442 9282543 9359862 9289085 9238459 9069272
14107 9069272 9054129 8941106 8796357 8823316 8705794 8227034 8245297 8190404 7970439 7993695
14097 7993695 7401941 7676483 7451038 7487973 7437494 7484033 7377030 6957959 7287312 6961588
14087 6961588 7229954 6696937 7090845 6648373 6494939 6567265 6430797 6075738 6163406 6408594
14077 6408594 6188719 6351378 5879194 6054027 6112650 5580542 5800389 5702655 5708451 5654593
14067 5654593 5435984 5374179 5468765 5506838 5396179 5022092 5124469 5221214 5089140 4826781
14057 4826781 5058841 4839319 5141441 5194289 4938997 4741951 5010164 4449845 4705626 4698120
14047 4698120 4604367 4683653 4255334 4401138 4530497 4246951 4544638 4235632 4047461 4108506
14037 4108506 4280454 3974936 4482942 4055686 3998729 4033697 4025913 3930809 3842901 3743870 3623183
14026 3623183 3471447 3419381 3669683 3733964 3324160 3702337 3493776 3614502 3246216 3452029
14016 3452029 3505492 3140532 3545051 3363114 3528051 3247457 3245775 3487173 3137119 2975314
14006 2975314 3231061 3262001 3337108 3234174 2397740 3068490 2716279 3011174 3155642 2837655
13996 2837655 2732626 2454045 2848060 2824486 2699272 2902221 2334383 2716236 2554670 2747132
13986 2747132 2396550 2533298 2545387 2576501 2585205 2409033 2750943 2902420 3526459 3475575
13976 3475575 3571646 4957562 6609781 9547670 15899888 27397531 36613584 23726202
13968 23726202 15563303 10984144 7720927 6579675 5390980 4800878 4428442 4061105
13960 4061105 3876244 3619885 3403426 3097849 3046244 3048320 2868281 2900044 2962922 2650662
13950 2650662 2638876 2497339 2664023 2659662 2544862 2323231 2478136 2265466 2654637 2535315
13940 2535315 2174993 2432870 2248417 2224562 2206696 2179674 2139962 2062019 2438082 2261677
13930 2261677 2077060 2060851 2157260 1921371 1561883 1968490 2271922 1799656 2019722 2261464
13920 2261464 1909958 2155676 1728075 1822741 1773280 2107609 1891800 1985059 1937671 1788546
13910 1788546 2043674 1793337 1543774 1699763 1729728 1920666 1677976 1501244 2111928 1794322
13900 1794322 1498857 1655253 1455761 1686205 1752039 1668769 1749942 1811662 1757225 1723087
13890 1723087 1447362 1766188 1834933 1705680 1534472 1668249 1466368 1732227 1687518 1572805
13880 1572805 1568691 1627497 1471704 1738930 1493685 1095793 1449958 1424062 1395921 1375412
13870 1375412 1487028 1569190 1482865 1241203 1281738 1604843 1321860 1269999 1275420 1647357
13860 1647357 1338621 995064 1366961 1226405 1105589 1356125 1234948 1150064 1158527 1089686
13850 1089686 1145040 1520270 1099011 1382510 1256445 1220977 1112170 1427632 1004345 1290853
13840 1290853 988537 1049182 1074048 1309578 1362050 1046617 1259091 973971 1448229 932587
13830 932587 1233675 1035544 1140626 1016695 1124174 1262585 1169413 1018392 1003727 858431
13820 858431 1215383 1324786 1074732 1310001 1005555 1214612 826288 976258 1064953 886012
13810 886012 1099354 1009300 1053656 957148 723958 1028565 1187066 1106854 1074897 736892
13800 736892 1097106 1183406 805206 1025323 1126263 866764 705466 1090134 683811 1129734
13790 1129734 726017 656593 964937 801710 640794 1025930 766887 865403 760143 744650
13780 744650 906391 733367 571720 871256 954021 1088435 872488 938009 698683 1087351
13770 1087351 738037 811419 792227 1237180 796795 845019 909662 653324 712764 877311
13760 877311 1208504 1029202 756375 512454 754167 793168 781330 597487 783458 943416
13750 943416 843474 614959 552880 539786 994214 810059 957074 918543 325330 927677
13740 927677 852850 754326 783454 954994 692753 797058 550039 658719 652877 691232 522094
13729 522094 696276 577227 681601 363579 1027139 372085 617981 517691 387937 845203
13719 845203 833275 800435 365979 573319 435367 661141 638275 677158 847793 579362
13709 579362 805638 575346 565315 745437 697787 393708 469415 869373 596670 646418
13699 646418 467586 659121 649073 674438 515237 336452 860622 565771 458811 551840
13689 551840 877951 496015 426479 773854 651346 795710 429132 372829 534727 191369
13678 713032 403630 933979 972406 413199 810245 99007 364943 581509 498793 612623
13668 612623 734687 717626 610538 504368 266886 495424 616177 715043 505398 865819
13658 865819 226482 780917 641561 477667 526928 704409 71959 793476 552128 764648
13648 764648 561672 387141 502593 343726 613129 213870 628171 314838 261106 649845
13638 649845 854574 587714 436411 503019 603447 431205 822817 498686 195204 231590
13628 231590 650233 447283 307371 488055 364979 544907 320957 514788 226239 335221
13618 335221 693294 470822 382907 606998 446491 536598 495013 510202 558536 595657 479982
13607 479982 426884 387160 639509 552560 486459 561181 577448 263316 271318 367676 60302
13595 261402 570858 312445 391516 412096 402134 478277 465246 622918 391290 146340 429159
13584 429159 356619 525073 417055 76493 570746 654550 579797 264711 417891 609187
13574 609187 357784 545735 395581 801024 417534 142318 265212 291274 717972 723610
13564 723610 506212 762213 485366 250449 10169 431784 349777 575960 711026 453746
13554 453746 395975 357459 360605 293512 349720 538470 366224 288886 122652 -19989 479300
13542 750524 542711 388932 616114 362429 544408 426157 543669 413071 567184 423372
13532 423372 491110 61523 150475 406694 232808 -177732 558750 367712 476062 503144
13522 503144 421570 20747 250286 340195 382498 710804 362957 294446 307111 214470 388918
13511 388918 453098 262108 329104 383746 186699 148270 465335 421478 261971 320212 162420
13500 162420 490945 87041 401819 207468 282357 191389 792817 275924 350841 124285
13489 168979 106016 197966 69228 85469 320435 376346 266535 309184 572721 129480 270909
13478 270909 200019 119708 261455 526364 362318 276879 572260 86326 292663 283152 282631
13467 282631 167223 85920 390313 649999 219625 331408 174992 328465 373892 -125104
13456 35121 344998 38349 -116366 82365 -50273 75020 623190 364803 422254 202533 479792
13445 479792 338446 157479 140320 196223 -27700 329299 103657 209032 133012 85731
13435 85731 139297 -55735 659716 52579 505776 305801 401339 405449 232034 249217 239470
13424 239470 292893 144476 310581 209458 203040 334065 395835 537436 239249 320794
13414 320794 397277 522008 310809 388132 171791 206726 457937 58873 123064 115603 135576
13403 135576 179358 412324 209259 200481 172146 -23783 47001 24945 234159 -9734 467019
13391 286835 247203 226196 332103 -27616 219064 396647 301492 379223 26673 -75591 394286
13379 295146 315170 337242 61093 120059 380323 582068 510919 410067 -247545 230978
13368 77830 174176 -37862 -6118 102931 584447 147876 428845 23903 172321 34111 273966
13357 273966 194228 261807 488330 462768 265411 231480 470485 770073 147266 180443
13347 180443 86957 363968 259819 421587 534210 310262 -99040 201729 330237 329732
13337 329732 346351 175203 242528 261177 489979 138220 267953 472693 532048 111219
13326 702045 94211 -34970 310454 121195 518455 425556 449048 448502 408298 -66630 318273
13314 -65538 322601 112012 360348 692980 178250 188208 311727 221026 333211 -57684
13303 159601 -85789 223010 -98633 250425 241325 2956 169277 419371 287998 72786 237179
13292 237179 189454 212737 -132355 114127 68687 42497 183500 113526 496308 -350978
13281 573934 209798 182087 264176 320709 205775 236519 57973 58147 490370 134119 85077
13270 85077 -52207 -39776 117045 484893 -171597 -97589 392427 81532 112683 53122 166842
13259 166842 -51556 261610 370474 83597 115738 189965 318149 145876 367961 212810
13249 212810 -135243 184793 111504 26653 358283 157729 30670 325229 146752 -167950
13238 338639 -94929 -31702 205964 112296 81959 282662 124521 113329 81763 -110675 101644
13226 93600 208375 -324290 119220 211110 -64941 104253 51632 5472 54881 -37572 149848
13214 -31470 -71787 538063 448970 335764 106684 -123253 447367 180397 395049 58429
13203 -171976 -20879 59630 -33781 140704 255601 -34320 -118444 139257 71642 192279 -8575
13191 -114599 49723 218139 344690 186701 486514 238661 19327 56369 235091 176206
13181 176206 199800 361656 9296 20286 289310 -60294 204947 73897 174033 116673 454922
13170 454922 351867 173185 347783 293843 83329 145950 242636 -278446 382361 84127
13159 399352 328167 120463 -5578 467054 226914 -256195 94295 73074 -13239 168481 235352
13148 235352 5335 362054 460604 298313 -22964 139615 -88556 398112 -37091 25569 259926
13137 259926 -234031 -86711 105351 -179318 379293 -72128 396000 22592 389875 208514
13127 208514 -168585 80894 -79648 56160 -184856 33975 14000 -109038 -87931 268349 -210629
13115 -13424 251295 153079 -67527 171300 -371377 -35955 -25283 -101409 82440 -103782 57787
13103 152120 291026 195959 187835 182141 281048 313625 141945 180644 -10401 108738 30595
13091 277501 9441 184072 79689 282404 -76782 -78973 -2553 -123032 305820 147419 341552
13080 341552 -7285 175389 37976 114534 250374 -14843 268930 155409 -75523 141966 -153623
13068 -577 -59583 -41016 -1005 97969 15995 99744 21396 314214 173879 186849 -125332 30155
13055 175334 -63953 11323 66842 156974 142521 56081 265925 146003 309825 105140 73089
13044 73089 37351 28879 124423 286578 138117 61629 61940 54955 108722 226247 185947 8647
13031 354482 350656 386609 161746 150397 17193 -14000 165252 184503 310100 153219 97857
13020 97857 47887 57498 309552 243346 88714 308435 22583 -159290 -6822 202285 136121
13009 136121 89240 -2343 88373 264745 68458 60288 -24029 147176 -73305 8204 184609
12998 184609 -94772 -118904 264432 -78238 114641 539061 113318 271568 5162 131193
12988 131193 271549 -73295 107325 7212 204015 67828 182787 168869 -150526 181161
12977 80077 53824 -9902 220825 506364 21989 -97951 63844 179172 130960 82007 397686
12966 397686 -8011 251061 158592 -50620 -73080 394913 -44451 -120843 180391 25135 78749
12955 78749 282834 -129614 253871 123879 200544 194663 -134674 170015 -200958 148293
12944 -214294 132800 160645 -54104 -26760 -96388 6378 793 -123678 282307 -59152 5144 24457
12932 24457 -94150 141658 43232 -146791 48252 218164 -112196 281391 -55885 -33759 -38573
12921 -38573 66222 121576 -29056 -51206 314420 175972 134494 46016 141992 292726 -75987
12909 -11533 100616 71747 -309673 41242 -142283 36510 -271955 -191325 61354 -69724 -79941
12898 -79941 319064 40593 -23253 -45338 81210 -59651 -343869 113166 196626 130285 78267
12887 78267 -155613 51709 247748 79239 10298 64167 256029 99452 -94632 -10238 179835
12875 142322 -16772 56011 227611 -46110 -3444 -25924 161619 -148735 -58512 334327 12787
12863 13463 271557 181236 -363304 -315575 -182161 41792 -79980 252878 114465 -187355
12852 107903 -19490 101650 229530 -126644 175338 -59102 74640 103085 -14841 224736
12841 26897 271482 18275 -417838 21101 394497 -76307 -220372 -169708 27412 85742 -148851
12829 455010 216584 96875 -12076 207108 139730 173218 -16163 -65121 237278 -170275 159613
12817 164914 -269476 -83349 105968 -26605 430919 233805 -340921 -40536 169088 -13148
12806 95673 76261 31219 -17337 68219 -20968 371627 -92255 -105361 898 158061 137587 -120642
12793 127491 -303755 238388 32591 -7288 -42550 -20095 1340 -23511 -189833 125180 -110061
12781 95403 -269557 -130451 33025 231755 -112343 -233950 259753 56821 71611 -56467
12770 437415 75941 159357 109717 560692 -128636 -151951 167634 56461 -109337 -312383
12760 -312383 -37187 -44024 -254616 -2315 342980 -12520 285192 93897 85708 -17436 -87468
12749 -87468 24165 459855 169391 373231 93950 -338184 148494 -147785 13162 -53667
12738 116712 -84734 70477 -171944 -67078 287490 98152 133763 -33267 58390 -155146 206266
12726 46726 -65807 162622 197161 202667 20115 385297 12773 350152 147749 256141 62996
12714 41983 164003 39044 117124 109170 36422 -230561 179595 -71924 -150191 -98056 12143
12702 -23599 -101584 -115900 88992 207705 -226801 280192 -95090 200188 287718 296649 374902
12691 374902 190080 205032 156445 340169 194656 74174 283415 -119109 -28273 147322
12680 -20002 12819 190406 46248 28911 12372 -287866 91466 376943 162892 98901 162417
12669 162417 104506 -6845 240888 -77609 409725 247292 75893 -136787 146137 209976 112052
12658 112052 120495 18528 373658 -21008 -6701 -2001 -89178 117935 -86868 66432 33819 -1387
12645 163544 -110042 -214167 290735 247729 292650 -63331 -167397 274203 61656 311694
12635 311694 169764 236611 98135 271720 -131673 351805 -183774 226411 166127 173732
12625 173732 59577 279561 28248 82588 171071 -168873 -127425 39057 273344 434677 217369
12614 217369 166820 169407 381120 -103871 208973 -199000 472988 133091 127853 248087
12604 248087 193271 52962 297710 35189 71649 90500 -300204 165124 1970 -137972 127125
12592 -48490 21066 49216 186705 175023 2123 -88361 -241046 180097 102087 352363 187551
12581 187551 160163 104423 2127 213986 -227721 146163 237966 63247 -61668 286652 -292263
12569 212079 131438 -198757 -55492 -54581 -357339 192950 -98567 55242 -134432 -26866 -33437
12558 -33437 140072 -467439 -203403 135729 -113743 47381 87718 -157110 236873 -111533
12547 457437 -6514 24895 -224211 279994 126258 85095 -77462 -180175 -139364 -61046 229814
12535 -63756 -12788 -63468 197128 134027 -80938 142185 -81667 -104924 134919 -68450 241978
12523 123278 -42743 362969 204221 316584 -36478 102740 114790 -123886 202399 287638
12513 287638 16487 -230803 2742 -225498 254220 56558 174511 175679 232337 222077 83299
12501 136241 60821 258639 -26512 -94611 105555 374069 393387 123275 224104 4429 -260701
12489 -233199 -372746 -24905 17663 49829 154507 177298 115131 -4590 -6288 11467 44247
12478 44247 -20234 80063 -96268 -250562 -28617 4347 -214196 -107303 -34325 180526 90827
12467 90827 194362 248241 -53259 -104552 -101157 104131 38004 -168531 125006 107645 6742
12455 74340 -258745 -254384 125566 -270996 -128057 14274 -97380 -58266 75474 155799 34798
12443 55831 169081 235259 163116 -82031 -230732 -8819 195352 58912 160816 -197794 9898
12431 26385 -143257 -38097 36582 -126476 -220549 -167887 -58811 55733 -143571 -181773 159802
12419 -154365 -53098 188760 -19791 381616 190038 200117 181064 98417 62534 146459 146203
12408 146203 54079 -234659 -130489 -78224 155452 -56800 49329 5924 163367 125379 62850
12397 62850 -95109 46946 -109686 205794 -25354 487665 -50152 249143 -24626 -32896 -130558
12386 -130558 -126399 92963 25280 -113068 381121 242175 136225 82164 -89772 -56190 198115
12374 83091 7378 120733 114661 144581 185652 120518 -120311 192704 269612 -172324 -15360
12362 -14703 43584 180968 -145722 212383 261660 -66521 -7754 157691 111519 -45042 203763
12350 175989 -127506 -104288 -287896 101099 -27639 165534 -90267 -21363 -247256 16813
12339 162210 111798 -161394 -94250 -87532 16188 154207 -189524 27682 127097 88003 102908
12328 102908 60396 -52677 219378 -133280 -52386 221373 185632 282283 104865 253119
12318 253119 -94400 217774 188977 -192773 -19663 150237 120086 -14372 -13829 36673 10884
12306 187284 -301937 66433 -352103 397486 -51400 -260309 -64131 207815 -30201 -105867
12296 -105867 34907 46932 185294 -10990 22855 -27072 -212926 157524 -126350 -359009
12286 -359009 104259 -19113 262758 -184785 44913 112307 93659 93622 123058 888 54421 387873
12274 387873 85941 -198173 349714 171855 -143579 -5073 363932 13618 335003 302854
12264 302854 140305 147763 163570 -17704 78911 375903 413957 512074 229541 261439 34003
12252 91735 239137 202422 43540 -17364 -69774 -158110 295439 227949 -86818 -143580 -40541
12240 276621 120097 266244 42188 52690 161735 387991 264558 -423572 -50584 86121
12229 273464 274417 136356 -89803 273820 214030 40286 107890 32451 -82225 324795 216161
12218 216161 89634 19578 -98850 33902 125617 323340 12905 22681 118034 411579 19259
12206 142747 332819 218567 111800 310477 440531 117372 204607 237584 226427 305266
12196 305266 321717 476368 72065 254984 130215 -295073 233206 97936 476529 74207
12185 309949 175582 137655 258937 32123 300509 343317 314624 69827 51149 205073 287070
12174 287070 92834 -150610 300729 449487 350945 645918 -4114 -1374 157048 -14918 -143762
12163 -143762 -14970 307315 -73831 261111 64152 -91109 68834 145414 252201 51941 52525
12152 52525 13248 -138365 3135 -43930 16887 -154511 12053 -346438 171893 394135 37761
12140 -30799 61740 119941 40613 -200006 -20173 -73000 7549 105876 -51455 -10778 517726
12128 188794 -80205 -100329 -182490 -190576 77032 61207 87718 -135680 -12000 -98425 -212547
12117 -212547 35495 131058 -32417 1916 253718 -84543 -148622 222055 275304 150013 9561
12105 5961 -155532 115112 -22181 -110544 54895 23773 -240790 -74950 82240 -79038 -32945
12093 -222685 102787 31618 -415162 78234 -44040 231758 305548 316872 -242550 -271684 -243829
12082 -243829 -32542 -129220 -78919 144458 100913 -47052 -138444 143664 -9198 -109948 -172623
12071 -172623 -59416 28907 27195 -83134 60463 77698 292790 371418 144939 895952 1665316
12060 1665316 1159289 320150 412746 -152857 -326595 -19825 409055 -99586 21011 2593
12049 -82471 103266 -67182 17398 1809 -51829 49571 236252 199529 16792 53254 115176
12038 115176 304656 242769 201985 -138742 1080 -122304 -210736 -264832 -37382 -16175 -58950
12027 -58950 -31066 149094 36496 207401 22649 -229768 -147237 74138 107018 238945 252344
12016 252344 103571 -299861 49343 -71253 105992 -193591 -272263 -117278 28606 262181
12006 262181 77064 136749 -109450 -87748 -14870 76793 266543 20179 65218 -92169 -33082
11994 24771 128019 -12250 -54348 30793 -149510 -99626 121537 -247247 125237 17214 -168953
11982 110251 -40948 -76666 -62626 -120707 -77671 26308 -275364 -150195 78589 -116606 61449
11970 49985 -211878 -26033 -9881 -111851 186306 52981 -293363 -44172 -320347 -125163 286815
11958 -255331 -257929 163824 -220046 229222 17021 -277394 -270430 -232997 162578 153209 288244
11947 288244 -75661 162000 131704 200286 241760 -127318 153802 -505671 177408 -152024
11936 -61002 13160 228287 186655 -24542 -142651 -48025 16469 -28042 -100341 133024 -150850
11924 10996 -188383 243754 247921 -199277 168041 -83094 86942 265004 -6772 -42717 -150377
11913 -150377 384737 159630 139941 108297 35694 53886 -219208 -279486 -94116 63489 3138
11901 220132 61107 -91171 -256927 144720 -18047 -178256 175757 -159530 -175391 -65204
11890 -160596 30292 127043 -12002 235136 129657 89983 88870 158039 54683 -93098 128177
11878 83242 43019 -79037 210941 11178 -328664 441 10772 -136684 -43114 -53272 4018 193932
11866 193932 -74708 -59111 154647 25432 237717 -230556 62648 -215689 123412 147597
11856 147597 -274034 -120206 -156238 -152604 -46417 -8475 -150963 -72886 27536 189349 224573
11845 224573 -130749 219477 374360 71172 -70644 -147854 -180135 34773 82700 -298407 -48217
11833 140935 6122 -187407 -48597 63382 -31231 -74961 63541 -52341 57420 -287693 -186931
11822 -186931 171181 -277621 -212530 -201144 -3267 -192568 -88058 -169304 -327158 -237725 -153258
11811 -153258 -187579 79897 89120 -157090 -87881 256737 -124757 -32104 -177289 -135961 39532
11799 155250 -41344 23983 8248 -91945 -428636 -197043 -47862 105680 56568 238135 65618
11787 -379150 90967 147710 25979 28512 -109585 62404 -22794 15562 -177140 -47260 -89780
11776 -89780 76924 -17768 372606 -332179 121426 33151 -98928 279397 77532 22483 -335629
11764 -254194 -110022 37142 -221852 86217 -147583 496508 -390275 -424381 -216341 -4124
11753 6926 -76760 324739 -101583 -208817 -301285 -13763 118040 -141188 253061 -6134 -104454
11742 -104454 -253468 -118378 -149640 59256 375850 -366867 -47892 -143800 94291 -17678 -9119
11731 -9119 55866 -30958 -93447 188730 74621 116536 123860 109554 139787 45323 -68410 -110533
11719 -110533 -236587 143389 208667 52545 -92456 175303 205098 82781 -185674 -59810 -195033
11708 -195033 -220178 175621 -39328 221776 -9761 272270 29780 -144204 -146291 -78653 -4831
11696 -19577 45110 52655 191584 -236217 -25711 182977 -4127 20681 7488 -62713 416132
11684 104021 126520 46413 7369 -8596 -37234 18242 -8686 27109 115539 -78413 13645 -82368
11671 33510 -80050 38754 114565 141940 334708 55401 -4945 -44688 -43490 219617 3174 -146361
11658 64918 53204 97189 -155229 120209 169521 39385 71296 60511 28110 464263 125685
11646 126768 -1438 -213225 117524 -116868 5244 -10594 251340 47695 12662 61850 -103254
11634 54771 -308042 274525 141616 111710 211173 218238 -108104 -120954 66570 -91449 -233559
11623 -233559 -71173 142008 6326 247503 182965 -286472 -82067 -26001 115411 174461 -287508
11611 390388 -372309 216165 -214710 -73021 173658 -178260 116186 56427 12882 -58761
11600 123599 40408 -47996 263259 281917 -83961 29952 123918 220874 214395 -180299 20745
11588 -45009 -106835 320986 56107 -31759 -70727 369566 -21724 107043 161392 193068 313878
11577 313878 87091 127185 145584 305033 74419 -10968 374377 90789 158406 180962 179586
11566 179586 145903 162393 177963 11605 18946 -21104 -97014 -117310 -24692 292844 164352
11555 164352 -25711 166950 101877 -127141 7894 -83819 37509 161939 84141 88032 86813
11544 86813 -7433 238960 371009 440790 116053 26224 -34034 -95682 -51876 -71158 17929
11532 249940 -221024 96051 320437 267772 189464 196517 31774 61956 -27545 352248 104433
11520 174975 -45673 -221788 249492 -97184 -38895 70786 -70978 -131233 -150501 -44120 -25055
11509 -25055 453524 115162 206828 4447 -20758 -140472 -156440 205118 158848 213600 -150483
11497 138007 35965 274913 -59788 20270 -52778 -96437 112107 204849 188922 244341 -27072
11485 119605 204899 72808 310711 -1026 160397 6285 154189 -189451 361120 207263 40294
11473 -113381 138608 151524 -102404 9387 -34793 230003 219893 318723 285513 -34370 210067
11461 21367 139348 112109 243812 -54132 8832 -91381 292161 177199 163790 -87078 276465
11449 204284 3365 236223 227847 352186 156330 242217 393928 -211683 -12127 159603 36977
11437 -4609 437276 39389 -126014 287748 -17776 -37707 34929 184501 158046 341143 257404
11426 257404 79465 16425 -191702 30922 141228 323881 16865 118886 266256 -86661
11415 97292 -4632 102961 16840 -232680 -99930 -71500 41214 -4198 167354 -186402 -131575
11404 -131575 -294715 -292528 112307 -106075 187762 41770 203397 21619 145525 187437
11394 187437 -269472 -126117 156772 -144061 -99762 219392 -62560 -51663 120443 -10127
11383 -50534 40908 -264432 -116626 135902 -8206 109848 -46122 106678 103374 -76038 68148
11371 -78377 -41296 -90808 218482 -247110 173050 -110884 3192 201241 116510 237586 49615
11359 178584 -60605 -209034 -1425 -16113 107025 -104345 -150422 -18904 -245139 103133 -328032
11347 -203109 25913 -119397 163539 -8169 213580 111427 -99298 -80640 -16948 174690 -28163
11335 45697 98104 -37179 -259008 224167 26370 -24099 -187333 188479 31114 -361683 205060
11323 -83932 118664 90285 50247 223756 -175950 -82742 63012 326666 697 -8353 234023
11311 -68850 -201265 353573 -270849 -166294 259139 -56989 -268780 93777 -6887 -390709
11301 -390709 140895 7081 122821 -187537 112209 -219653 -24 -244516 448201 -289009 -185439
11290 -185439 -226176 -264439 -70505 -545253 -57837 -316064 89466 -379841 -49457 -142222 21537
11278 104938 154839 -1699 269473 182764 -151719 104342 -285328 89458 40279 84338 7255
11266 211856 14186 -318501 -71410 64366 -36624 132631 -464347 -30091 112696 -74410 479567
11254 -141652 -294831 151160 -257864 -466998 -142603 161961 -11334 -47099 -195104 231656
11243 -426232 -197476 -83787 19461 95107 -318713 125832 -98594 -62336 -131404 243534 -94319
11231 98857 145900 -163984 -125156 -110594 -441330 -177640 293302 -283896 -221472 -75036 -203366
11220 -203366 120717 -94689 207066 167313 114724 -270657 -34773 -45015 -138722 -104143 -99502
11209 -99502 -22756 85427 215190 -95915 175124 -70078 -52786 105943 -198388 -375384 -105218
11197 -145794 -190463 302957 -207906 13886 194269 210454 258073 -247691 301289 251401
11187 251401 -53114 146200 -47601 -28402 203893 -260144 -115725 23546 125142 91299
11177 91299 221330 227890 187576 -208723 -233786 185625 294830 -186173 290017 -340032
11166 -105787 -519490 162648 -31178 -207303 139406 -174545 -12889 -232499 -59209 45774
11155 -153192 12365 -195683 59939 237753 -129035 180539 242245 -212063 59425 -112733
11144 74767 117071 -19660 51624 7570 -331607 -85093 215601 65844 211092 120916 -347188
11132 59329 65936 -99004 222593 29052 161494 -6560 -235584 77706 -132601 96991 402453
11121 402453 75848 -221076 -37998 163155 117997 -68194 -271584 -466269 -131257 -87405
11111 -87405 119104 134775 -68488 356988 17083 -158688 -10980 -123893 52738 -160881 108281
11099 423888 -33071 103890 321289 -90557 94104 103732 192203 8585 52807 122264 113446 300883
11087 300883 -199024 -20311 24566 329038 177511 181646 -85909 199381 40029 71658 431488
11076 431488 368592 392668 221163 181631 255188 122378 106822 -5754 192539 233768 38758
11064 -133708 387426 526312 482613 159252 272097 443455 123721 87401 216469 73783
11053 235581 330203 233690 562529 228953 483706 640837 457657 87912 331602 404243
11043 404243 461115 650718 463502 598508 790608 698348 853744 631392 599952 824882
11033 824882 585510 993996 1036930 926340 559945 536345 650517 524340 770795 638451
11023 638451 843677 387059 524558 943345 722507 594463 517066 316767 589761 922525
11013 922525 743905 653485 666645 749789 1115836 623124 675241 658009 964513 724232
11003 724232 1009852 771134 777416 423554 596816 751239 718497 509495 675746 785087
10993 785087 646269 727751 472776 546455 728687 346065 413804 623549 437795 544844
10983 544844 443695 468181 528771 771769 837412 859723 725509 697358 800885 631787
10973 631787 920554 764620 925518 1155642 1115569 946937 939187 1035933 1065186 1158391 1429727
10962 1429727 1759708 1706060 1832478 1664758 2102834 2378544 2503494 2705403 2972496 2959330
10952 2959330 2601520 2555312 2367142 2182524 2212142 1937067 1598521 1549318 1710693 2073161
10942 2073161 1873959 1757326 1774063 1664189 1687443 1676298 1435578 1136232 728299 800314
10932 800314 616127 708385 262490 340703 340978 415188 314911 448021 10309 347548 287840
10921 287840 92161 77842 222360 -162594 50098 123318 44613 283891 126664 -283497
10910 -76606 179120 -51677 -157312 202277 120320 -62648 41401 188684 347929 -79148 136384
10898 -46184 148930 -307319 54385 45819 58784 -129381 -8681 70775 -386687 294244 -245938
10886 -181749 -138192 111481 -333371 105634 -235109 218190 -64466 -204702 289076 207973
10876 207973 56315 108357 154699 -108896 -33154 -153191 -157899 59238 -312057 -53534 251018
10864 145931 326038 36080 -191289 295846 21901 287951 42668 28659 127257 -55268 120469
10852 -84430 -117428 -33589 19039 -188670 334544 -117003 -149113 392033 -118544 85243 141664
10841 141664 -104218 261380 20820 -20545 297212 176786 134511 -147852 -225789 56076
10830 -244582 -25647 -197881 122002 -175366 -5135 50421 134380 204511 -185467 244710 -265098
10818 -13340 -62180 135670 -48722 198803 193240 -40953 216631 -34410 127562 -380267 -130490
10806 54248 101285 67879 33227 -384139 -318740 275514 -473949 329255 -7466 -130493 -70871
10795 -70871 -225607 -209733 -274747 -9726 113981 97831 -20491 -82366 110048 100345 108907 -123915
10782 151272 -64426 -345592 -445073 -489273 -14049 136677 326886 97571 -122755 -201087 90741
10770 -20756 -159613 -207828 -271420 113604 148172 80684 -110305 69682 -63918 -186387 -231880
10759 -231880 -171115 4389 -104759 28629 44742 -204907 530107 -59205 24552 78663 21143
10747 -55379 -15755 -331195 386511 -13612 14016 -79389 -117502 -112951 -29958 137216 47933
10735 9396 -29908 -75448 9734 -165024 -6247 -58323 39402 -348391 59773 -140611 -322740
10724 -322740 -5069 137854 199557 98145 -70969 -423274 -124632 -242699 31985 202905 -8640
10712 -137440 16922 190208 -75709 48262 96670 -288485 -191764 39955 -295489 130628 -49775
10700 -127668 -198549 -123370 -30422 -238792 168846 -60199 45935 18378 10243 -187391 -307851
10689 -307851 96978 25697 313876 -369459 -115188 -165025 74003 -213202 -21893 49285 -117173
10677 -46862 -108793 73164 193163 222716 -297 346108 -326021 116150 -29564 -163723 -248433
10666 -248433 -52172 351391 -59757 31602 157306 -65845 -462041 185520 14240 -139496
10655 131745 -81264 -139654 51426 -266430 -269525 -190694 167849 112199 14995 -59164 65571
10643 293096 -205505 -7329 -241710 149242 17211 170682 -349692 -235336 -573 -180412 141310
10631 70915 -280007 2931 232202 122034 -232648 22137 -222504 223906 -162850 143190
10620 -490731 -7220 9480 298492 209079 -13567 -92861 -372069 -92009 56838 98977 -36919
10608 314720 110747 55540 162177 -280212 -168687 -256384 -237246 18227 -157700 -20663
10597 130839 -37532 -33122 64964 -364875 -92102 133199 -40128 204271 38849 -332189 -94954
10585 -53831 22188 -54615 -14471 -27832 -222894 238587 -111978 -269618 102962 -141254
10574 -238537 32543 38036 -187352 126974 26052 -107572 260122 -150888 14183 -406505
10563 -309886 13542 -129679 -251027 -120725 -129419 -308733 177059 -138717 -272124 79514
10552 -143451 -344678 198345 -85350 -341201 -49001 -299146 46062 135741 -88647 -322728
10542 -322728 128005 -57953 381184 120720 49486 139469 57240 73374 34636 110123 199479
10531 199479 -59539 -462725 -12709 -216555 -90131 -64798 14310 39730 70166 -366535 161619
10519 -192125 -199511 -54989 -28434 -395661 -152634 -210667 -30619 35923 -141808 -68445 -294850
10508 -294850 133142 -37960 -143805 -15063 175486 139298 -17261 -62895 204084 -2334 -21988
10497 -21988 20881 3015 -260277 -164364 -261277 -79362 -47572 -320506 114784 -282040 -31525
10485 15264 -72888 -57196 195984 -139258 -32986 476285 -68313 -189255 -238357 -404866 62579
10473 -116401 -181199 -205204 21521 -29832 -9281 32491 444743 183610 381899 550853 344721
10462 344721 214298 46217 -27599 -3941 149294 129755 -36096 92551 109592 -145654 -245740
10451 -245740 391112 -96371 -57323 -286088 139001 92250 -39138 256532 -131614 140861
10440 135954 -4926 176711 -127282 182567 -29173 44416 -58342 352127 355681 472878 81215
10428 74639 18894 -133424 1252 -100872 124682 141166 118605 -94559 -221275 51221 -2046
10416 -110618 -100402 144829 124330 2679 203946 -114575 -358535 -40476 132027 32767 -39216
10404 -260062 -400177 -174082 151580 -64878 301282 23780 -232809 -122571 -135616 37677
10393 145310 58578 2814 -44016 22225 -202896 -78373 -104357 12096 110789 147742 -164564
10381 -328798 -163749 -74538 67072 -95288 198861 -62757 211869 46602 163720 251066 34487
10369 438314 -6777 -38340 -32649 147747 -17714 -172462 11040 222022 -60781 48392 510340
10358 510340 316703 61381 109651 294231 398635 -17665 640050 527381 284479 385486
10348 385486 346733 549275 375440 33395 93768 302620 -50100 412630 -46385 250720
10337 56774 169794 271299 447941 70183 714784 419980 86288 498690 453854 384212
10327 384212 260847 -50177 630673 126609 178161 172212 258366 83613 211656 33560 346093
10316 346093 104137 -162384 -181039 115673 -3128 54381 310605 286245 279495 256443 262890
10305 262890 146528 432795 407354 -134685 -38693 229132 232546 260397 34220 52629 318559
10294 318559 269704 117498 -55627 129423 -62197 -222026 -199311 268336 -102293 137128
10283 -180729 -133690 -127238 -7850 120656 61297 -122472 111340 -186482 -102194 -84770 -145785
10272 -145785 -267252 -149092 319960 -316618 89609 -211539 51649 -367209 -72696 323636
10261 -91852 -120781 -217336 118330 -229082 147336 -143303 -245300 67276 -211081 235963
10250 -169128 177388 144625 -93473 -124445 -11400 81071 497681 271116 91056 424354 229709
10239 229709 335696 -57113 -20438 284628 340216 -244060 -71453 -16406 -55609 221476 281591
10228 281591 23131 -13108 -30266 -114526 213190 5262 75295 39632 23165 -35195 373782
10216 -129111 -233865 -511690 -97596 -113164 -279189 -162442 42186 -202581 -125613 -111432
10206 -111432 -148386 -46039 80006 121419 59029 107647 159982 3556 24872 -158551 -206350
10195 -206350 -259126 -157016 -225068 -136032 241229 -18362 -19412 140028 -48847 -241186 -149497
10184 -149497 -213207 -6372 -110211 -218091 89863 194442 -328028 -88943 -104997 63744 266589
10173 266589 -205760 173128 -255940 172867 183933 49059 -178667 36862 -127265 151098
10162 -135797 -263036 107118 -140384 -186064 -350638 -54140 -142682 -182577 -100971 -134247 93001
10150 103932 53895 631 66142 -7916 -303912 -297119 -96546 74488 254908 -123208 -52174 4885
10137 -507212 -244195 -266895 -217345 281548 -126749 -221847 -237776 -155971 -92677 -44251 -227853
10126 -227853 18882 -155007 -84612 -188000 227155 -86298 -82651 93080 -261103 45702 104410
10115 104410 108307 -301804 -12947 -342588 -53902 -41743 35956 -52206 -232184 -232318 -24339
10103 -48719 -58759 -87390 -474078 -132031 -46619 -336684 -15270 3445 -43407 -263357 -249014
10092 -249014 -111952 -774 139682 -105909 -171686 -57255 184474 110968 142433 -369602 141858
10080 -370820 -125647 107833 -168219 -35437 -45068 -17445 -160372 75282 8135 -37110 -294365
10069 -294365 -230543 -255 91541 -270456 522839 -198396 50619 51799 -49215 25281 57120
10058 57120 5416 -13442 336169 -161134 -303651 -35893 -366858 183871 -45049 -74576 24788
10046 75016 77647 -427751 -116585 -143817 -121473 -100705 30975 217364 -53265 -103916 115432
10034 -108898 -128574 -209131 -145620 -11500 -402007 -189541 -228661 -150796 -95979 18428 -182135
10022 253772 44530 -134818 -304269 227992 -82985 30641 -163674 141684 -164592 -116120
10012 -116120 -4777 -119207 -384543 -307652 -175724 38161 -142415 -124299 89898 -135090 -156545
10001 -156545 -174779 154983 88741 -200125 -122879 -126437 -127809 -57482 61020 -106172 -69727
9990 -69727 -91387 -68549 -175894 -2423 144268 -26722 -273309 -545486 -84905 150524 23053
9978 -81807 193994 287022 -328782 -109940 -198040 -44001 -15781 -225643 -14348 -77136 71257
9966 -5706 -18334 183565 -85103 268315 288380 -73036 -57683 -86386 -9158 -84477 228730 207323
9954 207323 -244288 63767 -243527 -24929 -447867 12212 -245182 -5478 198194 -362950 176847
9942 -142776 -332471 76604 364373 -5671 -60572 -115623 -19478 -290708 119 -47847 -26763 -97779
9930 -97779 -162841 -32910 -144324 189871 103742 47139 -12969 -69605 13489 -51353 30036
9918 -156930 -186015 120807 -319787 -93586 -80891 -47690 103535 -178656 -3111 -248656 -89190
9906 -51999 -194097 -90582 -139343 -360183 -12973 -204689 -107463 -187517 -202150 -101695 -198583
9895 -198583 59744 -138418 65524 -71107 -83208 98084 63059 -28429 -245099 183412 -154497
9883 -521938 -74509 -185016 237487 156897 -32356 -244189 93958 -145058 -94575 322547 286082
9872 286082 -87123 -37880 14301 16113 -201624 -240596 104799 -135718 -5100 314430 -138434
9860 -245814 -257483 -644871 -226009 29007 356 119033 203892 -17657 62424 -176938 175513
9848 -95429 -214414 -86877 -213655 -336094 -296757 -218737 141268 186454 -33517 -265825 293201
9836 -144631 -347834 -207512 -54555 -228266 -408373 -399651 51602 -106075 -229238 29844 -48007
9824 69951 241410 -6477 48350 234546 185412 -466600 166381 -209202 353333 47956 -263761
9812 -262365 -10409 -113681 -11442 -147166 -107140 -166271 46688 -34297 -238870 66560 317325
9801 317325 -38207 294853 93992 -43378 132782 34250 -49539 92368 65531 60582 -99608
9789 -35195 -162018 -65120 -379065 -313766 -283604 9625 -92997 91842 -98479 66715 -33074 -113764
9777 -113764 179577 141572 23372 -190531 -19937 791 -19584 -156793 -79947 140664 -14997
9765 -12754 -9355 -370460 -244914 -296187 119414 -57755 -123568 238210 -233745 -300453 -23186
9753 217051 -19252 -157345 234889 -70090 -189434 -151261 -123841 90098 175097 142932 -177041
9741 -186213 82102 27910 166597 209813 -76156 56386 -308588 -70543 -158984 -45540 80302
9729 -61399 -215949 60170 73519 -30249 118004 -91396 35734 -202624 510202 118681 -19354
9717 -152837 172405 102949 -281220 -447064 6089 -578 25861 -235584 -44620 77994 -148455
9705 115104 -79874 79256 -104040 137035 -302898 -39993 -104942 71013 -237117 83848 103221
9694 103221 138115 -270624 -219114 -11751 -89559 -286823 -51035 336521 -66790 -26765 83422
9682 -166173 -235134 -238448 -120329 70442 -218081 -132846 256080 -349822 161648 35407 138125
9671 138125 4283 -60288 -215812 -220839 721 -117979 -10376 -147696 116920 -466227 256149
9659 -184280 -78863 -167150 16759 -439701 -31400 28453 -227682 59929 319719 -360207 -293218
9648 -293218 -201022 48555 14796 -83240 -29969 -23343 -60608 -140762 6866 122938 181041 -219846
9635 -58053 197177 -40827 -56415 183983 -94159 -302365 -9847 -118588 -190561 -217881 162902
9623 38381 156869 68162 -158056 218932 111812 362847 22232 -299645 -170074 -324446
9613 -324446 -96674 -7051 -253089 -23940 -224635 158986 -314863 14355 114054 -144369 -25372
9601 -200782 -242447 21437 -108686 -6655 -106790 -262958 -155496 -147594 189091 268745 -357076
9589 -167441 -190570 35571 -198124 -235407 -175750 -215662 -264166 -179581 -167270 63175 5648 98318
9577 98318 170507 -28201 -110230 -315930 -287606 -210867 -84754 164072 -124638 125291 -355853
9565 -292658 -276824 60209 -194788 54932 -231042 225148 109880 -14466 250582 -44947 23624
9553 -118367 -101091 -84009 -87140 -56271 -116862 86146 -316705 -131378 -179405 -232556 231807
9541 63404 -132231 48003 20634 -180690 -91382 59963 273296 71584 -405266 -269546 103776
9529 -281331 -284394 -22717 41863 44184 -151481 -160125 -39714 40823 -83495 169346 -18084 -56023
9517 -56023 56888 -97879 -212052 -237320 -234749 -68468 -40706 10514 -70057 -226371 -71201 -22137
9504 -131078 -84576 -224780 -248116 -16951 169124 -491512 -47710 7208 59212 -101496 -68581
9493 -68581 121985 70327 367352 237380 136229 -187751 -103675 27395 -32125 -22126 67773
9481 -61390 -209471 -27062 -195629 48569 -14671 301055 25839 75661 -196116 -54300 -228175
9470 -228175 -30043 -383621 -108067 -99944 -203026 184066 238305 26024 319271 -172287 126157
9458 187969 -382450 -92530 115477 26478 -154147 139561 -240760 -145477 212031 -241568
9447 -130519 -368788 115971 -233147 -239594 17630 -203403 -253183 65281 -210139 241691 -23514
9435 -11112 -64860 -247913 37929 -54579 -309518 -136060 -209999 -93633 230888 -149728 -199534
9424 -199534 -111808 -87636 -475140 1298 11117 -16331 66196 -128342 101846 -153830 146818
9412 -196624 -177975 74996 -400560 232551 181719 -220670 -8357 164361 232876 -172073 38054
9400 -283702 2920 291618 -55722 52798 65416 -298829 -116408 25 -131607 -83060 177331
9388 -50244 -292729 18845 -199854 -79740 -45027 -187645 9598 -55609 207572 -193477 -137926
9377 -137926 -62694 -322397 -104408 -103073 23940 296495 -294613 150767 -130585 93530 -238034
9365 -40778 -17226 47703 -146277 29001 208990 -4570 -296978 75647 93733 -237241 -259600
9354 -259600 -112589 -207192 -180699 154176 287560 -340559 -50254 -330002 66067 173395
9344 173395 -228912 107878 18846 -151691 -308103 -154660 132464 -86963 -224941 21361
9333 -17975 99393 90205 1099 -215379 209418 -25363 10558 -491103 -55440 199720 -274924
9321 -242765 -349935 97554 89741 -143312 -83626 -350994 -294962 38397 -186263 -183966 -45321
9309 -57894 -94263 -4740 -247932 -76596 315660 -126696 17189 -217412 40359 -312432 60599
9297 163326 -154152 -168667 137411 -78283 201596 77633 -10381 -156008 93357 -52998 -39087
9286 -39087 10773 98781 -178033 93064 -432557 -135694 24431 2178 -75777 -52011 -176647
9275 -176647 -79637 116683 -195593 -67108 375735 211819 -74056 -54660 2101 -123528 251067
9263 -116589 -242098 -3388 100779 127231 -17381 -176211 82792 -21633 54015 -335755 223831
9251 -205945 -303636 4419 86340 -330276 97675 -393096 130423 -104593 -150601 -130941 -36108
9239 -203463 134526 47597 -170519 -114834 327877 -87250 -59124 -368019 91083 -145110 -57168
9227 -85582 169375 96148 9714 17018 -2417 -155938 -184284 -272760 -47978 -40067 -436 101284
9214 -97403 98287 21232 -241660 34942 57269 -153891 199168 -103961 -135090 -30523 -32852
9203 -32852 -133354 -26770 -461084 169515 -93232 64312 -99808 -260519 35431 -27198 -140402
9192 -140402 -67551 32172 -145273 41954 27930 -24943 -15529 -186848 -153542 -235604 39130
9180 -36057 -259363 -146044 -200555 -59785 117044 -124069 -132266 97740 -239418 -152342 -224408
9169 -224408 46990 50974 -431597 -258622 -17303 -45478 -113627 -126357 -77679 -527600 -158270
9157 -5515 181430 -40554 113153 1474 -77257 205581 -200878 -33903 82764 -286895 164989
9145 -194916 -86117 18468 60263 42122 -109219 -235256 69586 96389 131361 -130180 -33052
9133 -75803 -81243 -130897 -261458 -110615 195105 104241 71058 179644 -73491 240611 18585
9121 168579 82295 -121905 -285505 -276369 -196793 -27025 125009 -194483 205798 -166927 -40986
9109 -315601 -121935 -28284 -200796 113577 -548683 118539 -224680 -112228 -198493 56968
9098 -28693 -267165 -166873 -232133 -49991 158973 -170271 156399 -44892 130659 32295 -45727
9086 -182994 75453 -185906 308753 -168278 -67267 -182491 71731 264602 -9530 -88603 -350127
9075 -350127 1051 -117430 -43740 146093 101658 -189978 -122895 -121345 -47311 231162 10594
9063 95227 -278955 -78284 137700 4650 -34282 44241 -235172 -334587 70528 106279 -50954
9051 17763 8364 -317514 24907 -112023 82708 -51314 141776 -191466 178036 -121811 99444
9039 -127412 -31140 179798 42552 -23973 28535 180867 -192289 -215603 -347508 136963 213182
9028 213182 -145182 -33104 -90402 -33759 -290965 -242332 -57529 227125 64557 16402 152727
9017 152727 -170267 -158990 -37348 -208337 -107144 79846 187608 -153524 -389863 57109
9006 -147744 92216 28534 -68548 20630 410396 130114 -44474 -65814 -69559 88709 -242859
8994 116522 -129916 -65128 276110 160778 -414119 134224 106104 -162361 -186028 -73652
8983 27251 20062 100058 3497 -167571 -192471 -369775 -240705 -145864 -119981 -133924 50985 85333
8971 85333 113777 65886 -244907 -201492 144012 97207 -192088 69465 -265300 -15259 200214
8959 -160710 177448 -85314 -190580 -63291 -173681 -207624 137278 -343147 51239 73734 -129789
8947 -288779 -172773 34823 -106556 -62996 202175 10861 -307327 -14973 33382 -56918 136153
8935 41912 -1966 -47736 -112754 -49696 -244471 -158629 -242903 303 -17976 -260446 -68886 -156900
8923 -156900 64512 -251628 -315621 154723 -267739 16846 177607 206343 74579 151583 515392
8912 515392 210512 188843 220216 481542 838335 1567300 2742808 5559052 7443995 2956466
8901 1703917 1044213 316181 254400 258138 247398 507749 20249 60568 98961 376260 -59194
8889 170615 -2683 -28089 -375465 141689 308257 175218 -211420 -5977 -222916 -75947 -101808
8878 -101808 -313135 -272127 -227736 -311738 -116131 -290310 -286597 -319279 -35186 -190272 -250260
8867 -250260 2013 -172442 -109825 36322 51896 185725 -206481 111791 -188192 36385 62220
8856 62220 18908 -97036 -319512 -34310 550596 -545685 205447 353178 -133193 33088 -130052
8844 381200 -157368 51877 112825 -80434 -90895 -179253 10947 -167093 -127598 290261 -339825
8832 -173728 -14392 14779 55968 -93617 -254082 -247238 -175195 -63147 152436 -71047 -240262
8821 -240262 -65605 65090 -188527 28678 -507207 -200015 293139 117101 -101763 -204950
8811 -204950 -30591 -60323 6094 -82421 -432031 26841 -54104 -12282 -225725 80611 -374348
8799 -128251 -186860 -56979 14275 -22644 181390 -84095 -321964 -119938 70424 -54543 -191770
8788 -191770 -137508 -65949 -296653 29071 39429 54601 -386672 -134492 290067 -45071 -5456
8776 -50493 -44366 85799 259722 -232699 -164907 -38231 13990 60240 253370 159015 62799
8764 3310 247962 -350050 -10282 -334542 -131428 399039 -294468 223052 -178881 153453
8753 81548 179745 -270073 -144102 62462 -87969 -130500 -210465 -258612 -130508 20170 165300
8742 165300 -154711 -15358 -413284 -128935 -84746 -144886 38891 -253994 102215 173681 -184248
8730 19821 -74529 -351809 -362452 32688 32768 -9617 -97778 14193 -348531 111225 -109944 -6259
8717 219865 -114022 -377765 -125223 -197483 -134135 57904 -62085 240908 124479 177844 -5054
8705 -128283 -132867 165244 -245408 -83133 44743 -23468 -197711 -260792 371646 -43030 -145878
8694 -145878 44905 -278894 -221053 -47160 -106560 115306 214378 -50328 -377980 -186058 90263
8682 -478310 77791 48998 153463 -93170 98259 39998 203138 15055 23837 -114431 -39503
8670 -153669 -45812 196317 16008 131937 -89701 -128348 -227833 -238065 -261192 -79583 6774
8658 -262915 232212 -124181 155 18579 230878 -81869 -77078 -27358 -288392 48298 147465
8647 147465 -171557 64874 -197006 -33906 -210071 175915 -291217 94468 324790 -113464
8636 -210732 178952 -149375 70759 -260622 -269482 -40656 -467618 -50766 400319 -19225 -143392
8625 -143392 124440 -179487 39970 -292878 -209305 -18188 249810 -145147 -111527 -151474 166957
8613 13466 173949 -411232 259460 -78564 -19834 -83137 -490058 17898 7002 196173 -186522
8601 39716 113125 -13448 -77454 -158974 -25813 -110180 48681 194423 -130206 85299 -110720
8589 74412 208391 -74861 -124749 -47592 59923 146528 131404 -172369 -145777 33634 43360 95390
8577 95390 -304922 54965 23847 73907 53110 -85922 -22184 -65363 -84004 -29467 -336789
8566 -336789 -101541 -117221 -159154 56424 338174 237393 -19678 79365 -75673 36474 -335583
8554 -209441 -221930 -64783 -66814 -11583 88182 86741 -6539 -86900 66660 -101221 -210698 -176989
8542 -176989 168480 42202 -175547 50811 -355995 -340289 82542 -304505 278509 -104548
8531 -94975 -48988 -3741 158851 56368 91095 -462203 -35736 3332 -37992 11071 -324157 -148111
8518 -48200 74951 -47875 162681 297919 -56881 -85027 -463567 -234093 189493 -327490 69877
8506 -290885 88512 -98954 -189682 159730 -136319 169130 20924 -423681 -66243 -289215 -80312
8494 -116662 82694 59673 -190957 -36293 111602 247636 257406 91269 -216536 37675 -46765
8482 -236133 35013 -199570 -50222 -292639 -295516 57343 111134 158176 -62534 92434 -177851
8470 -26468 150089 142478 33781 -209270 -70359 -50079 -251572 -187798 -233522 198363 -204977
8458 130500 314751 -396934 -132070 82650 -124210 -15448 -180346 -341903 -389401 -64005
8447 98402 -53137 -180373 294808 -74298 197951 -9724 366575 167969 71467 86881 -318995
8435 -47581 107947 250142 -17540 -45874 -109082 -185808 130683 -138983 36921 -552726 -59387
8423 -128570 155469 -44890 -220176 -50406 166178 55992 -66163 -282655 -34365 169046 -210205
8411 -111882 235248 -13656 -139684 -139957 -140878 28647 -172969 -32758 -281816 -257032 53615 254132
8399 254132 13644 -107786 -151863 -27304 -134264 -140751 -100810 37748 31529 76150 184154
8388 184154 145627 -85309 -87129 26781 -34531 259827 -407104 -203359 -21530 -273918 -405585
8377 -405585 110568 -360270 -283161 -181717 -142642 57044 -78535 -262803 -274230 260358 -60184
8365 62697 36939 -183295 35422 -149678 -68286 -65885 136367 -47740 -251575 248141 -166363
8353 -310662 -291656 -34000 165167 162835 -224931 183465 -50374 335221 -12916 -125572 -99112
8342 -99112 -136791 -332831 12306 181414 4746 -68711 282693 216043 -103324 -46497 -393746
8331 -393746 103006 -123157 224421 106237 50602 244806 86373 -230790 189469 -38837
8320 -92753 -256513 86850 -41187 106348 273325 -102499 -30155 -205979 -288402 -186371 -213538
8309 -213538 -6665 43438 167148 144907 -165821 155390 37360 45919 -61960 41291 -58438
8297 -93980 31345 181281 126475 -222890 -108484 -155246 -57656 -130875 -11177 197938 -18712
8285 222415 -207186 -15661 85439 131604 -137849 -96400 -123986 -196067 -447031 -75590 -175782
8274 -175782 51167 -245413 191073 -103698 -23799 -82940 -310192 -194387 147147 234016
8264 234016 -245696 -199719 166627 -195650 -78429 77503 -63899 -193928 27299 387531 242897
8253 242897 121468 -88451 144079 -99100 -220851 89602 -443365 -109572 130610 130856 32087
8241 -49107 31224 -188977 163968 -134084 73453 3934 -97333 -100847 267400 -4082 -227041
8230 -227041 183249 139562 -65804 -66732 -27828 54942 -102547 -52835 88500 -229988 211375
8218 -117271 -38785 -198262 -331713 -105355 -184794 -163525 133517 -269333 82735 -266675
8207 60374 135630 -22126 2768 4439 200832 -272656 -100475 36998 28853 40012 356009 -131462
8194 -216134 21239 -262299 112887 -112289 -228806 -269063 -547331 -160712 198815 -89053
8183 268752 193812 137709 -241207 41316 -122679 -137435 -19493 -276450 330445 42744 53570
8172 53570 -147002 142989 -292203 19759 -248234 -145808 -166670 -186403 78495 204330 -187537
8160 10630 81183 222852 113954 178278 -88143 -82668 -127386 -38099 26414 305694 -55527
8148 -15094 -25982 -136772 -173802 30332 -105646 -56609 -283139 75009 165239 -79981 46945
8136 271204 -147419 -124734 -162158 -220450 -253292 -170537 59634 115638 210821 93737 -186610
8124 -148151 173748 -161303 -213145 -8931 74266 27000 88099 114587 -8325 179566 137733
8113 137733 -132484 215661 20825 -63621 63276 152551 7952 55098 89805 -32133 -425412
8102 -425412 -130695 -168101 131210 -103420 -135182 -99832 -307148 -78356 31298 272766 -127821
8090 -126081 -52112 -32711 -544949 -126964 -280645 -46677 -122104 -45274 200164 -243284 172157
8078 75066 -83932 31429 300193 -139957 -151757 -131872 134157 73937 91926 -349563 5521
8066 -44606 -122680 132276 -404842 -374399 53892 -53351 -254064 -88902 -171412 9943 252384
8055 252384 -174963 -56206 -242101 37974 -187828 46977 -37579 -310949 16446 70896 -42165
8043 229937 94167 -93999 -170548 19753 20227 -50032 -246284 -43882 148974 61580 188763
8032 188763 -103045 134669 -250459 -15381 -24414 3676 -3421 102454 90548 118904 -134472
8020 88273 -14121 -327575 -259170 131533 45264 -351444 -9901 82010 -13590 7012 -275333
8008 -170229 -167152 -87690 190096 264513 1963 32128 -435266 -178819 -247288 151971 -128338
7996 94826 -46588 -294158 -326890 8358 -273608 -166555 -359443 -83409 149548 6790 -111820
7984 -116087 -213019 128731 71145 -242424 38805 -75307 119985 -363282 -413564 63981 -85877
7972 -166179 -179463 -301246 -15450 159981 222896 -119650 -583 -18751 -64344 -22538 -368923
7961 -368923 -103331 155430 -314116 33597 94838 -45754 52499 -232785 59179 -103150 -347084
7950 -347084 -62441 -272949 57318 -2663 -79308 -166651 164728 -221103 30513 -39843 280925
7938 208105 17173 -28745 -82626 359700 -165808 -340521 -152938 -126865 -21792 -7037 -54089
7927 -54089 -17930 27478 37864 -313556 -180683 179011 -165409 -124567 128024 -70913 -399431
7916 -399431 279598 -124475 -330373 86749 118622 15718 496871 -16451 100536 -58074 236894
7904 -87627 -69316 114960 -142393 -26837 -74903 -172302 304293 220657 -90155 120455 -241469
7892 -195585 -256373 -117726 80459 305692 141887 62377 -99462 104535 21784 168406 9275
7880 15413 13753 -211290 -26546 -86502 -152111 29133 -177252 -313789 -170601 236653 101558
7868 151946 -1959 128818 55516 -456684 -157029 -256152 -59477 -231192 407145 70827 -239740
7856 -265837 207976 120224 -462732 -196458 163974 334656 14756 -116397 -92507 -276941
7846 -276941 -261593 -65205 -105988 -13840 -153494 -351548 -221991 592750 55904 -92764 -277914
7835 -277914 -177014 -337572 -340916 -28823 172856 -273538 -61790 -51780 114901 -305785 -66060
7823 -26674 -237284 8542 -56750 6516 -163212 76869 62297 -57284 256051 360285 -263166
7811 -469656 29658 -173235 -147222 -87143 -292350 63868 -371577 -103520 -105261 112479 -32986
7799 -456220 -7575 23719 123787 -247234 472313 -229138 229813 -184996 -74051 -146372 88072
7787 89179 -164060 -77366 -34578 169594 -169604 -45578 124019 19757 265610 -121119 -72826
7776 -72826 -167269 104196 -129263 -279475 -75461 -112029 14957 53871 -296406 -116772 189591
7764 -135909 263398 -302475 -558378 306176 -90875 322831 251763 -118817 302544 -14592
7753 -292290 8769 125398 14614 -103936 292402 -22794 -37936 59734 -32927 -217003 294705
7741 91786 27931 -249248 -281046 -63544 -159309 51709 919 44676 127097 -83969 -15348 -28013
7729 -28013 -178977 146089 128583 -53224 -80313 -208069 142818 36765 -34470 166374 94837
7718 94837 -73803 -226975 -76378 -261082 91244 135791 -185909 60466 -99491 109550 177183
7707 177183 23489 -200992 -366287 -58157 299263 43139 -42837 -254459 264821 -185846
7696 -220366 196157 93476 -66852 73797 -145249 -251581 -296117 -119940 232454 39364 37581
7685 37581 225857 -120065 -91056 231004 -46424 -34207 59925 159066 -119827 -326256 -56134
7673 -414475 -4837 28174 -19542 -95673 185211 -28415 -273663 -36834 -286837 -181098 -278651
7662 -278651 -253948 -470389 -125269 258330 17566 -159463 -236470 -134223 68720 -117181
7651 147886 3892 58314 -81364 -100143 -222764 -38143 -241618 5373 -65450 184307 219065
7640 219065 113159 -291065 -161886 -31295 -103987 361673 11123 -265099 -53618 -104879 191838
7628 -148979 -51221 -217215 298853 -303751 7883 -133004 -184295 292861 80845 -151697 151762
7616 18197 85571 -72252 52077 104694 73995 84446 -3178 180317 -148846 145277 136666 66507
7603 -230253 -325189 -156745 -112606 -179636 -26779 -144506 -61910 -42081 -95772 81746 -87121
7591 82811 23518 -280586 233689 -120125 -25023 -128522 -161369 20568 36937 21792 -52305
7579 -61903 -615610 -439316 -246967 -211626 -70366 -273749 274887 -39870 -63377 -157674 -312193
7568 -312193 -320181 -96814 29776 208700 -79654 -61315 177577 -259109 164179 -137089 -61032
7556 -135842 -346369 146816 -138658 -112286 199269 257690 -417048 -34554 50680 23336 -197223
7544 118452 56282 -8658 -80131 -170357 12674 -436195 -98065 76389 -186428 -137351 -6428 114403
7531 87384 -118276 55220 -105127 -67655 -348366 78284 203753 187918 -191597 160598 -138997
7519 47606 367646 -30891 117719 -167413 52661 46024 -242398 111100 164072 26197 -44172
7507 231425 -42135 -114200 -124997 -155453 5679 -137907 -459796 121759 -86663 -159755 99938
7495 -86286 220956 -41855 231156 -19536 128904 -48909 -47550 -80705 -57951 -206136 -150391
7484 -150391 -29238 63091 -237049 -8352 -88068 -65273 -61328 -221052 -147537 -113674 -120796 286411
7471 -128719 -233055 -36245 -247652 -44215 91914 139181 22137 105381 70221 -207227 -133460
7460 -133460 -265547 68962 -7864 -252750 -317076 264830 -110584 106217 -30776 119545 376426
7449 376426 199106 -151675 35971 -139785 -80286 108680 110008 -104881 -171199 133852 -339219
7437 -91854 283642 101976 -194972 -235661 -26058 -270718 -82858 30804 417 -305438 -124667
7425 13662 -115147 -57331 12981 -90369 209666 49853 123831 -55645 35792 25050 53969
7414 53969 -25078 -53776 296049 33881 -108131 43554 383937 -178154 -213419 -107958 17940
7402 -458646 236603 -47815 -230472 -24136 32350 -329072 -42748 88676 -187690 -162374 192001
7390 -122281 174226 119659 -177205 151050 185120 75635 64470 115708 -40003 -204203 65548
7378 -103138 252548 -142617 219542 -69133 -119016 291887 -117047 87521 253437 127536
7368 127536 -243809 -264636 -392459 98691 8512 -82106 -292412 -99102 15632 -128317 -451040
7357 -451040 20298 327235 -7842 92332 245315 162982 -122347 -281554 -109757 22791 -153328
7345 21872 177079 -103112 -17339 -33793 -105106 -127412 -259637 -76536 83684 251699 221723
7334 221723 -102667 71727 -51868 200563 -14767 -106924 -115050 -174621 34093 -127486 -68181
7323 -68181 -150259 -74540 -130939 -173062 177146 -325499 -260603 -88812 1356 203436 21224
7311 40561 94622 -23790 -206698 -91641 8411 234296 -105487 -158366 -67720 -164742 350421
7299 -116559 74556 -78204 -50567 -49625 40069 66715 264323 163752 69036 -115007 -8987 243802
7286 -283780 -26966 -37341 -108454 -150055 -150551 2434 233848 118917 -7645 -124888 -159029 -96860
7274 -96860 226746 90765 -6447 -112809 -25465 76012 -260012 -273151 68591 -117140 -42757
7262 -63109 170825 -199943 -395813 145830 -279318 146021 -19378 11294 -125875 -151129
7252 -151129 -119354 -98659 -180020 93418 117790 -16365 -395194 -34239 70252 51643 134686
7241 134686 80135 -40291 -339100 188116 89952 -61180 -57721 23638 -445587 124362 -55423
7229 -195529 108064 -191754 -214022 30207 67600 -60956 23940 -28834 -65224 88410 -56650
7217 -282350 4577 96347 55365 58686 -9946 -208560 -284499 -102432 -260257 10738 301080
7206 301080 -238228 123935 193896 -307915 112255 320091 7629 -135150 -132681 189350 147830
7195 147830 50982 3182 -61665 -57634 -224892 -2886 36869 -55030 -251397 -177965 48609 -2938
7182 155354 77402 -23195 153596 -13736 -121442 13838 -181863 -166561 443983 -205268 142231
7170 -138810 -95056 108987 66248 115700 114958 569 -35973 86541 -118994 107382 -118548 -259167
7158 -259167 -122264 -127848 -469935 -289466 -72740 -112292 197278 -79357 -129109 12486 266014
7147 266014 41435 59120 41854 -35900 144053 150199 -46187 -53745 -197052 186208 -128935
7135 73874 121903 262892 233294 -244397 -250251 139284 -180446 -259280 -131476 165831 -25262
7123 -247357 -222217 -72365 63531 -26804 143997 129369 -109861 -197328 186082 39921 -75555
7111 6173 -75055 -167611 -8942 -201893 -37552 124270 103365 -94130 -7193 -156632 67979 -162050
7098 302833 31170 -65980 -58360 16169 20070 -177523 21807 85373 -597913 -65417 -154564 59214
7085 -359187 -218255 -144098 -3212 -198854 -13065 -175860 -91806 96973 292684 -482265 -20659
7073 -30161 -97170 171410 145669 261895 -135230 76555 94159 99316 -188664 -20206 326 7928
7061 7928 -198638 -327582 131683 65972 -114336 -447113 97283 49281 136046 -53193 -287924
7050 -287924 -187762 164720 155198 111769 -114053 -281418 -253583 -38779 189162 55825 187194
7039 187194 358739 -411233 -11541 25879 -70330 -104553 -41270 -85571 -157507 -145500 294133
7027 -203929 20949 -96453 -13260 -72655 -289008 -155889 -124401 -304677 223303 229360 199352
7016 199352 104929 -102761 -176411 39236 -9368 193878 -177368 187360 -225712 -208912 -50076
7004 129375 -183570 -87093 -163739 -145109 3458 -14870 -189322 29205 38206 -79495 -231088
6993 -231088 87716 17553 -219488 72516 -39236 -118218 79621 -327789 30903 269403 -23785
6981 -355745 176052 -96823 89251 -4514 -70337 350295 -167879 -262017 4741 194928 3974
6969 -32261 -1266 163548 140982 -111302 240517 -197304 185200 53769 71642 191745 -75035
6957 206433 135925 -233984 -153016 -22000 -151546 -263863 -250331 -100697 187814 31506 -160455
6945 -32992 -29131 30414 -113157 42553 -68147 22810 161343 -11590 69648 -462339 68658
6933 100134 160066 -225578 -168676 -142562 -91431 6438 -178316 -318317 172365 -85263 141677
6921 -178680 -343650 -28382 155940 23801 -75241 -639 -136781 439237 -91398 -178365 -76795
6909 -65590 -282521 -104207 19153 -233888 -5654 -184113 -273037 -244335 18472 48110 -78632
6897 54133 32722 -78322 -168702 -56537 -125028 -103354 100136 226147 251305 158127 -244211
6885 -50924 -418179 -150986 -172288 84090 -63785 32725 -181499 150353 -126117 -66315 63931
6873 -161011 140978 -72740 -17201 66481 359223 -74140 -159561 -332922 -211433 117049 -477989
6861 -51591 -5660 -8574 257036 10272 -13229 -289702 168738 125944 -255246 -144528 161488
6849 -83821 240896 114156 94817 -87077 90557 128126 -108501 -17095 -25029 -198509 -7401
6837 32444 -97683 161246 -79765 -119124 269302 136633 122130 -1291 -79658 -50935 -206273
6826 -206273 -155090 -116990 -518426 274253 -21683 7942 -125611 258105 -107337 -196865 -320233
6815 -320233 -108675 144167 159387 -190003 -53463 -16514 1737 -296878 94637 -226491 348674
6803 -82579 -196537 26235 -93946 -64753 14737 -8176 30900 -372295 56473 -141654 -206015
6792 -206015 97492 -222995 100072 -388782 -328162 176377 4844 -167022 -16524 17465 -185929
6780 1653 -108957 118435 -88094 -5214 170190 1363 -240628 -65463 -198854 -7410 -212605
6769 -212605 -33914 148858 118290 -363609 -154921 89251 157291 16550 143268 29887 96275
6758 96275 170396 -202164 -142139 -122540 -14893 19912 252135 44100 -117416 -538820 -158032
6746 178815 -323318 -85582 -186521 -397305 137928 -22526 53155 110016 230600 -221452
6735 280251 40787 194206 7589 57920 32440 -17226 -106177 80422 14028 -357201 -151753
6723 10876 -82844 -130482 134990 202256 253549 271633 24680 34263 46003 -7070 208855 -367526
6710 87098 -65117 -145986 -3381 414989 -226255 -176599 -171340 -152169 -144143 -67734 5511 -83433
6697 126941 -233011 160356 -356855 223052 119 60768 75608 -23431 -53057 -228293 10992
6685 259738 173364 -55627 -161475 -277400 -86091 42269 -175788 317862 86145 -90024 -281697
6674 -281697 -32527 111166 -230063 -278587 100257 -222162 -68445 256113 -70186 459962
6663 -17021 -33311 201054 112955 128952 -88609 119302 45982 -39359 -37348 110258 -18400
6651 95090 132960 -100272 30870 -178122 -109735 209341 -230587 236371 9304 -124727 -24778
6639 -75438 148220 -11807 145776 -235717 -119186 175677 37622 255621 178052 24121 -138259
6627 211066 -146921 339912 -102359 -239709 31003 16771 -55553 -59933 -137590 16815 233828
6616 233828 -29549 -112547 143911 -45813 176595 204021 -102532 38279 93713 92042 149392
6605 149392 227093 169033 261208 -141629 10384 53140 13887 -16241 -129515 78995 -41785
6593 258934 -2536 127206 23371 -131084 -18249 -41927 -61662 -71866 -112148 -232442 -70343
6581 -101422 -119954 -120747 34133 -220507 123617 -208638 -140633 -77702 -30534 100913 82771
6570 82771 2120 -133880 173369 -139257 -125688 1393 -57340 276006 -322656 40312 -152565
6558 151380 -157476 155519 216354 99759 29070 -426957 142154 -96943 370432 243466
6548 243466 -6633 -84991 -179004 201064 -49060 64828 164174 -171813 199715 -302597 -246790
6537 -246790 -81014 148749 -82939 43506 -15795 68191 142759 20444 30155 -191463 -180028
6526 -180028 39806 -121702 155959 -17653 -107981 -297839 170682 -70763 -416313 -113768
6515 -314334 100183 -34357 204106 70297 -66450 -111408 31330 -263527 -192220 146242 -103029
6503 103007 250762 60198 -104023 -17582 51453 86138 162791 235367 166151 90953 -190913
6491 -109266 143143 -35471 180385 185355 244150 403117 -30115 -22836 -198923 105407 200446
6480 200446 153102 -21300 -28363 -209822 51719 -271825 -202288 -59179 -136541 83905 -195703
6468 125374 19478 157771 -143567 -608 53110 79285 311919 -82113 -182878 -153710 45586
6456 -239967 -11815 299365 -184803 -227717 194542 128521 81275 -240498 -50501 -330002 -110971
6444 210383 -81272 -106015 -160113 217414 6943 133716 -6789 142684 -152420 -201058 -104258
6433 -104258 -66928 -381904 17749 88501 -136476 56344 -144742 -107071 -172081 30819 -276480
6421 70435 -18961 -31254 52611 89980 55700 61474 -23411 263962 110027 156994 -172895
6409 249336 -126385 208386 106654 33794 -172179 265699 34233 105733 -123980 -122257 -40355
6397 -88984 -183905 -143021 134440 213864 296801 -133725 67254 45119 -93164 20818 251102
6386 251102 130302 -209997 -43829 158805 -122984 -183061 131649 -219586 -342137 70779
6375 -182961 72835 -287109 -131226 240432 -62627 89 -24263 -203203 -6902 -146101 -146068 -214472
6363 -214472 -354344 1073 -410324 151392 -319500 -135587 50427 -5960 -144413 -93753 -170466
6352 -170466 65433 -149046 217024 -57095 94421 278612 213952 318354 -265933 -134924
6342 -134924 -155128 -28316 -89979 -235533 -259594 -136280 292292 -51014 95907 -562595 39086
6330 250617 172692 163531 -70826 -171547 36342 -345157 2487 -36093 -33868 -188751 -261448 -363009
6318 -363009 22122 128723 -24903 61565 -295149 -83272 42988 -133719 169985 160788 161956
6307 161956 220338 27395 28591 74405 -219239 -380684 -78944 23571 206415 -130640 -16239
6295 281556 -57215 131400 -12772 100160 -25308 -35494 -150369 -39459 53889 141567 209529
6284 209529 -182584 177610 -192423 178026 56963 -504825 32039 -178986 -78810 -273029
6274 -273029 242181 193746 256603 -424599 101487 -54869 -138820 114535 -18614 -250197 -198646
6263 -198646 -426838 -194923 -159914 262261 123502 -67861 -172551 60715 186483 28324
6252 -217219 56508 -94017 -38909 212356 -46893 206152 -6567 161120 75215 146538 -110512
6240 -183321 107640 147640 74140 170436 80371 -190127 -48098 -124677 255743 -15423 150063
6228 -80353 -286476 -122020 127231 -57498 -324378 -1632 -42855 -34874 -56370 76876 110664
6217 110664 35376 -51597 -107869 -111707 -82876 -137789 118486 -21264 -153860 32225 -16249
6205 -25730 55565 257299 54770 192332 -168433 -153148 28908 98830 -256330 77827 -150001
6193 -320455 186454 316333 125292 78563 39107 -63265 -65422 94752 2345 -105756 16896
6181 66161 26815 -32193 263007 -34927 91744 -354123 -469572 509944 4888 26412 -46927
6169 -23077 58226 -307570 -200977 308938 -82933 110205 144683 -93598 94223 -387222 19562
6157 -29965 188185 165929 -34160 62878 -47684 -4161 -125049 29292 82987 98144 57286 216033
6145 216033 -149404 145716 31104 307170 -112790 -231355 111704 115314 -92830 -197269
6135 -197269 7092 -90391 -97832 57323 -390109 43584 -152363 163655 151996 221952 11631
6123 179498 36275 -169626 -162519 261799 11755 -46402 29158 128023 121876 -186708 -16760
6111 44627 258252 8249 271728 130574 104463 178999 1412 -258856 92634 91814 152438 -29137
6098 180352 -481106 -140523 6102 207138 208539 -157057 120611 211551 81180 17107 -55524
6086 -3336 -45291 8659 88522 -34252 -90718 343875 -235400 -7820 -75779 -252329 213552 -46639
6073 189783 -231102 108786 -356339 711 -111220 -95898 -105395 -27686 194765 -63179 -132503
6062 -132503 113368 -714435 191299 105625 206302 87803 -180601 -91673 -29240 56752 265366
6051 265366 -253889 -48470 -18802 -9837 -284407 29281 217534 30353 -205592 -29598 85585
6039 91256 -131033 -19584 69029 -19826 -141202 -260415 -30855 166333 75641 18567 -126635
6027 -142643 -50625 -119501 -47979 -348713 -92115 129096 29870 -64318 79714 271342 251556
6016 251556 30491 -40325 58474 -5470 -359456 114076 -122610 160788 159604 -217240 -226683
6005 -226683 529887 -13455 203448 145739 264821 34789 74331 -3141 -966 83939 30554 -401220
5992 79572 118457 225969 -57147 207213 -107935 35627 -33418 163119 24137 -244340 -116916
5980 97254 -116325 -237562 55268 212713 138109 -82025 -264058 -46014 -147182 24992 109671
5969 109671 166304 111023 197408 151006 26028 120684 -226048 -7374 -34141 107390 82288
5958 82288 -106279 -149756 -126005 136448 -91984 -126032 135688 -324225 -116280 109217 -78152
5946 -122028 271145 -13975 -31561 -327939 -158507 14890 -415531 -62217 125863 182586 -50238
5934 -7731 179837 341966 182201 118004 167985 -64007 9191 399723 6671 -213369 89339
5922 13724 -91691 46155 81450 414506 24612 3376 -81389 346066 284899 220342 -47074 -92386
5910 -92386 -369269 345924 215670 -228300 58265 -285161 69484 -146574 -328957 -229529
5900 -229529 -125309 -165386 -215233 152799 -156603 -179067 50705 -160862 -446645 -194423
5889 -261365 215959 -45140 106801 85923 96142 88047 -161271 94101 -28428 -128360 -152875
5878 -152875 50625 167232 71354 -98380 -323047 -169961 -42578 24273 -298403 108698 -112862
5866 -35416 -157073 -214051 -194913 -105630 -149774 -67140 -156002 103105 24763 -257415 40428
5854 31259 91073 -240709 -35465 134010 -185599 -42430 73715 -208804 22182 49808 102531
5843 102531 29598 105996 -197305 240135 -283431 -78109 163987 -56018 45719 -253956 336043
5831 103394 91033 91274 37019 -88534 286019 -23529 -53535 164767 90038 -290700 -85801
5819 -455044 158779 -371360 -382368 82425 64349 111136 57984 -229052 223250 -959 215444
5807 -259809 110317 57671 16881 73437 226598 -45221 53670 -97219 -65311 -155509 -3622
5795 48236 -235606 323325 -82122 312995 69564 -199870 -65821 96092 106839 93061 54861
5784 54861 -3948 81397 111745 -152628 261972 -108367 62417 213636 -133913 -169279 243480
5772 -104333 -138196 -15395 -78518 116497 187431 2615 -19676 -62633 -136482 -386608 -97466
5760 281710 76654 5390 -129678 -12640 170751 -43017 -163240 -107644 -36097 -4067 -62141
5749 -62141 124868 14093 164866 96105 -213005 168348 34123 -73867 -25846 209018 117252
5738 117252 69989 4603 -61117 -217085 84707 -17235 183046 -54700 133474 -34335 45249
5726 -109971 47483 -163207 78926 282953 132643 32794 -95196 287653 306166 187521 -11232
5714 163888 -265561 -178141 -238625 278768 -29484 67407 -111554 -129779 204315 107782 -66195
5702 -136438 26242 -260770 12896 135427 -22720 -71782 146834 -14038 413079 -278462 199042
5690 58790 213118 98366 86289 -51087 246469 -256922 -2147 -12906 233435 25760 -213031
5678 -24919 -3099 -69820 -333990 -203131 189136 -279022 68046 -212794 -149175 -184923 -50639
5666 -139848 -183836 -306029 26605 -64298 -100629 -47020 40970 -47264 50674 -67148 345926
5654 168587 -18612 -218299 -167317 145326 -353577 196883 -28930 117109 76040 -202687
5643 46996 144841 101871 123607 -29086 -65228 -129924 -147360 141488 -57211 -264246 -172220
5632 -172220 229793 -43948 48235 202711 -139813 215242 2851 -22303 5474 25070 29577
5621 29577 -82061 -15454 -148931 -29728 44681 -105584 -247765 54714 141770 -199470 62909
5609 387247 9595 -109107 -223259 43596 8998 -37895 83761 -188523 193734 -63671 -98103
5598 -98103 -115308 -190678 83624 -120872 253059 -90276 -102301 51892 197660 43484 236726
5587 236726 158332 -51408 -266492 -149809 100933 10213 -176436 -171998 -18889 -7633 169983
5575 -129243 -238253 176828 118708 -233330 54301 -85916 33241 -83892 260436 -143740 94756
5563 51772 -694 37131 192679 190955 -68131 220620 -217857 257755 -16932 -164151 388230
5551 -163851 -366988 -418814 59151 -193551 79797 -60376 -114081 46306 -45296 249997 148422
5540 148422 -20808 119951 -113472 9465 -73904 54976 282546 185468 16328 -136 219150
5528 -139204 28231 168660 118132 -23929 -268356 156627 132636 89201 -82355 493944 -81514
5516 125116 57149 -377098 -12174 -30126 -59734 43411 57174 -349192 185691 -406886 -88874
5504 -92784 372420 -246063 143469 -109421 -59240 -73513 -298577 411 171020 107685 260909
5493 260909 -111058 -88127 160741 -24534 -29443 126780 -48851 -177511 -286337 10045 65258
5482 65258 -263084 -36022 132970 23404 70510 107643 -112935 -223717 -91986 7007 -188172
5470 -62981 -7575 -348192 62875 92691 341520 -99045 -122577 135270 53843 268762 111997
5458 -220618 -86213 -199708 281097 291387 1280 -243061 -43626 78849 188785 38672 -125672
5446 2274 -32101 14609 -91383 208949 140609 7254 95911 -113110 -48702 260183 -312186
5434 -35530 123416 -163377 205834 43443 25667 -91319 -49990 -138438 208812 448712 -84801
5422 37284 -48228 44886 105489 -154118 -82601 -13839 30861 16312 271543 177817 -20309
5410 123993 87047 79171 81249 -396459 180187 -128604 -27904 198267 120892 296077 417067
5399 417067 -158662 0 193351 69837 -244105 51839 56610 -13560 -100263 213493 -12865 10152
5386 -248910 29062 67774 239812 66705 -347767 130939 -92278 8402 11639 -120764 -42839
5374 114476 -49578 -45505 -120188 -342702 -75415 -51491 192482 -11532 -101295 128242 -123397
5362 -148128 299054 114828 -231030 246188 -193114 -27963 -52076 100710 -299416 -133632
5351 -6864 159941 -83150 -120968 -185718 -90085 -349345 255942 -148280 137473 57341 96728
5340 96728 12671 348463 -97157 95567 -125719 -89232 -56724 67786 -159660 -62390 80345
5328 24277 -138807 172800 -220019 69081 -283254 -140194 239156 89543 17379 -249706
5317 -260997 -1044 -336147 132866 -38441 38741 1160 15437 -38498 -126226 104201 103843 -104711
5304 -49720 -63339 295165 63829 -71834 557 266230 113066 96437 -94137 61023 -179064
5292 34367 -282539 -123414 100778 131839 -50823 -150383 195189 56551 -100262 41619 155085
5281 155085 185329 123027 -28366 -240734 63719 -87023 -123357 51896 249099 304405 -116143
5269 205677 -14453 219531 -109806 121205 -264335 185800 -98005 -4117 56083 -183711 -51083
5257 78331 -13172 191691 57032 330689 -13086 -95288 -34702 -199126 321939 -69746 24485
5245 -20802 -480 246861 139983 370626 -55477 36190 -71719 96999 -97354 77523 55532 -374776
5232 -52697 -52257 93937 -153785 -150496 171318 343952 25607 -150632 7204 203136 -40852 107830
5219 -277773 60768 153489 344640 -506896 97048 5073 252519 -72606 92927 -214408 214316
5207 -81824 -66079 -20598 116741 -125509 238630 -314532 235706 83265 -230615 -220303 -362406
5196 -362406 -42675 -242162 -124884 -33081 63063 136005 -236436 -138076 -172945 234437 -121054
5184 171282 -217707 -144249 -244996 -69405 -14743 175667 -80741 -51393 -136757 -155 -265502
5173 -265502 47364 -7858 -45595 52389 13555 -149388 -203062 83729 -187649 49182 -115142
5161 -195628 -135345 -212269 275722 11731 -80194 20385 69045 -203149 192009 11406 124989
5150 124989 31231 18646 190547 48950 64378 160657 -150604 -213025 -15249 -227697 42090
5138 111893 69746 334964 -68252 27388 230899 -234007 -279328 78383 -73317 -64564 227615
5126 -39079 49434 68449 39644 133941 243227 75616 -138812 -62352 -77680 -164045 -305178
5115 -305178 -547 -54268 54125 80606 116020 71145 -134956 -68435 166345 228341 114323
5104 114323 -187815 123183 507229 55670 -206436 -283402 136839 -420942 366885 -11887
5093 -154171 -194100 -74528 7324 -151797 87489 -156440 172690 353603 -206462 38172 370303
5082 370303 -115596 165560 74008 246153 -24135 166471 79273 171057 56379 83849 273163
5071 273163 7012 -18454 70331 -121221 -87768 87359 -146492 -49775 111261 283827 33077
5059 50295 -86846 174396 113616 -210846 -95337 -49737 -267124 -121246 139433 -403123 -81589
5047 64508 43125 -163978 56864 217940 53250 237320 -236938 142368 188576 134393 -170341
5035 -24051 -207982 93315 -42432 39211 -293834 11164 129581 290943 -138598 -217198 126300
5023 114010 -217007 -145769 26963 -334361 58509 -175090 -49688 54304 -98923 14006 148914
5012 148914 107592 73359 29789 -72244 -297446 -85573 112481 -36325 84101 124400 -285612
5000 159037 196620 218108 -71072 -26258 -110858 39764 31745 -119148 -102233 58517 -344000
4988 66615 119183 56945 -68613 85360 -196497 -24422 -281099 196291 19579 -137278 -6757
4976 -173231 -316313 79159 -135699 -12746 38203 46990 147650 96510 145332 444194 -119223
4964 -121652 -23186 -80826 88259 -25373 40462 163932 67633 219818 -207384 130817 -231641
4952 -95690 -289833 -71502 -226500 -78082 69328 -143166 123926 -94874 -10719 -192191 64980
4940 167168 -373242 -153345 -29694 -391536 -17081 113444 186086 263427 101108 -196592
4929 -109063 245634 -19866 285899 2921 -91675 -47721 -271369 -172918 175274 112585 207761
4918 207761 112084 -84179 43433 -35323 -116102 -112885 -134747 375979 -151296 -9859 238109
4906 -42980 -2152 77041 -1548 135569 159871 -49627 -34022 16076 -32619 -23169 -82795 23108
4893 81230 -37070 18317 -36311 -63662 -225378 177855 -15508 216385 -105294 -175934 58365
4881 31794 156171 -22201 -150513 36198 -856 6961 62253 149851 188644 85204 -61241 -121096
4869 -121096 -161921 -131640 -333326 -35700 -204095 214252 -109588 68942 200538 100634 -153069
4857 -241738 -74056 29239 270488 41376 -102476 -47216 82263 -217813 9730 246714 -179519
4845 -117004 -153466 256558 -49690 -203827 -50786 37563 -229575 29814 -304231 -9996 24730
4833 113308 68490 278753 98918 -110289 -16447 159542 169418 285636 129560 -262722 64122
4821 -20128 112874 91897 -48059 123843 106468 291617 43763 -237014 -182385 -122699 124445
4809 157456 32305 -117289 -205198 72548 164511 -78240 -27142 314041 -16373 -1186 224969
4797 96296 -162609 -33512 -118157 241875 97146 109915 -132296 -309302 129286 230995 173862
4786 173862 183428 54142 16131 99668 -95703 -181712 -14901 -154379 -97901 121294 -249703
4774 196331 155283 -36855 -168958 -296513 162493 251429 41520 -171374 31003 19355 -128212
4762 53699 -75622 -51504 -122183 -243966 66351 -225644 -378123 -252251 100483 245617 -8538
4750 -104708 236554 108865 166829 -75159 -58322 243213 235712 -2269 -264963 70566 -10049
4738 -151458 -197949 -89028 -2629 -94519 -196086 288348 -13489 80110 399052 -45152 -87494
4727 -87494 -268400 85777 81216 435580 -35249 30835 224263 40731 -15505 298726 93761
4715 346376 244737 -272632 -155951 410332 -30397 106984 231949 -27661 -200143 215971
4704 54309 65981 222146 -106940 -314195 221837 84039 -92806 25136 -351523 -138903 -17072
4692 269624 -185530 -2413 -4669 -65217 44677 28133 190516 -222062 86641 -1766 124584
4680 -52973 -36551 -325479 134244 -24650 355267 -5226 347877 -143800 195532 -156002 -127053
4669 -127053 141415 -29346 -222066 -146344 -147302 90701 -1300 54601 31668 45967 -115240 86255
4656 -38640 222360 -145527 -56195 -206358 279106 -31109 148059 -150953 -87236 -62123 -7201
4644 15378 15819 78520 197231 226320 158932 -410543 -2374 -345673 35192 -14648 -167632 -263585
4632 -263585 272326 12974 -128371 6079 204567 242284 -272876 -5902 -235443 -153335 -108027
4621 -108027 25593 -2333 119370 -22349 -19927 -120225 148828 54420 384700 96696 2093
4609 298252 -249541 237156 72671 -148912 -257429 -288528 179479 -26253 147050 3195 -205696
4597 205058 -2300 249952 155915 -97576 -43410 -109308 -101573 -119756 107343 119570 -104182
4585 -156487 136817 -69517 -243594 173688 215468 -342846 -73844 73178 -150859 -81103 51728
4573 -110150 144332 123486 -152677 257841 -151762 -40507 -5959 -19720 -240409 -142476 -228065
4562 -228065 -67684 -52476 274756 144616 299041 173629 50605 105206 215254 149971 515502
4551 515502 68173 122283 256413 201495 142971 334253 21581 -57706 211733 20499 -54936
4539 135671 97050 8234 32182 -66909 125398 187473 -119903 42426 -157659 -326617 87273
4527 -100931 91801 167985 -132829 157082 151830 122664 76955 297020 -12576 151332 -97207
4515 -84009 71622 -300877 11229 -229937 284686 179298 201816 -184008 -497 -185112 -180372
4504 -180372 -8618 258042 376161 145351 -90043 37967 -116639 16481 74221 -89559 309809
4492 -88324 -67482 152957 164031 58915 197600 37741 180089 9452 54146 -71340 -79037 -95906
4480 -95906 -54744 118386 193498 -5197 -149180 -61901 73246 226946 -118727 171792 266044
4469 266044 231323 -27874 -265763 129217 -59305 -10805 209631 -120147 157910 68524 238638
$$ [...]
##END NTUPLES=NMR SPECTRUM
##END=
