
##TITLE=UV1146_M6-1005-1000_6279139_5uGItLd4f7
##JCAMPDX= 6.0         $$ Bruker NMR JCAMP-DX V2.0
##DATA TYPE= NMR SPECTRUM
##DATA CLASS= NTUPLES
##ORIGIN= BRUKER
##OWNER= Administrator
$$ 1.72 TOPSPIN		Version 2.1
$$ 2012-06-03 10:11:07.125 -0500  Administrator@TOPSPIN
$$ Compression mode = diff/dup
##.OBSERVE FREQUENCY= 400.13188235
##.OBSERVE NUCLEUS= ^1H
##.ACQUISITION MODE= SIMULTANEOUS (DQD)
##.ACQUISITION SCHEME= undefined
##.AVERAGES= 64
##.DIGITISER RES= 22
##SPECTROMETER/DATA SYSTEM= spect
##.PULSE SEQUENCE= noesygpps1d.comp
##.SOLVENT NAME= COFFEE_meoh
##.SHIFT REFERENCE= INTERNAL, COFFEE_meoh, 1, 14.96749
##AUDIT TRAIL= $$ (NUMBER, WHEN, WHO, WHERE, PROCESS, VERSION, WHAT)
$$ ##TITLE= Audit trail, TOPSPIN		Version 2.1
$$ ##JCAMPDX= 5.01
$$ ##ORIGIN= Bruker BioSpin GmbH
$$ ##OWNER= Administrator
$$ $$ C:\Bruker\TOPSPIN/data/COFFEE/nmr/UV1146_M6-1005-1000_6279139_5uGItLd4f7/12/pdata/1/auditp.txt
$$ ##AUDIT TRAIL=  $$ (NUMBER, WHEN, WHO, WHERE, PROCESS, VERSION, WHAT)
(   1,<2012-06-03 10:11:01.656 -0500>,<Administrator>,<TOPSPIN>,<go>,<TOPSPIN 2.1>,
      <created by zg
	started at 2012-06-03 09:59:31.375 -0500,
	POWCHK enabled, PULCHK disabled,
       configuration hash MD5:
       D5 CA 7A 23 FE 6B EE E2 50 67 74 61 24 F7 5E 3B
       data hash MD5: 64K
       9A 81 F3 BA 5D DF 14 3E AE 40 E1 F0 9B 8D 70 7E>)
(   2,<2012-06-03 10:11:04.468 -0500>,<Administrator>,<TOPSPIN>,<proc1d>,<TOPSPIN 2.1>,
      <Start of raw data processing
       efp LB = 0.3 FT_mod = 6 PKNL = 1 PHC0 = 0 PHC1 = 0 SI = 128K 
       data hash MD5: 128K
       67 A6 3B 6F 53 10 23 84 D1 B7 9F 66 C6 17 12 60>)
(   3,<2012-06-03 10:11:05.828 -0500>,<Administrator>,<TOPSPIN>,<proc1d>,<TOPSPIN 2.1>,
      <pk PHC0 = 33.73352 PHC1 = 0 
       data hash MD5: 128K
       74 FD 8E 4C 4A D5 EB B2 64 7E 35 EF 6E 1D 80 D7>)
(   4,<2012-06-03 10:11:06.671 -0500>,<Administrator>,<TOPSPIN>,<proc1d>,<TOPSPIN 2.1>,
      <abs ABSG = 1 
       data hash MD5: 128K
       EC 5C CF 55 48 2E 14 37 7A C1 2E 05 A6 F9 BC 02>)
(   5,<2012-06-03 10:11:06.765 -0500>,<Administrator>,<TOPSPIN>,<proc1d>,<TOPSPIN 2.1>,
      <abs ABSG = 2 
       data hash MD5: 128K
       CF A8 96 9C 83 C9 62 8C 3B 08 80 6D 00 D6 31 87>)
(   6,<2012-06-03 10:11:06.828 -0500>,<Administrator>,<TOPSPIN>,<proc1d>,<TOPSPIN 2.1>,
      <abs ABSG = 3 
       data hash MD5: 128K
       EE 1B F8 33 D7 EB AE 8F A1 5F E1 07 FA C0 6E A1>)
(   7,<2012-06-03 10:11:06.937 -0500>,<Administrator>,<TOPSPIN>,<proc1d>,<TOPSPIN 2.1>,
      <abs ABSG = 4 
       data hash MD5: 128K
       05 27 0F A4 5F C1 05 31 08 8B B6 03 8D 81 44 D1>)
(   8,<2012-06-03 10:11:07.000 -0500>,<Administrator>,<TOPSPIN>,<proc1d>,<TOPSPIN 2.1>,
      <abs ABSG = 5 
       data hash MD5: 128K
       0D 38 DB 2C 3E D0 F3 B2 93 49 5C FA FD FE CD 76>)
$$ ##END=
$$ 
$$ $$ hash MD5
$$ $$ EC 82 84 55 92 D8 E0 0F B2 90 6A E6 2A 7F 9A E1
##$RELAX= 
##$RELAX= 
##$RELAX= 
##$RELAX= 
##$RELAX= 
##$RELAX= 
##$RELAX= 
##$RELAX= 
$$ Bruker specific parameters
$$ [...]
##$TP07= 0
##$TPNAME0= <>
##$TPNAME1= <>
##$TPNAME2= <>
##$TPNAME3= <>
##$TPNAME4= <>
##$TPNAME5= <>
##$TPNAME6= <>
##$TPNAME7= <>
##$TPOAL= (0..7)
0.5 0.5 0.5 0.5 0.5 0.5 0.5 0.5
##$TPOFFS= (0..7)
0 0 0 0 0 0 0 0
##$TUNHIN= 0
##$TUNHOUT= 0
##$TUNXOUT= 0
##$USERA1= <user>
##$USERA2= <user>
##$USERA3= <user>
##$USERA4= <user>
##$USERA5= <user>
##$V9= 5
##$VALIST= <valist>
##$VCLIST= <CCCCCCCCCCCCCCC>
##$VD= 0
##$VDLIST= <DDDDDDDDDDDDDDD>
##$VPLIST= <PPPPPPPPPPPPPPP>
##$VTLIST= <TTTTTTTTTTTTTTT>
##$WBST= 2048
##$WBSW= 25
##$XGAIN= (0..3)
0 0 0 0
##$XL= 0
##$YL= 0
##$YMAX_a= 10723169
##$YMIN_a= -9431306
##$ZGOPTNS= <>
##$ZL1= 120
##$ZL2= 120
##$ZL3= 120
##$ZL4= 120
##$ABSF1= 14.96749
##$ABSF2= -5.58504
##$ABSG= 5
##$ABSL= 3
##$ALPHA= 0
##$AQORDER= 0
##$ASSFAC= 0
##$ASSFACI= 0
##$ASSFACX= 0
##$ASSWID= 0
##$AUNMP= <proc_prof1d_extract.lims>
##$AXLEFT= 0
##$AXNAME= <>
##$AXNUC= <1H>
##$AXRIGHT= 0
##$AXTYPE= 0
##$AXUNIT= <>
##$AZFE= 0.1
##$AZFW= 0.1
##$BCFW= 0
##$BC_mod= 0
##$BYTORDP= 0
##$COROFFS= 0
##$CY= 15
##$DATMOD= 1
##$DC= 0
##$DFILT= <>
##$DTYPP= 0
##$F1P= 0
##$F2P= 0
##$FCOR= 0.5
##$FTSIZE= 131072
##$FT_mod= 6
##$GAMMA= 0
##$GB= 0
##$INTBC= 1
##$INTSCL= 1
##$ISEN= 128
##$LB= 0.3
##$LEV0= 0
##$LPBIN= 0
##$MAXI= 10000
##$MC2= 0
##$MEAN= 0
##$ME_mod= 0
##$MI= 0
##$NCOEF= 0
##$NC_proc= -1
##$NLEV= 6
##$NOISF1= 0
##$NOISF2= 0
##$NSP= 0
##$NTH_PI= 0
##$NZP= 0
##$OFFSET= 14.96749
##$PC= 1
##$PHC0= 33.73352
##$PHC1= 0
##$PH_mod= 1
##$PKNL= yes
##$PPARMOD= 0
##$PPDIAG= 0
##$PPIPTYP= 0
##$PPMPNUM= 2147483647
##$PPRESOL= 1
##$PSCAL= 4
##$PSIGN= 0
##$PYNMP= <proc.py>
##$REVERSE= no
##$SF= 400.130005251309
##$SI= 131072
##$SIGF1= 0
##$SIGF2= 0
##$SINO= 400
##$SIOLD= 131072
##$SPECTYP= <>
##$SREGLST= <1H.CDCl3>
##$SSB= 0
##$STSI= 131072
##$STSR= 0
##$SW_p= 8223.68421052632
##$SYMM= 0
##$S_DEV= 0
##$TDeff= 65536
##$TDoff= 0
##$TI= <>
##$TILT= no
##$TM1= 0
##$TM2= 0
##$TOPLEV= 0
##$USERP1= <user>
##$USERP2= <user>
##$USERP3= <user>
##$USERP4= <user>
##$USERP5= <user>
##$WDW= 1
##$XDIM= 131072
##$YMAX_p= 126782457
##$YMIN_p= -367555960
##$CURPLOT= <Network HP LaserJet P1505>
##$CURPRIN= <$Network HP LaserJet P1505>
##$DFORMAT= <normdp>
##$LAYOUT= <+/1D_H.xwp>
##$LFORMAT= <normlp>
##$PFORMAT= <normpl>
##$SURQMSG= 1
$$ End of Bruker specific parameters
$$ ---------------------------------
##NTUPLES= NMR SPECTRUM
##VAR_NAME=  FREQUENCY,     SPECTRUM/REAL,   SPECTRUM/IMAG
##SYMBOL=    X,             R,               I
##VAR_TYPE=  INDEPENDENT,   DEPENDENT,       DEPENDENT
##VAR_FORM=  AFFN,          ASDF,            ASDF
##VAR_DIM=   131072,        131072,          131072
##UNITS=     HZ,            ARBITRARY UNITS, ARBITRARY UNITS
##FACTOR=    0.0627417313425165, 1,          1
##FIRST=     8223.62146879498, -765,         -22022
##LAST=      0,             -350,            -22160
##MIN=       0,             -367555960,      0
##MAX=       8223.62146879498, 126782457,    0
$$ Real data points
##PAGE= N=1
##DATA TABLE= (X++(R..R)), XYDATA
$$ [...]
$$ plain form
63017 307880 309995 312257 314462 316477 318509 320975 324096 327814 332105 337071 342664 348609 354772 361380
63003 361380 368638 376358 384240 392365 401102 410640 420910 431949 443987 457152 471367 486606 502967
62990 502967 520358 538396 556815 575782 595594 616189 637087 657768 677979 697761 717309
62979 717309 736734 755886 774452 792258 809412 826082 842298 858013 873177 887624 901017
62968 901017 912999 923253 931312 936497 938261 936460 931144 922285 909967 894739 877419 858593 838524
62955 838524 817579 796429 775733 755856 737030 719654 704265 691257 680695 672357 665954 661417
62943 661417 658966 658835 660934 664872 670332 677263 685677 695413 706166 717647 729575 741558 753149
62930 753149 764087 774480 784675 794921 805110 814830 823585 830964 836655 840442 842200 841801 839033
$$ packed form
63017C07880K115K262K205K015K032K466L121L718M291M966N593N945O163O608
63003C61380P258P720P882Q125Q737R538J0270J1039J2038J3165J4215J5239J6361
62990E02967J7391J8038J8419J8967J9812K0595K0898K0681K0211J9782J9548
62979G17309J9425J9152J8566J7806J7154J6670J6216J5715J5164J4447J3393
62968I01017J1982J0254Q059N185J764j801n316q859j2318j5228j7320j8826k0069
62955H38524k0945k1150k0696j9877j8826j7376j5389j3008j0562q338o403m537
62943F61417k451j31K099L938N460O931Q414R736J0753J1481J1928J1983J1591
62930G53149J0938J0393J0195J0246J0189R720Q755P379N691L787J758l99k768
$$ plain form
62917 839033 833687 825701 815070 801663 785426 766810 746661 725502 703214 679657 655362 631281
62905 631281 608034 585797 564746 545138 526911 509640 493014 477095 462024 447772 434319
62894 434319 421761 410099 399122 388646 378684 369261 360255 351582 343346 335663 328482 321690 315246
62881 315246 309143 303365 297997 293166 288789 284579 280446 276678 273556 270960 268597 266396 264421 262506
62867 262506 260340 257939 255790 254369 253634 253043 252022 250422 248607 247109 246145 245475 244732 243787 242688 241392
62851 241392 239757 237815 235861 234193 232836 231600 230325 229007 227712 226468 225286 224268 223585 223290 223188
62836 223188 222987 222585 222143 221898 221899 221985 221944 221740 221576 221690 222020 222209 222001 221575 221310 221310 221349 221216 220922 220587 220335
62815 220335 220287 220456 220622 220552 220352 220367 220651 220795 220420 219601 218670 217813 217046 216414 215964 215627 215295 214964 214674 214441
$$ packed form
62917H39033n346p986j0631j3407j6237j8616k0149k1159k2288k3557k4295k4081
62905F31281k3247k2237k1051j9608j8227j7271j6626j5919j5071j4252j3453
62894D34319j2558j1662j0977j0476r962r423r006q673q236p683p181o792o444
62881C15246o103n778n368m831m377m210m133l768l122k596k363k201j975j915
62867B62506k166k401k149j421p35n91j021j600j815j498r64o70p43r45j099j296
62851B41392j635j942j954j668j357j236j275j318j295j244j182j018o83k95j02
62836B23188k01m02m42k45JQ6m1k04j64J14L30J89k08m26k65%L9j33k94l35k52
62815B20335m8J69J66p0k00J5K84J44l75q19r31q57p67o32m50l37l32l31k90k33
$$ plain form
62795 214441 214380 214782 215882 217546 219354 220926 222087 222805 223127 223182 223115 222989 222768 222347 221671 220882 220345 220352 220788
62776 220788 221275 221630 221981 222432 222898 223358 223941 224623 225133 225384 225713 226415 227316 228104 228861 229874 231092 232228
62758 232228 233312 234753 236786 239203 241660 243960 245969 247610 249051 250715 252947 255778 259033 262502
62744 262502 265972 269324 272670 276262 280185 284272 288373 292569 297095 302159 307865 314184 320971 328129
62730 328129 335774 344176 353530 363917 375449 388322 402686 418578 435952 454697 474650 495766
62718 495766 518239 542266 567623 593664 619796 645890 672181 698812 725440 751192 775009
62707 775009 796111 814120 828714 839338 845412 846711 843324 835373 823030 806757 787238 765031
62695 765031 740505 714138 686599 658466 630099 601859 574222 547596 522191 498199 475896
$$ packed form
62795B14441o1M02J100J664J808J572J161P18L22N5o7j26k21m21o76p89n37PM36
62776B20788M87L55L51M51M66M60N83O82N10K51L29P02R01P88P57J013J218J136
62758B32228J084J441K033K417K457K300K009J641J441J664K232K831L255L469
62744B62502L470L352L346L592L923M087M101M196M526N064N706O319O787P158
62730C28129P645Q402R354J0387J1532J2873J4364J5892J7374J8745J9953K1116
62718D95766K2473K4027K5357K6041K6132K6094K6291K6631K6628K5752K3817
62707G75009K1102J8009J4594J0624O074J299l387p951j2343j6273j9519k2207
62695G65031k4526k6367k7539k8133k8367k8240k7637k6626k5405k3992k2303
$$ plain form
62684 475896 455453 436772 419584 403571 388418 373972 360466 348372 337875 328648 320259 312641
62672 312641 305985 300340 295481 291115 287105 283570 280833 279165 278471 278368 278624 279331 280528 281911 283202
62657 283202 284693 287094 290790 295421 300308 305155 310299 316351 323655 332078 341274 351113 361780 373501
62643 373501 386332 400256 415330 431587 448912 467169 486424 506904 528777 552040 576519
62632 576519 601814 627281 652263 676355 699294 720598 739498 755321 767755 776627 781545 781953
62620 781953 777550 768559 755544 739060 719484 697155 672610 646663 620184 593708 567294 540864
62608 540864 514728 489654 466356 444981 425181 406586 389084 372730 357602 343803 331401
62597 331401 320270 310116 300693 291883 283555 275560 267976 261153 255321 250307 245799 241728 238159 234986
$$ packed form
62684D75896k0443j8681j7188j6013j5153j4446j3506j2094j0497r227q389p618
62672C12641o656n645m859m366m010l535k737j668o94j03K56P07J197J383J291
62657B83202J491K401L696M631M887M847N144O052P304Q423R196R839J0667J1721
62643C73501J2831J3924J5074J6257J7325J8257J9255K0480K1873K3263K4479
62632E76519K5295K5467K4982K4092K2939K1304J8900J5823J2434Q872M918M08
62620G81953m403q991j3015j6484j9576k2329k4545k5947k6479k6476k6414k6430
62608E40864k6136k5074k3298k1375j9800j8595j7502j6354j5128j3799j2402
62597C31401j1131j0154r423q810q328p995p584o823n832n014m508m071l569l173
$$ plain form
62583 234986 232050 229473 227499 225985 224398 222457 220518 219152 218542 218415 218414 218296 217909 217203 216288 215366 214581
62566 214581 213968 213519 213231 213065 212943 212814 212797 213239 214468 216374 218370 219976 221374 223194 225740 228682
62550 228682 231526 234187 236944 240021 243398 246951 250669 254741 259432 264812 270612 276494 282496 289097
62536 289097 296804 305808 316033 327304 339329 351732 364324 377284 390880 404952 418785 431485
62524 431485 442458 451550 458815 464188 467401 468210 466626 462846 457049 449351 439942 429125 417258 404752
62510 404752 392060 379468 366945 354403 342112 330625 320231 310705 301664 293001 284840 277309
62498 277309 270487 264450 259188 254555 250404 246651 243182 239864 236727 233958 231648 229728 228243 227430
62484 227430 227321 227510 227572 227578 227937 228809 229926 230945 231767 232478 233213 234091 235179 236478 238030 240035 242764
$$ packed form
62583B34986k936k577j974j514j587j941j939j366o10j27jj18l87p06r15r22p85
62566B14581o13m49k88j66j22j29j7M42J229J906J996J606J398J820K546K942
62550B28682K844K661K757L077L377L553L718M072M691N380N800N882O002O601
62536B89097P707R004J0225J1271J2025J2403J2592J2960J3596J4072J3833J2700
62524D31485J0973R092P265N373L213Q09j584l780n797p698r409j0817j1867j2506
62510D04752j2692j2592j2523j2542j2291j1487j0394r526r041q663q161p531
62498B77309o822o037n262m633m151l753l469l318l137k769k310j920j485q13
62484B27430j09J89O2OL59Q72J117J019Q22P11P35Q78J088J299J552K005K729
$$ plain form
62467 242764 246371 250787 255785 261085 266539 272277 278579 285559 293116 301303 310525 321157 333064 345743
62453 345743 358904 372721 387518 403424 420369 438243 456899 476069 495309 514075 531856
62442 531856 548301 563210 576476 588061 598032 606492 613535 619376 624486 629427 634540 639977 646023
62429 646023 653112 661465 670973 681536 693223 705937 719273 732928 746901 760882 773681 783655
62417 783655 789713 791698 789979 785011 777123 766285 752053 734053 712552 688346 662170 634517
62405 634517 605904 576925 548076 519837 492913 467993 445284 424600 405884 389211 374351
62394 374351 360858 348728 338433 330084 323068 316795 311329 306877 303122 299612 296493 294273 292978
62381 292978 292078 291280 290874 291182 292080 293236 294498 295845 297138 298155 298742 298834 298416 297507 296111 294164 291638
$$ packed form
62467B42764L607M416M998N300N454N738O302O980P557Q187R222J0632J1907J2679
62453C45743J3161J3817J4797J5906J6945J7874J8656J9170J9240J8766J7781
62442E31856J6445J4909J3266J1585R971Q460P043N841N110M941N113N437O046
62429F46023P089Q353R508J0563J1687J2714J3336J3655J3973J3981J2799R974
62417G83655O058J985j719m968p888j0838j4232j8000k1501k4206k6176k7653
62405F34517k8613k8979k8849k8239k6924k4920k2709k0684j8716j6673j4860
62394C74351j3493j2130j0295q349p016o273n466m452l755l510l119k220j295
62381B92978r00p98m06L08Q98J156J262J347J293J017N87R2m18r09j396j947k526
$$ plain form
62364 291638 288695 285561 282234 278521 274473 270543 267121 264070 260917 257472 254004 250823 247924 245120
62350 245120 242355 239747 237405 235307 233355 231480 229752 228423 227765 227772 228067 228235 228244 228441 229100 230122 231204
62333 231204 232233 233367 234789 236496 238323 240152 241998 243932 245996 248226 250793 253939 257723 261873
62319 261873 266023 270094 274294 278795 283526 288316 293088 297904 302897 308226 313937 319884 325983 332555
62305 332555 340154 348990 358775 369296 380809 393668 407834 423104 439547 457298 476062 495306
62293 495306 514954 535351 556440 577404 597303 615626 631919 645277 654778 660381 662981 663480
62281 663480 662058 658421 652427 644247 634072 621979 608156 593076 577279 561087 544727 528638
62269 528638 513402 499256 485916 473049 460716 449133 438205 427640 417419 407772 398668 389717
$$ packed form
62364B91638k943l134l327l713m048l930l422l051l153l445l468l181k899k804
62350B45120k765k608k342k098j952j875j728j329o58PK95J68RJ97O59J022J082
62333B31204J029J134J422J707J827J829J846J934K064K230K567L146L784M150
62319B61873M150M071M200M501M731M790M772M816M993N329N711N947O099O572
62305C32555P599Q836R785J0521J1513J2859J4166J5270J6443J7751J8764J9244
62293D95306J9648K0397K1089K0964J9899J8323J6293J3358R501N603K600M99
62281F63480j422l637n994q180j0175j2093j3823j5080j5797j6192j6360j6089
62269E28638j5236j4146j3340j2867j2333j1583j0928j0565j0221r647r104q951
$$ plain form
62257 389717 380715 371967 363862 356368 349177 342157 335448 329277 323913 319682 316696 314568 312647 310604
62243 310604 308659 307178 306184 305385 304573 303893 303684 304115 305044 306200 307396 308497 309280 309544 309342 309000 308829
62226 308829 308932 309291 309873 310600 311343 312070 312916 314033 315409 316935 318585 320477 322788 325649 329036 332785
62210 332785 336779 341109 345934 351215 356822 362911 369953 378243 387595 397699 408591 420609 434029
62197 434029 448952 465419 483361 502515 522625 543651 565513 587666 609145 629070 646869
62186 646869 662062 674167 682943 688492 690981 690418 686850 680542 671777 660602 646976 631074 613293
62173 613293 594020 573626 552646 531724 511355 491827 473465 456685 441644 428012 415292
62162 415292 403382 392636 383375 375462 368411 361813 355583 349875 344870 340646 337177 334423 332338 330773
$$ packed form
62257C89717r002q748q105p494p191p020o709o171n364m231k986k128j921k043
62243C10604j945j481r94p99q12o80k09M31R29J156J196J101P83K64k02l42j71
62226C08829J03L59N82P27P43P27Q46J117J376J526J650J892K311K861L387L749
62210C32785L994M330M825N281N607O089P042Q290R352J0104J0892J2018J3420
62197D34029J4923J6467J7942J9154K0110K1026K1862K2153K1479J9925J7799
62186F46869J5193J2105Q776N549K489n63l568o308q765j1175j3626j5902j7781
62173F13293j9273k0394k0980k0922k0369j9528j8362j6780j5041j3632j2720
62162D15292j1910j0746r261p913p051o598o230n708n005m224l469k754k085j565
$$ plain form
62148 330773 329440 328124 326958 326322 326378 326800 327128 327305 327715 328749 330460 332644 335053 337545 340151 343050
62132 343050 346325 349743 352945 355902 358992 362503 366292 370101 374017 378372 383260 388452 393773 399266
62118 399266 404892 410328 415266 419784 424242 428842 433473 438024 442680 447863 453958 461170 469548 479034
62104 479034 489547 501094 513764 527488 541821 556088 569743 582433 593677 602739 609056 612716
62092 612716 614271 614092 612099 608121 602256 594745 585648 574886 562563 549113 535141 521165 507506
62079 507506 494306 481626 469563 458320 448154 439244 431582 424962 419115 413863 409117 404725 400396
62066 400396 395929 391485 387495 384263 381742 379720 378094 376908 376230 376095 376499 377353 378459 379612 380678
62051 380678 381520 381893 381522 380316 378497 376508 374779 373517 372594 371639 370260 368276 365739 362833 359772
$$ packed form
62148C30773j333j316j166o36N6M22L28J77M10J034J711K184K409K492K606K899
62132C43050L275L418L202K957L090L511L789L809L916M355M888N192N321N493
62118C99266N626N436M938M518M458M600M631M551M656N183O095P212Q378R486
62104D79034J0513J1547J2670J3724J4333J4267J3655J2690J1244R062O317L660
62092F12716J555j79j993l978n865p511r097j0762j2323j3450j3972j3976j3659
62079E07506j3200j2680j2063j1243j0166q910p662o620n847n252m746m392m329
62066D00396m467m444l990l232k521k022j626j186o78j35M04Q54J106J153J066
62051C80678Q42L73l71j206j819j989j729j262r23r55j379j984k537k906l061
$$ plain form
62036 359772 356798 354214 352276 351003 350117 349304 348565 348210 348487 349317 350506 352025 353957 356286 358961 362089
62020 362089 365839 370158 374834 379887 385592 392063 399013 406133 413482 421325 429702 438358 447016 455528
62006 455528 463872 472215 480915 490229 499982 509718 519244 528787 538484 547844 555947 562173 566536 569287
61992 569287 570374 569519 566696 562230 556358 548939 539772 528989 516909 503635 489147 473730 457961
61979 457961 442179 426302 410355 394895 380650 367849 356169 345254 335095 325889 317740 310583
61967 310583 304277 298699 293741 289210 284807 280303 275754 271446 267607 264231 261164 258176 254979 251435
61953 251435 247854 244818 242536 240550 238294 235777 233483 231799 230842 230698 231395 232642 233922 235057 236369
61938 236369 238157 240183 241866 242835 243128 242956 242480 241825 241108 240389 239630 238680 237279 235121 232082 228448
$$ packed form
62036C59772k974k584j938j273q86q13p39l55K77Q30J189J519J932K329K675L128
62020C62089L750M319M676N053N705O471O950P120P349P843Q377Q656Q658Q512
62006D55528Q344Q343Q700R314R753R736R526R543R697R360Q103O226M363K751
61992E69287J087q55k823m466n872p419r167j0783j2080j3274j4488j5417j5769
61979D57961j5782j5877j5947j5460j4245j2801j1680j0915j0159r206q149p157
61967C10583o306n578m958m531m403m504m549m308l839l376l067k988l197l544
61953B51435l581l036k282j986k256k517k294j684r57j44O97J247J280J135J312
61938B36369J788K026J683R69K93j72m76o55p17p19p59r50j401k158l039l634
$$ plain form
61922 228448 224821 221698 219115 216744 214274 211644 209002 206575 204564 202976 201562 200086 198710 197850
61908 197850 197521 197126 196193 195103 194684 195181 196085 196932 197762 198683 199488 200025 200579 201541 202958 204725 206986
61891 206986 209919 213298 216660 219849 223101 226645 230531 234745 239221 243780 248415 253551 259679 266714
61877 266714 274086 281522 289342 297830 306645 315133 322977 330315 337316 343910 349885 355090 359499 363171
61863 363171 366176 368515 370112 370850 370676 369736 368440 367240 366194 364900 363085 361207 360233 360803 362805
61848 362805 365746 369278 373257 377560 382063 386722 391509 396217 400395 403476 405104 405423 404977 404209 403092
61833 403092 401358 398924 395868 392122 387587 382590 377812 373608 369636 365369 360731 356004 351334 346603
61819 346603 341689 336606 331401 326122 320891 315859 311100 306632 302535 298936 295914 293514 291783 290699
$$ packed form
61922B28448l627l123k583k371k470k630k642k427k011j588j414j476j376q60
61908A97850l29l95r33j090m19M97R04Q47Q30R21Q05N37N54R62J417J767K261
61891B06986K933L379L362L189L252L544L886M214M476M559M635N136O128P035
61877B66714P372P436P820Q488Q815Q488P844P338P001O594N975N205M409L672
61863C63171L005K339J597P38j74r40j296j200j046j294j815j878r74N70K002
61848C62805K941L532L979M303M503M659M787M708M178L081J628L19m46p68j117
61833D03092j734k434l056l746m535m997m778m204l972m267m638m727m670m731
61819C46603m914n083n205n279n231n032m759m468m097l599l022k400j731j084
$$ plain form
61805 290699 290161 290169 290968 292805 295561 298813 302299 306177 310748 316103 322190 329123 337173 346409 356502
61790 356502 367016 377788 388884 400300 411909 423711 435881 448388 460672 471870 481352 488926
61778 488926 494667 498706 501167 502120 501588 499690 496808 493467 490061 486787 483849 481576 480329 480365 481793
61763 481793 484514 488129 492028 495624 498503 500411 501218 500839 499094 495635 490165 482774 473959 464340 454421
61748 454421 444548 434870 425281 415564 405663 395699 385761 375847 366099 356896 348585 341176 334400 328017
61734 328017 321994 316433 311378 306723 302333 298260 294679 291523 288378 284955 281525 278611 276332 274381
61720 274381 272590 271095 269863 268520 266875 265340 264509 264515 265009 265583 266006 266249 266527 267196 268374 269777 271148
61703 271148 272690 274817 277576 280617 283697 286919 290425 294053 297356 299824 301117 301269 300678 299772 298657
$$ packed form
61805B90699n38QP99J837K756L252L486L878M571N355O087O933Q050R236J0093
61790C56502J0514J0772J1096J1416J1609J1802J2170J2507J2284J1198R482P574
61778D88926N741M039K461R53n32j898k882l341l406l274k938k273j247L6J428
61763D81793K721L615L899L596K879J908Q07l79j745l459n470p391q815r619r919
61748D54421r873r678r589r717r901r964r938r914r748r203q311p409o776o383
61734C28017o023n561n055m655m390m073l581l156l145l423l430k914k279j951
61720B74381j791j495j232j343j645j535q31OM94N74M23K43K78O69J178J403J371
61703B71148J542K127K759L041L080L222L506L628L303K468J293J52n91r06j115
$$ plain form
61688 298657 297157 295166 292754 289995 286855 283345 279639 275985 272568 269458 266574 263707 260734 257832
61674 257832 255371 253526 252081 250678 249185 247785 246762 246268 246241 246471 246748 246961 247124 247316 247596 247940 248251
61657 248251 248434 248457 248318 247968 247347 246476 245427 244254 243018 241870 240937 240125 239160 237869 236274 234388 232095
61640 232095 229399 226603 224116 222129 220553 219140 217575 215624 213335 211026 208955 207115 205447 204037
61626 204037 202892 201735 200299 198781 197697 197297 197330 197372 197157 196595 195722 194705 193726 192812 191918 191173 190842
61609 190842 190970 191253 191303 190951 190301 189662 189431 189781 190432 190934 191267 191928 193310 195208 197088 198652 199963
61592 199963 201186 202457 203879 205390 206706 207612 208315 209230 210439 211584 212378 212959 213635 214469 215344 216279
61576 216279 217399 218615 219587 220112 220344 220520 220590 220323 219688 218892 218024 216893 215340 213539 211746 209858 207504
$$ packed form
61688B98657j500j991k412k759l140l510l706l654l417l110k884k867k973k902
61674B57832k461j845j445j403j493j400j023m94k7K30K77K13J63J92K80L44L11
61657B48251J83K3j39l50o21q71j049j173j236j148r33q12r65j291j595j886k293
61640B32095k696k796k487j987j576j413j565j951k289k309k071j840j668j410
61626B04037j145j157j436j518j084m00L3M2k15n62q73j017r79r14q94p45l31
61609A90842J28K83N0l52o50o39k31L50O51N02L33O61J382J898J880J564J311
61592A99963J223J271J422J511J316R06P03R15J209J145P94N81O76Q34Q75R35
61576B16279J120J216R72N25K32J76P0k67o35p96q68j131j553j801j793j888k354
$$ plain form
61559 207504 204655 201909 199975 198978 198409 197704 196707 195582 194455 193242 191726 189772 187517 185416 183930
61544 183930 183046 182213 180875 179001 176957 174935 172812 170587 168576 167013 165677 164222 162700 161450 160551
61529 160551 159736 158830 157945 157148 156276 155256 154338 153742 153270 152543 151541 150644 150152 150015 150057 150228 150499 150687
61511 150687 150582 150241 150001 150142 150599 151060 151348 151612 152116 152931 153932 154986 155987 156726 156965 156736 156424 156463
61493 156463 157042 158124 159577 161137 162404 163102 163320 163380 163512 163787 164285 165079 166024 166762 167056 167015 166922 166895 166886
61474 166886 166927 167247 168039 169183 170285 171007 171295 171283 171084 170778 170488 170343 170349 170388 170291 169864 168943 167622 166397
61455 166397 165813 165948 166388 166791 167233 167916 168763 169502 170010 170398 170818 171324 171877 172407 172926 173605 174620 175864
61437 175864 176985 177815 178587 179622 180956 182441 184007 185631 187203 188642 190055 191528 192848 193658 193900
$$ packed form
61559B07504k849k746j934r97n69p05r97j125j127j213j516j954k255k101j486
61544A83930q84q33j338j874k044k022k123k225k011j563j336j455j522j250q99
61529A60551q15r06q85p97q72j020r18n96m72p27j002q97m92j37M2J71K71J88
61511A50687j05l41k40J41M57M61K88K64N04Q15J001J054J001P39K39k29l12L9
61493A56463N79J082J453J560J267O98K18O0J32K75M98P94R45P38K94m1r3k7r
61474A66886M1L20P92J144J102P22K88j2j99l06k90j45OL9r7m27r21j321j225
61455A66397n84J35M40M03M42O83Q47P39N08L88M20N06N53N30N19O79J015J244
61437A75864J121Q30P72J035J334J485J566J624J572J439J413J473J320Q10K42
$$ plain form
61422 193900 193878 193952 194306 194993 195957 196995 197846 198402 198716 198821 198599 197859 196482 194600 192700 191401 190973 191110
61404 191110 191291 191284 191170 191063 191000 190993 190951 190608 189746 188533 187451 186917 187013 187462 187761 187575 187146 187152 187890 188871 189490
61383 189490 189862 190557 191695 192853 193805 194803 196043 197345 198552 199788 201184 202698 204335 206165 207958
61368 207958 209269 210078 210933 212127 213207 213667 213761 214129 214894 215674 216339 217184 218348 219506 220266 220552 220476 220139
61350 220139 219654 219164 218715 218257 217776 217278 216634 215665 214418 213195 212242 211596 211260 211323 211779 212363 212740 212796 212685
61331 212685 212591 212582 212659 212891 213434 214411 215770 217272 218636 219714 220585 221494 222665 224079 225452 226529 227424
61314 227424 228518 229987 231593 233018 234260 235556 236995 238410 239624 240616 241435 242076 242537 242887 243212 243488
61298 243488 243539 243194 242520 241935 241979 242891 244454 246272 248157 250151 252300 254524 256694 258702 260406 261626
$$ packed form
61422A93900k2P4L54O87R64J038Q51N56L14J05k22p40j377j882j900j299m28J37
61404A91110J81pj14j07o3pm2l43q62j213j082n34R6M49K99j86m29OP38R81O19
61383A89490L72O95J138J158R52R98J240J302J207J236J396J514J637J830J793
61368B07958J311Q09Q55J194J080M60R4L68P65P80O65Q45J164J158P60K86p6l37
61350B20139m85m90m49m58m81m98o44r69j247j223r53o46l36O3M56N84L77N6j11
61331B12685r4rP7K32N43R77J359J502J364J078Q71R09J171J414J373J077Q95
61314B27424J094J469J606J425J242J296J439J415J214R92Q19O41M61L50L25K76
61298B43488N1l45o74n85M4R12J563J818J885J994K149K224K170K008J704J220
$$ plain form
61282 261626 262283 262519 262676 263121 264064 265450 266988 268294 269083 269306 269174 268970 268784 268443 267776 266878 265972 265112
61264 265112 264216 263410 263065 263326 263860 264291 264757 265756 267524 269822 272327 274942 277645 280324 282957 285790
61248 285790 289148 293113 297538 302306 307409 312721 317858 322344 325865 328391 330119 331317 332125 332396 331829
61233 331829 330355 328362 326370 324485 322324 319547 316291 312958 309706 306355 302781 299199 296011 293488
61219 293488 291643 290307 289275 288485 288120 288418 289335 290494 291547 292499 293593 294962 296484 297947 299262
61204 299262 300481 301721 303141 304943 307336 310406 313985 317680 321111 324095 326636 328746 330401 331618
61190 331618 332447 332829 332617 331830 330820 330008 329438 328662 327201 325108 322986 321375 320180 318870 317184 315469
61174 315469 314210 313481 313013 312665 312545 312749 313285 314275 315903 318084 320414 322583 324649 326751 328809 330679
$$ packed form
61282B61626O57K36J57M45R43J386J538J306P89K23j32k04j86l41o67q98r06q60
61264B65112q96q06l45K61N34M31M66R99J768K298K505K615K703K679K633K833
61248B85790L358L965M425M768N103N312N137M486L521K526J728J198Q08K71n67
61233C31829j474j993j992j885k161k777l256l333l252l351l574l582l188k523
61219B93488j845j336j032p90l65K98R17J159J053R52J094J369J522J463J315
61204B99262J219J240J420J802K393L070L579L695L431K984K541K110J655J217
61190C31618Q29L82k12p87j010q12n70p76j461k093k122j611j195j310j686j715
61174C15469j259p29m68l48j20K04N36R90J628K181K330K169K066K102K058J870
$$ plain form
61158 330679 332473 334485 336854 339479 342185 344830 347296 349547 351666 353695 355498 356923 358074 359264
61144 359264 360680 362279 364013 365994 368321 370906 373630 376650 380364 385023 390431 396083 401519 406461
61130 406461 410723 414149 416678 418336 419117 419017 418242 417223 416249 415189 413691 411559 408781 405346 401302
61115 401302 396944 392662 388552 384415 380141 375868 371710 367580 363366 359056 354590 349833 344854 340015
61101 340015 335627 331651 327862 324141 320464 316817 313365 310522 308620 307567 307030 306911 307409 308632 310324
61086 310324 311982 313131 313502 313088 312095 310758 309223 307601 306072 304852 304085 303798 303919 304316 304973 306114
61070 306114 308014 310656 313740 317107 320936 325346 330078 334821 339719 345276 351777 359034 366698 374585
61056 374585 382671 390986 399602 408606 418027 427797 437777 447764 457524 466884 475799 484250 492140 499354
$$ packed form
61158C30679J794K012K369K625K706K645K466K251K119K029J803J425J151J190
61144C59264J416J599J734J981K327K585K724L020L714M659N408N652N436M942
61130D06461M262L426K529J658P81j00p75j019r74j060j498k132k778l435m044
61115D01302m358m282m110m137m274m273m158m130m214m310m466m757m979m839
61101C40015m388l976l789l721l677l647l452k843j902j053n37j19M98J223J692
61086C10324J658J149L71m14r93j337j535j622j529j220p67k87J21L97O57J141
61070C06114J900K642L084L367L829M410M732M743M898N557O501P257P664P887
61056C74585Q086Q315Q616R004R421R770R980R987R760R360Q915Q451P890P214
$$ plain form
61042 499354 505798 511295 515558 518411 519993 520655 520693 520261 519410 518085 516154 513617 510740 507895 505307
61027 505307 503088 501389 500349 499939 500000 500416 501172 502291 503869 506125 509245 513214 517892 523198 529077
61012 529077 535364 541870 548577 555590 562886 570243 577441 584388 591039 597335 603271 608918 614272 619129
60998 619129 623185 626311 628746 630955 633267 635659 637987 640293 642748 645353 647985 650802 654296 658834
60984 658834 664330 670562 677582 685614 694714 704762 715674 727453 740170 754055 769503 786782
60972 786782 805837 826502 848774 872750 898492 926189 956263 989053 1024441 1061997 1101479
60961 1101479 1143087 1187317 1234757 1285912 1341186 1401178 1466947 1539603 1619565 1706673 1801276
60950 1801276 1904818 2019115 2145671 2286201 2443383 2620558 2821198 3049355 3310046
$$ packed form
61042D99354O444N497M263K853J582O62L8m32q51j325j931k537k877k845k588
61027E05307k219j699j040m10O1M16P56J119J578K256L120L969M678N306N879
61012E29077O287O506O707P013P296P357P198O947O651O296N936N647N354M857
60998F19129M056L126K435K209K312K392K328K306K455K605K632K817L494M538
60984F58834N496O232P020Q032R100J0048J0912J1779J2717J3885J5448J7279
60972G86782J9055K0665K2272K3976K5742K7697L0074L2790L5388L7556L9482
60961A101479M1608M4230M7440N1155N5274N9992O5769P2656P9962Q7108R4603
60950A801276J03542J14297J26556J40530J57182J77175K00640K28157K60691
$$ plain form
60941 3310046 3608329 3948385 4334456 4772103 5267342 5825424 6452288 7154363 7927690
60932 7927690 8738235 9513075 10160947 10614294 10861032 10942326 10924680 10873437 10841038 10859482
60922 10859482 10925494 10988552 10963281 10768819 10369218 9785622 9076646 8308255 7534108 6790321
60912 6790321 6097585 5465124 4895263 4387290 3938972 3546338 3203871 2905599 2645896
60903 2645896 2419521 2221590 2047812 1894587 1758979 1638728 1532089 1437387 1352839 1276982
60893 1276982 1208925 1147896 1092814 1042672 997026 955612 917674 882153 848449 816515 786256
60882 786256 757299 729401 702656 677218 653095 630276 608755 588359 568851 550253 532833
60871 532833 516751 501911 488141 475253 462960 451057 439720 429342 419978 411226 402696 394376
$$ packed form
60941C310046K98283L40056L86071M37647M95239N58082O26864P02075P73327
60932G927690Q10545P74840O47872M53347K46738Q1294j7646n1243l2399J8444
60922A0859482O6012O3058k5271j94462l99601n83596p08976p68391p74147p43787
60912F790321o92736o32461n69861n07973m48318l92634l42467k98272k59703
60903B645896k26375j97931j73778j53225j35608j20251j06639r4702q4548p5857
60893A276982o8057o1029n5082n0142m5646m1414l7938l5521l3704l1934l0259
60882G86256k8957k7898k6745k5438k4123k2819k1521k0396j9508j8598j7420
60871E32833j6082j4840j3770j2888j2293j1903j1337j0378r364q752q530q320
$$ plain form
60859 394376 386461 379053 372144 365662 359436 353285 347267 341696 336834 332660 329001 325718 322696 319842
60845 319842 317144 314627 312194 309683 307107 304641 302239 299462 295904 291693 287410 283551 280169 276957
60831 276957 273543 269708 265493 261155 257023 253339 250154 247311 244505 241501 238367 235443 233032 231157
60817 231157 229645 228325 227058 225626 223808 221626 219418 217599 216388 215824 215915 216659 217897 219309 220610
60802 220610 221729 222801 224067 225725 227724 229673 231135 232103 233039 234234 235390 236059 236326 236722 237520 238461
60786 238461 239207 239691 239916 239745 239108 238160 237030 235595 233686 231312 228546 225375 221915 218555 215632 213098
60770 213098 210718 208445 206335 204241 201959 199637 197657 196067 194494 192728 191078 189954 189263 188468 187166
60755 187166 185431 183614 181986 180605 179390 178210 176921 175419 173743 172094 170705 169676 168950 168441 168123
$$ packed form
60859C94376p915p408o909o482o226o151o018n571m862m174l659l283l022k854
60845C19842k698k517k433k511k576k466k402k777l558m211m283l859l382l212
60831B76957l414l835m215m338m132l684l185k843k806l004l134k924k411j875
60817B31157j512j320j267j432j818k182k208j819j211n64R1P44J238J412J301
60802B20610J119J072J266J658J999J949J462R68R36J195J156O69K67L96P98R41
60786B38461P46M84K25j71o37r48j130j435j909k374k766l171l460l360k923k534
60770B13098k380k273k110k094k282k322j980j590j573j766j650j124o91p95j302
60755A87166j735j817j628j381j215j180j289j502j676j649j389j029p26n09l18
$$ plain form
60740 168123 168017 168167 168619 169380 170392 171586 172892 174141 175076 175593 175894 176228 176559 176712 176735 176841 177016 177040
60722 177040 176922 176939 177145 177211 176945 176584 176366 176130 175675 175211 175070 175175 175115 174620 173667 172306 170761 169527 169009
60703 169009 169052 169145 169013 168794 168708 168875 169346 169985 170411 170387 170206 170334 170713 170840 170539 170219 170263 170540 170705 170677 170639
60682 170639 170752 171017 171261 171207 170701 169902 169047 168110 166951 165778 165043 164809 164583 163942 163016 162164 161529 161105
60664 161105 160987 161260 161822 162528 163353 164252 165084 165853 166810 168055 169264 170068 170581 171211 172119 173139 174142
60647 174142 175100 175798 175868 175230 174256 173369 172650 171957 171246 170584 169960 169260 168448 167638 166943 166333 165701 165057 164570
60628 164570 164384 164433 164506 164504 164542 164789 165276 165878 166458 166963 167437 167990 168720 169600 170461 171157 171716 172296 172985 173683
60608 173683 174179 174302 173992 173312 172510 171968 171928 172133 171932 170967 169676 168856 168751 168918 169053 169474 170499 171720
$$ packed form
60740A68123j06J50M52P61J012J194J306J249R35N17L01L34L31J53K3J06J75K4
60722A77040j18J7K06O6k66l61k18k36m55m64j41J05o0m95r53j361j545j234n18
60703A69009M3R3j32k19q6J67M71O39M26k4j81J28L79J27l01l20M4K77J65k8l8
60682A70639J13K65K44n4n06p99q55r37j159j173p35k34k26o41r26q52o35m24
60664A61105j18K73N62P06Q25Q99Q32P69R57J245J209Q04N13O30R08J020J003
60647A74142R58O98P0o38r74q87p19o93p11o62o24p00q12q10o95o10o32o44m87
60628A64570j86M9P3kL8K47M87O02N80N05M74N53P30Q80Q61O96N59N80O89O98
60608A73683M96J23l10o80q02n42m0K05k01r65j291q20j05J67J35M21J025J221
$$ plain form
60590 171720 172452 172682 173009 173642 174048 173818 173327 173143 173182 172900 172146 171331 170776 170334 169767 169117 168534 167998 167445
60571 167445 167000 166828 166827 166731 166500 166399 166598 166913 167071 167095 167240 167622 168105 168525 168820 168982 169076 169300 169808 170429
60551 170429 170788 170795 170736 170767 170673 170345 170182 170650 171606 172497 173086 173613 174257 174889 175418 175969 176558 176954 177055 177142 177556
60530 177556 178325 179329 180568 182068 183627 184989 186217 187665 189488 191336 192630 193156 193331 193788 194687
60515 194687 195567 196002 196264 197084 198836 201266 204059 207226 210806 214538 218184 221975 226315 231149 235926
60500 235926 240215 244061 247643 250838 253323 254978 256011 256680 257004 256798 255954 254641 253248 252177 251705
60485 251705 251972 253006 254729 256978 259594 262490 265706 269433 273929 279388 285884 293450 302086 311625
60471 311625 321685 331883 342014 351905 361156 369166 375346 379244 380626 379683 377109 373690 369815 365530
$$ packed form
60590A71720P32K30L27O33M06k30m91j84L9k82p54q15n55m42n67o50n83n36n53
60571A67445m45j72jr6k31j01J99L15J58K4J45L82M83M20K95J62R4K24N08O21
60551A70429L59Pn9L1r4l28j63M68R56Q91N89N27O44O32N29N51N89L96J01Q7M14
60530A77556P69J004J239J500J559J362J228J448J823J848J294N26J75M57Q99
60515A94687Q80M35K62Q20J752K430K793L167L580L732L646L791M340M834M777
60500B35926M289L846L582L195K485J655J033O69L24k06q44j313j393j071m72
60485B51705K67J034J723K249K616K896L216L727M496N459O496P566Q636R539
60471C11625J0060J0198J0131R891R251Q010O180L898J382r43k574l419l875m285
$$ plain form
60457 365530 360994 356532 352293 348201 344348 341125 338805 337285 336429 336382 337296 338938 340922 343279 346534
60442 346534 351213 357402 364816 373158 382432 392994 405294 419487 435310 452336 470238 488702
60430 488702 507196 525028 541678 556984 570980 583581 594511 603557 610822 616612 620998 623575
60418 623575 623682 620746 614342 604146 590069 572407 551753 528881 504859 481001 458319 437009
60406 437009 416757 397470 379408 362758 347522 333844 321941 311595 302156 293212 284918 277516
60394 277516 270930 265027 259851 255305 250991 246675 242638 239225 236353 233759 231457 229574 227996 226553
60380 226553 225333 224449 223645 222558 221199 219820 218443 216928 215393 214118 213120 212208 211412 210941 210709 210329
60364 210329 209661 208969 208467 208063 207652 207331 207168 207031 206799 206551 206422 206459 206716 207326 208348 209648 210950 211952
$$ packed form
60457C65530m536m462m239m092l853l223k320j520q56m7R14J642J984K357L255
60442C46534M679O189P414Q342R274J0562J2300J4193J5823J7026J7902J8464
60430D88702J8494J7832J6650J5306J3996J2601J0930R046P265N790M386K577
60418F23575J07k936o404j0196j4077j7662k0654k2872k4022k3858k2682k1310
60406D37009k0252j9287j8062j6650j5236j3678j1903j0346r439q944q294p402
60394B77516o586n903n176m546m314m316m037l413k872k594k302j883j578j443
60380B26553j220q84q04j087j359j379j377j515j535j275r98r12p96m71k32l80
60364B10329o68o92n02m04m11l21j63j37k32k48j29L7K57O10J022J300J302J002
$$ plain form
60346 211952 212480 212704 213103 213966 214999 215737 216271 217201 218805 220655 222231 223543 224926 226475 227972 229241
60330 229241 230326 231381 232560 233949 235538 237291 239247 241437 243621 245332 246319 246818 247277 247978 249048
60315 249048 250669 252982 255790 258572 260887 262704 264318 265990 267727 269398 270979 272590 274248 275742
60301 275742 276879 277780 278762 279994 281425 283044 284970 287272 289905 292855 296162 299727 303300 306752 310196
60286 310196 313678 316946 319606 321401 322222 322042 321066 319807 318761 317963 317033 315613 313664 311379 308980
60271 308980 306648 304501 302580 300873 299345 297883 296245 294186 291664 288851 285951 283102 280489 278410
60257 278410 277104 276534 276466 276749 277442 278634 280281 282301 284792 287986 291961 296483 301187 305809 310205
60242 310205 314264 317970 321508 325143 328859 332165 334334 334948 334171 332477 330069 326664 321920 315974 309427
$$ packed form
60346B11952N28K24L99Q63J033P38N34R30J604J850J576J312J383J549J497J269
60330B29241J085J055J179J389J589J753J956K190K184J711R87M99M59P01J070
60315B49048J621K313K808K782K315J817J614J672J737J671J581J611J658J494
60301B75742J137R01R82J232J431J619J926K302K633K950L307L565L573L452L444
60286C10196L482L268K660J795Q21j80r76j259j046p98r30j420j949k285k399
60271C08980k332k147j921j707j528j462j638k059k522k813k900k849k613k079
60257B78410j306n70o8K83O93J192J647K020K491L194L975M522M704M622M396
60242C10205M059L706L538L635L716L306K169O14p77j694k408l405m744n946o547
$$ plain form
60227 309427 302845 296462 290360 284651 279366 274403 269779 265781 262632 260123 257842 255674 253784 252162
60213 252162 250515 248702 246989 245676 244699 243785 242915 242343 242181 242121 241671 240600 239092 237519 236161 235130
60197 235130 234443 234054 233866 233852 234120 234726 235413 235757 235676 235584 235887 236498 237058 237463 237877 238325 238633 238831 239254 240056
60177 240056 240883 241292 241343 241551 242252 243228 244027 244499 244908 245563 246499 247561 248740 250235 252187 254452 256724
60160 256724 258817 260771 262769 265013 267626 270599 273828 277202 280650 284113 287563 291059 294629 298078
60146 298078 301141 303865 306639 309651 312551 314851 316493 317778 318935 320034 321200 322539 323860 324774
60132 324774 325137 325164 325073 324842 324353 323538 322343 320757 318959 317243 315715 314224 312646 311040 309524 308167
60116 308167 307086 306427 306157 306030 305880 305806 305985 306384 306703 306577 305837 304724 303790 303392 303262 302765 301599 300030
$$ packed form
60227C09427o582o383o102n709n285m963m624l998l149k509k281k168j890j622
60213B52162j647j813j713j313r77r14q70n72j62o0m50j071j508j573j358j031
60197B35130o87l89j88j4K68O06O87L44q1r2L03O11N60M05M14M48L08J98M23Q02
60177B40056Q27M09N1K08P01R76P99M72M09O55R36J062J179J495J952K265K272
60160B56724K093J954J998K244K613K973L229L374L448L463L450L496L570L449
60146B98078L063K724K774L012K900K300J642J285J157J099J166J339J321R14
60132C24774L63K7r1k31m89q15j195j586j798j716j528j491j578j606j516j357
60116C08167j081o59k70j27j50p4J79L99L19j26p40j113r34l98j30m97j166j569
$$ plain form
60098 300030 298446 296998 295750 294854 294340 293965 293510 293116 293087 293456 293936 294232 294262 294116 293990 294132 294692 295596
60080 295596 296651 297730 298797 299776 300544 301084 301581 302329 303545 305243 307213 309106 310625 311712 312611 313650
60064 313650 314928 316249 317448 318674 320182 321890 323447 324817 326427 328568 330925 333020 334882 336902
60050 336902 339224 341645 344048 346453 348666 350340 351449 352306 353036 353444 353522 353689 354286 355150 355895 356344 356479
60033 356479 356308 355993 355867 356006 356005 355419 354232 352641 350621 347994 344782 341192 337332 333195 328881 324616
60017 324616 320574 316800 313223 309631 305785 301703 297706 294038 290626 287355 284352 281771 279487 277301
60003 277301 275240 273390 271590 269661 267810 266434 265585 264937 264294 263760 263368 262908 262229 261439 260692 260057 259732
59986 259732 260105 261354 263114 264773 266047 267085 268111 269152 270154 271164 272200 273053 273409 273262 272984
$$ packed form
60098C00030j584j448j248q96n14l75m55l94k9L69M80K96L0j46j26J42N60R04
60080B95596J055J079J067R79P68N40M97P48J216J698J970J893J519J087Q99J039
60064C13650J278J321J199J226J508J708J557J370J610K141K357K095J862K020
60050C36902K322K421K403K405K213J674J109Q57P30M08P8J67N97Q64P45M49J35
60033C56479j71l15j26J39jn86j187j591k020k627l212l590l860m137m314m265
60017C24616m042l774l577l592l846m082l997l668l412l271l003k581k284k186
60003B77301k061j850j800j929j851j376q49o48o43n34l92m60o79p90p47o35l25
59986B59732L73J249J760J659J274J038J026J041J002J010J036Q53L56j47k78
$$ plain form
59971 272984 272810 272400 271270 269574 268062 267151 266396 265153 263404 261530 259576 257251 254593 252122 250206
59956 250206 248686 247274 245938 244725 243492 242087 240636 239387 238392 237566 236900 236416 235968 235340 234529 233712
59940 233712 232929 232002 230844 229680 228825 228319 227931 227471 226989 226668 226650 226994 227701 228698 229871 231160 232562
59923 232562 233979 235156 235896 236306 236699 237273 237984 238683 239264 239659 239826 239790 239582 239168 238537 237887 237514 237498 237594
59904 237594 237504 237131 236547 235931 235569 235716 236293 236844 236946 236577 236010 235484 235121 234994 235070 235145 235014 234719 234533 234702
59884 234702 235288 236125 236868 237137 236819 236242 235947 236295 237262 238554 239868 241135 242585 244450 246633 248824
59868 248824 250968 253386 256232 259082 261319 262811 263933 265000 265957 266655 267132 267518 267833 267999 267998 267935 267990
59851 267990 268322 268991 269941 271107 272496 274094 275707 276974 277590 277511 276898 275936 274759 273609 272924 273018 273631
$$ packed form
59971B72984j74m10j130j696j512r11p55j243j749j874j954k325k658k471j916
59956B50206j520j412j336j213j233j405j451j249r95q26o66m84m48o28q11q17
59940B33712p83r27j158j164q55n06l88m60m82l21j8L44P07R97J173J289J402
59923B32562J417J177P40M10L93N74P11O99N81L95J67l6k08m14o31o50l73j6R6
59904B37594r0l73n84o16l62J47N77N51J02l69n67n26l63j27P6P5j31k95j86J69
59884B34702N86Q37P43K69l18n77k95L48R67J292J314J267J450J865K183K191
59868B48824K144K418K846K850K237J492J122J067R57O98M77L86L15J66jo3N5
59851B67990L32O69R50J166J389J598J613J267O16p9o13r62j177j150o85R4O13
$$ plain form
59834 273631 274078 274031 273919 274253 274843 275181 275478 276652 279096 282047 284503 286360 288231 290519 293115 295798
59818 295798 298443 300932 303247 305576 307986 310086 311415 312136 312950 314310 316015 317609 318809 319469 319474 318911
59802 318911 318163 317665 317618 317941 318388 318691 318734 318651 318698 319032 319660 320520 321487 322379 323127 323872 324810 326020 327556
59783 327556 329514 331793 333913 335320 335820 335552 334714 333609 332808 332834 333675 334865 336041 337066 337657 337335
59767 337335 335938 333900 331851 330099 328571 327029 325215 322967 320373 317745 315393 313522 312319 311910
59753 311910 312182 312783 313344 313611 313400 312670 311608 310462 309228 307716 305899 303956 302014 300087 298338 297070
59737 297070 296291 295545 294360 292698 290794 288742 286428 283836 281230 278983 277272 275930 274626 273192 271733
59722 271733 270382 269129 267984 267153 266782 266663 266471 266235 266303 266879 267880 269220 270873 272603 274052 275207
$$ packed form
59834B73631M47m7j12L34N90L38K97J174K444K951K456J857J871K288K596K683
59818B95798K645K489K315K329K410K100J329P21Q14J360J705J594J200O60Nn63
59802C18911p48m98m7L23M47L03M3q3M7L34O28Q60R67Q92P48P45R38J210J536
59783C27556J958K279K120J407N00k68q38j105q01K6Q41J190J176J025N91l22
59767C37335j397k038k049j752j528j542j814k248k594k628k352j871j203m09
59753C11910K72O01N61K67k11p30j062j146j234j512j817j943j942j927j749j268
59737B97070p79p46j185j662j904k052k314k592k606k247j711j342j304j434j459
59722B71733j351j253j145q31l71j19j92k36O8N76J001J340J653J730J449J155
$$ plain form
59706 275207 276485 278180 280140 282117 284153 286395 288811 291337 294122 297321 300781 304155 307320 310471
59692 310471 313839 317381 320772 323660 325999 328127 330414 332854 335134 337024 338485 339428 339696 339387 338872
59677 338872 338387 337847 337214 336745 336632 336663 336543 336392 336585 337177 337783 338046 338031 338083 338470 339175 339964 340585 340937 341084
59657 341084 341153 341325 341880 343020 344560 345960 346831 347379 348192 349660 351674 353844 355916 357979 360339 363180
59641 363180 366337 369409 372143 374650 377231 380047 382921 385434 387244 388375 389147 389790 390285 390645 391133
59626 391133 391894 392525 392371 391291 389823 388516 387375 386033 384204 381828 378982 375838 372595 369373 366238
59611 366238 363314 360691 358235 355763 353426 351656 350651 350195 350052 350271 350968 352058 353412 355035 356891
59596 356891 358777 360570 362418 364482 366638 368606 370267 371657 372732 373317 373238 372364 370571 367768 363950
$$ packed form
59706B75207J278J695J960J977K036K242K416K526K785L199L460L374L165L151
59692C10471L368L542L391K888K339K128K287K440K280J890J461R43K68l09n15
59677C38872m85n40o33m69j13L1j20j51J93N92O06K63j5N2L87P05P89O21L52J47
59657C41084O9J72N55J140J540J400Q71N48Q13J468K014K170K072K063K360K841
59641C63180L157L072K734K507K581K816K874K513J810J131P72O43M95L60M88
59626C91133P61O31j54j080j468j307j141j342j829k376k846l144l243l222l135
59611C66238k924k623k456k472k337j770j005m56j43K19O97J090J354J623J856
59596C56891J886J793J848K064K156J968J661J390J075N85p9q74j793k803l818
$$ plain form
59581 363950 359207 353801 348197 342892 338077 333582 329144 324671 320307 316355 313066 310301 307523 304379
59567 304379 301154 298306 295688 292692 289159 285613 282441 279399 276143 272786 269607 266606 263691 260966
59553 260966 258502 256148 253882 252093 251109 250737 250571 250556 250859 251390 251830 252028 252059 252017 251963 251935 251817 251430 250982
59534 250982 251067 251897 252829 253081 252627 251993 251431 250839 250297 250078 250128 250031 249574 248934 248352 247927 247723 247687 247486 246804
59514 246804 245789 244845 244031 243092 242053 241291 240944 240732 240482 240370 240414 240216 239511 238752 238692 239536 240778 241822
59496 241822 242516 243038 243467 243648 243505 243338 243637 244557 245815 247163 248754 250859 253407 256083 258755 261567
59480 261567 264702 268302 272525 277418 282807 288521 294580 300853 306619 310844 312975 313272 312449 311190 309934
59465 309934 308769 307505 306057 304709 303782 303175 302505 301618 300612 299466 298028 296332 294510 292415 289749
$$ packed form
59581C63950m743n406n604n305m815m495m438m473m364l952l289k765k778l144
59567C04379l225k848k618k996l533l546l172l042l256l357l179l001k915k725
59553B60966k464k354k266j789r84l72j66j5L03N31M40J98L1m2n4k8j18l87m48
59534B50982Q5Q30R32K52m54o34n62n92n42k19N0r7m57o40n82m25k04l6k01o82
59514B46804j015r44q14r39j039p62l47k12k50j12M4j98p05p59o0Q44J242J044
59496B41822O94N22M29J81j43j67K99R20J258J348J591K105K548K676K672K812
59480B61567L135L600M223M893N389N714O059O273N766M225K131K97q23j259j256
59465C09934j165j264j448j348r27o07o70q87j006j146j438j696j822k095k666
$$ plain form
59450 289749 286591 283401 280404 277383 274170 270970 268031 265357 262908 260770 258933 257184 255411 253815
59436 253815 252635 251878 251428 251220 251200 251296 251506 251851 252245 252639 253274 254449 256023 257534 258871 260388 262234
59419 262234 263991 265241 266096 266860 267492 267771 267807 268040 268844 270341 272381 274501 276097 276948 277443 278081 278906
59402 278906 279667 280301 280947 281602 282145 282659 283461 284776 286585 288753 291062 293168 294791 296032 297261 298588
59386 298588 299639 300004 299804 299629 299901 300414 300566 299953 298614 296784 294668 292591 291101 290614 290980 291636 292199
59369 292199 292758 293628 295052 297108 299675 302443 305185 308067 311473 315538 320109 325139 330771 336979 343433
59354 343433 349899 356498 363479 370995 379216 388216 397449 405581 411169 413486 412641 409344 404814 400566
59340 400566 397757 396696 397201 399191 402520 406336 409086 409389 406806 401850 395526 388868 382565 376779 371316
$$ packed form
59450B89749l158l190k997l021l213l200k939k674k449k138j837j749j773j596
59436B53815j180p57m50k08k0R6K10L45L94L94O35J175J574J511J337J517J846
59419B62234J757J250Q55P64O32K79L6K33Q04J497K040K120J596Q51M95O38Q25
59402B78906P61O34O46O55N43N14Q02J315J809K168K309K106J623J241J229J327
59386B98588J051L65k00j75K72N13J52o13j339j830k116k077j490m87L66O56N63
59369B92199N59Q70J424K056K567K768K742K882L406M065M571N030N632O208O454
59354C43433O466O599O981P516Q221R000R233Q132N588K317q45l297m530m248
59340D00566k809j061N05J990L329L816K750L03k583m956o324o658o303n786n463
$$ plain form
59325 371316 366030 361040 356626 352966 349945 347194 344394 341637 339386 337979 337272 336840 336411 335971 335596
59310 335596 335397 335573 336311 337613 339324 341314 343524 345859 348144 350205 351990 353682 355673 358291 361504
59295 361504 365034 368791 372974 377638 382474 387231 392134 397527 403277 408858 414031 419054 424178 429218
59281 429218 433759 437595 440827 443634 446040 447829 448609 448065 446210 443350 439798 435702 431118 426156 420961
59266 420961 415605 410040 404180 398026 391756 385667 379973 374658 369537 364438 359324 354297 349490 344890
59252 344890 340275 335425 330409 325559 321131 317136 313565 310616 308496 307143 306332 306013 306406 307750 310041
59237 310041 313049 316519 320388 324843 330008 335501 340307 343270 343720 341714 337861 333075 328320 324305
59223 324305 321265 319089 317608 316749 316489 316788 317595 318859 320596 322963 326150 330126 334578 339232 344101
$$ packed form
59325C71316n286m990m414l660l021k751k800k757k251j407p07m32m29m40l75
59310C35596j99J76P38J302J711J990K210K335K285K061J785J692J991K618L213
59295C61504L530L757M183M664M836M757M903N393N750N581N173N023N124N040
59281D29218M541L836L232K807K406J789P80n44j855k860l552m096m584m962n195
59266D20961n356n565n860o154o270o089n694n315n121n099n114n027m807m600
59252C44890m615m850n016m850m428l995l571k949k120j353q11l19L93J344K291
59237C10041L008L470L869M455N165N493M806K963M50k006l853m786m755m015
59223C24305l040k176j481q59k60K99Q07J264J737K367L187L976M452M654M869
$$ plain form
59208 344101 349269 354563 359619 364217 368331 371844 374494 376154 377053 377576 377916 378006 377692 376924 375791 374426
59192 374426 372886 371128 369115 366922 364730 362704 360942 359480 358326 357457 356802 356196 355456 354593 353926 353794
59176 353794 354070 354096 353234 351407 349043 346630 344422 342415 340395 338106 335519 332897 330424 327861 324814
59161 324814 321317 317866 314814 311938 308786 305319 302050 299567 298015 297037 296148 295176 294347 293977 294110 294523
59145 294523 295001 295526 296195 297105 298329 299889 301646 303321 304686 305726 306601 307527 308740 310428 312545 314760
59129 314760 316732 318386 319792 320867 321464 321743 322128 322766 323282 323267 322802 322215 321544 320581 319315 317929 316382
59112 316382 314463 312287 310320 308738 307224 305582 304155 303308 302910 302692 302764 303269 303790 303685 302898 301893
59096 301893 300832 299375 297345 295071 292891 290777 288605 286467 284470 282536 280590 278701 276897 275072
$$ packed form
59208C44101N168N294N056M598M114L513K650J660Q99N23L40R0l14p68j133j365
59192C74426j540j758k013k193k192k026j762j462j154q69o55o06p40q63o67j32
59176C53794K76K6q62j827k364k413k208k007k020k289k587k622k473k563l047
59161C24814l497l451l052k876l152l467l269k483j552r78q89r72q29l70J33M13
59145B94523M78N25O69R10J224J560J757J675J365J040Q75R26J213J688K117K215
59129C14760J972J654J406J075N97K79L85O38N16j5m65n87o71r63j266j386j547
59112C16382j919k176j967j582j514j642j427q47l98k18P2N05N21j05p87j005
59096C01893j061j457k030k274k180k114k172k138j997j934j946j889j804j825
$$ plain form
59082 275072 273166 271253 269374 267554 265968 264735 263489 261617 259121 256835 255533 255156 255177 255344 255735
59067 255735 256379 257275 258629 260680 263355 266347 269463 272663 275924 279290 282951 287021 291339 295705 300156
59052 300156 304755 309274 313416 317275 321268 325605 330061 334277 338050 341305 343989 346057 347477 348278
59038 348278 348660 348892 348956 348413 346872 344535 342089 340083 338553 337245 335975 334759 333712 332882 332107 331027
59022 331027 329324 326936 324101 321175 318380 315607 312516 308992 305484 302636 300576 298817 296881 294718
59008 294718 292467 290168 287889 285827 284051 282377 280720 279309 278312 277491 276451 275077 273520 271974 270655
58993 270655 269744 269111 268379 267467 266807 266744 267042 267255 267295 267288 267246 267284 267834 269100 270544 271490 272019 272708 273656 274436
58973 274436 274966 275737 277071 278774 280692 282989 285664 288288 290583 292833 295472 298587 302143 306347 311360
$$ packed form
59082B75072j906j913j879j820j586j233j246j872k496k286j302l77K1J67L91
59067B55735O44Q96J354K051K675K992L116L200L261L366L661M070M318M366M451
59052C00156M599M519M142L859L993M337M456M216L773L255K684K068J420Q01
59038C48278L82K32O4n43j541k337k446k006j530j308j270j216j047q30p75j080
59022C31027j703k388k835k926k795k773l091l524l508k848k060j759j936k163
59008B94718k251k299k279k062j776j674j657j411r97q21j040j374j557j546j319
58993B70655r11o33p32r12o60o3K98K13M0pm2L8N50J266J444R46N29O89R48P80
58973B74436N30P71J334J703J918K297K675K624K295K250K639L115L556M204N013
$$ plain form
58958 311360 316818 321946 326134 329272 331618 333490 334973 335852 335920 335397 334844 334615 334566 334407 334103 333818 333648
58941 333648 333598 333701 334022 334584 335378 336349 337301 337939 338092 337815 337262 336553 335786 335027 334204 333174 331979 330967
58923 330967 330510 330615 330924 331139 331393 332133 333633 335719 338052 340567 343438 346694 350177 353911 358162 362939
58907 362939 367740 372060 375961 379839 383766 387390 390430 392995 395364 397609 399457 400470 400394 399370 397670
58892 397670 395248 391842 387555 382946 378359 373549 368291 362963 358089 353607 349063 344374 339942 336117
58878 336117 332960 330431 328417 326676 325100 323871 323048 322221 321064 319910 319259 318932 318375 317627 317199 317051
58862 317051 316547 315603 315047 315439 316220 316480 316098 315606 315339 315248 315329 315756 316602 317766 319176 320880 323010 325706
58844 325706 328997 332695 336519 340359 344306 348469 352968 358009 363686 369692 375501 380851 385860 390773
$$ packed form
58958C11360N458N128M188L138K346J872J483Q79O8n23n53k29m9j59l04k85j70
58941C33648n0J03L21N62P94R71R52O38J53k77n53p09p67p59q23j030j195j012
58923C30967m57J05L09K15K54P40J500K086K333K515K871L256L483L734M251M777
58907C62939M801M320L901L878L927L624L040K565K369K245J848J013p6j024j700
58892C97670k422l406m287m609m587m810n258n328m874m482m544m689m432l825
58878C36117l157k529k014j741j576j229q23q27j157j154o51l27n57p48m28j48
58862C17051n04r44n56L92P81K60l82m92k67r1Q1M27Q46J164J410J704K130K696
58844C25706L291L698L824L840L947M163M499N041N677O006N809N350N009M913
$$ plain form
58830 390773 395865 401490 407825 414595 421375 428107 434898 441435 447122 451786 455764 459217 461931 463857
58816 463857 465279 466253 466429 465661 464342 462916 461477 460077 458899 457824 456299 453965 451117 448226 445360
58801 445360 442333 439065 435487 431383 426660 421554 416379 411286 406420 401895 397462 392578 387074 381393
58787 381393 375984 370822 365755 360867 356189 351482 346684 342164 338140 334215 329898 325285 320838 316772
58773 316772 313068 309816 307094 304737 302627 300982 299968 299248 298363 297371 296696 296524 296748 297379 298501 299909
58757 299909 301170 302095 302879 303780 304918 306329 307960 309644 311218 312609 313690 314254 314294 314097 313855 313404
58741 313404 312540 311358 310022 308438 306428 304090 301709 299505 297638 296214 295006 293462 291338 289152
58727 289152 287652 286990 286738 286554 286503 286810 287640 289076 291081 293524 296361 299615 303061 306170 308550 310200
$$ packed form
58830C90773N092N625O335O770O780O732O791O537N687M664L978L453K714J926
58816D63857J422R74J76p68j319j426j439j400j178j075j525k334k848k891k866
58801D45360l027l268l578m104m723n106n175n093m866m525m433m884n504n681
58787C81393n409n162n067m888m678m707m798m520m024l925m317m613m447m066
58773C16772l704l252k722k357k110j645j014p20q85r92o75j72K24O31J122J408
58757B99909J261R25P84R01J138J411J631J684J574J391J081N64M0j97k42m51
58741C13404q64j182j336j584k010k338k381k204j867j424j208j544k124k186
58727B89152j500o62k52j84n1L07Q30J436K005K443K837L254L446L109K380J650
$$ plain form
58711 310200 311146 311178 310209 308567 306584 304181 301219 297973 294819 291710 288391 284993 281937 279384 277127
58696 277127 275001 273062 271442 270290 269750 269714 269765 269625 269506 269772 270478 271472 272663 273850 274633 274965 275510
58679 275510 276970 279234 281661 283971 286325 288748 291113 293667 296911 300832 304746 308014 310525 312423
58665 312423 313780 314707 315430 316081 316618 317009 317339 317750 318426 319578 321210 323034 324809 326622 328542 330231
58649 330231 331266 331692 331819 331550 330354 327899 324339 319961 314902 309249 303138 296703 290117 283637 277425
58634 277425 271437 265699 260479 255943 251810 247701 243640 239895 236516 233403 230645 228345 226299 224274
58620 224274 222451 221117 220089 218950 217767 217003 216786 216827 217056 217787 219138 220802 222504 224295 226302 228598
58604 228598 231379 234847 238759 242432 245284 247113 247889 247672 246766 245544 244025 241982 239495 237050 235030
$$ packed form
58711C10200R46L2r69j642j983k403k962l246l154l109l319l398l056k553k257
58696B77127k126j939j620j152n40l6N1j40j19K66P06R94J191J187P83L32N45
58679B75510J460K264K427K310K354K423K365K554L244L921L914L268K511J898
58665C12423J357R27P23O51N37L91L30M11O76J152J632J824J775J813J920J689
58649C30231J035M26J27k69j196k455l560m378n059n653o111o435o586o480o212
58634B77425n988n738n220m536m133m109m061l745l379l113k758k300k046k025
58620B24274j823j334j028j139j183p64k17M1K29P31J351J664J702J791K007K296
58604B28598K781L468L912L673K852J829P76k17r06j222j519k043k487k445k020
$$ plain form
58589 235030 233450 232213 231190 230052 228430 226352 224224 222304 220534 218882 217460 216266 215180 214276
58575 214276 213770 213606 213487 213365 213532 214111 214840 215435 215837 215998 215789 215231 214550 213912 213344 212906 212619 212260 211604
58556 211604 210910 210768 211406 212498 213662 214818 215981 217123 218310 219640 220960 221970 222697 223517 224690
58541 224690 226191 227957 229879 231539 232469 232770 233085 233824 234839 235956 237339 239148 241270 243666 246625
58526 246625 250404 254843 259534 264125 268365 272150 275723 279562 283888 288464 292949 297232 301347 305327
58512 305327 309299 313493 318068 322998 328157 333394 338666 344250 350673 358208 366547 375268 384335 393831
58498 393831 403436 412663 421356 429390 436084 440602 442911 443708 443469 442205 440144 437854 435475 432525 428702
58483 428702 424297 419578 414315 408236 401448 394111 386145 377587 368825 360205 351746 343493 335782 328938
$$ packed form
58589B35030j580j237j023j138j622k078k128j920j770j652j422j194j086r04
58575B14276n06j64j19j22J67N79P29N95M02J61k09n58o81o38n68m38k87l59o56
58556B11604o94j42O38J092J164J156J163J142J187J330J320J010P27Q20J173
58541B24690J501J766J922J660R30L01L15P39J015J117J383J809K122K396K959
58526B46625L779M439M691M591M240L785L573L839M326M576M485M283M115L980
58512C05327L972M194M575M930N159N237N272N584O423P535Q339Q721R067R496
58498C93831R605R227Q693Q034O694M518K309P97k39j264k061k290k379k950l823
58483D28702m405m719n263o079o788p337p966q558q762q620q459q253p711o844
$$ plain form
58469 328938 322972 317747 313146 308958 304947 301160 297829 294901 292052 289176 286494 284086 281774 279566
58455 279566 277756 276462 275468 274623 273945 273295 272432 271483 270861 270634 270458 270190 270018 269937 269746 269674 270298 271588
58437 271588 272663 272830 272366 272009 272198 273083 274711 276843 279055 281292 283948 287195 290677 294091 297562
58422 297562 301272 305232 309622 314805 320720 326772 332544 338113 343482 348241 352028 354767 356276 356262 354929
58407 354929 352979 350765 348052 344851 341769 339223 337057 335284 334432 334685 335418 336132 337242 339333 342202
58392 342202 345213 348107 350926 353522 355639 357134 357732 357028 355081 352551 349918 347059 343855 340642 337694
58377 337694 334923 332454 330822 330141 329773 329311 329246 330138 331761 333612 335630 337843 339963 341916 344191 347038
58361 347038 349893 352172 354007 355580 356396 355927 354451 352563 350407 348016 345794 343949 342009 339624 337329
$$ packed form
58469C28938n966n225m601m188m011l787l331k928k849k876k682k408k312k208
58455B79566j810j294r94q45o78o50q63r49o22k27j76k68j72q1j91p2O24J290
58437B71588J075J67m64l57J89Q85J628K132K212K237K656L247L482L414L471
58422B97562L710L960M390N183N915O052N772N569N369M759L787K739J509j4j333
58407C54929j950k214k713l201l082k546k166j773q52K53P33P14J110K091K869
58392C42202L011K894K819K596K117J495N98p04j947k530k633k859l204l213k948
58377C37694k771k469j632o81l68m62o5Q92J623J851K018K213K120J953K275K847
58361C47038K855K279J835J573Q16m69j476j888k156k391k222j845j940k385k295
$$ plain form
58346 337329 335785 334814 333928 333232 333011 332972 332735 332603 332981 333531 333802 334236 335590 337712 339833 341801 344039
58329 344039 346499 348600 350152 351528 352956 354380 355926 357874 360178 362526 364809 367110 369459 371985
58315 371985 374960 378255 381220 383552 385842 388728 392066 395499 399247 403585 408069 412116 415914 419998
58301 419998 424331 428542 432671 436931 441128 445061 449095 453579 458068 461842 464805 467235 469131 470525
58287 470525 471968 473973 476404 479061 482282 486255 490418 494374 498758 504248 510390 516338 522210 528642
58273 528642 535583 542538 549508 556648 563512 569654 575488 581539 587367 592281 596557 600856 604943 608160
58259 608160 610663 613101 615602 618200 621687 626727 632649 638330 643813 649799 656161 662355 668860 676671
58245 676671 685680 694909 704058 713524 723232 732801 742533 752899 763368 773080 782313 791992 802160
$$ packed form
58346C37329j544r71q86o96k21l9k37j32L78N50K71M34J354K122K121J968K238
58329C44039K460K101J552J376J428J424J546J948K304K348K283K301K349K526
58315C71985K975L295K965K332K290K886L338L433L748M338M484M047L798M084
58301D19998M333M211M129M260M197L933M034M484M489L774K963K430J896J394
58287D70525J443K005K431K657L221L973M163L956M384N490O142N948N872O432
58273E28642O941O955O970P140O864O142N834O051N828M914M276M299M087L217
58259F08160K503K438K501K598L487N040N922N681N483N986O362O194O505P811
58245F76671R009R229R149R466R708R569R732J0366J0469R712R233R679J0168
$$ plain form
58232 802160 812247 822383 833020 843776 854111 864640 876295 888722 901085 913845 928008
58221 928008 943179 958214 973349 989768 1007438 1025334 1043530 1063124 1084268 1106188 1128917
58210 1128917 1153113 1178403 1203821 1229688 1257096 1285829 1314824 1344400 1375879 1409249 1443414
58199 1443414 1478635 1516462 1557277 1600109 1644734 1691736 1740630 1790270 1841104 1894734 1951412
58188 1951412 2010344 2072316 2139455 2212452 2290550 2374218 2465215 2564141 2670593 2785704 2911709
58177 2911709 3048978 3196155 3352966 3519967 3695918 3878861 4069776 4271887 4486453
58168 4486453 4712665 4951362 5205010 5474069 5757496 6057056 6377086 6719807 7084936
58159 7084936 7473894 7889831 8333432 8803657 9303099 9837871 10412088 11027661 11689553
$$ packed form
58232H02160J0087J0136J0637J0756J0335J0529J1655J2427J2363J2760J4163
58221I28008J5171J5035J5135J6419J7670J7896J8196J9594K1144K1920K2729
58210A128917K4196K5290K5418K5867K7408K8733K8995K9576L1479L3370L4165
58199A443414L5221L7827M0815M2832M4625M7002M8894M9640N0834N3630N6678
58188A951412N8932O1972O7139P2997P8098Q3668R0997R8926J06452J15111J26005
58177B911709J37269J47177J56811J67001J75951J82943J90915K02111K14566
58168D486453K26212K38697K53648K69059K83427K99560L20030L42721L65129
58159G084936L88958M15937M43601M70225M99442N34772N74217O15573O61892
$$ plain form
58150 11689553 12405518 13180625 14018525 14928680 15925785 17021817 18226033 19553445 21025754
58141 21025754 22663993 24489506 26532921 28833198 31429396 34366722 37711237 41542932
58133 41542932 45929560 50917037 56539907 62824472 69802749 77572762 86316471 96092570
58125 96092570 106425026 116065474 123313369 126782457 126038916 121658085 114785658 106619130
58117 106619130 98093568 89782897 81934142 74584072 67700510 61269632 55303589 49816033
58109 49816033 44810496 40279054 36199701 32540294 29270685 26366763 23802109 21543926
58101 21543926 19559714 17820828 16297300 14956576 13770810 12720107 11786606 10951215
58093 10951215 10198412 9518732 8903847 8343775 7830876 7361756 6932714 6537271 6170164
$$ packed form
58150A1689553P15965P75107Q37900R10155R97105J096032J204216J327412J472309
58141B1025754J638239J825513K043415K300277K596198K937326L344515L831695
58133D1542932M386628M987477N622870O284565O978277P770013Q743709R776099
58125I6092570J0332456R640448P247895L469088p43541m380831o872427q166528
58117A06619130q525562q310671p848755p350070o883562o430878n966043n487556
58109D9816033n005537m531442m079353l659407l269609k903922k564654k258183
58101B1543926j984212j738886j523528j340724j185766j050703r33501q35391
58093A0951215p52803o79680o14885n60072n12899m69120m29042l95443l67107
$$ plain form
58084 6170164 5829750 5514378 5220124 4944094 4686448 4447057 4223265 4012858 3816251
58075 3816251 3633829 3463666 3303449 3152193 3008697 2870887 2738092 2611665 2492154
58066 2492154 2378171 2269066 2166121 2069936 1979100 1892668 1811561 1736169 1664907 1596478 1531440
58055 1531440 1470220 1411735 1355332 1302081 1252690 1205929 1160465 1116509 1074408 1033309 992586
58044 992586 953069 915616 879833 845263 812388 781400 751430 722042 694152 668449 644255
58033 644255 620866 598648 577832 557650 537638 518478 500578 483134 465588 448723 433262
58022 433262 418632 404107 390039 376941 364446 352148 340410 329445 318616 307517 296731
58011 296731 286695 276917 267181 258394 251266 245157 239208 233629 228954 224899 220942 217196 213840 210488
$$ packed form
58084F170164l40414l15372k94254k76030k57646k39391k23792k10407j96607
58075C816251j82422j70163j60217j51256j43496j37810j32795j26427j19511
58066B492154j13983j09105j02945r6185r0836q6432q1107p5392p1262o8429o5038
58055A531440o1220n8485n6403n3251m9391m6761m5464m3956m2101m1099m0723
58044I92586l9517l7453l5783l4570l2875l0988k9970k9388k7890k5703k4194
58033F44255k3389k2218k0816k0182k0012j9160j7900j7444j7546j6865j5461
58022D33262j4630j4525j4068j3098j2495j2298j1738j0965j0829j1099j0786
58011B96731j0036r778r736q787p128o109n949n579m675m055l957l746l356l352
$$ plain form
57997 210488 206855 203267 199780 195722 190895 186237 182480 179023 175022 170684 166629 162807 158972 155438
57983 155438 152462 149622 146639 144070 142335 140827 138890 136964 135803 135196 134404 133287 132122 130822 129216
57968 129216 127620 126358 125134 123573 121897 120436 118992 117321 115676 114188 112372 109920 107390 105415
57954 105415 103836 102325 101184 100710 100400 99668 98829 98511 98591 98550 98420 98526 98684 98516 98192 98095 98052 97708 97308
57935 97308 97360 97767 98042 98107 98207 98280 98105 97834 97751 97738 97507 97149 96942 96893 96928 97120 97278 96750 95253 93469 92235
57914 92235 91561 90998 90491 90206 89977 89658 89617 90141 90700 90565 89869 89344 89271 89393 89561 89756 89684 89103 88356 87935
57894 87935 87672 86968 85674 84132 82565 80966 79412 77955 76462 74994 74028 73791 73785 73567 73553 74366 75853
57877 75853 77480 79258 81423 83594 85250 86743 88849 91452 93670 95196 96497 97686 98231 97979 97497
$$ packed form
57997B10488l633l588l487m058m827m658l757l457m001m338m055l822l835l534
57983A55438k976k840k983k569j735j508j937j926j161o07p92j117j165j300j606
57968A29216j596j262j224j561j676j461j444j671j645j488j816k452k530j975
57954A05415j579j511j141m74l10p32q39l18Q0m1j30J06J58j68l24r7m3l44m00
57935I7308N2M07K75O5J00P3j75k71q3j3k31l58k07m9L5J92J58n28j497j784j234
57914I2235o74n63n07k85k29l19m1N24N59j35o96n25p3J22J68J95p2n81p47m21
57894H7935k63p04j294j542j567j599j554j457j493j468r66k37ok18j4Q13J487
57877G5853J627J778K165K171J656J493K106K603K218J526J301J189N45k52m82
$$ plain form
57862 97497 97099 96353 94912 93158 91601 90185 88550 86547 84268 81938 79970 78735 78106 77565 76884 76356
57846 76356 76301 76724 77526 78662 79929 80909 81239 80786 79643 78183 76980 76307 75825 75125 74400 74186 74605 75307
57828 75307 76046 76795 77441 77900 78481 79565 80936 81986 82596 83278 84390 85713 86899 87830 88440 88620 88487
57811 88487 88347 88337 88391 88605 89237 90262 91326 92160 92743 93045 93027 92898 92995 93331 93613 93727 93857 94100 94319 94422
57791 94422 94496 94597 94712 94912 95266 95660 95963 96317 96903 97542 97888 97932 97948 98049 98195 98508 99134 99844 100233 100266
57771 100266 100239 100280 100318 100444 100815 101251 101461 101594 102087 102964 103870 104685 105576 106383 106619 106162 105405 104599 103594
57752 103594 102362 101206 100263 99251 97942 96431 94803 92933 90767 88430 85943 83276 80716 78734
57738 78734 77378 76290 75364 74885 74882 74947 74876 74940 75338 75864 76349 76895 77486 77903 78277 79084 80272 81036 80932 80644
$$ packed form
57862I7497l98p46j441j754j557j416j635k003k279k330j968j235o29n41o81n28
57846G6356n5M23Q02J136J267R80L30m53j143j460j203o73m82p00p25k14M19P02
57828G5307P39P49O46M59N81J084J371J050O10O82J112J323J186R31O10J80j33
57811H8487j40j0N4K14O32J025J064Q34N83L02j8j29R7L36K82J14J30K43K19J03
57791I4422P4J01J15K00L54L94L03L54N86O39L46M4J6J01J46L13O26P10L89L3
57771A00266k7M1L8J26L71M36K10J33M93Q77R06Q15Q91Q07K36m57p57q06j005
57752A03594j232j156r43j012j309j511j628j870k166k337k487k667k560j982
57738G8734j356j088r26m79lO5p1O4L98N26M85N46N91M17L74Q07J188P64j04k88
$$ plain form
57718 80644 81086 82156 83057 83564 84328 85922 88114 90153 91515 92288 93000 94050 95295 96303 96963 97551
57702 97551 98173 98540 98432 98002 97429 96618 95466 94083 92577 90952 89439 88537 88458 88859 89393 90111 91054 91853
57684 91853 92222 92548 93489 95172 97163 99111 100964 102640 103891 104555 104719 104639 104631 104932 105440 105729 105525 105082
57666 105082 104906 105190 105729 106262 106692 107044 107427 108001 108844 109856 110867 111800 112686 113571 114446 115168 115533 115546
57648 115546 115555 115872 116298 116334 115830 115137 114593 114250 114180 114631 115670 116961 118119 119067 119966 120978 122152 123245
57630 123245 123688 123096 121837 120679 119837 118878 117614 116512 115991 115899 116012 116502 117520 118794 120091 121700
57614 121700 124043 127183 131086 135992 142089 149175 157097 166151 176614 188243 200662 213800 227174
57601 227174 239026 246930 249380 246414 238962 228209 215526 202234 189153 176620 164971 154625
$$ packed form
57718H0644M42J070R01N07P64J594K192K039J362P73P12J050J245J008O60N88
57702I7551O22L67j08m30n73q11j152j383j506j625j513r02p9M01N34P18R43P99
57684I1853L69L26R41J683J991J948J853J676J251O64J64q0qL01N08K89k04m43
57666A05082j76K84N39N33M30L52L83N74Q43J012J011R33Q86Q85Q75P22L65J3
57648A15546RL17M26L6n04o93n44l43p0M51J039J291J158R48Q99J012J174J093
57630A23245M43n92j259j158q42r59j264j102n21r2J13M90J018J274J297J609
57614A21700K343L140L903M906O097P086P922R054J0463J1629J2419J3138J3374
57601B27174J1852P904K450k966p452j0753j2683j3292j3081j2533j1649j0346
$$ plain form
57589 154625 145737 138177 131905 127012 123367 120504 117960 115534 113264 111357 110087 109521 109435 109616 110090
57574 110090 110836 111561 112086 112710 113795 115147 116243 116915 117381 117734 117843 117691 117414 117033 116504 115955 115508 114966
57556 114966 114090 113055 112220 111554 110780 110022 109744 109995 110224 109961 109272 108429 107584 106915 106695 106992 107575 108246
57538 108246 109003 109786 110373 110630 110639 110497 110223 109898 109651 109429 109037 108428 107719 106943 106063 105178 104434 103754 102980
57519 102980 102293 102109 102531 103202 103738 103996 103908 103485 103035 103007 103446 103920 104066 103957 103805 103651 103444 103192 102932
57500 102932 102753 102871 103427 104247 105053 105840 106720 107492 107872 108088 108729 109881 111009 111809 112634 113800 115009
57483 115009 115852 116443 117158 118079 119078 120162 121395 122695 124040 125609 127419 129044 130040 130469 130676 130782
57467 130782 130742 130729 131045 131732 132640 133835 135601 137973 140578 143002 145171 147334 149805 152762 156228 160194
$$ packed form
57589A54625q888p560o272m893l645k863k544k426k270j907j270n66q6J81M74
57574A10090P46P25N25O24J085J352J096O72M66L53J09j52k77l81n29n49m47n42
57556A14966q76j035q35o66p74p58k78K51K29k63o89q43q45o69k20K97N83O71
57538A08246P57P83N87K57Rj42k74l25k47k22l92o09p09p76q80q85p44o80p74
57519A02980o87j84M22O71N36K58q8m23m50k8M39M74J46j09j52j54k07k52k60
57500A02932j79J18N56Q20Q06P87Q80P72L80K16O41J152J128Q00Q25J166J209
57483A15009Q43N91P15R21R99J084J233J300J345J569J810J625R96M29K07J06
57467A30782m0j3L16O87R08J195J766K372K605K424K169K163K471K957L466L966
$$ plain form
57451 160194 164765 170028 175788 181585 187093 192344 197496 202537 207337 211826 215952 219647 222953 226008
57437 226008 228756 230860 232099 232740 233249 233794 234240 234542 234830 235083 234990 234255 232943 231461 230241 229485 229124
57420 229124 229003 229070 229367 229854 230344 230611 230556 230270 229970 229846 229922 230110 230424 231011 231859 232668 233177 233516 234030 234853
57400 234853 235897 237156 238698 240455 242333 244483 247141 250176 253150 255818 258251 260467 262325 263908
57386 263908 265636 267855 270526 273385 276149 278628 280942 283620 287053 290835 294083 296443 298312 300031
57372 300031 301499 302807 304585 307304 310673 314144 317621 321270 324974 328404 331389 333914 336036 338070
57358 338070 340547 343641 346947 350118 353281 356509 359369 361547 363534 366089 369249 372488 375643 379045
57344 379045 382775 386409 389549 392171 394381 396258 397975 399766 401698 403753 406061 408776 411773 414782
$$ packed form
57451A60194M571N263N760N797N508N251N152N041M800M489M126L695L306L055
57437B26008K748K104J239O41N09N45M46L02K88K53r3p35j312j482j220p56l61
57420B29124j21O7K97M87M90K67n5k86l00j24P6J88L14N87Q48Q09N09L39N14Q23
57400B34853J044J259J542J757J878K150K658L035K974K668K433K216J858J583
57386B63908J728K219K671K859K764K479K314K678L433L782L248K360J869J719
57372C00031J468J308J778K719L369L471L477L649L704L430K985K525K122K034
57358C38070K477L094L306L171L163L228K860K178J987K555L160L239L155L402
57344C79045L730L634L140K622K210J877J717J791J932K055K308K715K997L009
$$ plain form
57330 414782 417789 421031 424656 428632 432879 437203 441241 444795 448144 451695 455445 459118 462683 466321
57316 466321 469961 473276 476161 478856 481573 484290 486910 489353 491507 493361 495182 497304 499816 502659
57302 502659 505870 509437 513049 516343 519304 522125 524835 527390 530007 532963 536175 539341 542422 545608
57288 545608 548865 551935 554719 557291 559598 561584 563570 566050 569084 572237 575117 577604 579662 581381
57274 581381 583177 585512 588360 591314 594142 596805 599045 600530 601481 602596 604212 606017 607693 609348
57260 609348 611146 612974 614689 616354 618029 619661 621303 623128 625096 626950 628629 630357 632216 633962
57246 633962 635350 636345 636958 637237 637484 638044 638804 639271 639255 639067 638947 638738 638272 637720 637370 637359 637712 638322 638837
57227 638837 638929 638711 638543 638414 638014 637370 636901 636690 636284 635345 634031 632516 630666 628413 626031 623794 621748
$$ packed form
57330D14782L007L242L625L976M247M324M038L554L349L551L750L673L565L638
57316D66321L640L315K885K695K717K717K620K443K154J854J821K122K512K843
57302E02659L211L567L612L294K961K821K710K555K617K956L212L166L081L186
57288E45608L257L070K784K572K307J986J986K480L034L153K880K487K058J719
57274E81381J796K335K848K954K828K663K240J485R51J115J616J805J676J655
57260F09348J798J828J715J665J675J632J642J825J968J854J679J728J859J746
57246F33962J388R95O13K79K47N60P60M67j6j88j20k09m66n52l50j1L53O10N15
57227F38837R2k18j68j29m00o44m69k11m06r39j314j515j850k253k382k237k046
$$ plain form
57210 621748 619953 618501 617150 615449 613399 611506 609979 608437 606615 604825 603382 602085 600570 598710
57196 598710 596410 593516 590241 587127 584249 580962 576810 572157 567525 562874 558013 553224 548915 545020
57182 545020 541232 537490 533785 529818 525262 520054 514070 506963 498758 490167 481788 473360 464308 454635
57168 454635 444741 434743 424568 414442 404627 394847 384497 373337 361591 349565 337600 326145
57156 326145 315357 304762 293754 282291 270739 259215 247521 235599 223679 212031 200773
57145 200773 189767 178514 166416 153376 139846 126143 112165 97998 84320 71772 60366
57134 60366 49848 40263 31832 24699 19149 15506 13448 11863 9790 7030 3501 -1288 -7646 -15159
57120 -15159 -23355 -32332 -42240 -52797 -63888 -75985 -89334 -103420 -117949 -133741 -151871 -172584
$$ packed form
57210F21748j795j452j351j701k050j893j527j542j822j790j443j297j515j860
57196E98710k300k894l275l114k878l287m152m653m632m651m861m789m309l895
57182E45020l788l742l705l967m556n208n984p107q205q591q379q428r052r673
57168D54635r894r998j0175j0126r815r780j0350j1160j1746j2026j1965j1455
57156C26145j0788j0595j1008j1463j1552j1524j1694j1922j1920j1648j1258
57145B00773j1006j1253j2098j3040j3530j3703j3978j4167j3678j2548j1406
57134F0366j0518r585q431p133n550l643k058j585k073k760C501a288o358p513
57120a5159q196q977r908j0557j1091j2097j3349j4086j4529j5792j8130k0713
$$ plain form
57108 -172584 -195854 -222344 -252857 -287374 -325550 -367631 -413994 -464351 -518334 -576303 -638530
57097 -638530 -704059 -771466 -840320 -911023 -983710 -1058394 -1135617 -1215779 -1298238 -1382190 -1467996
57086 -1467996 -1556586 -1648123 -1742422 -1840073 -1941744 -2046842 -2154382 -2264833 -2379705 -2499679
57076 -2499679 -2624569 -2754750 -2890999 -3033171 -3180683 -3334319 -3496226 -3668388 -3852480
57067 -3852480 -4050856 -4265965 -4498992 -4750685 -5023406 -5320854 -5646132 -6001713 -6390900
57058 -6390900 -6817391 -7283684 -7791892 -8345990 -8951527 -9613693 -10338030 -11133089 -12010549
57049 -12010549 -12983372 -14066437 -15278878 -16643450 -18183946 -19925734 -21898362 -24135016
57041 -24135016 -26670483 -29543727 -32803654 -36511634 -40742219 -45587679 -51161856 -57594387
$$ packed form
57108a72584k3270k6490l0513l4517l8176m2081m6363n0357n3983n7969o2227
57097f38530o5529o7407o8854p0703p2687p4684p7223q0162q2459q3952q5806
57086a467996q8590r1537r4299r7651j01671j05098j07540j10451j14872j19974
57076b499679j24890j30181j36249j42172j47512j53636j61907j72162j84092
57067c852480j98376k15109k33027k51693k72721k97448l25278l55581l89187
57058f390900m26491m66293n08208n54098o05537o62166p24337p95059q77460
57049a2010549r72823j083065j212441j364572j540496j741788j972628k236654
57041b4135016k535467k873244l259927l707980m230585m845460n574177o432531
$$ plain form
57033 -57594387 -65020462 -73579599 -83421764 -94706783 -107595552 -122241707 -138776812
57026 -138776812 -157276099 -177721765 -199993306 -223860905 -248913183 -274418902 -299246654
57019 -299246654 -321970755 -341140440 -355559913 -364460108 -367555960 -365023520 -357403617
57012 -357403617 -345447125 -329965246 -311746170 -291533670 -270022123 -247846951 -225579305
57005 -225579305 -203724176 -182707915 -162858418 -144398285 -127457431 -112091568 -98297446
56998 -98297446 -86028300 -75209474 -65746936 -57529010 -50430601 -44322478 -39078576 -34578774
56990 -34578774 -30712277 -27382360 -24506967 -22014988 -19844736 -17945919 -16279152 -14811540
56982 -14811540 -13513953 -12362084 -11336506 -10419893 -9595757 -8850350 -8173512 -7556687 -6991898
$$ packed form
57033e7594387p426075q559137r842165j1285019j2888769j4646155j6535105
57026a38776812j8499287k0445666k2271541k3867599k5052278k5505719k4827752
57019b99246654k2724101j9169685j4419473q900195l095852K532440P619903
57012c57403617J1956492J5481879J8219076K0212500K1511547K2175172K2267646
57005b25579305K1855129K1016261J9849497J8460133J6940854J5365863J3794122
56998i8297446J2269146J0818826R462538Q217926P098409O108123N243902M499802
56990c4578774L866497L329917K875393K491979K170252J898817J666767J467612
56982a4811540J297587J151869J025578R16613Q24136P45407O76838O16825N64789
$$ plain form
56973 -6991898 -6473281 -5997519 -5561648 -5161707 -4794004 -4455974 -4145143 -3858846 -3595671
56964 -3595671 -3355636 -3138267 -2941848 -2764862 -2606221 -2463006 -2329439 -2199430 -2069538
56955 -2069538 -1939220 -1809617 -1682920 -1561671 -1447460 -1340675 -1241748 -1151676 -1070896 -998655
56945 -998655 -933937 -876025 -823790 -775576 -730403 -688424 -649773 -614018 -581204 -552369 -528353
56934 -528353 -509008 -494106 -483991 -478681 -477246 -478747 -483012 -489908 -498738 -509015 -520977 -534605 -548816
56921 -548816 -562244 -574167 -584115 -591358 -595503 -596965 -596257 -593419 -588656 -582709 -575989 -568052 -558651 -548566
56907 -548566 -538659 -528798 -518444 -507663 -496755 -485495 -473671 -461888 -450958 -440854 -431091 -421734
56895 -421734 -413232 -405564 -398437 -392073 -386959 -382917 -379194 -375392 -371631 -367843 -363624 -358781 -353458 -347635
$$ packed form
56973f991898N18617M75762M35871L99941L67703L38030L10831K86297K63175
56964c595671K40035K17369J96419J76986J58641J43215J33567J30009J29892
56955b069538J30318J29603J26697J21249J14211J06785R8927R0072Q0780P2241
56945i98655O4718N7912N2235M8214M5173M1979L8651L5755L2814K8835K4016
56934e28353J9345J4902J0115N310J435j501m265o896q830j0277j1962j3628j4211
56921e48816j3428j1923r948p243m145j462P08K838M763N947O720P937R401J0085
56907e48566R907R861J0354J0781J0908J1260J1824J1783J0930J0104R763R357
56895d21734Q502P668P127O364N114M042L723L802L761L788M219M843N323N823
$$ plain form
56881 -347635 -341010 -333393 -324866 -315558 -305629 -295366 -284966 -274306 -263242 -251931 -240552 -228986
56869 -228986 -217228 -205955 -196174 -188395 -182433 -177884 -174365 -171433 -168701 -166054 -163518 -161037 -158613 -156388
56855 -156388 -154268 -151691 -148188 -143987 -139727 -135718 -131880 -128202 -124837 -121827 -119103 -116672 -114442 -111991
56841 -111991 -108898 -105244 -101501 -97943 -94440 -90690 -86394 -81333 -75549 -69399 -63176 -56864 -50435 -44173
56827 -44173 -38371 -32921 -27519 -22137 -17040 -12528 -8953 -6726 -5912 -5963 -6202 -6426 -6792 -7333 -7955 -8638 -9197
56810 -9197 -9058 -7721 -5284 -2089 1980 7318 13812 20863 28174 36068 44901 54526 64363 73676 81700
56795 81700 87798 91672 93358 93156 91719 89925 88331 86836 85181 83567 82485 82152 82564 83926 86556
56780 86556 90404 95104 100438 106403 112936 120049 128098 137405 147551 157445 166031 172475 175858 175395
$$ packed form
56881c47635O625P617Q527R308R929J0263J0400J0660J1064J1311J1379J1566
56869b28986J1758J1273R781P779N962M549L519K932K732K647K536K481K424K225
56855a56388K120K577L503M201M260M009L838L678L365L010K724K431K230K451
56841a11991L093L654L743L558L503L750M296N061N784O150O223O312O429O262
56827d4173N802N450N402N382N097M512L575K227Q14n1k39k24l66n41o22o83n59
56810i197J39J337K437b089A980N338O494P051P311P894Q833R625R837R313Q024
56795H1700O098L874J686k02j437j794j594j495j655j614j082l33M12J362K630
56780H6556L848M700N334N965O533P113Q049R307J0146R894Q586O444L383m63
$$ plain form
56766 175395 171208 164370 156052 147037 138103 130205 123873 118781 114298 110254 107025 105095 104712 105753
56752 105753 107740 110194 113106 116931 122085 128602 136182 144164 151410 156622 159033 158616 155644 150429
56738 150429 143587 136112 128889 122282 116304 110986 106410 102619 99674 97638 96448 95965 96192 97234 98980
56723 98980 101092 103392 106074 109428 113453 117693 121284 123252 123117 121177 118018 113882 108915 103793 99491
56708 99491 96309 93660 90983 88365 86101 84149 82350 80785 79604 78760 78181 77897 77805 77599 77117 76448
56692 76448 75574 74288 72711 71421 70774 70444 69983 69406 68858 68125 66982 65766 65085 65094 65511 66143 66987 67895
56674 67895 68601 69052 69352 69466 69336 69185 69325 69694 69968 70100 70390 70998 71757 72500 73228 73922 74507 75095 75978
56655 75978 77250 78653 79877 80835 81568 82067 82312 82350 82269 82198 82324 82771 83415 83952 84193 84174 84014 83786 83559
$$ packed form
56766A75395m187o838q318r015q934p898o332n092m483m044l229j930l83J041
56752A05753J987K454K912L825N154O517P580P982P246N212K411m17k972n215
56738A50429o842p475p223o607n978n318m576l791k945k036j190m83K27J042J746
56723I8980K112K300K682L354M025M240L591J968j35j940l159m136m967n122m302
56708I9491l182k649k677k618k264j952j799j565j181q44n79k84r2k06m82o69
56692G6448q74j286j577j290o47l30m61n77n48p33j143j216o81RM17O32Q44R08
56674F7895P06M51L00J14j30j51J40L69K74J32K90O08P59P43P28O94N85N88Q83
56655G5978J272J403J224R58P33M99K45L8q1p1J26M47O44N37K41j9j60k28k27
$$ plain form
56636 83559 83394 83190 82694 81776 80656 79753 79294 79117 78856 78302 77531 76733 76036 75530 75345 75525 75921 76359 76826
56617 76826 77317 77628 77598 77493 77779 78491 79193 79654 80135 80848 81564 82045 82485 83169 83968 84571 84992 85469 85999
56598 85999 86307 86204 85691 84840 83849 83073 82719 82612 82548 82670 83223 84129 85173 86411 87961 89541 90715 91559
56580 91559 92609 94144 95942 97755 99567 101265 102527 103220 103635 104153 104959 106111 107557 108929 109631 109360
56564 109360 108356 107058 105764 104666 103926 103473 102947 102025 100677 99084 97503 96265 95620 95436 95278 94911
56548 94911 94524 94355 94367 94430 94579 94877 95251 95633 96094 96653 97099 97227 97102 96904 96661 96338 96080 96087 96294 96372 96082
56527 96082 95538 95124 95231 95981 97094 98046 98474 98456 98392 98623 99215 100002 100772 101430 102029 102707 103587 104733 106100
56508 106100 107488 108636 109465 110182 111024 111994 112958 113919 115006 116301 117858 119792 122107 124503 126585 128258
$$ packed form
56636H3559j65k04m96r18j120r03m59j77k61n54p71p98o97n06j85J80L96M38M67
56617G6826M91L11l0j05K86P12P02M61M81P13P16M81M40O84P99O03M21M77N30
56598H5999L08j03n13q51r91p76l54j07o4J22N53R06J044J238J550J580J174Q44
56580I1559J050J535J798J813J812J698J262O93M15N18Q06J152J446J372P02k71
56564A09360j004j298j294j098p40m53n26r22j348j593j581j238o45j84j58l67
56548I4911l87j69J2O3J49K98L74L82M61N59M46J28j25j98k43l23k58PK07P8k90
56527I6082n44m14J07P50J113R52M28j8o4K31N92P87P70O58N99O78Q80J146J367
56508A06100J388J148Q29P17Q42R70R64R61J087J295J557J934K315K396K082J673
$$ plain form
56492 128258 129653 130747 131400 131744 132199 132982 133893 134666 135194 135351 134968 134165 133396 132947 132644 132229 131720 131190
56474 131190 130513 129610 128704 127965 127121 125766 123950 122146 120703 119622 118812 118282 118019 117908 117835 117731 117518
56457 117518 117087 116345 115221 113725 112091 110719 109839 109282 108713 108038 107441 107109 107029 107017 106848 106446 106012 105888
56439 105888 106214 106812 107445 108024 108495 108736 108745 108740 108875 108998 108875 108541 108221 108037 107986 108085 108317 108508 108470 108228 107912
56418 107912 107544 107131 106892 107154 107989 109128 110211 110965 111187 110812 110015 109121 108372 107869 107704 107929 108379 108709
56400 108709 108688 108376 107999 107760 107793 108195 109004 110146 111411 112501 113211 113574 113784 113958 114101 114251 114505 114776
56382 114776 114727 114113 113106 112142 111519 111217 110997 110589 109900 109161 108748 108732 108782 108645 108522 108749 109278 109716 109808 109625
56362 109625 109328 109014 108783 108733 108841 109036 109394 110121 111262 112558 113661 114448 115114 115970 117099 118172 118680
$$ packed form
56492A28258J395J094O53L44M55P83R11P73N28J57l83q03p69m49l03m15n09n30
56474A31190o77r03r06p39q44j355j816j804j443j081q10n30k63j11p3j04k13
56457A17518m31p42j124j496j634j372q80n57n69o75n97l32q0j2j69m02m34j24
56439A05888L26N98O33N79M71K41RnJ35J23j23l34l20j84n1R9K32J91l8k42l16
56418A07912l68m13k39K62Q35J139J083P54K22l75p97q94p49n03j65K25M50L30
56400A08709k1l12l77k39L3M02Q09J142J265J090P10L63K10J74J43J50K54K71
56382A14776m9o14j007r64o23l02k20m08o89p39m13j6N0j37j23K27N29M38R2j83
56362A09625k97l14k31n0J08J95L58P27J141J296J103P87O66Q56J129J073N08
$$ plain form
56345 118680 118397 117564 116608 115815 115298 115068 115047 115136 115366 115843 116485 117020 117314 117522 117827 118258 118859 119725 120720
56326 120720 121510 122038 122626 123357 123758 123483 122951 122810 123020 122939 122194 121016 119847 119050 118870 119206 119478 119212
56308 119212 118669 118451 118590 118577 118269 118132 118458 118947 119325 119832 120763 121938 122969 123774 124476 125083 125567 126084
56290 126084 126804 127647 128427 129151 129925 130656 131111 131281 131491 132086 133074 134137 134975 135621 136330 137203 138046 138686
56272 138686 139277 140149 141452 143088 144874 146588 148009 149119 150165 151295 152273 152812 153073 153527 154388 155488
56256 155488 156631 157776 158873 159877 160893 162060 163287 164368 165301 166228 167124 167857 168507 169291 170231 171200
56240 171200 172245 173528 175021 176604 178385 180544 182963 185401 187962 190914 194134 197272 200413 204020
56226 204020 208189 212516 216791 221196 225729 230040 234094 238398 243301 248541 253790 259155 264841 270759
$$ packed form
56345A18680k83q33r56p93n17k30k1Q9K30M77O42N35K94K08L05M31O01Q66R95
56326A20720P90N28N88P31M01k75n32j41K10q1p45j178j169p97j80L36K72k66
56308A19212n43k18J39j3l08j37L26M89L78N07R31J175J031Q05P02O07M84N17
56290A26084P20Q43P80P24P74P31M55J70K10N95R88J063Q38O46P09Q73Q43O40
56272A38686N91Q72J303J636J786J714J421J110J046J130R78N39K61M54Q61J100
56256A55488J143J145J097J004J016J167J227J081R33R27Q96P33O50P84R40R69
56240A71200J045J283J493J583J781K159K419K438K561K952L220L138L141L607
56226B04020M169M327M275M405M533M311M054M304M903N240N249N365N686N918
$$ plain form
56212 270759 276798 283109 289796 296686 303676 310982 318822 327212 336278 346351 357453 369155 381234
56199 381234 394117 408381 424135 441171 459354 478621 499028 521115 545786 573476 603783
56188 603783 636261 671128 708809 749190 791809 836387 882698 930193 978237 1026460 1074392
56177 1074392 1120972 1164887 1205187 1241158 1271807 1296022 1313140 1322924 1325112 1319439 1306117 1285926
56165 1285926 1259840 1228772 1193623 1155229 1114280 1071441 1027463 983036 938694 894985 852576
56154 852576 812002 773485 737074 702746 670296 639490 610447 583517 558667 535404 513462
56143 513462 493061 474295 456803 440389 425404 412096 400068 388852 378542 369380 361177 353684
56131 353684 347096 341613 336825 332135 327510 323259 319357 315569 311989 308902 306299 304053 302326 301298
$$ packed form
56212B70759O039O311O687O890O990P306P840Q390R066J0073J1102J1702J2079
56199C81234J2883J4264J5754J7036J8183J9267K0407K2087K4671K7690L0307
56188F03783L2478L4867L7681M0381M2619M4578M6311M7495M8044M8223M7932
56177A074392M6580M3915M0300L5971L0649K4215J7118R784K188n673j3322k0191
56165A285926k6086l1068l5149l8394m0949m2839m3978m4427m4342m3709m2409
56154H52576m0574l8517l6411l4328l2450l0806k9043k6930k4850k3263k1942
56143E13462k0401j8766j7492j6414j4985j3308j2028j1216j0310r162q203p493
56131C53684o588n483m788m690m625m251l902l788l580l087k603k246j727j028
$$ plain form
56117 301298 300667 299948 299013 297970 296811 295647 294915 294821 294934 294919 295260 296547 298428 300069 301386 303012 305236
56100 305236 307818 310761 314421 318806 323465 328134 332877 337664 342456 347680 353954 361313 369338 378000
56086 378000 387684 398439 409902 422086 435562 450742 467572 486030 506362 528693 552913 579017
56074 579017 607050 636606 666797 696702 725458 752061 775754 796693 815748 833627 850545
56063 850545 866489 881120 893468 902401 907480 908900 906790 901203 892686 882069 869604 854886 837591
56050 837591 817690 795032 769524 741870 713469 685450 658348 632701 609266 588516 570459
56039 570459 555008 542001 530917 521186 512823 506232 501427 498011 495762 494572 493928 493242 492638 492673 493337
56024 493337 494081 494754 495712 497038 498499 500237 502671 505671 508683 511711 515330 519709 524439 529384 534808
$$ packed form
56117C01298o31p19r35j043j159j164p32r4J13j5L41J287J881J641J317J626K224
56100C05236K582K943L660M385M659M669M743M787M792N224O274P359Q025Q662
56086C78000R684J0755J1463J2184J3476J5180J6830J8458K0332K2331K4220K6104
56074E79017K8033K9556L0191K9905K8756K6603K3693K0939J9055J7879J6918
56063H50545J5944J4631J2348Q933N079J420k110n587q517j0617j2465j4718j7295
56050H37591j9901k2658k5508k7654k8401k8019k7102k5647k3435k0750j8057
56039E70459j5451j3007j1084r731q363o591m805l416k249j190o44o86o04L5O64
56024D93337P44O73R58J326J461J738K434L000L012L028L619M379M730M945N424
$$ plain form
56009 534808 540682 546734 553237 560760 569073 577230 584879 592559 600641 608937 617471 626550 635919 644816
55995 644816 653064 661142 669095 676458 683370 690630 698357 705791 712676 719752 727550 735800 744389 753792
55981 753792 764161 775041 786333 798594 812067 826442 841777 858512 876382 894511 912824
55970 912824 932147 952653 973565 994712 1016929 1040457 1064343 1087981 1111943 1136805 1162511
55959 1162511 1189407 1218537 1250333 1284341 1320693 1360352 1403403 1448614 1495320 1544256 1595978
55948 1595978 1650090 1706727 1767175 1832269 1901696 1975518 2054834 2140314 2231874 2330452 2438212
55937 2438212 2556124 2683076 2818056 2961238 3112266 3269729 3433439 3605175 3786291
55928 3786291 3976750 4177402 4390653 4617782 4858129 5112194 5382896 5672442 5980662
$$ packed form
56009E34808N874O052O503P523Q313Q157P649P680Q082Q296Q534R079R369Q897
55995F44816Q248Q078P953P363O912P260P727P434O885P076P798Q250Q589R403
55981G53792J0369J0880J1292J2261J3473J4375J5335J6735J7870J8129J8313
55970I12824J9323K0506K0912K1147K2217K3528K3886K3638K3962K4862K5706
55959A162511K6896K9130L1796L4008L6352L9659M3051M5211M6706M8936N1722
55948A595978N4112N6637O0448O5094O9427P3822P9316Q5480R1560R8578J07760
55937B438212J17912J26952J34980J43182J51028J57463J63710J71736J81116
55928C786291J90459K00652K13251K27129K40347K54065K70702K89546L08220
$$ plain form
55919 5980662 6307834 6656296 7027699 7421789 7839724 8285770 8764126 9277311 9829420
55910 9829420 10427360 11077020 11782153 12549207 13389146 14312437 15327138 16444922 17684525
55901 17684525 19067145 20614625 22355544 24326914 26567169 29116082 32026562 35368382
55893 35368382 39216390 43645901 48742250 54595359 61275185 68832015 77311172 86660713
55885 86660713 96470416 105743147 113030052 116986940 116980145 113292271 106845178 98737304
55877 98737304 89912383 81043188 72547740 64654498 57475075 51054974 45391402 40439250
55869 40439250 36126896 32375147 29105737 26244665 23729354 21513086 19559572 17836070
55861 17836070 16313891 14970169 13783846 12732121 11793982 10954268 10201096 9522026 8905699
$$ packed form
55919E980662L27172L48462L71403L94090M17935M46046M78356N13185N52109
55910I829420N97940O49660P05133P67054Q39939R23291J014701J117784J239603
55901A7684525J382620J547480J740919J971370K240255K548913K910480L341820
55893C5368382L848008M429511N096349N853109O679826P556830Q479157R349541
55885H6660713R809703R272731P286905L956888o795l687874o447093q107874
55877I8737304q824921q869195q495448p893242p179423o420101n663572m952152
55869D0439250m312354l751749l269410k861072k515311k216268j953514j723502
55861A7836070j522179j343722j186323j051725r38139q39714p53172o79070o16327
$$ plain form
55852 8905699 8344600 7833028 7364464 6933439 6537642 6175312 5842224 5533477 5246321
55843 5246321 4978973 4728544 4492491 4270510 4062747 3867522 3682729 3508045 3343862
55834 3343862 3189403 3043644 2906701 2778544 2657661 2542668 2434013 2332501 2237356 2147340
55824 2147340 2062551 1983483 1909439 1839491 1774041 1713915 1658730 1607438 1559488 1514152 1469742
55813 1469742 1424924 1380058 1336049 1292731 1249510 1206563 1164175 1121778 1078961 1036602 995824
55802 995824 956626 918598 882134 847748 815038 783488 753557 725861 700030 675400 652032
55791 652032 630000 608500 586798 565303 544634 524464 504414 485228 467823 451880 436569
55780 436569 421979 408631 396281 384456 373562 364167 355681 346973 337939 329302 321311 313750 306849
$$ packed form
55852H905699n61099n11572m68564m31025l95797l62330l33088l08747k87156
55843E246321k67348k50429k36053k21981k07763j95225j84793j74684j64183
55834C343862j54459j45759j36943j28157j20883j14993j08655j01512r5145r0016
55824B147340q4789p9068p4044o9948o5450o0126n5185n1292m7950m5336m4410
55813A469742m4818m4866m4009m3318m3221m2947m2388m2397m2817m2359m0778
55802I95824l9198l8028l6464l4386l2710l1550k9931k7696k5831k4630k3368
55791F52032k2032k1500k1702k1495k0669k0170k0050j9186j7405j5943j5311
55780D36569j4590j3348j2350j1825j0894r395q486q708r034q637p991p561o901
$$ plain form
55767 306849 300997 295886 290965 286410 282637 279231 275410 271223 267231 263355 259086 254592 250577 247202
55753 247202 244073 241103 238520 236271 234274 232975 232763 233106 233144 232830 232650 232575 232287 232124 232714 233861 234777
55736 234777 235282 235792 236257 236089 235127 233746 232032 229722 226979 224339 221863 219142 216182 213528 211408
55721 211408 209445 207259 204713 201573 197592 193012 188482 184480 181229 178906 177374 175936 174053 172136
55707 172136 170974 170570 170233 169577 168716 167622 166075 164167 162116 159760 156940 154202 152278 150959 149316
55692 149316 146995 144501 142236 140103 138046 136211 134479 132622 130913 129847 129239 128398 127248 126391 125996
55677 125996 125459 124371 123004 121614 120075 118507 117507 117329 117445 117237 116605 115636 114283 112675 111221 110101
55661 110101 109110 108220 107725 107604 107317 106558 105683 105054 104472 103669 102904 102640 102913 103418 103931 104361 104593 104618 104620 104688
$$ packed form
55767C06849n852n111m921m555l773l406l821m187l992l876m269m494m015l375
55753B47202l129k970k583k249j997j299k12L43L8l14j80p5k88j63N90J147R16
55736B34777N05N10M65j68r62j381j714k310k743k640k476k721k960k654k120
55721B11408j963k186k546l140l981m580m530m002l251k323j532j438j883j917
55707A72136j162m04l37o56q61j094j547j908k051k356k820k738j924j319j643
55692A49316k321k494k265k133k057j835j732j857j709j066o08q41j150q57l95
55677A25996n37j088j367j390j539j568j000j78J16k08o32r69j353j608j454j120
55661A10101r91q90m95j21k87p59q75o29n82q03p65k64K73N05N13M30K32K5KO8
$$ plain form
55641 104688 104612 104140 103261 102133 100933 99857 99065 98512 98049 97692 97580 97661 97687 97563 97466 97565 97878 98360 98924
55622 98924 99431 99960 100884 102353 103883 104937 105725 106852 108285 109330 109669 109694 109694 109408 108722 108171 108293 108887
55604 108887 109281 109058 108289 107339 106710 106766 107337 107843 107985 108052 108392 108915 109332 109583 109807 110080 110381 110615 110550 109938
55584 109938 108803 107407 105900 104254 102536 100897 99239 97265 94975 92723 90710 88789 86904 85271
55570 85271 83923 82493 80764 79114 78096 77797 77866 77979 78045 78117 78281 78536 78665 78398 77763 77100 76699 76634 76895
55551 76895 77346 77542 77016 75910 74923 74441 74101 73401 72366 71327 70393 69540 68982 69014 69488 69798 69436 68468
55533 68468 67403 66673 66244 65782 65198 64830 64935 65208 65145 64752 64520 64745 65278 65966 66845 67875 68908 70050
55515 70050 71612 73511 75169 76244 77105 78355 80200 82534 85309 88506 91940 95335 98391 100661 101686
$$ packed form
55641A04688p6m72q79j128j200j076p92n53m63l57j12Q1K6j24r7R9L13M82N64
55622I8924N07N29R24J469J530J054P88J127J433J045L39K5%k86o86n51J22N94
55604A08887L94k23p69r50o29N6N71N06J42O7L40N23M17K51K24K73L01K34o5o12
55584A09938j135j396j507j646j718j639j658j974k290k252k013j921j885j633
55570H5271j348j430j729j650j018k99O9J13O6P2J64K55J29k67o35o63m01o5K61
55551G6895M51J96n26j106r87m82l40p00j035j039r34q53n58L2M74L10l62r68
55533F8468j065p30m29m62n84l68J05K73o3l93k32K25N33O88Q79J030J033J142
55515G0050J562J899J658J075Q61J250J845K334K775L197L434L395L056K270J025
$$ plain form
55500 101686 101513 100813 100221 99718 98894 97566 95898 94088 92209 90236 88074 85674 83301 81491 80566 80255
55484 80255 79932 79152 77904 76523 75423 74768 74353 73912 73506 73369 73443 73408 73172 72966 72934 72974 73065 73334 73689 73796
55464 73796 73558 73198 72723 71799 70366 68893 67716 66568 65101 63482 62023 60608 58951 57186 55719
55449 55719 54662 53814 53070 52456 51873 51181 50479 49979 49682 49413 49103 48775 48324 47574 46518 45361 44383 43885
55431 43885 44074 44829 45728 46482 47186 48000 48810 49410 49810 50094 50186 49986 49598 49191 48804 48501 48533 49059 49838 50396
55411 50396 50432 49925 49077 48313 48084 48408 48817 48951 48971 49131 49246 48978 48441 48105 48163 48329 48233 47760 47034 46314
55391 46314 45857 45727 45797 46016 46451 46976 47204 46987 46694 46682 46751 46509 46024 45737 45863 46262 46765 47247 47502 47420
55371 47420 47245 47332 47747 48367 49229 50357 51392 51799 51451 50661 49730 48812 48142 47923 47944 47735 47180 46665 46554
$$ packed form
55500A01686j73p00n92n03q24j328j668j810j879j973k162k400k373j810r25l11
55484H0255l23p80j248j381j100o55m15m41m06j37P4l5k36k06l2M0R1K69L55J07
55464G3796k38l60m75r24j433j473j177j148j467j619j459j415j657j765j467
55449E5719j057q48p44o14n83o92p02n00k97k69l10l28m51p50j056j157r78m98
55431D3885J89P55Q99P54P04Q14Q10O00M00K84R2k00l88m07l87l03L2N26P79N58
55411E0396L6n07q48p64k29L24M09J34K0J60J15k68n37l36N8J66r6m73p26p20
55391D6314m57j30P0K19M35N25K28k17k93j2O9k42m85k87J26L99N03M82K55q2
55371D7420j75Q7M15O20Q62J128J035M07l48p90r31r18o70k19K1k09n55n15j11
$$ plain form
55352 46554 46849 47366 47930 48339 48494 48645 49178 50043 50659 50564 49907 49212 48870 48979 49458 50114 50731 51189 51519
55333 51519 51801 52077 52293 52255 51726 50726 49618 48759 48170 47730 47510 47626 47929 48167 48374 48731 49132 49267 49170
55314 49170 49272 49788 50414 50752 50768 50642 50403 49902 49029 47868 46715 45946 45676 45591 45304 44859 44647 44800 44972
55295 44972 44820 44417 44057 43905 44010 44437 45155 45881 46271 46243 46004 45793 45696 45701 45859 46305 47072 47923 48496 48691
55275 48691 48764 48945 49090 48902 48399 47928 47738 47740 47684 47411 46950 46527 46430 46722 47124 47366 47538 47891 48360 48590 48417
55254 48417 48086 47888 47834 47734 47477 47148 46975 47113 47416 47492 47152 46738 46793 47449 48328 49001 49321 49387 49400 49547 49801
55233 49801 49873 49611 49349 49538 50079 50367 50048 49425 48985 48831 48727 48466 48056 47666 47516 47692 48066 48488 48986
55214 48986 49576 49988 49917 49535 49387 49675 49999 49929 49542 49190 48997 48838 48633 48426 48281 48263 48456 48874 49414 49966
$$ packed form
55352D6554K95N17N64M09J55J51N33Q65O16r5o57o95l42J09M79O56O17M58L30
55333E1519K82K76K16l8n29j000j108q59n89m40k20J16L03K38K07L57M01J35r7
55314D9170J02N16O26L38J6j26k39n01q73j161j153p69k70q5k87m45k12J53J72
55295D4972j52m03l60j52J05M27P18P26L90k8k39k11r7NJ58M46P67Q51N73J95
55275D8691P3J81J45j88n03m71j90Kn6k73m61m23r7K92M02K42J72L53M69K30j73
55254D8417l31j98n4j00k57l29j73J38L03P6l40m14N5O56Q79O73L20O6J3J47K54
55233D9801P2k62k62J89N41K88l19o23m40j54j04k61m10l90j50J76L74M22M98
55214D8986N90M12p1l82j48K88L24p0l87l52j93j59k05k07j45j8J93M18N40N52
$$ plain form
55194 49966 50469 50842 51012 51051 51127 51251 51238 51003 50724 50604 50586 50422 49980 49386 48930 48779 48747 48424 47657 46839 46535
55173 46535 46891 47595 48315 48899 49235 49259 49134 49081 49007 48581 47797 47084 46788 46813 46932 47114 47367 47516 47421 47187 46971
55152 46971 46741 46421 46126 46078 46357 46861 47383 47660 47515 47085 46768 46862 47365 48116 48921 49528 49734 49634 49514 49469
55132 49469 49370 49302 49616 50370 51063 51188 50816 50370 50085 49947 49915 49883 49601 48958 48236 47813 47689 47555 47229 46820
55112 46820 46529 46522 46882 47473 47962 48147 48203 48399 48693 48807 48587 48123 47644 47489 47990 49120 50348 51130 51454
55093 51454 51692 52009 52226 52143 51741 51118 50491 50170 50255 50421 50289 49981 49949 50281 50559 50450 50094 49788 49588 49389
55073 49389 49167 48919 48572 48117 47695 47437 47338 47393 47702 48263 48792 48971 48826 48703 48850 49149 49286 49117 48814 48660
55053 48660 48736 48843 48754 48510 48370 48477 48682 48744 48658 48709 49178 50012 50834 51269 51240 50947 50596 50288 50150 50393 51101
$$ packed form
55194D9966N03L73J70L9P6J24j3k35k79j20j8j64m42n94m56j51l2l23p67q18l04
55173D6535L56P04P20N84L36K4j25n3p4m26p84p13k96K5J19J82K53J49r5k34k16
55152D6971k30l20k95m8K79N04N22K77j45m30l17R4N03P51Q05O07K06j00j20m5
55132D9469r9o8L14P54O93J25l72m46k85j38l2l2k82o43p22m23j24j34l26m09
55112D6820k91pL60N91M89J85N6J96K94J14k20m64m79j55N01J130J228P82L24
55093E1454K38L17K17q3m02o23o27l21Q5J66j32l08l2L32K78j09l56l06k00j99
55073D9389k22k48l47m55m22k58r9N5L09N61N29J79j45j23J47K99J37j69l03j54
55053D8660P6J07q9k44j40J07K05O2q6N1M69Q34Q22M35k9k93l51l08j38K43P08
$$ plain form
55032 51101 52052 52882 53454 53943 54529 55119 55432 55353 55128 55169 55635 56251 56592 56526 56268 56074 55977 55849 55569 55086
55012 55086 54452 53902 53752 54077 54603 55032 55395 55895 56481 56810 56663 56210 55761 55395 54959 54360 53745 53354 53275
54993 53275 53373 53449 53386 53175 52880 52605 52427 52286 52018 51567 51122 50935 51041 51325 51785 52531 53492 54324 54723 54710
54973 54710 54486 54156 53713 53228 52860 52699 52635 52507 52333 52372 52832 53543 54069 54221 54303 54670 55255 55775 56231 56773
54953 56773 57169 56919 55991 55022 54595 54679 54975 55398 55899 56199 56129 56012 56295 56934 57509 57806 57912 57797 57277 56433
54933 56433 55690 55370 55420 55619 55817 55900 55785 55576 55511 55651 55804 55838 55910 56247 56825 57365 57617 57589 57526 57678 58017
54912 58017 58225 58032 57578 57284 57397 57771 58156 58522 59017 59675 60274 60520 60308 59793 59233 58817 58675 58938 59617
54893 59617 60442 61048 61350 61592 61925 62163 62070 61702 61271 60824 60316 59902 59879 60343 61072 61722 62050 61981 61628 61254
$$ packed form
55032E1101R51Q30N72M89N86N90L13p9k25M1M66O16L41o6k58j94r7j28k80m83
55012E5086o34n50j50L25N26M29L63N00N86L29j47m53m49l66m36n99o15l91p9
54993E3275R8P6o3k11k95k75j78j41k68m51m45j87J06K84M60P46R61Q32L99j3
54973E4710k24l30m43m85l68j61o4j28j74L9M60P11N26J52Q2L67N85N20M56N42
54953E6773L96k50r28r69m27Q4K96M23N01L00p0j17K83O39N75K97J06j15n20q44
54933E6433p43l20N0J99J98Q3j15k09o5J40J53L4P2L37N78N40K52k8o3J52L39
54912E8017K08j93m54k94J13L74L85L66M95O58N99K46k12n15n60m16j42K63O79
54893E9617Q25O06L02K42L33K38r3l68m31m47n08m14k3M64P29O50L28o9l53l74
$$ plain form
54873 61254 61076 61146 61457 62079 63024 64088 65005 65716 66368 67107 68026 69169 70460 71729 73017 74699 77045
54856 77045 79752 82199 84108 85667 87042 88077 88537 88347 87504 86002 83969 81707 79485 77413 75565
54841 75565 74024 72760 71591 70383 69152 67969 66896 66056 65605 65553 65742 65980 66135 66146 66099 66260 66848 67763
54823 67763 68718 69603 70518 71461 72279 72954 73695 74619 75638 76788 78404 80734 83515 86134 88097 89209
54807 89209 89466 89014 88147 87116 85888 84246 82153 79895 77819 76022 74341 72638 70992 69573 68403
54792 68403 67341 66333 65518 64980 64511 63799 62809 61780 60869 59985 59036 58162 57607 57424 57376 57125 56520 55793
54774 55793 55402 55605 56163 56585 56624 56426 56265 56259 56357 56446 56417 56277 56175 56254 56493 56816 57240 57777 58253 58450 58410 58348
54752 58348 58325 58225 58061 58011 58075 57994 57628 57162 56798 56454 55994 55569 55498 55864 56402 56776 56887 56926 57158 57639 58154
$$ packed form
54873F1254j78P0L11O22R45J064R17P11O52P39R19J143J291J269J288J682K346
54856G7045K707K447J909J559J375J035M60j90q43j502k033k262k222k072j848
54841G5565j541j264j169j208j231j183j073q40m51n2J89K38J55J1m7J61N88R15
54823F7763R55Q85R15R43Q18O75P41R24J019J150J616K330K781K619J963J112
54807H9209K57m52q67j031j228j642k093k258k076j797j681j703j646j419j170
54792F8403j062j008q15n38m69p12r90j029r11q84r49q74n55j83m8k51o05p27
54774E5793l91K03N58M22L9j98j61oR8Q9k9j40j02P9K39L23M24N37M76J97m0o2
54752E8348k3j00j64n0O4q1l66m66l64l44m60m25p1L66N38L74J11L9K32M81N15
$$ plain form
54731 58154 58489 58693 58923 59126 59124 59010 59168 59782 60538 60995 61083 61087 61288 61760 62398 63024 63532 64019 64690 65600 66623
54710 66623 67737 69089 70709 72355 73830 75266 76911 78798 80813 82960 85261 87490 89261 90397
54696 90397 90999 91098 90477 88962 86788 84509 82502 80674 78702 76550 74622 73349 72742 72430 72046 71424
54680 71424 70512 69397 68413 67959 68103 68548 69056 69687 70505 71304 71827 72060 72133 72071 71892 71808 72106 72871 74024
54661 74024 75580 77653 80181 82845 85279 87275 88749 89653 89970 89719 88893 87447 85411 83063 80902
54646 80902 79344 78355 77474 76327 75015 73856 72874 71819 70641 69619 68927 68375 67747 67133 66678 66241 65531
54629 65531 64488 63269 62014 60855 60068 59893 60185 60478 60460 60247 60160 60386 60891 61526 62129 62537 62600 62234 61508
54610 61508 60670 59996 59571 59278 58971 58572 58003 57237 56442 55957 56014 56581 57471 58427 59091 59200 58916 58754 58996
$$ packed form
54731E8154L35K04K30K03kj14J58O14P56M57Q8MK01M72O38O26N08M87O71R10J023
54710F6623J114J352J620J646J475J436J645J887K015K147K301K229J771J136
54696I0397O02R9o21j515k174k279k007j828j972k152j928j273o07l12l84o22
54680G1424r12j115r84m54J44M45N08O31Q18P99N23K33P3o2j79q4K98P65J153
54661G4024J556K073K528K664K434J996J474R04L17k51q26j446k036k348k161
54646H0902j558r89q81j147j312j159r82j055j178j022o92n52o28o14m55m37p10
54629F5531j043j219j255j159p87j75K92K93j8k13q7K26N05O35O03M08O3l66p26
54610F1508q38o74m25k93l07l99n69p66p95m85N7N67Q90R56O64J09k84j62K42
$$ plain form
54591 58996 59397 59598 59601 59614 59697 59838 60210 60980 61947 62690 63038 63149 63149 63009 62772 62589 62494 62384 62243 62160 62053 61668
54569 61668 60976 60317 59971 59724 59131 58124 57166 56755 56944 57454 58124 59045 60205 61264 61881 62135 62369 62634
54551 62634 62599 62066 61265 60536 60028 59886 60355 61341 62159 62130 61355 60512 59993 59614 59180 58877 58968 59428 60035 60620
54531 60620 61071 61295 61303 61233 61195 61206 61292 61514 61863 62238 62595 62964 63335 63611 63735 63717 63561 63266 62914 62655 62598 62784
54509 62784 63162 63493 63425 62882 62291 62156 62434 62638 62513 62316 62389 62764 63277 63794 64191 64366 64391 64471 64643 64776
54489 64776 64907 65312 66057 66796 67255 67609 68116 68589 68626 68230 67827 67689 67700 67735 67893 68221 68489 68451 68185 67942
54469 67942 67788 67558 67151 66685 66311 66025 65728 65408 65132 64916 64696 64440 64194 64007 63886 63887 64146 64728 65485 66185
54449 66185 66717 67067 67132 66743 65907 64907 64081 63596 63460 63644 64057 64514 64831 64971 64990 64912 64740 64613 64836 65626
$$ packed form
54591E8996M01K01LJ3Q3J41L72P70R67P43L48J11%j40k37j83r5j10j41q3j07l85
54569F1668o92o59l46k47n93j007r58m11J89N10O70R21J160J059O17K54K34K65
54551F2634l5n33q01p29n08j42M69R86Q18k9p75q43n19l79m34l03R1M60O07N85
54531F0620M51K24Qp0l8J1Q6K22L49L75L57L69L71K76J24j8j56k95l52k59n7J86
54509F2784L78L31o8n43n91j35K78K04j25j97P3L75N13N17L97J75K5Q0J72J33
54489F4776J31M05P45P39M59L54N07M73L7l96m03j38J1L5J58L28K68l8k66k43
54469F7942j54k30m07m66l74k86k97l20k76k16k20k56k46j87j21JK59N82P57P00
54449F6185N32L50O5l89q36j000q26m85j36J84M13M57L17J40J9p8j72j27K23P90
$$ plain form
54429 65626 66879 68231 69350 70085 70410 70360 70085 69832 69745 69769 69841 70087 70596 71124 71280 71017 70698 70641 70886 71436
54409 71436 72393 73629 74692 75306 75752 76437 77296 77955 78295 78484 78563 78424 78185 78134 78254 78139 77542 76727 76131
54390 76131 75927 76011 76222 76423 76527 76526 76416 76081 75464 74807 74485 74556 74700 74638 74366 73933 73310 72561 71906 71490 71284
54369 71284 71332 71784 72572 73274 73503 73248 72756 72301 72177 72588 73349 73955 74166 74247 74438 74512 74191 73733 73653 74013
54349 74013 74397 74540 74581 74680 74748 74646 74407 74149 73994 74060 74338 74568 74454 74048 73704 73624 73672 73682 73751 74103 74791 75644
54327 75644 76407 76889 77075 77163 77375 77698 77896 77771 77343 76806 76436 76495 77010 77606 77800 77557 77368 77695 78520 79575
54307 79575 80772 82147 83519 84559 85212 85819 86698 87785 88794 89575 90188 90716 91141 91375 91295 90797 89923
54290 89923 88897 87960 87171 86448 85744 85012 84115 82963 81757 80826 80139 79291 78104 76954 76278 75998 75764
$$ packed form
54429F5626J253J352J119P35L25n0k75k53q7K4P2K46N09N28J56k63l19n7K45N50
54409G1436R57J236J063O14M46O85Q59O59L40J89P9j39k39n1J20j15n97q15n96
54390G6131k04Q4K11K01J04jj10l35o17o57l22P1J44o2k72m33o23p49o55m16k06
54369G1284M8M52P88P02K29k55m92m55j24M11P61O06K11Q1J91P4l21m58q0L60
54349G4013L84J43M1R9O8j02k39k58j55O6K78K30j14m06l44q0M8J0O9L52O88Q53
54327G5644P63M82J86Q8K12L23J98j25m28n37l70N9N15N96J94k43j89L27Q25J055
54307G9575J197J375J372J040O53O07Q79J087J009P81O13N28M25K34q0m98q74
54290H9923j026r37p89p23p04p32q97j152j206r31o87q48j187j150o76k80k34
$$ plain form
54273 75764 75541 75560 75767 75789 75490 75152 75042 75142 75407 75917 76559 76926 76789 76382 75990 75505 74698 73711 72939 72563
54253 72563 72502 72665 72955 73152 73152 73234 73732 74460 74855 74740 74555 74702 74965 74810 74057 73058 72310 72049 72123 72162 71941
54232 71941 71619 71549 71844 72272 72585 72784 73020 73427 74138 75245 76573 77614 77939 77596 76989 76423 75968 75706
54214 75706 75835 76384 77007 77245 76964 76397 75804 75250 74738 74377 74242 74199 74052 73849 73863 74222 74774 75350 75990 76736
54194 76736 77383 77644 77527 77349 77372 77551 77634 77387 76767 75958 75264 74816 74419 73820 73068 72477 72240 72250 72337 72501
54174 72501 72823 73336 74056 75040 76248 77456 78396 78949 79118 78890 78269 77402 76569 76044 75977 76342 76879 77143 76799
54155 76799 75940 75013 74381 74050 73877 73911 74333 75115 75919 76425 76613 76602 76386 75875 75153 74459 73907 73413 72895 72412
54135 72412 72052 71842 71831 72090 72535 72940 73233 73630 74307 75109 75731 76076 76233 76246 76139 76064 76136 76169 75870 75325 74950
$$ packed form
54273G5764k23J9K07K2k99l38j10J00K65N10O42L67j37m07l92m85q07r87p72l76
54253G2563o1J63K90J97%Q2M98P28L95j15j85J47K63j55p53r99p48k61P4L9k21
54232G1941l22p0K95M28L13J99K36M07P11J107J328J041L25l43o07n66m55k62
54214G5706J29N49O23K38k81n67n93n54n12l61j35m3j47k03J4L59N52N76O40P46
54194G6736O47K61j17j78K3J79Q3k47o20q09o94m48l97n99p52n91k37J0Q7J64
54174G2501L22N13P20R84J208J208R40N53J69k28o21q67q33n25o7L65N37K64l44
54155G6799q59r27o32l31j73L4M22P82Q04N06J88j1k16n11p22o94n52m94n18m83
54135G2412l60k10j1K59M45M05K93L97O77Q02O22L45J57J3j07p5P2L3k99n45l75
$$ plain form
54114 74950 74900 74873 74652 74548 74993 75880 76618 76800 76525 76107 75703 75327 75009 74800 74716 74764 74969 75318 75719 76093
54094 76093 76405 76569 76415 75890 75223 74700 74296 73692 72741 71787 71363 71636 72288 72859 73080 72926 72550 72238 72254
54075 72254 72643 73256 73964 74735 75462 75918 76002 75912 75917 76058 76194 76252 76269 76240 76110 75929 75867 76038 76407 76864 77307 77657
54053 77657 77935 78288 78889 79745 80736 81795 82929 84049 84947 85555 86162 87202 88834 90768 92546 93906
54037 93906 94890 95638 96188 96465 96389 95933 95163 94266 93506 92998 92554 91860 90831 89682 88647 87790 87110 86669
54019 86669 86511 86582 86798 87085 87313 87341 87215 87168 87338 87625 87924 88330 88981 89873 90958 92193 93341 93975 93949
54000 93949 93644 93475 93379 93138 92960 93245 93871 94262 94223 94215 94679 95527 96470 97447 98459 99349 100074 100907 102083 103452
53980 103452 104797 106296 108329 110931 113762 116568 119376 122250 125112 127882 130608 133361 136094 138674
$$ packed form
54114G4950n0k7k21j04M45Q87P38J82k75m18m04l76l18k09q4M8K05L49M01L74
54094G6093L12J64j54n25o67n23m04o04r51r54m24K73O52N71K21j54l76l12J6
54075G2254L89O13P08P71P27M56Q4r0NJ41J36N8J7k9j30j81o2J71L69M57M43L50
54053G7657K78L53O01Q56R91J059J134J120Q98O08O07J040J632J934J778J360
54037I3906R84P48N50K77p6m56p70q97p60n08m44o94j029j149j035q57o80m41
54019H6669j58P1K16K87K28K8j26m7J70K87K99M06O51Q92J085J235J148O34k6
54000I3949l05j69r6k41j78K85O26L91l9qM64Q48R43R77J012Q90P25Q33J176J369
53980A03452J345J499K033K602K831K806K808K874K862K770K726K753K733K580
$$ plain form
53966 138674 140992 143060 145018 147039 149177 151360 153497 155497 157147 158164 158469 158335 158132 158008 157882
53951 157882 157606 156998 155840 154051 151841 149558 147416 145433 143532 141588 139446 137082 134688 132482 130461
53936 130461 128466 126490 124727 123322 122206 121193 120182 119202 118349 117678 117098 116441 115666 114917 114290 113627
53920 113627 112683 111471 110280 109398 108949 108986 109499 110280 110997 111547 112236 113484 115388 117723 120273 123020 125945
53903 125945 128814 131237 132898 133650 133449 132360 130623 128630 126718 125051 123683 122636 121812 120979 120049
53888 120049 119364 119473 120571 122262 123954 125348 126496 127533 128501 129404 130308 131426 133034 135220 137663
53873 137663 139837 141559 143139 144893 146683 148211 149637 151505 154002 156635 158852 160767 162992 165824
53859 165824 168911 171774 174378 176997 179727 182400 184978 187720 190817 194123 197395 200650 204048 207550
$$ packed form
53966A38674K318K068J958K021K138K183K137K000J650J017L05j34k03j24j26
53951A57882k76o08j158j789k210k283k142j983j901j944k142k364k394k206k021
53936A30461j995j976j763j405j116j013j011r80q53o71n80o57p75p49o27o63
53920A13627r44j212j191q82m49L7N13P81P17N50O89J248J904K335K550K747K925
53903A25945K869K423J661P52k01j089j737j993j912j667j368j047q24q33r30
53888A20049o85J09J098J691J692J394J148J037R68R03R04J118J608K186K443
53873A37663K174J722J580J754J790J528J426J868K497K633K217J915K225K832
53859A65824L087K863K604K619K730K673K578K742L097L306L272L255L398L502
$$ plain form
53845 207550 210955 214220 217435 220482 222969 224595 225375 225499 225208 224829 224581 224201 223078 220960 218291 215651
53829 215651 213110 210371 207277 203854 200063 195921 191738 187839 184128 180289 176374 172774 169599 166525
53815 166525 163362 160320 157522 154684 151593 148615 146313 144684 143153 141271 139107 136917 134762 132567
53801 132567 130373 128313 126422 124643 123025 121769 120953 120290 119344 118005 116626 115582 114837 114112 113393 112982
53785 112982 113009 113143 112969 112487 112072 111976 112018 111817 111230 110503 110004 109841 109807 109672 109407 109053 108563 107959 107553 107713
53765 107713 108355 108965 109225 109372 109750 110297 110718 111000 111406 112039 112731 113417 114261 115312 116356 117283 118384 119967
53747 119967 121837 123459 124643 125771 127308 129298 131464 133600 135678 137723 139798 142027 144478 147018
53733 147018 149439 151756 154194 156886 159688 162319 164543 166234 167408 168264 169019 169627 169795 169349 168399 167107
$$ packed form
53845B07550L405L265L215L047K487J626P80J24k91l79k48l80j123k118k669k640
53829B15651k541k739l094l423l791m142m183l899l711l839l915l600l175l074
53815A66525l163l042k798k838l091k978k302j629j531j882k164k190k155k195
53801A32567k194k060j891j779j618j256q16o63r46j339j379j044p45p25p19m11
53785A12982K7J34j74m82m15r6M2k01n87p27m99j63l4j35k65l54m90o04m06J60
53765A07713O42O10K60J47L78N47M21K82M06O33O92O86Q44J051J044R27J101J583
53747A19967J870J622J184J128J537J990K166K136K078K045K075K229K451K540
53733A47018K421K317K438K692K802K631K224J691J174Q56P55O08J68m46r50j292
$$ plain form
53717 167107 165487 163601 161732 160082 158473 156611 154555 152647 150969 149190 146997 144438 141826 139479
53703 139479 137589 136107 134665 132875 130806 128966 127684 126710 125565 124074 122400 120749 119275 118150
53689 118150 117462 117077 116740 116300 115697 114861 113813 112810 112153 111849 111632 111343 111112 111091 111196 111197 110958 110510 109953
53670 109953 109393 108945 108719 108789 109194 109921 110864 111837 112669 113307 113874 114594 115605 116783 117770 118291 118399 118415 118617
53651 118617 119049 119552 119933 120118 120249 120618 121412 122540 123787 125087 126507 127956 129118 129789 130171 130680 131520
53634 131520 132578 133719 135026 136666 138591 140456 141860 142649 142999 143223 143504 143790 143910 143772 143470 143184
53618 143184 143035 142993 142974 142973 143084 143366 143760 144161 144549 144923 145172 145103 144650 144022 143588 143626 144170 145005 145808 146331 146532
53597 146532 146531 146446 146345 146311 146442 146723 146990 147127 147226 147465 147865 148279 148598 148840 149093 149420 149847 150305 150664 150899
$$ packed form
53717A67107j620j886j869j650j609j862k056j908j678j779k193k559k612k347
53703A39479j890j482j442j790k069j840j282r74j145j491j674j651j474j125
53689A18150o88l85l37m40o03q36j048j003o57l04k17k89k31k1J05Jk39m48n57
53670A09953n60m48k26P0M05P27R43R73Q32O38N67P20J011J178R87N21J08J6K02
53651A18617M32N03L81J85J31L69P94J128J247J300J420J449J162O71L82N09Q40
53634A31520J058J141J307J640J925J865J404P89L50K24K81K86J20j38l02k86
53618A43184j49m2j9jJ11K82L94M01L88L74K49o9m53o28m34L8N44Q35Q03N23K01
53597A46532jq5j01l4J31K81K67J37R9K39M00M14L19K42K53L27M27M58L59K35
$$ plain form
53577 150899 151193 151711 152293 152585 152519 152473 152868 153754 154906 156120 157265 158238 159091 160140 161667 163544 165322
53560 165322 166707 167776 168754 169812 171108 172773 174728 176643 178219 179399 180301 181054 181802 182705 183795
53545 183795 184941 186056 187237 188616 190156 191716 193205 194548 195591 196291 196902 197783 198956 200045 200712
53530 200712 201006 201207 201429 201514 201269 200719 200091 199596 199258 198974 198708 198552 198564 198586 198296 197426 195906 193884 191703
53511 191703 189821 188595 188041 187867 187754 187617 187574 187734 188057 188365 188454 188233 187838 187626 187934 188722 189473 189584 188980
53492 188980 188270 188173 188812 189672 190264 190619 191070 191748 192474 193097 193730 194631 195948 197592 199336 200981 202532
53475 202532 204190 206172 208531 211158 213894 216617 219302 222067 225159 228828 233191 238169 243490 248788
53461 248788 253859 258897 264338 270415 276959 283681 290493 297445 304572 311982 319909 328434 337316 346365
$$ packed form
53577A50899K94N18N82K92o6m6L95Q86J152J214J145R73Q53J049J527J877J778
53560A65322J385J069R78J058J296J665J955J915J576J180R02P53P48R03J090
53545A83795J146J115J181J379J540J560J489J343J043P00O11Q81J173J089O67
53530B00712K94K01K22Q5k45n50o28m95l38k84k66j56J2K2k90q70j520k022k181
53511A91703j882j226n54j74j13j37m3J60L23L08Q9k21l95k12L08P88P51J11o04
53492A88980p10r7O39Q60N92L55M51O78P26O23O33R01J317J644J744J645J551
53475B02532J658J982K359K627K736K723K685K765L092L669M363M978N321N298
53461B48788N071N038N441O077O544O722O812O952P127P410P927Q525Q882R049
$$ plain form
53447 346365 355848 366150 377109 388071 398660 409111 419729 430399 440879 451227 461630 471990
53435 471990 482030 491725 501331 510972 520440 529462 538007 546308 554673 563265 571982 580558 588849 596971
53421 596971 605072 613051 620693 628014 635297 642728 650165 657327 664037 670188 675561 679872 682997 685087
53407 685087 686450 687317 687737 687627 686875 685354 682880 679267 674522 668939 662917 656626 649998 643031 635997
53392 635997 629189 622550 615702 608361 600559 592459 584132 575650 567237 559134 551382 543902 536787 530282
53378 530282 524448 519047 513816 508734 503956 499728 496428 494443 493742 493753 493899 494162 494921 496384 498452 501056
53362 501056 504285 508162 512596 517616 523354 529710 536366 543299 551018 560012 570141 580844 591820
53349 591820 603223 615224 627694 640429 653485 667114 681442 696357 711759 727811 744818
$$ packed form
53447C46365R483J0302J0959J0962J0589J0451J0618J0670J0480J0348J0403J0360
53435D71990J0040R695R606R641R468R022Q545Q301Q365Q592Q717Q576Q291Q122
53421E96971Q101P979P642P321P283P431P437P162O710O151N373M311L125K090
53407F85087J363Q67M20j10p52j521k474l613m745n583o022o291o628o967p034
53392F35997o808o639o848p341p802q100q327q482q413q103p752p480p115o505
53378E30282n834n401n231n082m778m228l300j985p01J1J46K63P59J463K068K604
53362E01056L229L877M434N020N738O356O656O933P719Q994J0129J0703J0976
53349E91820J1403J2001J2470J2735J3056J3629J4328J4915J5402J6052J7007
$$ plain form
53338 744818 762867 781680 800962 820774 841436 863075 885436 908172 931134 954330 977731
53327 977731 1001235 1024717 1048022 1071036 1093814 1116488 1138940 1160686 1181243 1200527 1218704
53316 1218704 1235747 1251368 1265390 1277967 1289347 1299544 1308345 1315496 1320767 1323906 1324703 1323129 1319304
53303 1319304 1313275 1304933 1294230 1281390 1266763 1250496 1232526 1212932 1192147 1170685 1148813 1126590
53291 1126590 1104121 1081582 1059064 1036568 1014176 992141 970776 950253 930426 910841 891100
53280 891100 871322 852075 833689 815856 798155 780724 764066 748390 733575 719653 706811
53269 706811 694934 683681 673121 663775 655787 648551 641431 634411 627748 621393 615197 609329 604015
53256 604015 599030 593895 588453 583001 577958 573698 570501 568286 566580 565024 563796 563220 563256 563733 564836
$$ packed form
53338G44818J8049J8813J9282J9812K0662K1639K2361K2736K2962K3196K3401
53327I77731K3504K3482K3305K3014K2778K2674K2452K1746K0557J9284J8177
53316A218704J7043J5621J4022J2577J1380J0197Q801P151N271L139P97j574l825
53303A319304o029q342j0703j2840j4627j6267j7970j9594k0785k1462k1872k2223
53291A126590k2469k2539k2518k2496k2392k2035k1365k0523j9827j9585j9741
53280H91100j9778j9247j8386j7833j7701j7431j6658j5676j4815j3922j2842
53269G06811j1877j1253j0560r346p988p236p120p020o663o355o196n868n314
53256F04015m985n135n442n452n043m260l197k215j706j556j228n76L6M77J103
$$ plain form
53241 564836 566842 569522 572366 575360 579022 583621 588932 594765 601244 608385 615891 623596 631740 640588
53227 640588 650080 660027 670288 680609 690584 700034 709102 717818 725891 733121 739667 745627 750722 754703
53213 754703 757771 760166 761583 761442 759681 756846 753388 749230 744072 737822 730614 722605 713858 704310
53199 704310 693858 682562 670725 658612 646175 633240 619904 606509 593245 580028 566831
53188 566831 553845 541204 528759 516348 504124 492344 480889 469278 457243 445095 433390
53177 433390 422363 411902 401957 392651 383905 375244 366217 356918 347873 339480 331821 324945 319013 314010
53163 314010 309542 305081 300345 295344 290155 284821 279383 273921 268521 263242 258054 252779 247236 241503
53149 241503 235960 230967 226541 222405 218310 214211 210184 206264 202401 198561 194852 191481 188503 185657
$$ packed form
53241E64836K006K680K844K994L662M599N311N833O479P141P506P705Q144Q848
53227F40588R492R947J0261J0321R975R450R068Q716Q073P230O546N960N095L981
53213G54703L068K395J417j41j761k835l458m158n158o250p208q009q747r548
53199G04310j0452j1296j1837j2113j2437j2935j3336j3395j3264j3217j3197
53188E66831j2986j2641j2445j2411j2224j1780j1455j1611j2035j2148j1705
53177D33390j1027j0461r945r306q746q661r027r299r045q393p659o876n932n003
53163C14010m468m461m736n001n189n334n438n462n400n279n188n275n543n733
53149B41503n543m993m426m136m095m099m027l920l863l840l709l371k978k846
$$ plain form
53135 185657 182570 179159 175710 172483 169376 166055 162392 158665 155322 152602 150394 148467 146790 145501
53121 145501 144544 143475 141808 139494 136919 134511 132489 130909 129717 128759 127939 127314 126859 126235 125130 123816
53105 123816 122977 122888 123129 123215 123094 122848 122323 121451 120594 120156 120032 119844 119533 119297 119064 118506 117605 116749 116176
53086 116176 115731 115295 115088 115310 115730 115925 115801 115684 115915 116514 117189 117575 117490 117053 116566 116279 116271 116491 116807 117037
53066 117037 117040 116858 116706 116820 117331 118238 119390 120501 121330 121872 122348 122974 123811 124825 125985 127245 128503
53049 128503 129608 130385 130683 130436 129667 128457 126967 125496 124324 123375 122208 120553 118776 117564 117164 117177
53033 117177 117150 117074 117184 117490 117726 117686 117398 116990 116541 116108 115745 115416 114975 114346 113713 113365 113331 113289 112968 112498
53013 112498 112187 112025 111700 111129 110643 110505 110556 110556 110606 110921 111373 111629 111633 111580 111452 110991 110196 109490 109231 109303 109343 109153
$$ packed form
53135A85657l087l411l449l227l107l321l663l727l343k720k208j927j677j289
53121A45501r57j069j667k314k575k408k022j580j192r58q20o25m55o24j105j314
53105A23816q39q9K41Q6j21k46n25q72q57m38j24j88l11k36k33n58r01q56n73
53086A16176m45m36k07K22M20J95j24j17K31N99O75L86q5m37m87k87qK20L16K30
53066A17037Lj82j52J14N11R07J152J111Q29N42M76O26Q37J014J160J260J258
53049A28503J105P77K98k47p69j210j490j471j172r49j167j655j777j212m00J3
53033A17177k7p6J10L06K36m0k88m08m49m33l63l29m41o29o33l48l4m2l21m70
53013A12498l11j62l25n71m86j38N1%N0L15M52K56Mn3j28m61p95p06k59P2M0j90
$$ plain form
52991 109153 108760 108291 107916 107800 107932 108114 108188 108190 108221 108328 108551 108915 109270 109328 108980 108439 107959 107601 107367 107379 107738
52970 107738 108313 108831 109150 109321 109466 109677 109957 110174 110187 110067 110013 110010 109790 109291 108899 108988 109380 109578 109429 109249
52950 109249 109314 109552 109773 109952 110115 110186 110096 109967 110038 110414 110958 111446 111777 112015 112213 112272 112080 111803 111812 112247 112780
52929 112780 113007 112968 113089 113635 114408 114995 115175 115060 114983 115233 115826 116530 117180 117871 118726 119618 120288 120659 120786
52910 120786 120595 119990 119220 118798 118935 119317 119588 119765 119999 120181 120104 119866 119784 119931 120020 119809 119403 119049 118800 118484
52890 118484 117942 117206 116457 115868 115501 115294 115155 115032 114941 114964 115175 115517 115755 115709 115495 115453 115748 116165 116384 116324
52870 116324 116118 115843 115432 114840 114159 113543 113102 112859 112756 112684 112559 112375 112159 111905 111573 111152 110671 110228 110006
52851 110006 110195 110791 111546 112170 112557 112728 112674 112377 111927 111492 111156 110886 110639 110399 110166 109978 109938 110101 110350
$$ packed form
52991A09153l93m69l75j16J32J82P4KL1J07K23L64L55N8l48n41m80l58k34J2L59
52970A07738N75N18L19J71J45K11K80K17J3j20n4lk20m99l92Q9L92J98j49j80
52950A09249O5K38K21J79J63P1r0j29P1L76N44M88L31K38J98N9j92k77RM35N33
52929A12780K27l9J21N46P73N87J80j15p7K50N93P04O50O91Q55Q92O70L71J27
52910A20786j91o05p70m22J37L82K71J77K34J82p7k38q2J47Q9k11m06l54k49l16
52890A18484n42p36p49n89l67k07j39j23r1K3K11L42K38m6k14m2K95M17K19o0
52870A16324k06k75m11n92o81o16m41k43j03p2j25j84k16k54l32m21m81m43k22
52851A10006J89N96P55O24L87J71n4k97m50m35l36k70k47k40k33j88m0J63K49
$$ plain form
52832 110350 110531 110661 110883 111274 111817 112515 113312 113941 114114 113921 113803 114007 114318 114439 114416 114467 114603 114708 114862
52813 114862 115254 115782 116052 115902 115733 116111 117151 118420 119422 120012 120348 120554 120599 120476 120337 120301 120218 119776 118865
52794 118865 117678 116428 115151 113868 112769 112041 111660 111464 111355 111281 111143 110891 110618 110339 109774 108625 107052
52777 107052 105625 104738 104264 103863 103404 102990 102725 102607 102582 102602 102655 102793 103080 103511 104034 104604 105098 105270 104990
52758 104990 104528 104384 104753 105351 105803 105967 105831 105394 104855 104671 105132 105972 106666 107030 107294 107674 108110 108427 108524
52739 108524 108360 107944 107389 106816 106193 105401 104473 103617 102958 102434 101992 101740 101818 102201 102724 103186 103414 103319 103011
52720 103011 102777 102855 103267 103900 104647 105389 105903 105971 105599 105027 104511 104131 103849 103655 103596 103672 103815 103950 104048 104079 104005
52699 104005 103861 103759 103757 103762 103677 103611 103805 104330 104957 105428 105769 106243 107015 107918 108606 108888 108920 109035 109395 109859 110263
$$ packed form
52832A10350J81J30K22L91N43O98P97O29J73j93j18K04L11J21k3N1J36J05J54
52813A14862L92N28K70j50j69L78J040J269J002N90L36K06M5j23j39l6q3m42r11
52794A18865j187j250j277j283j099p28l81j96j09p4j38k52k73k79n65j149j573
52777A07052j427q87m74m01m59m14k65j18k5K0N3J38K87M31N23N70M94J72k80
52758A04990m62j44L69N98M52J64j36m37n39j84M61Q40O94L64K64L80M36L17R7
52739A08524j64m16n55n73o23p92r28q56o59n24m42k52P8L83N23M62K28r5l08
52720A03011k34P8M12O33P47P42N14O8l72n72n16l80k82j94n9P6J43J35R8L1p4
52699A04005j44j02kNq5o6J94N25O27M71L41M74P72R03O88K82L2J15L60M64M04
$$ plain form
52678 110263 110703 111393 112287 113047 113460 113668 113903 114157 114270 114229 114238 114509 115065 115725 116188 116248 116013 115855 116038 116443
52658 116443 116722 116624 116127 115344 114473 113717 113126 112597 112105 111858 112080 112735 113556 114234 114486 114132 113311 112488 112017
52639 112017 111824 111668 111593 111779 112088 112131 111823 111524 111528 111719 111864 111968 112158 112398 112515 112424 112210 112016 111896 111770
52619 111770 111550 111349 111413 111745 111960 111742 111285 110981 110799 110441 109985 109876 110204 110534 110644 110892 111518 112091 112115
52600 112115 111846 111973 112705 113643 114458 115208 115999 116787 117605 118598 119770 120938 121981 122855 123332 123057 122036
52583 122036 120805 119950 119616 119557 119495 119282 118820 118089 117224 116496 116144 116242 116654 117143 117574 118003 118535 119182 119900
52564 119900 120688 121506 122198 122645 122957 123283 123470 123124 122092 120703 119464 118637 118169 117892 117684 117487 117283 117042
52546 117042 116699 116234 115758 115417 115201 114960 114631 114333 114217 114335 114665 115147 115639 115953 116022 115974 115998 116174 116442 116635
$$ packed form
52678A10263M40O90Q94P60M13K08K35K54J13m1RK71N56O60M63O0k35j58J83M05
52658A16443K79r8m97p83q71p56n91n29m92k47K22O55Q21O78K52l54q21q23m71
52639A12017j93j56p5J86L09M3l08k99MJ91J45J04J90K40J17r1k14j94j20j26
52619A11770k20k01O4L32K15k18m57l04j82l58m56j09L28L30J10K48O26N73K4
52600A12115k69J27P32R38Q15P50P91P88Q18R93J172J168J043Q74M77k75j021
52583A22036j231q55l34n9o2k13m62p31q65p28l52R8M12M89M31M29N32O47P18
52564A19900P88Q18O92M47L12L26J87l46j032j389j239q27m68k77k08j97k04k41
52546A17042l43m65m76l41k16k41l29k98j16J18L30M82M92L14O9m8K4J76K68J93
$$ plain form
52526 116635 116551 116124 115600 115440 115945 117018 118304 119463 120256 120528 120286 119783 119387 119297 119419 119520 119457 119248 118964
52507 118964 118590 118053 117425 116996 117030 117438 117807 117832 117618 117493 117592 117750 117774 117679 117624 117686 117786 117790 117630 117330 116939 116481
52485 116481 115982 115515 115189 115093 115264 115686 116298 116966 117512 117802 117818 117669 117493 117412 117513 117848 118365 118879 119186 119280
52465 119280 119363 119598 119896 120046 119987 119840 119700 119542 119315 119019 118663 118312 118187 118547 119391 120421 121359 122153 122828
52446 122828 123336 123711 124219 125135 126434 127832 129040 129871 130224 130134 129755 129151 128210 126922 125577 124485 123601
52429 123601 122693 121743 120987 120571 120504 120828 121537 122321 122747 122710 122453 122142 121777 121547 121840 122726 123796 124693 125472
52410 125472 126199 126555 126217 125402 124672 124353 124441 124945 125920 127190 128410 129459 130523 131714 132840 133595 133833
52393 133833 133597 133023 132270 131427 130506 129588 128903 128602 128463 128078 127314 126443 125768 125299 124887 124462 124065 123756 123623
$$ packed form
52526A16635q4m27n24j60N05J073J286J159P93K72k42n03l96r0J22J01o3k09k84
52507A18964l74n37o28m29L4M08L69K5k14j25R9J58K4r5n5O2J00Mj60l00l91m58
52485A16481m99m67l26r6J71M22O12O68N46K90J6j49j76q1J01L35N17N14L07R4
52465A19280Q3K35K98J50n9j47j40j58k27k96l56l51j25L60Q44J030R38P94O75
52446A22828N08L75N08R16J299J398J208Q31L53r0l79o04r41j288j345j092q84
52429A23601r08r50p56m16o7L24P09P84M26l7k57l11l65k30K93Q86J070Q97P79
52410A25472P27L56l38q15p30l19Q8N04R75J270J220J049J064J191J126P55K38
52393A33833k36n74p53q43r21r18o85l01j39l85p64q71o75m69m12m25l97l09j33
$$ plain form
52374 123623 123749 124070 124333 124305 124001 123632 123360 123175 122964 122689 122516 122755 123592 124850 126064 126877 127292 127552
52356 127552 127856 128268 128822 129588 130593 131759 132955 134125 135313 136575 137897 139224 140563 141977 143498
52341 143498 145123 146918 148994 151215 153013 153687 152967 151233 149156 147236 145716 144669 143997 143381 142498
52326 142498 141379 140434 140006 140004 140009 139745 139306 138981 138955 139251 139819 140609 141557 142587 143652 144748 145901 147120
52308 147120 148363 149531 150549 151480 152523 153802 155184 156354 157104 157475 157673 157859 158041 158101 157962 157772 157890
52291 157890 158549 159566 160496 161119 161675 162569 163943 165582 167171 168575 169926 171445 173155 174765 175936
52276 175936 176664 177325 178358 180031 182398 185287 188280 190999 193530 196383 199928 204080 208613 213494 218655
52261 218655 223791 228740 233898 239806 246390 253040 259437 265834 272431 278955 285144 291263 297768 304627
$$ packed form
52374A23623J26L21K63k8l04l69k72j85k11k75j73K39Q37J258J214Q13M15K60
52356A27552L04M12N54P66J005J166J196J170J188J262J322J327J339J414J521
52341A43498J625J795K076K221J798O74p20j734k077j920j520j047o72o16q83
52326A42498j119r45m28kNk64m39l25k6K96N68P90R48J030J065J096J153J219
52308A47120J243J168J018R31J043J279J382J170P50L71J98J86J82O0j39j90J18
52291A57890O59J017R30O23N56Q94J374J639J589J404J351J519J710J610J171
52276A75936P28O61J033J673K367K889K993K719K531K853L545M152M533M881N161
52261B18655N136M949N158N908O584O650O397O397O597O524O189O119O505O859
$$ plain form
52247 304627 311368 317740 323993 330489 337305 344279 351268 358231 365176 372089 378886 385447 391737 397826
52233 397826 403688 409006 413365 416643 419069 420879 422089 422684 422843 422827 422723 422500 422216 422011 421861 421549 420954
52216 420954 420237 419653 419269 418980 418737 418577 418502 418464 418529 418966 420106 422121 424901 428091 431305 434429 437716
52199 437716 441482 445704 450057 454359 458790 463600 468781 474114 479404 484530 489398 494062 498759 503640
52185 503640 508466 512738 516105 518561 520319 521672 522882 523944 524472 524043 522700 520893 518890 516488 513391
52170 513391 509665 505678 501775 498155 494875 491803 488713 485590 482717 480294 478112 475844 473543 471569
52156 471569 470076 468823 467547 466258 465131 464280 463741 463498 463467 463621 464152 465311 466982 468650 469963 471153
52140 471153 472638 474383 475958 477186 478368 479815 481439 483005 484544 486247 488077 489793 491293 492701
$$ packed form
52247C04627O741O372O253O496O816O974O989O963O945O913O797O561O290O089
52233C97826N862N318M359L278K426J810J210N95J59j6j04k23k84k05j50l12n95
52216D20954p17n84l84k89k43j60p5l8O5M37J140K015K780L190L214L124L287
52199D37716L766M222M353M302M431M810N181N333N290N126M868M664M697M881
52185E03640M826M272L367K456J758J353J210J062N28m29j343j807k003k402l097
52170E13391l726l987l903l620l280l072l090l123k873k423k182k268k301j974
52156D71569j493j253j276j289j127q51n39k43l1J54N31J159J671J668J313J190
52140D71153J485J745J575J228J182J447J624J566J539J703J830J716J500J408
$$ plain form
52126 492701 494058 495193 495978 496524 496949 497143 496905 496226 495180 493650 491421 488616 485755 483245 481008 478757
52110 478757 476478 474443 472824 471534 470383 469243 468075 467012 466358 466263 466348 465962 464967 464054 464051 465056 466470
52093 466470 467720 468673 469420 470032 470605 471241 471832 472056 471787 471355 471262 471725 472634 473794 475018 476085 476851 477416
52075 477416 478023 478785 479633 480479 481274 481949 482511 483232 484568 486823 489986 493881 498311 503076 508049 513305
52059 513305 519033 525308 532106 539535 547765 556639 565601 574201 582490 590728 598930 606910 614617 622127
52045 622127 629359 636111 642349 648234 653878 659273 664455 669499 674296 678523 681923 684488 686332 687514
52031 687514 687986 687624 686277 683910 680711 676934 672729 668223 663662 659196 654592 649517 644193 639381 635569
52016 635569 632413 629218 625763 622389 619489 617230 615690 614895 614694 614832 615263 616205 617828 620009 622483
$$ packed form
52126D92701J357J135P85N46M25J94k38o79j046j530k229k805k861k510k237k251
52110D78757k279k035j619j290j151j140j168j063o54r5Q5l86r95r13lJ005J414
52093D66470J250R53P47O12N73O36N91K24k69m32r3M63R09J160J224J067P66N65
52075D77416O07P62Q48Q46P95O75N62P21J336K255L163L895M430M765M973N256
52059E13305N728O275O798P429Q230Q874Q962Q600Q289Q238Q202P980P707P510
52045F22127P232O752O238N885N644N395N182N044M797M227L400K565J844J182
52031F87514M72l62j347k367l199l777m205m506m561m466m604n075n324m812l812
52016F35569l156l195l455l374k900k259j540p95k01J38M31R42J623K181K474
$$ plain form
52001 622483 625168 628183 631606 635297 639014 642717 646650 651032 655714 660265 664413 668209 671718 674744
51987 674744 677020 678496 679261 679274 678393 676589 673945 670487 666242 661445 656480 651540 646533 641338 635962
51972 635962 630386 624499 618345 612263 606625 601485 596599 591659 586408 580663 574443 568019 561698 555570
51958 555570 549595 543884 538669 533977 529471 524742 519675 514484 509452 504687 500039 495179 489813 483924
51944 483924 477791 471667 465459 458810 451493 443666 435739 428096 420964 414401 408213 401972 395253 387972
51930 387972 380436 373052 366066 359565 353551 347899 342352 336734 331135 325753 320532 315130 309265 302973
51916 302973 296475 289973 283706 278052 273341 269532 266249 263188 260410 258208 256779 256082 255897 255974 256186
51901 256186 256623 257475 258741 260122 261243 261968 262358 262398 261925 260911 259677 258694 258181 258008 258009 258295 259165 260762
$$ packed form
52001F22483K685L015L423L691L717L703L933M382M682M551M148L796L509L026
51987F74744K276J476P65J3q81j804k644l458m245m797m965m940n007n195n376
51972F35962n576n887o154o082n638n140m886m940n251n745o220o424o321o128
51958E55570n975n711n215m692m506m729n067n191n032m765m648m860n366n889
51944D83924o133o124o208o649p317p827p927p643p132o563o188o241o719p281
51930C87972p536p384o986o501o014n652n547n618n599n382n221n402n865o292
51916C02973o498o502o267n654m711l809l283l061k778k202j429o97j85P7K12
51901B56186M37Q52J266J381J121P25L90M0m73j014j234r83n13j73JK86Q70J597
$$ plain form
51883 260762 262932 265466 268376 271862 276048 280888 286313 292370 299143 306634 314741 323247 331746 339670
51869 339670 346423 351405 353908 353312 349621 343664 336456 328395 319352 309435 299260 289429 280184 271741
51855 271741 264471 258382 252761 246819 240593 234776 229795 225487 221728 218829 217083 216297 216025 216044 216349
51840 216349 216850 217353 217787 218219 218641 218889 218705 217820 216034 213426 210425 207511 204845 202288 199788 197581
51824 197581 195977 195037 194570 194370 194391 194686 195257 195990 196754 197527 198429 199672 201471 203919 206819 209669 211943
51807 211943 213443 214292 214632 214463 213822 212929 211989 210954 209656 208165 206872 206174 206131 206470 206831 206981 206857
51790 206857 206475 205836 204943 203832 202527 200975 199120 197072 195095 193372 191838 190318 188751 187159 185508
51775 185508 183745 182005 180611 179776 179371 179073 178701 178322 178060 177907 177819 177861 178129 178547 178881 179014 179076 179229 179398
$$ packed form
51883B60762K170K534K910L486M186M840N425O057O773P491Q107Q506Q499P924
51869C39670O753M982K503n96l691n957p208q061r043r917j0175r831r245q443
51855B71741p270o089n621n942o226n817m981m308l759k899j746p86k72J9L05
51840B16349N01N03M34M32M22K48j84q85j786k608l001k914k666k557k500k207
51824A97581j604r40m67k00K1K95N71P33P64P73R02J243J799K448K900K850K274
51807B11943J500Q49L40j69o41q93r40j035j298j491j293o98m3L39L61J50j24
51790B06857l82o39q93j111j305j552j855k048j977j723j534j520j567j592j651
51775A85508j763j740j394q35m05k98l72l79k62j53q8M2K68M18L34J33O2J53J69
$$ plain form
51756 179398 179356 179027 178612 178454 178809 179699 180823 181689 182020 182025 182132 182459 182724 182656 182334 182009 181807 181694 181625 181609
51736 181609 181686 181897 182224 182529 182662 182627 182531 182342 181874 181052 180067 179225 178748 178757 179220 179869 180344 180540 180678 180936
51716 180936 181224 181409 181572 181901 182476 183329 184515 185981 187520 189023 190628 192453 194375 196262 198202 200238
51700 200238 202081 203448 204528 205698 206779 207018 205933 203846 201457 199105 196692 194170 191847 190076
51686 190076 188786 187474 185795 184064 182905 182435 182093 181433 180723 180489 180820 181509 182619 184417 186807 189320
51670 189320 191668 193869 195807 197121 197690 197871 198118 198638 199471 200573 201723 202671 203477 204351 205088 205071 204023
51653 204023 202391 200805 199528 198623 198166 197957 197379 196010 194145 192354 190779 189294 188113 187669 187971 188538
51637 188538 188992 189314 189499 189362 188817 188017 187117 186185 185470 185414 186170 187242 187847 187570 186560 185228 183933 182886
$$ packed form
51756A79398m2l29m15j58L55Q90J124Q66L31NJ07L27K65o8l22l25k02j13o9j6
51736A81609P7K11L27L05J33l5r6j89m68q22r85q42m77RM63O49M75J96J38K58
51716A80936K88J85J63L29N75Q53J186J466J539J503J605J825J922J887J940K036
51700B00238J843J367J080J170J081K39j085k087k389k352k413k522k323j771
51686A90076j290j312j679j731j159m70l42o60p10k34L31O89J110J798K390K513
51670A89320K348K201J938J314N69J81K47N20Q33J102J150R48Q06Q74P37j7j048
51653B04023j632j586j277r05m57k09n78j369j865j791j575j485j181m44L02N67
51637A88538M54L22J85j37n45q00r00r32p15n6P56J072O05k77j010j332j295j047
$$ plain form
51619 182886 182148 181615 181086 180458 179879 179648 179947 180698 181719 182925 184281 185639 186860 188089 189703 191893
51603 191893 194466 197141 199838 202536 205015 206919 207976 208050 207135 205444 203380 201233 199046 196894 195116
51588 195116 194055 193727 193979 194782 196067 197367 198039 197849 197048 195837 194125 191963 189892 188564 188097 187958
51572 187958 187445 186231 184497 182682 181134 179922 178905 177896 176782 175613 174632 174062 173781 173321 172338 170967
51556 170967 169575 168337 167211 166190 165307 164503 163744 163219 163147 163411 163667 163802 164026 164491 165084 165658 166194 166689
51538 166689 167101 167534 168244 169394 170976 173040 175782 179298 183374 187567 191327 194084 195461 195557 194827 193674
51522 193674 192352 191229 190780 191161 192070 193215 194657 196517 198682 201080 203971 207603 211721 215782 219604
51507 219604 223479 227629 231882 235961 239816 243578 247306 250981 254662 258580 263021 268179 274145 281022
$$ packed form
51619A82886p38n33n29o28n79k31K99P51J021J206J356J358J221J229J614K190
51603A91893K573K675K697K698K479J904J057P4r15j691k064k147k187k152j778
51588A95116j061l28K52Q03J285J300O72j90q01j211j712k162k071j328m67j39
51572A87958n13j214j734j815j548j212j017j009j114j169r81n70k81m60r83j371
51556A70967j392j238j126j021q83q04p59n25p2K64K56J35K24M65N93N74N36M95
51538A66689M12M33P10J150J582K064K742L516M076M193L760K757J377R6p30j153
51522A93674j322j123m49L81R09J145J442J860K165K398K891L632M118M061L822
51507B19604L875M150M253M079L855L762L728L675L681L918M441N158N966O877
$$ plain form
51493 281022 288917 297643 306453 314319 320624 325442 329071 331460 332271 331320 328758 324896 320035 314428 308211
51478 308211 301412 294164 286877 280044 273905 268411 263438 258858 254469 250075 245651 241282 236927 232433
51464 232433 227837 223455 219609 216335 213409 210555 207562 204294 200724 196990 193412 190349 187942 185981
51450 185981 184121 182295 180802 179944 179649 179565 179361 178834 177843 176431 174948 173871 173413 173442 173706 174020 174251
51433 174251 174376 174543 174926 175438 175774 175781 175627 175530 175489 175394 175250 175141 175030 174734 174091 173100 171924 170802 169938 169421
51413 169421 169202 169115 168922 168439 167671 166766 165769 164544 163073 161691 160751 160144 159438 158500 157679 157245 156982 156511
51395 156511 155816 155202 154921 155074 155741 156895 158219 159308 160123 161022 162316 163979 165874 168009 170453 173174
51379 173174 176177 179675 183867 188464 192690 195859 197919 199350 200612 201797 202686 202954 202291 200551 197934
$$ packed form
51493B81022P895Q726Q810P866O305M818L629K389Q11r51k562l862m861n607o217
51478C08211o799p248p287o833o139n494m973m580m389m394m424m369m355m494
51464B32433m596m382l846l274k926k854k993l268l570l734l578l063k407j961
51450A85981j860j826j493q58k95q4k04n27r91j412j483j077m58K9K64L14K31
51433A74251J25J67L83N12L36Pj54r7m1r5j44j09j11k96o43r91j176j122q64n17
51413A69421k19q7j93m83p68r05r97j225j471j382r40o07p06r38q21m34k63m71
51395A56511o95o14k81J53O67J154J324J089Q15Q99J294J663J895K135K444K721
51379A73174L003L498M192M597M226L169K060J431J262J185Q89K68o63j740k617
$$ plain form
51364 197934 194911 191861 188839 185804 182926 180463 178423 176571 174793 173234 172034 171166 170567 170231 170042
51349 170042 169770 169404 169335 169933 171090 172376 173534 174580 175496 176181 176756 177623 179085 181074 183326 185643
51333 185643 187877 189898 191801 193988 196809 200122 203411 206328 209024 211988 215696 220380 225960 232138
51319 232138 238695 245764 253718 262729 272536 282761 293339 304496 316279 328208 339416 349058 356574
51306 356574 361687 364329 364584 362614 358568 352595 344935 335903 325757 314655 302843 290801 279042
51293 279042 267792 256994 246640 236918 227999 219848 212397 205730 199966 195058 190874 187372 184501
51280 184501 182021 179675 177560 176071 175368 175130 174887 174422 173700 172650 171232 169621 168088 166753 165593
51265 165593 164656 164030 163641 163256 162724 162068 161348 160582 159852 159333 159141 159189 159255 159162 158905 158665 158707 159149 159834 160456
$$ packed form
51364A97934l023l050l022l035k878k463k040j852j778j559j200q68n99l36j89
51349A70042k72l66o9N98J157J286J158J046R16O85N75Q67J462J989K252K317
51333A85643K234K021J903K187K821L313L289K917K696K964L708M684N580O178
51319B32138O557P069P954R011R807J0225J0578J1157J1783J1929J1208R642P516
51306C56574N113K642K55j970m046n973p660r032j0146j1102j1812j2042j1759
51293B79042j1250j0798j0354r722q919q151p451o667n764m908m184l502k871
51280A84501k480k346k115j489p03k38k43m65p22j050j418j611j533j335j160
51265A65593r37o26l89l85n32o56p20p66p30n19j92M8O6r3k57k40M2M42O85O22
$$ plain form
51245 160456 160784 160690 160075 158984 157752 156838 156444 156396 156422 156370 156196 155935 155778 155956 156444 156933 157234 157482 157852
51226 157852 158237 158431 158472 158585 158886 159350 160053 161203 162887 164910 166950 168773 170341 171797 173285 174733
51210 174733 175864 176537 176942 177324 177616 177575 177194 176732 176303 175774 175134 174721 174848 175314 175485 174862 173483 171792
51192 171792 170239 169024 168168 167690 167619 167794 167847 167492 166809 166077 165396 164654 163813 163039 162475 162025 161483 160794 160150
51173 160150 159861 160147 160892 161636 161926 161711 161307 161001 160849 160843 161030 161354 161596 161632 161618 161765 162058 162317 162454 162493
51153 162493 162421 162202 161932 161861 162241 163167 164509 165911 166984 167625 168134 168917 170102 171495 172828 173969 174922
51136 174922 175742 176452 176971 177156 176941 176392 175594 174622 173652 172946 172613 172546 172710 173312 174407 175524 176014 175792
51118 175792 175399 175284 175329 175205 174892 174637 174545 174495 174407 174324 174241 174005 173489 172783 172151 171843 171947 172334 172720 172840 172671
$$ packed form
51245A60456L28r4o15j091j232r14l94m8K6n2j74k61j57J78M88M89L01K48L70
51226A57852L85J94M1J13L01M64P03J150J684K023K040J823J568J456J488J448
51210A74733J131O73M05L82K92m1l81m62m29n29o40m13J27M66J71o23j379j691
51192A71792j553j215q56m78p1J75N3l55o83p32o81p42q41p74n64m50n42o89o44
51173A60150k89K86P45P44K90k15m04l06j52oJ87L24K42L6j4J47K93K59J37L9
51153A62493p2k19k70p1L80R26J342J402J073O41N09P83J185J393J333J141R53
51136A74922Q20P10N19J85k15n49p98r72r70p06l33o7J64O02J095J117M90k22
51118A75792l93j15M5j24l13k55r2n0q8q3q3k36n16p06o32l08J04L87L86J20j69
$$ plain form
51097 172671 172506 172693 173242 173725 173702 173207 172733 172676 172941 173165 173186 173137 173147 173157 173076 172933 172793 172653 172488 172338 172251
51076 172251 172178 172005 171703 171392 171278 171499 172026 172649 173076 173061 172557 171816 171323 171461 172186 173115 173999 174941 176048
51057 176048 177061 177639 177893 178320 179178 180211 181092 181803 182427 182876 183106 183413 184163 185252 186159 186561 186667 186901
51039 186901 187442 188169 188880 189464 189959 190575 191530 192746 193760 194105 193772 193201 192814 192660 192569 192484 192528 192782 193195
51020 193195 193756 194592 195710 196758 197265 197177 196992 197239 197977 198899 199830 200897 202246 203790 205323 206760 208193
51003 208193 209809 211813 214347 217399 220829 224565 228751 233594 239083 244935 250803 256446 261641 266062
50989 266062 269430 271853 273931 276384 279484 282817 285618 287353 288023 287978 287480 286521 285005 282989 280656
50974 280656 278089 275243 272182 269225 266726 264772 263164 261585 259659 256973 253373 249343 245836 243551
$$ packed form
51097A72671j65J87N49M83k3m95m74n7K65K24K1m9J0J0q1j43j40j40j65j50q7
51076A72251p3j73l02l11j14K21N27O23M27j5n04p41m93J38P25R29Q84R42J107
51057A76048J013N78K54M27Q58J033Q81P11O24M49K30L07P50J089R07M02J06K34
51039A86901N41P27P11N84M95O16R55J216J014L45l33n71l87j54r1q5M4K54M13
51020A93195N61Q36J118J048N07q8j85K47P38R22R31J067J349J544J533J437J433
51003B08193J616K004K534L052L430L736M186M843N489N852N868N643N195M421
50989B66062L368K423K078K453L100L333K801J735O70m5m98r59j516k016k333
50974B80656k567k846l061k957k499j954j608j579j926k686l600m030l507k285
$$ plain form
50960 243551 242427 241954 241808 241994 242541 243359 244486 246159 248502 251301 254247 257319 260737 264554 268499
50945 268499 272257 275764 279164 282502 285592 288196 290282 292076 293854 295680 297342 298547 299197 299483 299696
50930 299696 300030 300601 301613 303318 305785 308833 312277 316100 320312 324790 329522 334869 341320 348929 357241
50915 357241 365791 374412 383014 391438 399752 408425 417911 428240 439269 451151 464230 478610 494236
50902 494236 511297 530087 550409 571506 592787 614268 636191 658525 681033 703492 725510
50891 725510 746372 765396 782380 797506 810948 822828 833336 842578 850342 856339 860655 863764
50879 863764 866134 868056 869770 871381 872582 872755 871492 868862 865122 860386 854685 848129 840827 832744
50865 832744 823727 813572 802022 788832 773958 757610 740030 721323 701618 681291 660928 641059
$$ packed form
50960B43551j124m73j46J86N47Q18J127J673K343K799K946L072L418L817L945
50945B68499L758L507L400L338L090K604K086J794J778J826J662J205O50K86K13
50930B99696L34N71J012J705K467L048L444L823M212M478M732N347O451P609Q312
50915C57241Q550Q621Q602Q424Q314Q673R486J0329J1029J1882J3079J4380J5626
50902D94236J7061J8790K0322K1097K1281K1481K1923K2334K2508K2459K2018
50891G25510K0862J9024J6984J5126J3442J1880J0508R242P764N997M316L109
50879H63764K370J922J714J611J201J73j263k630l740m736n701o556p302q083
50865H32744r017j0155j1550j3190j4874j6348j7580j8707j9705k0327k0363j9869
$$ plain form
50853 641059 621950 603613 585982 569116 553225 538442 524680 511793 499786 488682 478269
50842 478269 468273 458780 450155 442495 435511 429075 423513 419044 415276 411664 408300 405811 404514 404022
50828 404022 403729 403340 402885 402502 402387 402725 403551 404743 406225 408033 410176 412610 415402 418756 422763 427288
50812 427288 432193 437524 443387 449713 456334 463232 470648 478898 488116 498166 508823 520057 532117
50799 532117 545289 559639 575084 591631 609397 628482 649039 671432 696068 723006 752017
50788 752017 783117 816799 853538 893233 935371 979557 1025619 1073278 1122035 1171461 1221356
50777 1221356 1271447 1321034 1369040 1414375 1456204 1493864 1526674 1553984 1575516 1591611 1602929
50766 1602929 1609861 1612415 1610789 1605938 1599347 1592243 1585190 1578451 1572476 1567868 1564881 1563118 1561699 1559610
$$ packed form
50853F41059j9109j8337j7631j6866j5891j4783j3762j2887j2007j1104j0413
50842D78269r996r493q625p660o984o436n562m469l768l612l364k489j297m92
50828D04022k93l89m55l83j15L38Q26J192J482J808K143K434K792L354M007M525
50812D27288M905N331N863O326O621O898P416Q250R218J0050J0657J1234J2060
50799E32117J3172J4350J5445J6547J7766J9085K0557K2393K4636K6938K9011
50788G52017L1100L3682L6739L9695M2138M4186M6062M7659M8757M9426M9895
50777A221356N0091M9587M8006M5335M1829L7660L2810K7310K1532J6095J1318
50766A602929O932K554j626m851o591p104p053o739n975m608k987j763j419k089
$$ plain form
50752 1559610 1555874 1549542 1539741 1525814 1507384 1484288 1456539 1424428 1388546 1349540 1307858 1263859
50740 1263859 1218116 1171495 1124962 1079471 1036022 995553 958597 925115 894735 867135 842189
50729 842189 819957 800623 784317 770856 759788 750730 743512 737890 733332 729362 725957 723342 721405
50716 721405 719635 717642 715469 713240 710725 707471 703318 698579 693654 688521 682732 675897 668133 659921
50702 659921 651615 643208 634628 626000 617534 609281 601190 593314 585816 578832 572480 566956 562507 559363
50688 559363 557736 557728 559153 561593 564868 569293 575251 582653 591085 600406 610908 622936 636664 652167
50674 652167 669347 687784 707048 727234 748815 771866 795827 820202 845038 870468 896180
50663 896180 921744 947148 972508 997379 1020835 1042247 1061601 1079012 1094219 1106638 1115649 1120768
$$ packed form
50752A559610l736o332r801j3927j8430k3096k7749l2111l5882l9006m1682m3999
50740A263859m5743m6621m6533m5491m3449m0469l6956l3482l0380k7600k4946
50729H42189k2232j9334j6306j3461j1068r058p218n622m558l970l405k615j937
50716G21405j770j993k173k229k515l254m153m739m925n133n789o835p764q212
50702F59921q306q407q580q628q466q253q091p876p498o984o352n524m449l144
50688E59363j627qJ425K440L275M425N958P402Q432R321J0502J2028J3728J5503
50674F52167J7180J8437J9264K0186K1581K3051K3961K4375K4836K5430K5712
50663H96180K5564K5404K5360K4871K3456K1412J9354J7411J5207J2419R011N119
$$ plain form
50651 1120768 1121794 1118985 1113025 1104764 1095054 1084740 1074545 1064931 1056204 1048727 1042877 1038748 1036097
50638 1036097 1034626 1034111 1034194 1034194 1033252 1030559 1025430 1017363 1006198 992113 975423 956466 935755 914067
50624 914067 892158 870477 849303 829114 810649 794534 780919 769538 760110 752682 747590 745069
50612 745069 744935 746753 750348 756010 764081 774439 786468 799474 812992 826768 840625 854372 867733
50599 867733 880379 892155 903260 914049 924630 934819 944500 953796 962752 971113 978653 985570 992299
50586 992299 999002 1005532 1011882 1018359 1025256 1032684 1040808 1049928 1060085 1070899 1082096 1094025 1107262
50573 1107262 1121808 1137020 1152286 1167387 1182106 1195940 1208430 1219495 1229233 1237628 1244707 1250781
50561 1250781 1256098 1260222 1261993 1260228 1254422 1244950 1232852 1219462 1205990 1193226 1181620 1171540
$$ packed form
50651A120768J026k809n960q261r710j0314j0195r614q727p477n850m129k651
50638A036097j471n15Q3%r42k693n129q067j1165j4085j6690j8957k0711k1688
50624I14067k1909k1681k1174k0189j8465j6115j3615j1381r428p428n092k521
50612G45069j34J818L595N662Q071J0358J2029J3006J3518J3776J3857J3747J3361
50599H67733J2646J1776J1105J0789J0581J0189R681R296Q956Q361P540O917O729
50586I92299O703O530O350O477O897P428Q124R120J0157J0814J1197J1929J3237
50573A107262J4546J5212J5266J5101J4719J3834J2490J1065R738Q395P079O074
50561A250781N317M124J771j765n806r472j2098j3390j3472j2764j1606j0080
$$ plain form
50549 1171540 1163292 1156872 1151882 1147830 1144434 1141556 1138939 1136129 1132577 1127733 1121038 1111976 1100195 1085568
50535 1085568 1068126 1047970 1025312 1000573 974321 947056 919076 890665 862346 834809 808540
50524 808540 783603 759911 737582 716892 697956 680679 665058 651313 639572 629558 620797 613128
50512 613128 606873 602413 599771 598685 598975 600627 603564 607482 612089 617362 623527 630822 639363 649086
50498 649086 659696 670759 682075 693945 706891 721077 736141 751635 767467 783846 800950
50487 800950 818742 836967 855285 873538 891975 911020 930665 950298 969355 988083 1007421
50476 1007421 1028192 1050611 1074504 1099735 1126291 1154171 1183364 1213916 1245929 1279493 1314617
50465 1314617 1351231 1389301 1428986 1470555 1514057 1559079 1604888 1650726 1695897 1739707 1781479
$$ packed form
50549A171540q248o420m990m052l396k878k617k810l552m844o695r062j1781j4627
50535A085568j7442k0156k2658k4739k6252k7265k7980k8411k8319k7537k6269
50524H08540k4937k3692k2329k0690j8936j7277j5621j3745j1741j0014q761p669
50512F13128o255m460k642j086K90J652K937L918M607N273O165P295Q541R723
50498F49086J0610J1063J1316J1870J2946J4186J5064J5494J5832J6379J7104
50487H00950J7792J8225J8318J8253J8437J9045J9645J9633J9057J8728J9338
50476A007421K0771K2419K3893K5231K6556K7880K9193L0552L2013L3564L5124
50465A314617L6614L8070L9685M1569M3502M5022M5809M5838M5171M3810M1772
$$ [...]
##END NTUPLES=NMR SPECTRUM
##END=
