
##TITLE=UV1147_M6-1005-1000_6279012_ruyhNrGdiu
##JCAMPDX= 6.0         $$ Bruker NMR JCAMP-DX V2.0
##DATA TYPE= NMR SPECTRUM
##DATA CLASS= NTUPLES
##ORIGIN= BRUKER
##OWNER= Administrator
$$ 1.72 TOPSPIN		Version 2.1
$$ 2012-06-03 11:09:55.671 -0500  Administrator@TOPSPIN
$$ Compression mode = diff/dup
##.OBSERVE FREQUENCY= 400.13188235
##.OBSERVE NUCLEUS= ^1H
##.ACQUISITION MODE= SIMULTANEOUS (DQD)
##.ACQUISITION SCHEME= undefined
##.AVERAGES= 8
##.DIGITISER RES= 22
##SPECTROMETER/DATA SYSTEM= spect
##.PULSE SEQUENCE= zg30
##.SOLVENT NAME= COFFEE_meoh
##.SHIFT REFERENCE= INTERNAL, COFFEE_meoh, 1, 14.98061
##AUDIT TRAIL= $$ (NUMBER, WHEN, WHO, WHERE, PROCESS, VERSION, WHAT)
$$ ##TITLE= Audit trail, TOPSPIN		Version 2.1
$$ ##JCAMPDX= 5.01
$$ ##ORIGIN= Bruker BioSpin GmbH
$$ ##OWNER= Administrator
$$ $$ C:\Bruker\TOPSPIN/data/COFFEE/nmr/UV1147_M6-1005-1000_6279012_ruyhNrGdiu/10/pdata/1/auditp.txt
$$ ##AUDIT TRAIL=  $$ (NUMBER, WHEN, WHO, WHERE, PROCESS, VERSION, WHAT)
(   1,<2012-06-03 11:09:48.343 -0500>,<Administrator>,<TOPSPIN>,<go>,<TOPSPIN 2.1>,
      <created by zg
	started at 2012-06-03 11:08:41.828 -0500,
	POWCHK enabled, PULCHK disabled,
       configuration hash MD5:
       D5 CA 7A 23 FE 6B EE E2 50 67 74 61 24 F7 5E 3B
       data hash MD5: 64K
       C9 19 46 45 94 0D EF D2 85 8F 7A 2A 1D 7C 4B 80>)
(   2,<2012-06-03 11:09:51.328 -0500>,<Administrator>,<TOPSPIN>,<proc1d>,<TOPSPIN 2.1>,
      <Start of raw data processing
       efp LB = 0 FT_mod = 6 PKNL = 1 PHC0 = 0 PHC1 = 0 SI = 32K 
       data hash MD5: 32K
       D5 A9 18 DA 3F 38 12 0A B0 93 83 E5 FA 58 4D 2C>)
(   3,<2012-06-03 11:09:51.718 -0500>,<Administrator>,<TOPSPIN>,<proc1d>,<TOPSPIN 2.1>,
      <pk PHC0 = 207.724 PHC1 = 0 
       data hash MD5: 32K
       B7 F8 8C 94 99 26 32 00 FB 3F C2 78 FF D2 23 EE>)
(   4,<2012-06-03 11:09:51.781 -0500>,<Administrator>,<TOPSPIN>,<proc1d>,<TOPSPIN 2.1>,
      <abs ABSG = 1 
       data hash MD5: 32K
       94 F4 EF 4D 88 B7 71 80 A0 E4 04 E7 11 C9 71 C3>)
(   5,<2012-06-03 11:09:51.796 -0500>,<Administrator>,<TOPSPIN>,<proc1d>,<TOPSPIN 2.1>,
      <abs ABSG = 2 
       data hash MD5: 32K
       6D 68 FF F3 5E CB 38 64 89 72 92 B0 AC 3D 46 89>)
(   6,<2012-06-03 11:09:51.828 -0500>,<Administrator>,<TOPSPIN>,<proc1d>,<TOPSPIN 2.1>,
      <abs ABSG = 3 
       data hash MD5: 32K
       D6 C7 10 8A 2A 0D F4 5A 87 39 EE 70 BE A6 94 5F>)
(   7,<2012-06-03 11:09:51.890 -0500>,<Administrator>,<TOPSPIN>,<proc1d>,<TOPSPIN 2.1>,
      <abs ABSG = 4 
       data hash MD5: 32K
       90 2C 31 00 57 8F 61 EE E6 3A 35 59 95 D8 32 82>)
(   8,<2012-06-03 11:09:51.921 -0500>,<Administrator>,<TOPSPIN>,<proc1d>,<TOPSPIN 2.1>,
      <abs ABSG = 5 
       data hash MD5: 32K
       F0 22 57 FA 1C 2C 21 03 7F C2 09 3E 0A E0 D1 EC>)
$$ ##END=
$$ 
$$ $$ hash MD5
$$ $$ 56 13 6A FF 38 18 C6 73 1B B7 4F A5 0E 89 B6 81
##$RELAX= 
##$RELAX= 
##$RELAX= 
##$RELAX= 
##$RELAX= 
##$RELAX= 
##$RELAX= 
$$ Bruker specific parameters
$$ --------------------------
$$ [...]
##$TP= (0..7)
150 150 150 150 150 150 150 150
##$TP07= 0
##$TPNAME0= <>
##$TPNAME1= <>
##$TPNAME2= <>
##$TPNAME3= <>
##$TPNAME4= <>
##$TPNAME5= <>
##$TPNAME6= <>
##$TPNAME7= <>
##$TPOAL= (0..7)
0.5 0.5 0.5 0.5 0.5 0.5 0.5 0.5
##$TPOFFS= (0..7)
0 0 0 0 0 0 0 0
##$TUNHIN= 0
##$TUNHOUT= 0
##$TUNXOUT= 0
##$USERA1= <user>
##$USERA2= <user>
##$USERA3= <user>
##$USERA4= <user>
##$USERA5= <user>
##$V9= 5
##$VALIST= <valist>
##$VCLIST= <CCCCCCCCCCCCCCC>
##$VD= 0
##$VDLIST= <DDDDDDDDDDDDDDD>
##$VPLIST= <PPPPPPPPPPPPPPP>
##$VTLIST= <TTTTTTTTTTTTTTT>
##$WBST= 2048
##$WBSW= 25
##$XGAIN= (0..3)
0 0 0 0
##$XL= 0
##$YL= 0
##$YMAX_a= 532263
##$YMIN_a= -658239
##$ZGOPTNS= <>
##$ZL1= 120
##$ZL2= 120
##$ZL3= 120
##$ZL4= 120
##$ABSF1= 14.98061
##$ABSF2= -5.57192
##$ABSG= 5
##$ABSL= 3
##$ALPHA= 0
##$AQORDER= 0
##$ASSFAC= 0
##$ASSFACI= 0
##$ASSFACX= 0
##$ASSWID= 0
##$AUNMP= <proc_prof1d_extract_pilot.lims>
##$AXLEFT= 0
##$AXNAME= <>
##$AXNUC= <1H>
##$AXRIGHT= 0
##$AXTYPE= 0
##$AXUNIT= <>
##$AZFE= 0.1
##$AZFW= 0.1
##$BCFW= 0
##$BC_mod= 0
##$BYTORDP= 0
##$COROFFS= 0
##$CY= 15
##$DATMOD= 1
##$DC= 0
##$DFILT= <>
##$DTYPP= 0
##$F1P= 0
##$F2P= 0
##$FCOR= 0.5
##$FTSIZE= 32768
##$FT_mod= 6
##$GAMMA= 0
##$GB= 0
##$INTBC= 1
##$INTSCL= 1
##$ISEN= 128
##$LB= 0
##$LEV0= 0
##$LPBIN= 0
##$MAXI= 10000
##$MC2= 0
##$MEAN= 0
##$ME_mod= 0
##$MI= 0
##$NCOEF= 0
##$NC_proc= -8
##$NLEV= 6
##$NOISF1= 0
##$NOISF2= 0
##$NSP= 0
##$NTH_PI= 0
##$NZP= 0
##$OFFSET= 14.98061
##$PC= 1
##$PHC0= 207.724
##$PHC1= 0
##$PH_mod= 1
##$PKNL= yes
##$PPARMOD= 0
##$PPDIAG= 0
##$PPIPTYP= 0
##$PPMPNUM= 2147483647
##$PPRESOL= 1
##$PSCAL= 4
##$PSIGN= 0
##$PYNMP= <proc.py>
##$REVERSE= no
##$SF= 400.13
##$SI= 32768
##$SIGF1= 0
##$SIGF2= 0
##$SINO= 400
##$SIOLD= 32768
##$SPECTYP= <>
##$SREGLST= <1H.CDCl3>
##$SSB= 0
##$STSI= 32768
##$STSR= 0
##$SW_p= 8223.68421052632
##$SYMM= 0
##$S_DEV= 0
##$TDeff= 65536
##$TDoff= 0
##$TI= <>
##$TILT= no
##$TM1= 0
##$TM2= 0
##$TOPLEV= 0
##$USERP1= <user>
##$USERP2= <user>
##$USERP3= <user>
##$USERP4= <user>
##$USERP5= <user>
##$WDW= 1
##$XDIM= 32768
##$YMAX_p= 460030210
##$YMIN_p= -680692
##$CURPLOT= <Network HP LaserJet P1505>
##$CURPRIN= <$Network HP LaserJet P1505>
##$DFORMAT= <normdp>
##$LAYOUT= <+/1D_H.xwp>
##$LFORMAT= <normlp>
##$PFORMAT= <normpl>
##$SURQMSG= 1
$$ End of Bruker specific parameters
$$ ---------------------------------
##NTUPLES= NMR SPECTRUM
##VAR_NAME=  FREQUENCY,     SPECTRUM/REAL,   SPECTRUM/IMAG
##SYMBOL=    X,             R,               I
##VAR_TYPE=  INDEPENDENT,   DEPENDENT,       DEPENDENT
##VAR_FORM=  AFFN,          ASDF,            ASDF
##VAR_DIM=   32768,         32768,           32768
##UNITS=     HZ,            ARBITRARY UNITS, ARBITRARY UNITS
##FACTOR=    0.250966925370066, 1,           1
##FIRST=     8223.43324360095, -294698,      -164165
##LAST=      0,             222188,          -17318
##MIN=       0,             -680692,         0
##MAX=       8223.43324360095, 460030210,    0
$$ Real data points
##PAGE= N=1
##DATA TABLE= (X++(R..R)), XYDATA
$$ [...]
19529e4854B0249J67594c39210B6422a86496G4658J8116a19342c5700I1459a7149
19517A74894o37F1954N5699a5740j47860B52050a6667A7187a12685A22540m8103
19506G4437N1653c49988a67285k7291Q9657F5514A4069c8696n4115B36050i3183
19494A29669a00824A14422A0277b87824i8514a9559B81965b24832F0093b22110
19483F8201b91016h4500l9335c0755C9066r927i530k24767Q5614A7664N6367L2816
19471A06847a50243L3663r2946a03728j16861B16716b27946m2437B02367a04908
19460I411a63289j4276K0180m1663J7450L4332A44105e465C84781a35414A4629
19448C9390j2878b78592G8199a38674A9787a17193e4971A02457a22801L2920j84742
$$ plain form
19529 -54854 20249 187843 -339210 26422 -186496 74658 92774 -119342 -35700 91459 -17149
19517 174894 174257 61954 117653 -15740 -163600 252050 -16667 17187 -112685 122540 74437
19506 74437 126090 -349988 -167285 -194576 -104919 65514 14069 -38696 -92811 236050 -93183
19494 129669 -100824 114422 10277 -287824 -98514 -19559 281965 -224832 60093 -222110
19483 68201 -291016 -84500 -123835 -30755 39066 29139 -9530 -234297 -148683 17664 74031 106847
19471 106847 -150243 -116580 -209526 -103728 -220589 216716 -227946 -270383 202367 -104908
19460 9411 -163289 -177565 -157385 -199048 -181598 -147266 144105 -5465 384781 -135414 14629
19448 39390 26512 -278592 78199 -138674 19787 -117193 -54971 102457 -122801 -89881 -274623
19437b74623F9029b59946A28881e3840j89784F2100d6499p7708j10338a15302
19426B1495d6292B5155a56648A16889k4766b31939r09j21826d5670j18197h0929
19414A42499b14799J05539k31854i3831A01174b23307C30a82476Q1608K1124r3341
19403a73085g0693j03995A39110a45109e2831E3057J8619O8047c90741A41140
19392a13437A30555i846H5491b10988h2062l3709b3268A22396J39923f2420j5519
19381g7939k3749J4494a7219H2820c2887B7119J54196e696G858i3670j30243g2891
19368I4082j6490d3140K0952Q576A5374E817d0601D847a95972d4964A8104k736
19356A5368b48488h43j31247k01935G0314a71925B6457b3846j10617n547j21787
$$ plain form
19437 -274623 69029 -259946 128881 -53840 -243624 62100 -46499 -124207 -234545 -115302
19426 21495 -46292 25155 -156648 116889 92123 -231939 -232848 -354674 -45670 -163867 -80929
19414 142499 -214799 -109260 -341114 -93831 101174 -223307 330 -182476 -100868 -79744 -173085
19403 -173085 -70693 -174688 139110 -145109 -52831 53057 71676 139723 -390741 141140
19392 -113437 130555 -9846 85491 -210988 -82062 -115771 -23268 122396 262319 -62420 -77939
19381 -77939 -101688 -87194 -17219 82820 -32887 27119 181315 -5696 7858 -93670 -223913 -72891
19368 94082 77592 -43140 -22188 -13612 15374 5817 -40601 4847 -195972 -44964 18104 15368
19356 15368 -248488 -843 -132090 -334025 70314 -171925 26457 -23846 -134463 -140010 -261797
19345b61797A78000p9607M4417a42976r2255c5576j78341J02093d3275j31548
19335a74823C4439J87215C2751a5290k7404A65302G4783M318a94283e8946l8663
19324i7609j13038k06167d7168j09980j14178I8099g6882J5560a4801A232M4314
19313D5546f2545k45520e0534A2007a19187j7648j46989G1054A2789g1980n8386
19302a30366K0337j48547A95577a54364g6697l24733a08869B88096c30912A8619
19291a90205O5248j7321o1397C9164J56672R6383g5918k05929a6664j59018O0120
19280a15562e3762q3687l1246C4652R5103J56334a48080B7299R6129b9954F2114
19268a00275l18729C00060g2103k5876E818J95988a87580D3797L6875M329b67468
$$ plain form
19345 -261797 178000 98393 142810 -142976 -235231 -35576 -213917 -111824 -43275 -174823
19335 -174823 34439 221654 32751 -15290 -42694 165302 74783 79101 -194283 -58946 -97609
19324 -97609 -210647 -416814 -47168 -157148 -271326 98099 -76882 -61322 -14801 1232 45546
19313 45546 -62545 -308065 -50534 12007 -119187 -136835 -283824 71054 12789 -71980 -130366
19302 -130366 -110029 -258576 195577 -154364 -76697 -401430 -108869 288096 -330912 18619
19291 -190205 -124957 -142278 -203675 39164 195836 292219 -75918 -281847 -16664 -175682 -115562
19280 -115562 -53762 -137449 -168695 34652 129755 286089 -148080 27299 123428 -29954 62114
19268 -100275 -419004 300060 -72103 -97979 5818 201806 -187580 43797 80672 85001 -267468
19256c7366A90277a06639I1777N204b88868p0824J59503j41324A28417B8223c70099
19244c26569h7219F5113f9525A6204F743d7575n1157e776k30951P0669j60996
19233c27054I4866P9600m2141E1918b14898a4282I3267f6326J5435j78346k24026
19222d53263f4084B29208a65672j02019D8983A2621J52558a03230A28979c44428
19211a71307l7418d5650p1832A35141K03427b90930R9621K7164R341R681e4632
19199i0117A5570a42625K2431B36664a87494M6603F8925R4599b43923d3959A42942
19187a05531A10889c31359g4191F3525f4671A02867i0965c4424l31811E045b27845
19175h8816m07150A31209J11368b25534a3584H1820b7582j73755C592d5967j03141
$$ plain form
19256 -37366 190277 -106639 91777 96981 -288868 -359692 -200189 -341513 128417 28223 -370099
19244 -326569 -87219 65113 -69525 16204 6743 -47575 -98732 -5776 -236727 -166058 -327054
19233 -327054 94866 174466 132325 51918 -214898 -14282 93267 -66326 -50891 -229237 -453263
19222 -453263 -64084 229208 -165672 -267691 48983 12621 165179 -103230 128979 -344428
19211 -171307 -208725 -45650 -117482 135141 338568 -290930 -191309 -164145 -154804 -145123 -54632
19199 -90117 15570 -142625 -120194 236664 -187494 -140891 68925 163524 -243923 -43959 142942
19187 -105531 110889 -331359 -74191 63525 -64671 102867 -90965 -34424 -366235 5045 -227845
19175 -88816 -495966 131209 242577 -225534 -13584 81820 -27582 -201337 3592 -45967 -149108
19164a49108l3999E1758a45139J0164A00150a16197A03443d8937C3671g1949E5397
19152a36585l5924f557p0333k07398d2169A8825d4241C2092L7233a20700j43238
19141b63938c0276m0985E2980c1880m2256K418I740c62324B63379A07175m5866
19130F1309O9461d1351A80851a00274B2547a51818l7592n8089a3604k14316G6946
19118a12516i338k3208k07657a19837r2492R6828H4326a23388e3570m7714H0435
19106b3038r3439L1094l1937A3296J49815b6874k57159A47948M4259c32003L0620
19095c01383a20309b9447A86103h7424A64254a14391N2214l8293j67514J23766
19085a44218B2472a1873E3873K1508a3839A2594h6723C0603b54290N8116A66258
$$ plain form
19164 -149108 -183107 51758 -145139 -134975 100150 -116197 103443 -48937 33671 -71949 55397
19152 -136585 -172509 -6557 -76890 -284288 -42169 18825 -44241 32092 69325 -120700 -263938
19141 -263938 -30276 -71261 52980 -31880 -74136 -71718 9740 -362324 263379 107175 61309
19130 61309 130770 -41351 180851 -100274 22547 -151818 -189410 -247499 -13604 -227920 76946
19118 -112516 -9338 -32546 -240203 -119837 -212329 -115501 84326 -123388 -53570 -101284 80435
19106 -23038 -116477 -85383 -117320 13296 163111 -26874 -284033 147948 192207 -332003 -301383
19095 -301383 -120309 -29447 186103 -87424 164254 -114391 -62177 -100470 -267984 -144218
19085 -144218 22472 -11873 53873 75381 -13839 12594 -86723 30603 -254290 -196174 166258
19073A05460i6037k17469J14134k3109D4626e2586m25864B03716a69882P2329
19063i7553c8727l2099H6910d07911B06100a4660j74639A9553Q9822J66411c5140
19051b72289D6056a64115b0344r247q181k33759a5576C36386h4245o1499l9290
19040a85034p3729b1667H347J24355a1706j68920A6553a87304Q9221k89659A9814
19028d7729B76096A15798e4947p8386j01922H1640a35218j58899M1977L6483F0707
19016A05151a87588C56047a79631d1884b0808A67465Q799a09471B53316a24928
19005b61528e4013B07009B0373a66209j52922J25131B89841M7421b2839k8988
18995e1827a1347j09877B44473a51436B13627A02935b08118P6308j4436e5044
$$ plain form
19073 105460 -96037 -313506 -199372 -222481 44626 -52586 -478450 203716 -169882 -97553
19063 -97553 -38727 -70826 86910 -407911 206100 -14660 -189299 19553 109375 275786 -35140
19051 -272289 46056 -164115 -20344 -29591 -37772 -271531 -15576 336386 -84245 -145744 -185034
19040 -185034 -258763 -21667 8347 132702 -11706 -180626 16553 -187304 -98083 -387742 19814
19028 -47729 276096 115798 -54947 -133333 -235255 81640 -135218 -294117 -252140 -215657 60707
19016 105151 -187588 356047 -179631 -41884 -20808 167465 176264 -109471 253316 -124928
19005 -261528 -54013 207009 20373 -166209 -319131 -194000 289841 337262 -22839 -51827
18995 -51827 -11347 -121224 244473 -151436 213627 102935 -208118 -131810 -146246 -55044
18984f2938e313j55729a9202k42380h6086A11290h6830B00494b19479i9907q2330
18973a82237A675J37811L2922b51831B04982a17303B17877i2176H7461a55281
18962i6076c0205q8872d0597m8592p2179e6274l4332A70372k1400J04843b23982
18950a1106j59925J7285j58474a31348a9320B964K76040A23607l5908b69160n9712
18939c28872I8192a98797A05163K63879b08649A28665d6927j76062j81629B54008
18928b80223A54338e1474q219j9138A79568b44868f6834E7485A757L70106d006
18916b95267r0886d9047I0626g4186m15161i8684I9444f9335c0321A89137g6815
18904B70599p7632c6778C52268a41670B1221h838q5436j17545A94154g1796k74157
$$ plain form
18984 -62938 -5313 -161042 -19202 -261582 -86086 111290 -86830 200494 -219479 -99907 -182237
18973 -182237 1675 139486 172408 -251831 204982 -117303 217877 -92176 87461 -155281
18962 -96076 -30205 -119077 -40597 -89189 -161368 -56274 -90606 170372 148972 253815 -223982
18950 -11106 -171031 -153746 -312220 -131348 -19320 2964 279004 123607 87699 -269160 -328872
18939 -328872 98192 -198797 105163 369042 -208649 128665 -46927 -222989 -404618 254008
18928 -280223 154338 -51474 -59693 -78831 179568 -244868 -66834 57485 1757 371863 -4006
18916 -295267 -386153 -49047 90626 -74186 -489347 -98684 99444 -69335 -30321 189137 -76815
18904 270599 192967 -36778 352268 -141670 21221 -8838 -94274 -211819 194154 -71796 -345953
18893c45953a38478D7576O0727m3425c57135G9324P8185a06602J0956o992m12681
18882e15319D435H53a10835B53906a08624K024I5838l724D5097M3283a0727p8696
18870h9423A10568a14886N0418I7167c90222G9793e21693e2287j05915a658H0113
18858b7689j72274Q9677A10273A3218b37146p270g0960j8132j19319B5736f3509
18846i4147j41564h0532C53891h0102A10000K86551H3433a33838D33000F5380
18835d4593B30530b71151i1838E4267c72351J55562c5620I8606c0599A5081b31491
18823D7478O5267e6931B05407H497P1432i9021o5825B39508D2930c14206A9659
18811F9154k2388a7024B51670g8683p4098n6777P7383B11143a62841K5133L2849
$$ plain form
18893 -345953 -138478 47576 108303 64878 -357135 79324 157509 -106602 -95646 -102638 -515319
18882 -515319 4435 853 -110835 253906 -108624 -106600 95838 92114 45097 88380 -10727 -89423
18870 -89423 110568 -114886 -64468 97167 -390222 79793 -521693 -52287 -158202 -1658 80113
18858 -27689 -199963 -110286 110273 13218 -237146 -244416 -70960 -89092 -208411 25736 -63509
18846 -94147 -235711 -80532 353891 -80102 110000 396551 83433 -133838 433000 65380
18835 -44593 230530 -271151 -91838 54267 -372351 -216789 -35620 98606 -30599 15081 -231491
18823 47478 112745 -56931 205407 8497 79929 -99021 -164846 239508 42930 -314206 19659
18811 69154 46766 -17024 251670 -78683 -152781 -209558 -132175 211143 -162841 -137708 -104859
18800a04859I1979L3659k7404h2007p5728f4581F360e6354D6350j7305L3290C352
18787a32219C2965a70183D0514a41555A1908a9966B15982H947a56683N5757m2417
18776a43343k95491J08716E9839J09816a02814J6933r0735f7295l62090A11144
18765b52374M1077N9998a574r9883A0323c9856j11770G8641J27276a435j70242
18754a71677N9407D7887c0649k6741j0394l22910B27064g867j19654j29595f5325
18742E4620a47322e3883E0509b00911j39823A30450I769h6627j50280A38486E1559
18730b37005C3177K65064f1333B85997D0092J10736a15905B22537p0825l6869
18720A14843i5709A48193k2035D7253c147l76061I0230J75752b00235M5591m6440
$$ plain form
18800 -104859 91979 125638 98234 -82007 -157735 -64581 6360 -56354 46350 29045 62335 3352
18787 -132219 32965 -170183 40514 -141555 11908 -19966 215982 8947 -156683 -100926 -143343
18776 -143343 -438834 -330118 59839 169655 -102814 -85881 -176616 -67295 -429385 111144
18765 -252374 -211297 -151299 -1574 -101457 10323 -39856 -151626 78641 205917 -1435 -171677
18754 -171677 -112270 47887 -30649 -57390 -67784 -390694 227064 -7867 -127521 -257116 -65325
18742 54620 -147322 -53883 50509 -200911 -340734 130450 9769 -86627 -236907 138486 51559
18730 -237005 33177 298241 -61333 285997 40092 150828 -115905 222537 151712 114843
18720 114843 -95709 148193 126158 47253 -3147 -379208 90230 265982 -200235 -154644 -201084
18709b01084B52912b27799A85393b75446o7938B05019I8992i8787j74663L3645
18699b39805d4892j9654k5519A8861a52511g4034j247C0100M666Q3793a46962
18687H1398f4157f134j37814e6036H1283a70490f8559j42817i2710r5342C51035
18675f0067C61003a60481j28073J41852e436j94061c6237j56043j535H815a44061
18663F6038c07267J50079E7680K48460b63369a6170l5759E5420J26531a34795
18652a10456M5220j47335H8241a44535e8289j31255A94478F7131J13915a08994
18641a98990F1116a07158B45075c46832J06649L8086O8559A3764K31141a420K12
18630a208B29287b23456A46059D4147b55146e4874B515J32836b95036D3175J1538
$$ plain form
18709 -201084 252912 -227799 185393 -275446 -343384 205019 98992 -98787 -273450 -239805
18699 -239805 -44892 -64546 -90065 18861 -152511 -74034 -75281 30100 34766 118559 -146962
18687 81398 -64157 -6134 -143948 -56036 81283 -170490 -68559 -211376 -92710 -188052 351035
18675 -60067 361003 -160481 -288554 -146702 -5436 -199497 -36237 -192280 -193815 8815 -144061
18663 66038 -307267 -157188 57680 306140 -263369 -16170 -51929 55420 181951 -134795
18652 -110456 -65236 -212571 88241 -144535 -58289 -189544 194478 67131 181046 -108994
18641 -198990 61116 -107158 245075 -346832 -240183 -202097 -133538 13764 244905 -1420 -1208
18630 -1208 229287 -223456 146059 44147 -255146 -54874 2515 135351 -295036 43175 54713
18619E4713c42311e3617n1669j99653R1834r6558n6544C00637i2420p9462J7763
18608a54119j30308J26445I0047N1573J58451C703J17908A9913d9416p7898l4046
18597a61360A96266q6516c14091a29568A29629B6722b70220B37704a39956C8608
18586i2559K1670A5056L217c62066C36352G4427a5504j15105J3695J8154K6652
18575g2108a6732g421j41367p0836B09114F5500b42316I3197b58345a15107d0901
18563a07727A55736D28L4251K0513A5654a09466q8776j27355j2186h714k3282
18552c1996k9226r9387A68421a30379b6507j41621E1702R3311c54722J40627J00386
18541a13709c0792q3243E4143b4075j24547O417o8509H8361g8973k16892A34455
$$ plain form
18619 54713 -342311 -53617 -105286 -304939 -213105 -309663 -366207 300637 -92420 -171882 -154119
18608 -154119 -284427 -157982 90047 141620 300071 3703 121611 19913 -49416 -127314 -161360
18597 -161360 196266 109750 -314091 -129568 129629 26722 -270220 237704 -139956 38608
18586 -92559 -70889 15056 18273 -362066 336352 74427 -15504 -130609 -116914 -98760 -72108
18575 -72108 -16732 -7421 -148788 -219624 209114 65500 -242316 93197 -258345 -115107 -40901
18563 -107727 155736 428 34679 55192 15654 -109466 -198242 -325597 -337783 -8714 -31996
18552 -31996 -61222 -160609 168421 -130379 -26507 -168128 51702 145013 -354722 -214095 -113709
18541 -113709 -30792 -114035 54143 -24075 -148622 -142205 -210714 88361 -78973 -295865 134455
18529a56907H2808e6013k91411f5945n8075p0515A37325b69731A90182Q2757b8017
18517E4082b43421A09116d8286o32406a20026j89484D8483a2716B5859c10388
18506A36796J87962A13767a08651R753j24486f0284B90969a28427a3133A20739
18495b77010h3615C9853K08982I9980i3415C1860K5831h1425j0909G3021g1281
18483b00519f0443j45358g8668A6914c04537i4970G2586M2302b60280M3489a04263
18471c73564A28056K3829m6115P3339J2006r1994f472k21166M2905J0382A76735
18459E0159i731k44765B52372A19695a89743l1689j5888h3494m5887B6202L3776
18448E9978J86717f5200j47687C0379f1037E0808c0538A39992M9807f1057A52675
$$ plain form
18529 -156907 82808 -56013 -347424 -65945 -124020 -194535 137325 -269731 190182 272939 -28017
18517 54082 -243421 109116 -48286 -680692 -120026 -309510 48483 -12716 25859 -310388
18506 136796 324758 113767 -108651 -98898 -223384 -60284 290969 -128427 -13133 120739
18495 -277010 -83615 39853 248835 99980 -93415 31860 57691 -81425 -92334 73021 -71281
18483 -200519 -60443 -205801 -78668 16914 -304537 -94970 72586 114888 -260280 -216791 -104263
18471 -373564 128056 151885 105770 179109 191115 99121 -6472 -227638 -184733 -174351 176735
18459 50159 -9731 -254496 252372 119695 -189743 -221432 -237320 -83494 -129381 26202 59978
18448 59978 246695 -65200 -212887 30379 -61037 50808 -30538 139992 189799 -61057 152675
18436B58581c35872b3619B17948a89542B34965c52210L2462A80114l5172b0333
18425B7316e6781j84042Q7171i223E28785d82171D4766K4200f431j32320l15642
18414d54393A99664e5612a2593j77878h0660B5467a26078d8430H7698e4066a8117
18402a18130c4286r2718B2189b30182A59714G0076J06430n5348m8415b08939I0702
18390a23760M4991m62063a05289G01K18416i607L145n959A7186c04440B97347
18378c08043c7845j41626k11854d5833m4427C24681a61417H2403a51290I1723
18367A04444f4358A91428b49904i5318m8903J58A14928c21214c1167A4429i9797
18355G717K25680a66448e9386n919A6356J89007D4847L1997P7038b22155A23943
$$ plain form
18436 258581 -335872 -23619 217948 -189542 234965 -352210 -319748 180114 144942 -20333
18425 27316 -56781 -240823 -153652 -9223 528785 -482171 44766 68966 -6431 -138751 -454393
18414 -454393 199664 -55612 -12593 -190471 -80660 25467 -126078 -48430 87698 -54066 -18117
18402 -118130 -34286 -127004 22189 -230182 159714 70076 176506 121158 72743 -208939 90702
18390 -123760 -78769 -540832 -105289 701 219117 -9607 -6462 -12421 17186 -304440 297347
18378 -308043 -37845 -179471 -391325 -45833 -90260 324681 -161417 82403 -151290 91723
18367 104444 -64358 191428 -249904 -95318 -144221 -144063 114928 -321214 -31167 14429 -99797
18355 7717 233397 -166448 -59386 -65305 16356 205363 44847 76844 153882 -222155 123943
18343a20162B0296g7558b3986G1107J04183b8978j10007E7233K61671b20602D59049
18331b89560a9776B10331c47640m9967f0866k78377D14685A54515d9701j45167
18321a94868a3375C1191b26664Q2792j32933P2395B58854a89372j60740d9880
18310a98608a1124G5052P8059a02284a9553G9022a67642A61806b60629D0684L96827
18299D37511a32656A36037k241E6185b7600k09162f9969B06b7291B80280a63340
18287c37503R1236E1248k3236L5888h8862j18871A3059M1853b04710a5432j0274
18276b5706k19489L5174I5389H189M3188a40641N5497o5062N0073R977D782a9488
18263b45926g4518B72838F7834a27898G8539b38992e3577G0449g1005I7672b88156
$$ plain form
18343 -120162 20296 -77558 -23986 71107 175290 -28978 -138985 57233 318904 -220602 459049
18331 -289560 -19776 210331 -347640 -397607 -60866 -339243 414685 154515 -49701 -194868
18321 -194868 -13375 31191 -226664 -143872 -276805 -204410 258854 -189372 -350112 -49880
18310 -198608 -11124 75052 153111 -102284 -19553 79022 -167642 161806 -260629 40684 437511
18299 437511 -132656 136037 133796 56185 -27600 -236762 -69969 206 -27291 280280 -163340
18287 -337503 -246267 51248 28012 63900 -88862 -207733 13059 54912 -204710 -15432 -25706
18276 -25706 -245195 -210021 95389 8189 51377 -140641 -85144 -150206 -100133 -90156 4782 -19488
18263 -245926 -74518 272838 67834 -127898 78539 -238992 -53577 70449 -71005 97672 -288156
18251b15398e5942o7072H9919b15148c0495K980A24377d7930A98795c66112i4107
18239b36106a16684j20722L6854l04054A43345c21746a30968A08187b3861A44409
18228b56811A22729J3333c6914G5093g6094A51149E5891J13000a41546G8104L1654
18217A09758h0584o1780E7034b60192Q5592e0917k39138A30479a09267H4121j3127
18206G0994a07560E6347a6174j54211A55687c09964F5904K1983g9386j49584A57978
18194D235J25501J8040d08689a793E8433g7531A54977B8591b5581B98671a45263
18182B05531F4345D679i8611L1651A2125b33636E8506a90735a3300A03498h393
18170b40060A58547b0734j65399R69d6317a9851B66070d8199l9282f373E5704
$$ plain form
18251 -215398 -55942 -123014 89919 -215148 -30495 -27515 124377 -47930 198795 -366112 -94107
18239 -236106 -116684 -237406 -200552 -504606 143345 -321746 -130968 108187 -23861 144409
18228 -256811 122729 136062 -36914 75093 -76094 151149 55891 168891 -141546 78104 109758
18217 109758 -80584 -142364 57034 -260192 -174600 -50917 -290055 130479 -109267 84121 70994
18206 70994 -107560 56347 -16174 -170385 155687 -309964 65904 87887 -79386 -228970 157978
18194 4235 129736 147776 -408689 -1793 58433 -77531 154977 28591 -25581 298671 -145263
18182 205531 64345 4679 -98611 -66960 12125 -233636 58506 -190735 -13300 103498 -8393
18170 -240060 158547 -20734 -186133 -185164 -46317 -19851 266070 -48199 -87481 -6373 55704
18158i463k58036I9657d0127N386G5778a0928q3495q7490P0670j61336f4095r1917
18146a56012E293Q5122D5057e4040E8806J20478f9088j05463g6040A14049M2613
18135A56662b84986D7415f5115l638A28941h3505C5512d9048l6940H6526J81896
18124B68422a38133A9666K1656C400K21115m6423a43907A75175a13864a018j6323
18113a7341m0676D675f4163G5224c52749D6309J77268a11554A52028M0203I2448
18101a85004k8557G7550n507d3495E9090N0152a01687b9624l6276j46269l8391
18090b50560G065c54053a05683J0351m89700A29856a85693g2484a4754j79171
18080a93925A44445b24704C07856J4857C2914K4875d71781b5100r608l6652k68167
$$ plain form
18158 -9463 -267499 99657 -40127 -34741 75778 -10928 -94423 -181913 -111243 -272579 -64095 -156012
18146 -156012 5293 90415 45057 -54040 58806 179284 -69088 -174551 -76040 114049 156662
18135 156662 -284986 47415 -65115 -68753 128941 -83505 35512 -49048 -85988 86526 268422
18124 268422 -138133 19666 41322 3400 224515 178092 -143907 175175 -113864 -1018 -17341
18113 -17341 -58017 4675 -64163 75224 -352749 46309 223577 -111554 152028 192231 92448
18101 -185004 -213561 77550 72043 -43495 59090 109242 -101687 -29624 -65900 -212169 -250560
18090 -250560 7065 -354053 -105683 -95332 -585032 129856 -185693 -72484 -14754 -193925
18080 -193925 144445 -224704 307856 322713 32914 57789 -471781 -25100 -34708 -71360 -339527
18069c39527i1633j67201G3969h3629A66769a97901d3553H1023h2357A77612b63723
18057a91464A12484k7260c30424f0067A36821J72498a40488r1597I8708b3351
18046a99829E3852h7316j69872h727j7633C0272J19701m7810f7999B41903m5473
18035A96430D1750a23895A95528Q4122B8765P2960d4183G3749c5300k88500J60488
18024a63312c8305r0742I6635P1187a78485G2706b88717B11403j5045f2872A36953
18012A29611a10800n7787k33691a42901N4844H26J51906C1294J51166n3902c71953
18000b8284l64281F4389a3817A1830c34003A22981E2535i7743A36988N8786b00443
17988a94972F3737a33073o8863K7622B37207b36076A42984n3669a92271b1277
$$ plain form
18069 -339527 -91633 -258834 73969 -83629 166769 -197901 -43553 81023 -82357 177612 -263723
18057 -191464 112484 85224 -330424 -60067 136821 309319 -140488 -232085 98708 -23351
18046 -199829 53852 -87316 -257188 -8727 -26360 30272 149973 102163 -67999 241903 196430
18035 196430 41750 -123895 195528 279650 28765 101725 -44183 73749 -35300 -323800 -163312
18024 -163312 -38305 -129047 96635 167822 -178485 72706 -288717 211403 196358 -62872 136953
18012 129611 -110800 -168587 -402278 -142901 -88057 826 152732 31294 182460 128558 -371953
18000 -28284 -392565 64389 -13817 11830 -334003 122981 52535 -97743 136988 195774 -200443
17988 -194972 63737 -133073 -201936 -174314 237207 -236076 142984 89315 -192271 -21277
17977b8357m027A31296b12160r753d4758j43609d400o9728A0038M8606J6921a9567
17964B48306A11597l9531J43139f5736A44633b0971A2126b93687F6245P4982a69004
17952a23105b5478A32678J8930a61767j2447A8164L32183p7295a61615I528L9261
17941D8789J00564K3479b574j68138B53944a30895A66280p6477a6680E4827a30994
17929b31092B15270C8723P2439n2003B6764b9750B51167a96396A7810O1885Q24
17918H0519N3861E6507g4925l59992F2437a55936A48162a50430A3024N974M1805
17907F0803Q7096b32497A57657G2164L88348a45087A17466P279f1761A34256a2960
17895C8043a85640B06183o0632M521A9760L2892B124b76810A40770C656b8776
$$ plain form
17977 -28357 -32384 131296 -212160 -221913 -44758 -188367 -4400 -74128 10038 58644 75565 -19567
17964 248306 111597 72066 215205 -65736 144633 -20971 12126 -293687 66245 141227 -169004
17952 -123105 -25478 132678 151608 -161767 -174214 18164 350347 273052 -161615 9528 48789
17941 48789 149353 172832 -2574 -170712 253944 -130895 166280 89803 -16680 54827 -130994
17929 -231092 215270 38723 111162 59159 26764 -29750 251167 -196396 17810 79695 80519
17918 80519 134380 56507 -74925 -434917 62437 -155936 148162 -150430 13024 18998 60803
17907 60803 147899 -232497 157657 72164 460512 -145087 117466 124745 -61761 134256 -12960
17895 38043 -185640 206183 145551 150072 19760 52652 2124 -276810 140770 3656 -28776
17883b30454a11267j9146M4317R653k42725A27293N3161a09642L7771K3599k5968
17872g4240j69225O9988c4187A2080J04541J9550a97662A17401K2560o5779a29242
17860F8101b74804a2494B2221b18645A73188J4354b23551A23586A8186i6875A96759
17848D3979a94904B47009a96960A44786b71139m549J24850O5071A91496a28445
17837a29316E7862a43874A23314h2410p147j54527B75836j20594G7422b66227
17826A97214b46144A64601M9900A03547k2651C2962h1143O033A29131b19501A233
17814a00126E00937C8494c35384K9293I212a39266e3064K6244E0093A1327b10993
17802b12309q9906k64931c9674A97011b24403J8347e6467B02933C1116b07676
$$ plain form
17883 -230454 -111267 -130413 -86096 -76443 -319168 127293 180454 -109642 -71871 -48272 -74240
17872 -74240 -243465 -173477 -34187 12080 116621 136171 -197662 117401 139961 74182 -129242
17860 68101 -274804 -12494 22221 -218645 173188 187542 -223551 123586 18186 -96875 196759
17848 43979 -194904 247009 -196960 144786 -271139 -275688 -150838 -85767 191496 -128445
17837 -129316 57862 -143874 123314 -82410 -89557 -244084 275836 155242 77422 -266227
17826 197214 -246144 164601 214501 103547 80896 32962 -81143 -75110 129131 -219501 1233
17814 -100126 500937 38494 -335384 -306091 9212 -139266 -53064 -26820 50093 11327 -210993
17802 -212309 -302215 -567146 -39674 197011 -224403 -206056 -56467 202933 31116 -207676
17791c16459B99416m1719a05861F7566P819l5550h2672F4731a24039k08044E6156
17779a1979l01667A5665C741L9735J65373G0905a19533A32632a41817A07234K95172
17768D02406a18537N4594e958m5227O858j5249b1743m3473D9038a43169N7980
17757h5189D18797d3069A42946k7138c0632B81777f0722B3134N4067b51904L7471
17746b14433D44496b1635k9378j66703a8398j8946j10715f2439j93103b7953m8190
17735g6143m4844A96308D7210d49611h3780j23794C7438a13085F9152L9180K6275
17724A34607c0612j06515A41991D1781K12058g015A15747h1022C33207b64908
17713d2602k15097e6673l1144B27250a13239d4707k41968e93k79770A95942b57121
$$ plain form
17791 -316459 299416 257697 -105861 67566 75385 39835 -82672 64731 -124039 -332083 56156
17779 -11979 -313646 15665 3741 43476 208849 70905 -119533 132632 -141817 107234 402406
17768 402406 -118537 -63943 -5958 -51185 -44327 -59576 -21743 -65216 49038 -143169 -85189
17757 -85189 418797 -43069 142946 115808 -30632 281777 -60722 23134 77201 -251904 -214433
17746 -214433 444496 -21635 -51013 -217716 -18398 -37344 -148059 -62439 -255542 -27953 -76143
17735 -76143 -120987 196308 47210 -449611 -83780 -207574 37438 -113085 69152 108332 134607
17724 134607 -30612 -137127 141991 41781 253839 -7015 115747 -81022 333207 -264908
17713 -42602 -257699 -56673 -87817 227250 -113239 -44707 -286675 -593 -280363 195942 -257121
17701e4868A74693B1735P9228L7930I488J46082c88339e7914j1323K4541B36007
17689A1005c97673a96909j0297F5584g7465A3753K44865N9085c2713A31730E2246
17677A94626F6210R9643c94p2864n6096C31087E2551N0473a50243r9062A41892
17665b2729A95429f0560A88416l2678C0978R0286L0103c5076A29731J18979B560
17653a9611k8370j02086H9255a38595A72874J313b6809g351A03291N7173i8791
17641b96565B22892a69023A38386b8302j13953j13719b863p8084A76879i1949
17630A61406b96920G8730e3232H0682a4432A43390e4979J4681C4791c4355A10312
17618a80673D06707I0376a1427B20545m4154j7655L37012C2316f1189k31638A52294
$$ plain form
17701 -54868 174693 21735 100963 138893 9488 155570 -388339 -57914 -69237 -44696 236007
17689 11005 -397673 -196909 -207206 65584 -77465 13753 258618 317703 -32713 131730 52246
17677 194626 66210 165853 -394 -73258 -129354 331087 52551 103024 -150243 -249305 141892
17665 -22729 195429 -60560 188416 155738 30978 121264 151367 -35076 129731 248710 2560
17653 -19611 -47981 -150067 89255 -138595 172874 174187 -26809 -7351 103291 160464 -98791
17641 -296565 222892 -169023 138386 -28302 -142255 -255974 -2863 -80947 176879 -91949
17630 161406 -296920 78730 -53232 80682 -14432 143390 -54979 -40298 34791 -34355 110312
17618 -180673 406707 90376 -11427 220545 176391 158736 495748 32316 -61189 -292827 152294
17606b6555j62013M2829A11450b75937C2840i6970a0516r0571o2168A41284c0697
17594A84831d5326j05761M6913C505i8202E1566d18180E637d7727K3028k16787
17583b41486A08603m4301d0644D76502a50149O7447B64708p662a18256L7128A64455
17571c30247i6478B76279p1179a40596j899k6353A86989q800q651m4891J2879
17560A37526o4059J12010K10270b50287B13473P7227a58658l1214G9842i624r0476
17549a00100C035K70299i0994B95161a50r6526c9385B58520H8103J1521L4521
17538A34145J9319m1774B1171d6458A9276J22582M588b26029H7135b78416H8761
17526d4650E0831J18410G8702L7699B0362J22271c31039A72052a53638A18706
$$ plain form
17606 -26555 -188568 -145739 111450 -275937 32840 -96970 -10516 -101087 -163255 141284 -30697
17594 184831 -45326 -151087 -104174 3505 -98202 51566 -418180 5637 -47727 -24699 -241486
17583 -241486 108603 64302 -40644 476502 -150149 -82702 264708 257046 -118256 -81128 164455
17571 -330247 -96478 276279 205100 -140596 -142495 -168848 186989 178189 169538 124647 137526
17560 137526 73467 185477 395747 -250287 213473 290700 -158658 -189872 79842 -9624 -100100
17549 -100100 3035 273334 -90994 295161 -150 -96676 -39385 258520 88103 99624 134145
17538 134145 153464 111690 21171 -46458 19276 141858 146446 -226029 87135 -278416 88761
17526 -44650 50831 169241 78702 116401 20362 142633 -331039 172052 -153638 118706
17515C099b56305A3655P4320a42151B09745j4323G9084J33786Q6985N7525f6570
17503e217C5700J2171J59230a7319o7061j6690E6183b70070a18101A29135A5984
17491A10888k221R2048H4417K08869D681M1711N7689d2891A51817E2255a6286
17479D29353f4477A19598M6801c17172A99586R0342g0328G5774L49868A33180
17468A15907a38320B26759j6237A1637a65394c6087A46436Q8568M0788r563j00186
17457A66043J23441K88333A57218n8987d1331B2978L04819j53427i9226B20783
17446A09292D1797J58050a81559D3183E862J64531n1262L9081a08644I1637a11269
17434A89627K00537A11184J4992j2820J75380A44187e6383E86637E600L04056
$$ plain form
17515 3099 -256305 13655 87975 -142151 209745 195422 79084 212870 299855 357380 -66570
17503 -5217 35700 47871 207101 -17319 -84380 -101070 56183 -270070 -118101 129135 15984
17491 110888 108667 200715 84417 293286 4681 46392 104081 -42891 151817 52255 -16286
17479 429353 -64477 119598 166399 -317172 199586 289928 -70328 75774 425642 133180
17468 115907 -138320 226759 210522 11637 -165394 -36087 146436 235004 275792 266229 166043
17457 166043 289484 577817 157218 98231 -41331 22978 327797 174370 -99226 220783
17446 109292 41797 199847 -181559 43183 5862 170393 119131 158212 -108644 91637 -111269
17434 189627 390164 111184 126176 113356 288736 144187 -56383 586637 5600 309656
17424C09656o5454J6695f6047F9483M23752A53901j8125J76320p2287p2172R700
17413A77337J01990F3023N5161K65379j30852J45251j48956F0424A301M80556
17403D81857j21060j25947K3024l1952J79237k01569J14107r5734j1848K27924
17393D38039A95816J6187F9925B1095R2289O661d7400D21171A62135a04217j25116
17382b29333B97766r404j12986q5089a68553B62919A26117K8316n8845C5152L77212
17371D12364l5409j59030D7568N0100a71932Q092C12351A2974K01152D5651N6452
17360A02103K70907q9803J70179n7656A52060M8737a28027a437j35528A54023
17349C31504I3364J20407J70393E8799J86270J549A9820N7008k5582J79040A0269
$$ plain form
17424 309656 244202 260897 -66047 69483 493235 153901 135776 312096 239809 167637 177337
17413 177337 279327 63023 118184 383563 252711 397962 249006 60424 1301 481857
17403 481857 360797 234850 257874 225922 405159 203590 317697 221963 210115 438039
17393 438039 195816 212003 69925 21095 113384 120045 -47400 421171 162135 -104217 -229333
17382 -229333 297766 288362 175376 90287 -168553 262919 126117 154433 95588 35152 412364
17371 412364 376955 217925 47568 97668 -171932 -163840 312351 12974 214126 45651 102103
17360 102103 373010 283207 453386 395730 152060 200797 -128027 -1437 -136965 154023
17349 331504 93364 213771 384164 58799 245069 246618 19820 76828 51246 230286 10269
17337A89638L89268k55829a21758I2070J72526M0130n3467b42139j7844B29859
17326B92834k6098B2807Q3080l1425a81437A64541R3672n8592o7454D6817M6968
17315I3785K9290K64836j03023N5031a7223C24854j6780F5893j0603k5831C766
17303C964L67069A45644k2682P0257o9156K18399o4412b20054C37119B9143A4285
17291f4728B16313C0877J13917f3130A79595i1116C32194j59591p2069c7570B84922
17279A20055m6406L706K24991A9332a5228B03378k787h4274B72204A15035J43257
17268B58292p4198K41086C0508O88341h5868A55132k2763K56435K39835B21209
17257B51740b5308E42836B30187A8457P0281J55477r443J6372b4632C08625j22864
$$ plain form
17337 189638 578906 323077 -121758 92070 264596 304726 251259 -242139 -259983 229859
17326 292834 266736 22807 105887 74462 -181437 164541 258213 199621 132167 46817 93785
17315 93785 123075 387911 284888 339919 -17223 324854 308074 65893 55290 29459 3766
17303 3964 371033 145644 122962 193219 124063 342462 278050 -220054 337119 29143 14285
17291 -64728 216313 30877 144794 -63130 179595 -91116 332194 172603 100534 -37570 284922
17279 120055 73649 77355 302346 19332 -15228 203378 200591 -84274 272204 115035 258292
17268 258292 184094 425180 30508 718849 -85868 155132 132369 388804 628639 221209
17257 251740 -25308 542836 230187 18457 88738 244215 234772 251144 -24632 308625 185761
17246A85761o0883C8795K11436L1120c9074A11016K77388j18659a27996D41153
17235H6114J37385r2330l4179J48590m5074j3405K25736A07584J49359a00668
17224F9275O4826J02185e540B12939J26221h4445C55225a68803C95229a51699
17213I0195J88915n3664J18097K40434B20039A07895J21743A01748J39931N627
17203B47306E9023A3464J92169I7327l7759J07017K06587C1793M21739j91466
17193B62066m7916l7717K09825n9780o4408J10767A09920Q5322j9557C3933J63831
17182A97764J55325j22818l5375q0795K91207k00970B8679J09250l6956K56168
17172C57141a38356c789B4036L18255K48695M8459j83140k10859J62727J2577
$$ plain form
17246 185761 124878 38795 250231 281351 -39074 111016 388404 269745 -127996 441153
17235 86114 223499 131169 96990 245580 200506 187101 412837 107584 256943 -100668
17224 69275 134101 236286 -5540 212939 339160 -84445 355225 -168803 395229 -151699
17213 90195 279110 225446 343543 583977 220039 107895 229638 101748 241679 247306
17203 247306 59023 13464 205633 97327 59568 166585 373172 31793 453532 262066
17193 262066 214150 176433 386258 326478 262070 372837 109920 195242 175685 33933 197764
17182 197764 353089 230271 194896 114101 405308 204338 28679 137929 100973 357141
17172 357141 -138356 -3789 24036 342291 590986 639445 456305 245446 408173 420750
17162D20750c23212B81034o9378l3311K47527m419j53842P31L6408J62256D2709
17150A46724K41781j52038K03924J17192A58720M17220j31213A51675J20566r0871
17140A81370J8375L51959A58088O1383r2487a9622B59306J10594A83604J99943
17130C83547K77382k90649A69722M51572k44729A04306L78167j81262J40734p0452
17120C71493r8340j15598L71032j33532L8417A00861J28844K92815q318J0105
17110E24307j97450j9171M7472p2572K52729A87419L6038o9905L10221O0681A58352
17098C87552J73475B49715D6666J95822K75337j34131Q698o2800J87992k28367
17088B89217L70486j86906m799O9503J8525l1907L1262B07680J13795r9202Q5098
$$ plain form
17162 420750 -323212 281034 211656 178345 425872 421453 267611 268342 304750 467006 42709
17150 146724 388505 236467 440391 557583 158720 575940 444727 151675 272241 181370
17140 181370 199745 551704 158088 219471 126984 -19622 259306 369900 183604 383547
17130 383547 660929 370280 169722 621294 376565 104306 482473 301211 441945 371493
17120 371493 273153 157555 528587 395055 433472 100861 229705 522520 514202 524307
17110 524307 326857 307686 355158 282586 535315 187419 223457 153552 463773 524454 158352
17098 387552 561027 249715 46666 242488 517825 383694 392392 329592 517584 289217
17088 289217 659703 472797 467998 537501 556026 524119 555381 207680 321475 222273 307371
17077C07371J61264K18698k8065J31801k31101A82935K63791A59237J57913N3812
17067C70962N7497K27217j30629k49107J66392j3834K96J3504K75070C46263r7184
17056B49079M88819B96313N79020l96578J554j19101K85901j49187J61541B70124
17045F45663j46003P1244j63841M8365K20326q670j26222j37819K01592K5966
17035F30601Q397j21207q5461q3363K10259K56068k01025j09748K0451j35076
17025C89896R9160K5126K22403L3526K1599K12780m13870Q0821k18574J31319
17015E84186k31517N87473l59633R3635K70819m0420q9642j14686j64338P2542
17005F08419J57764k72891M22647l33254L05961j61085k0862K15406j74013q222
$$ plain form
17077 307371 468635 687333 659268 791069 559968 182935 446726 159237 317150 370962
17067 370962 428459 655676 525047 275940 442332 428498 428794 442298 717368 346263 249079
17056 249079 737898 296313 875333 478755 480309 361208 647109 497922 659463 270124
17045 645663 499660 570904 407063 455428 675754 667084 540862 403043 604635 630601
17035 630601 638998 517791 432330 348967 559226 815294 614269 504521 524972 389896
17025 389896 489056 514182 736585 770111 791710 1004490 590620 671441 452867 584186
17015 584186 352669 940142 580509 674144 944963 904543 814901 700215 535877 608419
17005 608419 766183 493292 915939 582685 888646 727561 706699 922105 748092 739870
16995G39870K84853m3554k20830P0883q625j84866o6039Q2648k826L96515n4673
16984I93356j06784K914k06883K6349R9823L91797l52725k38782j13531L96017
16974H91551k71489L77194D02752O24074L7716L722n5461k17074k06370P05810
16964A295169n20803J8935q0248L51291k29475m2386J82939M7488j62864M18486
16954A278532m18066L48667N1134j67349j30558K27792k10747M85728l89106O4531
16944A140558q9947J08436o7879R9081k03677L60857k07810l91054M44002j57623
16934A034944m6911M49754m01658M76290j70114Q7763l29997K17011Q4301j72577
16924A228806j10295K59250j1380l38576L01463P7910K85695r4767k52588o5383
$$ plain form
16995 739870 1024723 981169 760339 831222 822597 637731 571692 654340 651514 1048029 993356
16984 993356 886572 889486 682603 708952 808775 1200572 847847 609065 495534 891551
16974 891551 620062 997256 402752 1026826 1064542 1068264 1012803 795729 589359 1295169
16964 1295169 774366 793301 713053 1064344 834869 792483 975422 1022910 860046 1278532
16954 1278532 860466 1209133 1260267 1092918 962360 1190152 979405 1465133 1076027 1140558
16944 1140558 1050611 1159047 1091168 1190249 986572 1347429 1139619 748565 1192567 1034944
16934 1034944 988033 1437787 1036129 1512419 1342305 1430068 1100071 1317082 1401383 1228806
16924 1228806 1118511 1377761 1366381 1027805 1329268 1407178 1692873 1598106 1345518 1280135
16914A280135J70963K90545n4287j37568m4612M68760l69401k11281L71340m80832
16904A283762P9985L430n8343N19418k74543J13815N5964J22427l80845R8802
16894A563872M10019j30177J12262j05705o8108K97799k45990p4677J33808K87279
16884B180382l17786P6525J45918k71013p473N82113j74597M85l55433N3305O2275
16873A974701M54293j07967J08175r5119r8451Q0372j75672K77223L29277k03952
16863B542880k05589M22143m18648L04676Q7771j84315J47818k5592q7616L06051
16853B889579p7409k5183M73197j06991p2486l1542J4764K01856J42985m50927
16843B957843M17297l41064L35858J64632J14723P9320j90457k9740N11918l79428
$$ plain form
16914 1280135 1451098 1741643 1687356 1549788 1505176 1973936 1604535 1393254 1764594 1283762
16904 1283762 1363747 1367177 1308834 1828252 1553709 1667524 1723488 1845915 1465070 1563872
16894 1563872 1973891 1843714 1955976 1850271 1782163 2079962 1833972 1759295 1893103 2180382
16884 2180382 1862596 1939121 2085039 1814026 1806553 2388666 2214069 2214554 1859121 1912426 1974701
16873 1974701 2428994 2321027 2429202 2334083 2235632 2316004 2140332 2417555 2746832 2542880
16863 2542880 2337291 2759434 2340786 2645462 2733233 2548918 2696736 2671144 2583528 2889579
16853 2889579 2812170 2786987 3260184 3153193 3080707 3049165 3063929 3265785 3408770 2957843
16843 2957843 3375140 3034076 3369934 3534566 3649289 3728609 3538152 3508412 4020330 3640902
16833C640902K63490p357K21320j32817J70748o7400K28653J0449k30457K24443
16823D321974L20248p0918K32580J32988J52289k70612J50180j4151L57650j84730
16813E127498L87533k64265L51691k60225M72929J58910r0820N3816J70201K67924
16803F375192M11141l32756L61178L51028K00243j41029K83999J74896J06971
16794G790863l91022Q97959R5961K12733L45176j1941K81698p4281K27906N45170
16784I920222N06L54853K82205K65436J16368L80832N61080r8029K00169M83247
16774A2466889L46258K51396P67735K7707N94566L74896L92332L83408Q57766
16765A6462953J68914P58502L81291O81555O93766N34171L04239R27188J263086
$$ plain form
16833 3640902 3904392 3897035 4118355 3985538 4156286 4088886 4317539 4327988 4097531 4321974
16823 4321974 4642222 4571304 4803884 4936872 5089161 4818549 4968729 4954578 5312228 5127498
16813 5127498 5515031 5250766 5602457 5342232 5815161 5974071 5883251 5937067 6107268 6375192
16803 6375192 6786333 6453577 6814755 7165783 7366026 7224997 7508996 7683892 7790863
16794 7790863 7399841 8297800 8393761 8606494 8951670 8939729 9221427 9147146 9375052 9920222
16784 9920222 9920728 10275581 10557786 10823222 10939590 11320422 11881502 11783473 11983642 12466889
16774 12466889 12813147 13064543 13832278 13859985 14454551 14829447 15221779 15605187 16462953
16765 16462953 16631867 17390369 17771660 18453215 19146981 19681152 19985391 20912579 22175665
16756B2175665J18332J185935N46630J240534L11146J340189R91056J148757R62607
16747C0020851J437069J204241J571496J210611J738133J501469J916112J859041
16739D2459023J977868J971424K003464K805050K126477K643737K924489L167226
16731F2078758L482036L014935L987785L825220M299898M304125M443474N177160
16723I4613391M714791N688674N512249N929281O263597N914961O178531O465436
16715A41280911N916363O090115O152640N143444M929917M401266L521932K516140
16707A79952728K037325O40056L93887j707495j626719k974367l673387m498541
16699A68543487n247123n133182o261048n806585o772081o044139o261426n953756
$$ plain form
16756 22175665 22293997 23479932 24026562 25267096 25578242 26918431 27909487 29058244 30020851
16747 30020851 31457920 32662161 34233657 35444268 37182401 38683870 40599982 42459023
16739 42459023 44436891 46408315 48411779 51216829 53343306 55987043 58911532 62078758
16731 62078758 65560794 68575729 72563514 76388734 80688632 84992757 89436231 94613391
16723 94613391 99328182 105016856 110529105 116458386 122721983 128636944 134815475 141280911
16715 141280911 147197274 153287389 159440029 164583473 169513390 173914656 177436588 179952728
16707 179952728 181990053 182630109 183023996 181316501 179689782 176715415 173042028 168543487
16699 168543487 163296364 158163182 151902134 146095549 139323468 133279329 127017903 121064147
16691A21064147o129434n885652n842723n231309n180337n205855m514426m111598
16683G8962813m244286l982111l902832l602380l131940k938564k804462l067013
16675E1289225k432077k273665k329144j842079k265273k043415j443130j838801
16667C4821641j375040j268740j165329j612996j185228j060101j254633q33781
16659B5065793j074923q30486q14790p01556r97248p37825m71440q65941o57395
16650A7914189o89556n11292k70633p68853n09266n31323o08467N1215p63857
16641A3312157p0071o73951j08470m82163n23779l88677k21376l02909l63330
16632A0177431l14596m4337n99820J82494o99499L25677k54958k32112n00677
$$ plain form
16691 121064147 114934713 109049061 103206338 97975029 92794692 87588837 83074411 78962813
16683 78962813 74718527 70736416 66833584 63231204 60099264 57160700 54356238 51289225
16675 51289225 48857148 46583483 44254339 42412260 40146987 38103572 36660442 34821641
16667 34821641 33446601 32177861 31012532 29399536 28214308 27154207 25899574 25065793
16659 25065793 23990870 23160384 22345594 21644038 20646790 19908965 19437525 18571584 17914189
16650 17914189 17224633 16713341 16442708 15673855 15164589 14633266 14024799 14076014 13312157
16641 13312157 13242086 12568135 12459665 11977502 11453723 11065046 10843670 10540761 10177431
16632 10177431 9862835 9818498 9218678 9401172 8701673 9027350 8772392 8540280 8039603
16623H039603J19216l26698l13338J27908m07174j22659j23210l41936J78187
16614F829899k93744k46254K8263k59603j8882P9006o40293N58245n56130l34528
16604E145979j21779L38087l74669l2836J6046l70658J78364J45179k85524r3497
16594D544692r1483q6837j5676k055m20662J08556Q9450k89333p6799M7301n2313
16583C754841L14461n45916j77315J16099K86595l81146j06738L56354l35185
16574C282050M6204n6210j00582l17201K20643q0330n288j79619j85350O40730
16564C265047n84625Q4761m6112q6368j73293J35777j17269L4068l13681K1799
16554B220104k4964J05328j58568l03423N90166n36935K20623j42039Q9949j09504
$$ plain form
16623 8039603 8158819 7832121 7518783 7646691 7239517 7116858 6993648 6651712 6829899
16614 6829899 6536155 6289901 6318164 6058561 6039679 6118685 5478392 6036637 5480507 5145979
16604 5145979 5024200 5362287 4987618 4954782 4970828 4600170 4778534 4923713 4638189 4544692
16594 4544692 4453209 4366372 4350696 4348641 3927979 4036535 4125985 3836652 3759853 3807154 3754841
16583 3754841 4069302 3523386 3346071 3462170 3748765 3367619 3260881 3617235 3282050
16574 3282050 3328254 3272044 3171462 2854261 3074904 2994574 2989286 2809667 2624317 3265047
16564 3265047 2680422 2765183 2719071 2632703 2459410 2595187 2477918 2511986 2198305 2220104
16554 2220104 2195140 2300468 2141900 1838477 2428643 1891708 2112331 1970292 2060241 1950737
16544A950737l0314k04136K44653r6526J08913L5365j01834j79522K77781k53959
16534A751158j37139J28722j65957J99935j23512j15182J98080k52792K77309
16525A760622l98833M82372l43413n3733K32924o30485M26590j23542L90196J6849
16515A759547l22877l6103q067L7638J4730k78469L47610n64628J72776P0030
16505A192187J17575p324J98115j89064o6170j73776M64423n25785M55708k44164
16495A221725j78900j5850K21326l76953J94123J42809j42145j03197K30738j94978
16485I98698J16058q6033J54295o9007k91566M57599j01165m0999L3217m13450
16475G57647K12226j14242K91277k09607m9337m3809O4168L81051l55246k9820
$$ plain form
16544 1950737 1920423 1716287 1960940 1864414 1973327 2008692 1906858 1727336 2005117 1751158
16534 1751158 1614019 1742741 1576784 1776719 1653207 1538025 1736105 1483313 1760622
16525 1760622 1361789 1844161 1500748 1447015 1679939 1049454 1476044 1352502 1742698 1759547
16515 1759547 1436670 1400567 1392500 1430138 1444868 1166399 1514009 949381 1122157 1192187
16505 1192187 1309762 1302438 1500553 1311489 1245319 1071543 1535966 1010181 1465889 1221725
16495 1221725 1042825 1026975 1248301 871348 1065471 1208280 1066135 962938 1193676 998698
16485 998698 1114756 1028723 1183018 1114011 822445 1280044 1178879 1137880 1171097 757647
16475 757647 969873 855631 1146908 937301 887964 844155 908323 1289374 934128 904308
16465I04308O259K02991m32046L0237K37696l62620J13823J39967j44586K23061
16455I19090l1830j87158k32462K53454m7659j24932J67535j54934K03950k66537
16445D98517K64256K9164j60528j74K27317m8405k4240l2916k47875L8420J97282
16434G40818j9421J31312C59557K30787Q2507j42751K50554P8252l59000r0760
16424D09146j99040L78428o4268R9550j67992L8096J41382k10760N1640J84924
16414F61106C04918N57578l91807B24910K22308N2968j25199m0915K6106p048
16404C53130q0375K89994k02716K34926j25642j08664L90932k95364n1499K05835
16394F10557B45780J30517n4327L37227k83715K47512j28865j53853k6699K9220
$$ plain form
16465 904308 910567 1113558 681512 711749 949445 586825 700648 840615 696029 919090
16455 919090 887260 700102 467640 721094 673435 548503 716038 561104 765054 498517
16445 498517 762773 791937 631409 631235 858552 810147 785907 752991 505116 543536 740818
16434 740818 721397 852709 359557 590344 672851 530100 780654 858906 499906 409146
16424 409146 210106 588534 524266 623816 455824 493920 635302 424542 476182 661106
16414 661106 304918 862496 470689 224910 447218 500186 374987 334072 360178 353130
16404 353130 272755 562749 360033 594959 469317 360653 751585 456221 404722 610557
16394 610557 245780 376297 321970 659197 375482 622994 494129 340276 313577 342797
16384C42797J44863B37058N3370M2963P400k0146K95165l8786j01220l2213j16538
16373C27053J31027J39403A47424J72670C9620J57264K24889A79698L43044j77828
16363C44914j49273p5542M02554A47127G0413O23818l29312I6766O0301R2418
16353B49485J18696j38405K9098J60876A06478m8100L28152m5310r2034j17389
16343A31797J98117J94304k29192J30641I8577L07842P3570j30879p1190M1662
16333C19582A54933J63241o596J1656K09571F8523N99662A55533J21919m5261
16323B32191j02380K81116J5604B12346J4651K15913B01794G8226M18828c5903
16312B76666j01413p4423J71986k7982I0484M2900P5770M6959n7986K1429K7156
$$ plain form
16384 342797 487660 237058 290428 333391 340791 320645 615810 577024 475804 443591 327053
16373 327053 458080 597483 147424 320094 39620 196884 421773 179698 522742 344914
16363 344914 195641 120099 522653 147127 70413 694231 364919 96766 157067 249485
16353 249485 368181 229776 258874 419750 106478 58378 386530 341220 249186 131797
16343 131797 329914 524218 295026 425667 98577 406419 479989 349110 277920 319582
16333 319582 154933 318174 311578 323234 532805 68523 668185 155533 277452 232191
16323 232191 129811 410927 426531 212346 226997 442910 201794 78226 497054 -35903
16312 276666 175253 100830 272816 244834 90484 133384 209154 256113 198127 219556 246712
16301B46712q966m568m7261p1676A9224J43728J73121J5205n3461j16251k5459
16290A56107K47707I2751Q6602E2036K51419O570J74629B578L40802e6660n8311
16279a14971A52545p553l5612K5042l8366c1938E0089J50174J38771Q9884c9751
16267b1067A96980J57575A76560J88788b9929C1417J38398M52160B76373K38166
16257E14539A12072C7376A5943L6867L00178C1498R5147M1102l368d6499D31635
16245A279L0524K06457d2802A81124d9472A77311R7359m1082B7060K0403N13326
16234E60789G2867h048B28181d0448C1487J11404R7424a87530A58852K6399G0451
16222a01418C82297a42490C86580m5133p5556I6850J9857A8426d2421B56071I2943
$$ plain form
16301 246712 237746 233178 185917 114241 19224 162952 336073 351278 297817 181566 156107
16290 156107 403814 92751 179353 52036 303455 310025 484654 2578 343380 -56660 -114971
16279 -114971 152545 144992 109380 134422 96056 -31938 50089 200263 339034 428918 -39751
16267 -21067 196980 354555 176560 365348 -29929 31417 169815 621975 276373 514539
16257 514539 112072 37376 15943 52810 352988 31498 126645 167747 164379 -46499 431635
16245 1279 31803 238260 -42802 181124 -49472 177311 274670 233588 27060 47463 560789
16234 560789 72867 -8048 228181 -40448 31487 142891 240315 -187530 158852 185251 70451
16222 -101418 382297 -142490 386580 341447 265891 96850 116707 18426 -42421 256071 92943
16210A37921J01366A03383a4435B35618a6314B18043n8000h297k2164A11693P1934
16199A83627d0536A56072K6328K1747Q0733b2557A41507J53713B0525K13008Q4871
16188C18404C1514l851A0521J13970L7053a63815A34245a36193A77960K04501
16178C82461d1160A6033L70266h8014B62434I291e8882F285R3269j8641a39109
16166I8649b39036r439a01753A82848F278J69293d5261G3101j5571b0618B8876
16154H1546k7061j9353K11371a93806A81430b5994G0376E246O8631I155K12369
16143B21524i4801k06567B24613o122a45412C84086e797I4938a20975A50531b02006
16131H0161b3988j00816A04707O6171e42037B02425b39687a09173C48632e7102
$$ plain form
16210 137921 239287 103383 -14435 235618 -16314 218043 160043 -8297 -30461 111693 183627
16199 183627 -40536 156072 182400 204147 284880 -22557 141507 295220 20525 233533 318404
16188 318404 31514 27663 10521 124491 161544 -163815 134245 -136193 177960 382461
16178 382461 -41160 16033 386299 -88014 262434 9291 -58882 6285 99554 80913 -139109
16166 98649 -239036 -248475 -101753 182848 6278 175571 -45261 73101 57530 -20618 28876
16154 81546 54485 35132 246503 -193806 181430 -25994 70376 5246 73877 9155 221524
16143 221524 -94801 -301368 224613 218491 -145412 384086 -5797 94938 -120975 150531 -202006
16131 80161 -23988 -124804 104707 170878 -542037 202425 -239687 -109173 348632 -57102
16120A01386f3352B0475f4256j8370K2661l43I5925c2543A14116b05592A60460
16108b32363R7284D7856Q9017c4823I2162b84281f8223A96461E4918A7168a75921
16096G0824a6785F5545a34845A71388M7458J65632a97942k2211C80859a28740
16085a47059N8229p0599A19410L5805b0789E2532R8930O8810m3539a45140C20789
16073c273I2386N6863f8391h795B66784g9838A59192m5537D1610h3539j68777
16062b52316C17601C0625M4204j3488a42656F169a23551L2603I2189a84424d2547
16050B80006f3589B06650a37663O1213A91830p1150C1995H444c6931M903A90593
16038b4552q974j23138L2380I0137J48567b2047I788K0649c36374a0506I4365
$$ plain form
16120 101386 -63352 20475 -64256 -82626 -59965 -60308 95925 -32543 114116 -205592 160460
16108 -232363 -135079 47856 136873 -34823 92162 -284281 -68223 196461 54918 17168 -175921
16096 70824 -16785 65545 -134845 171388 218846 384478 -197942 -220153 380859 -128740
16085 -147059 -88830 -159429 119410 155215 -20789 52532 151462 220272 176733 -145140 320789
16073 -3273 92386 149249 -68391 -8795 266784 -79838 159192 113655 41610 -83539 -252316
16062 -252316 317601 30625 74829 61341 -142656 6169 -123551 -90948 92189 -184424 -42547
16050 280006 -63589 206650 -137663 -76450 191830 120680 31995 8444 -36931 -32028 190593
16038 -24552 -33526 -156664 -124284 90137 238704 -22047 9788 30437 -336374 -10506 94365
16026H6043g9632p2634O7114C87677A0671g5280B29425h92j68565c0347I6822
16014g3701j2105o3543B4362L9104e7346A89921m3429R8590b05298O7696A92235
16002e062k9536k0860m4609j64248A11017J4850A9787b02105m42C27081j42437
15991A84644b9828k0044j518C9027P0406c93258D34443b49909E2280a77856A12293
15979B24404a63587B63058b14243B06797I4252j3391c88487D4976J11566C8319
15968D30888L1347B12956k3445J26436l569A54786F5684e4677j25981d0472H7973
15956A12890b53187e960n2003k04075a2913j68919E3723A8501e7013m1755G5419
15944A91107a35193E1049N3731b2760k63697h3454I013a3890G1867h366A71454
$$ plain form
16026 86043 -79632 -152266 -85152 387677 10671 -75280 229425 -892 -169457 -30347 96822
16014 -73701 -85806 -149349 24362 63466 -57346 189921 146492 245082 -205298 -137602 192235
16002 -5062 -34598 -55458 -100067 -264315 111017 125867 19787 -202105 -202547 327081 184644
15991 184644 -29828 -49872 -51390 39027 109433 -393258 434443 -249909 52280 -177856 112293
15979 224404 -163587 263058 -214243 206797 94252 80861 -388487 44976 156542 38319
15968 430888 462235 212956 189511 315947 312378 154786 65684 -54677 -180658 -40472 87973
15956 112890 -253187 -5960 -57963 -262038 -12913 -181832 53723 18501 -57013 -98768 75419
15944 191107 -135193 51049 104780 -22760 -286457 -83454 9013 -13890 71867 -8366 171454
15932d48640A2476g5160B00241A7849a14449N6429B23402b99227j4277B05350
15921a8610D5971K9547a33873A29069a0475l65036J82539B12614c11497A7132
15910c00733f4700p8283e5357l9446A27848J12866r3120o2988k0491N9108m6137
15899G7086a65927F906a65431f555j95704A19404e3808I7682a14617M5984m3738
15888a12371j36502P9265G7165k6784d01438a20089L501j5365m6373B96615E1433
15876a18563m0238I3721h1087C21M8554h2190a9474O163j27464L9812k02220f0037
15863a1429B29921g361q4471d5312j1277A65494a84853j5572r2709K6537k7781
15852b94378F7137L22192a40845d3292A63075a86692a9558n2199l10519B32042
$$ plain form
15932 -448640 12476 -75160 200241 17849 -114449 -58020 223402 -299227 -313504 205350
15921 -18610 45971 75518 -133873 129069 -10475 -375511 -192972 212614 -311497 17132
15910 -300733 -64700 -142983 -55357 -94803 127848 240714 147594 84606 64115 123223 77086
15899 77086 -165927 6906 -165431 -6555 -202259 119404 -53808 97682 -114617 -68633 -112371
15888 -112371 -248873 -169608 77165 50381 -401438 -120089 -116588 -131953 -178326 296615 51433
15876 -118563 -158801 93721 -81087 321 48875 -82190 -19474 -13311 -140775 -100963 -303183 -60037
15863 -11429 229921 -7361 -91832 -45312 -56589 165494 -184853 -200425 -293134 -266597 -294378
15852 -294378 67137 389329 -140845 -43292 163075 -186692 -19558 -71757 -382276 232042
15841A13683B5537L1679a60607N9347F0856j9833P9128O8743J4128a92263O9492
15830a22771k3937M0428A29876b55716J0182C27625A7004o008K25803c43478b2926
15818d68767G4825a6374G0283J97234M4287A15594R439a74196L7723j28744J20045
15807a45172k3081H7164c17418e9861j97867A45192a27724C3832H400K37589b42002
15795b85563J16102j54086e0640m4602G9893J27477D8731K12915A04578P0660
15785A75238a69130A08625d5672r2578k53974J05014b9234B3078J57317a95250
15774G5122K36551A55157M8648a2684k63134A65710i7926C4079b9208k58967e5246
15762B58735c0098C4123d2612A47878a52266L6184I0092a55242k10931C89624
$$ plain form
15841 113683 25537 57216 -160607 -101260 60856 41023 120151 188894 203022 -192263 -122771
15830 -122771 -146708 -106280 129876 -255716 -245534 327625 17004 10996 236799 -343478 -22926
15818 -468767 74825 -16374 70283 267517 311804 115594 125033 -174196 -136473 -265217 -145172
15807 -145172 -168253 87164 -317418 -59861 -257728 145192 -127724 33832 8400 245989 -242002
15795 -285563 -169461 -323547 -50640 -95242 79893 207370 48731 261646 104578 175238
15785 175238 -169130 108625 -45672 -138250 -392224 -287210 -29234 23078 180395 -195250
15774 75122 311673 155157 203805 -12684 -275818 165710 -97926 34079 -29208 -288175 -55246
15762 258735 -30098 34123 -42612 147878 -152266 -116082 90092 -155242 -366173 389624
15751C9074a09051a1679j49765e5919A86857C7611c57491A49104E5047R8511G5382
15739b2645o4146A33486e4686D21119I0479c33544I4247a95122r523m827A58294
15727b19451f8775a4232j80726J1364O4122I1282a67619A67920a476C78966b0585
15715F276d0673l2438k39947A51044c45090B29124l3050c86710A61327n500c21688
15703A59540h2509L6200a7275j89918a00275H6992B153g9318k74280a9949B81091
15691a70973B4334O1095a3937j50901N2880J6987F7662b00287B42337r6330a6533
15679A96186c41598f9827A12708R1492F6514b36902B3413J67122Q1825h5492c0867
15667A0753a53164g1802j49476O217j7396C3493K7526a53052C04488d82819b09470
$$ plain form
15751 39074 -109051 -11679 -161444 -55919 186857 37611 -357491 149104 55047 153558 75382
15739 -22645 -86791 133486 -54686 421119 90479 -333544 94247 -195122 -204645 -209472 158294
15727 -219451 -68775 -14232 -194958 -183594 -119472 91282 -167619 167920 -1476 378966 -20585
15715 6276 -40673 -73111 -313058 151044 -345090 229124 196074 -386710 161327 155827 -321688
15703 159540 -82509 -46309 -17275 -207193 -100275 86992 2153 -79318 -353598 -19949 281091
15691 -170973 24334 85429 -13937 -164838 -111958 -94971 67662 -200287 242337 146007 -16533
15679 196186 -341598 -69827 112708 204200 66514 -236902 23413 190535 272360 -85492 -30867
15667 10753 -153164 -71802 -221278 -215061 -232457 33493 61019 -153052 304488 -482819 -209470
15655f8183A7092b1103A85947F4103M716c09531d3322R758n3564C40557b57731
15643b1652A23229a1971k29061a10912B8198b48004Q0187M5103A85840a27016
15632B83372F4575A8618c9178r0962j27560A55727j4803b5109j84335C0825f5388
15620A34344a19246n6288c8339C0527a99447j06773J27866G3724K11133a50972
15609a92162n8373B12541B0355i6955A25539K6050c19413I8206a47151B33519
15598A50536g5469F2752a45313c0431j20366d4963E695L6055a76507F399K39471
15587B45870a69685k68266h2744l5848D2626J50567f4031G0407b4197r2980N0592
15576f6585K5663D1559K53791m4286n7401N7421G9111f1177A23950b85439B59097
$$ plain form
15655 -68183 17092 -21103 185947 64103 68819 -309531 -43322 -33564 -87128 340557 -257731
15643 -21652 123229 -11971 -241032 -110912 28198 -248004 -167817 -122714 185840 -127016
15632 283372 64575 18618 -39178 -130140 -257700 155727 140924 -25109 -209444 30825 -65388
15620 134344 -119246 -175534 -38339 30527 -199447 -306220 -178354 73724 284857 -150972
15609 -192162 -250535 212541 20355 -96955 125539 151589 -319413 98206 -147151 233519
15598 150536 -75469 62752 -145313 -30431 -150797 -44963 5695 41750 -176507 6399 245870
15587 245870 -169685 -437951 -82744 -118592 42626 193193 -64031 70407 -24197 -117177 -66585
15576 -66585 -40922 41559 295350 251064 193663 251084 79111 -61177 123950 -285439 259097
15564a28438o8212i31j02314C9643g9225j1676B57750b0822p6554j98112B2369
15552g6647A19386b35275m954R5366C0417c1847I3384J52027h7161A65665C7950
15540A92070d2269D6737b2578A83708o6758c7205m84181f7215A40648a80423H2373
15528A66203a37896f3218j69038A53684E4155K16071a84198N7627B3826a50326
15517A12240b7884n2142B20339A09608m1942l741b96547d980j75893k1537P4181
15506a28229A36347o5489O6557c42242A95008c3111k51416B27938c33801D32950
15495a29301A13860J98625l1601A1056J04721K81308e594G2621M2778d5485J5284
15484c0201B47289j7293e1885p5769a9255j96161R5195k51673A27347E7274a63896
$$ plain form
15564 -128438 -196650 -931 -103245 39643 -79225 -90901 257750 -20822 -97376 -295488 22369
15552 -76647 119386 -235275 -240229 -144863 30417 -31847 93384 245411 -87161 165665 37950
15540 192070 -42269 46737 -22578 183708 116950 -37205 -521386 -67215 140648 -180423 82373
15528 166203 -137896 -63218 -232256 153684 54155 270226 -184198 -126571 23826 -150326
15517 112240 -27884 -80026 220339 109608 67666 63925 -296547 -4980 -180873 -202410 -128229
15506 -128229 136347 70858 137415 -342242 195008 -33111 -284527 227938 -333801 432950
15495 -129301 113860 312485 280884 11056 115777 397085 -5594 72621 115399 -45485 -30201
15484 -30201 247289 229996 -51885 -127654 -19255 -215416 -120221 -371894 127347 57274 -163896
15472D8904J7161f4881j80962C329a82037K2114r1688A4174J49935p1696f67A23048
15459B7426K82953a27552B70702b51264L2908J8943D2487a81684E3663M6150L1444
15448A31257B6084J48983b17517o4167A06455J4798L303c79A4092a24350c3824
15436I6576C0145J85650a41757B8487M6253d1242h271I5888g3464J133A4859a93493
15423B16499O5170r9835a83152p0583g3767A72484N7871b04651j0867J2950k27598
15412d30166F1188i177B0444N7652M5874a21616o5093F4662O5159q646n8007e205
15399b75001B34148h1987E2963b25861B90982F6118h6140L6903A7787J57658p6861
15388I8584K95022a00541D7849c0054A91733p8125d77429f6187k84899B42526
$$ plain form
15472 48904 66065 -64881 -245843 3329 -182037 -159923 -251611 14174 164109 92413 -667 123048
15459 27426 310379 -127552 270702 -251264 -218356 -199413 42487 -181684 53663 99813 131257
15448 131257 26084 175067 -217517 -281684 106455 121253 124556 -379 14092 -124350 -33824
15436 96576 30145 215795 -141757 28487 74740 -41242 -8271 95888 -73464 -72331 14859 -193493
15423 216499 281669 181834 -183152 -253735 -73767 172484 230355 -204651 -215518 -202568 -430166
15412 -430166 61188 -9177 20444 78096 123970 -121616 -186709 64662 129821 121175 63168 -5205
15399 -275001 234148 -81987 52963 -225861 290982 66118 -86140 -49237 17787 175445 98584
15388 98584 393606 -100541 47849 -30054 191733 113608 -477429 -66187 -351086 242526
15377B58834a75618A76536c37270J61060d3621B5415b25746G2900O5916m6367
15367I2449m1466J47538I5067a63971q4634N0046J7560P7435i800j04845k16048
15356c30693B12661K189a05965k2831E0537a93946B34620e7929K7737j6459p5397
15345a22048j198m5856N8635A48003l6131a32574A8551g0981D4725A7248J40146
15334A57394o9389N7137n0046b7862j97332A38575D8421a47768N44b1633j77353
15323a98986J1261d8002a496I7506c0383A72261a95420m3449a5572B8442a54300
15311B2101L6733a26941A55612E1143K03456A05800M2372a72223b9038j10672
15301a39710D31614B9011e8212A90302l7752k9414c8274m8853j70039p5240A28608
$$ plain form
15377 258834 -175618 176536 -337270 -176210 -43621 25415 -225746 72900 138816 92449
15367 92449 50983 198521 95067 -163971 -248605 -198559 -180999 -103564 -9800 -114645 -330693
15356 -330693 212661 214850 -105965 -128796 50537 -193946 234620 -57929 -30192 -46651 -122048
15345 -122048 -123246 -169102 -110467 148003 111872 -132574 18551 -70981 44725 17248 157394
15334 157394 88005 145142 95096 -27862 -225194 138575 48421 -147768 -147224 -21633 -198986
15323 -198986 -187725 -48002 -1496 97506 -30383 172261 -195420 -238869 -15572 28442 -154300
15311 22101 58834 -126941 155612 51143 254599 105800 148172 -172223 -29038 -139710
15301 -139710 431614 29011 -58212 190302 152550 123136 -38274 -87127 -257166 -332406 128608
15289b08883O1975G9970L5308l7971M796a516E1814B563R3967K69994A49362k53
15277A49109a44389A18554J17508N0395b36313A88322d36611a97202C7154a44134
15266e5602m9046A92032c5905k9987b57A49323J2215J88687j37827c41645C68826
15254G1048O6635l4506o093J60189J63573r8267B0111J82554i5083H4698J67510
15243B52208c0239B26949i4542E38190A05720K51237r6645K80288L1056j8294
15233E53362N90798Q4863j5342k0967l3285B75191k9687j12102c3111A08208J94660
15222C02868A23656J99840c1821C00128K05239b6221A76569o6940c4241A90607
15211B15321j05120h1523B78568e6383i770l60301A87671K2619f1487a374l4526
$$ plain form
15289 -208883 -146908 79970 115278 77307 82103 -1516 51814 2563 96530 366524 149362 149109
15277 149109 -144389 118554 236062 286457 -236313 188322 -436611 -197202 37154 -144134
15266 -55602 -104648 192032 -35905 -65892 -257 149323 161538 350225 212398 -341645 368826
15254 71048 137683 103177 97084 257273 420846 322579 20111 202665 -95083 84698 252208
15243 252208 -30239 226949 -94542 538190 105720 356957 260312 540600 571656 553362
15233 553362 1144160 1229023 1213681 1192714 1159429 275191 245504 133402 -33111 108208 302868
15222 302868 123656 323496 -31821 300128 505367 -26221 176569 109629 -34241 190607
15211 215321 110201 -81523 278568 -56383 -9770 -370071 187671 210290 -61487 -1374 -35900
15200c5900a5466j97173a01556B8468c13q5842I8767E260a99647A28507L39287
15189D67794H6005p750K19087b40143B21555a72755h4604B14920a26916B07292
15178h3797C7310a01499n6231A91694a03086d5560G6322K3134i3695B8601Q5959
15167A14560l0540D547N2959a04241D6763J08517a68801k3783j47800A73581J369
15156A74950O2220E3539L16582f4913E5134j0057A1613g2913E42709F2088q987
15145E3101b5019G8389c79342a58419F8641J5038b24974B33810A03113a03697
15134A82360C7370f2738I6616L08475j21915p2162n5641A7592h7929K6209A1822
15122A45915k9432h2793A98962M0424J3835m1829A469L18748j19870q7829N39779
$$ plain form
15200 -35900 -15466 -212639 -101556 28468 -313 -86155 98767 5260 -199647 128507 467794
15189 467794 86005 78255 297342 -240143 221555 -172755 -84604 214920 -126916 207292
15178 -83797 37310 -101499 -157730 191694 -103086 -45560 76322 99456 -93695 28601 114560
15167 114560 84020 4547 57506 -104241 46763 155280 -168801 -192584 -340384 173581 174950
15156 174950 237170 53539 370121 -64913 55134 45077 11613 -72913 542709 62088 53101
15145 53101 -25019 78389 -379342 -158419 68641 83679 -224974 233810 103113 -103697
15134 182360 37370 -62738 96616 405091 283176 211014 155373 17592 -87929 -61720 11822
15122 145915 116483 -82793 198962 239386 253221 211392 1469 320217 200347 112518 652297
15111F52297B68173a8608A15464f4900B71467O0761j43853J13212b5246H8616
15100C06044G4877e1943A67710J3528k2598m3756c0038l49938A25030d1828A21006
15088C5739a75019O0443C37551o3361M839R260a55987A8499a6667A44712L33330
15077D78042k8044A60006J71457K8530j74315q7407K12982L8054b83990A35495
15066b90485C42554A05093J34728a59934A61242a8722A43165e9985D91966j74110
15056C17856G1415R8651p6454a32840E0704N5671N2418c1625B08218J75575e9163
15044f8634C04818n5639G8667b3572H9026L09593o6260K45954F1188K35309J25359
15033D21856D4227A9722J35516J86137a35291B79346J35581J37738j99890A48444
$$ plain form
15111 652297 268173 -18608 115464 -64900 271467 332228 188375 301587 -25246 88616
15100 306044 74877 -51943 167710 181238 158640 114884 -30038 -379976 125030 -41828 121006
15088 35739 -175019 -114576 337551 274190 279029 288289 -155987 18499 -16667 144712 478042
15077 478042 449998 160006 331463 359993 185678 98271 311253 349307 -283990 135495
15066 -290485 342554 105093 239821 -159934 161242 -18722 143165 -59985 491966 317856
15056 317856 71415 170066 93612 -132840 50704 106375 158793 -31625 208218 383793 -59163
15044 -68634 304818 249179 78667 -23572 89026 398619 332359 578313 61188 296497 421856
15033 421856 44227 19722 155238 341375 -135291 279346 414927 552665 352775 148444
15022C35738O5576H1957J23503P921p1917n6698k8190J25849a42142B17533m1162
15011A76371l7647E0436L68080j74109N6251N0934A4544J55213G36M5279A2049
14999A48501l3968k1793J01670J355H1025J72305J29918Q4671G0677L28916d5951
14987B32045F8240e9773B93994J40725b41935a03198B17004K31155A67919J2857
14977A80776l0895J41793r0032I169L08955p3213a88046C34188L06j06186J69004
14966C97312j67917e8186A84819b15056A94988k4392L1616B7J61852i9529G3943
14954I2161J63578M288D2222L37576J32499I8483L90264B30771R8121j57149O3751
14943B35494K5521j00227L76752B03821J97764H5312J53361L25069A09856a392
$$ plain form
15022 335738 401314 81957 205460 213381 141464 84766 56576 182425 -142142 217533 176371
15011 176371 138724 50436 418516 244407 300658 351592 14544 169757 736 46015 12049
14999 148501 114533 92740 194410 195765 81025 253330 383248 467919 70677 399593 -45951
14987 232045 68240 -59773 293994 434719 -241935 -103198 217004 448159 167919 180776
14977 180776 149881 291674 201642 9169 318124 244911 -188046 334188 334494 228308 397312
14966 397312 229395 -58186 184819 -215056 194988 170596 202212 27 161879 -99529 73943
14954 92161 255739 260027 42222 379798 512297 98483 488747 230771 328892 171743 235494
14943 235494 261015 160788 537540 203821 401585 85312 238673 563742 109856 -1392
14932D31134H7760N25105k84563J6584J65059B22991L1522l6449L58351e8766
14921B3837K10529J08640j66548K16499j54289R3198B7830a00955B81285J31213
14911D12498j34869l6422L12744j53908A98479P8309j01059r814J62442h2401
14900D13072C5623M95439j1810k57130A22065P6741N0986j357K92462B26312j9232
14889B07080J1402M43517A32572Q9075q6602J23112r0683K38991r5350K35447
14879E46562A53719K39230l2729j62208J93939A39371L12317N121j19308q8875
14869B48626J71514l2088L01350j99775j59829A6361N27412k5663j43408J30211
14859E04913A63195P1827n5732r297K47493O3575k0769j23492j09764K73289B17799
$$ plain form
14932 431134 87760 612865 328302 344886 509945 222991 254513 218064 576415 -58766
14921 23837 234366 343006 176458 392957 238668 331866 27830 -100955 281285 412498
14911 412498 277629 241207 553951 400043 198479 276788 175729 165915 328357 -82401
14900 413072 35623 531062 519252 262122 122065 198806 249792 248435 540897 226312 207080
14889 207080 218482 661999 132572 221647 135045 258157 167474 406465 311115 546562
14879 546562 153719 392949 360220 198012 391951 139371 451688 456809 337501 248626
14869 248626 420140 388052 689402 489627 329798 16361 543773 518110 374702 504913
14859 504913 163195 235022 179290 169993 417486 481061 460292 336800 227036 500325 217799
14847B22488L76113A19403J92849Q8531j0009N3082n3636J33909j00471J59348
14837E83006j59753m2237m2047J83098O3161j15542A43519K55530j82834K14407
14827D30622A87239K06951a6999D05877j20927K52631j95966O2345j24904J19546
14817C98602K69351k62890j22611L83904A49050K55327J04493J05196m9371k10943
14807C53752K7194O4909j17278K65571L438j89833J93026A20275K76151J10537
14797E06963k52431J61534L03798l59615L83922A94349M09428p2985k46076j4451
14787B70265J91643M26039A64089M38793j61102o899j24268J20656R1610O9823
14777E92702k33512J60857r2243J34857q831j3668K00647j65733K67427k13649
$$ plain form
14847 222488 598601 119403 312252 400783 390774 443856 390220 524129 423658 583006
14837 583006 423253 381016 338969 522067 585228 469686 143519 399049 216215 430622
14827 430622 187239 394190 -16999 405877 284950 537581 341615 403960 279056 398602
14817 398602 667953 405063 282452 666356 149050 404377 508870 614066 564695 353752
14807 353752 380946 445855 328577 594148 597586 407753 600779 120275 396426 506963
14797 506963 254532 416066 719864 360249 744171 194349 603777 530792 284716 270265
14787 270265 461908 887947 164089 602882 441780 434881 310613 431269 522879 592702
14777 592702 359190 520047 427804 562661 553830 540162 740809 575076 842503 628854
14767F28854J5151J46738l44836J79944k10519M54326j54379k72575J69662J5422
14757F27788L1339j12947q1147K34941k80497K65955J2851j0892O6395q9720k30897
14746D33169J97191k6150L29951o2465m14099k5017K63235k59248K19522K5427
14736F81516k97828J39577J76022C10966L21358J5643C21317M50388j50921p2701
14726E48083N5262J80222o0871O4691j00720k01220J82813o4218m8790J42843
14716F98095n4073j17173K99012k12944j26932m3359J91494K87260j20466J4922
14706H15836o5363J39151J42590J12620j75965m0045l16416Q3881J21734n4777
14696G63246K35963k12571K45200j31463R0631K08439n21601R8908K10579L0373
$$ plain form
14767 628854 644005 790743 445907 625851 415332 869658 715279 442704 612366 627788
14757 627788 659127 546180 465033 699974 419477 685432 698283 687391 753786 664066 433169
14746 433169 630360 604210 934161 871696 457597 432580 695815 436567 656089 681516
14736 681516 383688 523265 699287 310966 632324 647967 321317 771705 620784 548083
14726 548083 603345 783567 722696 787387 686667 485447 668260 604042 555252 698095
14716 698095 644022 526849 825861 612917 485985 442626 634120 921380 800914 815836
14706 815836 750473 889624 1032214 1144834 968869 928824 612408 696289 818023 763246
14696 763246 999209 786638 1031838 900375 991006 1199445 677844 776752 987331 1017704
14686A017704k26652K889n2129J28660n8817k50291N26499k6626k18907k4484
14676H17846J77668K46783m30175N05966k80756r1010p0809O1265q7830K79145
14666A128093j32018j36672j0812L11511k93284p6231k6994J39362L50130j88328
14656A064757K78713m78709J19350k69490K68026K01054m04393L29733M2521j62911
14646I88651J08090J21787j32357N11K3361m2530n6098j04673M18584k29370L28662
14635A424618M6203J26647n17317j27677M74623n98626M48393Q1947k35909J76097
14625A298999P2550r3902o9974J88579J3142R5600k98308j0460K41868j67858
14615A270236J43136r3207J55888p3772k3693r095R0468m4656L3095l02085N877
$$ plain form
14686 1017704 791052 793941 741812 870472 811655 561364 1087863 1061237 842330 817846
14676 817846 995514 1242297 812122 1318088 1037332 946322 875513 936778 848948 1128093
14666 1128093 996075 859403 848591 1160102 866818 790587 763593 902955 1253085 1064757
14656 1064757 1343470 864761 984111 714621 982647 1183701 779308 1109041 1151562 988651
14646 988651 1096741 1218528 1086171 1086682 1110043 1067513 1011415 906742 1325326 1095956 1424618
14635 1424618 1470821 1597468 1080151 952474 1427097 828471 1276864 1358811 1122902 1298999
14625 1298999 1371549 1277647 1207673 1396252 1409394 1504994 1206686 1196226 1438094 1270236
14615 1270236 1413372 1320165 1476053 1402281 1378588 1369493 1459961 1415305 1448400 1146315 1152192
14604A152192j3285L13351k39492J24932J06447j0477j05643J33184J30933J78231
14594A770373R3308k22204J52945k12214L32275k3561m56473L75409k35181N6791
14584A631468j305L23190k42921j85974L94495j82595j98350J0255p0602J14064
14574A591725o8949J79235J28775M0362r0086K61288O3505n00477M51827N7994
14564B115199r8932r2958m9168O4917M06115l31322K99209J09691O3331r674k44235
14553B232173M71716k47776k29187M42602N0572o2245j9107k483L80320k59856
14543B756729O04853j59183K87740M89122M24312J92160P91692Q44290J599698
14534G831413K269057M385357O429153J0520419P41382j2424959p417338m316182
$$ plain form
14604 1152192 1138907 1452258 1212766 1337698 1444145 1433668 1328025 1461209 1592142 1770373
14594 1770373 1863681 1641477 1794422 1582208 1914483 1890922 1434449 1809858 1574677 1631468
14584 1631468 1630163 1953353 1710432 1524458 1918953 1736358 1538008 1548263 1477661 1591725
14574 1591725 1522776 1702011 1830786 1871148 1781062 2042350 2105855 1605378 2057205 2115199
14564 2115199 2016267 1923309 1874141 1939058 2345173 2013851 2313060 2422751 2486082 2476408 2232173
14553 2232173 2703889 2456113 2226926 2669528 2720100 2657855 2638748 2636265 3016585 2756729
14543 2756729 3361582 3202399 3490139 3979261 4403573 4595733 5387425 6231715 7831413
14534 7831413 10100470 14485827 20914980 31435399 32176781 19751822 12334484 8018302
14526H018302k105309j689195q47541l12659k42284J14754k39029N7787l38664
14517B416162R5290L3957k17972L50249k92132L60770l63747J63928j25214m2753
14507B378538R225J22582N3056J45878j61914J26667R4332l657L940j9456Q1944
14496B831135l72P8268k0910J59024n5950L2876P6197j60694M72219j77895R4552
14485C328450j90828N9027R7294M7537m03904M33569K98362l26700J14946K88709
14475C746462j53568J12896l1423r1805L35595l07806J84709o4968J36287M0438
14465C906817L3720J90476j99180L2L10072K25795l92625N20339j24398l0384
14455D440664P9870J70536m08573L92789j40350K43253j89336J77122O5017j90285
$$ plain form
14526 8018302 5912993 4223798 3376257 3063598 2821314 2936068 2697039 2754826 2416162
14517 2416162 2511452 2545409 2327437 2677686 2385554 2746324 2382577 2546505 2421291 2378538
14507 2378538 2387763 2510345 2563401 2709279 2547365 2674032 2768364 2764707 2768647 2749191 2831135
14496 2831135 2830763 2909031 2888121 3047145 2991195 3024071 3100268 2939574 3411793 3233898 3328450
14485 3328450 3137622 3196649 3293943 3341480 2937576 3371145 3669507 3342807 3457753 3746462
14475 3746462 3592894 3705790 3674367 3582562 3918157 3610351 3795060 3730092 3866379 3906817
14465 3906817 3940537 4131013 3931833 3931865 4241937 4467732 4075107 4595446 4471048 4440664
14455 4440664 4520534 4691070 4282497 4675286 4534936 4778189 4588853 4765975 4830992 4640707
14445D640707L80847l31011O80443j67619J92527j41053L32172l76643J03206
14436E313576K74009j92185J85787K4140q4826L88649R1618J24103j26801R0510
14426F088580K96703K96507j48988j347j68401M0707K56666M41333k44946J05700
14416F962514L43788L53214l09211k2341J90797L44637L9947k34420O00608k27687
14406H041846L24628k0104J26170k12806M21441J50997k3738K92814N0612J41454
14396I293314n4808L91933J19737L54459k07249q9015M00063J85327k1072O2542
14386A0435231J63605P98080O944J68272q9831N73987K66630m08628J65445N50392
14376A2630127L56207M03341J53886j28456M14900P6133J98856K50291L05730
$$ plain form
14445 4640707 5021554 4690543 5370986 5203367 5395894 5254841 5587013 5210370 5313576
14436 5313576 5587585 5395400 5581187 5605327 5520501 5909150 6000768 6124871 5998070 6088580
14426 6088580 6385283 6681790 6532802 6531455 6363054 6403761 6660427 7101760 6856814 6962514
14416 6962514 7306302 7659516 7350305 7327964 7518761 7863398 7903345 7668925 8269533 8041846
14406 8041846 8366474 8346370 8472540 8259734 8681175 8832172 8808434 9101248 9151860 9293314
14396 9293314 9238506 9630439 9750176 10104635 9897386 9808371 10208434 10393761 10372689 10435231
14386 10435231 10598836 11396916 11403860 11572132 11482301 12056288 12322918 11914290 12079735 12630127
14376 12630127 12986334 13389675 13543561 13415105 13830005 13906138 14104994 14355285 14661015
14367A4661015N29557L59203K89230L05791o69P09382P9041M95654K19629N52785
14357A8200618J59348K32431L91063L50915M04536M70753K35358P64634L17184
14348B1526840M19134N75391M27032J68136J214369K14681O95511P15780M37733
14339B6394607O27435J001388M58049N85253P17708R97022O76580O37007R01999
14330C2997048Q42799Q30687J128035M99363J577692P36375J205628J249430J179752
14321D2246809R80728J534521J538801Q76570J631682J590346J736932J722225
14313E3858614J446613J772754K051091K061677J914770K554104K059573K051076
14305F9770272K903405K710704K666446K984343K990317L529987L365391L562893
$$ plain form
14367 14661015 15190572 15549775 15839005 16144796 16144127 16853509 16932550 17428204 17647833 18200618
14357 18200618 18359966 18592397 18983460 19334375 19738911 20209664 20445022 21209656 21526840
14348 21526840 21945974 22521365 22948397 23116533 24330902 24545583 25241094 25956874 26394607
14339 26394607 27022042 28023430 28481479 29066732 29784440 30781462 31458042 32095049 32997048
14330 32997048 33839847 34670534 35798569 36297932 37875624 38611999 39817627 41067057 42246809
14321 42246809 43227537 44762058 46300859 47177429 48809111 50399457 52136389 53858614
14313 53858614 55305227 57077981 59129072 61190749 63105519 65659623 67719196 69770272
14305 69770272 72673677 75384381 78050827 81035170 84025487 87555474 90920865 94483758
14297I4483758L613659M160932M130479M649674M905377M782826N626846N685231
14289A32038782N845234O558464O728967O863114P265266Q020979Q311235Q884956
14281A90516997R534763J0026174J0289940J0728533J1891125J2217648J2317404
14274B67522584J3637695J3521575J4176367J4752777J4648199J5350468J4844366
14267C68454031J4476528J3156817J1846315J0996302R856321R266568Q640951
14260D46693833O548080M347587J847274J01446J3085M78905k967524q461013
14252D48601673r558051j0459933r699781j1140441j1574288j2856262j3649830
14245C69663087j3615594j3420261j3193574j3990978j2965625j3200141j2668918
$$ plain form
14297 94483758 98097417 102258349 106388828 111038502 115943879 120726705 126353551 132038782
14289 132038782 137884016 144442480 151171447 158034561 165299827 173320806 181632041 190516997
14281 190516997 200051760 210077934 220367874 231096407 242987532 255205180 267522584
14274 267522584 281160279 294681854 308858221 323610998 338259197 353609665 368454031
14267 368454031 382930559 396087376 407933691 418929993 428786314 438052882 446693833
14260 446693833 453241913 457589500 459436774 459538220 459551305 460030210 457062686 448601673
14252 448601673 439043622 428583689 418883908 407743467 396169179 383312917 369663087
14245 369663087 356047493 342627232 329433658 315442680 302477055 289276914 276607996
14238B76607996j2678241j1938235j0826159j1613558j0842013j0728806r950721
14231A98030263r350543q895795q204400q411847q245395p523476p010964o708362
14223A33679481n672452n782581n453206n102973m718537m448485l745757m141437
14215I4614053l623759l569041l433051l196462l083527l184803k550403k208545
14207F9764462k947224k018254k374415j823099k097793j961961j583658j898459
14199E3059599j402752j740293j353963j568334j644793j116273j194238o95146
14191D2343807j297120j416205j192627m53328j842563n95122o23598j261000
14183C3662244r08751n24476o02994j147542n87978q75828p28731n04110j126944
$$ plain form
14238 276607996 263929755 251991520 241165361 229551803 218709790 207980984 198030263
14231 198030263 188679720 179783925 171579525 163167678 154922283 147398807 140387843 133679481
14223 133679481 128007029 122224448 116771242 111668269 106949732 102501247 98755490 94614053
14215 94614053 90990294 87421253 83988202 80791740 77708213 74523410 71973007 69764462
14207 69764462 66817238 64798984 62424569 60601470 58503677 56541716 54958058 53059599
14199 53059599 51656847 49916554 48562591 46994257 45349464 44233191 43038953 42343807
14191 42343807 41046687 39630482 38437855 37984527 36141964 35546842 34923244 33662244
14183 33662244 32753493 32229017 31626023 30478481 29890503 29014675 28285944 27781834 26654890
14174B6654890l31731p72139l68075q61725j31282k74168p66107p94626n0021
14165B2305016m85547q33143j69903n57141j51873o79638r0727m56005l56594
14156A8524445k25779m78546n59454K5511l80936k17436m16089j55017n43689
14147A5573010k11793l44234k50873p1888m54134K35750m54143m36873k14013
14138A3370809m86889R5856j37634j42626k98631n95607K85242l56574p1450l94799
14128A1267697j68371K39865m27822J63593o07529M5604k22703l03724k23352
14119I763258K65570k48207k62036k37042r3246J10549l14105j96529m138j28554
14109H655520j91692l10111K7608m7291j37793j16183M68630m80979m40350J17124
$$ plain form
14174 26654890 26323159 25551020 25182945 24321220 24189938 23915770 23149663 22355037 22305016
14165 22305016 21819469 20986326 20816423 20259282 20107409 19427771 19337044 18881039 18524445
14156 18524445 18298666 17820120 17260666 17286177 16905241 16687805 16271716 16116699 15573010
14147 15573010 15361217 15016983 14766110 14694222 14240088 14475838 14021695 13584822 13370809
14138 13370809 12883920 12979776 12842142 12699516 12400885 11805278 12090520 11733946 11662496 11267697
14128 11267697 11099326 11339191 10911369 11074962 10467433 10513037 10290334 9986610 9763258
14119 9763258 10028828 9780621 9518585 9281543 9188297 9298846 8984741 8788212 8784074 8655520
14109 8655520 8463828 8153717 8181325 8134034 7996241 7880058 8348688 7867709 7427359 7544483
14099G544483L3598l24925P4087K9772k46408J18085o2197l30543J98264j62980
14089F871236j78773J48482l83932J66459k38741q2324n1890J28783k4286n28642
14079E826372k00880L23236p9600l35844p1821j01612j62272N97811m65888j47016
14069E182486r139o1439r2987J93878l98507L36836n34864L61697j11863j65733
14059D700365J69907j33485j24820j23327l82981O20419l46643O3702K4371k61735
14049D205773k71375K60599J48255j27162j14045M06928j79049J181k53777R9140
14039D176468m65119L66412k85014J10948j86634J61987l26276K29788l77567
14030C404993Q0852L16252j33191m8815k65462K791k12348J94456P4074j59547
$$ plain form
14099 7544483 7578081 7253156 7327243 7357015 7110607 7228692 7166495 6835952 7034216 6871236
14089 6871236 6692463 6840945 6457013 6623472 6384731 6302407 6250517 6379300 6355014 5826372
14079 5826372 5625492 5948728 5869128 5533284 5461463 5359851 5197579 5795390 5329502 5182486
14069 5182486 5173347 5111908 5018921 5212799 4814292 5151128 4616264 4977961 4866098 4700365
14059 4700365 4870272 4736787 4611967 4488640 4105659 4726078 4379435 4443137 4467508 4205773
14049 4205773 3934398 4194997 4343252 4216090 4102045 4508973 4329924 4331105 4077328 4176468
14039 4176468 3711349 4077761 3792747 3903695 3717061 3879048 3552772 3782560 3404993
14030 3404993 3485845 3802097 3668906 3620091 3354629 3357420 3145072 3339528 3413602 3254055
14020C254055J81620m8618k98662J55977p0030J97807k95687J69567j98119m1614
14010C006296Q9064n15891N07135l6007j01356k33710K4579L795N4041k67626
14000B530320j62975K64670O2713J6584m3148l56876N29747K2162k77142n7664
13990B528391j30533R1315p3081J42696r3181O8207j20570l9834N1997J12711
13980B538118j14628K72065K57234L75684N04213Q10929K206937L065844N697705
13971A5614101J0483814O576021j1241839p596422l451441k620651j750416n34764
13963E478403r89207k06139l66691l89062n19302M26895m81587J47801k35662
13954B865449l12281O0083j74704n4165j42197J6416R2811j6925j24571J09156
$$ plain form
14020 3254055 3435675 3387057 3088395 3244372 3174342 3372149 3076462 3246029 3047910 3006296
14010 3006296 3095360 2579469 3086604 3050597 2949241 2715531 2740110 2743905 2797946 2530320
14000 2530320 2367345 2632015 2694728 2711312 2668164 2311288 2841035 2863197 2586055 2528391
13990 2528391 2397858 2489173 2416092 2558788 2465607 2533814 2413244 2373410 2425407 2538118
13980 2538118 2423490 2695555 2952789 3328473 3832686 4643615 6850552 9916396 15614101
13971 15614101 26097915 32673936 21432097 13835675 10384234 7763583 6013167 5478403
13963 5478403 4489196 4283057 3916366 3527304 3008002 3434897 2953310 3101111 2865449
13954 2865449 2553168 2613251 2438547 2384382 2242185 2258601 2351412 2334487 2209916 2319072
13944B319072q6912n1033k13496L66246L142k19548K58163o52890K07522J79929
13934B110195k18555R0050L4538K19421j66419l21101n3910P6306J00268m0013
13924A830780K70752j9512k8873k92382K0394J5574P2672m97353K12464J20077
13914A704593K4432K5607m34455N54869j35984l4084K516Q7738r4460k19333L5028
13903A516467P5140k5915K9240l0649M45617n93343p9959J2773J35544K43033
13893A727948k86914J15165r4029J5343J14833j14290j3991j74740J10904K40126
13883A640355N0928k80889L3091j2703N4695j65409K73653l62498N46484n87161
13873A190546q3290L76210l21783p2515L8254K52319O6104l37467Q9487K14316
$$ plain form
13944 2319072 2232160 2181127 1967631 2333877 2337019 2117471 2375634 1722744 1930266 2110195
13934 2110195 1891640 1981690 2016228 2235649 2069230 1748129 1694219 1770525 1870793 1830780
13924 1830780 2101532 2082020 2053147 1760765 1781159 1796733 1869405 1372052 1584516 1704593
13914 1704593 1729025 1754632 1320177 1875046 1739062 1704978 1707494 1795232 1700772 1481439 1516467
13903 1516467 1591607 1565692 1594932 1564283 2009900 1416557 1336598 1349371 1484915 1727948
13893 1727948 1441034 1556199 1462170 1477513 1592346 1478056 1464065 1289325 1400229 1640355
13883 1640355 1691283 1410394 1443485 1430782 1485477 1320068 1593721 1231223 1777707 1190546
13873 1190546 1107256 1483466 1161683 1089168 1127422 1379741 1445845 1108378 1197865 1412181
13863A412181M7399l29482J9769L7590j24923J62695L30057m09587K65639l11484
13853A099854J97640j57288M98517l51546K5989m3894j70430J23722j51383K32719
13843A303900j37211Q7835j53328K47440j56544j49132n6344K90166j93438j37146
13833I46198J33331l87032n2540L88617J44863j69854j76255N4385J97904J43389
13823A223006l23290J31592l3053j45956J37896L11654l65461J66707l17699L83804
13813A169200J9857n26854L23091k32984L32808k46128J08421J63187j16949l16679
13803F76970L29319m1809m0650J57986j31839M0008N9661j39468l22539K15279
13793H02918K61692l96692M42779l29150n1983K53207k26734M9312J77747m29628
$$ plain form
13863 1412181 1459580 1130098 1149867 1187457 1062534 1225229 1555286 1145699 1411338 1099854
13853 1099854 1297494 1140206 1638723 1287177 1313166 1269272 1098842 1222564 1071181 1303900
13843 1303900 1166689 1254524 1101196 1348636 1192092 1042960 986616 1276782 1083344 946198
13833 946198 1079529 692497 639957 1028574 1173437 1003583 827328 881713 1079617 1223006
13823 1223006 899716 1031308 998255 852299 990195 1301849 936388 1103095 785396 1169200
13813 1169200 1189057 662203 985294 752310 1085118 838990 947411 1110598 993649 676970
13803 676970 1006289 964480 923830 1081816 949977 989985 1049646 910178 587639 802918
13793 802918 1064610 667918 1110697 781547 729564 982771 756037 805349 983096 553468
13783E53468M15983l19155J72848J58593l6877r3226J80986j05039P6446j17735
13773H86292n3542K25056l10802J20070k07360m3774L8847M51640m04428K43635
13763I45634l60450J86398K44420l35558N4602J81055O5962l17321N6754J66731
13753H88227j50775q198m9869R4379j7881B84412O28396q2747j88441r8604o460
13742E36556J79283n1576q7481l8202n3633K32913N3997J04266D19943K52176
13732F72119j68035n4312L45051n9726J73678k47200L97286l72652p0503K20541
13722H36247k16503J35864j60788m9964l4584k3718L34328j36916J4373K83515
13712I81854k17148j03495J69789j65999k34796K509L02593j94059J21512j27629
$$ plain form
13783 553468 969451 650296 823144 981737 944860 851634 1032620 927581 1004027 886292
13773 886292 832750 1057806 747004 867074 659714 615940 654787 1106427 701999 945634
13763 945634 585184 771582 1016002 680444 735046 916101 982063 664742 721496 888227
13753 888227 737452 729254 679385 773764 755883 284412 912808 830061 641620 543016 536556
13742 536556 715839 664263 576782 538580 484947 717860 771857 876123 419943 672119
13732 672119 504084 449772 794823 735097 908775 661575 1058861 686209 615706 836247
13722 836247 619744 755608 594820 544856 510272 486554 820882 683966 698339 981854
13712 981854 764706 661211 831000 665001 430205 432714 735307 541248 662760 535131
13702E35131L62022k85397m126Q5810k14353l71O840L03682q292C79697L21416
13691G01113j57928L02519B5143L00490J18145Q7877j00648O855K40617P1284
13681G49763B97878K54439J45366j03941k23981h869F33417k65840N0063L28476
13671G46116q9375q1617k3546j98217j23912J48803J33586J8511N1031n4419j10600
13660D16361A64688K22874K70373l01334J93548K50645j89070A86156N99870l01988
13650D84038J16339K10607m1025o4880n4968O5104B69805J50450R253O6740j57610
13639C38638M1910N470K32803B62050J39834J14982K30818j23067j27801J3170
13629E09986p6758J09232p038M2668m0815K24689P3434l26992J25121k7022k78185
$$ plain form
13702 535131 897153 611756 607630 693440 479087 478716 485556 789238 780946 379697 701113
13691 701113 543185 845704 25143 325633 443778 531655 431007 437862 678479 749763
13681 749763 297878 552317 697683 593742 369761 -8869 633417 367577 417640 746116
13671 746116 656741 575124 551578 353361 229449 378252 511838 530349 581380 526961 416361
13660 416361 164688 387562 657935 356601 550149 800794 611724 186156 786026 484038
13650 484038 600377 810984 769959 705079 650111 715215 269805 420255 429508 496248 338638
13639 338638 380548 386018 618821 262050 401884 516866 747684 624617 496816 509986
13629 509986 433228 542460 535422 578090 537275 761964 835398 508406 633527 606505 328320
13618C28320j35271L33036A85646L49925q7458A54257M00535B53523J72737q7501
13608C38759J24725A53809M296J50724M46913C65716R0534J41663j37730J00527
13598E60710B14699M21027A87159L46077k17514e6207E64400B74683K25125r7349
13588D02459A06449L37886j62296J30709j37246L1231J13341J61740B63096k4915
13578B38181K97061K16439j83568B21870K78924K3699A71839J80359O80n289Q2775
13567D30364j8030G4699B6501K78545L19864B41682L5055M3031M21743j18197
13557F23314C00522r1457M25244k34420M7712G1470N72188k95755A17070K95669
13547D12739j61732K07062J7142A0846N08500j39496A45990K51816j06859J91444
$$ plain form
13618 328320 193049 526085 185646 535571 448113 154257 554792 253523 426260 338759
13608 338759 463484 153809 158105 308829 755742 365716 456250 597913 460183 560710
13598 560710 214699 635726 187159 533236 315722 -56207 564400 274683 499808 402459
13588 402459 106449 444335 282039 412748 275502 306733 420074 581814 263096 238181
13578 238181 535242 751681 568113 221870 500794 524493 171839 352198 352878 347589 430364
13567 430364 412334 74699 26501 305046 624910 241682 276737 319768 741511 623314
13557 623314 300522 209065 634309 399889 447601 71470 643658 347903 117070 412739
13547 412739 251007 458069 475211 10846 519346 379850 145990 397806 290947 482391
13537D82391I2777N8414J31912j37403K40950J08917B21703J51455J1585q8847
13527B95896Q6430A83924L92962A73651k9843K59783M96455C34440r562A36780
13516I1093b8275C20002K19436j89565A67929m260L25481j31431j48362N6621
13506B65978M4070r4490m5255J15251J21334m1312n931C7688R0234J34946A16303
13494C89032j89431R2628M24746B35267p6392m2422J71838K49741k27255p7648
13484B33129N7682k0089j18796M05659B00235J54523D9501J80888a43619D60239
13473A49197J54575M6743K09894a36187A24566M41234B35894n1311J19949p2316
13463B32216o0059J70909c788B12545M3509Q274N9401L9340J31388j35343A27189
$$ plain form
13537 482391 92777 151191 283103 145700 386650 495567 221703 373158 384743 295896
13527 295896 382326 183924 576886 173651 143808 403591 900046 334440 324878 136780
13516 91093 -28275 320002 539438 349873 167929 163669 489150 357719 209357 265978
13506 265978 310048 215558 170303 285554 406888 365576 359645 37688 127922 262868 116303
13494 389032 199601 292229 716975 235267 158875 116453 288291 538032 310777 233129
13484 233129 290811 270722 151926 557585 200235 354758 49501 230389 -143619 460239
13473 149197 303772 350515 560409 -136187 124566 565800 235894 184583 304532 232216
13463 232216 172157 343066 -3788 212545 256054 264328 323729 363069 494457 359114 127189
13451A48264C0464L91942j27750o8259A00775M02384j65915j10756C1983J48937
13441A80920A047K51927A16683N1958p4430N6708L85927B7641K54904a06047C96389
13429H6332L14601L750j24187h2947D96059d1449A35026L06415K815q9134A77120
13417G75445e6007C18256F1159J65180P5965J17814A56694E6045J86943r7654
13407A45334J55651J92448r8281A43017K59561A2841K36154k2781R6663F1113
13396I1818J82685K0759r3597J00676A08193K70786k3842c3678d550E289J3291
13385A8580L10987J49735j87586H6234R5172L89741B05014r3576J49239C9394
13374B47706G6950J3070K71090n3797N998E2852J47425j1699n3096K07138a45734
$$ plain form
13451 148264 30464 422406 294656 226397 100775 503159 337244 226488 31983 180920
13441 180920 1047 252974 116683 168641 94211 150919 536846 27641 282545 -106047 396389
13429 86332 400933 404683 280496 -82947 496059 -41449 135026 441441 444256 355122 177120
13417 775445 -56007 318256 61159 226339 302304 420118 156694 56045 242988 145334
13407 145334 300985 493433 395152 143017 402578 12841 248995 226214 322877 61113
13396 91818 274503 295262 201665 302341 108193 378979 355137 -33678 -4550 5289 18580
13385 18580 329567 479302 291716 86234 181406 571147 205014 111438 260677 39394
13374 247706 76950 90020 361110 307313 313311 52852 200277 188578 135482 342620 -145734
13362C20311p5998j05919L17397O5752j91707a24077A24950n6140J14869M4538
13352B28217q3266K06857m6564A14521P5332R3713A19732b502C40483F9924J73829
13341B43753j10404L6380j478l805O6755C4580J7729K70208l1818j29506J89311
13330C50504A49930l0718K59153j72805J243f2956C75279L28381B07841J44360
13320C52201A63154J26206P3412p3431j12303m0346J35474J47809A71481q1202
13310I0279a44275B75593K00180D2423K53773Q748R191j06673D6973K34440L06871
13299E88284k55264A64627i3645C92329N2893C1950L26428A32417c6595B73842
13288C54096n2142E7014M0696M3587N6958m6946R2928F4701A7070O6984e0767
$$ plain form
13362 320311 244313 138394 455791 521543 329836 -124077 124950 68810 183679 228217
13352 228217 144951 351808 305244 114521 189853 283566 119732 -2502 340483 69924 243753
13341 243753 133349 169729 168251 164446 231201 34580 52309 322517 290699 161193 350504
13330 350504 149930 119212 378365 205560 206803 -62956 375279 703660 207841 352201
13320 352201 163154 289360 362772 289341 177038 136692 272166 419975 171481 90279
13310 90279 -144275 275593 475773 42423 296196 304944 314135 207462 46973 281413 588284
13299 588284 333020 164627 -93645 392329 445222 31950 358378 132417 -36595 273842
13288 354096 301954 57014 97710 141297 198255 151309 244237 64701 17070 84054 -50767
13276A67289o5872j7321O4793J46417F7874L14224A50215j1710F3431P2966J50944
13265B87341h2005e71F4302M11088e0180A29529O21b9493D20827b41181a1973
13253A64840m6493K94912o234B9669K5862L2043J05023Q7452o664J34377F5533
13241A99501B593b77110J35932E06807k32419q5099P1055j19237a6671B5734K42557
13230B68291k8726i4598C49977F9311b5556E892N2812P9394m3862J9057e6430
13218I090J31595J1514J42835p9534E7443c4541j8439G400J68090D2511b03717
13206a26364C56751C8522L55471H5707a10312B45502A5929a65103M5223b9734
13195F5972K02409a21931A56669b15271i35C97009A38809C8520L02696C2544b03870
$$ plain form
13276 167289 101417 84096 148889 295306 67874 382098 150215 138505 63431 136397 287341
13265 287341 -82005 -571 64302 475390 -50180 129529 130150 -29493 420827 -241181 -11973
13253 164840 118347 413259 407025 29669 55531 87574 192597 280049 273385 407762 65533
13241 199501 2593 -277110 -141178 506807 274388 189289 260344 141107 -16671 25734 268291
13230 268291 239565 -94598 349977 69311 -25556 5892 58704 138098 94236 113293 -56430
13218 9090 140685 152199 295034 215500 57443 -34541 -52980 7400 175490 42511 -203717
13206 -126364 356751 38522 393993 85707 -110312 245502 15929 -165103 -119880 -29734
13195 65972 268381 -121931 156669 -215271 -935 397009 138809 38520 341216 32544 -203870
13183f7298C27585b10482A67430N9979d3811D43339B07397h8366F4674P05040
13173G69714C24586A01645R4433J3102a42305J0529a657H4461J98626H7023c0815
13161a2218D30642m4267j89055c2852F6355J5016b45901G6275h8144a1847p6712
13150h8559D6531J31981G8485K01059p6308a86872C10786j05567a30511d7839
13139A83040L8529A05204g8709B5286K2048P3696M9324J14498j28317L95788a88995
13127E0660g0266D44644H2227k549C0607J96578a49969A72506b09322G3918J65152
13116B39070Q7479A28126L10084g367A66797N9580C8153L13254H4801J37383A08573
13104b22966A29606c4936F6067j4873A8216K01055A01949B5613a99460I0758a03759
$$ plain form
13183 -67298 327585 -210482 167430 227409 -43811 443339 207397 -88366 64674 769714
13173 769714 324586 101645 196078 209180 -142305 -131776 -1657 84461 283087 87023 -30815
13161 -12218 430642 386375 197320 -32852 66355 81371 -245901 76275 -88144 -11847 -88559
13150 -88559 46531 178512 78485 279544 203236 -186872 310786 205219 -130511 -47839
13139 183040 221569 105204 -78709 25286 47334 121030 170354 284852 156535 552323 -188995
13127 50660 -70266 444644 82227 79678 30607 227185 -149969 172506 -209322 73918 239070
13116 239070 326549 128126 438210 -7367 166797 226377 38153 351407 84801 222184 108573
13104 -222966 129606 -34936 66067 51194 18216 219271 101949 25613 -199460 90758 -103759
13092C34110j48544a37666d5160C39862I4997M5883K1472b81259D8468e9886B10464
13080E2652L15794a7284e447j25445B77039b101B61808b78906A14587J03095n1824
13069A65858o7405J96169M3934H5914l4953N0213E237a2977j28516J4148G2405
13057d6394n0341C33704q7642a55571A23111P0759J43679n9424p6775o1304A0266
13045E0403L45459a24194C90290a96314A50845g9811j83778B34261A11035R1307
13035B02342J1603a99018B14312N7473a286j17693A00806J9902D5210J93651J38394
13024C77255D2679K70973j19081K24832c7105C9811L45469A09569m2499J94355
13014B61425I6671K3188E5848a77825C99204a55381B13821J64199G9081b16057
$$ plain form
13092 334110 185566 -137666 -45160 339862 94997 140880 162352 -281259 48468 -59886 210464
13080 52652 368446 -17284 -5447 -130892 277039 -2101 261808 -278906 114587 217682 165858
13069 165858 98453 294622 338556 85914 50961 101174 5237 -12977 -141493 -127345 72405
13057 -46394 -96735 333704 246062 -155571 123111 193870 337549 278125 201350 140046 10266
13045 50403 395862 -124194 390290 -196314 150845 -79811 -263589 234261 111035 202342
13035 202342 213945 -199018 214312 271785 -1286 -118979 100806 120708 45210 238861 377255
13024 377255 42679 313652 194571 419403 -37105 39811 385280 109569 67070 261425
13014 261425 96671 119859 55848 -177825 399204 -155381 213821 378020 79081 -216057
13003B60705d19252B05310n1945A1980Q2909J08985Q8490k1127h7127B13045J69613
12992C82658r9554J53343a67906A73372m5450K34672o4911hG3548r265a65792
12980A96805M185j4908d7517A72960b19944I0487K3138i1558A11748b7875p1261
12969i9136A04727k2491B1967J50179E6595b69120I7344N01015A95534r2673l3076
12958F9785A1220K41589c5241B87297E8466d3176A35577a4618j7144q4926C23481
12946H9053b224p0149A1203L73737A6248a57072C12341c5352C38425A66136d6868
12934C97352A9172M8673a10512c9544A02191c7466G8330O1252L54019b44770e9309
12922A95161J56522a39679F0164g9223k9989f043A21088K13462h3731I7501b2312
$$ plain form
13003 260705 -419252 205310 153365 11980 94889 203874 292364 271237 -87127 213045 382658
12992 382658 283104 436447 -167906 173372 127922 362594 297683 -8 73548 64283 -165792
12980 196805 200990 186082 -47517 172960 -219944 90487 113625 -91558 111748 -27875 -99136
12969 -99136 104727 82236 21967 172146 56595 -269120 97344 598359 195534 102861 69785
12958 69785 11220 252809 -35241 287297 58466 -43176 135577 -14618 -31762 -116688 323481
12946 89053 -2224 -72373 11203 384940 16248 -157072 312341 -35352 338425 166136 -46868
12934 397352 19172 67845 -110512 -39544 102191 -37466 78330 139582 493601 -244770 -59309
12922 195161 351683 -139679 60164 -79223 -109212 -6043 121088 334550 -83731 97501 -22312
12910B9562m655b9479C5396a4056r6124A38485c70200i8561E7008K14610L5134
12899C06752B3026J7723P2171c53989J36439c2540E2844Q8866B1303e4495m2995
12888i7490H3896P2688G8067a50783j23098B5322b06819C60251c2512H8724J26521
12877B15245E3212J85065i2959a9074A6883a45664D61040A37292P5403J43768
12867C56463I0595D4205b0789B43099r3793b19629B27407a81740B88150a08283
12856A22047N6305N2474n1958d8214A22795R154l8531c3875A24964J6571K32537
12845C74072j82657i8962A58082c9008k02027A1435K61956d9524B45225A001J02438
12834A03439R6301q930J45306j31865g9116p3356E2873c5196C0814K10516r1667
$$ plain form
12910 29562 24907 -29479 35396 -14056 -110180 138485 -370200 -98561 57008 271618 306752
12899 306752 23026 40749 112920 -353989 -217550 -32540 52844 141710 21303 -54495 -97490
12888 -97490 83896 156584 78067 -150783 -273881 25322 -206819 360251 -32512 88724 215245
12877 215245 53212 238277 -92959 -19074 16883 -145664 461040 137292 212695 356463
12867 356463 90595 44205 -20789 243099 149306 -219629 227407 -181740 288150 -108283
12856 122047 178352 230826 178868 -48214 122795 131949 93418 -33875 124964 141535 374072
12845 374072 191415 -98962 158082 -39008 -241035 11435 273391 -49524 245225 1001 103439
12834 103439 199740 190810 336116 204251 -79116 -152472 52873 -35196 30814 241330 149663
12823A49663M1783h2671A75688A2478g5075A67472c7421K574n6914A45695a85329
12811A47875a84670Q0993a9349A34084A2478J97409c7050H9968b82553a02759
12800D4773f6379l2708E09586A60428D2286A3732b4151A64569a6130B55940O015
12789B61955a6107j03270E3451b35242l5426J24483j78933a15066N3264A03063
12778A25468K90656h2050E0318O2958a805D6850j5970K21070A7270J50810G537
12766A30126a63618A97429n2716b74034J35074B44201l7321k901b60082h0369
12755a37442E7145K18379b60087e6007r6572A55697Q4239i0334G186e9165j42888
12744b02053A29809N6119n3998f4084j1161C90748F7891a96724a04m6021J1346
$$ plain form
12823 149663 191446 -82671 175688 12478 -75075 167472 -37421 -34847 -91761 145695 -185329
12811 147875 -184670 -103677 -19349 134084 12478 209887 -37050 89968 -282553 -102759
12800 44773 -66379 -99087 509586 160428 42286 13732 -24151 164569 -16130 255940 261955
12789 261955 -16107 -119377 53451 -235242 -270668 -146185 -325118 -115066 -61802 103063
12778 125468 416124 -82050 50318 113276 -1805 46850 30880 251950 17270 168080 7537
12766 130126 -163618 197429 144713 -274034 -138960 244201 206880 203979 -260082 -80369
12755 -137442 57145 275524 -260087 -56007 -152579 155697 239936 -90334 7186 -59165 -202053
12744 -202053 129809 185928 131930 -64084 -75245 390748 67891 -196724 -104 -46125 -34779
12733c4779p6591a4937I2974E68a06278F93L80197a6288B34514H8709C8120J18148
12721A56268O9234f6388A94942a01353r7924B03375a94221N9572J1403H9012k8963
12710F0049a18626N9161r6222C25395a43261A56052G3615b4717k83097B80852
12699a13846G8401K25102j20794o8401Q9746B3285J50397J68381H8434J51121
12689B39555p7708J56486G8935P50J64593a20238B51914L8496a2569r8877B15865
12677b64360J8756I4122J30865r0803i3606c4803j34780n0318m0523b5599j68316
12666a93915B2414K50907E2254L12717b04394C27200f6617I4960k6655j2625L8875
12655I4555l256J53862A08754L9967C7269a1067l9578K089A45766p0485J76508
$$ plain form
12733 -34779 -111370 -14937 92974 568 -106278 693 380890 -16288 234514 88709 38120 156268
12721 156268 225502 -66388 194942 -101353 -199277 203375 -194221 -134649 -123246 89012 60049
12710 60049 -118626 -59465 -155687 325395 -143261 156052 73615 -24717 -307814 280852
12699 -113846 78401 303503 182709 114308 204054 23285 173682 342063 88434 239555
12689 239555 161847 318333 78935 79685 244278 -120238 251914 290410 -12569 -111446 215865
12677 -264360 -245604 94122 224987 134184 -93606 -34803 -169583 -219901 -260424 -25599 -193915
12666 -193915 22414 273321 52254 364971 -204394 327200 -66617 94960 68305 55680 94555
12655 94555 91299 245161 108754 148721 37269 -11067 -50645 -48556 145766 75281 251789
12644B51789g2372O923H2613C1124J55620M9932D6681M42458b28503C26323B9099
12632c3142A12871P3230K70788G1496e0366A6648h7144A90154K2867L3587F1442
12620b9720G42J1875J54292c0348E4212K75622R0545j01453m0479c8672C43925
12608B05796a7765A6016R6227n2739L18734A85855n9203J90176r236A15246b2222
12596B25946D7661N0447b06220A61046b80007h2895d637E000a34307A10615a9293
12584f6263F3814j3178J13441m0943N7585D8122P1234N9492B6079K4555I551J76147
12572A85698a68286K1672c8526B22700c23032B87580j15381b6426A33059K72530
12562D05589j80634D1969L635e0739A23558k3579a55281A01843J09705d1973A70068
$$ plain form
12644 251789 -72372 -65449 82613 31124 186744 236676 46681 489139 -228503 326323 29099
12632 -33142 112871 186101 456889 71496 -50366 16648 -87144 190154 213021 246608 61442
12620 -29720 742 12617 166909 -30348 54212 329834 420379 318926 278447 -38672 343925
12608 205796 -17765 16016 112243 59504 378238 185855 126652 316828 307592 115246 -22222
12596 225946 47661 98108 -206220 161046 -280007 -82895 -4637 5000 -134307 110615 -19293
12584 -66263 63814 50636 164077 123134 180719 48122 119356 178848 26079 50634 9551 185698
12572 185698 -168286 -146614 -38526 222700 -323032 287580 172199 -26426 133059 405589
12562 405589 224955 41969 45604 -50739 123558 99979 -155281 101843 211548 -41973 170068
12550B44725A19584g6861A65787O0278a02936L9569j14842A69349o6433a81837
12539G0875b66941M8663F6358a6253l71245a18732E459b5571j47583F757c02878
12527a32235C5640J01409a25357B5105b22833K5193A89300a85379H8586b01756
12516h2393o3201C79171D7340N7549L2928l8401d2460k04116k1036A48790a8143
12504b71485a14854M0570A9140O0364a85428i104k29316F2583J3893h5912A57584
12492g0434k6957J1347E1285P7876a11647G3195A9575L8738K96521A46776M0169
12481A86945B7572i2989b4849H3976l1856J15522g916A83750B5687J38863A2882
12469d3887E3508A933J33934J22248a6991j4660a2232H9405j3137c502r1565d3282
$$ plain form
12550 244725 119584 -76861 165787 226065 -102936 -63367 -178209 169349 102916 -181837
12539 70875 -266941 -218278 66358 -16253 -387498 -118732 5459 -25571 -173154 6757 -302878
12527 -132235 35640 137049 -125357 25105 -222833 -197640 189300 -185379 88586 -201756
12516 -82393 -145594 379171 47340 104889 137817 99416 -42460 -246576 -267612 148790 -18143
12504 -271485 -114854 -74284 19140 79504 -185428 -9104 -238420 62583 76476 -85912 157584
12492 -70434 -97391 -86044 51285 129161 -111647 73195 19575 58313 354834 146776 186945
12481 186945 27572 -92989 -24849 83976 52120 167642 -7916 183750 25687 164550 12882
12469 -43887 53508 1933 135867 258115 -16991 -31651 -12232 89405 76268 -3502 -95067 -43282
12456c19510a02829q0633h815A00811K047c55735b1643H9497g5G1567J80622D5936
12443H1291d5880A84569k4392a01361B30583J04629a96492O3813D7339e6479D6957
12431d389I85b27194C0254a08226C02936C1954a43987J2318m6412h750B68373
12419d02262J38145f7595b4712l59273i7913m4427C41380I4074J09001a38718
12408A03369a12309c263j99296A16747K80492A31676M282N7014C7988f50j39996
12397a40646B74342A23919K77150f9400j9287G0432a05125k4872h399E2705k0693
12386C2012Q1703L5949a76199L0777A66627L8444F5438a6284D20055a65693b9013
12374H0584P9821a87408A92020H3750a27102N4686k14797A62386a48005A0250
$$ plain form
12456 -319510 -102829 -183462 -8815 100811 102858 -355735 -21643 89497 -75 71567 252189 45936
12443 81291 -45880 184569 160177 -101361 230583 335212 -196492 -132679 47339 -56479 46957
12431 -4389 985 -227194 30254 -108226 302936 31954 -143987 -131669 -178081 -8750 268373
12419 -402262 -264117 -67595 -24712 -383985 -97913 -142340 341380 94074 203075 -138718
12408 103369 -112309 -3263 -202559 116747 397239 131676 135958 192972 37988 -650 -140646
12397 -140646 274342 123919 401069 -69400 -88687 70432 -105125 -129997 -8399 52705 32012
12386 32012 113715 149664 -176199 -145422 166627 205071 65438 -16284 420055 -165693 -29013
12374 80584 160405 -187408 192020 83750 -127102 -72416 -287213 162386 -148005 10250
12363a25045A58721K2787H6623k9452d3110A34496i8750p2942f7367C43691F6201
12351B45719C0385a81038g6147J8644B1922m526a97177q3691d2709p0037A95046
12339A88219a7106j71429e6852A5005h6207D2522A6165d6894q391C67161K3785
12328C90946A50797o7854c155A25907K00124b01781d8598A38440g606k49584A75996
12316i2903k1002m9092e0519H8430e3449j68815D08726F0204J01662J70429b24249
12304a4770C10340a06266L501A31430F2201a7240k06637d0381j56313j03826Q1455
12293b19065e4914e58k97554C205K64533l9975A00992D7487L5905f7610A13818
12281A41665a26017e8771A76859e5600C44805D7491M0686b37157B42950j02053
$$ plain form
12363 -125045 158721 181508 86623 57171 -43110 134496 -98750 -171692 -67367 343691 66201
12351 245719 30385 -181038 -76147 -57503 21922 17396 -197177 -280868 -42709 -112746 195046
12339 188219 -17106 -188535 -56852 15005 -86207 42522 16165 -46894 -55285 367161 390946
12328 390946 150797 82943 -3155 125907 326031 -201781 -48598 138440 -7606 -257190 175996
12316 -92903 -113905 -162997 -50519 88430 -53449 -222264 408726 60204 161866 332295 -224249
12304 -14770 310340 -106266 -102765 131430 62201 -17240 -223877 -40381 -196694 -300520 -219065
12293 -219065 -54914 -558 -298112 3205 267738 227763 100992 47487 83392 -67610 113818
12281 141665 -126017 -58771 176859 -55600 344805 47491 88177 -237157 242950 140897
12271A40897B815b28466B74011b23633B63025I3854R6853k4902C3423P0412M11025
12260E14860A88650e8893C06856I3835L0629J64976a40816F8867b9815B73554
12249h1396A9170P4247Q9849a82697M7798r0267h4756C12915a64544H351K23380
12238B31731C7631J9655g9465B68429b79804A10105N9519j6409L9682J10710b055
12226B27281E8277c68406D16527b83570J18662I2914N6833O0573i0074D47818
12215C86283A7905J98971J80238a2041B31476b12543A70906n4662k2554M9734
12205A43424J39994G3671K9059a70137D22829e9618A34318L37340A32239J55369
12195B87608o9326K91278A37176m142n9528J27153E2494J43428J2606p6033f5221
$$ plain form
12271 140897 2815 -228466 274011 -223633 263025 93854 190707 165805 33423 103835 514860
12260 514860 188650 -58893 306856 93835 124464 289440 -140816 68867 -29815 273554
12249 -81396 19170 93417 183266 -182697 -134899 -225166 -84756 312915 -164544 8351 231731
12238 231731 37631 57286 -79465 268429 -279804 110105 169624 153215 192897 303607 -2055
12226 227281 58277 -368406 416527 -283570 -164908 92914 149747 210320 -90074 447818
12215 386283 17905 216876 397114 -12041 231476 -212543 170906 116244 93690 143424
12205 143424 283418 73671 102730 -170137 422829 -59618 134318 471658 132239 287608
12195 287608 218282 509560 137176 133034 73506 200659 52494 195922 208528 132495 -65221
12183a77675B49399o3907p0054J30007R3043A1976K69594A7740L04421A44649
12172D2277f4847o414l2900A33211K83470a50531I7449K30637f015G8657b12212
12160H7520Q3948j949c5286C52657A06218L2495o0516l7859J32638J39256J60743
12149D72975o7435C7262a08190A45091Q7785M7955G0993M5346a43429B13727a7133
12137B10152a53989P0858A8375c3556r802n3303B02090k6897N9030b16982i9096
12125B39153K28r0386I023J40352a4845D4785M1020J08961f2241b0191l1143E7080
12112e463j165k44896D80999d7867a5803A68654J3276O2638h3560H8535d11287
12100a04241j28909f8559j15306E21142i2157G8544b14455a1304B50866a45631
$$ plain form
12183 -177675 249399 185492 115438 245445 338488 11976 281570 17740 322161 144649
12172 42277 -64847 -71261 -104161 133211 416681 -150531 97449 328086 -6015 78657 -212212
12160 87520 171468 169519 -35286 352657 106218 138713 78197 40338 172976 312232 472975
12149 472975 405540 37262 -108190 145091 232876 280831 70993 116339 -143429 213727 -17133
12137 210152 -153989 -83131 18375 -33556 -43358 -96661 202090 175193 234223 -216982 -99096
12125 239153 239381 148995 9023 149375 -14845 44785 85805 194766 -62241 -20191 -51334 57080
12112 -5463 -6628 -251524 480999 -47867 -15803 168654 181930 244568 -83560 88535 -411287
12100 -104241 -233150 -68559 -183865 521142 -92157 78544 -214455 -11304 250866 -145631
12089A58013J99225H8325L80079A23692a57533H4575J77165a32778B01135a06493
12078h1870n8310B24631b6762j4851I4199b0493l20971F1749c57212a17821H3015
12066c45258a44048p4234J02980C75008R4511M63833J46705l97394C05179j4035
12056B91144M1233r5677j05490a91379b1021G4785f6448A40082e4744B5873a44566
12044a98046I6928e5752k45634c1651B39398H9256a84543D35827D8661c490D19114
12032C02776C4560c4865H7588P0770a16347j02358R9900b3568A76433a52726d2342
12020E7653a32385d379A2708a44165l8674g6668C5078e13921G8850D28a73940
12008c15798B16596h945p7531F0728c33666A32319a17870c6582D781K25911E6
$$ plain form
12089 158013 357238 88325 468404 123692 -157533 84575 261740 -132778 201135 -106493
12078 -81870 -140180 224631 -26762 -41613 94199 -20493 -341464 61749 -357212 -117821 83015
12066 -345258 -144048 -218282 -115302 375008 469519 933352 1080057 682663 305179 291144
12056 291144 332377 236700 131210 -191379 -21021 74785 -66448 140082 -54744 25873 -144566
12044 -198046 96928 -55752 -301386 -31651 239398 89256 -184543 435827 48661 -3490 419114
12032 302776 34560 -34865 87588 158358 -116347 -218705 -118805 -23568 176433 -152726 -42342
12020 57653 -132385 -4379 12708 -144165 -182839 -76668 35078 -513921 78850 428 -173940
12008 -315798 216596 -8945 -86476 60728 -333666 132319 -117870 -36582 4781 230692 56
11996C02601e9328q4114e8394j12701C1888f3455k81197A08915D0080J06755g1302
11984b65952b6972C0564m485K73521a81304F189a77357C3257J7998P4197i5463
11972a90041G130J4555a65043I342f9702A89011G2363e2152B19627A7980b94538
11960A0846d0366A08169l5093b46936a5981j78221a5203A77644G483K1894a29863
11948e7112B34275N1113D6906c17304E2348A7599K01244b92268G6982C057a61648
11936a44575e0561A11988a83892j22710b7079G4837e2428A99689B8556J53616
11926A82172A7206a46231b5157D9710J52870a75775J415L0640j85475i2863j9531
11915a12394B69392N589i4558l0998G9371d1616o3170b048j46740B821O9150c1171
$$ plain form
11996 302601 -59328 -143442 -58394 -171095 31888 -63455 -344652 108915 40080 146835 -71302
11984 -265952 -26972 30564 26079 299600 -181304 6189 -177357 33257 51255 125452 -95463
11972 -190041 7130 21685 -165043 9342 -69702 189011 72363 -52152 219627 17980 -294538
11960 10846 -40366 108169 73076 -246936 -15981 -194202 -15203 177644 7483 29377 -129863
11948 -57112 234275 285388 46906 -317304 52348 17599 218843 -292268 76982 3057 -161648
11936 -144575 -50561 111988 -183892 -306602 -27079 74837 -52428 199689 28556 182172
11926 182172 17206 -146231 -25157 49710 202580 -175775 -174360 -143720 -329195 -92863 -112394
11915 -112394 269392 274981 -94558 -125556 79371 -41616 -104786 -2048 -148788 2821 71971 -31171
11902E8730P3913D1561B0626K67734a52877F3768a45396a9549l94847a49450l4724
11891a84174G9829J27166b66977E2127L43411A79091p4458l6127b33702c4455
11880e506k23r5035B93951l985b68916k4896B60239F8693a56796k4176A02445
11868f8159o7810A11465a67457F0590c632q9580A2421a95115D0834a39540B82265
11856E7566a82585A74371M7548a79930A08737a53207f2509I4842b06672F5084
11845h4369A769J79556J70221a00383b9130A33684b70417a05460D9143a13151
11834A60665p070a14332K1471k05334e8245k36638a46405F4210N5188a64918m3719
11823b08637k20258L79B2564J49997h3506l7300l2958j86744A81921J0927a36263
$$ plain form
11902 58730 132643 41561 20626 288360 -152877 63768 -145396 -19549 -414396 -149450 -184174
11891 -184174 79829 206995 -266977 52127 395538 179091 104633 68506 -233702 -34455
11880 -5506 -5729 -100764 293951 289966 -268916 -293812 260239 68693 -156796 -180972 102445
11868 -68159 -135969 111465 -167457 60590 -3632 -93212 12421 -195115 40834 -139540 282265
11856 57566 -182585 174371 221919 -179930 108737 -153207 -62509 94842 -206672 65084
11845 -84369 1769 181325 351546 -100383 -29130 133684 -270417 -105460 49143 -113151
11834 160665 153595 -114332 -92861 -298195 -58245 -294883 -146405 64210 119398 -164918 -208637
11823 -208637 -428895 -428516 22564 172561 -83506 -120806 -153764 -340508 181921 192848 -136263
11811A57257N0434r1672a7326H9482a25138J7487l1287O5000A0207L2445G811
11799f5038A76582i2471C7359a02338L8656a6591J86A03449e1692D61852a11693
11787h5367E496O9744J40418h7533C366J49336E5786A3422b27114B01227b87453
11775B68482E051Q5816a52793c8900A3277b46313e7915B23486c6596k24842h1352
11763A72832a61447A02397b25264A26282H38J11352G138b06939E5790J20161a0680
11751b30103B74839I3127d00959f8201k11148I412a43008B18826K7749b26064
11740B44430a69503G5504P4381J69322d1525o6589d6092j07814M0340F6322b13990
11728i1161B04932h3021G0377g9680J8040m3123n9884h2005a704m9282A72355
$$ plain form
11811 157257 207691 116019 -17326 89482 -125138 -107651 -138938 -73938 10207 42652 7811
11799 -65038 176582 -92471 37359 -102338 -63682 -16591 -16405 103449 -51692 461852 -111693
11787 -85367 5496 75240 215658 -87533 3366 152702 55786 13422 -227114 201227 -287453
11775 268482 5051 90867 -152793 -38900 13277 -246313 -57915 223486 -36596 -261438 -81352
11763 172832 -161447 102397 -225264 126282 838 112190 7138 -206939 55790 175951 -10680
11751 -230103 274839 93127 -400959 -68201 -279349 9412 -143008 218826 246575 -226064
11740 244430 -169503 75504 149885 319207 -41525 -108114 -46092 -153906 -113566 66322 -213990
11728 -91161 204932 -83021 70377 -79680 -61640 -104763 -164647 -82005 -1704 -50986 172355
11716g8354k8504H6631b74802B06167b49184K2850I8228b05598b8625l42358H6177
11704B01378B1124L7483K09389h9724D9460c28934k1022L3385C01372i95j32110
11693a33105j29765A51959r763R7597P7446c6577G3845C1911L0390b74178A38921
11681B90056A8644j835J5814b8167p9361r6240A23320J5172J24229j1873a09075
11669C81606b69702J30045A21026a82293I7714R5445a59589B01575a06115B20487
11658I3149f6150k0587A65743d2164A00664f6620K2816B21116E5096j7488c36953
11646a80041h4876A99154f8964o1856N5906C52830H5646R0582a06975J3778a1685
11634b89963N0761B8868J4921i3330A53455k2723a1203D29945i905r336k57677
$$ plain form
11716 -78354 -106858 86631 -274802 206167 -249184 -226334 98228 -205598 -28625 -370983 86177
11704 201378 21124 58607 267996 -89724 49460 -328934 -349956 -316571 301372 -995 -133105
11693 -133105 -262870 151959 142196 239793 317239 -36577 73845 31911 62301 -274178 138921
11681 290056 18644 16809 32623 -28167 -107528 -203768 123320 138492 262721 250848 -109075
11669 381606 -269702 -139657 121026 -182293 97714 193159 -159589 201575 -106115 220487
11658 93149 -66150 -86737 165743 -42164 100664 -66620 -43804 221116 55096 37608 -336953
11646 -180041 -84876 199154 -68964 -130820 -74914 352830 85646 176228 -106975 -93197 -11685
11634 -289963 -239202 28868 43789 -93330 153455 130732 -11203 429945 -9905 -19241 -276918
11623b76918A71214E877a89058A1441a7740A15278R3016H8006a60425B75612a28344
11611C42896G2121f8286D0135H867J88832a75A45905P3629b31920J3901A04920
11599B05203n0515b53831H949a73018H458P5726N8810a7106j47618B63783a27384
11587B39670f9980b5883k81986a03364r943D8574b75373D5624e4266D9365J98865
11576B48230J48860E0167M6947K41397r9711h2423A82454d3087B27152I3193M5673
11565A38866o7517d9398A07a07842A64635a16045h686D13275A7846L9359O3695
11554A20900j6525N0211a87247A49481N1931B3473R6896e4835B6403M0968a74755
11542A2507K4487J80687a59291c0626B32852n7717E6695L64566b69669D55736
$$ plain form
11623 -276918 171214 5877 -189058 11441 -17740 115278 208294 88006 -160425 275612 -128344
11611 342896 72121 -68286 40135 8867 197699 -175 145905 219534 -231920 -218019 104920
11599 205203 154688 -253831 8949 -173018 8458 84184 142994 -17106 -164724 263783 -127384
11587 239670 -69980 -25883 -307869 -103364 -113307 48574 -275373 45624 -54266 49365 248230
11576 248230 397090 50167 97114 338511 238800 -82423 182454 -43087 227152 93193 138866
11565 138866 71349 -49398 107 -107842 164635 -116045 -8686 413275 17846 57205 120900
11554 120900 104375 154586 -187247 149481 201412 23473 120369 -54835 26403 67371 -174755
11542 12507 36994 217681 -159291 -30626 232852 175135 56695 421261 -269669 455736
11531a1989I1947e675A8643R9107D929J92532o377n6963D5062K67957J8695a13327
11518C773h1759r8317B54191j18796A4340K49032r4294p1821J58085A01591j03
11507A01488J69808D787a59537A41694N2278b7611A11891K5392o1390q701k6793
11496D0399a03517H9694K0050Q1204g2286G8570J16671a45591B09179b8669q8986
11485a17655k1450A01524N8196J0381K55084R285A18851c6786C87393I7669b37721
11473B46695m8241J12592m1643j7409a39403B08512K93796I2306g9704D4908J72023
11462B16931K14157C3523J66723g5487B01529n851m9335i128j06128M2476A14725
11450e91B81692a09485B84454A10454a39326B36919N6372h5833k10645a04172
$$ plain form
11531 -11989 91947 -5675 18643 117750 4929 197461 191084 134121 45062 313019 331714 -113327
11518 3773 -81759 -180076 254191 135395 14340 263372 169078 97257 255342 101591 101488
11507 101488 271296 4787 -159537 141694 193972 -27611 111891 137283 75893 67192 40399
11496 40399 -103517 89694 109744 190948 -72286 78570 195241 -145591 209179 -28669 -117655
11485 -117655 -139105 101524 159720 170101 425185 434470 118851 -36786 387393 97669 -237721
11473 246695 198454 311046 269403 251994 -139403 208512 502308 92306 -79704 44908 216931
11462 216931 431088 33523 200246 -75487 201529 195678 146343 -9128 -115256 -72780 114725
11450 -591 281692 -109485 284454 110454 -139326 236919 293291 -85833 -296478 -104172
11439a48769P0691F3732a81809C65404b6088A06600J41913e2681j0209D65633
11428A55427K690k5348R8972j13437Q7386g001B52600a400l6194C79677A25702
11416a32514j61798B263M80161g7527B03429c09k64736A76306m109h4878D19312
11404b0827B35076a49923K841E4431B2599O6454L1057J1600J11073j2542A4672
11392D0032A8213P4428b13887B28213h3455l03586B50038H911K60575a11151M2351
11381f8800A32925a69687A27967J29777I1028G261J10486a37086A91529J4119
11371B05648F5105k3900J87420A07452J38972g336j1670k81485B43661C3777K99640
11360C33417D9956a21421c1536j35883b5217B3427i4334j1187k74036B71465c24128
$$ plain form
11439 -148769 -78078 63732 -181809 365404 -26088 106600 248513 -52681 -62890 465633
11428 155427 158117 132769 231741 118304 205690 -7001 252600 -1400 -37594 379677 125702
11416 -132514 -294312 2263 482424 -77527 203429 -309 -265045 176306 172197 -84878 419312
11404 -20827 235076 -149923 -147082 54431 22599 89053 120110 131710 242783 230241 14672
11392 40032 18213 92641 -213887 228213 -83455 -387041 250038 8911 269486 -111151 -68800
11381 -68800 132925 -169687 127967 257744 91028 7261 117747 -137086 191529 205648
11371 205648 65105 41205 228625 107452 246424 -7336 -19006 -300491 243661 33777 333417
11360 333417 49956 -121421 -31536 -167419 -25217 23427 -94334 -105521 -379557 271465 -324128
11348b2259D29477b17396l1685B8572M6058g927m4165A5399Q3547a22543A28497
11336G1042a76053A00660b59264I9582b13870A14482J00970b6590a1299l12399
11326c23698J23315B12797a8825l0103A23542l5717b7059F4766K02873a27891
11315a44023B13770o2144K2062p5443J62709B8665O6974a51219n809L8592A57752
11303B81305h3637A64975R2186b22570A53848E1201J19995a43452G5144N4296
11293A29440c01644a03339d2407A07341J07293b62140J09987J5828A33667l5234
11283I8433K32762e0288G5816g214j80546M9097F6780J4133b55441A50703g4662
11271a73478b892j6123C9465d6308k0243j13637A16906h0552E9307K5950B4893
$$ plain form
11348 -22259 429477 -217396 -249081 28572 74630 -7927 -52092 15399 98946 -122543 128497
11336 71042 -176053 100660 -259264 99582 -213870 114482 215452 -26590 -11299 -323698
11326 -323698 -200383 212797 -18825 -48928 123542 87825 -27059 64766 267639 -127891
11315 -144023 213770 151626 173688 98245 260954 28665 95639 -151219 -157028 -118436 157752
11303 281305 -83637 164975 257161 -222570 153848 51201 171196 -143452 75144 129440
11293 129440 -301644 -103339 -42407 107341 214634 -262140 -152153 -136325 133667 98433
11283 98433 331195 -50288 75816 -7214 -187760 -138663 66780 80913 -255441 150703 -74662
11271 -173478 -2892 -19015 39465 -46308 -66551 -180188 116906 -80552 59307 85257 24893
11259a52203g1321C40172d4304j0077j41052D3508b29884F6193a80657C7636b9522
11247a52014p2195C68058a72100g5005A22317k2159c9638D2102c210o3410b7592
11235a84397M6080I4222a77041P9311B93120d49194A59371e4213A31853B5291
11224A36965K1151i1726q6705j83710a56875D8431M1837M6642a48110o2525D06187
11212b50674E3041c4232n2487K6378b5174l8496j07054j47397f4497A47636n1362
11201I6274b90647F1069e20335a88153n7534A86741D685b31628A96202p5305a92583
11189c86834J29760e0079A30575b07200c9410j6361j5373l5784A16088N2365c49601
11177b73635A36919J67896C423i5306n1707n6701n4907C6108c06222J14819A0290
$$ plain form
11259 -152203 -71321 340172 -44304 -54381 -195433 43508 -229884 66193 -180657 37636 -29522
11247 -152014 -224209 368058 -172100 -75005 122317 100158 -39638 42102 -3210 -66620 -27592
11235 -184397 -138317 94222 -177041 -97730 293120 -449194 159371 -54213 131853 25291
11224 136965 158116 -91726 -178431 -362141 -156875 48431 90268 136910 -148110 -210635 406187
11212 -250674 53041 -34232 -86719 -60341 -25174 -63670 -170724 -318121 -64497 147636 96274
11201 96274 -290647 61069 -520335 -188153 -245687 186741 4685 -231628 196202 120897 -192583
11189 -386834 -257074 -50079 130575 -207200 -39410 -55771 -71144 -106928 116088 168453 -349601
11177 -273635 136919 304815 3423 -95306 -147013 -203714 -258621 36108 -306222 -191403 10290
11165G4778J99228A01302J74132a17850A74070I951P3151a75048k06971J85156
11155a96863B05635L8535e9839A08227b31991A07062B9978K7133J921c4009k11545
11144b45554l660c7178A1211e09824a67364m704D1570c11620a45227K451A35457
11132g0015A33633B8075M1922K07988a87164K7451A43848L1991c6876A17184a00754
11120B03436b27778A11344E2447K82439I6204a03686A20775A9244d9627q5161
11110a34788a9889G1120J49056F2746b47971J18985G4349d3566B14245g0871k7708
11099i8579M2459A46023B7860J60247J22225K629o5449P1574e0721C24914I2496
11087A90502O6905J8491J20510j93398d9192j5669G6661J25557J15437j43824
$$ plain form
11165 74778 274006 101302 275434 -117850 174070 9951 83102 -175048 -382019 -196863
11155 -196863 205635 244170 -59839 108227 -231991 107062 29978 57111 59032 -34009 -245554
11144 -245554 -249214 -37178 11211 -509824 -167364 -172068 41570 -311620 -145227 -142776 135457
11132 -70015 133633 28075 69997 277985 -187164 -159713 143848 175839 -36876 117184 -100754
11120 203436 -227778 111344 52447 334886 96204 -103686 120775 19244 -49627 -134788
11110 -134788 -19889 71120 220176 62746 -247971 -128986 74349 -43566 214245 -70871 -98579
11099 -98579 -56120 146023 27860 188107 310332 312961 247512 319086 -50721 324914 92496
11087 190502 257407 275898 396408 203010 -49192 -64861 76661 202218 317655 173831
11077A73831J76119j04955L0060J2278j04308J95837f3366A56490Q8418m1959
11067B02949K05528A46281k2560K31135J52731E9335h5911B94942J24362k2313
11057C96991P5585l6006r249A86229K12630j48663Q1945L90047k25980J26054
11047F22262J9013C07625O6841J05167m022J61912q7545K87634l06572R0348C04922
11035G33044J74535j72588N3061j70500K77708m5573R2392j67074K12343k32866
11025G54482k14087M22599D24360K15689o1354K11508R3241J94318l65953P2410
11015G84219j84424K07260k67464L71705p3241j15199j54937K14504J95888m2227
11005I36084j96691r5317q1447J39611J8873l2394k21266M12653B00956R35369
$$ plain form
11077 173831 349950 244995 275055 287333 183025 378862 -63366 156490 244908 202949
11067 202949 408477 146281 123721 354856 507587 59335 -85911 294942 419304 396991
11057 396991 472576 436570 427321 186229 398859 250196 332141 722188 496208 622262
11047 622262 641275 307625 374466 479633 475611 637523 549978 837612 531040 621388 304922
11035 733044 907579 734991 788052 617552 895260 849687 942079 775005 987348 754482
11025 754482 540395 962994 424360 640049 578695 790203 883444 1077762 711809 784219
11015 784219 599795 807055 539591 911296 838055 722856 567919 782423 978311 936084
11005 936084 739393 644076 562629 702240 721113 688719 467453 880106 200956 1136325
10995A136325m50153p6718o7076k0051O8062o1593k3797J25619m7082L69322k94524
10984F58334k67771J43517R1940k23822K50756K10944j98458N0919J37180J52401
10974A005940k09555P8212k09118Q6634K40163J1054J09514j17142M91766J09501
10964A596969m85830J27442N01141L33542J04780j41516M97579j3759L92715k96303
10954B616760K3455o8942R3684l53414l02864J50679o05995K73845l21117K65028
10944A771119j33007M9492j77925J46955J69337q9640n06675k12346J65825m98962
10934F84173K53738k06693j42420J1313j16709j81488d8753N354I0505J50772
10924B41277O0694q7969n5969F3587J6103c5622A29429M4576C1207P5078c476
$$ plain form
10995 1136325 686172 609454 542378 522327 590389 528796 504999 630618 583536 952858 658334
10984 658334 390563 534080 626020 402198 652954 863898 665440 716359 853539 1005940
10974 1005940 796385 874597 665479 752113 992276 1003330 1112844 995702 1487468 1596969
10964 1596969 1111139 1238581 1739722 2073264 2178044 2036528 2534107 2520348 2913063 2616760
10954 2616760 2640215 2571273 2664957 2311543 2008679 2159358 1553363 1827208 1506091 1771119
10944 1771119 1638112 1687604 1509679 1656634 1825971 1736331 1229656 1017310 1183135 684173
10934 684173 937911 731218 588798 600111 483402 301914 -48753 -43399 90505 241277
10924 241277 301971 214002 158033 63587 79690 -35622 129429 174005 31207 106285 -3476
10912c8380A28377a28585e4428A80764f5551A77181P6135h6252A95856k5103q2611
10901H8142b6595k86483c0148C5269K39674A10798f5045A12823b85296Q4389i4986
10889h2676I2019D5321K44547b80239G4047a84671Q2590b7797A49638J8804f3549
10877f2229H2470L5020L1284K1593q2877j5947e5870B6315c00686B33511i2254
10865C51607a24696e1250j69753A9651b12908P0555j25296B46411e7703b6712
10854F9914e8107m7179K5506j9024l1133J4037K5608o5208A63741E1200b73899
10842a48331L9252q369A42080K8879b3114C6367M4339g3837B17256n5238m8505
10831A13513j733j3754a04635n9382C5587b63851B08602e7699H0680c62494B31072
$$ plain form
10912 -38380 128377 -128585 -54428 180764 -65551 177181 253316 -86252 195856 170753 88142
10901 88142 -26595 -313078 -30148 35269 274943 110798 -65045 112823 -285296 -200907 -94986
10889 -82676 92019 45321 289868 -280239 74047 -184671 -102081 -27797 149638 168442 -63549
10877 -62229 82470 117490 148774 170367 87490 71543 -55870 26315 -300686 233511 -92254
10865 351607 -124696 -51250 -221003 19651 -212908 -142353 -267649 246411 -57703 -26712
10854 69914 -58107 -105286 -79780 -98804 -129937 -115900 -90292 -155500 163741 51200 -273899
10842 -148331 -109079 -117448 142080 170959 -23114 36367 80706 -73837 217256 162018 113513
10831 113513 111780 98026 -104635 -164017 35587 -263851 208602 -57699 80680 -362494 231072
10819a26376G0854J65833n2319A020a60674A78302L1286a64751B87085j02774
10809A84311a35646J7590B57630a83807I1793J65322f7796E184b03200B07152
10798d2631j06240j48057a808k13333O4279C09461B9965a05822M6596H7899a05830
10786g2270q0026P5881c80C4176P0332f9312D5640b3851G2356h9330m2221r5528
10774b27079A03085K94206a39839f5738A22312N0909a01312B05628c46192a64731
10763b01516A93881e3604k16756a26541F400J8775K3022b06411l583c275j4068
10752a7343E5191a97716K0322B64706b72941D0355a06196j28637J3627B85401
10741h2809C4125c8872j53301M2342D4154b41206p5151a6402H801K6898h6944
$$ plain form
10819 -126376 70854 236687 184368 1020 -160674 178302 209588 -164751 287085 184311
10809 184311 -135646 -118056 257630 -183807 91793 257115 -67796 5184 -203200 207152
10798 -42631 -148871 -296928 -1808 -215141 -150862 309461 29965 -105822 -59226 87899 -105830
10786 -72270 -152296 -76415 -380 34176 104508 -69312 45640 -23851 72356 -89330 -131551 -227079
10774 -227079 103085 397291 -139839 -65738 122312 173221 -101312 205628 -346192 -164731
10763 -201516 193881 -53604 -270360 -126541 6400 25175 48197 -206411 -209994 -3275 -17343
10752 -17343 55191 -197716 -177394 264706 -272941 40355 -106196 -234833 -221206 285401
10741 -82809 34125 -38872 -192173 -149831 44154 -241206 -316357 -16402 8801 35699 -86944
10729B0549O3391a74939O358A0986J19138R3192a34932I792b01938j03458A01778
10717I0774c7723H900a16779d4405G8972J7601e2446B21169j7815p3768M2431
10706A72017a70626C09861c3617j81571N8888M0992k43306J28034q0563j29933
10696d41076B07993o4800a77180A43205B6479a00522b2950l74423a55082c0260
10685D7359d213C30639b11798A80894b1479j80880d313B53609o3856H0857J80253
10674B61110a63014g3673n8461k42853c1944A91657a41088r3207j36751J24232
10664b46814j5373Q9211H7353K47089E3273a68753N1236o4481j1189a4555A62990
10652e28584A67847a32542N3194G0420R466B7145J01505c86271A01527a10616
$$ plain form
10729 20549 83940 -174939 -168581 10986 130124 223316 -134932 9792 -201938 -305396 101778
10717 90774 -37723 8900 -116779 -44405 78972 96573 -52446 221169 203354 129586 172017
10706 172017 -170626 309861 -33617 -215188 -156300 -115308 -358614 -230580 -311143 -441076
10696 -441076 207993 143193 -177180 143205 26479 -100522 -22950 -397373 -155082 -30260
10685 47359 -4213 330639 -211798 180894 -21479 -202359 -4313 253609 189753 80857 261110
10674 261110 -163014 -73673 -132134 -374987 -31944 191657 -141088 -234295 -371046 -246814
10664 -246814 -262187 -172976 87353 334442 53273 -168753 -117517 -181998 -193187 -14555 162990
10652 -528584 167847 -132542 -79348 70420 79886 27145 128650 -386271 101527 -110616
10641e7881I459h8802H7665a49656p148D17672A56243J22354I0343b66457G51
10629f6805l4617j48439N2225O5996a6654j16822l3034m4571g3383b1667l01310
10618c22977A87998e8573H4982b42820E5600f8356j73903Q449i4169l9564G2466
10606C3759a67846I5044l2945K012h2720j29850A59113a39763A30837n7202a14233
10594c00178c2771j37550G8610b20195E4916a49347G026b54544C5057K81357a44150
10582A97070F3395d0227j9503n7280I1116M0530a15128p9943J2329A50137E1901
10570A24820e9020B54266a80602j84969c3674r9852l4907P6716A59783a5957h7
10558a44707A25624O6701b70111R6241C8793J50469e0431A16808a98781M3780
$$ plain form
10641 -57881 9459 -88802 87665 -149656 -156804 417672 156243 278597 90343 -266457 751
10629 -66805 -101422 -249861 -197636 -131640 -16654 -133476 -166510 -211081 -73383 -21667 -322977
10618 -322977 187998 -58573 84982 -242820 55600 -68356 -242259 -233810 -94169 -133733 72466
10606 33759 -167846 95044 62099 64111 -82720 -212570 159113 -139763 130837 73635 -114233
10594 -300178 -32771 -170321 78610 -220195 54916 -149347 7026 -254544 35057 316414 -144150
10582 197070 63395 -40227 -59730 -117010 91116 131646 -115128 -195071 -182742 150137 51901
10570 124820 -59020 254266 -180602 -365571 -33674 -133526 -168433 -91717 159783 -15957 -87
10558 -144707 125624 192325 -270111 -173870 38793 189262 -50431 116808 -198781 -155001
10548a55001k7211Q9048A79441C2809b32863c9157k37228A17252b9113r5638A52710
10536A91560J01972C7793d987k2826j98814c6772I664J66105n7712L2728d24444
10524a89008F7782j9447a96507K1531I357P1485c62556e4845A52012i599q9419
10513i9018A12689a25919j67226A09645a82727e3445a8074k7404F2195L2267e1138
10501f5421j24195A31500e4402A74933f37158A55805J989B7140q779Q1977e0084
10489B4168j93c41766e5593A33759i3734a0182k26905J5398B13674d79684A0357
10477b1642C13915a73672C3909P0356A2433a09009A90394q7957K11576F0430K18912
10466B79342o9612f504A31190K114J22698I0214Q5663c4117A31243a70350A0754
$$ plain form
10548 -155001 -182212 -93164 179441 32809 -232863 -39157 -276385 117252 -29113 -124751 152710
10536 191560 293532 37793 -4987 -27813 -226627 -36772 9664 175769 118057 150785 -424444
10524 -189008 67782 48335 -196507 -174976 9357 80842 -362556 -54845 152012 -9599 -99018
10513 -99018 112689 -125919 -293145 109645 -182727 -53445 -18074 -45478 62195 94462 -51138
10501 -65421 -189616 131500 -54402 174933 -637158 155805 157794 27140 18361 100338 -50084
10489 24168 23975 -341766 -55593 133759 -93734 -10182 -237087 -221689 213674 -479684 10357
10477 -21642 313915 -173672 33909 104265 12433 -109009 190394 102437 314013 60430 279342
10466 279342 209730 -6504 131190 133304 256002 90214 175877 -34117 131243 -170350 10754
10454f5246A11484j2354N008k3430a86505o5346B0581e8464d356B73022A34020
10442E5942J34314m5668C2261a04332j36042A22154G224h9401B9382e4345C40225
10430a03856A53017M00526I406c7612A85137b74053E6251A5512L27776A12013
10419g4354k5174j62895A69971b41475H4185k9492L03601A6099O5550O7192b1723
10407g704l27479K7096a48595a3303A54381N4915k2353d23070J01317e8521L942
10396e4579j24644k33027A13360i60k01499k9055l0588A42788b14310B61480H7169
10384a70782k8126A81291K4043c63954C905g4250C55154d447o409B11539J35881
10373C47420A53622N7912i5436r875p8451A8246O3784K59126a08703B55435J67058
$$ plain form
10454 -65246 111484 99130 104138 80708 -186505 -251851 20581 -58464 -4356 273022 134020
10442 55942 190256 144588 32261 -104332 -240374 122154 7224 -89401 29382 -54345 340225
10430 -103856 153017 553543 9406 -37612 185137 -274053 56251 15512 343288 112013
10419 -74354 -99528 -262423 169971 -241475 84185 54693 358294 16099 81649 148841 -21723
10407 -7704 -335183 -308087 -148595 -13303 154381 209296 186943 -423070 -321753 -58521 -54579
10396 -54579 -179223 -412250 113360 -960 -202459 -231514 -262102 142788 -214310 261480 87169
10384 -170782 -198908 181291 205334 -363954 3905 -74250 355154 -4447 -10856 211539 347420
10373 347420 153622 211534 -95436 -105311 -183762 18246 82030 341156 -108703 255435 422493
10362D22493j28088I7437m3108J10864J18803n1315J24386Q6528n7793J57321
10352E43123j86423j67911J89853j59810N6049l6803r0416F2545K50472L99607
10342G12624j71829B40957D8764L74284F2445J05649K32991J03865J56324l5576
10332F25698K03349A06707J80230i62l5235A22078K42200A45250j782J6933m675
10321A55726L55675B04005c94931E3829K6518c8257F4956J26106J39334q3705
10311B46691J74874a79425K9977E29920B58176J10888j34332I0087M1195B6943
10300B67711q4676M0949M8400l7530A2195d3210k09635G014J80738b3798j49108
10289a72906o7148I5228f1345a2682E0099O8554j2889m3499L687K0689N471c3329
$$ plain form
10362 422493 294405 97437 54329 165193 283996 232681 357067 443595 385802 543123
10352 543123 356700 188789 378642 218832 274881 238078 147662 62545 313017 712624
10342 712624 540795 240957 48764 423048 62445 168094 401085 504950 661274 625698
10332 625698 829047 106707 286937 -962 -36197 122078 364278 145250 143468 160401 155726
10321 155726 511401 204005 -394931 53829 80347 -38257 64956 191062 330396 246691
10311 246691 421565 -179425 -149448 529920 258176 369064 234732 90087 131282 26943
10300 267711 183035 223984 272384 234854 12195 -43210 -252845 7014 187752 -23798 -172906
10289 -172906 -240054 95228 -61345 -12682 50099 118653 105764 62265 65952 86641 92112 -33329
10276b7308j1757j57917j180j77207A14164a3983I9279a43832d5221A39072a25073
10264a09721A4997a70031r2926g5271r9478Q4766k13228C8477O5108a53204C7853
10252a79811B15019d2350D9095g8640c5628E5568h8907C35591A21777J7981J82987
10241C22745b3897A11905g4839j98901C54983A3904c4967j17110a7617k56236
10231b73853Q7930f00k19743B1885a73287l2565h6273F3233j5161J09511b64811
10219A73491a01026A07806b33104Q2442L8825q336O559A50291j9702D4108K03831
10208B47939b07158A49126b64948l1842J28691G3239c7780j92012f8852A35566
10197G0156J763c14889i2863a4976I4165a87024E9409i0500j34988k08016a22265
$$ plain form
10276 -27308 -39065 -196982 -198162 -375369 114164 -13983 99279 -143832 -45221 139072 -125073
10264 -109721 14997 -170031 -262957 -75271 -174749 -89983 -303211 38477 103585 -153204 37853
10252 -179811 215019 -42350 49095 -78640 -35628 55568 -88907 335591 121777 139758 322745
10241 322745 -23897 111905 -74839 -273740 354983 13904 -34967 -152077 -17617 -273853
10231 -273853 -185923 -600 -220343 21885 -173287 -205852 -86273 63233 48072 157583 -264811
10219 173491 -101026 107806 -233104 -150662 -111837 -120173 -113614 150291 130589 44108 247939
10208 247939 -207158 149126 -264948 -296790 -168099 73239 -37780 -229792 -68852 135566
10197 70156 71919 -314889 -92863 -14976 94165 -187024 59409 -90500 -225488 -433504 -122265
10185b67250J22318A42723P5847j02205R8268J49054j64326C1008a12604E9064
10174g7085l4984k23452a66197D5698O5903n1450j2534b86082M339a07761A54122
10162a50657B30529i9848j57438g6666C04072a3207j16437j216Q458k9963N7024
10151i5341d3905q5787j55929F7728a5443q7325A11632j0925b56003c8982a118
10139b42704A1938e7285B37667F6606f8247i387D316M1578a27500B51866f0949
10127B6116b39779r0484E3445J48563o2871c61826B41348D9890a57584B04777
10116A04755d7349A39409h6501B10815E6523Q3864d1783o8991G8379M465C717
10104A15966C6132b6883m0332j58118g0649j92195E720J61989G9721p826h8430
$$ plain form
10185 -267250 -144932 142723 218570 116365 214633 363687 199361 31008 -112604 59064
10174 -77085 -112069 -335521 -166197 45698 111601 60151 47617 -286082 -281743 -107761 154122
10162 -150657 230529 -99848 -257286 -76666 304072 -13207 -129644 -130860 -122402 -152365 -95341
10151 -95341 -43905 -129692 -285621 67728 -15443 -102768 111632 100707 -256003 -38982 -1118
10139 -242704 11938 -57285 237667 66606 -68247 -9387 4316 45894 -127500 251866 -60949
10127 26116 -239779 -330263 53445 202008 139137 -361826 241348 49890 -157584 204777
10116 104755 -47349 139409 -86501 210815 56523 140387 -41783 -110774 78379 82844 3717
10104 115966 36132 -26883 -67215 -225333 -70649 -262844 5720 167709 79721 71895 -88430
10092b13457h1973j27027L5654A80358b12989e4720A13621b05941i6974k91881
10082c88855a54092H0884d273p2750k6890k01918o5528I0566b31249P265j57470
10071c81454A48403a07473j5834j98855h1533H2633f4750j80915A25915e1866
10060E1784h1688j8212E105a48266r108a7445p4064j5456A3010b68507A01316
10048a94691A3540J57076d6706q3958j23107P2015P1726C7710i8671P279A1336
10036i9106A84757c14272a54554c6680A0354Q4740G37J23433b47054A53981b7606
10024a24477A44459a04153A02896L4876A4873c3162j44048o9371J15815k42414
10014c73180a16486G1818P5497a77880G7987a24204k19864c2465a3111k91840
$$ plain form
10092 -213457 -81973 -209000 -173346 180358 -212989 -54720 113621 -205941 -96974 -388855
10082 -388855 -154092 80884 -4273 -77023 -103913 -305831 -371359 90566 -231249 -223984 -381454
10071 -381454 148403 -107473 -123307 -322162 -81533 82633 -64750 -245665 125915 -51866
10060 51784 -81688 -99900 5105 -148266 -157374 -17445 -91509 -106965 13010 -268507 101316
10048 -194691 13540 170616 -46706 -130664 -253771 -181756 -110030 37710 -98671 -91392 11336
10036 -99106 184757 -314272 -154554 -36680 10354 95094 737 124170 -247054 153981 -27606
10024 -124477 144459 -104153 102896 137772 14873 -33162 -177210 -246581 -130766 -373180
10014 -373180 -116486 71818 147315 -177880 77987 -124204 -344068 -32465 -13111 -304951
10004c04951K2774R4379e4788j74530k08993E29b1576O672j3873k37322L7685
9993b28414L5505j0405b3759j23363B6734a7085A4149J80326F8001a93178N3012
9982a40166a2624G1072a67275P0312C28785F6444D378m01b06259j7575j8364g5870
9969G3515c8038j12463B50889r0934a62199g8209M366p0550K8805A29624b08770
9957b45002l1447i4084j09930m3767A37515a41331j43989B62906g6406j76557
9947b52963K397J6470E7837a98702F1884J01115o2572b45945J18749j81062A85110
9935a3269n7545I5106a46362O1909E8884b65923a11465H956i6491I8165b33025
9923H7300h0007k24132k32564A44881E5892b79248j23903j9043A74966q0800a57975
$$ plain form
10004 -304951 -282177 -187798 -54788 -229318 -438311 529 -21576 -14904 -28777 -266099 -228414
9993 -228414 -192909 -203314 -23759 -147122 26734 -17085 14149 194475 68001 -193178 -140166
9982 -140166 -12624 71072 -167275 -96963 328785 66444 4378 3977 -206259 -223834 -242198 -75870
9969 73515 -38038 -150501 250889 159955 -162199 -78209 -73843 -144393 -115588 129624 -208770
9957 -245002 -276449 -94084 -204014 -247781 137515 -141331 -285320 262906 -76406 -252963
9947 -252963 -250566 -234096 57837 -198702 61884 162999 100427 -245945 -127196 -308258 185110
9935 -13269 -70814 95106 -146362 -84453 58884 -265923 -111465 8956 -96491 98165 -233025
9923 87300 -80007 -304139 -536703 144881 55892 -279248 -403151 -422194 174966 94166 -157975
9911A03387c16118A45796a10913A8361L3951c10090J16720d2829C8460b65092
9900a66162E9398A6606a37931A63776a64058k9381B87740A08146i2403k9123N2025
9889f9501j93458A05005c26970N2251M2864C34905i2311b137B6110K33012c51989
9877a4718F3054c5294l20365N3284d1732I2359a60499f8592l528J3102q8662B9047
9864B75899b78473F2531b39367B4058a15144A31583a16631A46837c64636a68079
9853A6434J53352n8213r200c24449J23956i4962E9620J10817l7652a2136m64441
9842d76577b00483a4995j97468k26406g2948i612j24039B35975h1506m1833K636
9831a20703j74654A47172F2808B0869J26553L1627b2837C09248a69606D96817
$$ plain form
9911 103387 -316118 145796 -110913 18361 52312 -310090 -193370 -42829 38460 -265092
9900 -166162 59398 16606 -137931 163776 -164058 -193439 287740 108146 -92403 -121526 -69501
9889 -69501 -262959 105005 -326970 -274719 -231855 334905 -92311 -2137 26110 259122 -351989
9877 -14718 63054 -35294 -355659 -302375 -41732 92359 -160499 -68592 -72120 -59018 -147680 29047
9864 275899 -278473 62531 -239367 24058 -115144 131583 -116631 146837 -364636 -168079
9853 16434 169786 111573 102373 -324449 -200493 -94962 59620 170437 132785 -12136 -476577
9842 -476577 -200483 -14995 -212463 -438869 -72948 -9612 -133651 235975 -81506 -123339 -120703
9831 -120703 -295357 147172 62808 20869 147422 179049 -22837 309248 -169606 496817
9820a43624A60567F0362a00288c6861k40229e8348C0545b45789e0735j89799I445
9808D557J58233n2256a15538H4118H301J68390g6871q7543O6243j39116O6229
9797a71058A02337i3347o6462f7743A34705a0282q0974L3660l69923H5385a31711
9785I5204b2105I5535m4088J83000b28377H2076b16012J01930G1744c50374H3136
9773a34025j2392k85965D5408f2284n8624k93388J89052E8126c2060I1722d8662
9761a93514A26175K7727C2953J41637G9344f9465r6406H2181b07501k6154O1118
9750a72537Q4440j94901J290k52777C0886J07343J8419a33443p9191B77905D0906
9738A20311b48893J00108c4858A67754b02176i5092j35121B4790a96626N3107
$$ plain form
9820 -143624 160567 60362 -100288 -36861 -277090 -58348 30545 -245789 -50735 -240534 9445
9808 4557 162790 110534 -115538 84118 8301 176691 -76871 -164414 -98171 -237287 -171058
9797 -171058 102337 -93347 -159809 -67743 134705 -10282 -91256 -57596 -427519 85385 -131711
9785 95204 -22105 95535 51447 234447 -228377 82076 -216012 -114082 71744 -350374 83136
9773 -134025 -146417 -432382 45408 -62284 -120908 -414296 -225244 58126 -32060 91722 -48662
9761 -193514 126175 153902 32953 174590 79344 -69465 -165871 82181 -207501 -233655 -172537
9750 -172537 -88097 -282998 -281708 -534485 30886 138229 156648 -133443 -212634 277905 40906
9738 120311 -248893 -148785 -34858 167754 -202176 -95092 -230213 24790 -196626 -143519
9728a43519O8852k44599A84708H4563e1624n6870B3114J94071D9616J44613g4280
9716a30823n9362Q164Q9933A29929b79366M3751i4144b8273b464k1912I723a60309
9703a78249q2571L3914E1216J05531a89749A22997b06489G1158B0664i6488d0406
9691c20248A60721j2999h4281B27107O5394b50458i7488r7044N6241B4168k408
9680B1760b9172Q42A05526c8421j01891L6963C72179A9910f8771B30732a65219
9668a18894I7890g4501A35308h2544A50345n2994a72190L6123j829j36636B50177
9656A73925p5448a42919G4276i6228b7117A3767M5367K38435j47529o5891c19806
9644c98481A78434g5107k11198K1372o5658k652A4506h5694L5362A42074G34a534
$$ plain form
9728 -143519 -74667 -319266 184708 84563 -51624 -108494 23114 217185 49616 194229 -74280
9716 -130823 -190185 -182021 -92088 129929 -279366 -235615 -94144 -28273 -2464 -24376 9723 -160309
9703 -178249 -260820 -226906 51216 156747 -189749 122997 -206489 71158 20664 -96488 -40406
9691 -320248 160721 147722 -84281 227107 292501 -250458 -97488 -194532 -138291 24168 21760
9680 21760 -29172 -28330 105526 -38421 -140312 -103349 372179 19910 -68771 230732 -165219
9668 -118894 97890 -74501 135308 -82544 150345 97351 -172190 -136067 -137896 -274532 250177
9656 173925 98477 -142919 74276 -96228 -27117 13767 59134 297569 150040 84149 -319806
9644 -398481 178434 -75107 -286305 -264933 -330591 -333243 14506 -85694 -50332 142074 734 -1534
9631b32112P7021B1467b19101l0691a4269n531m1145r8399A94490h062j26017
9620a34079O3262o6745l02711a3376I388f6021H2104a29578c0353j65739B9813
9608a70774d7556m4094b1773B17173e37761b28490a13597k5851c1338m4172j25215
9597b00725A95015C7252a32081A78104f6813k44407A92974j6840c3464j091k03667
9586b38222k6452E3513a09064A05301R3381b25572a0723I0562k3324d1626j81505
9575b23131b5814o6376p2383A61451b49899E513a79743A08685e065A42576C2460
9563a54168o0016e3121C06138e7872C44720d5941b2265l5637K3247o8207p6564
9552a79426J1124O9039D7071f1556B49920E4623c23773a38629B96625a10703c8117
$$ plain form
9631 -232112 -155091 21467 -219101 -249792 -14269 -19800 -60945 -159344 194490 -8062 -134079
9620 -134079 -70817 -137562 -440273 -13376 9388 -66021 82104 -129578 -30353 -196092 29813
9608 -170774 -47556 -91650 -21773 217173 -537761 -228490 -113597 -139448 -31338 -75510 -200725
9597 -200725 195015 37252 -132081 178104 -66813 -311220 192974 176134 -33464 -34555 -238222
9586 -238222 -264674 53513 -109064 105301 198682 -225572 -10723 90562 67238 -41626 -223131
9575 -223131 -25814 -92190 -164573 161451 -249899 5513 -179743 108685 -5065 142576 32460
9563 -154168 -214184 -53121 306138 -57872 344720 -45941 -22265 -57902 -34655 -102862 -179426
9552 -179426 -168302 -99263 47071 -61556 249920 54623 -323773 -138629 296625 -110703 -38117
9540a34059O215A49571a23025E4237J73640D255e9706C8717b92965B57044a05167
9528B3665c12283b8123m7134K5951B44834c25846D29450c0886k30189C8171b04054
9516i9677j23771A58733i6654q5443n6158A58986n3395l6539b73602J35573N9393
9505g8636I8078b18323C6503L91398f0214G3187i8201C29449a44888N1609j16125
9494b09404E5508f6061o1799C3651d5299A8649g3318B35682B1744b26143H4366
9482b35040A78777a2138A61611h3460j28065l6177R2017O0336b3430j04223A10642
9470a76465j19700H4305J56174a77224p790c6609j0581k8325i549B0993a24826
9458d8575k89086h7803c5744a0790M888A87401b24062n3418J3405i6686F8374
$$ plain form
9540 -134059 -127844 149571 -123025 54237 227877 4255 -59706 38717 -292965 257044 -105167
9528 23665 -312283 -28123 -75257 -49306 244834 -325846 429450 -30886 -261075 38171 -204054
9516 -99677 -223448 158733 -96654 -182097 -238255 158986 105591 69052 -273602 -138029 -78636
9505 -78636 98078 -218323 36503 427901 -60214 73187 -98201 329449 -144888 -93279 -209404
9494 -209404 55508 -66061 -127860 33651 -45299 18649 -73318 235682 21744 -226143 84366
9482 -235040 178777 -12138 161611 -83460 -211525 -247702 -155685 -95349 -23430 -127653 110642
9470 -176465 -296165 84305 240479 -177224 -185014 -36609 -47190 -75515 -9549 20993 -124826
9458 -48575 -337661 -87803 -35744 -10790 -5902 187401 -224062 -277480 -264075 -96686 68374
9446E3873i2511k72875a28628k0635B98462c0703q06A0663J26987l1361b0370
9434a67589L5373k25024a08604j67837F3509P4233J56670a32623M4419b4304l8906
9423f3210K6095m17144B41483C440a96701h156k28322B40040a8831F1061a81503
9411f3974l6107M8840A490J99161b89815h6232A92389A3896c5843j2111H5108
9399a19155L6270j16043A6053d9804j37085j1114j8036c2270r380k9167B67023
9387c66669Q8447A88055c60194J53392r8165F0587a4107o1992B5131c0604o2921
9376i3525M1654D354b550o0945j09547b0244k85114a11869a6011k39357i2026
9364A27872e2334a5930k6722p6767B48204e1259r3842e3525F040b56067A0170
$$ plain form
9446 53873 -92511 -365386 -128628 -149263 298462 -30703 -31509 10663 137650 106289 -20370
9434 -167589 -132216 -357240 -108604 -276441 63509 137742 294412 -132623 -88204 -24304 -63210
9423 -63210 -37115 -454259 241483 3440 -196701 -8156 -236478 240040 -18831 61061 -181503
9411 -63974 -100081 -51241 1490 200651 -289815 -86232 192389 13896 -35843 -47954 85108
9399 -119155 -82885 -198928 16053 -49804 -186889 -198003 -216039 -32270 -41650 -70817 267023
9387 -366669 -278222 188055 -360194 -206802 -304967 60587 -14107 -76099 25131 -30604 -93525
9376 -93525 -51871 4354 -2550 -63495 -173042 -20244 -305358 -111869 -16011 -255368 -92026
9364 127872 -52334 -15930 -42652 -119419 248204 -51259 -145101 -53525 6040 -256067 10170
9352c32310b8464E1948J1480a63548k03491g1751A29011a47687J6279J9491J3871
9341i8046j11963D5415g9255C57523h5735B17857C2394b65811b5505k44119f5793
9329a52117f555j48637D36663b02657C11138E7571b83836A14441b35895B5730
9318c8255J8378A37177b16806B49583c8470j09328B88765i5508I3716D2065m061
9307C8004J63822A254a63480A05410C3658J14852D8037b28743A51783c91884d9498
9295e5486B40340b22719D6948K0716b02620R3585l2910j00384B8666a03318j26951
9284b30269J2812r7253J37704J9434k9540a1065l8171j58898n2590E2039N4108
9273A06147a86613Q4144k19962D627c8646D5b3815o1985A51137L9420a7353F9066
$$ plain form
9352 -332310 -28464 51948 63428 -163548 -367039 -71751 129011 -147687 -131408 -111917 -98046
9341 -98046 -210009 45415 -79255 357523 -85735 217857 32394 -265811 -25505 -269624 -65793
9329 -152117 -6555 -155192 436663 -202657 311138 57571 -283836 114441 -235895 25730
9318 -38255 -19877 137177 -216806 249583 -38470 -147798 288765 -95508 93716 42065 38004
9307 38004 201826 1254 -163480 105410 33658 148510 48037 -228743 151783 -391884 -49498
9295 -55486 240340 -222719 46948 67664 -202620 -109035 -141945 -242329 28666 -103318 -230269
9284 -230269 -217457 -314710 -177006 -157572 -187112 -11065 -49236 -208134 -260724 52039 106147
9273 106147 -186613 -102469 -322431 4627 -38646 45 -23815 -85800 151137 190557 -17353 69066
9260A61461B895b99162a6068A2184K57443o1397b93974A76241q0483a39967o5320
9249b05287a01782M0915j37423j40806a20357a1199I2867c08222N1607H878d4730
9237a69915Q2142A75270l311d21662a96861C3461c55888A99010f696l2555k29631
9226b68882N1920l470o5297A06491a05916K9705n6659j46829I5668A5044b18093
9214e57556a57313E9518a967H7760a46948A59304a62128p9731D8719A8728d140
9202B55237I5491o246a73825A71204a34511A22239a12935j82525a5868d15k48624
9191b49039A56416a77161d0615r4648N5545I7973a94539o4802E8650i079p8707
9180h7786C4047a71379A3712q70K5350R5312g6472n3430o4092h4653j68516E952
$$ plain form
9260 161461 2895 -299162 -16068 12184 269627 208230 -293974 176241 95758 -139967 -205287
9249 -205287 -101782 -60867 -198290 -339096 -120357 -11199 92867 -308222 -256615 8878 -44730
9237 -169915 -87773 175270 171959 -421662 -196861 33461 -355888 199010 -6696 -39251 -268882
9226 -268882 -216962 -220432 -285729 106491 -105916 -76211 -132870 -279699 95668 15044 -218093
9214 -557556 -157313 59518 -1967 87760 -146948 159304 -162128 -241859 48719 18728 -4140
9202 255237 95491 89245 -173825 171204 -134511 122239 -112935 -295460 -15868 -415 -249039
9191 -249039 156416 -177161 -40615 -135263 -79718 97973 -194539 -259341 58650 -9079 -87786
9180 -87786 34047 -171379 13712 12842 38192 133504 -76472 -129902 -193994 -84653 -253169 5952
9167f6412a4149B30630E3084c27894E8150b20318n619c4553E40533b89774a07202
9155A32268B5486a05324F471a14217I4622a50142A31185d3121a0287m55328E3354
9143a41016b8160F8265d4584n59B68624a1165F7687P3075b1703A41691a42815
9131B50983A20373a71179D4462a53594M9621k33122I7001K782h8798B4740b07553
9119B9349b9914C0320K8640a32684A62292o1118a29018c2091A21908b05442A93616
9107A21556a96557m3856J23L6786l3129N0653M2349A01466J11096l384J60141
9096C69319a56341l448b7642k6777q7078L2420C60049a95005R4845k6843a3424
9084D4251a50737o7338D5304b74426L58B83588b7951k62944E6341A06J9369J38794
$$ plain form
9167 -66412 -14149 230630 53084 -327894 58150 -220318 -225937 -34553 540533 -289774 -107202
9155 132268 25486 -105324 6471 -114217 94622 -150142 131185 -43121 -10287 -465615 53354
9143 -141016 -28160 68265 -44584 -45143 268624 -11165 67687 140762 -21703 141691 -142815
9131 250983 120373 -171179 44462 -153594 -103973 -337095 97001 99783 -88798 24740 -207553
9119 29349 -29914 30320 58960 -132684 162292 101174 -129018 -32091 121908 -205442 193616
9107 121556 -196557 -240413 -240290 -203504 -236633 -185980 -143631 101466 212562 209178 369319
9096 369319 -156341 -159789 -27642 -54419 -141497 -109077 360049 -195005 -100160 -127003 -13424
9084 44251 -150737 -218075 45304 -274426 -274068 283588 -27951 -290895 56341 106 19475 158269
9072A58269b60791k87638a30883G1895a09558c408l54007a01522b8339j17424
9062a45763M1088C04625d9866j26742D7439a05736c5838j27255B46780e3231I2913
9050i5303M6227l8734A26688b05966k0085A15622J50609b04088a3682b42C00534
9038A19383b73052A39377c04137L4209a21250C34253b34545C7307a65393A51797
9027b95603M8760F5246N882K276a48689G2935j4780h4862o3342c3835D8470e1075
9014a0682j76816F8100C3216b45679l0437I609Q5186e5354H4612c163q1400A14640
9001E6853a89381A74693c0907d284B59248c9367j84680G8143b08123K2456C04050
8989b45918E5546O2812J15468d84068c4604E4016a62120f5450H6944a19968R263
$$ plain form
9072 158269 -260791 -548429 -130883 71895 -109558 -3408 -357415 -101522 -28339 -145763
9062 -145763 -104675 304625 -49866 -176608 47439 -105736 -35838 -163093 246780 -53231 92913
9050 -95303 -49076 -87810 126688 -205966 -226051 115622 266231 -204088 -13682 -242 300534
9038 119383 -273052 139377 -304137 -269928 -121250 334253 -234545 37307 -165393 151797
9027 -295603 -246843 65246 71128 73404 -148689 72935 58155 -84862 -148204 -33835 48470 -51075
9014 -10682 -187498 68100 33216 -245679 -276116 9609 94795 -55354 84612 -3163 -84563 114640
9001 56853 -189381 174693 -30907 -4284 259248 -39367 -224047 78143 -208123 -185667 304050
8989 -245918 55546 118358 233826 -484068 -34604 54016 -162120 -65450 86944 -119968 -110705
8978a10705m9512D6367N3322b59943J21036C0286d1489j78361A09186l8280P2367
8967A43273a04108l0458B38491m7442b2446E4570a11227k43154b2365n3760a5814
8955b8465o0564J543A01295c0138j76602J2486j63001B2137K86464D0741g8397
8943b25283E9269g6022A63396k5610b83979c146G0079b6677O614B96793i7877
8931A2910a24923r466j43323j9102J46143d3920J4711C1485O0654a33263f6395
8919d7285A16684L21126A44715a67180b5284l8509B48944O8647Q7960K51444M91327
8908A148322J79855J717532J694268N713991E000643B478670q00283m82543E60729
8898D48794J33132k28116A40842K72905a06706B07645N1658R7441j72011o0396
$$ plain form
8978 -110705 -160217 46367 99689 -259943 -138907 30286 -41489 -219850 109186 70906 143273
8967 143273 -104108 -134566 238491 191049 -22446 54570 -111227 -354381 -22365 -76125 -15814
8955 -28465 -89029 -87486 101295 -30138 -206740 -194254 -357255 22137 308601 40741 -78397
8943 -225283 59269 -76022 163396 137786 -283979 -3146 70079 -26677 -20063 296793 -97877
8931 12910 -124923 -134389 -277712 -296814 -150671 -43920 -29209 31485 92139 -133263 -66395
8919 -47285 116684 437810 144715 -167180 -25284 -63793 248944 317591 405551 656995 1148322
8908 1148322 1328177 3045709 4739977 10453968 5000643 2478670 1678387 1195844 560729
8898 448794 581926 353810 140842 413747 -106706 207645 259303 356744 184733 124337
8888A24337C9913j1753b75535J18373N9439d8556D7672k1024b56343c6920C3268
8876a77851G9728b43781L9975J8712q2095f2697k17240d8679m3496b200m89774
8865d91974J34127J60223M1253o7484O452k6943A03419C0595J95619b17052A27543
8853D148R0771a05736q5990B49943b91839B85816A6691a73103c6297n2185B37373
8841a30493A64660n0967C2713b6896k43034j993A822J30631b7461B10141c44617
8829A55174m9738L1114l864a31898B94711c21551E6080f7504B8102a59423J0514
$$ plain form
8888 124337 39913 28160 -275535 -157162 -97723 -48556 47672 26648 -256343 -36920 33268
8876 -177851 79728 -243781 -203806 -185094 -267189 -62697 -279937 -48679 -92175 -2200 -491974
8865 -491974 -357847 -197624 -156371 -223855 -217403 -244346 103419 30595 226214 -217052 127543
8853 4148 94919 -105736 -191726 249943 -291839 285816 16691 -173103 -36297 -88482 237373
8841 -130493 164660 113693 32713 -26896 -269930 -271923 1822 132453 -27461 210141 -344617
8829 155174 105436 136550 132686 -131898 294711 -321551 56080 -67504 28102 -159423 -148909
$$ [...]
##END NTUPLES=NMR SPECTRUM
##END=
