
##TITLE=UV1147_M6-1005-1000_6279012_ruyhNrGdiu
##JCAMPDX= 6.0         $$ Bruker NMR JCAMP-DX V2.0
##DATA TYPE= NMR SPECTRUM
##DATA CLASS= NTUPLES
##ORIGIN= BRUKER
##OWNER= Administrator
$$ 1.72 TOPSPIN		Version 2.1
$$ 2012-06-03 11:22:59.312 -0500  Administrator@TOPSPIN
$$ Compression mode = diff/dup
##.OBSERVE FREQUENCY= 400.13188235
##.OBSERVE NUCLEUS= ^1H
##.ACQUISITION MODE= SIMULTANEOUS (DQD)
##.ACQUISITION SCHEME= undefined
##.AVERAGES= 64
##.DIGITISER RES= 22
##SPECTROMETER/DATA SYSTEM= spect
##.PULSE SEQUENCE= noesygpps1d.comp
##.SOLVENT NAME= COFFEE_meoh
##.SHIFT REFERENCE= INTERNAL, COFFEE_meoh, 1, 14.96714
##AUDIT TRAIL= $$ (NUMBER, WHEN, WHO, WHERE, PROCESS, VERSION, WHAT)
$$ ##TITLE= Audit trail, TOPSPIN		Version 2.1
$$ ##JCAMPDX= 5.01
$$ ##ORIGIN= Bruker BioSpin GmbH
$$ ##OWNER= Administrator
$$ $$ C:\Bruker\TOPSPIN/data/COFFEE/nmr/UV1147_M6-1005-1000_6279012_ruyhNrGdiu/12/pdata/1/auditp.txt
$$ ##AUDIT TRAIL=  $$ (NUMBER, WHEN, WHO, WHERE, PROCESS, VERSION, WHAT)
(   1,<2012-06-03 11:22:53.843 -0500>,<Administrator>,<TOPSPIN>,<go>,<TOPSPIN 2.1>,
      <created by zg
	started at 2012-06-03 11:11:23.625 -0500,
	POWCHK enabled, PULCHK disabled,
       configuration hash MD5:
       D5 CA 7A 23 FE 6B EE E2 50 67 74 61 24 F7 5E 3B
       data hash MD5: 64K
       06 5D A7 A5 E4 C2 10 1D 62 7C 45 F9 D3 4E A1 24>)
(   2,<2012-06-03 11:22:56.625 -0500>,<Administrator>,<TOPSPIN>,<proc1d>,<TOPSPIN 2.1>,
      <Start of raw data processing
       efp LB = 0.3 FT_mod = 6 PKNL = 1 PHC0 = 0 PHC1 = 0 SI = 128K 
       data hash MD5: 128K
       F9 E7 77 62 8E 08 52 21 98 74 77 01 59 5B BF 83>)
(   3,<2012-06-03 11:22:57.953 -0500>,<Administrator>,<TOPSPIN>,<proc1d>,<TOPSPIN 2.1>,
      <pk PHC0 = 30.06958 PHC1 = 0 
       data hash MD5: 128K
       68 55 14 EB 9B 16 F4 B4 71 C1 64 C6 62 D1 8C 97>)
(   4,<2012-06-03 11:22:58.656 -0500>,<Administrator>,<TOPSPIN>,<proc1d>,<TOPSPIN 2.1>,
      <abs ABSG = 1 
       data hash MD5: 128K
       7F B6 46 85 6F E6 B6 90 0E FC D4 4C BC 9B D4 C9>)
(   5,<2012-06-03 11:22:58.734 -0500>,<Administrator>,<TOPSPIN>,<proc1d>,<TOPSPIN 2.1>,
      <abs ABSG = 2 
       data hash MD5: 128K
       31 5D F8 F6 18 D1 6F 8C 0D 23 CC 35 21 C5 A4 45>)
(   6,<2012-06-03 11:22:58.781 -0500>,<Administrator>,<TOPSPIN>,<proc1d>,<TOPSPIN 2.1>,
      <abs ABSG = 3 
       data hash MD5: 128K
       7C 4D 21 B4 E7 0C 3C F5 57 FA 8F 21 B4 E2 C4 54>)
(   7,<2012-06-03 11:22:58.843 -0500>,<Administrator>,<TOPSPIN>,<proc1d>,<TOPSPIN 2.1>,
      <abs ABSG = 4 
       data hash MD5: 128K
       6F EA 3B F5 9E F0 7C DD 14 1D FC AA 5A 3F F1 3D>)
(   8,<2012-06-03 11:22:58.906 -0500>,<Administrator>,<TOPSPIN>,<proc1d>,<TOPSPIN 2.1>,
      <abs ABSG = 5 
       data hash MD5: 128K
       82 D1 EF C9 9B 3D 97 03 D7 5A 73 75 F5 56 CA 45>)
$$ ##END=
$$ 
$$ $$ hash MD5
$$ $$ 62 6A FD 64 F7 D7 90 49 F5 18 77 F1 C4 6E C5 F4
##$RELAX= 
##$RELAX= 
##$RELAX= 
##$RELAX= 
##$RELAX= 
##$RELAX= 
##$RELAX= 
##$RELAX= 
$$ Bruker specific parameters
$$ [...]
##$TP07= 0
##$TPNAME0= <>
##$TPNAME1= <>
##$TPNAME2= <>
##$TPNAME3= <>
##$TPNAME4= <>
##$TPNAME5= <>
##$TPNAME6= <>
##$TPNAME7= <>
##$TPOAL= (0..7)
0.5 0.5 0.5 0.5 0.5 0.5 0.5 0.5
##$TPOFFS= (0..7)
0 0 0 0 0 0 0 0
##$TUNHIN= 0
##$TUNHOUT= 0
##$TUNXOUT= 0
##$USERA1= <user>
##$USERA2= <user>
##$USERA3= <user>
##$USERA4= <user>
##$USERA5= <user>
##$V9= 5
##$VALIST= <valist>
##$VCLIST= <CCCCCCCCCCCCCCC>
##$VD= 0
##$VDLIST= <DDDDDDDDDDDDDDD>
##$VPLIST= <PPPPPPPPPPPPPPP>
##$VTLIST= <TTTTTTTTTTTTTTT>
##$WBST= 2048
##$WBSW= 25
##$XGAIN= (0..3)
0 0 0 0
##$XL= 0
##$YL= 0
##$YMAX_a= 10810954
##$YMIN_a= -6921158
##$ZGOPTNS= <>
##$ZL1= 120
##$ZL2= 120
##$ZL3= 120
##$ZL4= 120
##$ABSF1= 14.96714
##$ABSF2= -5.58539
##$ABSG= 5
##$ABSL= 3
##$ALPHA= 0
##$AQORDER= 0
##$ASSFAC= 0
##$ASSFACI= 0
##$ASSFACX= 0
##$ASSWID= 0
##$AUNMP= <proc_prof1d_extract.lims>
##$AXLEFT= 0
##$AXNAME= <>
##$AXNUC= <1H>
##$AXRIGHT= 0
##$AXTYPE= 0
##$AXUNIT= <>
##$AZFE= 0.1
##$AZFW= 0.1
##$BCFW= 0
##$BC_mod= 0
##$BYTORDP= 0
##$COROFFS= 0
##$CY= 15
##$DATMOD= 1
##$DC= 0
##$DFILT= <>
##$DTYPP= 0
##$F1P= 0
##$F2P= 0
##$FCOR= 0.5
##$FTSIZE= 131072
##$FT_mod= 6
##$GAMMA= 0
##$GB= 0
##$INTBC= 1
##$INTSCL= 1
##$ISEN= 128
##$LB= 0.3
##$LEV0= 0
##$LPBIN= 0
##$MAXI= 10000
##$MC2= 0
##$MEAN= 0
##$ME_mod= 0
##$MI= 0
##$NCOEF= 0
##$NC_proc= -3
##$NLEV= 6
##$NOISF1= 0
##$NOISF2= 0
##$NSP= 0
##$NTH_PI= 0
##$NZP= 0
##$OFFSET= 14.96714
##$PC= 1
##$PHC0= 30.06958
##$PHC1= 0
##$PH_mod= 1
##$PKNL= yes
##$PPARMOD= 0
##$PPDIAG= 0
##$PPIPTYP= 0
##$PPMPNUM= 2147483647
##$PPRESOL= 1
##$PSCAL= 4
##$PSIGN= 0
##$PYNMP= <proc.py>
##$REVERSE= no
##$SF= 400.130005391008
##$SI= 131072
##$SIGF1= 0
##$SIGF2= 0
##$SINO= 400
##$SIOLD= 131072
##$SPECTYP= <>
##$SREGLST= <1H.CDCl3>
##$SSB= 0
##$STSI= 131072
##$STSR= 0
##$SW_p= 8223.68421052632
##$SYMM= 0
##$S_DEV= 0
##$TDeff= 65536
##$TDoff= 0
##$TI= <>
##$TILT= no
##$TM1= 0
##$TM2= 0
##$TOPLEV= 0
##$USERP1= <user>
##$USERP2= <user>
##$USERP3= <user>
##$USERP4= <user>
##$USERP5= <user>
##$WDW= 1
##$XDIM= 131072
##$YMAX_p= 492702497
##$YMIN_p= -443846820
##$CURPLOT= <Network HP LaserJet P1505>
##$CURPRIN= <$Network HP LaserJet P1505>
##$DFORMAT= <normdp>
##$LAYOUT= <+/1D_H.xwp>
##$LFORMAT= <normlp>
##$PFORMAT= <normpl>
##$SURQMSG= 1
$$ End of Bruker specific parameters
$$ ---------------------------------
##NTUPLES= NMR SPECTRUM
##VAR_NAME=  FREQUENCY,     SPECTRUM/REAL,   SPECTRUM/IMAG
##SYMBOL=    X,             R,               I
##VAR_TYPE=  INDEPENDENT,   DEPENDENT,       DEPENDENT
##VAR_FORM=  AFFN,          ASDF,            ASDF
##VAR_DIM=   131072,        131072,          131072
##UNITS=     HZ,            ARBITRARY UNITS, ARBITRARY UNITS
##FACTOR=    0.0627417313425165, 1,          1
##FIRST=     8223.62146879498, 3090,         -101398
##LAST=      0,             2778,            -102761
##MIN=       0,             -443846820,      0
##MAX=       8223.62146879498, 492702497,    0
$$ Real data points
##PAGE= N=1
##DATA TABLE= (X++(R..R)), XYDATA
$$ [...]
63536A475096j1739j2225j3046j4244j5262j5791j6538j8879k3241k7999l0802
$$ 1475096 1463357 1451132 1438086 1423842 1408580 1392789 1376251 1357372 1334131 1306132 1275330
63525A275330l0988k9919k8984k8205k7007k5231k2992k0235j7031j3666j0226
$$ 1275330 1244342 1214423 1185439 1157234 1130227 1104996 1082004 1061769 1044738 1031072 1020846
63514A020846o687l518j300M07K700N618Q016R536J1196J3386J4887J5033J5308
$$ 1020846 1014159 1010641 1009341 1009748 1012448 1018066 1026082 1035618 1046814 1060200 1075087 1090120 1105428
63501A105428J7211J9815K1322K2081K3952K7251L0385L2415L4057L6074L8445
$$ 1105428 1122639 1142454 1163776 1185857 1209809 1237060 1267445 1299860 1333917 1369991 1408436
63490A408436M1300M4866M8248M9857M9249M6870M1848L2426J9395O886j805p463
$$ 1408436 1449736 1494602 1542850 1592707 1641956 1688826 1730674 1763100 1782495 1789381 1787576 1780113
63478A780113j2560j7221j9602j9261j7928j7158j7022j7306j8481k1231k5767
$$ 1780113 1767553 1750332 1730730 1711469 1693541 1676383 1659361 1642055 1623574 1602343 1576576
63467A576576l1681l7724m2063m3794m4005m4404m5006m4348m1935l9147l7325
$$ 1576576 1544895 1507171 1465108 1421314 1377309 1332905 1287899 1243551 1201616 1162469 1125144
63456A125144l6012l3752l0068k6100k3506k2908k3232k2627k0397j7678j5806
$$ 1125144 1089132 1055380 1025312 999212 975706 952798 929566 906939 886542 868864 853058
63445H53058j4467j2409r561p203o083n652n387n569o150o099m762l076k435k975
$$ 853058 838591 826182 816621 809418 803335 797683 792296 786727 780577 774478 769716 766640 764205 761230
63431G61230l716l873l284k053o02L10L99M63J437L212M916N903N784M125J212
$$ 761230 757514 753641 750357 748304 747702 748012 748411 748874 750311 753523 758439 764342 770126 774251 775463
63416G75463j228j396L92J948J705L7j923l591m697m939m594m650n527o254n558
$$ 775463 774235 772839 773231 775179 776884 776921 774998 771407 766710 761771 757177 752527 747000 740746 735188
63401G35188l399q52J000J656J245O30R84K510M035M600M989O671R623J2334J4017
$$ 735188 731789 730937 731937 733593 734838 735468 736452 738962 742997 747597 752586 759257 768880 781214 795231
63386G95231J5530J7623J9508K0036J9693K0297K2911K6870L0878L4304L7086
$$ 795231 810761 828384 847892 867928 887621 907918 930829 957699 988577 1022881 1059967
63375A059967L9042L9885L9587L8156L5279L0899K6249K3554K4050K6746K9665
$$ 1059967 1099009 1138894 1178481 1216637 1251916 1282815 1309064 1332618 1356668 1383414 1413079
63364A413079L2045L4544L7608M0692M3303M5768M8307N0031M9605M6540M1294
$$ 1413079 1445124 1479668 1517276 1557968 1601271 1647039 1695346 1745377 1794982 1841522 1882816
63353A882816L4447K6473J8014R707J867n264j1094j5057j7189j8050j8345j9019
$$ 1882816 1917263 1943736 1961750 1971457 1973324 1968060 1956966 1941909 1924720 1906670 1888325 1869306
63341A869306k1119k4845k9175l3222l7340m1987m6047m7836m7462m6600m5820
$$ 1869306 1848187 1823342 1794167 1760945 1723605 1681618 1635571 1587735 1540273 1493673 1447853
63330A447853m3820l9907l5476l2103k9476k6404k2794j9258j5608j1262o690
$$ 1447853 1404033 1364126 1328650 1296547 1267071 1240667 1217873 1198615 1183007 1171745 1165055
63319A165055l065n41J949N174Q848J2472J5909J8854K0632K1040K1011K2023
$$ 1165055 1161990 1161449 1163398 1168572 1177420 1189892 1205801 1224655 1245287 1266327 1287338 1309361
63307A309361K4852K8784L2089L3566L3834L4712L7153M0361M3226M5715M8059
$$ 1309361 1334213 1362997 1395086 1428652 1462486 1497198 1534351 1574712 1617938 1663653 1711712
63296A711712M9385M8329M4594L8992L2235K4619J6578Q496L02p726j4164j7781
$$ 1711712 1761097 1809426 1854020 1893012 1925247 1949866 1966444 1974940 1975242 1967516 1953352 1935571
63284A935571j9376k0842k2567k3458k3681k5359k9799l5596m0539m4064m6785
$$ 1935571 1916195 1895353 1872786 1849328 1825647 1800288 1770489 1734893 1694354 1650290 1603505
63273A603505m8752m9450m8813m7138m4477m0922l6992l3031k8805k4337k0326
$$ 1603505 1554753 1505303 1456490 1409352 1364875 1323953 1286961 1253930 1225125 1200788 1180462
63262A180462j7116j4154j1483j0793j3608j8917k3843k6350k6383k4790k2436
$$ 1180462 1163346 1149192 1137709 1126916 1113308 1094391 1070548 1044198 1017815 993025 970589
63251I70589k0160j8440j6995j5429j3905j2560j0862q691p324p969r645j0129
$$ 970589 950429 931989 914994 899565 885660 873100 862238 853547 846223 838254 828609 818480
63239H18480q818p152o288o005o062o839q127q829q564q256q482q559p954p228
$$ 818480 809662 802510 796222 790217 784155 777316 769189 760360 751796 743540 735058 726499 718545 711317
63225G11317o704n560l387j499j406k798m227m976n132m601l428k493k514k780
$$ 711317 704613 699053 695666 694167 692761 689963 685736 680760 675628 671027 667599 665106 662592 659812
63211F59812k066m49J043K085K982L301K324P55K57J019J447Q10M70J604L184
$$ 659812 657746 657297 658340 660425 663407 666708 669032 669787 670044 671063 672510 673320 673790 675394 678578
63196F78578L563L083L498N392P533Q778R332R893J0525J0969J1436J2476J4175
$$ 678578 682141 685224 688722 694114 701647 710425 719757 729650 740175 751144 762580 775056 789231
63183G89231J5906J7035J7664J8436J9558K0407K0428K0181K0933K3201K6315
$$ 789231 805137 822172 839836 858272 877830 898237 918665 938846 959779 982980 1009295
63172A009295K9468L2455L5034L6357L5808L4030L2358L1365L0550K9345K7820
$$ 1009295 1038763 1071218 1106252 1142609 1178417 1212447 1244805 1276170 1306720 1336065 1363885
63161A363885K6395K5498K5492K6327K7163K6899K5322K3282K1446J9440J6507
$$ 1363885 1390280 1415778 1441270 1467597 1494760 1521659 1546981 1570263 1591709 1611149 1627656
63150A627656J2594Q224L535j921q345j4987k0478k3793k4941k4834k4430k3952
$$ 1627656 1640250 1648474 1652009 1650088 1641743 1626756 1606278 1582485 1557544 1532710 1508280 1484328
63138A484328k3015k1437j9579j7682j5401j2378r026o115l703j133J863M729
$$ 1484328 1461313 1439876 1420297 1402615 1387214 1374836 1365810 1359695 1355992 1354859 1356722 1361451
63126A361451P033R210J1855J4673J6752J7810J8656K0289K2862K5592K7445K7857
$$ 1361451 1368484 1377694 1389549 1404222 1420974 1438784 1457440 1477729 1500591 1526183 1553628 1581485
63114A581485K6938K5129K2814K0278J7927J6077J4449J2223Q838M534o1m527
$$ 1581485 1608423 1633552 1656366 1676644 1694571 1710648 1725097 1737320 1746158 1750692 1750631 1746104
63102A746104q733j2780j7178k2455k8187l2918l5701l7177l8416l9259l8907
$$ 1746104 1737371 1724591 1707413 1684958 1656771 1623853 1588152 1550975 1512559 1473300 1434393
63091A434393l7657l6635l5925l4446l1942k9641k8280k6871k4349k1294j8908
$$ 1434393 1396736 1360101 1324176 1289730 1257788 1228147 1199867 1172996 1148647 1127353 1108445
63080A108445j7191j5301j3073j0975r052p138n713n292n155l945j525R16K638
$$ 1108445 1091254 1075953 1062880 1051905 1042853 1035715 1030002 1024710 1019555 1015610 1014085 1015001 1017639
63067A017639M096N733P166P968Q360Q735R132R396R112P464M213R10j76J197
$$ 1017639 1021735 1027468 1034634 1042602 1050962 1059697 1068829 1078225 1087337 1094801 1099014 1099924 1099748 1100945
63053A100945K801K863K178K387L389L889L586L301L240K741J694R02Q10R17O77
$$ 1100945 1103746 1106609 1108787 1111174 1114563 1118452 1122038 1125339 1128579 1131320 1133014 1133916 1134726 1135643 1136320
63038A136320P5q11j831k211j155P99K123K506L370N456P144O500M085K299K423
$$ 1136320 1136395 1135584 1133753 1131542 1130387 1131186 1133309 1135815 1139185 1144641 1151785 1158285 1162370 1164669 1167092
63023A167092L815N644P702R343R352P665N984N908P344R388J1589J3559J4552
$$ 1167092 1170907 1176551 1184253 1193596 1202948 1210613 1216597 1222505 1229849 1239237 1250826 1264385 1278937
63010A278937J4751J5879J9011K2492K3895K3586K4315K7223L0444L2260L3586
$$ 1278937 1293688 1309567 1328578 1351070 1374965 1398551 1422866 1450089 1480533 1512793 1546379
62999A546379L6136L9831M3535M7098N1050N5043N8260O0955O4109O7758P0901
$$ 1546379 1582515 1622346 1665881 1712979 1764029 1819072 1877332 1938287 2002396 2070154 2141055
62988B141055P2921P3954P4071P3324P2415P2055P1624O9818O6785O4258O3195
$$ 2141055 2213976 2287930 2362001 2435325 2507740 2579795 2651419 2721237 2788022 2852280 2915475
62977B915475O2560O0953N8395N5668N2748M8808M3342L6591K9078K1080J2382
$$ 2915475 2978035 3038988 3097383 3153051 3205799 3254607 3297949 3334540 3363618 3384698 3397080
62966C397080K462q793k0484l1266m0526m8494n5377o1147o6038p0167p2540p1610
$$ 3397080 3399542 3390749 3370265 3338999 3298473 3249979 3194602 3133455 3067417 2997250 2924710 2853100
62954B853100o7287o1388n5596m9799m3057l5194k6764j8251j0145l063L047R159
$$ 2853100 2785813 2724425 2668829 2619030 2575973 2540779 2514015 2495764 2485619 2482556 2485603 2494762
62942B494762J5811K2008K6480K9500L2483L6009L9157M0802M0768L9727L8560
$$ 2494762 2510573 2532581 2559061 2588561 2621044 2657053 2696210 2737012 2777780 2817507 2856067
62931B856067L7854L7568L7072L5708L3196K9446K4442J8523J2177N261k953j2540
$$ 2856067 2893921 2931489 2968561 3004269 3037465 3066911 3091353 3109876 3122053 3127314 3124361 3111821
62919C111821k2447l1749m0691m9807n8736o6675p3322p8499q1539q2172q1502
$$ 3111821 3089374 3057625 3016934 2967127 2908391 2841716 2768394 2689895 2608356 2526184 2444682
62908B444682q0847p9976p7689p3957p0094o6805o3410n9363n5399n2547n0731
$$ 2444682 2363835 2283859 2206170 2132213 2062119 1995314 1931904 1872541 1817142 1764595 1713864
62897A713864m8987m6569m3541m0574l8387l7075l5964l4427l2714l1455l0495
$$ 1713864 1664877 1618308 1574767 1534193 1495806 1458731 1422767 1388340 1355626 1324171 1293676
62886A293676k9019k6785k4494k2703k1114j9301j7596j6707j6637j6450j5188
$$ 1293676 1264657 1237872 1213378 1190675 1169561 1150260 1132664 1115957 1099320 1082870 1067682
62875A067682j2915j0724r546r086q295o892n812n859o488o422n084l062j533
$$ 1067682 1054767 1044043 1034497 1025411 1017116 1010224 1004412 998553 992065 985643 980559 977497 975964
62862I75964j461k831m366m705m217m674o579q007p070m510k575k226k840l881
$$ 975964 974503 971672 967306 962601 958384 953710 947131 939124 932054 927544 924969 922743 919903 916022
62848I16022n142n912n681n412o299p489o895m328j876q69m05O27J871K631L060
$$ 916022 910880 904968 899287 893875 887576 880087 873192 868864 866988 866119 865714 866341 868212 870843 873903
62833H73903L271K667J151j80m67k50l51o24n74l38k50k90n51j331k232k230j306
$$ 873903 877174 879841 880992 880812 880345 880095 879744 879120 878546 878208 877958 877668 877117 875786 873554 871324 870018
62816H70018q70j710k755k756k117j920k125k021j696j883k767l839m512m168
$$ 870018 869148 867438 864683 861927 859810 857890 855765 853744 852048 850165 847398 843559 839047 834879
62802H34879k402L7J430J112M86J026K205K535J806J013P15Q15J333K091K135
$$ 834879 832477 832514 833944 835056 835542 836568 838773 841308 843114 844127 844842 845657 846990 849081 851216
62787H51216Q12r38j624j064p0J086K412K973J740m39j507q98K2L77Q48J884K522
$$ 851216 852028 851090 849466 848402 848332 849418 851830 854803 856543 856104 854597 853699 853721 854098 854946 856830 859352
62770H59352J861N44k04NR29K427M100N028M834M555N507P539R234R700R391R031
$$ 859352 861213 861757 861553 861558 862487 864914 869014 874042 878876 883431 888938 896477 905711 915411 924802 933833
62754I33833Q480P296O006N916P288Q555Q210P073P334R406J1290J1693J1992
$$ 933833 942313 949609 955615 961531 968819 977374 985584 992657 999991 1009397 1020687 1032380 1044372
62741A044372J3811J6144J6916J6563J7649K1026K4626K6572K7544K9162L1640
$$ 1044372 1058183 1074327 1091243 1107806 1125455 1146481 1171107 1197679 1225223 1254385 1286025
62730A286025L4339L7387M1419M6260N1084N5622O0338O5461P0466P4660P8027
$$ 1286025 1320364 1357751 1399170 1445430 1496514 1552136 1612474 1677935 1748401 1823061 1901088
62719A901088Q1562Q6518R2757R8025R9772R7855R4502R1309Q7424Q1272P2759
$$ 1901088 1982650 2069168 2161925 2259950 2359722 2457577 2552079 2643388 2730812 2812084 2884843
62708B884843O2576N0366L5299J8111Q88j5313l1080m6401n9467o8842p5685q2280
$$ 2884843 2947419 2997785 3033084 3051195 3052083 3036770 3005690 2959289 2899822 2830980 2755295 2673015
62696B673015q8764r3069r4142r3602r3399r3178r1232q7238q2534p8023p3308
$$ 2673015 2584251 2491182 2397040 2303438 2210039 2116861 2025629 1938391 1855857 1777834 1704526
62685A704526o8062o2867n8196n3647m8795m3924l9434l5394l2156l0373k9674
$$ 1704526 1636464 1573597 1515401 1461754 1412959 1369035 1329601 1294207 1262051 1231678 1202004
62674A202004k8390k5472k1777j8455j5081j0800o493m055l701l603k233J97K740
$$ 1202004 1173614 1148142 1126365 1107910 1092829 1082029 1075536 1071481 1067780 1064177 1061944 1062141 1064881
62661A064881M834O285P338Q978J2022J5658J8070J8924K0055K3142K7628L1662
$$ 1064881 1069715 1076000 1083338 1092316 1104338 1119996 1138066 1156990 1177045 1200187 1227815 1259477
62649A259477L4302L6178L8591M2480M7778N3359N8063O2038O6374P1259P5432
$$ 1259477 1293779 1329957 1368548 1411028 1458806 1512165 1570228 1632266 1698640 1769899 1845331
62638A845331P8007P9996Q3078Q7280R0740R1723R0243Q7468Q3952P8691P0125
$$ 1845331 1923338 2003334 2086412 2173692 2264432 2356155 2446398 2533866 2617818 2696509 2766634
62627B766634N7907M3401K8276J3077k440j8133l3275m7229n9515o9557p7184
$$ 2766634 2824541 2867942 2896218 2909295 2906855 2888722 2855447 2808218 2748703 2679146 2601962
62616B601962q3136q8188r1980r3795r4138r4160r3510r0411q4376p7407p1707
$$ 2601962 2518826 2430638 2338658 2244863 2150725 2056565 1963055 1872644 1788268 1710861 1639154
62605A639154o7371o3171n8565n3891m9471m5575m2696m0787l8670l5180l0723
$$ 1639154 1571783 1508612 1450047 1396156 1346685 1301110 1258414 1217627 1178957 1143777 1113054
62594A113054k6831k4332k2684k1032j9177j7404j5903j4676j3729j3129j2757
$$ 1113054 1086223 1061891 1039207 1018175 998998 981594 965691 951015 937286 924157 911400
62583I11400j2076j0412p786n245l909l880m427m986n291m896l495j756p98p95
$$ 911400 899324 888912 881126 875881 871972 868092 863665 858679 853388 848492 844997 843241 842443 841648
62569H41648r39q66j094j831k406k194j195N43K946N071N525M411L656M634O526
$$ 841648 840709 839843 838749 836918 834512 832318 831123 831666 834612 839683 845208 849619 853275 857909 864435
62554H64435P836Q406Q909R323R292R321J0308J2137J3836J4978J6046J7550J9554
$$ 864435 872271 880677 889586 898909 908201 917522 927830 939967 953803 968781 984827 1002377 1021931
62541A021931K2039K5069K8506L1935L4752L6485L7452L9013M2178M5776M7257
$$ 1021931 1043970 1069039 1097545 1129480 1164232 1200717 1238169 1277182 1319360 1365136 1412393
62530A412393M5831M3520M2244M1118L7947L2307K5619J8837J1685L978l864j1638
$$ 1412393 1458224 1501744 1543988 1585106 1623053 1655360 1680979 1699816 1711501 1715479 1711615 1699977
62518A699977j9456k6836l2684l6494l8897m0881m2894m4621m5224m4104m1805
$$ 1699977 1680521 1653685 1621001 1584507 1545610 1504729 1461835 1417214 1371990 1327886 1286081
62507A286081l9752l8586l7411l5258l2543l0179k8017k5369k2479k0203j8457
$$ 1286081 1246329 1207743 1170332 1135074 1102531 1072352 1044335 1018966 996487 976284 957827
62496I57827j6350j3774j1623j0307r155p538n701m178l006j779j10J909L452
$$ 957827 941477 927703 916080 905773 896618 889080 883379 879201 876195 874416 874306 876215 879667
62483H79667L490K014L03m98n14l10K03J187K071K417K970M623O961R117J1358
$$ 879667 883157 885171 885474 884976 884462 884152 884355 885542 887613 890030 893000 897623 904584 913701 925059
62468I25059J4293J7172J8811J9869K2127K5580K8328K9693L1289L4346L7969
$$ 925059 939352 956524 975335 995204 1017331 1042911 1071239 1100932 1132221 1166567 1204536
62457A204536M1064M4183M8098N2017N4692N6325N7988N9859O1330O2212O2561
$$ 1204536 1245600 1289783 1337881 1389898 1444590 1500915 1558903 1618762 1680092 1742304 1804865
62446A804865O1713N8737N3837M8248M2722L6937L0517K4049J8727J5216J3005
$$ 1804865 1866578 1925315 1979152 2027400 2070122 2107059 2137576 2161625 2180352 2195568 2208573
62435B208573J0908Q411O465O662R614J4567K0579K7301L4309M0496M4906M7859
$$ 2208573 2219481 2227892 2234357 2241019 2250633 2265200 2285779 2313080 2347389 2387885 2432791 2480650
62423B480650N0547N3429N5381N4518M9740M1508L1268K0246Q842k955j5079k7592
$$ 2480650 2531197 2584626 2640007 2694525 2744265 2785773 2817041 2837287 2846129 2843174 2828095 2800503
62411B800503m0819n4696o8116p9471q7780r3005r5612r6429r6493r6155r4438
$$ 2800503 2759684 2704988 2636872 2557401 2469621 2376616 2281004 2184575 2088082 1991927 1897489
62400A897489r0073q3305p5889o9236o3140n6571m9197m1901l6064l2290k9699
$$ 1897489 1807416 1724111 1648222 1578986 1515846 1459275 1410078 1368177 1332113 1299823 1270124
62389A270124k6695k2700j8575j5128j2111r300p397o654n688l334q80m56j625
$$ 1270124 1243429 1220729 1202154 1187026 1174915 1165615 1158218 1151564 1145876 1142542 1141662 1141206 1139581
62376A139581j819k24J067K78j858l903n664p214p900p774q427j0746j3039j3158
$$ 1139581 1137762 1137538 1138605 1138883 1137025 1133122 1127458 1120244 1112344 1104570 1096143 1085397 1072358 1059200
62362A059200j1562j0491j0773j1236j1056j0919j1474j2003j1337r465p707p410
$$ 1059200 1047638 1037147 1026374 1015138 1004082 993163 981689 969686 958349 948884 941177 933767
62350I33767q592r866r866q647p261o144m690k524k03J707L334M749N449N280
$$ 933767 925175 915309 905443 896796 889535 883391 878701 876177 875974 877681 881015 885764 891213 896493
62336H96493N100N780P068Q067Q274P677O531N545N613O845Q505J0269J2543J5099
$$ 896493 901593 907373 914441 922508 930782 938459 944990 950535 956148 962993 971498 981767 994310 1009409
62322A009409J6625J6524J6085J6805J8460J9885K0814K1734K2688K3471K4411
$$ 1009409 1026034 1042558 1058643 1075448 1093908 1113793 1134607 1156341 1179029 1202500 1226911
62311A226911K5845K7314K8370K9591L1778L4782L8190M2308M7251N1852N5166
$$ 1226911 1252756 1280070 1308440 1338031 1369809 1404591 1442781 1485089 1532340 1584192 1639358
62300A639358N8396O3551P0512P7082Q1756Q4601Q5546Q3814P9550P4227O8615
$$ 1639358 1697754 1761305 1831817 1908899 1990655 2075256 2160802 2244616 2324166 2398393 2467008
62289B467008O1653N2022L9807K6145J2357n8r885j7445k4560l2525m0795m8154
$$ 2467008 2528661 2580683 2620490 2646635 2658992 2658934 2649049 2631604 2607044 2574519 2533724 2485570
62277B485570n4236n9186o2646o4002o3294o1228n8585n6045n4109n2642n0780
$$ 2485570 2431334 2372148 2309502 2245500 2182206 2120978 2062393 2006348 1952239 1899597 1848817
62266A848817m7784m3930m0388l8325l8132l9064l9651l8883l7135l5497l4293
$$ 1848817 1801033 1757103 1716715 1678390 1640258 1601194 1561543 1522660 1485525 1450028 1415735
62255A415735l2963l1275k9793k8709k7094k4058k0165j6998j5405j4655j3308
$$ 1415735 1382772 1351497 1321704 1292995 1265901 1241843 1221678 1204680 1189275 1174620 1161312
62244A161312j0804q024o257n565m652k655m65N29O17J562M155P187R188J0124
$$ 1161312 1150508 1142484 1136227 1130662 1126010 1123355 1122890 1123419 1124036 1125598 1129753 1136940 1146128 1156252
62230A156252J0824J1611J2362J3203J4326J5471J6293J6835J7043J6443J5073
$$ 1156252 1167076 1178687 1191049 1204252 1218578 1234049 1250342 1267177 1284220 1300663 1315736
62219A315736J4228J5101J6864J7391J6077J4747J5186J6914J8346J9267K0746
$$ 1315736 1329964 1345065 1361929 1379320 1395397 1410144 1425330 1442244 1460590 1479857 1500603
62208A500603K2994K4961K6416K8863L3514L9339M4294M7855N1205N5367O0310
$$ 1500603 1523597 1548558 1574974 1603837 1637351 1676690 1720984 1768839 1820044 1875411 1935721
62197A935721O5542P0314P3577P5158P6721P9690Q2057P9445P0177N7289M4469
$$ 1935721 2001263 2071577 2145154 2220312 2297033 2376723 2458780 2538225 2608402 2665691 2710160
62186B710160L1996J8413M311q100j8223k7454l6731m5894n5085o4591p3170p8739
$$ 2710160 2742156 2760569 2764880 2756780 2738557 2711103 2674372 2628478 2573393 2508802 2435632 2356893
62174B356893q1026q1566q0872p7734p2023o5984o1566n8135n4198m9945m6531
$$ 2356893 2275867 2194301 2113429 2035695 1963672 1897688 1836122 1777987 1723789 1673844 1627313
62163A627313m3798m0372l5669l0695k6874k4763k3642k2018j8891j4891j1677
$$ 1627313 1583515 1543143 1507474 1476779 1449905 1425142 1401500 1379482 1360591 1345700 1334023
62152A334023j0145r754r602r174q013n820l256j367P5K281N053O424N595M623
$$ 1334023 1323878 1314124 1304522 1295348 1287335 1281515 1278259 1276892 1276967 1279248 1284301 1290725 1296320 1300943
62138A300943N815Q718J1210J2443J3141J3839J4499J5308J6271J6447J5200J3881
$$ 1300943 1306758 1315476 1326686 1339129 1352270 1366109 1380608 1395916 1412187 1428634 1443834 1457715
62126A457715J4665J7843K1553K4014K4727K3722K1266J8503J6876J6561J6487
$$ 1457715 1472380 1490223 1511776 1535790 1560517 1584239 1605505 1624008 1640884 1657445 1673932
62115A673932J6161J6409J8065K0970K4554K8497L2571L6708M1326M6811N2560
$$ 1673932 1690093 1706502 1724567 1745537 1770091 1798588 1831159 1867867 1909193 1956004 2008564
62104B008564N7359O0620O2267O1576N7459N0119M1188L1979K2797J4077O587
$$ 2008564 2065923 2126543 2188810 2250386 2307845 2357964 2399152 2431131 2453928 2468005 2474592
62093B474592j14p750j6854k5502l1709l5997m0276m5047m9142n1760n3259n4005
$$ 2474592 2474478 2466728 2449874 2424372 2392663 2356666 2316390 2271343 2222201 2170441 2117182 2063177
62081B063177n3666n1826m8502m4011l8982l4409l0911k7963k4608k0972j8389
$$ 2063177 2009511 1957685 1909183 1865172 1826190 1791781 1760870 1732907 1708299 1687327 1668938
62070A668938j7847j8740j9360j8435j6147j3865j2660j2059j0691q260o111n180
$$ 1668938 1651091 1632351 1612991 1594556 1578409 1564544 1551884 1539825 1529134 1520874 1514763 1509583
62058A509583m316j712K459O017P237O152L524r9l885o534p290o561n135l490
$$ 1509583 1505267 1503555 1506014 1512031 1519268 1525420 1528944 1528845 1524960 1518426 1511136 1504575 1499440 1495950
62044A495950k236k286l994o665r386j1736j3315j3449j2075j0113q236n992l004
$$ 1495950 1493714 1491428 1487434 1480769 1471383 1459647 1446332 1432883 1420808 1410695 1402459 1396467 1393463
62031A393463k15J237J929L627P008J1053J4513J6888J8114J8563J9430K1846
$$ 1393463 1393248 1394485 1396414 1400041 1407049 1418102 1432615 1449503 1467617 1486180 1505610 1527456
62019A527456K5326K8212K9853L1156L2738L4009L4669L5600L7273L8599L8565
$$ 1527456 1552782 1580994 1610847 1642003 1674741 1708750 1743419 1779019 1816292 1854891 1893456
62008A893456L7955L8084L8795L9228L9713M1079M2407M1448L7337L1368K4846
$$ 1893456 1931411 1969495 2008290 2047518 2087231 2128310 2170717 2212165 2249502 2280870 2305716
61997B305716J7856J0499L639k394q559j5551k2490k8229l3178l8727m5300n1834
$$ 2305716 2323572 2334071 2337710 2335316 2326757 2311206 2288716 2260487 2227309 2188582 2143282 2091448
61985B091448n6984o0199o1840o2697o3194o2814o0859n7857n5259n3327n0492
$$ 2091448 2034464 1974265 1912425 1849728 1786534 1723720 1662861 1605004 1549745 1496418 1445926
61974A445926m5734m0466l6675l3998l0516k6085k2788k1612k0601j7538j3167
$$ 1445926 1400192 1359726 1323051 1289053 1258537 1232452 1209664 1188052 1167451 1149913 1136746
61963A136746j0254j0096j1424j2590j3316j3776j3285j1158q462p524r161j1334
$$ 1136746 1126492 1116396 1104972 1092382 1079066 1065290 1052005 1040847 1032385 1024861 1015700 1004366
61951A004366j1404r219o843n409l825j090J588K341J470J073K127L523M130M156
$$ 1004366 992962 983743 976900 971491 967666 966576 968164 970505 971975 973048 975175 978698 982828 986984
61937I86984M019L304J845O52N31N50q10l383n414n857n476n676p150r733j2652
$$ 986984 991003 994307 996152 996804 997335 997885 997075 993692 988278 982421 976945 971269 964119 954386 941734
61922I41734j4720j5124j4272j3183j2045j0227p910o425o509p228p418p126o737
$$ 941734 927014 911890 897618 884435 872390 862163 854253 847828 841319 834091 826673 819547 812810
61909H12810n701l537j384q47j487j206O93K517K791K290K447L185L622L962N087
$$ 812810 807109 803572 802188 801341 799854 798648 799341 801858 804649 806939 809386 812571 816193 820155 825242
61894H25242O751P814Q226R315J1832J4832J6972J8036J8749J9868K1895K4930
$$ 825242 831993 839807 848033 857348 869180 884012 900984 919020 937769 957637 979532 1004462
61882A004462K8251L0673L1945L3208L5438L7920L9020L8133L6054L3643L1130
$$ 1004462 1032713 1063386 1095331 1128539 1163977 1201897 1240917 1279050 1315104 1348747 1379877
61871A379877K8815K7477K7358K7286K5557K1696J6850J2478R038O049K940n47
$$ 1379877 1408692 1436169 1463527 1490813 1516370 1538066 1554916 1567394 1576432 1582481 1585421 1584874
61859A584874m304p687r527r019o773m331k300M18M923J0338J4459J6227J6630
$$ 1584874 1580570 1572883 1563356 1554337 1547564 1543233 1540933 1541351 1546274 1556612 1571071 1587298 1603928
61846A603928J6972J7276J6954J6111J5200J3700J0365N030o99n091q146j1214
$$ 1603928 1620900 1638176 1655130 1671241 1686441 1700141 1710506 1715536 1714837 1709746 1701600 1690386
61834A690386j4955j8396k0201k0329j9986k0152k0613k0543j9623j8417j7845
$$ 1690386 1675431 1657035 1636834 1616505 1596519 1576367 1555754 1535211 1515588 1497171 1479326
61823A479326j8452k0004k1594k2323k2036k1293k0563j9751j8623j7335j6146
$$ 1479326 1460874 1440870 1419276 1396953 1374917 1353624 1333061 1313310 1294687 1277352 1261206
61812A261206j4928j3343j1258q695n568j981J447M100O160Q351J0948J3598J6126
$$ 1261206 1246278 1232935 1221677 1212982 1207414 1205433 1206880 1210980 1217140 1225491 1236439 1250037 1266163
61799A266163J8953K2505K6738L1301L5738L9395M1762M3182M4805M7459N0729
$$ 1266163 1285116 1307621 1334359 1365660 1401398 1440793 1482555 1525737 1570542 1618001 1668730
61788A668730N3384N4464N3825N1907M9139M5440M0292L3549K6070J9022J2708
$$ 1668730 1722114 1776578 1830403 1882310 1931449 1976889 2017181 2050730 2076800 2095822 2108530
61777B108530O628P22m277p979j0907j3322j4234j2501q579m252o32K744O589
$$ 2108530 2115158 2115880 2111603 2103624 2092717 2079395 2065161 2052660 2044081 2039829 2039197 2041941 2048530
61764B048530J0463J3151J3983J2990R972M369l484j1754j8687k4508l0732l7497
$$ 2048530 2058993 2072144 2086127 2099117 2109089 2113458 2109974 2098220 2079533 2055025 2024293 1986796
61752A986796m2839m5089m4877m3957m3123m2391m2240m3013m3542m2220l9434
$$ 1986796 1943957 1898868 1853991 1810034 1766911 1724520 1682280 1639267 1595725 1553505 1514071
61741A514071l7256l6529l5894l4132l1711k9313k6431k2630j8976j6955j6662
$$ 1514071 1476815 1440286 1404392 1370260 1338549 1309236 1282805 1260175 1241199 1224244 1207582
61730A207582j7079j7360j7039j5780j3880j2180j0740q567n610l849m868p296
$$ 1207582 1190503 1173143 1156104 1140324 1126444 1114264 1103524 1094957 1089347 1085498 1080630 1073334
61718A073334q335p313n973n497n080l664j450Q30K932M737N787N767N065M453
$$ 1073334 1064999 1057686 1051713 1046216 1041136 1037472 1036022 1036852 1039784 1044521 1050308 1056075 1061140 1065593
61704A065593M542N525P054Q450R416J0336J1484J2284J1934J0279P559L985L17
$$ 1065593 1070135 1075660 1082714 1091164 1100580 1110916 1122400 1134684 1146618 1156897 1164456 1168441 1168758
61691A168758k003k499k790m646p454r241r766j0654j2437j3550j2831j1259j0349
$$ 1168758 1166755 1164256 1161466 1156820 1149366 1140125 1130359 1119705 1107268 1093718 1080887 1069628 1059279
61678A059279j0297j0534j0738j0439q898o389m468l950l678k450j037q98j683
$$ 1059279 1048982 1038448 1027710 1017271 1008373 1001984 997516 993566 989888 987438 986401 985503 983820
61665I83820j651j53J744K984L478L388K704J742J000K55j119k740l182k010p50
$$ 983820 982169 982016 983760 986744 990222 993610 996314 998056 999056 999311 998192 995452 992270 990260 989510
61650I89510j005k382l491m319o075q616r845q649o981p448r595j0526r054p182
$$ 989510 988505 986123 982632 978313 972238 963622 953777 945128 938147 930699 921104 910578 901524 894342
61636H94342o932p734q131q287r028r689q927p114n900n710n531n054n040n442
$$ 894342 887410 879676 871545 863258 854230 844541 835614 828500 822600 816890 811359 806305 801265 795823
61622G95823n117l854k837k573k114j176j124k626l970l299j386n12j271k021
$$ 795823 790706 786852 784015 781442 779328 778152 777028 774402 770432 767133 765747 765235 763964 761943
61608G61943j274N98K039J955P01j52N49K091K808K636L308N480P239O717M865
$$ 761943 760669 761267 763306 765261 765962 765810 766359 768450 771258 773894 777202 782682 789921 796638 801503
61593H01503L930M259M435L949L650L748L324K224J758K843M622N608N411M801
$$ 801503 805433 809692 814127 818076 821726 825474 828798 831022 832780 835623 840245 845853 851264 856065
61579H56065M538M557M079K580P58P5Q92J712J074n38j807k892m975p720r097
$$ 856065 860603 865160 869239 871819 872577 872652 873544 875256 876330 875792 873985 871093 866118 858398 849301
61564H49301q106o165n037m709m198l426l200l817m591m679l960l204l453m955
$$ 849301 841195 835030 829993 825284 821086 817660 814460 810643 806052 801373 797413 794209 790756 785801
61550G85801o733p698q050q789r959j0490r936r189q883q296o780n328n482p087
$$ 785801 779068 771370 763320 754531 744572 734082 724146 714957 706074 697778 690998 685670 680188 673101
61536F73101q321p941o549n486n221n124m312k453j35J355R60j091l251m001l220
$$ 673101 664780 656839 650290 644804 639583 634459 630147 627694 627559 628914 629874 628783 625532 621531 618311
61521F18311k019j377j267j186r28m37N97K126K982J841q06k728k496r62M00J490
$$ 618311 616292 614915 613648 612462 611534 611097 611694 613820 616802 618643 617837 615109 612613 611651 612051 613541
61505F13541K746L467K637R98N39J864L587M470M717M763M363L435K640K345K076
$$ 613541 616287 619754 622391 623389 623928 625792 629379 633849 638566 643329 647692 651127 653767 656112 658188
61490F58188J570J343J556J460P04R1J33k2j128k201j692M62L068N229O409N768
$$ 658188 659758 661101 662657 664117 664821 664912 665045 665023 663895 661694 660002 660464 663532 668761 675170 680938
61474F80938L202N88J80J653K469J416J7j33L06j56j375j989j596j036p84m07
$$ 680938 684140 684728 684908 686561 689030 690446 690463 690330 690636 690480 689105 687116 685520 684484 683700 683293
61458F83293L12P60M77q8l12l88r75k131l177l528l070j754M99L066M483L821
$$ 683293 683605 684365 684842 684754 684442 684054 683079 680948 677771 674243 671173 669419 669918 672984 677467 681288
61442F81288J994R23J383K410K870K838L042L768M744N560N712M832L445K806
$$ 681288 683282 684205 685588 687998 690868 693706 696748 700516 705260 710820 716532 721364 724809 727615
61428G27615L338L888L381K464K468L248L498K874K310K188J843J236J484K890
$$ 727615 730953 734841 738222 740686 743154 746402 749900 752774 755084 757272 759115 760351 761835 764725
61414G64725L912L284K053K046L109L517K640J508O27r35l589n779n751l949k444
$$ 764725 768637 771921 773974 776020 779129 782646 785286 786794 787421 786486 782897 777118 771367 767418 764974
61399G64974k213k287j644p27m48n69j00J037J848J827J572J456P50r61k302j473
$$ 764974 762761 760474 758830 758103 757655 757086 756986 758023 759871 761698 763270 764726 765476 764515 762213 760740
61383G60740J118L117L339L193M250N746N773M203K865L100M388N466N617M666
$$ 760740 761858 764975 768314 771507 775757 781503 787276 791479 794344 797444 801832 807298 812915 817581
61369H17581K909J509J876L925N699N546M043K987L056L497L793M273M948M913
$$ 817581 820490 821999 823875 827800 833499 839045 843088 846075 849131 852628 856421 860694 865642 870555
61355H70555L500J348m08j451k160k691k922l131l799m705n005m428l622k997
$$ 870555 874055 875403 874995 873544 871384 868693 865771 862640 858841 854136 849131 844703 841081 838084
61341H38084j995j83J551J867P61m46q50q20r11r41n84j03J78M77R27R36P7p09
$$ 838084 836089 835906 837457 839324 840085 839639 838789 837969 837058 836117 835533 835430 835608 836085 837012 837948 838025 837316
61323H37316P1K415M645N572N902O969Q698R663Q912P077N629N420O026O398O051
$$ 837316 837387 839802 844447 850019 855921 862890 871588 881251 890163 897240 902869 908289 914315 920713 926764
61308I26764N542N589N939N585M257L056L127M126M669M217L816M772P042R164
$$ 926764 932306 937895 943834 949419 953676 956732 959859 963985 968654 972871 976687 981459 988501 997665
61294I97665R720Q669P353P230Q468R747R570P779N650M464M234L997L177K230
$$ 997665 1007385 1016054 1023407 1030637 1039105 1048852 1058422 1066201 1071851 1076315 1080549 1084546 1087723 1089953
61280A089953J835J907J834J517J427J535Q95j085l411m432l828k903k787l197
$$ 1089953 1091788 1093695 1095529 1097046 1098473 1100008 1100903 1099818 1096407 1091975 1088147 1085244 1082457 1079260
61266A079260l315l143l299l892m216l537j787M60K535M246N965P922R593J0349
$$ 1079260 1075945 1072802 1069503 1065611 1061395 1057858 1056071 1056531 1059066 1063312 1069277 1077199 1086792 1097141
61252A097141J0631J1629J3515J4972J5105J4913J5824J7508J8326J7695J6612
$$ 1097141 1107772 1119401 1132916 1147888 1162993 1177906 1193730 1211238 1229564 1247259 1263871
61241A263871J5700J4029J0456N288J9m160p005q749r552r476q739p877p537q017
$$ 1263871 1279571 1293600 1304056 1309344 1309363 1305203 1298198 1289449 1279897 1270421 1261682 1253805 1246268 1238251
61227A238251r055j0146j0857j0853j0093r222r047r156p776l930P96L736M167
$$ 1238251 1229196 1219050 1208193 1197340 1187247 1178025 1168978 1159822 1152046 1148116 1148912 1152648 1156815
61214A156815L791M171N057N464N324N295N770O688P926R341J0698J1788J2437
$$ 1156815 1160606 1164777 1169834 1175298 1180622 1185917 1191687 1198375 1206301 1215642 1226340 1238128 1250565
61201A250565J2437J1915J1591J1944J2248J1294R163P274O446N964M904L423
$$ 1250565 1263002 1274917 1286508 1298452 1310700 1321994 1331157 1338431 1344877 1350841 1355745 1359168
61189A359168K052O63j134l226n286p261q949r692r210q233p648p395o792n688
$$ 1359168 1361220 1361883 1360749 1357523 1352237 1344976 1336027 1326335 1317125 1308892 1301244 1293849 1287057 1281369
61175A281369m751m826o168p908q192n632j004L251N514O205O334O093N584N667
$$ 1281369 1276618 1271792 1265624 1257716 1249524 1243892 1242888 1246139 1251653 1257858 1264192 1270285 1275869 1281536
61161A281536O821P962P694O234N087N168O275P958R730J0634R678O937L641J281
$$ 1281536 1288357 1296319 1304013 1310247 1315334 1320502 1326777 1334735 1344465 1355099 1364777 1371714 1375355 1376636
61147A376636Q46K446N115P445Q890R895J0593J0539J0296J1626J4920J7844J8252
$$ 1376636 1377482 1379928 1385043 1392488 1401378 1411273 1421866 1432405 1442701 1454327 1469247 1487091 1505343
61134A505343J7278J7501J8934J9117J6712J2750Q408L906j04k357k898l302m287
$$ 1505343 1522621 1540122 1559056 1578173 1594885 1607635 1616043 1619949 1619845 1617488 1614590 1611288 1607001
61121A607001m843m522m851p278j0993j3930j5019j4584j3429j2438j2412j3457
$$ 1607001 1602158 1597636 1592785 1585507 1574514 1560584 1545565 1530981 1517552 1505114 1492702 1479245
61109A479245j4910j6140j6914j6992j6323j5729j6265j7627j8305j7549j6027
$$ 1479245 1464335 1448195 1431281 1414289 1397966 1382237 1365972 1348345 1330040 1312491 1296464
61098A296464j4350j2399j0421r202q574p262m893k617j062O08K622L398J764
$$ 1296464 1282114 1269715 1259294 1250092 1241518 1234256 1229363 1226746 1225684 1226292 1228914 1232312 1234076
61085A234076j080l389n246p502r510r875q730p454o589n518l802j417J809N573
$$ 1234076 1232996 1229607 1224361 1216859 1207349 1197474 1188744 1181290 1174701 1169183 1165381 1163964 1165773 1171346
61071A171346Q341Q790P728P267Q397J0585J3327J6449J9160K0453K0673K1343
$$ 1171346 1179687 1188477 1196205 1203472 1211869 1222454 1235781 1252230 1271390 1291843 1312516 1333859
61059A333859K3225K5641K7737K9341L0476L1128L1596L2179L2477L1863L0529
$$ 1333859 1357084 1382725 1410462 1439803 1470279 1501407 1533003 1565182 1597659 1629522 1660051
61048A660051K9112K7614K5698K3717K2127K0154J6558J1725P432M345J337k326
$$ 1660051 1689163 1716777 1742475 1766192 1788319 1808473 1825031 1836756 1844188 1848533 1849870 1847544
61036A847544n833q505j1083j4166j6621j6955j5634j4680j5169j6212j6403j5455
$$ 1847544 1841711 1833206 1822123 1807957 1791336 1774381 1758747 1744067 1728898 1712686 1696283 1680828
61024A680828j3999j2391j0233p205l928j556l68P00K826N977R237J1918J3797
$$ 1680828 1666829 1654438 1644205 1637000 1633072 1631516 1631148 1631848 1634674 1640651 1649888 1661806 1675603
61011A675603J4795J5242J6187J8550K2085K5901K9650L3292L6077L7049L6777
$$ 1675603 1690398 1705640 1721827 1740377 1762462 1788363 1818013 1851305 1887382 1924431 1961208
61000A961208L7336M0125M4379M8189N0473N1717N3320N6290O0267O3787O5940
$$ 1961208 1998544 2038669 2083048 2131237 2181710 2233427 2286747 2343037 2403304 2467091 2533031
60989B533031O7319O8876P0331P0668O9870O9041O9085P0271P2801P6600Q0539
$$ 2533031 2600350 2669226 2739557 2810225 2880095 2949136 3018221 3088492 3161293 3237893 3318432
60978C318432Q3075Q3849Q3756Q3662Q4161Q6282R0917R7354J03678J08969J13975
$$ 3318432 3401507 3485356 3569112 3652774 3736935 3823217 3914134 4011488 4115166 4224135 4338110
60967D338110J19620J26027J33068J40644J48456J56790J67329J81729J99603
$$ 4338110 4457730 4583757 4716825 4857469 5005925 5162715 5330044 5511773 5711376
60958E711376K19693K42632K70384L02928L38044L74706M14363M58717N09223
$$ 5711376 5931069 6173701 6444085 6747013 7085057 7459763 7874126 8332843 8842066
60949H842066N69196O42847P30820Q29991R39073J060840J197595J349537J520337
$$ 8842066 9411262 10054109 10784929 11614920 12553993 13614833 14812428 16161965 17682302
60940A7682302J718256J947079K202176K479942K774776L040886L157821K973086
$$ 17682302 19400558 21347637 23549813 26029755 28804531 31845417 35003238 37976324
60932C7976324K422782J620182Q05891J94636j33571k11731j05073J08843K96411
$$ 37976324 40399106 42019288 42825179 43019815 42886244 42674513 42569440 42678283 42974694
60923D2974694K70459j04424p95668j607067k308623k766721k970933k976899
$$ 42974694 43245153 43140729 42345061 40737994 38429371 35662650 32691717 29714818
60915B9714818k848891k641300k398219k149874j911538j690663j492514j318366
$$ 29714818 26865927 24224627 21826408 19676534 17764996 16074333 14581819 13263453
60907A3263453j164500j027115r05748q00306p08515o28521n60754n04719m56648
$$ 13263453 12098953 11071838 10166090 9365784 8657269 8028748 7467994 6963275 6506627
60898F506627m12762l72707l37525l06324k77194k49709k24432k01470j81313
$$ 6506627 6093865 5721158 5383633 5077309 4800115 4550406 4325974 4124504 3943191
60889C943191j65439j54153j45314j36971j29584j23921j18670j12439j06328
$$ 3943191 3777752 3623599 3478285 3341314 3211730 3087809 2969139 2856700 2750372
60880B750372j01748r7187r0250q2118p6654p5042p4213p1007o5489n9516n4199
$$ 2750372 2648624 2551437 2461187 2379069 2302415 2227373 2153160 2082153 2016664 1957148 1902949
60869A902949m9806m6540m4296m2434m0411l8122l5541l2720k9997k7576k5225
$$ 1902949 1853143 1806603 1762307 1719873 1679462 1641340 1605799 1573079 1543082 1515506 1490281
60858A490281k3065k1942k2005k1821k0235j8263j7485j7392j6372j4637j3743
$$ 1490281 1467216 1445274 1423269 1401448 1381213 1362950 1345465 1328073 1311701 1297064 1283321
60847A283321j3541j2237r729q124q277q455p628p528r710j2629j3734j2999j2343
$$ 1283321 1269780 1257543 1247814 1239690 1231413 1222958 1215330 1207802 1198092 1185463 1171729 1158730 1146387
60834A146387j2555j2893j3041j3525j4445j5276j5810j6080j5614j4057j2276
$$ 1146387 1133832 1120939 1107898 1094373 1079928 1064652 1048842 1032762 1017148 1003091 990815
60823I90815j1555j1902j2208j1956j1537j1069j0259r409r234r362q358n743
$$ 990815 979260 967358 955150 943194 931657 920588 910329 900920 891686 882324 873966 868223
60811H68223k963j690j958k629k908k605j573J68J960L035L588M610O454Q106
$$ 868223 865260 863570 861612 858983 856075 853470 851897 852065 854025 857060 860648 865258 871712 879818
60797H79818Q287O993N447M533L793K366N47k09R95L312N066N466M964M128K750
$$ 879818 888105 895098 900545 905078 908871 911237 911784 911575 912570 915882 920948 926414 931378 935506 938256
60782I38256L66k803n673p144p033o188n694n956o628p356q284r604j0910j1372
$$ 938256 938622 935819 930146 923002 915969 909781 904087 898131 891503 884147 875863 866259 855349 843977
60768H43977j0595r026p489o534o202o208o221o169o383p216q319q496o769l814
$$ 843977 833382 824356 816867 810333 804131 797923 791702 785533 779150 771934 763615 755119 748350 744536
60754G44536j845k470m808o477o484o171o860p624o709m402k796k671k445r14
$$ 744536 742691 740221 735413 728936 722452 716281 709421 701797 695088 690686 687890 685219 682774 681860
60740F81860O66M67j092k088j934j810k327k457j238O85J972K168J810J435J137
$$ 681860 682526 682993 681901 679813 677879 676069 673742 671285 670047 670732 672704 674872 676682 678117 679254
60725F79254P49J61m04l71N26J663K202K339K973L993L993K339M81K58J458K205
$$ 679254 680003 680164 679760 679389 679915 681578 683780 686119 689092 693085 697078 699417 699898 700156 701614 703819
60709G03819J414k03j447j835j425m57M15M18m28j259j548j691k004j943j036
$$ 703819 705233 705030 703583 701748 700323 699866 700281 700699 700271 699012 697464 695773 693769 691826 690790
60694F90790j2l0j078j996k158k207k820l487l063j271Q46J897J347k46j957l316
$$ 690790 690778 690748 689670 687674 685516 683309 680489 677002 673939 672668 673514 675411 676758 676512 674555 671239
60678F71239m329m855m478l292k309k445l305l735l506l555m338m871m024k099
$$ 671239 666910 662055 657577 654285 651976 649531 646226 642491 638985 635430 631092 626221 622197 620098
60664F20098l53N62J054J721K725L842M628M662M032L337K949K666K507L094M606
$$ 620098 619745 620307 621361 623082 625807 629649 634277 638939 642971 646308 649257 651923 654430 657524 662130
60649F62130N940N890M665L327K263J449J489K742L700K356o39k253j149N60P09
$$ 662130 668070 673960 678625 681952 684215 685664 687153 689895 693595 695951 695312 693059 691910 692470 693179
60634F93179J32P11K027K094M84j381k511l040k981k156j268j208j353l27J428
$$ 693179 693311 694022 696049 698143 698627 697246 694735 691695 688714 686558 685290 684082 682729 682402 683830
60619F83830J792J24j567j491l69K35L53Q79J483J059k15q95m32P3l87j306j598
$$ 683830 685622 685746 684179 682688 682319 682554 682907 683786 685269 686328 686113 685218 684786 684859 684472 683166 681568
60602F81568j246j261k203l460m105l950l290k072jK477M086M067K991J831Q58
$$ 681568 680322 679061 676858 673398 669293 665343 662053 659981 659980 662457 666543 670610 673601 675432 676290
60587F76290J27K26J416K584K309Q18l88p84j240k156k790k853l211m213m658
$$ 676290 676417 676643 678059 680643 682952 683770 683382 682598 681358 679202 676412 673559 670348 666135 661477
60572F61477l502j428L05J554K686L244K620J392O18K93j87m15N45K232K870J682
$$ 661477 657975 656547 656852 658406 661092 664336 666956 668348 668966 669259 669072 668657 669202 671434 674304 675986
60556F75986j20j081j109q75n66M4Q99J613J859J539Q62M08O95J563K386K908
$$ 675986 675866 674785 673676 672801 672235 672279 673178 674791 676650 678189 679051 679459 680154 681717 684103 687011
60540F87011L287L406K902K156K381M054N848N983M429L010L231M600N414M824
$$ 687011 690298 693704 696606 698762 701143 705197 711045 717028 721457 724467 727698 732298 737712 742536
60526G42536L629L121L632M462M907M793M197L272K593K999M669O699Q113R027
$$ 742536 746165 749286 752918 757380 762287 767080 771277 774549 777142 780141 784810 791509 799622 808649
60512H08649J0280J2075J3613J4107J3775J3679J4704J6722J8661J9535J9341
$$ 808649 818929 831004 844617 858724 872499 886178 900882 917604 936265 955800 975141
60501I75141J8589J7098J4029R474N039K139L58j537l578m710m531l585j993P86
$$ 975141 993730 1010828 1024857 1034331 1039370 1041509 1041867 1040330 1036752 1032042 1027511 1023926 1021933 1022719
60487A022719M511P739R453J0214J1137J2673J4959J8478K3351K8485L2453L4995
$$ 1022719 1027230 1034969 1044422 1054636 1065773 1078446 1093405 1111883 1135234 1163719 1196172 1231167
60475A231167L7013L9135M1006M1901M1400L9295L5348K9473K2023J3758N449
$$ 1231167 1268180 1307315 1348321 1390222 1431622 1470917 1506265 1535738 1557761 1571519 1576968
60464A576968k394r442j5248j9239k1196k1550k0917j9464j7078j4098j1337r301
$$ 1576968 1574574 1565132 1549884 1530645 1509449 1487899 1466982 1447518 1430440 1416342 1405005 1395704
60452A395704p711n830l022R87N838J0507J4077J6770J9843K4332L0208L6765
$$ 1395704 1387993 1382163 1379141 1380128 1385966 1396473 1410550 1427320 1447163 1471495 1501703 1538468
60440A538468M3323M9390N4720N9564O4438O9366P3622P6338P7018P5365P1136
$$ 1538468 1581791 1631181 1685901 1745465 1809903 1879269 1952891 2029229 2106247 2181612 2252748
60429B252748O4534N6385M7707L9278L1625K5062J9533J4618R589L136o475k0055
$$ 2252748 2317282 2373667 2421374 2460652 2492277 2517339 2536872 2551490 2561079 2564215 2557740 2537685
60417B537685l6256n2421o6645p8218q6471r0733r1788r1717r1400q9391q4211
$$ 2537685 2501429 2449008 2382363 2304145 2217674 2126941 2035153 1943436 1852036 1762645 1678434
60406A678434p6691o9012o2426n7037n2797m9265m5190l9875l4502l0683k8242
$$ 1678434 1601743 1532731 1470305 1413268 1360471 1311206 1266016 1226141 1191639 1160956 1132714
60395A132714k5896k3618k2444k2170k1148j8650j5684j3082j0547q194p274q318
$$ 1132714 1106818 1083200 1060756 1038586 1017438 998788 983104 970022 959475 951281 944007 935689
60383I35689r806r843q242o161m584m016m645n816o165n276m407m637n181m631
$$ 935689 925883 916040 907798 901637 897053 893037 888392 882576 876411 871135 866728 862091 856910 852279
60369H52279l106j828j288j182j697l139m520m154j973J74Q44L92k16o73r05o06
$$ 852279 849173 847345 846057 844875 843178 840039 835519 831365 829392 829566 830410 830802 830586 829913 829008 828402
60353H28402K4J43l30j39J507L436L849K642J239O16O46J170K414M169N582O091
$$ 828402 828426 828569 828239 828100 829607 833043 836892 839534 840773 841389 842035 843205 845619 849788 855370 861461
60337H61461N833N055L938L073L195M047M516M273M333N406O703P211P235P516
$$ 861461 867294 872349 876287 879360 882555 886602 891118 895391 899724 905130 911833 919044 926279 933795
60323I33795P592O542M980M592N553O047M922L476L668N637P934R297R211P616
$$ 933795 941387 947929 952909 957501 963054 969101 974023 977499 981167 986804 994738 1004035 1013246 1020862
60309A020862N334M160N081O654O560M663L147L462M685N375N582O167P235Q357
$$ 1020862 1026196 1030356 1035437 1042091 1048651 1053314 1056461 1059923 1064608 1069983 1075565 1081732 1088967 1097324
60295A097324R582J1094J2412J2901J2772J2681J2676J2409J2012J1764J1125
$$ 1097324 1106906 1118000 1130412 1143313 1156085 1168766 1181442 1193851 1205863 1217627 1228752
60284A228752R110N562J133l711q519j1872j2168r956p998q152r224r019p540
$$ 1228752 1237862 1243424 1244557 1240846 1232327 1220455 1208287 1198331 1190333 1182181 1172957 1163938 1156398
60271A156398o775p714r113r388q627q093q392q757q071o315m745m486n040m725
$$ 1156398 1149623 1141909 1132796 1123408 1114781 1106688 1098296 1089539 1081468 1075153 1070408 1065922 1060882 1056157
60257A056157k672L17L188O033R295J2434J4531J5799J7204J8753J9528J9381
$$ 1056157 1053485 1053802 1056990 1063023 1072318 1084752 1099283 1115082 1132286 1151039 1170567 1189948
60245A189948J9238J9469J9341J8518J7676J6889J4772J0337M516j280p120j3624
$$ 1189948 1209186 1228655 1247996 1266514 1284190 1301079 1315851 1326188 1330704 1329424 1322304 1308680
60233A308680j9944k4329k6340k6940k6675k5316k3243k1468k0050j8107j5787
$$ 1308680 1288736 1264407 1238067 1211127 1184452 1159136 1135893 1114425 1094375 1076268 1060481
60222A060481j4449j4271j3407j0732p876o931p310o736m817l535m141n437n755
$$ 1060481 1046032 1031761 1018354 1007622 999746 992815 985505 978769 973952 970417 966276 960839 955084
60209I55084n192m932n186m966l579j634m79r91k838m713n370m581l027j448j40
$$ 955084 949892 944960 939774 934808 931229 929595 929116 928125 925287 920574 915204 910623 907596 906148 906008
60194I06008P79J195J214J113Q95K99m96o81K64J798K914L289L359L476L495L209
$$ 906008 906787 907982 909196 910309 911204 911503 911007 910326 910590 912388 915302 918591 921950 925426 928921 932130
60178I32130K686K103J591J341J557K177K906L601M326M989N347N530O052O961
$$ 932130 934816 936919 938510 939851 941408 943585 946491 950092 954418 959407 964754 970284 976336 983297
60164I83297P341O338M515L609M691O995Q793R180Q735Q663R535J0860J1750J1864
$$ 983297 990638 996976 1001491 1005100 1009791 1016786 1025579 1034759 1043494 1052157 1061692 1072552 1084302 1096166
60150A096166J1664J1685J1857J1758J1334J0884J0372R377P926O831O809P583
$$ 1096166 1107830 1119515 1131372 1143130 1154464 1165348 1175720 1185097 1193023 1199854 1206663 1214246
60138A214246Q222Q055O866M665J923k18q44m80p32k327m047m061k140r9k2k243
$$ 1214246 1222468 1230523 1237389 1242054 1243977 1243759 1242915 1242435 1241703 1239376 1235329 1231268 1229128 1229029 1229007 1226764
60122A226764n190o993o991n707l764j440P91K073J999J210O37M40J42n20j522
$$ 1226764 1221574 1214581 1207590 1201883 1198119 1196679 1197470 1199543 1201542 1202752 1203389 1203829 1203971 1203451 1201929
60107A201929l007m979o676p114o359n600n801o786p736p838o481l580n8K704
$$ 1201929 1198922 1193943 1187267 1180153 1173794 1168194 1162393 1155607 1147871 1140033 1133552 1129972 1129914 1132618
60093A132618M104M504M208L245K245K277L291L854L247K603L016L575K781J158
$$ 1132618 1136722 1141226 1145434 1148679 1150924 1153201 1156492 1160346 1163593 1166196 1169212 1172787 1175568 1176726
60079A176726P50K229M003M360L306K013J438J807K647L142L036L135M180N569
$$ 1176726 1177476 1179705 1183708 1188068 1191374 1193387 1194825 1196632 1199279 1202421 1205457 1208592 1212772 1218341
60065A218341O153N994O038O310O080N859P184R847J1427J0747R845J0837J2575
$$ 1218341 1224494 1230488 1236526 1242836 1248916 1254775 1261959 1271806 1283233 1293980 1303825 1314662 1327237
60052A327237J2678J1592J1743J3056J2459Q526L934J844J882J581L26l93o8k79
$$ 1327237 1339915 1351507 1363250 1376306 1388765 1397291 1401225 1403069 1404951 1406532 1406858 1406465 1406397 1406118
60038A406118k250m905o084m990k748j060q32j853l394m862o030o710o668o056
$$ 1406118 1403868 1398963 1392879 1387889 1385141 1384081 1383249 1381396 1378002 1373140 1367110 1360400 1353732 1347676
60024A347676n694o431q272j0439j2190j3264j3740j3872j4002j4292j4504j4429
$$ 1347676 1341982 1335551 1327279 1316840 1304650 1291386 1277646 1263774 1249772 1235480 1220976 1206547
60012A206547j4283j4317j4170j3259j1676j0121q948q012p460p811q931r734
$$ 1206547 1192264 1177947 1163777 1150518 1138842 1128721 1119773 1111761 1104301 1096490 1087559 1077825
60000A077825r412q268o997n737m439l478l155l093k757k205j677r67O6R18J237
$$ 1077825 1068413 1060145 1053148 1047411 1042972 1039494 1036339 1033246 1030489 1028284 1026607 1025640 1025706 1026624 1027861
59985A027861J691K957M286M340L357L019L981M901M432K911J437K78r15k175
$$ 1027861 1029552 1032509 1036795 1041135 1044492 1047511 1051492 1056393 1060825 1063736 1065173 1065451 1064536 1062361
59971A062361l344m507n503n573m398l054l035m482o140o956p051p220q040r294
$$ 1062361 1059017 1054510 1049007 1043434 1039036 1035982 1032947 1028465 1022325 1015369 1008318 1001098 993058 983764
59957I83764r921q834o389m598m988o555o769m656j794j34J64J78M27M84j03j311
$$ 983764 973843 965009 958620 954022 949034 942479 935710 931054 929260 929126 929290 929468 929895 930379 930276 928965
59941I28965k928m599n585n110l237j075J74K22k96o61o27k63M28J528K841L709
$$ 928965 926037 921438 915853 910743 907506 906431 906605 906827 906531 905870 905243 904980 905408 906936 909777 913486
59925I13486L469K238J086J094K208L329L669L525L458L275K533J585J092O82
$$ 913486 916955 919193 920279 921373 923581 926910 930579 934104 937562 940837 943370 944955 946047 946729
59911I46729o21k420k913j535k82j180l472m724l950k133k98J155J673J010M05
$$ 946729 946108 943688 940775 939240 938958 937778 934306 929582 925632 923499 923201 924356 926029 927039 927444
59896I27444J269K587J789j336l804l467j694p66o68j75N28N09J83N99J447J735
$$ 927444 928713 931300 933089 931753 927949 924482 922788 922022 921354 921179 921707 922216 922399 922998 924445 926180
59880I26180J770K431L029K153L59j48J275L001L815M238M708M622M180N118Q227
$$ 926180 927950 930381 933410 935563 935922 935774 937049 940050 943865 948103 952811 957433 961613 966731 974958
59865I74958J1560J2544J0927Q378O207M818M520N199N528M134J632K81J235L111
$$ 974958 986518 999062 1009989 1018367 1024574 1029392 1033912 1039111 1044639 1048773 1050405 1050686 1051921 1055032
59851A055032L755K799J813K255L748M583L688J791M57K31K49l02r50o75N77J748
$$ 1055032 1058787 1061586 1063399 1065654 1069402 1073985 1077673 1079464 1079921 1080152 1080401 1080099 1079149 1078474 1079051 1080799
59835A080799J969J525J318J823K866M132N433O482O956P001P235P825Q081P644
$$ 1080799 1082768 1084293 1085611 1087434 1090300 1094432 1099865 1106347 1113303 1120304 1127539 1135364 1143445 1151089
59821A151089P646R566J2886J5110J4596J2334J0356R404Q937Q422P497N610K756
$$ 1151089 1158735 1168301 1181187 1196297 1210893 1223227 1233583 1242987 1251924 1260346 1267843 1273453 1276209
59808A276209J56r24p53o04j085j910k820l560l476k449j770k602l894l444r99
$$ 1276209 1276365 1275441 1274688 1274084 1272999 1271089 1268269 1264709 1261233 1258784 1257014 1254412 1250518 1247074 1246075
59793A246075J479K699L500M954O631P521P457O924O445O495P006O773M599J237
$$ 1246075 1247554 1250253 1253753 1258707 1265338 1272859 1280316 1287240 1293685 1300180 1307186 1313959 1318558 1319795
59779A319795j260k293l072l914l274n55K072K107m18l805o888q948r007p144
$$ 1319795 1318535 1316242 1313170 1309256 1305982 1305427 1307499 1309606 1309188 1305383 1298495 1289547 1280540 1273396
59765A273396n487n903p411p639o179m631l980l874m238n472o954p189n886m399
$$ 1273396 1267909 1262006 1254595 1246956 1240777 1236146 1232166 1228292 1224054 1218582 1211628 1204439 1198553 1194154
59751A194154l764l680l735m264n370o299o431o082n812n668n444n063m469l824
$$ 1194154 1190390 1186710 1182975 1178711 1173341 1167042 1160611 1154529 1148717 1143049 1137605 1132542 1128073 1124249
59737A124249l837n039o613o954n694m214l740l921l890l793m331n321n604m401
$$ 1124249 1120412 1115373 1108760 1101806 1096112 1091898 1088158 1084237 1080347 1076554 1072223 1066902 1061298 1056897
59723A056897k223m85l61j743l168l088j466K83J097J570K991N487P686Q262P371
$$ 1056897 1054674 1054189 1053828 1052085 1048917 1045829 1044363 1044646 1045743 1047313 1050304 1055791 1063477 1071739 1079110
59708A079110O293N979O220O393O577P380Q708R392Q577P003O386P615J0033J2227
$$ 1079110 1085403 1091382 1097602 1103995 1110572 1117952 1126660 1136052 1144629 1151632 1158018 1165633 1175666 1187893
59694A187893J3012J1913R452O943N472M893M322L519L202L870M964N497N129
$$ 1187893 1200905 1212818 1222270 1229213 1234685 1239578 1243900 1247419 1250621 1254491 1259455 1264952 1270081
59681A270081M285L609L439L623L634L052K032J159P74O89N23J06m69r09p87J76
$$ 1270081 1274366 1277975 1281414 1285037 1288671 1291723 1293755 1294914 1295688 1296377 1296900 1297006 1296537 1295628 1294841 1295017
59665A295017J777L301L915L231J738O60R49K187L016K848K574L060L721L398
$$ 1295017 1296794 1300095 1304010 1307241 1308979 1309639 1310588 1312775 1315791 1318639 1321213 1324273 1327994 1331392
59651A331392K169J268J376K092L014M236N594O579P358Q803J0848J1871J0624
$$ 1331392 1333561 1334829 1336205 1338297 1341311 1345547 1351141 1357720 1365078 1373881 1384729 1396600 1407224
59638A407224Q135O610O790P396P118O125N330M917M143K336k87k791m229m213
$$ 1407224 1415359 1421969 1428759 1436155 1443273 1449398 1454728 1459645 1463788 1466124 1465837 1463046 1458817 1454604
59624A454604l041j532q20j814m311o660p117n844n043o469r283j1112j0929r823
$$ 1454604 1451563 1450031 1449211 1447397 1443086 1436426 1429309 1423465 1418422 1411953 1402670 1391558 1380629 1370806
59610A370806q986q225p063o072n858n453l246M52L310L904L479M011N634P030
$$ 1370806 1361820 1353595 1346532 1340460 1334602 1329149 1325903 1326355 1329665 1333569 1337048 1341059 1346693 1353723
59596A353723P644Q104Q730Q992Q584P879P037N556L259Q11j310l768p532j2280
$$ 1353723 1361367 1369471 1378201 1387193 1395777 1403656 1410693 1416249 1419508 1420319 1419009 1415241 1407709 1395429
59582A395429j6223j7659j6651j5129j5204j7115j8999j8989j7217j5280j4115
$$ 1395429 1379206 1361547 1344896 1329767 1314563 1297448 1278449 1259460 1242243 1226963 1212848
59571A212848j3320j2377j1410j0538r562q776r047j0519j2007j2347j1739j1150
$$ 1212848 1199528 1187151 1175741 1165203 1155641 1146865 1137818 1127299 1115292 1102945 1091206 1080056
59559A080056j0889j0566r976r430r291r555r701q934p016m844l599l284k937
$$ 1080056 1069167 1058601 1048625 1039195 1029904 1020349 1010648 1001714 994698 989854 986255 982971 980034
59546I80034k246j853j875j542p54n54j190j185M77K567L417L469M219N454N448
$$ 980034 977788 975935 974060 972518 971764 971210 970020 968835 969312 971879 975296 978765 982984 988438 993886
59531I93886L716J728P10J97q12k409l869m545m417m189m676n680n933m776l243
$$ 993886 997602 999330 1000040 1000237 999425 997016 993147 988602 984185 979996 975320 969640 963707 958931 955688
59516I55688k695l026l280l351l670l715k447j76J428J360K73n72l32J199L263
$$ 955688 952993 949967 946687 943336 939666 935951 933504 933328 934756 936116 936389 935817 935485 936684 939947
59501I39947M199L054R76j77k60m40p52L1K047L839M621N249O347P198P309P415
$$ 939947 944146 947200 948176 947999 947739 947299 946547 946578 948625 952464 957085 962334 968681 975879 983188 990603
59485I90603Q033Q500Q621R770J2961J6914J9552K0674K1658K2931K3034K0204
$$ 990603 998636 1007136 1015757 1025527 1038488 1055402 1074954 1095628 1117286 1140217 1163251 1183455
59473A183455J4186O613J56l191l624l089k995k999k381j622j614k110k121j501
$$ 1183455 1197641 1204254 1204410 1201219 1197595 1194506 1191511 1188512 1186131 1184509 1182895 1180785 1178664 1177163
59459A177163j097j486k551m104o070p990r226r782j0316j1189j2063j2542j2672
$$ 1177163 1176066 1174580 1172029 1167925 1161855 1153865 1144639 1134857 1124541 1113352 1101289 1088747 1076075
59446A076075j2630j2327j1554j0324q830p307o039n327n209n276m958m102l123
$$ 1076075 1063445 1051118 1039564 1029240 1020410 1013103 1007064 1001737 996528 991252 986294 982192 979069
59433I79069k434j789n48J398L275M226M101L293K215J311J157K022L454M705
$$ 979069 976635 974846 974298 975696 978971 983197 987298 990591 992806 994117 995274 997296 1000750 1005455
59419A005455N415N597N359N034N122N566N571M693L650L291L318K901K125J871
$$ 1005455 1010870 1016467 1021826 1026860 1031982 1037548 1043119 1047812 1051462 1054753 1058071 1060972 1063097 1064968
59405A064968K468L490M536N263N024L621K224K261L525M632N209O183P827R077
$$ 1064968 1067436 1070926 1075462 1080725 1085749 1089370 1091594 1093855 1097380 1102012 1107221 1113404 1121231 1130308
59391A130308R243Q991R099R313Q991P871N765K574r20l343m330m941n961o785
$$ 1130308 1139551 1148542 1157641 1166954 1175945 1183816 1189581 1192155 1191235 1187892 1183562 1178621 1172660 1165875
59377A165875o532n303l792k393j219k15J063K915M450M258K552J596L214O866
$$ 1165875 1159343 1154040 1150248 1147855 1146636 1146421 1147484 1150399 1154849 1159107 1161659 1163255 1166469 1173335
59363A173335J0737J3799J6046J7709J9232K1340K4240K7069K8788K9396K9975
$$ 1173335 1184072 1197871 1213917 1231626 1250858 1272198 1296438 1323507 1352295 1381691 1411666
59352A411666L1750L4860L7278L5324K6691J3352M10q195j1891j1784q831m212
$$ 1411666 1443416 1478276 1515554 1550878 1577569 1590921 1591331 1583136 1571245 1559461 1550630 1546418
59340A546418N35M890R406J3270J3402P390l584j5724k5425l0347k9541k4424
$$ 1546418 1546953 1551843 1561249 1574519 1587921 1595311 1591727 1576003 1550578 1520231 1490690 1466266
59328A466266j8705j5483j4655j4150j2867j1201r619q164o916n760m150k141
$$ 1466266 1447561 1432078 1417423 1403273 1390406 1379205 1369586 1361422 1354506 1348746 1344596 1342455
59316A342455r15j177j816j358k3R23J212J622K589L925N380O340N776L834K564
$$ 1342455 1341540 1340363 1338547 1337189 1337166 1338089 1339301 1340923 1343512 1347437 1352817 1359157 1364933 1368767 1371331
59301A371331L587N732O681O315O549Q335J0781J3135J5523J7608J8486J8435
$$ 1371331 1374918 1380650 1387331 1393646 1400195 1408530 1419311 1432446 1447969 1465577 1484063 1502498
59289A502498J9037K0859K2471K2512K1499K0696K0268J9442J7925J6197J4712
$$ 1502498 1521535 1542394 1564865 1587377 1608876 1629572 1649840 1669282 1687207 1703404 1718116
59278A718116J3310J1292P983L472j143m623o848q820j1459j4770j8153k0998
$$ 1718116 1731426 1742718 1750701 1754173 1753030 1748407 1741559 1732739 1721280 1706510 1688357 1667359
59266A667359k2940k3818k3712k2948k2140k1940k2367k2555k1854k0977k1127
$$ 1667359 1644419 1620601 1596889 1573941 1551801 1529861 1507494 1484939 1463085 1442108 1420981
59255A420981k1949k1630j9464j6956j5609j4851j3289j0960r033p957p178o193
$$ 1420981 1399032 1377402 1357938 1340982 1325373 1310522 1297233 1286273 1277240 1269283 1262105 1255912
59243A255912m821k776Q8L449P130J1338J5615J8391J8528J6394J2569O600j522
$$ 1255912 1251091 1248315 1248403 1251852 1258982 1270320 1285935 1304326 1322854 1339248 1351817 1358417 1356895
59230A356895r649j4998j6948j6999j6381j5124j3118j0646p997n471l407j439
$$ 1356895 1347246 1332248 1315300 1298301 1281920 1266796 1253678 1243032 1235035 1229564 1226157 1224718
59218A224718J443N087P562P832P854J0172J4231J7149J7610J6864J6248J5833
$$ 1224718 1226161 1231248 1238810 1246642 1254496 1264668 1278899 1296048 1313658 1330522 1346770 1362603
59206A362603J5455J5069J3962J1447Q500O971P054P156O242M545K083j531n481
$$ 1362603 1378058 1393127 1407089 1418536 1427036 1434007 1441061 1448217 1454459 1459004 1461087 1459556 1454075
59193A454075p898q106p166o020m779l990m522n686n387l007n55o3j296k750l464
$$ 1454075 1446177 1438071 1430905 1424885 1420106 1416116 1411594 1405908 1400521 1397514 1396959 1396896 1395600 1392850 1389386
59178A389386l157j917o27n10j470k069j702j616l031n410p461q783r807j0814
$$ 1389386 1386229 1384312 1383685 1383175 1381705 1379636 1377934 1376318 1373287 1367877 1360416 1351633 1341826 1331012
59164A331012j1706j2157j1675j0280r124r454j0800j1378j0440r020q172p773
$$ 1331012 1319306 1307149 1295474 1285194 1276070 1266616 1255816 1244438 1233998 1224978 1216806 1209033
59152A209033p342o786n872m265k484j545j355o69J002K771L902M552M718M054
$$ 1209033 1201691 1194905 1189033 1184768 1182284 1180739 1179384 1178715 1179717 1182488 1186390 1190942 1195660 1199714
59138A199714L212L725N808P813Q473Q204P626O516N174M982O445Q042Q253P425
$$ 1199714 1202926 1206651 1212459 1220272 1228745 1236949 1244575 1251091 1256265 1261247 1267692 1275734 1283987 1291412
59124A291412O504N367L671K025R30l14k182l497l074j872j901l476n081n601
$$ 1291412 1297916 1303283 1306954 1308979 1309909 1309595 1307413 1303916 1300842 1298970 1297069 1293593 1288512 1282911
59110A282911n298m862m690n091o067o901o741n612m292l405l130l479m273n001
$$ 1282911 1277613 1272751 1268061 1262970 1256903 1250002 1243261 1237649 1233357 1229952 1226822 1223343 1219070 1214069
59096A214069n314n502o246p964j0368j2320j2358j0155p436o440p342q232p818
$$ 1214069 1208755 1203253 1197007 1189043 1178675 1166355 1153997 1143842 1136406 1129966 1122624 1114392 1106574
59083A106574o968p087q078q700q102o431m517l444l773m821n330m861l743j925
$$ 1106574 1099606 1092519 1084441 1075741 1067639 1061208 1056691 1053247 1049474 1044653 1039323 1034462 1030719 1028794
59069A028794P59L248L950L280L713O452R605J0790J0234J0031J1364J3697J5951
$$ 1028794 1029553 1032801 1036751 1040031 1043744 1050196 1059801 1070591 1080825 1090856 1102220 1115917 1131868
59056A131868J7365J7714J7528J7720J8514J9237J9351J8827J7432J4971J2471
$$ 1131868 1149233 1166947 1184475 1202195 1220709 1239946 1259297 1278124 1295556 1310527 1322998
59045A322998J1584J2177J2083R999P141N090L555J496r47k964m384n230m973
$$ 1322998 1334582 1346759 1358842 1368841 1375982 1381072 1384627 1386123 1385176 1382212 1377828 1372598 1367625
59032A367625l524k062j749k326k962l655m829o382q018r648j0898j1233j1124
$$ 1367625 1364101 1362039 1360290 1357964 1355002 1351347 1346518 1340136 1332118 1322470 1311572 1300339 1289215
59019A289215j1664j2464j1702r208p526q433j0247j0415r104q167p942p457o792
$$ 1289215 1277551 1265087 1253385 1244177 1236651 1228218 1217971 1207556 1198452 1190285 1182343 1174886 1168094
59006A168094o827p202o744n679n495o665q134q896q690p461n575m192m076m383
$$ 1168094 1161267 1154065 1147321 1141642 1136147 1129482 1121348 1112452 1103762 1096301 1090726 1086534 1082458 1078075
58992A078075l879k787k086j753j251r82j415j335Q42M206N945M994L206K493
$$ 1078075 1074196 1071409 1069323 1067570 1066319 1065337 1063922 1062587 1063429 1067635 1073580 1078574 1081780 1084273
58978A084273K568K293J710J754K762M082M788M482L670L492M706O983R426J1499
$$ 1084273 1086841 1089134 1090844 1092598 1095360 1099442 1104230 1108712 1112382 1115874 1120580 1127563 1136989 1148488
58964A148488J3105J4315J5410J6731J8072J8761J8584J7852J6332J3324R312
$$ 1148488 1161593 1175908 1191318 1208049 1226121 1244882 1263466 1281318 1297650 1310974 1320286
58953A320286O066M318K722J89k185k917k528k477k752k190n26J538L633N632
$$ 1320286 1326352 1330670 1333392 1333581 1331396 1328479 1325951 1323474 1320722 1318532 1318006 1319544 1323177 1328809
58939A328809O797O362M717K917J679J409K106K412L70l675o670o875o291p117
$$ 1328809 1335606 1341968 1346685 1349602 1351281 1352690 1354796 1357208 1357578 1353903 1347233 1340358 1334067 1326950
58925A326950p954o333l215j523j252K84L643O244O478N797O044P378R352J1711
$$ 1326950 1318996 1312663 1309448 1307925 1306673 1306957 1310600 1316844 1323322 1329119 1335163 1342541 1351893 1363604
58911A363604J3507J3784J3643J5290J8396J9855J7943J4537J2185J1018R848
$$ 1363604 1377111 1390895 1404538 1419828 1438224 1458079 1476022 1490559 1502744 1513762 1523610
58900A523610Q484P472O690N354K734j558p095j2209j5232j6347j7015j7699j7739
$$ 1523610 1532094 1539566 1546256 1551610 1554344 1552786 1545691 1533482 1518250 1501903 1484888 1467189 1449450
58887A449450j7306j7522j8322j8244j6855j5406j4486j2978j0342p952o993o670
$$ 1449450 1432144 1414622 1396300 1378056 1361201 1345795 1331309 1318331 1307989 1300037 1293044 1286374
58875A286374n793m695m202l948l184k299k171k562k472j703j035j049j500j798
$$ 1286374 1280581 1275886 1271684 1267736 1264552 1262253 1260082 1257520 1255048 1253345 1252310 1251261 1249761 1247963
58861A247963j569q42MN31N11q0r30j064O32L826O403O665N368M498M729N460
$$ 1247963 1246394 1245552 1245556 1246087 1246598 1246518 1245588 1244524 1245156 1248982 1255385 1262050 1267418 1271916 1276645 1282105
58845A282105O737R341J2982J6066J7524J7678J7286J6920J7122J7992J8656J8409
$$ 1282105 1288842 1298183 1311165 1327231 1344755 1362433 1379719 1396639 1413761 1431753 1450409 1468818
58833A468818J8016J8603J9726K0151K0130K0966K2565K3366K2817K1941K1232
$$ 1468818 1486834 1505437 1525163 1545314 1565444 1586410 1608975 1632341 1655158 1677099 1698331
58822A698331J9893J7547J4927J2490R860O965M300J947k52j698j849j772l050
$$ 1698331 1718224 1735771 1750698 1763188 1773048 1780013 1784313 1786260 1786008 1784310 1782461 1780689 1777639
58809A777639n277o713p184q117r681j0441j0075r968j0769j1824j3292j6131
$$ 1777639 1772362 1765649 1758465 1750348 1740667 1730226 1720151 1710183 1699414 1687590 1674298 1658167
58797A658167j9421k0663j9657j9276k1184k3541k4183k3440k2269k0367j7925
$$ 1658167 1638746 1618083 1598426 1579150 1557966 1534425 1510242 1486802 1464533 1444166 1426241
58786A426241j6777j7636j8395j7283j5763j6000j7209j6917j4619j2085j0949
$$ 1426241 1409464 1391828 1373433 1356150 1340387 1324387 1307178 1290261 1275642 1263557 1252608
58775A252608j1613j3376j4298j2266p720l906k964l368k763j402p60n89K10J121
$$ 1252608 1240995 1227619 1213321 1201055 1193335 1189429 1186465 1183097 1180334 1178932 1178172 1177583 1177793 1178914
58761A178914R87M43R93K410L285L480L795L819K436K01r31k52J005J541R98n40
$$ 1178914 1179901 1180344 1181337 1183747 1187032 1190512 1194307 1198126 1200562 1200763 1199832 1199580 1200585 1202126 1203124 1202584
58745A202584k565l884l862l615m579o316p269p241p342p750p325n692m091l748
$$ 1202584 1200019 1196135 1192273 1188658 1184079 1177763 1170494 1163253 1155911 1148161 1140836 1135144 1131053 1127305
58731A127305m550n564n943n032k639N63L367M967N354N153N355O682Q716J0192
$$ 1127305 1122755 1117191 1111248 1106216 1103577 1104140 1107507 1112474 1117828 1122981 1128336 1135018 1143734 1153926
58717A153926J0568J0465J0180Q936O388L695J962O27j406l961o180q073j0105
$$ 1153926 1164494 1174959 1185139 1194075 1200463 1204158 1206120 1206747 1205341 1201380 1195200 1187127 1177022
58704A177022j1848j2442j1927j1026j0096r300r112r455r088p165m771l535l289
$$ 1177022 1165174 1152732 1140805 1129779 1119683 1110383 1101271 1091816 1082728 1075563 1070792 1067257 1063968
58691A063968k478n56J443K468K326J329K48L57K232M724O275P010Q289J0406
$$ 1063968 1061490 1060934 1062377 1064845 1067171 1068500 1068748 1069105 1071337 1076061 1082336 1089346 1097635 1108041
58677A108041J2108J2466J2001J1596J1261J0483R200P990P459P545P459O568
$$ 1108041 1120149 1132615 1144616 1156212 1167473 1177956 1187156 1195146 1202605 1210150 1217609 1224177
58665A224177N332M883N568O549O947O633N829M896M655N775P466P993O903N453
$$ 1224177 1229509 1234392 1239960 1246509 1253456 1260089 1265918 1270814 1275469 1281244 1288710 1296703 1303606 1309059
58651A309059M453L227J272p50k572n045q228j0585j1515j2860j6133j9870k1889
$$ 1309059 1313512 1316739 1318011 1317261 1314689 1309644 1301416 1290831 1279316 1266456 1250323 1230453 1208564
58638A208564k2672k4141k6075k6428k4775k2915k1968k1031j9044j6329j3831
$$ 1208564 1185892 1161751 1135676 1109248 1084473 1061558 1039590 1018559 999515 983186 969355
58627I69355j2134j1405j1304j0934r800q597q140p908o721m410j816L44J532
$$ 969355 957221 945816 934512 923578 913778 905181 897041 889133 882412 878002 876186 876530 878062
58614H78062J141l58p65J575N198O967O066M900N816Q498J1034J2360J2911J3441
$$ 878062 879203 878845 878080 879655 884853 891820 897886 902786 908602 917100 928134 940494 953405 966846
58600I66846J3655J1977P155K95n399p711p521p134p441p816p927q126q433q500
$$ 966846 980501 992478 999633 999928 994529 986818 979297 972163 964722 956906 948979 940853 932420 923920
58586I23920q399q381q108p136n817m824m150l529l237l453l349k077k78O34M91
$$ 923920 915521 907140 899032 891896 886079 881255 877105 873576 870339 866886 863537 861460 861182 861816 862307
58571H62307N12J473K707K957J640n86k135j825l05N26p8q09l10J081K352L371
$$ 862307 862819 864292 866999 869956 871596 871010 868875 867050 866745 867271 867193 866384 866074 867155 869507 872878
58555H72878M399N078N015M550M028L321K776L352M863N495M316K783K438K662
$$ 872878 877277 882355 887370 891920 895948 899269 902045 905397 910260 915755 920071 922854 925292 927954
58541I27954K258J676J845K228K094K369L989N630N461M243M215N576O610O905
$$ 927954 930212 931888 933733 935961 938055 940424 944413 950043 955504 959747 963962 969538 976148 983053
58527I83053P887J0173J2603J4138J4838J4941J4622J4642J5554J6438J6006J4773
$$ 983053 990940 1001113 1013716 1027854 1042692 1057633 1072255 1086897 1102451 1118889 1134895 1149668
58515A149668J4460J5389J6164J5921J5298J5125J5611J6828J8702K0626K2181
$$ 1149668 1164128 1179517 1195681 1211602 1226900 1242025 1257636 1274464 1293166 1313792 1335973
58504A335973K3956K6561K9315L1073L1750L1890L1438L0285K9038K7817K5021
$$ 1335973 1359929 1386490 1415805 1446878 1478628 1510518 1541956 1572241 1601279 1629096 1654117
58493A654117J9177J1360M209r82m681p516r788j1930j3888j4754j4435j4611
$$ 1654117 1673294 1684654 1688863 1687881 1683200 1675684 1665896 1653966 1640078 1625324 1610889 1596278
58481A596278j6568j9242k1193k3068k6023k9041l0220k9684k8778k7516k5297
$$ 1596278 1579710 1560468 1539275 1516207 1490184 1461143 1430923 1401239 1372461 1344945 1319648
58470A319648k3098k2165k1377j8814j5255j3165j2778j2170j0841j0126j0144
$$ 1319648 1296550 1274385 1253008 1234194 1218939 1205774 1192996 1180826 1169985 1159859 1149715
58459A149715r471p988p143p145o570n014l609k720j696j009j927l854m687m028
$$ 1149715 1140244 1132256 1125113 1117968 1111398 1106384 1102775 1100055 1098359 1097350 1095423 1091569 1086882 1082854
58445A082854l380k995j432J140K252P23j548k398j769l52J833M382N947N899
$$ 1082854 1079474 1076479 1075047 1076187 1078439 1079162 1077614 1075216 1073447 1073095 1074928 1079310 1085257 1091156
58431A091156N235N123N847P430R750J1842J2694J2854J3774J5615J7395J9025
$$ 1091156 1096391 1101514 1107361 1114791 1124541 1136383 1149077 1161931 1175705 1191320 1208715 1227740
58419A227740K1193K3311K3646K1658J8504J5285J2439J0441R128O834K298k980
$$ 1227740 1248933 1272244 1295890 1317548 1336052 1351337 1363776 1374217 1383345 1390179 1392477 1389497
58407A389497o476q057r330j0309r545p140m741k693m7K683L843L730M468O654
$$ 1389497 1383021 1374964 1365634 1355325 1345780 1338640 1333899 1331206 1331159 1333842 1337685 1341415 1345883 1352537
58393A352537Q813J0232J1425J1727R512N148R09k370n733r091j0875j1018j1192
$$ 1352537 1361350 1371582 1383007 1394734 1404246 1409394 1410303 1407933 1402200 1393109 1382234 1371216 1360024
58380A360024j1621j0698q278o306n526m530k852j940k209j936r1K275M241O149
$$ 1360024 1348403 1337705 1329427 1323121 1317595 1313065 1310213 1308273 1306064 1304128 1304037 1306312 1310553 1316702
58366A316702P789Q045P121O717P386P781P033N567L407N8l625n821o220o129
$$ 1316702 1324491 1332536 1339657 1346374 1353760 1361541 1368574 1374141 1377548 1377606 1373981 1368160 1361940 1355811
58352A355811o175o073o055o226n348k857r68j707l180k336p3M47o02k76J838
$$ 1355811 1349636 1343563 1337508 1331282 1325934 1323077 1322109 1320402 1317222 1314886 1314813 1315260 1314658 1314382 1316220
58337A316220L623M965P324R341Q322N824O111Q861R349O355L870L889L784K335
$$ 1316220 1319843 1324808 1332132 1341473 1349795 1355619 1361730 1370591 1379940 1386295 1390165 1394054 1397838 1400173
58323A400173K266M482N579L783K239L627O182P553Q184Q599P781O396P194J0132
$$ 1400173 1402439 1406921 1412500 1416283 1418522 1422149 1428331 1435884 1444068 1452667 1460448 1466844 1474038 1484170
58309A484170J1621J0588J0520J3382J6426J7380J7886J9226J9492J7791J6733
$$ 1484170 1495791 1506379 1516899 1530281 1546707 1564087 1581973 1601199 1620691 1638482 1655215
58298A655215J7972J9559J9987K0436K0908J9032J4974J2515J2846J2555J0263
$$ 1655215 1673187 1692746 1712733 1733169 1754077 1773109 1788083 1800598 1813444 1825999 1836262
58287A836262R608J2562J5402J4863J3099J2942J3358J3207J4578J8415K1475
$$ 1836262 1845870 1858432 1873834 1888697 1901796 1914738 1928096 1941303 1955881 1974296 1995771
58276A995771K1315K0079K0122K0475K0475K1856K4184K3691J9809J7275J8402
$$ 1995771 2017086 2037165 2057287 2077762 2098237 2120093 2144277 2167968 2187777 2205052 2223454
58265B223454J9234J6963J4785J5210J5111J2358J0953J4072J7858J7890J6455
$$ 2223454 2242688 2259651 2274436 2289646 2304757 2317115 2328068 2342140 2359998 2377888 2394343
58254B394343J7580J9996K0887K1841K5168K8785L0244L1465L4234L5829L4363
$$ 2394343 2411923 2431919 2452806 2474647 2499815 2528600 2558844 2590309 2624543 2660372 2694735
58243B694735L3541L6539M0059M0200L9317M1131M3808M3956M3157M4560M7058
$$ 2694735 2728276 2764815 2804874 2845074 2884391 2925522 2969330 3013286 3056443 3101003 3148061
58232C148061M8333M9429N1312N1580M9537M9317N3021N6351N6220N6552O0843
$$ 3148061 3196394 3245823 3297135 3348715 3398252 3447569 3500590 3556941 3613161 3669713 3730556
58221C730556O5420O6264O6137O8580P1282P2016P4387Q0755Q6380Q7900R0428
$$ 3730556 3795976 3862240 3928377 3996957 4068239 4140255 4214642 4295397 4381777 4469677 4560105
58210D560105R8363J06599J09456J11111J17797J26484J31141J33982J40529J49190
$$ 4560105 4658468 4765067 4874523 4985634 5103431 5229915 5361056 5495038 5635567 5784757
58200E784757J55610J61818J71268J80153J83351J83767J86708J90568J92236
$$ 5784757 5940367 6102185 6273453 6453606 6636957 6820724 7007432 7198000 7390236
58191G390236J95557K05005K17224K28137K41660K61897K84165L03678L25210
$$ 7390236 7585793 7790798 8008022 8236159 8477819 8739716 9023881 9327559 9652769
58182I652769L53751L83835M09140M33919M63659M93975N20958N52614N96537
$$ 9652769 10006520 10390355 10799495 11233414 11697073 12191048 12712006 13264620 13861157
58173A3861157O46118O92712P40945P97179Q53900R02068R48286J002895J061818
$$ 13861157 14507275 15199987 15940932 16738111 17592011 18494079 19442365 20445260 21507078
58164B1507078J117758J177706J250201J326948J397369J469935J558160J657754
$$ 21507078 22624836 23802542 25052743 26379691 27777060 29246995 30805155 32462909
58156C2462909J760029J875122K017846K183464K362670K566587K809736L082941
$$ 32462909 34222938 36098060 38115906 40299370 42662040 45228627 48038363 51121304
58148E1121304L372833L693355M067073M492160M962028N499084O130681O851517
$$ 51121304 54494137 58187492 62254565 66746725 71708753 77207837 83338518 90190035
58140I0190035P653165Q570972R654573J0912709J2335302J3938269J5723341
$$ 90190035 97843200 106414172 116068745 126981454 139316756 153255025 168978366
58133A68978366J7628882J9604934K1719786K4128011K6984147L0430354L4407540
$$ 168978366 186607248 206212182 227931968 252059979 279044126 309474480 343882020
58126C43882020L8046212L9226785L5364460K5338976J0844044m384272j6862200
$$ 343882020 381928232 421155017 456519477 481858453 492702497 488318225 471456025
58119D71456025k5076962k9430091l1110489l1188883l0357492k8986711k7241685
$$ 471456025 446379063 416948972 385838483 354649600 324292108 295305397 268063712
58112B68063712k5233286k3117774k1048087j9082778j7210693j5439494j3803688
$$ 268063712 242830426 219712652 198664565 179581787 162371094 146931600 133127912
58105A33127912j2313080j0955123r735892q669576p738756o908175o167441n522685
$$ 133127912 120814832 109859709 100123817 91454241 83715485 76807310 70639869 65117184
58097F5117184m958693m447530l985374l585536l242677k936366k663036k433225
$$ 65117184 60158491 55710961 51725587 48140051 44897374 41961008 39297972 36864747
58089C6864747k242059k070723j913013j774747j651290j530253j412693j308994
$$ 36864747 34622688 32551965 30638952 28864205 27212915 25682662 24269969 22960975
58081B2960975j217446j127964j042543r71061r10925q51412p94388p50652p18514
$$ 22960975 21743529 20615565 19573022 18601961 17691036 16839624 16045236 15294584 14576070
58072A4576070o85297o47985o14180n84591n52049n16584m85043m57025m26453
$$ 14576070 13890773 13242788 12628608 12044017 11491968 10975384 10490341 10033316 9606863
58063I606863l95397l71407l52848l31520l08243k91510k82030k72399k60923
$$ 9606863 9211466 8840059 8487211 8155691 7847448 7555938 7273908 7001509 6740586
58054F740586k52394k46294k37153k25605k16788k09145j96951j82400j72914
$$ 6740586 6488192 6241898 6004745 5779140 5562352 5353207 5156256 4973856 4800942
58045D800942j67913j60406j50278j43665j40330j34180j25727j21609j21714
$$ 4800942 4633029 4472623 4322345 4178680 4038350 3904170 3778443 3656834 3535120
58036C535120j18766j11187j04954j01966r7642r1086q6991q6223q4385q0824
$$ 3535120 3416354 3305167 3200213 3098247 3000605 2909519 2822528 2736305 2651920 2571096
58026B571096p9548q0223p7836p2365o9540p0599p0186o5934o1692n9727n7654
$$ 2571096 2491548 2411325 2333489 2261124 2191584 2120985 2050799 1984865 1923173 1863446 1805792
58015A805792n4446n2081n0068m5603l9917l7398l7807l6427l2302k9250k8398
$$ 1805792 1751346 1699265 1649197 1603594 1563677 1526279 1488472 1452045 1419743 1390493 1362095
58004A362095k6898k4332k3281k3228k1005j7540j7137j9794k1227k0619k1163
$$ 1362095 1335197 1310865 1287584 1264356 1243351 1225811 1208674 1188880 1167653 1147034 1125871
57993A125871k2809k2001j8991j7989j9304j8696j5448j3798j5194j6179j5208
$$ 1125871 1103062 1081061 1062070 1044081 1024777 1006081 990633 976835 961641 945462 930254
57982I30254j4740j5291j4130j1425j1112j3990j5994j4899j2968j1775j0136
$$ 930254 915514 900223 886093 874668 863556 849566 833572 818673 805705 793930 783794
57971G83794q361q772j0873j1505j0617j1311j3668j4439j3381j3600j5038j4061
$$ 783794 775433 766661 755788 744283 733666 722355 708687 694248 680867 667267 652229 638168
57959F38168j0453q200q157o651k833o77j824k980k501l013n087m764n16L252
$$ 638168 627715 619515 611358 604707 601874 601197 599373 596393 593892 590879 585792 581028 580512 583764
57945E83764K937P56p3j98r64j048M74J599R00R0O66J483J557J812K307J410q04
$$ 583764 586701 587457 587384 587186 586222 585174 585648 587247 588147 588237 588903 590386 591943 593755 596062 597472 596668
57928E96668k042j954k877n269o599o124o367q375r848r512q993q820p053l600
$$ 596668 594626 592672 589795 584526 577927 571803 565436 557061 547213 537701 528708 519888 512835 509235
57914E09235j461j811k154j135p53j886k174n00P26J11j68J339K486J572L91P36
$$ 509235 507774 505963 503809 502674 501921 500035 497861 497361 498087 498198 498030 499369 501855 503427 503818 504554
57898E04554J380R34L34K92m82k319l146j973p60j099k148l204m766n824m085
$$ 504554 505934 506868 507202 507494 507012 504693 501547 499574 498814 497715 495567 492363 487597 481773 477688
57883D77688m55R64q62j916M77L730M923N244O618P842P372O504O611O307M264
$$ 477688 477233 478197 477335 475419 475896 479626 484549 489793 496411 504253 511625 518129 524740 531047 535311
57868E35311J894N63q53l099m380l710l322m953o790o876o600p818r274q963p593
$$ 535311 537205 537768 536915 533816 529436 525726 522404 517451 510661 503785 497185 489367 480093 471130 463537
57853D63537o791o127m693l466l427l307j686N73K024K726K769J160j867l844
$$ 463537 456746 450619 445926 442460 439033 435726 434040 434613 436637 439363 442132 443292 441425 437581
57839D37581l374k035j260r8J930K895J662K64N83J471J587K209M507O741P002
$$ 437581 434207 432172 430912 430814 432744 435639 437301 437565 438148 439619 441206 443415 447922 454663 461665
57824D61665O283O089N495L473J590J479J835Q84l74m08m18k177m471m893l691
$$ 461665 467948 474037 479532 483005 484595 486074 487909 488793 488419 488011 487593 485416 480945 476052 472361
57809D72361k858k750k439k129k446k445q81J436K677K512J768R34N26J455L387
$$ 472361 469503 466753 464314 462185 459739 457294 456413 457849 460526 463038 464806 465740 466266 467721 471108
57794D71108M402L841L527M612N496M703L405L079K945K036J395J893K122Q76
$$ 471108 475510 479351 482878 487490 492986 497689 501094 504173 507118 509154 510549 512442 514564 515440
57780E15440m37l77k12j409k639k117q91q92j443o72J190K631L465M033L429J111
$$ 515440 515003 514626 514414 513005 510366 508249 507358 506466 505023 504351 505541 508172 511637 515670 519099 520210
57764E20210j342k497l415n244o449n179k611j152r64r70j456k816l478k170p31
$$ 520210 518868 516371 512956 507712 501263 496084 493473 492321 491357 490387 488931 486115 482637 480467 479736
57749D79736j713m625p339r496j1522j2083r983p150o384p230p284o297n683n180
$$ 479736 478023 473398 466059 456563 445041 432958 422975 415825 409441 402211 394927 388630 382947 377767
57735C77767l515j502j052j760j638n25K14N97J568K549K428K106K971L817K664
$$ 377767 374252 372750 371698 369938 368300 367775 367989 368586 370154 372703 375131 377237 380208 384025 386689
57720C86689P16Q88L004M184L645L428M360M954M608M451M545L403R62p63p15
$$ 386689 387405 388293 391297 395481 399126 402554 406914 411868 416476 420927 425472 428875 429837 429074 428359
57705D28359L3O35J523K565K466P94j244k449k559j567J93J489J417Q75J258K279
$$ 428359 428392 429027 430550 433115 435581 436375 435131 432682 430123 428556 428749 430238 431655 432530 433788 436067
57689D36067K744K662K634K196R84M74K098M507N226M101K610R06j514l269k622
$$ 436067 438811 441473 444107 446303 447287 447761 449859 454366 459592 463693 466303 467209 465695 462426 459804
57674D59804q08m62j291q15J055J895J200J165K648L896L863L474K950J295q57
$$ 459804 458996 458534 457243 456428 457483 459378 460578 461743 464391 468287 472150 475624 478574 479869 479012
57659D79012j107Q94K617K603K249K561K185K50j597j729r34o91r39r29p04m45
$$ 479012 477905 478799 481416 484019 486268 488829 491014 491264 489667 487938 487004 486313 485374 484445 483741 483296
57643D83296P3N68K53n85o16L90J175J138R84R01J44j096j571j303j873l754n497
$$ 483296 483369 483937 484190 483605 482989 483379 484554 485692 486676 487577 487721 486625 485054 483751 481878 478124 472627
57626D72627o255o819p306o227l102J28J754K563M067O092P730R379J2296J6795
$$ 472627 466372 459553 452247 446020 442918 443046 444800 447363 451430 457522 465252 474631 486927 503722
57612E03722K2021K7066L1703L6416M1752M7161N0882N1808N0416M6344L6491
$$ 503722 525743 552809 584512 620928 662680 709841 760723 812531 862947 909291 945782
57601I45782J8559l880k3196l5179m1918m6660m9146m7776m3534l9150l5728l2221
$$ 945782 964341 960461 937265 902086 860168 813508 764362 716586 673052 633902 598174 565953
57589E65953k7549k1851j6258j2264j0581j0068q723o165m071l795m735n422n089
$$ 565953 538404 516553 500295 488031 477450 467382 458659 452494 448423 444628 439893 434471 429382
57576D29382l869k611k461l497l937k244L29J162r5j435j961k818m425n340m726
$$ 429382 425513 422902 420441 416944 413007 410763 411092 412254 412159 410724 408763 405945 401520 396180 391454
57561C91454l636l004k448j869k106l097l402k533j827k104k459k186j913j865
$$ 391454 387818 384814 382366 380497 378391 375294 371892 369359 367532 365428 362969 360783 358870 357005
57547C57005j118L70J063L79k07K08K34j335l251l659k709j760j358j363j839
$$ 357005 355887 356257 357320 357699 357492 357700 357934 356599 353348 349689 346980 345220 343862 342499 340660
57532C40660k558k757k440k649l571l900k953j815j404j151o36p19j737k409k008
$$ 340660 338102 335345 332905 330256 326685 322785 319832 318017 316613 315462 314826 314107 312370 309961 307953
57517C07953j884l186m696m607l148j790j057p61j132k113k557j766r20j415k706
$$ 307953 306069 302883 298187 293580 290432 288642 287585 286824 285692 283579 281022 279256 278336 276921 274215
57502B74215l202k571j772j567k038k895l263k133O2J382P93m26o24J78J147K176
$$ 274215 271013 268442 266670 265103 263065 260170 256907 254774 254836 256218 257011 256585 255961 256139 257286 259462
57486B59462L354M197M507M784M810L373O13j087j67J800K600K664L728N420N626
$$ 259462 262816 267013 271520 276304 281114 284487 285100 284013 283846 285646 288246 290910 294638 300058 305684
57471C05684L716J284j59n48m94n24r17j261o18J064K483K799K802L190L035J566
$$ 305684 309400 310684 310525 309977 309483 308959 308042 306781 306163 307227 309710 312509 315311 318501 321536 323102
57455C23102K00Q44K978M534N065N868P180P445N816L585K478K670L134L071K495
$$ 323102 323302 324146 327124 331658 336723 342591 349771 357216 363032 366617 369095 371765 374899 377970 380465
57440C80465J883J671J853K024J815J101j63j696k541j830j61P76L05m81m59J56
$$ 380465 382348 384019 385872 387896 389711 390812 390649 388953 386412 384582 384421 385197 385502 385021 384562 384718
57424C84718P17J215J803K202K300K325K090J163J81M77J841K300R41p56j213
$$ 384718 385435 386650 388453 390655 392955 395280 397370 398533 398714 399191 401032 403332 404273 403517 402304
57409D02304o88J06J356K718K577N65q11P85M166O268O105N139M630M728N376
$$ 402304 401616 401722 403078 405796 408373 408938 408127 408912 413078 419346 425451 430590 435220 439948 445324
57394D45324O281O446N445M523M934N869N732M596L743L463L172L096L909N185
$$ 445324 451605 458051 463496 468019 472953 478822 484554 489150 492893 496356 499528 502624 506533 511718
57380E11718O007O573P471P962P094N969O679Q938J0047Q619O378N585O330P264
$$ 511718 517725 524298 531769 539731 546825 552794 559473 568411 578458 587077 593455 599040 605370 612634
57366F12634P746Q237R110R787R174O947M448L630M827O331O726O600P175Q263
$$ 612634 620380 628617 637727 647514 656688 663635 668083 671713 676540 682871 689597 696197 703372 711635
57352G11635Q803Q555Q000P344O882P482R310J0784J0365Q852Q315R182J0005
$$ 711635 720438 728993 736993 744337 751219 758701 768011 778795 789160 798012 806327 815509 825514
57339H25514R923R798J0725J2622J4391J4827J3599J1992J1941J3519J4347J2685
$$ 825514 835437 845235 855960 868582 882973 897800 911399 923391 935332 948851 963198 975883
57327I75883J0155R736J1884J4440J5969J7120J8559J9456J8774J6996J5796J6281
$$ 975883 986038 995774 1007658 1022098 1038067 1055187 1073746 1093202 1111976 1128972 1144768 1161049
57315A161049J7855J8801J8179J7035J7061J8213J8950J8854J9171K0193K0221
$$ 1161049 1178904 1197705 1215884 1232919 1249980 1268193 1287143 1305997 1325168 1345361 1365582
57304A365582J8446J6818J7284J8828J9320J8861J9083K0259K1340K1994K2469
$$ 1365582 1384028 1400846 1418130 1436958 1456278 1475139 1494222 1514481 1535821 1557815 1580284
57293A580284K2208K0731J9179J8893J9262J9005J8699J9581K0586J9374J6020
$$ 1580284 1602492 1623223 1642402 1661295 1680557 1699562 1718261 1737842 1758428 1777802 1793822
57282A793822J3132J2210J2348J2619J3347J4562J5438J5777J6297J7050J7217
$$ 1793822 1806954 1819164 1831512 1844131 1857478 1872040 1887478 1903255 1919552 1936602 1953819
57271A953819J6761J6660J7292J8114J9057K0564K2223K3002K2986K3229K3874
$$ 1953819 1970580 1987240 2004532 2022646 2041703 2062267 2084490 2107492 2130478 2153707 2177581
57260B177581K4140K4310K5763K8565L0703L0462K8433K6647K6538K7910K9065
$$ 2177581 2201721 2226031 2251794 2280359 2311062 2341524 2369957 2396604 2423142 2451052 2480117
57249B480117K8191K5478K3370K3712K5385K6051K5310K4381K3524K1942J9799
$$ 2480117 2508308 2533786 2557156 2580868 2606253 2632304 2657614 2681995 2705519 2727461 2747260
57238B747260J8191J7369J6834J6935J8320K0060K0449J9617J9322K0291K1667
$$ 2747260 2765451 2782820 2799654 2816589 2834909 2854969 2875418 2895035 2914357 2934648 2956315
57227B956315K2890K4030K4520K3828K3282K4809K7804K9604K9202K8140K7531
$$ 2956315 2979205 3003235 3027755 3051583 3074865 3099674 3127478 3157082 3186284 3214424 3241955
57216C241955K6732K5388K4303K3597K2199K0000J8383J8005J8043J8297J9919
$$ 3241955 3268687 3294075 3318378 3341975 3364174 3384174 3402557 3420562 3438605 3456902 3476821
57205C476821K3247K6936K9993L2889L5782L7509L7398L6603L6719L8173M0494
$$ 3476821 3500068 3527004 3556997 3589886 3625668 3663177 3700575 3737178 3773897 3812070 3852564
57194C852564M2910M4437M4632M4327M4407M4084M2070L8986L6623L5113L3075
$$ 3852564 3895474 3939911 3984543 4028870 4073277 4117361 4159431 4198417 4235040 4270153 4303228
57183D303228L0377K8182K6357K3581K0298J8646J8923J8931J7755J7365J9282
$$ 4303228 4333605 4361787 4388144 4411725 4432023 4450669 4469592 4488523 4506278 4523643 4542925
57172D542925K2163K4029K4700K4855K4803K5314K7583L1199L4145L5802L7826
$$ 4542925 4565088 4589117 4613817 4638672 4663475 4688789 4716372 4747571 4781716 4817518 4855344
57161D855344M1006M3511M3753M2870M2730M3176M2908M1777M0689M0129L9803
$$ 4855344 4896350 4939861 4983614 5026484 5069214 5112390 5155298 5197075 5237764 5277893 5317696
57150E317696L8913L6350L1645K6000K1094J6909J2308P506L852J263j664m724
$$ 5317696 5356609 5392959 5424604 5450604 5471698 5488607 5500915 5508421 5512273 5513536 5511872 5507148
57138E507148n861m334j687Q88L741O894R658J2659J7488K3689K8782L2023L5282
$$ 5507148 5501287 5496953 5495266 5496154 5499895 5506789 5516447 5529106 5546594 5570283 5599065 5631088 5666370
57125E666370L9527M3301M5309M5414M2445L4659K3564J3629O572o95j0797k2101
$$ 5666370 5705897 5749198 5794507 5839921 5882366 5917025 5940589 5954218 5960790 5960095 5949298 5927197
57113E927197l2076m0979m9768n7426o2929o7418p2224p7062q1841q7581r3864
$$ 5927197 5895121 5854142 5804374 5746948 5684019 5616601 5544377 5467315 5385474 5297893 5204029
57102E204029r8314j00302j02114j04860j06675j06852j07828j10826j13586j15340
$$ 5204029 5105715 5005413 4903299 4798439 4691764 4584912 4477084 4366258 4252672 4137332
57092D137332j19882j30134j43265j55019j65498j76578j86717j92942j95766
$$ 4137332 4017450 3887316 3744051 3589032 3423534 3246956 3060239 2867297 2671531
57083B671531j97705j98827j97682j94906j91996j88140j82195j76442j74744
$$ 2671531 2473826 2274999 2077317 1882411 1690415 1502275 1320080 1143638 968894
57074I68894j78138j85485j96981A94817c8497k53130k70940k86633l01053l17311
$$ 968894 790756 605271 408290 194817 -38497 -291627 -562567 -849200 -1150253 -1467564
57064a467564l41153l77097m25249m83301n49244o20432o93575p68755q50798
$$ -1467564 -1808717 -2185814 -2611063 -3094364 -3643608 -4264040 -4957615 -5726370 -6577168
57055f577168r43986j048170j162406j288757j429892j586946j762816j963835
$$ -6577168 -7521154 -8569324 -9731730 -11020487 -12450379 -14037325 -15800141 -17763976
57047a7763976k195529k461425k769005l131121l557763m052081m618514n268411
$$ -17763976 -19959505 -22420930 -25189935 -28321056 -31878819 -35930900 -40549414 -45817825
57039d5817825o013573o862345p828008q932683j0194754j1618198j3198594j4928288
$$ -45817825 -51831398 -58693743 -66521751 -75454434 -85649188 -97267386 -110465980 -125394268
57031a25394268j6785279j8721275k0659551k2490343k4082860k5362828k6407158
$$ -125394268 -142179547 -160900822 -181560373 -204050716 -228133576 -253496404 -279903562
57024b79903562k7375484k8206608k8346041k6894400k3186029j7307718j0078512
$$ -279903562 -307279046 -335485654 -363831695 -390726095 -413912124 -431219842 -441298354
57017d41298354k548466M498070J0676012J5836202J9883693K2736246K4386505
$$ -441298354 -443846820 -439348750 -428672738 -412836536 -392952843 -370216597 -345830092
57010c45830092K4962513K4719054K3958093K2932910K1801524K0643350J9495185
$$ -345830092 -320867579 -296148525 -272190432 -249257522 -227455998 -206812648 -187317463
57003a87317463J8367835J7250057J6120542J4964105J3778113J2571240J1363219
$$ -187317463 -168949628 -151699571 -135579029 -120614924 -106836811 -94265571 -82902352
56996h2902352J0182586R057759Q008720P047117O179918N409293M731526M139614
$$ -82902352 -72719766 -63662007 -55653287 -48606170 -42426252 -37016959 -32285433 -28145819
56988b8145819L626107L182374K798087K463973K173704J921724J701573J507983
$$ -28145819 -24519712 -21337338 -18539251 -16075278 -13901574 -11979850 -10278277 -8770294
56980h770294J338583J191647J063873R51853Q53921P68963O94686O28552N69207
$$ -8770294 -7431711 -6240064 -5176191 -4224338 -3370417 -2601454 -1906768 -1278216 -709009
56971g09009a93053B74778M24088L84665L49796L19942K96060K78318K64355K50477
$$ -709009 -193053 274778 698866 1083531 1433327 1753269 2049329 2327647 2592002 2842479
56961B842479K34785K17413J97589J72983J43214J12317Q5933O6553N2225L9230
$$ 2842479 3077264 3294677 3492266 3665249 3808463 3920780 4006713 4073266 4125491 4164721
56951D164721K5179R937n662k1377l7338n2444o4399p2168p7205q1191q3642q3252
$$ 4164721 4189900 4199837 4194175 4172798 4135460 4083016 4018617 3946449 3869244 3788053 3704411 3621159
56939C621159q0457p6969p3596p0346o7854o6798o6529o6192o6550o8714p1759
$$ 3621159 3540702 3463733 3390137 3319791 3251937 3185139 3118610 3052418 2985868 2917154 2845395
56928B845395p3839p5033p6806p9174q1116q3506q8784r7309j06680j15051j22703
$$ 2845395 2771556 2696523 2619717 2540543 2459427 2375921 2287137 2189828 2083148 1968097 1845394
56917A845394j29570j33787j33842j30332j24564j17135j08696j00343r2191q3010
$$ 1845394 1715824 1582037 1448195 1317863 1193299 1076164 967468 867125 774934 691924
56907F91924p2358o1845n3354m6950m1317l5311k8643k1985j6849j4320j3448
$$ 691924 619566 557721 504367 457417 416100 380789 352146 330161 313312 298992 285544
56896B85544j1965q924n843m976p310j2161j7590k1200k1849k0688j9394j7656
$$ 285544 273579 264655 258812 253836 246526 234365 216775 195575 173726 153038 133644 115988
56884A15988j3942q608m209k267j466K38L190O484R497J2191J4851J8105K2312
$$ 115988 102046 93438 89229 86962 85496 85734 88924 95408 104905 117096 131947 150052 172364
56871A72364K6558K9210K9416K7098K1724J2946K632n741j0491j3024j5122j6650
$$ 172364 198922 228132 257548 284646 306370 319316 321948 316207 305716 292692 277570 260920
56859B60920j6766j5711j4135j1929r034o355m834m343m377m889n641n704m619
$$ 260920 244154 228443 214308 202379 193345 186990 182156 177813 173436 168547 162906 157202 152583
56846A52583l266k750l162m118n546p109p817p262o464o419o472n214k523L64
$$ 152583 149317 146567 143405 139287 133741 126632 118815 111553 105089 98670 92198 86984 84461 84825
56832H4825K536M283O447R583J3616J7887K1614K4425K6060K5760K2925J8567
$$ 84825 87361 91644 98091 107674 121290 139177 160791 185216 211276 237036 259961 278528
56820B78528J4828J2553J0514P780N503N163O117O479N823N520O683R125J2178
$$ 278528 293356 305909 316423 324203 329706 334869 340986 347465 353288 358808 365491 374616 386794
56807C86794J5318J7946J9814K1751K4960K9369L3614L6712L8597L8710L5452
$$ 386794 402112 420058 439872 461623 486583 515952 549566 586278 624875 663585 699037
56796F99037K7908J7456O620l105j1418j7598k0221j8891j5385j2114r702o812
$$ 699037 726945 744401 751021 747916 736498 718900 698679 679788 664403 652289 642587 635775
56784F35775k224L592R298J4404J9551K5294L1209L6355M0238M3128M5592M7776
$$ 635775 633551 637143 646441 660845 680396 705690 736899 773254 813492 856620 902212 949988
56772I49988M8928M7470M1682L0698J5138k923k0551l4818m3685m6605m4567l9519
$$ 949988 998916 1046386 1088068 1118766 1133904 1130981 1110430 1075612 1031927 985322 940755 901236
56760I01236l3375k7192k1236j5729j1282q149n396j402M552J1474J7578K1871
$$ 901236 867861 840669 819433 803704 792422 784273 778877 777475 782027 793501 811079 832950
56748H32950K4936K8251L2387L5314L3085K3270P863q099k0781k9647l5559l8613
$$ 832950 857886 886137 918524 953838 986923 1010193 1018056 1009957 989176 959529 923970 885357
56736H85357l8555l6034l2145k7448k2350j7734j4239j1438q683o238m658l484
$$ 885357 846802 810768 778623 751175 728825 711091 696852 685414 676731 670493 665835 662351
56724F62351j635J275M818Q593J2122J4192J3332R095K261n974j4251k1001k5231
$$ 662351 660716 661991 666809 675402 687524 701716 715048 724143 726404 720430 706179 685178 659947
56711F59947k7470k9046l0329l0410k8501k5058k1308j8204j5945j4169j2490
$$ 659947 632477 603431 573102 542692 514191 489133 467825 449621 433676 419507 407017
56700D07017j0952r750q682p414o369o475p603q169o967m659k775k032k312l346
$$ 407017 396065 386315 377633 370219 363850 357375 349772 341603 334636 329977 327202 325170 322858 319512
56686C19512m416m261k517o62l06j077j408r26p18j354k021j708l96J026J402
$$ 319512 315096 310835 308318 307656 307350 306273 304865 303939 303221 301867 299846 298138 297742 298768 300170
56671C00170J74j877l148l045k531k369j916o40M14J82m78k07M58M7j074j136
$$ 300170 300344 298467 295319 292274 289743 287374 285458 284818 285232 285414 284936 284729 285187 285234 284160 283024
56655B83024L2O68j46j266j380m14J247L174M238L233O94j420k232k616l058k730
$$ 283024 283056 283724 283578 282312 280932 280518 281765 284939 289177 292410 293104 291684 289452 286836 283778 281048
56639B81048j462q43k084m041m688l610j884k40J463L216M397M397L229J509J33
$$ 281048 279586 278743 276659 272618 267930 264320 262436 262196 263659 266875 271272 275669 278898 280407 280540
56624B80540j26J000L091N022N354L446N06j254j009j66l12j204j671j439q15
$$ 280540 280414 281414 284505 289527 294881 298327 298833 297579 296570 296404 296092 294888 293217 291778 290963
56609B90963M36K395L940M021L439L643M289L781J928J78o83j129j265m83R84
$$ 290963 291399 293794 297734 301755 305194 308837 313126 316907 318835 319013 318330 317201 315936 315453 316437
56594C16437K008K368K957L875M001K903J652J174J188J176J252J584J992K309
$$ 316437 318445 320813 323770 327645 331646 334549 336201 337375 338563 339739 340991 342575 344567 346876
56580C46876K260J239o84k054j721p53r35j903j800m23N54L24l60j235k774m271
$$ 346876 349136 350375 349691 347637 345916 345163 344228 342325 340525 340102 340656 340980 340620 339385 336611 332340
56564C32340m221k978k503l006k533n36R64P17J9l5m35j845k889k519j903k195
$$ 332340 328119 325141 322638 319632 317099 316563 317527 318244 318263 318228 317793 315948 313059 310540 308637 306442
56548C06442k502j830j044r68m15J756M204M816L652K287J370P18P22J753K915
$$ 306442 303940 302110 301066 300098 299683 301439 305643 310459 314111 316398 317768 318486 319208 320961 323876
56533C23876K985K010P86k91q87m04P27P26j195l309l539j973L4J930L591M160
$$ 323876 326861 328871 329657 329366 328479 328075 328802 329528 328333 325024 321485 319512 319546 321476 325067 329227
56517C29227L117J665J489K635L813M152L595K471J649K124L604M597M740N514
$$ 329227 332344 334009 335498 338133 341946 346098 349693 352164 353813 355937 359541 364138 368878 374392
56503C74392P623R403R248Q051P597Q005Q408Q773R185Q576O209L488K427L026
$$ 374392 382015 391418 400666 408717 416314 424319 432727 441500 450685 459261 465470 468958 471385 474411
56489D74411L731L615K622O75j841l584l803l442l424l102j907j089j791k804
$$ 474411 478142 481757 484379 485054 483213 479629 475826 472384 468960 465858 463951 462862 461071 458267
56475D58267k389j274j521l105m012l359k262j781j896k353k974l142k362j147
$$ 458267 455878 454604 453083 449978 445966 442607 440345 438564 436668 434315 431341 428199 425837 424690
56461D24690l35OM2n08j461j675o90K80K13l14q30k288m789n922l887p65N6j429
$$ 424690 424355 424361 424403 423895 422434 420759 420069 420349 420562 420248 419418 417130 412341 406419 402532 401767 401823 400394
56443D00394k520k232j950k192j794m40O19O43M1j031k585l461k281K59K035K371
$$ 400394 397874 395642 393692 391500 389706 389266 389885 390528 390569 389538 386953 383492 381211 381470 383505 385876
56427C85876K226J792K97j840k985k745k337k222j443K83J752K118J858J469P46
$$ 385876 388102 389894 390191 388351 385366 382621 380284 378062 376619 376902 378654 380772 382630 384099 384845
56412C84845k59r16r90q73q13r28j548k433k318p23O20rj453j162J025K816K922
$$ 384845 384586 383670 382680 381807 380994 380066 378518 376085 373767 373044 373664 373655 372202 371040 372065 374881 377803
56395C77803K202J560R34M50M03O9j426l035k753o68J050J236P06J54n87r95l9
$$ 377803 380005 381565 382499 382949 383352 383421 381995 378960 376207 375539 376589 377825 378531 378685 378098 377103 377064
56378C77064J658K046O22p97p45L22J440K222K179Q90o89r35J26R65J112J570
$$ 377064 378722 380768 381390 380593 379848 380170 381610 383832 386011 386901 386212 385277 385403 386368 387480 389050
56362C89050K599L142K768K146J442L31l27P70K744L219J941J055J331R85q15
$$ 389050 391649 394791 397559 399705 401147 401478 401151 401921 404665 407884 409825 410880 412211 413196 412381
56347D12381k256j981j241j346j376k15J202J451Q14K66j97p22o08N04J638J962
$$ 412381 410125 408144 406903 405557 404181 403966 405168 406619 407433 407699 407502 406780 406172 406676 408314 410276
56331D10276J964K109J801Q06K15P65J531J507J155J224J370J187J342K426L718
$$ 410276 412240 414349 416150 416956 417171 417936 419467 420974 422129 423353 424723 425910 427252 429678 433396
56316D33396M286M272M029L136J361m24j336j579j636j439j158j591k780l347
$$ 433396 437682 441954 445983 449119 450480 450056 448720 447141 445505 444066 442908 441317 438537 435190
56302D35190k174K07K658M644N678M975K885J362J698K743K680J602J000J439
$$ 435190 433016 433223 435881 440525 446203 451178 454063 455425 457123 459866 462546 464148 465148 466587
56288D66587K110K254J824J042L04L14J411K844L337K416R41L53J408L325M357
$$ 466587 468697 470951 472775 473817 474121 474435 475846 478690 482027 484443 485384 485737 487145 490470 494827
56273D94827L685K486K415L479M294M123L355K305R94J29O84K223L060K574K087
$$ 494827 498512 500998 503413 506892 511186 515309 518664 520969 521963 522092 522776 524999 528059 530633 532720
56258E32720K890M528N615N528M722M044L993M260M003L046K331K601L309L768
$$ 532720 535610 540138 545753 551281 556003 560047 564040 568300 572303 575349 577680 580281 583590 587358
56244E87358M427N831P226P668P621P848P668O319N104N890Q144R783J0429J1331
$$ 587358 591785 597616 604842 612510 620131 627979 635647 641966 647070 652960 661104 670887 681316 692647
56230F92647J2561J2948J2625J2930J3855J4156J3970J4665J6088J6767J6894
$$ 692647 705208 718156 730781 743711 757566 771722 785692 800357 816445 833212 850106
56219H50106J8180K0424K1344K0350J9642K0728K2674K4453K6339K8111K8671
$$ 850106 868286 888710 910054 930404 950046 970774 993448 1017901 1044240 1072351 1101022
56208A101022K8415K9411L2263L5278L7570M0425M4695M9344N3551N7874O2482
$$ 1101022 1129437 1158848 1191111 1226389 1263959 1304384 1349079 1398423 1451974 1509848 1572330
56197A572330O6729P1223P7748Q6319R4898J02721J11145J20504J29075J36220
$$ 1572330 1639059 1710282 1788030 1874349 1969247 2071968 2183113 2303617 2432692 2568912
56187B568912J43595J52107J60343J66945J71892J74611J73788J69806J64253
$$ 2568912 2712507 2864614 3024957 3191902 3363794 3538405 3712193 3881999 4046252
56178D046252J56357J43377J25343J05565Q5212O1578L3533M587k1761m6033o9633
$$ 4046252 4202609 4345986 4471329 4576894 4662106 4723684 4757217 4761804 4740043 4694010 4624377
56167D624377r1216j08860j22923j34249j42355j47513j51557j54474j53602j48544
$$ 4624377 4533161 4424301 4301378 4167129 4024774 3877261 3725704 3571230 3417628 3269084
56157C269084j43305j40728j38294j32662j25066j18661j13361j07132j00082
$$ 3269084 3125779 2985051 2846757 2714095 2589029 2470368 2357007 2249875 2149793
56148B149793r3565q7164p9969p3274o8788o5561o1364n5796m9870m4156l9331
$$ 2149793 2056228 1969064 1889095 1815821 1747033 1681472 1620108 1564312 1514442 1470286 1430955
56137A430955l6550l5274l2989k8958k5727k4866k4197k1581j8376j6345j4376
$$ 1430955 1394405 1359131 1326142 1297184 1271457 1246591 1222394 1200813 1182437 1166092 1151716
56126A151716j1368r374j0290j1970j1238q581o516n458m506m166m871m688j817
$$ 1151716 1140348 1130974 1120684 1108714 1097476 1088895 1082379 1076921 1072415 1068249 1063378 1058690 1056873
56113A056873K266N040O462P658Q320Q072Q159R203R716R410J0812J4706J7427
$$ 1056873 1059139 1064179 1070641 1078299 1086619 1094691 1102850 1112053 1121769 1131179 1141991 1156697 1174124
56100A174124J6262J4238J5471J8736K0173J9734K0382K2878K5755K8671L1910
$$ 1174124 1190386 1204624 1220095 1238831 1259004 1278738 1299120 1321998 1347753 1376424 1408334
56089A408334L4331L5523L7865M2890M8173N1681N6220O5102P6266Q5700R4199
$$ 1408334 1442665 1478188 1516053 1558943 1607116 1658797 1715017 1780119 1856385 1942085 2036284
56078B036284J05230J17914J27568J31941J31861J27021J16388J02088Q8079P5586
$$ 2036284 2141514 2259428 2386996 2518937 2650798 2777819 2894207 2996295 3084374 3159960
56068C159960O3885N4375M9139M6415M2033L4754K6194J6708N740m744j1893j6622
$$ 3159960 3223845 3278220 3327359 3373774 3415807 3450561 3476755 3493463 3499203 3494459 3482566 3465944
56056C465944k2711l1817m2959n5826p0665q5768r8576j08359j14843j16135j11554
$$ 3465944 3443233 3411416 3368457 3312631 3241966 3156198 3057622 2949263 2834420 2718285 2606731
56045B606731j04358r7855r0909q1188p0258o1092n3027m4024l5604l0530k7620
$$ 2606731 2502373 2404518 2313609 2232421 2162163 2101071 2048044 2004020 1968416 1937886 1910266
56034A910266k3855j9644j7079j4977j0805n621k135Q2K624M007K626J383L808
$$ 1910266 1886411 1866767 1849688 1834711 1823906 1818285 1816150 1816232 1818856 1822863 1825489 1826872 1830680
56021A830680Q001J0093J1091J4175J7868J8371J6584J6251J7256J7189J7456
$$ 1830680 1838681 1848774 1859865 1874040 1891908 1910279 1926863 1943114 1960370 1977559 1995015
56010A995015K0913K5462K6848K6092K7375L0446L1924L2145L3676L5222L4256
$$ 1995015 2015928 2041390 2068238 2094330 2121705 2152151 2184075 2216220 2249896 2285118 2319374
55999B319374L3405L6538M0748M0287L6458L5294L7353L8333L8030L9777M2483
$$ 2319374 2352779 2389317 2430065 2470352 2506810 2542104 2579457 2617790 2655820 2695597 2738080
55988B738080M2279M0848M3052M7500M8689M7242M8518N2187N3163N2053N4403
$$ 2738080 2780359 2821207 2864259 2911759 2960448 3007690 3056208 3108395 3161558 3213611 3268014
55977C268014O0038O3519O4978O9880P7749Q1899Q1139Q1472Q5269Q8916R1739
$$ 3268014 3328052 3391571 3456549 3526429 3604178 3686077 3767216 3848688 3933957 4022873 4114612
55966D114612R7025J03449J05974J06051J10613J20278J28996J35684J45064J56493
$$ 4114612 4211637 4315086 4421060 4527111 4637724 4758002 4886998 5022682 5167746 5324239
55956E324239J63623J66157J70436J77401J81713J83871J90870K03525K15271
$$ 5324239 5487862 5654019 5824455 6001856 6183569 6367440 6558310 6761835 6977106
55947F977106K25118K39475K59667K80015K99559L23100L49500L72127L91962
$$ 6977106 7202224 7441699 7701366 7981381 8280940 8604040 8953540 9325667 9717629
55938I717629M16712M46120M72492M96691N28513N69905O13123O56444P05426
$$ 9717629 10134341 10580461 11052953 11549644 12078157 12648062 13261185 13917629 14623055
55929A4623055P57398Q02055Q39437Q80317R27509R74659J024089J085731J157034
$$ 14623055 15380453 16182508 17021945 17902262 18829771 19804430 20828519 21914250 23071284
55920B3071284J225004J290081J366146J455407J547253J644326J764243J912175
$$ 23071284 24296288 25586369 26952515 28407922 29955175 31599501 33363744 35275919
55912C5275919K077999K263602K484175K738782L011050L304656L646045M046731
$$ 35275919 37353918 39617520 42101695 44840477 47851527 51156183 54802228 58848959
55904E8848959M497787N007213N604479O301553P090829P987972R029945J0223530
$$ 58848959 63346746 68353959 73958438 80259991 87350820 95338792 104368737 114592267
55896A14592267J1548953J3023293J4702158J6614573J8769338K1225753K4051992
$$ 114592267 126141220 139164513 153866671 170481244 189250582 210476335 234528327
55889B34528327K7190633L0465738L3666409L6295154L7049343L3927205K5512038
$$ 234528327 261718960 292184698 325851107 362146261 399195604 433122809 458634847
55882D58634847J2467085k400225j5763126k5551975l1409782l3976755l4118654
$$ 458634847 471101932 468701707 452938581 427386606 395976824 362000069 327881415
55875C27881415l2648605l0271588k7495289k4612017k1807369j9229169j6947036
$$ 327881415 295232810 264961222 237465933 212853916 191046547 171817378 154870342
55868A54870342j4939563j3169178j1627933j0300475r142655q122072p236979
$$ 154870342 139930779 126761601 115133668 104833193 95690538 87568466 80331487
55861H0331487o477993n810865n212276m685992m229700l819621l441174l103857
$$ 80331487 73853494 68042629 62830353 58144361 53914661 50095040 46653866 43550009
55853D3550009k813200k555930k323799k124918j960446j814728j678734j559996
$$ 43550009 40736809 38180879 35857080 33732162 31771716 29956988 28278254 26718258
55845B6718258j460139j365118j267304j176178j098061j024980r52082q87063
$$ 26718258 25258119 23893001 22625697 21449519 20351458 19326478 18374396 17487333
55837A7487333q33674p83538p32279o86904o49992o12994n72191n35290n05491
$$ 17487333 16653659 15870121 15137842 14450938 13800946 13187952 12615761 12080471 11574980
55828A1574980m74903m40356m10027l87416l63952l34747l07073k85904k65239
$$ 11574980 11100077 10659721 10249694 9862278 9498326 9163579 8856506 8570602 8305363
55819H305363k41548k22530k14513k13140k13602k18231k27011k32245k30008
$$ 8305363 8063815 7841285 7626772 7413632 7200030 6981799 6754788 6522543 6292535
55810F292535k26259k25062k21420k12030k02292j95853j87690j74565j62430
$$ 6292535 6066276 5841214 5619794 5407764 5205472 5009619 4821929 4647364 4484934
55801D484934j56192j51424j43257j34871j30194j26337j19941j13640j10024
$$ 4484934 4328742 4177318 4034061 3899190 3768996 3642659 3522718 3409078 3299054
55792C299054j06321j00673r6591r5883r4381q9659q5815q5603q5215q1808p8731
$$ 3299054 3192733 3092060 2995469 2899586 2805205 2715546 2629731 2544128 2458913 2377105 2298374
55781B298374p8128p5781o8809o1541n8223n6446n3039m9962m9019m7092m1945
$$ 2298374 2220246 2144465 2075656 2014115 1955892 1899446 1846407 1796445 1747426 1700334 1658389
55770A658389l6839l4311l1439k6224k2503k3276k5004k3831k1855k2008k2281
$$ 1658389 1621550 1587239 1555800 1529576 1507073 1483797 1458793 1434962 1413107 1391099 1368818
55759A368818k0433j9153k0943k2709k1041j8410j8610j9986j8471j4133r973
$$ 1368818 1348385 1329232 1308289 1285580 1264539 1246129 1227519 1207533 1189062 1174929 1164956
55748A164956p215n724n935o902n797k472p74k452l939k240M15R88K72k99k083
$$ 1164956 1157741 1152017 1146082 1139180 1133383 1130911 1130137 1127685 1123746 1121506 1121921 1122909 1123181 1122882 1120799
55733A120799n874r207j0458j1733j4661j7330j8270j9000j9893j8258j3732j0624
$$ 1120799 1114925 1105718 1095260 1083527 1068866 1051536 1033266 1014266 994373 976115 962383 951759
55721I51759j1552j3577j4095j5247j8461j9886j6252j0773q269q106o684l537
$$ 951759 940207 926630 912535 897288 878827 858941 842689 831916 823647 815541 808857 805320
55709H05320n24J978L930L716J001j431j924k602m844o129m822l889o032r115
$$ 805320 804796 806774 810704 814420 815421 813990 812066 809464 804620 798491 793669 789780 783748 774633
55695G74633j0329j0877j2437j3076j1125r290j0354j2246j2010j1128j2133j3350
$$ 774633 764304 753427 740990 727914 716789 707499 697145 684899 672889 661761 649628 636278
55683F36278j2043r760r512j0226r111p183p395r080r071o890m633l178k296k801
$$ 636278 624235 614475 604963 594737 585626 578443 571048 561968 552897 546007 541374 538196 535900 533099
55669E33099m885o142m806l017l406m764m675l976m568n154l530j070o34j644
$$ 533099 528214 522072 517266 514249 510843 506079 501404 497428 492860 487706 484176 483106 482472 480828
55655D80828j519m03k45n06Q54L143L675K165P86M17J38k50j59o6q70k153l243
$$ 480828 479309 478906 478661 478155 479009 482152 485827 487992 488778 489195 489333 489083 488924 488858 487988 485835 482592
55638D82592m692o693p750p155o737p779q500p139n106m243l451j240R56J319
$$ 482592 477900 471207 463457 456302 449565 441786 433286 426147 421041 416798 413347 412107 413063 414382
55624D14382J181K501M092L987L265L747M130K432L02O76K742L429K439J662R49
$$ 414382 415563 418064 422156 426143 429408 433155 437285 439717 440019 440695 443437 446866 449305 450967 451916
55609D51916j269m109n077m086l009k089l47J381J406L97J40J42j068k359j470
$$ 451916 450647 446538 441461 437375 434366 432277 431930 433311 434717 435114 435254 435396 434328 431969 430499
55594D30499Q59J992J900K745M527N009L675K197J119o09k920m600n707p162q400
$$ 430499 431358 433350 435250 437995 442522 447531 451206 453403 454522 453913 450993 446393 440686 433524 425124
55579D25124q237p351p035o410m212k230l320o501p917o376m271l068j703J45
$$ 425124 416887 409536 402501 396091 391879 389649 386329 379828 371911 365535 361264 358196 356493 356638
55565C56638Q02m78k174k904k862k387j355k83q0n35p39q36j608k861l913m945
$$ 356638 357440 356962 354788 351884 349022 346635 345280 344997 344917 344382 343643 342807 341199 338338 334425 329480
55549C29480o078o244m902l586l601l669k251m77m9l7J076J820q5l298m438l165
$$ 329480 323402 317158 312256 308670 305069 301400 299149 298672 298623 298586 299662 301482 301397 298099 293661 290496
55533B90496j986j766j235l26k53n62J97J226N72q83l40K152L608K900J977K118
$$ 290496 288510 286744 285509 285183 284930 284368 284565 285791 286363 285480 285140 287292 290900 293800 295777 297895
55517B97895K562L091M472O005N998N061N508P338Q193P651P807R071R102O904
$$ 297895 300457 303548 308020 314025 320023 325084 330592 337930 346123 353774 361581 370652 379754 386658
55503C86658M465L164J720r15l536m850n306n657n929o496p909r200q633o558
$$ 386658 391123 394287 396007 395092 391556 386706 381400 375743 369814 363318 355409 346209 337576 331018
55489C31018n176n252n462n046m439l382j271N23n0j969j984M47K407K169J070
$$ 331018 325842 320590 315128 310082 305643 302261 300990 301513 301463 299494 297510 297957 300364 302533 303603
55474C03603J00j626l873m381k567r08j056j525q34j3l04j087j791l182n041n211
$$ 303603 303703 302077 298204 293823 291256 290348 289292 287767 286933 286920 286616 285529 283738 280556 275515 270304
55458B70304k946q40j345l351m227l505k654k626l407m675n570m965l060j471
$$ 270304 267358 266518 265173 261822 257595 254090 251436 248810 245403 240728 235158 230193 227133 225662
55444B25662r70o28J72O11J18n89r48j292j443m90J275K091J252mp13j325j893
$$ 225662 224692 224064 224236 224847 224965 224376 223428 222136 220693 220203 221478 223569 224821 224817 224104 222779 220886
55427B20886j410R4J046R17J168K451L096J733n27j918k152j567j15J442J308
$$ 220886 219476 219570 220616 221533 222701 225152 228248 229981 229454 227536 225384 223817 223702 225144 226452
55412B26452q10k595k152n79p8r39j966k564k792k480j629q91n14K39J657K590
$$ 226452 225642 223047 220895 220316 220238 219299 217333 214769 211977 209497 207868 206977 206463 206702 208359 210949
55396B10949J884j6j735k404j922p18K17N5p15r22n64p60j652j899p26J010K207
$$ 210949 212833 212817 211082 208678 206756 206038 206255 206310 205595 204673 204109 203349 201697 199798 199072 200082 202289
55379B02289K699K638J863M02j374l104m150l521j296O17P54K61R00K012J852
$$ 202289 204988 207626 209489 209891 208517 205413 201263 197742 196446 197063 197817 198078 198978 200990 202842
55364B02842Q53O48P54m01j811j024J345K169J005N35J447J291m89j049O72J670
$$ 202842 203695 204343 205097 204696 202885 201861 203206 205375 206380 206915 208362 209653 209164 208115 208787 210457
55348B10457j9j986j717m88k08Q1J513K331Q34j191j242o6K16j41K92R99O69j35
$$ 210457 210438 208452 206735 206247 206039 206120 207633 209964 210798 209607 208365 208299 208515 208374 208666 209665 210334 210199
55330B10199k14k36j372k836l206k754k218r28J358K607J253p71o51J099J917
$$ 210199 209985 209749 208377 205541 202335 199581 197363 196435 197793 200400 201653 200882 200231 201330 203247
55315B03247J392J104J199L68j185j673o66L74N15K86J84q6p82j860l171m041
$$ 203247 204639 205743 206942 207310 206125 204452 203786 204160 204675 204961 205145 205059 204277 202417 199246 195205
55299A95205l352j074J267K526L094L230K202L22l00J106K232J177m39l24N56
$$ 195205 191853 190779 192046 194572 197666 200896 203098 203420 203120 204226 206458 207635 207196 206872 207428
55284B07428n6j543j556j93M03l4K82J603K012O93p87r83k72L43L83k95j429k091
$$ 207428 207372 205829 204273 204080 204483 204449 204731 206334 208346 209039 208252 207269 206997 207340 207723 207428 205999 203908
55266B03908j702q44m0J181K697K691J88k623l014j583q93j163l51J806L008K015
$$ 203908 202206 201362 201322 202503 205200 207891 208079 205456 202442 200859 199966 198803 198452 200258 203266 205281
55250B05281L60l03l80r48j882k273j590pJ687K422J893R61L60k19q94p24O02
$$ 205281 205641 205338 204958 204010 202128 199855 198265 198258 199945 202367 204260 205221 205581 205362 204468 203744 204346
55233B04346J448K83j898l037k806k132j139K19O02j045l005k626j53J786K095
$$ 204346 205794 206077 204179 201142 198336 196204 195065 195284 195886 194841 191836 189210 189057 190843 192938
55218A92938K004K185J792N83m15p13p36m12O00J399Q21j46O05K809L826K535
$$ 192938 194942 197127 198919 199502 199087 198374 197638 197226 197826 199225 200046 199900 200505 203314 207140 209675
55202B09675P43J74L46K40m4k20o67j435j858j638j047K3J719K916K120j43j763
$$ 209675 210418 210592 210938 211178 211134 210914 210247 208812 206954 205316 204269 204292 206011 208927 211047 210904 209141
55185B09141k034k258l139l723l374k736k017m64J762L073K758J946J399K86j814
$$ 209141 207107 204849 201710 197987 194613 191877 189860 189396 191158 194231 196989 198935 200334 200620 198806
55170A98806l377k865r24O27R95O17L6l79l09J63N81P50P39K51r49k048j872o54
$$ 198806 195429 192564 191640 192267 193262 193879 193915 193536 193227 193390 193971 194721 195460 195711 194762 192714 190842 190188
55152A90188K26M36R90K113K447J135p81j790j606p55L36J139R32l25j710k342
$$ 190188 190414 190850 191840 193953 196400 197535 196754 194964 193358 192603 192939 194078 195010 194685 192975 190633
55136A90633k021q29R26K289K310J319N70N29O28N48M57L5j175k420k277o87R43
$$ 190633 188612 187783 188709 190998 193308 194627 195197 195726 196354 196902 197359 197394 196219 193799 191522 190835 191778
55119A91778J785K132J996J021l7K16J454J781P11j60m6j86j116j094J066L537
$$ 191778 193563 195695 197691 198712 198675 198891 200345 202126 202837 202677 202631 202445 201329 200235 201301 204838
55103B04838L793J984K27m28n75p74r06q25m83K06R03R14L35J35M28l6j717k942
$$ 204838 208631 210615 210842 210414 209839 209065 208159 207334 206851 207057 207960 208874 209209 209344 209772 209736 208019 205077
55085B05077k134k79M89qo8J028J932J266n04j739j508l78M19L19j83n04q32j506
$$ 205077 202943 202664 203153 203145 203077 204105 206037 207303 206799 205060 203552 203174 203593 203912 203729 203225 202393 200887
55067B00887k008j547m56J45k8l71q22j826k753k174k00J246J286J313K320K940
$$ 200887 198879 197332 196876 197021 196993 196622 195800 193974 191221 189047 188847 190093 191379 192692 195012 197952
55051A97952J754lj03J431K663K682K228J732P83l30l80Q79J856J018j036k174
$$ 197952 199706 199703 199600 201031 203694 206376 208604 210336 211119 210789 210409 211288 213144 214162 213126 210952
55035B10952j167R49K053J268k46q57l59K99N74O45M98%q8J183K937K912O36j434
$$ 210952 209785 210734 212787 214055 213809 212952 212593 212892 213466 214111 214609 214609 214521 215704 218641 221553 222189 220755
55017B20755j103P22J751J480R50M27n77j515j193O7M75n56j362l23J910L312
$$ 220755 219652 220374 222125 223605 224555 224982 224405 222890 221697 221764 222239 221683 220321 219998 221908 225220
55001B25220K810J060o72j677k016k005j803j471j278j480j722j168M29K137K737
$$ 225220 228030 229090 228418 226741 224725 222720 220917 219446 218168 216688 214966 213798 214227 216364 219101
54986B19101J909L23j044j442p86M7j08j202j757p63Q34J390P80K45K79Lj087
$$ 219101 221010 221333 220289 218847 218061 218108 218000 216798 215041 214278 215112 216502 217282 217527 217806 217809 216722
54969B16722j932j249N20J586J053l6j74O19Q99j87j732k162j085M64J346J276
$$ 216722 214790 213541 214061 215647 216700 216664 216490 217109 218008 217821 216089 213927 212842 213306 214652 215928
54953B15928O63j0n23r55j401j582j065j27K22l60p55J06J506J842R64K29K65
$$ 215928 216591 216581 216058 215103 213702 212120 211055 210928 211150 210790 210035 210141 211647 213489 214453 214682 214947
54936B14947K15m65q90j49J224K014J837J175O12N76J242K076K038P80q06j568
$$ 214947 215162 214697 213807 213658 214882 216896 218733 219908 220520 221096 222338 224414 226452 227232 226426 224858
54920B24858j146K06K034L510L599K183L81p28j234j704j978j426j08J082J427
$$ 224858 223712 223918 225952 229462 233061 235244 235625 234897 233663 231959 229981 228555 228447 229529 230956
54905B30956J146R98J323J541Q19o47j492p97N93J197Q59N08K83p05k444l318
$$ 230956 232102 233100 234423 235964 236783 236136 234644 233847 234440 235637 236496 237004 237287 236582 234138 230820
54889B30820k001Q35L239L820K589P86N2R34K029J598J3o27N35K089K690K733
$$ 230820 228819 229654 232893 236713 239302 240088 240140 241074 243103 244701 244714 244087 244622 246711 249401 252134
54873B52134K897K615J291j80m17P66K644M623N945N588L762K632L970O732Q422
$$ 252134 255031 257646 258937 258757 258340 259106 261750 266373 272318 277906 281668 284300 288270 295002 303424
54858C03424Q361Q041Q468Q789P823N649L214J113p74k850n228p469q960r560
$$ 303424 311785 319826 328294 337083 344906 350555 353769 354882 354108 351258 346030 338561 329601 320041
54844C20041r518q779p152n303m480m721m424k633p58p60k326l266k410p75K18
$$ 320041 310523 301744 294592 289289 284809 280088 275664 273031 272273 271513 269187 265921 263511 262736 262954
54829B62954M87Q84J802K712K888K435K381L471M967N422M694M257N160O745P880
$$ 262954 263441 264325 266127 268839 271727 274162 276543 280014 284981 290403 295097 299354 304514 311259 319139
54814C19139Q381Q370P374N219K912J412K11j603l551m427m285m267m742n122
$$ 319139 327520 335890 343264 348483 351395 352807 353018 351415 347864 343437 339152 334885 330143 325021
54800C25021n367o152p265p362n811l775k822l237m188m947n372n558n432m765
$$ 325021 319654 313502 306237 298875 293064 289289 286467 283230 279042 274095 268723 263165 257733 252968
54786B52968l586k552k495l291l722k944j611q32o06j69N01O60J02n38q56j007
$$ 252968 249382 246830 244335 241044 237322 234378 232767 231935 231329 231160 231661 232321 232423 231885 231029 230022
54770B30022q58L0J279J434l23k775l691k153O01K536K712J775Q65M24K22J61
$$ 230022 229164 229194 230473 231907 231584 228809 225118 222965 223566 226102 228814 230589 231454 231878 232100 232261
54754B32261M56R86J169P14rp40j743l028l632k483K03K955M351L955K357P58
$$ 232261 232717 233703 234872 235586 235577 234837 233094 230066 226434 223951 224154 227109 231460 235415 237772 238530
54738B38530J04J97m1r66j473o08P10P18o18j263K50K836M151L350J742Q87Q44
$$ 238530 238634 238831 238790 237824 236351 235743 236453 237171 236553 235290 235540 238376 242527 245877 247619 248506 249350
54721B49350O89K60M95J805K996K658J261P70K103L990M774M531M643N817P384
$$ 249350 250039 250299 250794 252599 255595 258253 259514 260284 262387 266377 271151 275682 280325 286142 293526
54706B93526Q396Q755Q992R253Q916P450N447M099L447K062q27l785m885m325
$$ 293526 301922 310677 319669 328922 337838 345288 350735 354834 358281 360343 359516 355731 350846 346521
54692C46521l928m484n277n979p011p859p153n065l675m012m536l688k275j861
$$ 346521 342593 338109 332832 326853 319842 311983 304830 299765 296090 292078 287542 283854 281579 279718
54678B79718k235k052r70L01J258J708J441Q58J031K125K849K474K170L058M353
$$ 279718 277483 275431 274461 274762 276020 277728 279169 280027 281058 283183 286032 288506 290676 293734 298087
54663B98087M918N218N967O137M595K672K647M160M690L298J483J10j944n207
$$ 298087 303005 308223 314190 320327 324922 327594 330241 334401 339091 342389 343872 343982 342038 336831
54649C36831p841p801n553l467l160m244n258n251m485l742l115j996m59L20m04
$$ 336831 328990 321189 315636 312169 309009 304765 299507 294256 289771 286029 282914 280918 280459 280779 280375
54634B80375j865l063m057n051n295m252k857k173j740q43l19j162k271j899o51
$$ 280375 278510 275447 271390 266339 261044 256792 253935 251762 250022 249179 248860 247698 245427 243528 242877
54619B42877m86j178o21J322K257J220L37J237K381J740J92O4J443K063N05k122
$$ 242877 242391 241213 240592 241914 244171 245391 245728 246965 249346 251086 251278 251342 252785 254848 255353 253231
54603B53231l820l922l389l252l218k153q4J168K48j559j793p1J697K195K008
$$ 253231 249411 245489 242100 238848 235630 233477 233393 234561 234809 233250 231457 231386 233083 235278 237286
54588B37286J833J325M21J33J024K111K214J422N04j64l71R2O54J03j545k334
$$ 237286 239119 240444 240865 240998 242022 244133 246347 247769 248273 248109 247738 247830 248484 248587 247042 244708
54572B44708o58K363L873K335j167m228n114l753j426M55J410J625J063k94j549
$$ 244708 244050 246413 250286 252621 251454 247226 242112 238359 236933 237388 238798 240423 241486 241192 239643
54557B39643j412N8J329J402R16P50O83K44j06L54J332J948J996J975K056J874
$$ 239643 238231 238289 239618 241020 241936 242686 243369 243613 243507 243861 245193 247141 249137 251112 253168 255042
54541B55042J253N51J88K11K93N1n66j187j424j321j112p07J67J341K170K204
$$ 255042 256295 256846 257034 257245 257538 257589 257023 255836 254412 253091 251979 251272 251439 252780 254950 257154
54525B57154J451J17j524l005l809l625k338k02J704J949M51r49n06J330K834
$$ 257154 258605 258722 257198 254193 250384 246759 244421 244219 245923 247872 248323 247374 246868 248198 251032
54510B51032L398L618L470K122k07j808j509j33P40O40L43O94J706K535K286J133
$$ 251032 254430 258048 261518 263640 263433 261625 260116 259983 260723 261363 261706 262400 264106 266641 268927 270060
54494B70060K49K79M28k13j162j409j060q52n85M18J677J975J310R42J534K594
$$ 270060 270309 270588 271016 270803 269641 268232 267172 266320 265735 266153 267830 269805 271115 272057 273591 276185
54478B76185L547L987L179R38j297j948j636k127l250l122j442r0l5r4N12P76
$$ 276185 279732 283719 286898 287836 286539 284591 282955 280828 277578 274456 273014 272924 272889 272795 273307 274083
54462B74083J08l24K77Q05J53j051j821k347k855k565j090M27R09P63O84L86k38
$$ 274083 274191 273867 274144 274949 275102 274051 272230 269883 267028 264463 263373 263800 264709 265472 266156 266542 266304
54445B66304j72J186K715L104K567J910J094n0p99m80M03J042J337J336Q57M57
$$ 266304 266132 267318 270033 273137 275704 277614 278708 278658 277859 277379 277782 278824 280161 281497 282354 282811
54429B82811J160K431K204P1j534q56M75K39p64k68J638K837K479J567Q02J01
$$ 282811 283971 286402 288606 288677 287143 286287 286762 287001 286237 285969 287607 290444 292923 294490 295292 295393
54413B95393r6Q58K306K850K323J767J700J854K107K299J750L37n82M6J147J205
$$ 295393 295297 296155 298461 301311 303634 305401 307101 308955 311062 313361 315111 315448 314866 314912 316059 317264
54397C17264Q46J542K470J375j595l582k973j267l14O6O86J120O02n44j582k599
$$ 317264 318110 319652 322122 323497 321902 318320 315347 314080 313766 313832 314518 315638 316240 315696 314114 311515
54381C11515l868m665l841j475Q18J411M08l17R19L402M426K339j409l945m067
$$ 311515 307647 302982 299141 297666 298484 299895 300303 299986 300905 304307 308733 311072 309663 305718 301651
54366C01651k790j461n46n1M7J7J92N87J049J433J254Nj557j514O42K633K069
$$ 301651 298861 297400 296854 296803 296850 296867 297059 297646 298695 300128 301382 301387 299830 298316 298958 301591 303660
54349C03660k57j538q33K48M68M65R55J402J224R22J182J802K131J906J201K82
$$ 303660 303403 301865 301032 301280 301748 302213 303168 304570 305794 306716 307898 309700 311831 313737 314938 315220
54333C15220l20k41J66L67N51J129J611J087k11j045r05m68k89j99k23p40j368
$$ 315220 314900 314659 314825 315192 315743 316872 318483 319570 319359 318314 317409 316941 316652 316453 316230 315490 314122
54316C14122q70J132L223L639K132K1j081l47J824M107N383N713N850N980N630
$$ 314122 313252 314384 317607 321246 323378 323399 322318 321971 323795 327902 333285 338998 344848 350828 356458
54301C56458M717L814L223K481J053r93l048m344m399l583l062l659m928n794
$$ 356458 361175 364989 368212 370693 371746 370753 367705 363361 358962 355379 352317 348658 343730 337936
54287C37936n648m420k271l3P27p62l249m733m571l472k117r26n66j150j428l39
$$ 337936 332288 327868 325597 325564 326291 325529 322280 317547 312976 309504 307387 306461 305895 304745 303317 302978
54271C02978J029P25r92j778m97J474K554K670K133N88j748l255k496j6K212K626
$$ 302978 304007 304732 303740 301962 301465 302939 305493 308163 310296 310884 309136 305881 303385 303369 305581 308207
54255C08207J131r39j681l85J343J301m20j560r63j31p00j919j896m30P87M16
$$ 308207 309338 308399 306718 306333 307676 308977 308557 306997 306034 305903 305203 303284 301388 300958 301745 302161
54239C02161j066k136j868q00k98r37j709j325M3J161J482J407J020l1j292j689
$$ 302161 301095 298959 297091 296291 295993 295056 293347 292022 292065 293226 294708 296115 297135 297104 295812 294123
54223B94123j261j209j724j321Q05L179L855K700R07o32j447j008M92J640J252
$$ 294123 292862 291653 289929 288608 289413 292592 296447 299147 300054 299422 297975 296967 297459 299099 300351
54208C00351j43j293j967k563k602j067J837M504N597N110L713K020O01j48m09
$$ 300351 300208 298915 296948 294385 291783 290716 292553 297057 302654 307764 311477 313497 314098 313950 313541
54193C13541p22j132j080k73P56J246R58Q0j215k626l304k391l03J108N76p67
$$ 313541 312819 311687 310607 310334 311090 312336 313294 313374 312159 309533 306229 303838 303535 304643 305219 304452
54177C04452o73R73J716Mk296k324j85J401R75k1L44K178M294N492M776J768k216
$$ 304452 303779 304752 306468 306472 304176 301852 301667 303068 304043 304022 304366 306544 310838 316330 321106 322874 320658
54160C20658m609m120k109p99r59j805k373k176j256k27J66n5k37k25m68q21m51
$$ 320658 316049 311929 309820 309021 308062 306257 303884 301708 300452 300225 300391 300336 300099 299874 299406 298585 298134
54143B98134O53J327R96M56K36l58j533j912o53O82K49j088j050L59Q67l74j365
$$ 298134 298787 300114 301110 301566 301802 301444 299911 297999 297346 298028 298277 297189 296139 296498 297365 296991 295626
54126B95626l71J529K142J128Qk6Q96K031K727K597J849J315J512J801J143l25
$$ 295626 295255 296784 298926 300054 300062 300036 300932 302963 305690 308287 310136 311451 312963 314764 315907 315582
54110C15582j302j004j27K85J67K2k25j023k093k530k120j626j552j545j319j107
$$ 315582 314280 313276 313149 313434 313601 313623 313398 312375 310282 307752 305632 304006 302454 300909 299590 298483
54094B98483q01K51J708J861J3j896j778n83q46k429k337O92L859L910J360o29
$$ 298483 297682 297933 299641 301502 301515 299619 297841 297258 296412 293983 291646 292338 296197 300107 301467 300838
54078C00838l78R75J697J282J20j271k211j959m18J539K757K822K347K209K561
$$ 300838 300460 301435 303132 304414 304534 303263 301052 299093 298675 300214 302971 305793 308140 310349 312910
54063C12910K727K213J504J381J741J671O59q66k106k443j579J62J651J823Q38
$$ 312910 315637 317850 319354 320735 322476 324147 324806 323940 321834 319391 317812 317974 319625 321448 322286
54048C22286j38j56J008L077N116N690M418L052L598N527O433N356L668K392Q53
$$ 322286 322148 321992 323000 326077 331193 336883 341301 344353 347951 353478 359911 365267 368935 371327 372180
54033C72180j314k889l094l036l633l682j814P70J585K69j202j285k30J138K345
$$ 372180 370866 367977 364883 361847 358214 354532 352718 353488 355073 355342 354140 352855 352625 353763 356108
54018C56108K865K280J159O76J073J436J213J016J499K216K114P95j100k508k838
$$ 356108 358973 361253 362412 363088 364161 365597 366810 367826 369325 371541 373655 374450 373350 370842 368004
54003C68004k285j377k70J155K568L154K633J717J199J110J184J618K620L697
$$ 368004 365719 364342 364072 365227 367795 370949 373582 375299 376498 377608 378792 380410 383030 386727
53989C86727M096L779L376L330L578L800L667L132K905M111O800R281R788Q658
$$ 386727 390823 394602 397978 401308 404886 408686 412353 415485 418390 422501 429301 438582 448370 457028
53975D57028Q055R455J2008J3600J3119J1438J0339J0601J1193J0556Q550O686
$$ 457028 465083 474538 486546 500146 513265 524703 535042 545643 556836 567392 575942 582628
53963E82628O246O692O388M644K445J179J120J387J206P61N09J0j828n147q460
$$ 582628 588874 595566 601954 606598 609043 610222 611342 612729 613935 614696 615205 615215 613387 608240 599780
53948E99780j0194j0346j0019r858r740r548r268q678p826p409p702p653o292
$$ 599780 589586 579240 569221 559363 549623 540075 530807 522129 514303 506894 499192 491539 485247
53935D85247m540m068m699m685l447k259k042k368k873l820m766m581l392k699
$$ 485247 480707 476639 471940 467255 463808 461549 459507 457139 454266 450446 445680 441099 437707 435008
53921D35008k922k697j336K4N28R39J816K424K537L233M614N006L920L455M849
$$ 435008 432086 429389 428053 428077 428605 429544 431360 433784 436321 439554 444168 449174 453094 456549 461398
53906D61398O103N539N273P951J1864J2998J0846Q382O809M291K45k882l361k710
$$ 461398 467501 473040 478313 486264 498128 511126 521972 530354 537163 541454 541699 538817 535456 532746
53892E32746l048m181m856m942m781l795j369J829M485N912N909M375K065R14
$$ 532746 529698 525517 520661 515719 510938 507143 505774 507603 512088 518000 523909 528284 530349 531263
53878E31263K366N507P780P644O059N240O194P857Q682Q575Q569Q834Q306O587
$$ 531263 533629 539136 546916 554560 560619 565859 572053 579910 588592 597167 605736 614570 622876 629463
53864F29463M960M708N540O604P932R733J1312J2077J2681J3829J4766J4459J3469
$$ 629463 634423 639131 644671 651275 659207 668940 680252 692329 705010 718839 733605 748064 761533
53851G61533J3061J3185J3011J2693J2765J2456J0638Q023O294N320L466N29j923
$$ 761533 774594 787779 800790 813483 826248 838704 849342 857365 863659 868979 872445 872974 871051
53838H71051l271m638o492p691p594p222p549q308r237j0826j3059j4790j5298
$$ 871051 867780 863142 856650 848959 841365 834143 826594 818286 809049 798223 785164 770374 755076
53825G55076j5162j4936j4231j2785j1298j0455j0078r822r780r957j0036r949
$$ 755076 739914 724978 710747 697962 686664 676209 666131 656309 646529 636572 626536 616587
53813F16587r835r522r036r238j0575j1654j0842q907p927p833o759m935m970
$$ 616587 606752 597230 588194 578956 568381 556727 545885 536978 529051 521218 514459 509524 504554
53800E04554p305q665o821m116l849n445n955m643l167k324j369j77M36M59O06
$$ 504554 497249 488584 481763 477647 473798 468353 462398 457755 454588 452264 450895 450718 451154 451613 452219
53785D52219N33q56l221m644m147k828k131k217k479k577k445k017j375p06K2
$$ 452219 452752 451896 448675 444031 439884 437056 434925 432708 430229 427652 425207 423190 421815 421109 421131
53770D21131R01J558J401M48m30k81J056K790L722L231J863P21K58J75M47J544
$$ 421131 422032 423590 424991 425439 425009 424728 425784 428574 432296 435527 437390 438111 438369 438544 438991 440535
53754D40535L336M701M775L951L148K829L152M280N809O674O399N844O113P231
$$ 440535 443871 448572 453347 457298 460446 463275 466427 470707 476516 483190 489589 495433 501546 508777
53740E08777Q490R374R608R104Q565R296J1478J3331J3000J0655P867N684M330
$$ 508777 517267 526641 536249 545353 553918 563214 574692 588023 601023 611678 619545 625229 629559
53727F29559L974M442M663L757K298J288K77j893m742o367o296o348p862r503
$$ 629559 633533 637975 642638 646395 648693 649981 650258 648365 643623 637256 630960 624612 616750 607247
53713F07247r091o803n121n820q054r691r706q843q279q236q017p013n440m218
$$ 607247 598156 591353 586232 580412 572358 562667 552961 544118 535839 527603 519586 512573 507133 502915
53699E02915m283n763p550q051o811n174m653m935m423k637j027r46j889k399
$$ 502915 498632 492869 485319 477268 470457 465283 460630 455695 451272 448635 447608 446662 444773 442374
53685D42374j901q73J61R92J380J096J88j167k778m089m246k991j108L54R32O51
$$ 442374 440473 439600 439761 440753 442133 443229 443417 442250 439472 435383 431137 428146 427038 427392 428324 428975
53669D28975j94q58n27N94J405J599K183L548M237K928P90J64J389K590K584K259
$$ 428975 428781 427923 427396 427990 429395 430994 433177 436725 440962 443890 444680 444844 446233 448823 451407 453666
53653D53666K661L259L082K484K680L906N003M855L696K740K762L277L297K665
$$ 453666 456327 459586 462668 465152 467832 471738 476741 481596 485292 488032 490794 494071 497368 500033
53639E00033K248K771L983N200O032O150N109L173J832K360M031M847M092L087
$$ 500033 502281 505052 509035 514235 520267 526417 531526 534699 536531 538891 542922 547769 551861 554948
53625E54948L053L363K684J165K45N39R67M07o52r09k62p2j261l056m048l794
$$ 554948 558001 561364 564048 565213 565458 565997 566964 567371 566719 565810 565548 565476 564215 561159 557111 553317
53609E53317k722j058J056K751K944J866J025J293J910J776R49K61J77N81J105
$$ 553317 550595 549537 550593 553344 556288 558154 559179 560472 562382 564158 565107 565368 565545 566126 567231
53594E67231J256O33m80j342j806k455l183k668j33L105M862M575L652L568M446
$$ 567231 568487 569120 568640 567298 565492 563037 559854 557186 557053 560158 565020 569595 573247 576815 581261
53579E81261N364N301L813J409o11j140k9K086M255N338M550K616J727L360O455
$$ 581261 586625 591926 595739 597148 596537 595397 595368 597454 601709 607047 611597 614213 615940 619300 625755
53564F25755Q599Q688P580O534O076O197O540O329N163L952M054N324O141N694
$$ 625755 634354 643042 650622 657156 663232 669429 675969 682298 687461 691413 695467 700791 706932 712626
53550G12626N129N679O722O739N570M493M225M129L593L110L306L782L805L687
$$ 712626 717755 723434 730156 736895 742465 746958 751183 755312 758905 762015 765321 769103 772908 776595
53536G76595M248N050M577K600J059J517K793K543N63j131j358j159j686k487
$$ 776595 780843 785893 790470 793070 794129 795646 798439 800982 801545 800414 799056 797897 796211 793724
53522G93724k692k580k785l004k731k485k987l628l137j600n86j072k350l210
$$ 793724 791032 788452 785667 782663 779932 777447 774460 770832 767695 766095 765509 764437 762087 758877
53508G58877l327l052k591j938j245p58n40n64r66j758k361j839jJ989K704K206
$$ 758877 755550 752498 749907 747969 746724 745966 745426 744862 743896 742138 739777 737938 737937 739926 742630 744836
53492G44836J983K907M093M436M307M588M800L822K232K008L676N485O017N939
$$ 744836 746819 749726 753819 758255 762562 767150 771950 775772 778004 780012 783688 789173 795190 801129
53478H01129O268O559O187O036P417J0044J2522J4337J5936J7340J8012J8011
$$ 801129 807397 813956 820143 826179 833596 843640 856162 870499 886435 903775 921787 939798
53466I39798J8120J8805J9893K1149K2496K3817K5102K6572K8197K9514L0408
$$ 939798 957918 976723 996616 1017765 1040261 1064078 1089180 1115752 1143949 1173463 1203871
53455A203871L1404L2624L3265L2948L2728L3771L5715L7431L8764M0250M1676
$$ 1203871 1235275 1267899 1301164 1334112 1366840 1400611 1436326 1473757 1512521 1552771 1594447
53444A594447M2329M2403M2853M3929M4935M5307M4864M3273M0473L7616L6298
$$ 1594447 1636776 1679179 1722032 1765961 1810896 1856203 1901067 1944340 1984813 2022429 2058727
53433B058727L6660L7217L6713L5260L3624L2372L1861L2209L2910L3151L2706
$$ 2058727 2095387 2132604 2169317 2204577 2238201 2270573 2302434 2334643 2367553 2400704 2433410
53422B433410L1967L1183L0229K9138K8242K7656K7049K5817K3326J9373J4818
$$ 2433410 2465377 2496560 2526789 2555927 2584169 2611825 2638874 2664691 2688017 2707390 2722208
53411B722208J1099Q601O215L036l31l074n635q721j1729j3759j5454j8059k1090
$$ 2722208 2733307 2741908 2748123 2751159 2750828 2747754 2742119 2733398 2721669 2707910 2692456 2674397 2653307
53398B653307k2890k3446k4645k7461l0645l2732l3767l4334l4330l3573l2578
$$ 2653307 2630417 2606971 2582326 2554865 2524220 2491488 2457721 2423387 2389057 2355484 2322906
53387B322906l1907l1496l1187l1125l1095l0231k7991k4927k1996j9559j7391
$$ 2322906 2290999 2259503 2228316 2197191 2166096 2135865 2107874 2082947 2060951 2041392 2024001
53376B024001j5209j2852j0304p775n527l708k412j460N4L269P965J2284J5026
$$ 2024001 2008792 1995940 1985636 1977861 1972334 1968626 1966214 1964754 1964808 1968077 1976042 1988326 2003352
53363B003352J7217K0225K3285K4735K4982K6167K9053L2392L5488L9088M3278
$$ 2003352 2020569 2040794 2064079 2088814 2113796 2139963 2169016 2201408 2236896 2275984 2319262
53352B319262M6558M8084M9026N0698N2880N4997N7450O0545O3380O5132O6652
$$ 2319262 2365820 2413904 2462930 2513628 2566508 2621505 2678955 2739500 2802880 2868012 2934664
53341B934664O9420P3550P7800Q1166Q3611Q5651Q7809R0104R1793R2252R2225
$$ 2934664 3004084 3077634 3155434 3236600 3320211 3405862 3493671 3583775 3675568 3767820 3860045
53330C860045R3198R5109R6002R4610R2098R0205Q8726Q6106Q1899P7379P3795
$$ 3860045 3953243 4048352 4144354 4238964 4331062 4421267 4509993 4596099 4677998 4755377 4829172
53319D829172P0903O7349O2118N5662M9558M4568L9388L2284K3885J6789J1935
$$ 4829172 4900075 4967424 5029542 5085204 5134762 5179330 5218718 5251002 5274887 5291676 5303611
53308E303611O917j189j2585k5318l7737m8949n7979o4354o9328p4904q1469q7342
$$ 5303611 5310528 5309339 5296754 5271436 5233699 5184750 5126771 5062417 4993089 4918185 4836716 4749374
53296D749374r0761r1589r1119r0875r1512r2263r1560q8772q5137q2531q1578
$$ 4749374 4658613 4567024 4475905 4385030 4293518 4201255 4109695 4020923 3935786 3853255 3771677
53285C771677q1489q1385q1023q0385p9316p7728p5701p3257p0220o6441o2114
$$ 3771677 3690188 3608803 3527780 3447395 3368079 3290351 3214650 3141393 3071173 3004732 2942618
53274B942618n7896n4525n2033m9452m5727m0912l6089l2271k9788k8464k7643
$$ 2942618 2884722 2830197 2778164 2728712 2682985 2642073 2605984 2573713 2543925 2515461 2487818
53263B487818k6371k4375k2710k2387k2690k2022k0259j8664j7515j5571j2343
$$ 2487818 2461447 2437072 2414362 2391975 2369285 2347263 2327004 2308340 2290825 2275254 2262911
53252B262911r085o729m565j945K75J286K003L824O782J0130J3613J6881J8764
$$ 2262911 2253826 2247097 2242532 2240587 2240862 2242148 2244151 2247975 2254757 2264887 2278500 2295381 2314145
53239B314145J8823J8785K0763K4563K8300L1052L3344L5419L6750L7303L7813
$$ 2314145 2332968 2351753 2372516 2397079 2425379 2456431 2489775 2525194 2561944 2599247 2637060
53228B637060L8606L9285L9582L9526L8795L6920L4106L0942K7472K3469J9350
$$ 2637060 2675666 2714951 2754533 2794059 2832854 2869774 2903880 2934822 2962294 2985763 3005113
53217C005113J5785J2548Q898M951J557j242m421q528j3073j7498k1894k6442
$$ 3005113 3020898 3033446 3042344 3047295 3048852 3047610 3043189 3034661 3021588 3004090 2982196 2955754
53205B955754l0935l5093l8740m1564m3409m4860m6840m9498n2051n3793n4699
$$ 2955754 2924819 2889726 2850986 2809422 2766013 2721153 2674313 2624815 2572764 2518971 2464272
53194B464272n5014n4794n4017n2834n1703n1336n2002n2681n1658m8614m5389
$$ 2464272 2409258 2354464 2300447 2247613 2195910 2144574 2092572 2039891 1988233 1939619 1894230
53183A894230m3874m3945m4350m4794m5609m6083m4962m2542m0504l9440l8152
$$ 1894230 1850356 1806411 1762061 1717267 1671658 1625575 1580613 1538071 1497567 1458127 1419975
53172A419975l5778l3071l0922k9045k6973k5076k3608k1797j9091j6599j5978
$$ 1419975 1384197 1351126 1320204 1291159 1264186 1239110 1215502 1193705 1174614 1158015 1142037
53161A142037j7238j8714j9204j9164j9697k0999k2271k2783k2644k2370k1898
$$ 1142037 1124799 1106085 1086881 1067717 1048020 1027021 1004750 981967 959323 936953 915055
53150I15055k0488j7947j5548j4870j5715j6032j4398j1888j0798j1967j4078
$$ 915055 894567 876620 861072 846202 830487 814455 800057 788169 777371 765404 751326
53139G51326j5351j5154j3913j2403j1406j1493j2395j2907j2121j0578r595r448
$$ 751326 735975 720821 706908 694505 683099 671606 659211 646304 634183 623605 614010 604562
53127F04562r128q123p377p713q253p583n966n040n400n970n864n427n018m209
$$ 604562 595434 587311 579934 572221 563968 556385 550419 545379 539979 534009 528145 522718 517700 513491
53113E13491k888j978k086k503k461k398k949l615l627l260l088k640j300O8J7
$$ 513491 510603 508625 506539 504036 501575 499177 496228 492613 488986 485726 482638 479998 478698 478766 478783
53098D78783j177j727r61j95o29j647j869r36K94Q05K53q60j569j340o30l29p49
$$ 478783 477606 475879 474918 474723 474094 472447 470578 469642 469936 470741 470994 470134 468565 467225 466595 466266 465517
53081D65517j505k045j944j052Q5N05J39K42J683L433L832K770J427L42p46j436
$$ 465517 464012 461967 460023 458971 459056 459561 459700 459942 461625 465058 468890 471660 473087 473429 472683 471247
53065D71247p54J064K457K537J978J571J216P78O38Q13O06j53n49R7J199J906
$$ 471247 470493 471557 474014 476551 478529 480100 481316 482094 482732 483545 484151 483998 483449 483546 484745 486651
53049D86651K227K457K289J362Q6q53j415j963k470k542j967q79K80P76K5j575
$$ 486651 488878 491335 493624 494986 495072 494219 492804 490841 488371 485829 483862 482983 483263 484039 484064 482489
53033D82489k848l142k971l060l388l531l401l153k798k404k197k050j290M59
$$ 482489 479641 476499 473528 470468 467080 463549 460148 456995 454197 451793 449596 447546 446256 446715
53019D46715K571L855L572J828m84k042j937o14M06O0j283k526l038l037l209
$$ 446715 449286 453141 456713 458541 458057 456015 454078 453464 453870 453930 452647 450121 447083 444046 440837
53004D40837m016n070n203l808j935j173j511j406j15J292J666J266Q95P00O42
$$ 440837 436821 431751 426548 422740 420805 419632 418121 416715 416600 417892 419558 420824 421719 422419 423061
52989D23061J018J584J221l75j652j208L7J94p62j151k80Q10J279J497J793J717
$$ 423061 424079 425663 426884 426509 424857 423649 423686 423880 423118 421967 421687 422497 423776 425273 427066 428783
52973D28783J142P85R75R71K48n22n76l01n21j131j367j043o29l66o1K90M70M48
$$ 428783 429925 430710 431685 432656 432904 432382 431806 431505 430984 429853 428486 427443 426814 426448 426387 426677 427147 427595
52955D27595L08j17r21j519j148j1Q43R78J161K064L066K954J510l13j551j974
$$ 427595 427903 427786 426865 425346 424198 424187 425030 426008 427169 429233 432299 435253 436763 436450 434899 432925
52939D32925j751j049j40N07M87k75j397j990j096J240L527M181L302K366K115
$$ 432925 431174 430125 429985 430492 430979 430704 429307 427317 426221 427461 430988 435169 438471 440837 442952
52924D42952J850J129R20K029L373L152J402p9k58Qk28m52L20J835K849K706J835
$$ 442952 444802 445931 446851 448880 452253 455405 456807 456728 456470 456478 456250 455798 456118 457953 460802 463508 465343
52907D65343Q48j07r99j488j200k95M50K31j009k378k697j544L48J662J480r3
$$ 465343 466191 466084 465085 463597 462397 462102 462552 462783 461774 459396 456699 455155 455503 457165 458645 458552
52891D58552j976k863k202o59M94M71n36j764k530k575k080j469j020o57k59l9
$$ 458552 456576 453713 451511 450852 451346 451817 451281 449517 446987 444412 442332 440863 439843 439186 438927 438888
52875D38888l84j323k361k878k525j310M29K086K998K804J653J12j123j664j680
$$ 438888 438504 437181 434820 431942 429417 428107 428536 430622 433620 436424 438077 438189 437066 435402 433722
52860D33722j574j334n47Q09J952K065J253L64n3j78m05q25j238j427j278q58
$$ 433722 432148 430814 430267 431076 433028 435093 436346 436710 436657 436479 436074 435249 434011 432584 431306 430448
52844D30448l92j07l8k1J87O75J094Q00l81j630j868j056j56K00L10N44P14O56
$$ 430448 430056 429949 429911 429890 430077 430752 431846 432646 432265 430635 428767 427711 427555 427755 428065 428609 429323 429979
52826D29979O60Q64R43R02J323K201K444J443K70K55J009J113L05l13K4J013K184
$$ 429979 430639 431503 432446 433348 434671 436872 439316 440759 441029 441284 442293 443406 443711 443398 443422 444435 446619
52809D46619L387M353M741M671M388L585K024N61M18J429K095J477m9j852l770
$$ 446619 450006 454359 459100 463771 468159 471744 473768 474329 474747 476176 478271 479748 479699 477847 474077
52794D74077n580o849p562q013p887o485m014j681l15J52j52j176k045j560j05
$$ 474077 468497 461648 454086 446073 438186 431701 427687 426006 425691 425843 425691 424515 422470 420910 420805
52779D20805L07j229k998k959j499o30j010j191Q4K029K774J692J73m7J044J884
$$ 420805 421112 419883 416885 413926 412427 411797 410787 409596 409680 411709 414483 416175 416348 416301 417345 419229
52763D19229J488N85J93M7n54j192r88l42l85r49p08M87J260R87P04J147J534
$$ 419229 420717 421302 421495 421542 420988 419796 418808 418466 418081 417132 416424 416911 418171 419158 419862 421009 422543
52746D22543J142N62M01Q8r09j846j855j506j957l271m467m654l403r07J491J914
$$ 422543 423685 424247 424648 424736 423827 421981 420126 418620 416663 413392 408925 404271 400868 399961 401452 403366
52730D03366J39j715j724m97J16k07l09K63O49J90o57r55r7J828L757M134K474
$$ 403366 403505 401790 400066 399569 399685 399478 399169 399432 400081 400271 399614 398659 398562 400390 404147 408281 410755
52713D10755J80r83q47m90m26k13L13M96l21k028l798m498l389r93J025J492R38
$$ 410755 410935 409952 409105 408615 408189 407976 408289 408785 408464 406436 402638 398140 394751 393758 394783 396275 397213
52696C97213P13J198J644J399O50O6J55Q41J420J296R46J474K966M208M499M624
$$ 397213 397926 399124 400768 402167 402817 402883 403038 403879 405299 406595 407541 409015 411981 416189 420688 425312
52680D25312N251N490M219K024M68j5k12n09m54J92J081J959K775L263L159K643
$$ 425312 430563 436053 440272 442296 442764 442749 442537 442028 441574 441766 442847 444806 447581 450844 454003 456646
52664D56646J902O20j359l291m314m514m366l667k081k73O62O50M16K28r6k40
$$ 456646 458548 459168 457809 454518 450204 445690 441324 437657 435576 435303 435965 436615 437031 437259 437163 436923
52648D36923K52Q73O48l55j110j181j112j270j434j384j043j56J238K286K260
$$ 436923 437175 438048 438696 438341 437231 436050 434938 433668 432234 430850 429807 429651 430889 433175 435435
52633D35435J607J020J64j335k311j406N23J340Q38P24J399J265j98j251q78n80
$$ 435435 437042 438062 438226 436891 434580 433174 433697 435037 435875 436599 437998 439263 439065 437814 436936 436356
52617D36356j649k704j886L6Q21k7j083j329r31k90J53k44j233j078J283M079
$$ 436356 434707 432003 430117 430153 430974 430947 429864 428535 427604 427314 427467 427223 425990 424912 426195 430274
52601D30274M536K557O48M59J380K583M183N721N714L940K462K916M118L860K036
$$ 430274 434810 437367 438015 438474 439854 442437 446620 452341 458055 461995 464457 467373 471491 475351 477387
52586D77387L46l94q42j424j728j674j811k213k380k288k357k309j541p44j311
$$ 477387 477733 477339 476497 475073 473345 471671 469860 467647 465267 462979 460622 458313 456772 456028 454717
52571D54717k576j790J853N125M729J855L45J271K048P99j288k427k562k193j132
$$ 454717 452141 450351 452204 457329 462058 463913 464258 465529 467577 468376 467088 464661 462099 459906 458774
52556D58774K47L97j141k333j267R93J903R12l75q72j012j220j135n61J7J83n9
$$ 458774 459021 459418 458277 455944 454677 455670 457573 458485 458110 457238 456226 455006 453871 453310 453327 453510 453451
52539D53451o49j378j530n56R34J696J347N93J27J26N87J271J379K92j337k028
$$ 453451 452802 451424 449894 449338 450272 451968 453315 453908 454035 454161 454748 456019 457398 457690 456353 454325
52523D54325j119P25K436L311L021J854Q86J008J701J576K37j203j562q61l1J30
$$ 454325 453206 453931 456367 459678 462699 464553 465439 466447 468148 469724 469961 468758 467196 466335 466304 466434
52507D66434m30r81p52mM4j133k387k388j460r39j195j583j881k314k278p88J672
$$ 466434 466004 465023 464271 464267 464311 463178 460791 458403 456943 456004 454809 453226 451345 449031 446753 445965 447637
52490D47637L230K958J867J140P24J88k75m79q13j378j491p71J09M72O48J151
$$ 447637 450867 453825 455692 456832 457556 457744 457469 456990 456177 454799 453308 452537 452646 453118 453766 454917
52474D54917J547J184M67M36J204J775J463P83N96P95L71j089k385j750R38L686
$$ 454917 456464 457648 458115 458551 459755 461530 462993 463776 464372 465167 465538 464449 462064 460314 461252 464938
52458D64938M576L806K869K353J661N86k08l80l36j48Q42K769M523M977M185K882
$$ 464938 469514 473320 476189 478542 480203 480789 480581 480201 479865 479717 480559 483328 487851 492828 497013 499895
52442D99895J366l84j955k670k457k045k236l123m021m160l402k255j173k15N34
$$ 499895 501261 500877 498922 496252 493795 491750 489514 486391 482370 478210 474808 472553 471380 471165 471699
52427D71699P59N14M12O39M62n31j391j031%K71k85k24J253L209M262M010K933
$$ 471699 472458 472972 473384 474023 474485 473954 472563 471532 471532 471803 471518 471294 472547 475756 480018 484028 486961
52410D86961J759J073Q70N32j45k39J045K838L529K943K232J865J323P13Q99J674
$$ 486961 488720 489793 490663 491195 491050 490811 491856 494694 498223 501166 503398 505263 506586 507299 508198 509872
52394E09872J586J69j218j532j538k274l341l782l569l184k522j305J9P15O81
$$ 509872 511458 511627 510409 508877 507339 505065 501724 497942 494373 491189 488667 487362 487381 488096 488777
52379D88777K91k69r91j616j719j073O0Q87N93n99j365r10O6P61J690L324M411
$$ 488777 489068 488799 487808 486192 484473 483400 483460 484347 484940 484341 482976 482066 482132 482893 484583 487907 492318
52362D92318L611J987J570K026J473K92R05L362M577L105J527K371M425N151M413
$$ 492318 495929 497916 499486 501512 502985 503277 504182 507544 512121 515226 516753 519124 523549 528700 533113
$$ [...]
##END NTUPLES=NMR SPECTRUM
##END=
