
##TITLE=UV1148_M1-1003-1002_6301497_oaHm9oQJQT
##JCAMPDX= 6.0         $$ Bruker NMR JCAMP-DX V2.0
##DATA TYPE= NMR SPECTRUM
##DATA CLASS= NTUPLES
##ORIGIN= BRUKER
##OWNER= Administrator
$$ 1.72 TOPSPIN		Version 2.1
$$ 2012-06-06 00:27:52.984 -0500  Administrator@TOPSPIN
$$ Compression mode = diff/dup
##.OBSERVE FREQUENCY= 400.13188235
##.OBSERVE NUCLEUS= ^1H
##.ACQUISITION MODE= SIMULTANEOUS (DQD)
##.ACQUISITION SCHEME= undefined
##.AVERAGES= 8
##.DIGITISER RES= 22
##SPECTROMETER/DATA SYSTEM= spect
##.PULSE SEQUENCE= zg30
##.SOLVENT NAME= COFFEE_meoh
##.SHIFT REFERENCE= INTERNAL, COFFEE_meoh, 1, 14.98061
##AUDIT TRAIL= $$ (NUMBER, WHEN, WHO, WHERE, PROCESS, VERSION, WHAT)
$$ ##TITLE= Audit trail, TOPSPIN		Version 2.1
$$ ##JCAMPDX= 5.01
$$ ##ORIGIN= Bruker BioSpin GmbH
$$ ##OWNER= Administrator
$$ $$ C:\Bruker\TOPSPIN/data/COFFEE/nmr/UV1148_M1-1003-1002_6301497_oaHm9oQJQT/10/pdata/1/auditp.txt
$$ ##AUDIT TRAIL=  $$ (NUMBER, WHEN, WHO, WHERE, PROCESS, VERSION, WHAT)
(   1,<2012-06-06 00:27:46.078 -0500>,<Administrator>,<TOPSPIN>,<go>,<TOPSPIN 2.1>,
      <created by zg
	started at 2012-06-06 00:26:39.093 -0500,
	POWCHK enabled, PULCHK disabled,
       configuration hash MD5:
       D5 CA 7A 23 FE 6B EE E2 50 67 74 61 24 F7 5E 3B
       data hash MD5: 64K
       4E DC 97 35 61 48 62 13 4A 7B A6 93 FD 48 48 2B>)
(   2,<2012-06-06 00:27:48.765 -0500>,<Administrator>,<TOPSPIN>,<proc1d>,<TOPSPIN 2.1>,
      <Start of raw data processing
       efp LB = 0 FT_mod = 6 PKNL = 1 PHC0 = 0 PHC1 = 0 SI = 32K 
       data hash MD5: 32K
       AE 04 0A E4 A0 F7 AE 6F BD 60 7F D4 C6 AD C7 30>)
(   3,<2012-06-06 00:27:49.203 -0500>,<Administrator>,<TOPSPIN>,<proc1d>,<TOPSPIN 2.1>,
      <pk PHC0 = 209.1687 PHC1 = 0 
       data hash MD5: 32K
       B3 8D 68 71 09 9C B6 C4 20 DA 83 05 50 34 27 ED>)
(   4,<2012-06-06 00:27:49.312 -0500>,<Administrator>,<TOPSPIN>,<proc1d>,<TOPSPIN 2.1>,
      <abs ABSG = 1 
       data hash MD5: 32K
       DF 6F 9B 45 AD 74 7B CC 2C F1 F7 AB 57 6D 5F 3C>)
(   5,<2012-06-06 00:27:49.359 -0500>,<Administrator>,<TOPSPIN>,<proc1d>,<TOPSPIN 2.1>,
      <abs ABSG = 2 
       data hash MD5: 32K
       C5 A2 27 5B 49 44 BE 31 91 C3 CF C3 B9 73 5D E7>)
(   6,<2012-06-06 00:27:49.390 -0500>,<Administrator>,<TOPSPIN>,<proc1d>,<TOPSPIN 2.1>,
      <abs ABSG = 3 
       data hash MD5: 32K
       40 E1 F8 70 BD A3 7C BF 9E 94 B8 61 5F 83 2B 23>)
(   7,<2012-06-06 00:27:49.406 -0500>,<Administrator>,<TOPSPIN>,<proc1d>,<TOPSPIN 2.1>,
      <abs ABSG = 4 
       data hash MD5: 32K
       ED ED 53 5C 81 DC 06 BD C0 72 D4 C6 AF 36 47 F5>)
(   8,<2012-06-06 00:27:49.437 -0500>,<Administrator>,<TOPSPIN>,<proc1d>,<TOPSPIN 2.1>,
      <abs ABSG = 5 
       data hash MD5: 32K
       C5 B7 77 2E DE 5A 58 46 D7 1A F5 75 F7 46 E4 67>)
$$ ##END=
$$ 
$$ $$ hash MD5
$$ $$ 46 26 F8 D5 C5 D9 1E 34 8B F8 63 8D 5D 7A 73 17
##$RELAX= 
##$RELAX= 
##$RELAX= 
##$RELAX= 
##$RELAX= 
##$RELAX= 
##$RELAX= 
$$ Bruker specific parameters
$$ --------------------------
$$ [...]
##$TP= (0..7)
150 150 150 150 150 150 150 150
##$TP07= 0
##$TPNAME0= <>
##$TPNAME1= <>
##$TPNAME2= <>
##$TPNAME3= <>
##$TPNAME4= <>
##$TPNAME5= <>
##$TPNAME6= <>
##$TPNAME7= <>
##$TPOAL= (0..7)
0.5 0.5 0.5 0.5 0.5 0.5 0.5 0.5
##$TPOFFS= (0..7)
0 0 0 0 0 0 0 0
##$TUNHIN= 0
##$TUNHOUT= 0
##$TUNXOUT= 0
##$USERA1= <user>
##$USERA2= <user>
##$USERA3= <user>
##$USERA4= <user>
##$USERA5= <user>
##$V9= 5
##$VALIST= <valist>
##$VCLIST= <CCCCCCCCCCCCCCC>
##$VD= 0
##$VDLIST= <DDDDDDDDDDDDDDD>
##$VPLIST= <PPPPPPPPPPPPPPP>
##$VTLIST= <TTTTTTTTTTTTTTT>
##$WBST= 2048
##$WBSW= 25
##$XGAIN= (0..3)
0 0 0 0
##$XL= 0
##$YL= 0
##$YMAX_a= 503266
##$YMIN_a= -610643
##$ZGOPTNS= <>
##$ZL1= 120
##$ZL2= 120
##$ZL3= 120
##$ZL4= 120
##$ABSF1= 14.98061
##$ABSF2= -5.57192
##$ABSG= 5
##$ABSL= 3
##$ALPHA= 0
##$AQORDER= 0
##$ASSFAC= 0
##$ASSFACI= 0
##$ASSFACX= 0
##$ASSWID= 0
##$AUNMP= <proc_prof1d_extract_pilot.lims>
##$AXLEFT= 0
##$AXNAME= <>
##$AXNUC= <1H>
##$AXRIGHT= 0
##$AXTYPE= 0
##$AXUNIT= <>
##$AZFE= 0.1
##$AZFW= 0.1
##$BCFW= 0
##$BC_mod= 0
##$BYTORDP= 0
##$COROFFS= 0
##$CY= 15
##$DATMOD= 1
##$DC= 0
##$DFILT= <>
##$DTYPP= 0
##$F1P= 0
##$F2P= 0
##$FCOR= 0.5
##$FTSIZE= 32768
##$FT_mod= 6
##$GAMMA= 0
##$GB= 0
##$INTBC= 1
##$INTSCL= 1
##$ISEN= 128
##$LB= 0
##$LEV0= 0
##$LPBIN= 0
##$MAXI= 10000
##$MC2= 0
##$MEAN= 0
##$ME_mod= 0
##$MI= 0
##$NCOEF= 0
##$NC_proc= -8
##$NLEV= 6
##$NOISF1= 0
##$NOISF2= 0
##$NSP= 0
##$NTH_PI= 0
##$NZP= 0
##$OFFSET= 14.98061
##$PC= 1
##$PHC0= 209.1687
##$PHC1= 0
##$PH_mod= 1
##$PKNL= yes
##$PPARMOD= 0
##$PPDIAG= 0
##$PPIPTYP= 0
##$PPMPNUM= 2147483647
##$PPRESOL= 1
##$PSCAL= 4
##$PSIGN= 0
##$PYNMP= <proc.py>
##$REVERSE= no
##$SF= 400.13
##$SI= 32768
##$SIGF1= 0
##$SIGF2= 0
##$SINO= 400
##$SIOLD= 32768
##$SPECTYP= <>
##$SREGLST= <1H.CDCl3>
##$SSB= 0
##$STSI= 32768
##$STSR= 0
##$SW_p= 8223.68421052632
##$SYMM= 0
##$S_DEV= 0
##$TDeff= 65536
##$TDoff= 0
##$TI= <>
##$TILT= no
##$TM1= 0
##$TM2= 0
##$TOPLEV= 0
##$USERP1= <user>
##$USERP2= <user>
##$USERP3= <user>
##$USERP4= <user>
##$USERP5= <user>
##$WDW= 1
##$XDIM= 32768
##$YMAX_p= 459326037
##$YMIN_p= -766005
##$CURPLOT= <Network HP LaserJet P1505>
##$CURPRIN= <$Network HP LaserJet P1505>
##$DFORMAT= <normdp>
##$LAYOUT= <+/1D_H.xwp>
##$LFORMAT= <normlp>
##$PFORMAT= <normpl>
##$SURQMSG= 1
$$ End of Bruker specific parameters
$$ ---------------------------------
##NTUPLES= NMR SPECTRUM
##VAR_NAME=  FREQUENCY,     SPECTRUM/REAL,   SPECTRUM/IMAG
##SYMBOL=    X,             R,               I
##VAR_TYPE=  INDEPENDENT,   DEPENDENT,       DEPENDENT
##VAR_FORM=  AFFN,          ASDF,            ASDF
##VAR_DIM=   32768,         32768,           32768
##UNITS=     HZ,            ARBITRARY UNITS, ARBITRARY UNITS
##FACTOR=    0.250966925370066, 1,           1
##FIRST=     8223.43324360095, -86694,       78345
##LAST=      0,             43704,           -37247
##MIN=       0,             -766005,         0
##MAX=       8223.43324360095, 459326037,    0
$$ Real data points
##PAGE= N=1
##DATA TABLE= (X++(R..R)), XYDATA
$$ [...]
19512B90109c6134j62314N2275A51877a39744C7168a10133B6272L37155I8776
$$ 290109 -36134 -198448 -146173 151877 -139744 37168 -110133 26272 363427 98776
19501B46446a2167j20022l682j61149q1461J18708k12446A49229m7643c92217
$$ 246446 -12167 -132189 -135871 -297020 -378481 -259773 -472219 149229 101586 -392217
19490c37514a60577B06185c2027H820b01411l6184m8596J23717A13875D799J42442
$$ -337514 -160577 206185 -32027 8820 -201411 -237595 -286191 -162474 113875 4799 147241
19479A47241f022j08400m1323b9438k45996A31046c00944C7453e7806F0699b56843
$$ 147241 -6022 -114422 -155745 -29438 -275434 131046 -300944 37453 -57806 60699 -256843
19467e3446p5773A10125A7870b21286B46673i2099D2371i9581k5633I5941d23542
$$ -53446 -129219 110125 17870 -221286 246673 -92099 42371 -99581 -125214 95941 -423542
19455A21708L211E0628b1900B50530a07836j62394J12626e3441r3898O6933c6412
$$ 121708 124919 50628 -21900 250530 -107836 -270230 -157604 -53441 -147339 -80406 -36412
19443A64317p9671R5915e44367d0533B07743m1044a83231c1373j67837C00860
$$ 164317 84646 180561 -544367 -40533 207743 166699 -183231 -31373 -199210 300860
19432d14134b9296j01223q0711n2590i3980H5263c31010B38001a90471A51999
$$ -414134 -29296 -130519 -211230 -263820 -93980 85263 -331010 238001 -190471 151999
19421F3989A1994J69974p8801a15522j21950k05598b00230k05694c5485k34524
$$ 63989 11994 181968 103167 -115522 -237472 -443070 -200230 -405924 -35485 -270009
19411b70009K1629h65j93309h9608r0145E8965h2636q1453M9414d217j08187c3475
$$ -270009 -248380 -865 -194174 -89608 -179753 58965 -82636 -164089 -114675 -4217 -112404 -33475
19398b63484N623A6795f2511B48397a92112j71833d6316B44421o7958b14000h9038
$$ -263484 -257861 16795 -62511 248397 -192112 -363945 -46316 244421 176463 -214000 -89038
19386c92575h0896I4183a12564n9016C314J23529b73817i5421A30408D1253N204
$$ -392575 -80896 94183 -112564 -171580 3314 126843 -273817 -95421 130408 41253 46457
19375D6457b52332A13000a97562A18726E321d84298b38130C30035b95480a07741
$$ 46457 -252332 113000 -197562 118726 5321 -484298 -238130 330035 -295480 -107741
19364C0300b99348J35141M2001A43695P145a11845B7441J84390g9761A91590E2976
$$ 30300 -299348 -164207 -122206 143695 150840 -111845 27441 211831 -79761 191590 52976
19352H7514d7703a4688o8628C01515j49554e7188k20633A50001C4517d428k15355
$$ 87514 -47703 -14688 -83316 301515 151961 -57188 -277821 150001 34517 -4428 -219783
19341b19783B65179a60330J3424j4790r0340C7882a29794r2070A0066J96422H8157
$$ -219783 265179 -160330 -146906 -161696 -252036 37882 -129794 -221864 10066 206488 88157
19329d11250B8707a22345n2301h6448A79813E1032a05521c5785A80170C8684a63656
$$ -411250 28707 -122345 -174646 -86448 179813 51032 -105521 -35785 180170 38684 -163656
19317c47763B6896d8389l89660a71270g2790m19044A07677c83824B45334a95409
$$ -347763 26896 -48389 -438049 -171270 -72790 -491834 107677 -383824 245334 -195409
19306h858A08583d21332J95133A89908a12839f217l9490j50544I708a88952g9328
$$ -8858 108583 -421332 -226199 189908 -112839 -6217 -45707 -196251 9708 -188952 -79328
19294g1497H7787b60748e5708l2357l4325F9644b03860A37978c83941i7146A15092
$$ -71497 87787 -260748 -55708 -88065 -122390 69644 -203860 137978 -383941 -97146 115092
19282a38758e7058E9248d19020a94695c0535m3078p4059q1251B48406d221j01494
$$ -138758 -57058 59248 -419020 -194695 -30535 -73613 -147672 -228923 248406 -4221 -105715
19271a05715N0114M846j22711E3749i1814B11357c86656D6710J60741a723k4153
$$ -105715 -55601 -50755 -173466 53749 -91814 211357 -386656 46710 207451 -1723 -25876
19260b5876m3279l2015j11776A07223c05833B38894a3161l48629I8805d53399
$$ -25876 -69155 -101170 -212946 107223 -305833 238894 -13161 -361790 98805 -453399
19249a120k1978k0435A33958C5000h9129A4418K38961b4507h835F0633M5164J12647
$$ -1120 -23098 -43533 133958 35000 -89129 14418 253379 -24507 -8835 60633 105797 218444
19237B18444q7695a67329m3681F7076R5511J98155A7637a47704O7962B93845a95285
$$ 218444 130749 -167329 -211010 67076 162587 360742 17637 -147704 -79742 293845 -195285
19225E6338a7231A7719Q3994k2346R700p903a23417j25223A93491e6260E5798
$$ 56338 -17231 17719 101713 79367 89067 81164 -123417 -248640 193491 -56260 55798
19213b35538k17637d9897G6853g8940k06130D4594N1363Q1936p4429e9193o5895
$$ -235538 -453175 -49897 76853 -78940 -285070 44594 95957 177893 103464 -59193 -125088
19202a25088B61105b80136I2653d40768g6238A6474c97118a9705B20158j8187
$$ -125088 261105 -280136 92653 -440768 -76238 16474 -397118 -19705 220158 201971
19192B01971J38590A2680c61111a53916L7253j36075A7963j799c25021h6149K9542
$$ 201971 340561 12680 -361111 -153916 -116663 -252738 17963 16164 -325021 -86149 -56607
19181e6607A04599b6095k9420I5803a54269O4939q0624A79002a16033C0553a95264
$$ -56607 104599 -26095 -55515 95803 -154269 -89330 -169954 179002 -116033 30553 -195264
19169G0537a23693A19695a23521b285E3347R4557P3936k4577N5738a0368J693
$$ 70537 -123693 119695 -123521 -2285 53347 147904 221840 197263 253001 -10368 -8675
19158h675j04498J3625L7340K3558B1919K7958A0713h8421A02571J06655C8337
$$ -8675 -113173 -99548 -62208 -38650 21919 49877 10713 -88421 102571 209226 38337
19146b24835h7712B4235N5025h332n55272K11910A29749J18732k7474a15853A50758
$$ -224835 -87712 24235 79260 -8332 -563604 -351694 129749 248481 221007 -115853 150758
19134A21855b44864b2829k61223k5960a2938B3212c27424H0155c91152f743m7647
$$ 121855 -244864 -22829 -284052 -310012 -12938 23212 -327424 80155 -391152 -6743 -54390
19123e4390K277C26666a18137b3053G8036g3893J7856B00206g7120l05285c6155
$$ -54390 -52113 326666 -118137 -23053 78036 -73893 -56037 200206 -77120 -382405 -36155
19111a207k1381F9297b18154e9085j5259A43305d8227A3968c35708e5861C5658
$$ -1207 -22588 69297 -218154 -59085 -74344 143305 -48227 13968 -335708 -55861 35658
19099c19013J58413o992k0424h51o9171B264L2794K3828a57654k39535e7319E9597
$$ -319013 -160600 -167592 -188016 -851 -70022 2264 35058 58886 -157654 -397189 -57319 59597
19086A22867a11904b3822k34931D38852d8494l198j59881N8144j09025I0632b3517
$$ 122867 -111904 -23822 -258753 438852 -48494 -51692 -211573 -153429 -262454 90632 -23517
19074a47719B17182b25827B14633A6660J0822J01233j2930a92942A47959i0043
$$ -147719 217182 -225827 214633 16660 27482 128715 115785 -192942 147959 -90043
19063B503J56644A8892K9269a36429e661B19320b30048a06215j03148A39426d94980
$$ 2503 159147 18892 48161 -136429 -5661 219320 -230048 -106215 -209363 139426 -494980
19051c23043A2445g0638F3328J86672b32174G4809a59384j4678F8994A9173O6292
$$ -323043 12445 -70638 63328 250000 -232174 74809 -159384 -174062 68994 19173 85465
19040H5465N9848h0575C97129b25715h9728j71837h4457j42066k5867H4132c79567
$$ 85465 145313 -80575 397129 -225715 -89728 -261565 -84457 -226523 -252390 84132 -379567
19028a40314p7170d6929j62018d1993A61750m7398L8504a12965j17957R6293n7231
$$ -140314 -217484 -46929 -208947 -41993 161750 114352 152856 -112965 -230922 -134629 -191860
19017a91860J0316F2597b59776B49118h7226j11764B67472a27116A86630H2939
$$ -191860 -181544 62597 -259776 249118 -87226 -198990 267472 -127116 186630 82939
19006A01236g0565E80910d74558J13341P248J53129i9399F9810c74417a52160
$$ 101236 -70565 580910 -474558 -361217 -353969 -200840 -99399 69810 -374417 -152160
18995h7858B65793c06083a09683H4418J2423c4015j45183M5012A25216P6398b73323
$$ -87858 265793 -306083 -109683 84418 96841 -34015 -179198 -134186 125216 201614 -273323
18983D2342a08189a7489G7865C0689f6633F0121d50296B50579c33472A76938b2265
$$ 42342 -108189 -17489 77865 30689 -66633 60121 -450296 250579 -333472 176938 -22265
18971A37596b83330a5559B77506i1310l58239g8467l64901d3246N828A44661c22302
$$ 137596 -283330 -15559 277506 -91310 -449549 -78467 -443368 -43246 -37418 144661 -322302
18959F8866d6978q5269A71333F5473c39729D881a22422A99785H9219I591J73604
$$ 68866 -46978 -132247 171333 65473 -339729 4881 -122422 199785 89219 9591 183195
18948A83195Q4303a81968c3400j6314d432A12084c28944G1416a30452N8890A54038
$$ 183195 267498 -181968 -33400 -49714 -4432 112084 -328944 71416 -130452 -71562 154038
18936g8166K3859A19666c63203h3406j01246p2571a09437j9329A19875D568J73599
$$ -78166 -54307 119666 -363203 -83406 -184652 -257223 -109437 -128766 119875 4568 178167
18925A78167e0854j35666C14609C8106a24160n0515f0954A8671a94630i1800I6553
$$ 178167 -50854 -186520 314609 38106 -124160 -174675 -60954 18671 -194630 -91800 96553
18913a49907B76461a90626k36948J0146b2941a0915j52677A3255a37402j66387
$$ -149907 276461 -190626 -427574 -417428 -22941 -10915 -163592 13255 -137402 -303789
18903c03789B54925d6301I8271c40487C0833d05258G4474b61414q2578J66278
$$ -303789 254925 -46301 98271 -340487 30833 -405258 74474 -261414 -343992 -177714
18893a77714I7946a54081d810k52786A06882a34344q0223F6601f1558j07171A70105
$$ -177714 97946 -154081 -4810 -257596 106882 -134344 -214567 66601 -61558 -168729 170105
18881A73222a40944k29035F9463c47615l1033a35095E6148L8227g9129C8726f833
$$ 173222 -140944 -369979 69463 -347615 -378648 -135095 56148 94375 -79129 38726 -6833
18869g44r7913C414b76658R2056K49H639Q5786b6140B55829a6223H5874C9507
$$ -744 -98657 3414 -276658 -184602 -184353 8639 94425 -26140 255829 -16223 85874 39507
18856a56018l559r3436f0443j41378L8127H8487A4671L6979a45579B6383J10050
$$ -156018 -159577 -253013 -60443 -201821 -163694 88487 14671 51650 -145579 26383 136433
18845A36433K20416A0927a34888a0674B33152b4561q1699J2396D1042J61269E0333
$$ 136433 356849 10927 -134888 -10674 233152 -24561 -106260 -93864 41042 202311 50333
18833b6119A51309b01886o1547q7562A15567A9233J83084a74393b1109B08414
$$ -26119 151309 -201886 -263433 -350995 115567 19233 202317 -174393 -21109 208414
18822g2227C5448a49266B32709m5884c757r0220N63K5392k53029G7951J82044
$$ -72227 35448 -149266 232709 186825 -3757 -93977 -93414 -68022 -321051 77951 259995
18811B59995g063C4186c4470j06884I974a65615j52764H3684d13095A232O6491
$$ 259995 -7063 34186 -34470 -141354 9974 -165615 -318379 83684 -413095 1232 67723
18800F7723a10300A36794K29873f7130I2675L12590A20352B1659b45315C579N808
$$ 67723 -110300 136794 366667 -67130 92675 405265 120352 21659 -245315 3579 9387
18789I387c9727a7184Q516k22036A77627a02814C7558c18408C87445c4084D01746
$$ 9387 -39727 -17184 -8668 -230704 177627 -102814 37558 -318408 387445 -34084 401746
18777h7628j15369p961j80465B12047J90243a21263h935j05567A06433h6508k69025
$$ -87628 -202997 -210958 -391423 212047 402290 -121263 -8935 -114502 106433 -86508 -355533
18766c55533i5515B80443a19888j45936J03105p5225d7548A77184f3661l76917
$$ -355533 -95515 280443 -119888 -265824 -162719 -237944 -47548 177184 -63661 -440578
18756d40578J33929c769k32828l3353i4904B1030c89210J66315B22975a72008
$$ -440578 -306649 -3769 -236597 -269950 -94904 21030 -389210 -222895 222975 -172008
18745b1394l3377m1874K303c4622J860j84275C440h1688m93280a24024i532B10019
$$ -21394 -54771 -96645 -94342 -34622 -32762 -217037 3440 -81688 -574968 -124024 -9532 210019
18732E532J28718h3378A07387g2350A15929a78967n0529K3077A0348c48853F3993
$$ 5532 134250 -83378 107387 -72350 115929 -178967 -229496 -206419 10348 -348853 63993
18720F5609h1069j0198B12203a73109j70415M7032a48163B00361j2053b23543
$$ 65609 -81069 -91267 212203 -173109 -343524 -296492 -148163 200361 188308 -223543
18709f9443q5705B05809n5983g2546A10599A2951g3736p9219n6915p7582i5780
$$ -69443 -155148 205809 149826 -72546 110599 12951 -73736 -152955 -209870 -287452 -95780
18697b67380J32947I3058g130H3281Q0192a8504j33871J1089p3888C3699K90913
$$ -267380 -134433 93058 -7130 83281 163473 -18504 -152375 -141286 -215174 33699 324612
18686C24612i6075M3104l6254p0708D6527a13489j40612o0769K2332Q5056l5977
$$ 324612 -96075 -52971 -89225 -159933 46527 -113489 -254101 -314870 -292538 -207482 -243459
18675b43459d8839A20673D9595m014a79309A10799E2450b50767J05133D622J4496
$$ -243459 -48839 120673 49595 45581 -179309 110799 52450 -250767 -145634 4622 19118
18664A9118J12171b60674a10123k4893d3712A06259O8648a75218A62451b44382
$$ 19118 131289 -260674 -110123 -135016 -43712 106259 174907 -175218 162451 -244382
18653a6404j86346e0546C28505A23018D5631g7695k23863C16277b4923j23658
$$ -16404 -202750 -50546 328505 123018 45631 -77695 -301558 316277 -24923 -148581
18643a48581k75510a37776k2253b0857E1746K61238c18888B9534c46723A57079
$$ -148581 -424091 -137776 -160029 -20857 51746 312984 -318888 29534 -346723 157079
18632F4633a15373j3450M2195A05879B464g3483A83219n1961J23912j17911J9964
$$ 64633 -115373 -128823 -86628 105879 2464 -73483 183219 131258 255170 137259 157223
18621A57223e1103j2960A85474D1541O1104Q0890e9536C21064A40788A5612M7146
$$ 157223 -51103 -64063 185474 41541 102645 183535 -59536 321064 140788 15612 62758
18610F2758J36531c88357a7610B5070b77950M2379A03013a220j37805c5658C9782
$$ 62758 199289 -388357 -17610 25070 -277950 -235571 103013 -1220 -139025 -35658 39782
18598b00328M7540F9102a40101o2597g3509k89391K1839j8999N7851D2423i3695
$$ -200328 -152788 69102 -140101 -202698 -73509 -362900 -341061 -360060 -302209 42423 -93695
18586G3148l018K14703g607q0259j7706C25104c14762a29271G8607i063G616J70219
$$ 73148 70130 284833 -7607 -87866 -105572 325104 -314762 -129271 78607 -9063 7616 177835
18574A77835f6924B6439b39421P8121F351a65197j7560c107k6943k5966k33833
$$ 177835 -66924 26439 -239421 -161300 6351 -165197 -182757 -3107 -30050 -56016 -289849
18563b89849d0932q4421A15998i2071B56011a93024k29956a19168m9675D3030
$$ -289849 -40932 -125353 115998 -92071 256011 -193024 -422980 -119168 -168843 43030
18552i3560f858n9161l02477c5618j45257Q3860l11208A33649F124b84594J16016
$$ -93560 -6858 -66019 -368496 -35618 -180875 -97015 -408223 133649 6124 -284594 -168578
18541a68578C25117a52279p661p7675D642a76923C4485b3024o6263r9719b0250
$$ -168578 325117 -152279 -159940 -237615 4642 -176923 34485 -23024 -89287 -189006 -20250
18529B4958K87316B1834d4194j06452B01853l7361N9087a60819G099J91700b15451
$$ 24958 312274 21834 -44194 -150646 201853 164492 223579 -160819 7099 198799 -215451
18517h9268C2311J0c66m7115B63074b39247c879E0342J0884a83383j77065A37514
$$ -89268 32311 32321 -366 -47481 263074 -239247 -3879 50342 61226 -183383 -360448 137514
18504a41513n5690B14982g2171A9389a11561p1109o8048h2470A05062c80492g3824
$$ -141513 -197203 214982 -72171 19389 -111561 -182670 -250718 -82470 105062 -380492 -73824
18492B5355b40959R3556j57003g5562r1086m6880a7456p7854A26301J66419a23467
$$ 25355 -240959 -147403 -304406 -75562 -166648 -213528 -17456 -95310 126301 292720 -123467
18480i3066l18749J78631O5472K6475j6314B11030l2287c4698o2408I3254l4111
$$ -93066 -411815 -233184 -167712 -141237 -157551 211030 178743 -34698 -97106 93254 59143
18469E9143f3977k4809j52728g973j51198A59080b71627f090q7158m82220e4347
$$ 59143 -63977 -88786 -241514 -7973 -159171 159080 -271627 -6090 -93248 -575468 -54347
18457A06874g5871j89332N6787b9600I3709a9743j72192P1876j69451A34959a03843
$$ 106874 -75871 -265203 -208416 -29600 93709 -19743 -191935 -120059 -289510 134959 -103843
18445a89195j05121A40455b1976C58256A73565g6595j83518j1547I6671L1334
$$ -189195 -294316 140455 -21976 358256 173565 -76595 -260113 -271660 96671 128005
18435A28005C4762b92310a289A21145b46599P4348j11925h0316H7491a893k07406
$$ 128005 34762 -292310 -1289 121145 -246599 -172251 -284176 -80316 87491 -1893 -209299
18424b09299f1378F5171e25056a71934N4602A23349a31306b9506B32475g3421
$$ -209299 -61378 65171 -525056 -171934 -117332 123349 -131306 -29506 232475 -73421
18413B03849f9216j97111A59224a23585C64081a87804B20259f0603K3627q3791
$$ 203849 -69216 -266327 159224 -123585 364081 -187804 220259 -60603 -36976 -120767
18403a20767a2447k80940A12680L5933a86044j58344A93974o5915l8934b74610
$$ -120767 -12447 -293387 112680 148613 -186044 -344388 193974 128059 89125 -274610
18392A66549K45178b59973A08483c48926d3204a5934j7673C580K67511J56166
$$ 166549 411727 -259973 108483 -348926 -43204 -15934 -33607 3580 271091 427257
18382D27257c57584g2758A37196b59149F1400A4984d06547A13062a22854B7077
$$ 427257 -357584 -72758 137196 -259149 61400 14984 -406547 113062 -122854 27077
18371A37284k7363c45502a36038A7842L5472H032c10136a01297m9673b844j23454
$$ 137284 109921 -345502 -136038 17842 53314 8032 -310136 -101297 -150970 -2844 -126298
18360a26298I2381R6535b77338e4648m7098D5000b65937b6483C6592A3925J58342
$$ -126298 92381 188916 -277338 -54648 -101746 45000 -265937 -26483 36592 13925 172267
18349A72267a09136D26525b19105A54045a95838F8035l1730g4746F7874P6023
$$ 172267 -109136 426525 -219105 154045 -195838 68035 36305 -74746 67874 143897
18339A43897J31977B8407a20527A9781R1559a93221G7280a98730N7323B77375
$$ 143897 275874 28407 -120527 19781 111340 -193221 77280 -198730 -141407 277375
18328b267H7075i8431I7391a04238d9618A10999c26366A20033a31206k6045C23199
$$ -2267 87075 -98431 97391 -104238 -49618 110999 -326366 120033 -131206 -157251 323199
18316a65008e491E0812a3955H7039a10782A30918c44407a48217g3497p4803B3056
$$ -165008 -5491 50812 -13955 87039 -110782 130918 -344407 -148217 -73497 -148300 23056
18304E7585j4507b81538d1620C4129b10248k0946j80785a03856A14191k4833P2145
$$ 57585 43078 -281538 -41620 34129 -210248 -231194 -411979 -103856 114191 89358 161503
18293A61503a12335A53489J6959D3691h3581j39944g5945m7001A51283b73224
$$ 161503 -112335 153489 170448 43691 -83581 -223525 -75945 -122946 151283 -273224
18282b07929A82272D1722a26792R732B17020h0297C47113a22560h821A75799C0383
$$ -207929 182272 41722 -126792 -117060 217020 -80297 347113 -122560 -8821 175799 30383
18270b37152m1042e9951K905j4857B75541D485f1233j49565G897a24297o615c6142
$$ -237152 -278194 -59951 -57046 -71903 275541 4485 -61233 -210798 7897 -124297 -130912 -36142
18257c2226j46141A02135B2499a22819E6263f1980K5978B8321h6860A63337c24416
$$ -32226 -178367 102135 22499 -122819 56263 -61980 -36002 28321 -86860 163337 -324416
18245a98760I0094R3137b15067B08480b8145A09981a35794c5091j23008O7899
$$ -198760 90094 183231 -215067 208480 -28145 109981 -135794 -35091 -158099 -90200
18235i0200C0293Q8171k5676N346a27795p3293G3482K10013b06789K7429k17617
$$ -90200 30293 118464 92788 98134 -127795 -201088 73482 283495 -206789 -179360 -396977
18224c96977a84592c6229B99851c4193n6081A8928n802j923a60266A00590J22148
$$ -396977 -184592 -36229 299851 -34193 -90274 18928 13126 11203 -160266 100590 222738
18213B22738a74182A06912b24952g2827A94283i9733j9009r5155a4776q4869k45631
$$ 222738 -174182 106912 -224952 -72827 194283 -99733 -118742 -213897 -14776 -99645 -345276
18202c45276J19698K5906j07497A71b99222D0010i1928B58939F4748K35155p4304
$$ -345276 -225578 -199672 -307169 171 -299222 40010 -91928 258939 64748 299903 225599
18191B25599a11083i385r6073M6318A69632j9669f2334A64811c21067B2590b47416
$$ 225599 -111083 -9385 -105458 -59140 169632 149963 -62334 164811 -321067 22590 -247416
18179B44524E8750b59650N512M6488A88527b1661j40961A49421K07880j25654
$$ 244524 58750 -259650 -254138 -207650 188527 -21661 -162622 149421 357301 231647
18169B31647h133j46271B00438a75296A21780n9179B4678M0401K19995i9096K3765
$$ 231647 -8133 -154404 200438 -175296 121780 62601 24678 65079 285074 -99096 -75331
18158g5331j55694j25695a03594A82892A2185h7484I6898i1724B23058H9001b70583
$$ -75331 -231025 -356720 -103594 182892 12185 -87484 96898 -91724 223058 89001 -270583
18146a7402l5159o2758N5004j09987A54994R1610a77593a3386j40461E6779h9604
$$ -17402 -52561 -115319 -60315 -170302 154994 246604 -177593 -13386 -153847 56779 -89604
18134e1906A04686f8216j24826n7387J02936A7063R4385a9199A1626h0125r0990
$$ -51906 104686 -68216 -193042 -250429 -147493 17063 111448 -19199 11626 -80125 -171115
18123a71115A31310d0662q7687A50821e223r2756l2323B17678a67042M1781A33631
$$ -171115 131310 -40662 -128349 150821 -5223 -97979 -130302 217678 -167042 -125261 133631
18111b8901C0812M6043d1128J7870l09734B00849E7946h5918j91886e6904K2087
$$ -28901 30812 76855 -41128 -23258 -332992 200849 57946 -85918 -277804 -56904 -34817
18100c4817H3874c6143o8856j4914B31441B601a65332A70876d3538J034A00512
$$ -34817 83874 -36143 -104999 -119913 231441 2601 -165332 170876 -43538 -42504 100512
18088D09669A26913b4395A27057m0594b20343P7641l5877j81861p3104J84310
$$ 409669 126913 -24395 127057 86463 -220343 -142702 -178579 -360440 -433544 -249234
18078b49234f3490C3254P7924b1401A96205d6030A0939b62760A97581b02227B2643
$$ -249234 -63490 33254 111178 -21401 196205 -46030 10939 -262760 197581 -202227 22643
18066d7647B53084b418n0491q0166A16935L2642a73578N4791m7358O1329k51098
$$ -47647 253084 -2418 -52909 -133075 116935 149577 -173578 -118787 -166145 -104816 -355914
18055c55914A40038O7453d21962a29738b6394I6175C0466R4318A2279P66c151
$$ -355914 140038 207491 -421962 -129738 -26394 96175 30466 124784 12279 13045 -3151
18043d6131k46465F8990L3188b18361p0387B35931b73169A8746Q4633b11682A5106
$$ -46131 -292596 68990 102178 -218361 -288748 235931 -273169 18746 103379 -211682 15106
18031B795K20083d2896k0019C07074b40567b753A34695h2385C30056c3644C23900
$$ 2795 222878 -42896 -62915 307074 -240567 -2753 134695 -82385 330056 -33644 323900
18019e6648H6388b77765A63947b65289R4326M0868A53413b28060G7717l1141A464
$$ -56648 86388 -277765 163947 -265289 -170963 -130095 153413 -228060 77717 46576 1464
18007a78993d3013j16698O025E9636g4268j85537j6902m5049A21189f0328j8074
$$ -178993 -43013 -159711 -153686 59636 -74268 -259805 -276707 -321756 121189 -60328 -78402
17996g8402A18666a58226A16681l5314a65616m8393B85065g6052l2408A45783
$$ -78402 118666 -158226 116681 81367 -165616 -214009 285065 -76052 -108460 145783
17985h6347A04102J86983d7303j30148f9606p8434k2336H987Q2186g3999k22463
$$ -86347 104102 291085 -47303 -177451 -69606 -148040 -170376 8987 91173 -73999 -296462
17974b96462K0273b1311k89896g2501A15949a78196D9134h4661A25012F1283O6648
$$ -296462 -276189 -21311 -311207 -72501 115949 -178196 49134 -84661 125012 61283 127931
17963A27931B1242J91432h5420r9559B02879a95191C2329B985J28454B685R1614
$$ 127931 21242 212674 -85420 -184979 202879 -195191 32329 2985 131439 2685 94299
17952I4299M964C1773J8206O4383d6039j74119B45014h5303j17996O5286F2588
$$ 94299 99263 31773 49979 114362 -46039 -220158 245014 -85303 -203299 -138013 62588
17940e0357j05862A70013G4464k2207j6347J34050h6534I4133a89143d0674j03571
$$ -50357 -156219 170013 74464 52257 35910 169960 -86534 94133 -189143 -40674 -144245
17929a44245p4563O1589B84816a05090F481K00440C4914a23565N2440i094B79909
$$ -144245 -218808 -157219 284816 -105090 6481 206921 34914 -123565 -71125 -9094 279909
17917i0702c9651F7245a45892D022b35618f2660r1418G067f798j3960A05871b26001
$$ -90702 -39651 67245 -145892 4022 -235618 -62660 -154078 7067 -6798 -20758 105871 -226001
17904a69836d1008J1759A94154a21205N7621A18173a13786A44738b0001A52502
$$ -169836 -41008 -29249 194154 -121205 -63584 118173 -113786 144738 -20001 152502
17893a30927m64762H1329a13694p7649B72234a39561E75802h041K098A29492J86066
$$ -130927 -595689 81329 -113694 -191343 272234 -139561 575802 -8041 -5943 129492 315558
17882C15558l8327E1084a86183A87885g8004B8642K09150c1795I5522D5718i1648
$$ 315558 277231 51084 -186183 187885 -78004 28642 237792 -31795 95522 45718 -91648
17870B3794J22502a07747N2711B67261b14903G7960a78586c2368A43760i7808
$$ 23794 146296 -107747 -55036 267261 -214903 77960 -178586 -32368 143760 -97808
17859B80650A05572J27789c5762j73606B30820A7472L0058j3149K98908k7743
$$ 280650 105572 233361 -35762 -209368 230820 17472 47530 34381 333289 305546
17849C05546a0745n4189b6588D0442i5369C7194a26579k27212k5716a66928O1181
$$ 305546 -10745 -64934 -26588 40442 -95369 37194 -126579 -353791 -379507 -166928 -105747
17838a05747B39605f2343b6449B14769a5766l474B06176c3972C74934H0830C7374
$$ -105747 239605 -62343 -26449 214769 -15766 -19240 206176 -33972 374934 80830 37374
17826a09489B2134a7952m8335l2201B80526E5886J47971c8551D0004M3989M2422
$$ -109489 22134 -17952 -66287 -98488 280526 55886 203857 -38551 40004 83993 126415
17815A26415J35006a85546b5218b889o6131I8059A0250a93777D1071J61135p8057
$$ 126415 261421 -185546 -25218 -2889 -69020 98059 10250 -193777 41071 202206 124149
17804A24149b58185a24758B97040f4467p077A36084b71700K7760A44393A0143
$$ 124149 -258185 -124758 297040 -64467 -71544 136084 -271700 -243940 144393 10143
17793B41553c62737a25139p8390e2373j1736j7547k0626H5311e7568B3679a0837
$$ 241553 -362737 -125139 -203529 -52373 -64109 -81656 -102282 85311 -57568 23679 -10837
17781D008J46915d7951r0193p5206e1860j04519b439l86805B94540a64240j89743
$$ 4008 150923 -47951 -138144 -213350 -51860 -156379 -2439 -389244 294540 -164240 -353983
17770c53983J34036P6172A05766c23543K1440C08229d9741A77189a71415j00987
$$ -353983 -219947 -143775 105766 -323543 -302103 308229 -49741 177189 -171415 -272402
17760b72402E7402Q5109J59763a67286A06852h387A38390H836J97512e5153j46732
$$ -272402 57402 142511 302274 -167286 106852 -8387 138390 8836 206348 -55153 -201885
17749b01885f6261k17479g9730k09919F3058K42085g8086k56516c5782A8359b07226
$$ -201885 -66261 -283740 -79730 -289649 63058 305143 -78086 -334602 -35782 18359 -207226
17737b5642j38821A17122a80697J6808K4176A11553J30228f645E6820L94090h3511
$$ -25642 -164463 117122 -180697 -163889 -139713 111553 241781 -6645 56820 450910 -83511
17725b54498A67319n1126c5622l91919R9692E4985a79832f5641C28125A20733
$$ -254498 167319 116193 -35622 -427541 -327849 54985 -179832 -65641 328125 120733
17714D146d3517m6346C5984a23391B0737D225J36242H767L35782G7132a02086
$$ 4146 -43517 -89863 35984 -123391 20737 4225 140467 8767 344549 77132 -102086
17702C94897j47205B097L30773j39054I011i4930A19571J52453C3853J41335J10154
$$ 394897 247692 2097 332870 193816 9011 -94930 119571 272024 33853 175188 285342
17691B85342G7151n673a4728j12345j20474A15378k2274c5990o7770A69383L2576
$$ 285342 77151 71478 -14728 -127073 -247547 115378 93104 -35990 -103760 169383 201959
17680B01959J20385q1344b31039h6499r3625L6590k0587O0099D00299b85108J40677
$$ 201959 322344 241000 -231039 -86499 -180124 -143534 -164121 -104022 400299 -285108 -144431
17669a44431j05157o4270F3033J99620b41394a5550B13514l9433K14652P4252
$$ -144431 -249588 -313858 63033 262653 -241394 -15550 213514 174081 388733 462985
17659D62985a5758n6031C47516i4141M2995C0916a13592A2275P4321h6145K3897
$$ 462985 -15758 -71789 347516 -94141 -51146 30916 -113592 12275 86596 -86145 -62248
17648f2248j58409B97627j12702q7422k8898L26982g4387a9490o3074k6336m1583
$$ -62248 -220657 297627 184925 97503 68605 395587 -74387 -19490 -82564 -108900 -150483
17637a50483P1239l734c5606j05361A80050c1294A05102d2020F3245a81225G7126
$$ -150483 -79244 -82978 -35606 -140967 180050 -31294 105102 -42020 63245 -181225 77126
17625a36013A86441f9563A60170a95652K8937f1917I6138K11002a58405L8970
$$ -136013 186441 -69563 160170 -195652 -166715 -61917 96138 307140 -158405 -119435
17615a19435A71239k7332c5261j78485d463k20818J06769B84628d8558k68069
$$ -119435 171239 143907 -35261 -213746 -4463 -225281 -118512 284628 -48558 -316627
17605c16627R1592e9221H7085a6238j66217B5267J58949j8931m3514L3896f276
$$ -316627 -225035 -59221 87085 -16238 -182455 25267 184216 165285 121771 155667 -6276
17593c9996p9729A055a22656q1003H1408c6956A05845c38608J22077O0029C16918
$$ -39996 -119725 1055 -122656 -203659 81408 -36956 105845 -338608 -216531 -156502 316918
17581A62276a22254I722K63511q6670j1618Q1704O4028l5133D8241b59453P1974
$$ 162276 -122254 9722 273233 186563 174945 256649 320677 285544 48241 -259453 -187479
17570a87479g1060A93880p8330O8114P2438k0128a7884J462C4827b20925H5357
$$ -187479 -71060 193880 115550 183664 256102 235974 -17884 -16422 34827 -220925 85357
17558f6412j29007F3276K42002b44206B45940d2110C47743a79119m8301r3142
$$ -66412 -195419 63276 305278 -244206 245940 -42110 347743 -179119 -227420 -320562
17548c20562I1009P2001n2554k5338J01253f0634A13689K37171a05017A14075
$$ -320562 91009 163010 110456 85118 186371 -60634 113689 350860 -105017 114075
17537B49206I1234a48013m0645D3247a84755C45810E7315a7167C01950J43151
$$ 249206 91234 -148013 -188658 43247 -184755 345810 57315 -17167 301950 445101
17527D45101j85445c77792i6179B84846p696a10183q2198c5946j01790D73986
$$ 445101 259656 -377792 -96179 284846 277150 -110183 -192381 -35946 -137736 473986
17516E7924K7376M4486d0205C78500e3131j96865B26513F4828J90288j07093C076
$$ 57924 85300 129786 -40205 378500 -53131 -249996 226513 64828 255116 148023 3076
17504b2308r7838d3987B16775b87999H3068K8416J49361q4347k7974B7913f0394
$$ -22308 -120146 -43987 216775 -287999 83068 111484 260845 176498 148524 27913 -60394
17492A89007c702q87m6102P100p0907j6342K5120N37a0111A3944M9728M87110
$$ 189007 -3702 -4589 -50691 -43591 -114498 -130840 -105720 -105183 -10111 13944 63672 550782
17480E50782B66263r4364R2343q0346e4940j01865B34781a45597b0442l59417
$$ 550782 266263 171899 264242 183896 -54940 -156805 234781 -145597 -20442 -379859
17470c79859A71208q049J83956q6441a75244D8968f5661Q639C25820B2163F047
$$ -379859 171208 163159 347115 260674 -175244 48968 -65661 -57022 325820 22163 6047
17458B54174a21458B12425G8179N5311Q0713C4117b4977C78313n5621A15951M7532
$$ 254174 -121458 212425 78179 133490 214203 34117 -24977 378313 322692 115951 163483
17447A63483L9939f1701D24664j64443o0197o3981b4722m7146e169B05211h8589
$$ 163483 203422 -61701 424664 260221 200024 136043 -24722 -71868 -5169 205211 -88589
17435C9961K70588B4947J37702p6812L55260A18880m6681K3620L21831A10064
$$ 39961 310549 24947 162649 85837 441097 118880 72199 95819 417650 110064
17424A5886J71821h9287C12758A01930b3642F0997A5193J48629J14499l1686a69488
$$ 15886 187707 -89287 312758 101930 -23642 60997 15193 163822 278321 246635 -169488
17412D17540B0143N0234K66071i8799I0760K30757i4063L6273J08C32055N8365
$$ 417540 20143 70377 336448 -98799 90760 321517 -94063 -57790 -57682 332055 390420
17401C90420j83216K4811b06385B91866j44168Q4259g0686e902B36784J59634
$$ 390420 207204 232015 -206385 291866 147698 231957 -70686 -5902 236784 396418
17391C96418a4150B56381A20590c6379j8909D38444b6581E5014J46552o5626h254
$$ 396418 -14150 256381 120590 -36379 -55288 438444 -26581 55014 201566 135940 -8254
17379A12554K70307C1794M80779B44070j02846m8413R6846a47796D49391e6036
$$ 112554 382861 31794 512573 244070 141224 92811 189657 -147796 449391 -56036
17368F5719a77036B6232K17663l4865G695d5505A35774a01399G9049P0422b6913
$$ 65719 -177036 26232 243895 209030 7695 -45505 135774 -101399 79049 149471 -26913
17356I618L04035c38620C72408A2208g268A2013K8561J12398l1780J57152o6138
$$ 9618 313653 -338620 372408 12208 -7268 12013 40574 152972 121192 278344 212206
17345B12206G1969K60300k7680A42658O3236E7594J10015K13631j23287c1138
$$ 212206 71969 332269 304589 142658 205894 57594 167609 381240 257953 -31138
17334H6596J24120N0195O6098e8588b0439D4120e6606A54262O7037O8747k8026
$$ 86596 210716 260911 327009 -58588 -20439 44120 -56606 154262 221299 290046 262020
17323B62020r6181b04888j40178A9895b5946n9823A85014j0142J66456F4084K14945
$$ 262020 165839 -204888 -345066 19895 -25946 -85769 185014 174872 341328 64084 279029
17312B79029I9390h4949B41298l7407m3995I973L29261b1772n1521B65070O4509
$$ 279029 99390 -84949 241298 203891 159896 9973 339234 -21772 -73293 265070 329579
17301C29579f3776C29712L0120A12408l9776J61913j9857a27032A28836J05421
$$ 329579 -63776 329712 359832 112408 72632 234545 214688 -127032 128836 234257
17291B34257F6028b11826F5438i6022C42772A08488j786a3278C80224e2375D2301
$$ 234257 66028 -211826 65438 -96022 342772 108488 106702 -13278 380224 -52375 42301
17279B02378J37987F7179K0233a01792A28449A0513L98998m6915M9056a13992
$$ 202378 340365 67179 87412 -101792 128449 10513 409511 362596 411652 -113992
17268A7618K15639q4206J35118l68J04599r8917E4167K82393A29332j3397a24888
$$ 17618 233257 149051 284169 283801 388400 289483 54167 336560 129332 115935 -124888
17256A68300R3111a99163B82704M9051E5942a53547B36208p8369O3991M4754J19454
$$ 168300 261411 -199163 282704 331755 55942 -153547 236208 157839 221830 266584 386038
17245C86038j59603n8388K75428A59452J69216A1185K02771j0501Q2883j34461
$$ 386038 226435 168047 443475 159452 328668 11185 213956 203455 286338 151877
17235A51877G2450j6303J82925R4973A59526g516C25911g9355L3124A99209f2775
$$ 151877 72450 56147 239072 334045 159526 -7516 325911 -79355 -46231 199209 -62775
17223A23501O2986J94668K19766J5692d6928A44785e3905B24592A03036L02930
$$ 123501 186487 381155 600921 616613 -46928 144785 -53905 224592 103036 405966
17213D05966k01904C1090N26292j23633G7508L36316E0699j323M86007j04995
$$ 405966 204062 31090 557382 433749 77508 413824 50699 49376 535383 430388
17203D30388B06065J95901j20441A2359J1614b01114C50134p0582J8833J74611
$$ 430388 206065 401966 281525 12359 23973 -201114 350134 279552 298385 472996
17193D72996B07094J5251C5030K97962j03366p555M2458i8620M3171D74345G4352
$$ 472996 207094 222345 35030 332992 229626 222071 264529 -98620 -55449 474345 74352
17181E3735K97727M1513A05624b9026A89311Q4795a09765C97637j07678J198J28558
$$ 53735 351462 392975 105624 -29026 189311 274106 -109765 397637 289959 291157 419715
17170D19715Q9682d6424D0434K71567i2453E07663H2224K03639K1714a02367B15956
$$ 419715 509397 -46424 40434 312001 -92453 507663 82224 285863 307577 -102367 215956
17158A36759m0236J7862c36n5343B70461b157B92202d8210A78423N7810L0315
$$ 136759 96523 114385 -336 -55679 270461 -2157 292202 -48210 178423 236233 266548
17147B66548C5012a2198B97786j12897f3670C86843A60952C6151L72870q8563
$$ 266548 35012 -12198 297786 184889 -63670 386843 160952 36151 409021 320458
17137C20458j37849M7454J34144M0654j31020A23089J96065o2057K64398A68742
$$ 320458 182609 230063 364207 404861 273841 123089 319154 257097 521495 168742
17126G86661A82056b8509B95051J54317d6134G071L23337B8501Q5100K13829J0153
$$ 786661 182056 -28509 295051 449368 -46134 7071 330408 28501 113601 327430 337583
17115C37583A33835K85438j80009P4071A17379J03174l3153N4885J03602J27960
$$ 337583 133835 419273 239264 313335 117379 220553 187400 242285 345887 473847
17105D73847J38639B84523K9578j3758J87296j42269j18724k8274J60478J49813
$$ 473847 612486 284523 314101 300343 487639 345370 226646 198372 358850 508663
17095E08663A60795J72784J07833j77926Q3746J12310L3733A91543j8255P0276
$$ 508663 160795 333579 441412 263486 347232 459542 493275 191543 173288 243564
17085B43564L49696G1824J62329L52982l9960o6283A29250L96223j3981j26389
$$ 243564 593260 71824 234153 587135 547175 480892 129250 525473 511492 385103
17075C85103P2088q4478F4174L01587j19060g8123C80899J70383L25383B56134
$$ 385103 457191 372713 64174 365761 246701 -78123 380899 551282 876665 256134
17064C96288k1010n5363J33200F6531K99322Q4870M4366j66533L04890j63574
$$ 396288 375278 319915 453115 66531 365853 450723 495089 328556 633446 469872
17054D69872j92057J27059O5291n671R1721j53634J05475j93850J37053K27302
$$ 469872 277815 404874 470165 464494 556215 402581 508056 314206 451259 678561
17044F78561k28205j12346J85816j28252L06866B75921K9820J2082K79389j02804
$$ 678561 450356 338010 523826 395574 702440 275921 305741 317823 597212 494408
17034D94408j57033N236K63080B04612p5987K54860O4138k1298K65829N5452j48271
$$ 494408 337375 342611 605691 204612 128625 383485 447623 426325 692154 747606 599335
17023E99335p981p3101j11679j0847K65047j54221I0366K91264J52364q5334j31746
$$ 599335 591354 518253 406574 395727 660774 506553 90366 381630 533994 448660 316914
17012C16914K94312P6613j15554K3740J43690J71693k98442j79451j55132K22666
$$ 316914 611226 687839 572285 596025 739715 911408 612966 433515 278383 501049
17002E01049M378J13958N5585p9985L02654k47791M94K26001O4713m63701K28266
$$ 501049 505427 619385 674970 594985 897639 649848 650342 876343 941056 477355 705621
16991G05621J52116k41810K05830k42358K44936k51736L59705m65478K26759k64135
$$ 705621 857737 615927 821757 579399 824335 572599 932304 466826 693585 429450
16981D29450M04107j5656k81994L2409L05876k12611K37694J82933n06128p3662
$$ 429450 833557 817901 535907 568316 874192 661581 899275 1082208 576080 502418
16971E02418K97211j34291K0707m6306N50592D54944J10236K12136p5531J32794
$$ 502418 799629 665338 686045 639739 1190331 454944 565180 777316 701785 834579
16961H34579l22052L52240J14246j53965R1049j50935J2448p9185L48355k66901
$$ 834579 512527 864767 979013 825048 916097 765162 777610 698425 1046780 779879
16951G79879K19622r4524J06778l3444j04149Q2366l26838J79671m4170l5286
$$ 779879 999501 904977 1011755 978311 874162 956528 629690 809361 765191 729905
16941G29905J07841p1653K74956J95374k68921l31063P04357l99039L9336j30736
$$ 729905 837746 766093 1041049 1236423 967502 636439 1340796 941757 981093 850357
16931H50357M71448j97313k64065J64956j67726K32420J5578M4083r687J09367
$$ 850357 1321805 1124492 860427 1025383 857657 1090077 1105655 1149738 1140051 1249418
16921A249418K14988n09504K83871k85068J89463P1038j59468N36180o67833M98469
$$ 1249418 1464406 954902 1238773 953705 1143168 1214206 1054738 1590918 923085 1421554
16911A421554J10471n93998M23485j47911L1922M8905Q9993k0916K09835j93698
$$ 1421554 1532025 938027 1361512 1213601 1245523 1294428 1384421 1363505 1573340 1379642
16901A379642K69116J35381n86137N22392j53765J9146j82459k4601J66967k75899
$$ 1379642 1648758 1784139 1198002 1720394 1566629 1585775 1403316 1378715 1545682 1269783
16891A269783K55581l9393K35383q4958J92832m04563K45222j4152j1795J5141
$$ 1269783 1525364 1485971 1721354 1636396 1829228 1424665 1669887 1655735 1643940 1659081
16881A659081J43606J74555j60684K55514j11209l83835K68090l48409O83353
$$ 1659081 1802687 1977242 1816558 2072072 1960863 1577028 1845118 1496709 2180062
16872B180062j84387j88991K1429L06919K0608l43295K34246J08399K9811o1602
$$ 2180062 1995675 1806684 1828113 2135032 2155640 1812345 2046591 2154990 2184801 2123199
16862B123199J06267L7967K10416j56486J07942m4619o8759N3107L569N7621j0689
$$ 2123199 2229466 2267433 2477849 2321363 2429305 2384686 2315927 2369034 2372603 2430224 2419535
16851B419535L21540J83921m48759J69676j34763L07416R2401k24217K10645j56027
$$ 2419535 2741075 2924996 2476237 2645913 2511150 2818566 2910967 2686750 2897395 2741368
16841B741368K35454J87066q5159j44462N36797j14101j73659N26641k88563l8251
$$ 2741368 2976822 3163888 3078729 2934267 3471064 3356963 3183304 3709945 3421382 3383131
16831C383131k03589L50000l4545J08920j15742L01612M4594R7232K02866P5023
$$ 3383131 3179542 3529542 3494997 3603917 3488175 3789787 3834381 3931613 4134479 4209502
16821D209502R4448l35994K57998j29135L97127m09836K66686M16466k29007K74163
$$ 4209502 4303950 3967956 4225954 4096819 4493946 4084110 4350796 4767262 4538255 4812418
16811D812418L22496J08768k05212J11095j590Q7452K22956J84818J50080J66463
$$ 4812418 5134914 5243682 5038470 5149565 5147975 5235427 5458383 5643201 5793281 5959744
16801E959744K07988m3453O67157k56553J36121j56788M44828j9722K86164K64912
$$ 5959744 6167732 6124279 6791436 6534883 6671004 6514216 6959044 6939322 7225486 7490398
16791G490398M11027o0519O6381N30627q6563K55581q58K86416L18340J62933
$$ 7490398 7901425 7840906 7907287 8437914 8351351 8606932 8606074 8892490 9210830 9373763
16781I373763M57867j11994M97831K03826N29736J55834L42876L27599L94991
$$ 9373763 9831630 9719636 10217467 10421293 10951029 11106863 11449739 11777338 12172329
16772A2172329N93637L10137K88008M33555L78000L11383P42165L36761P90200
$$ 12172329 12765966 13076103 13364111 13797666 14175666 14487049 15229214 15565975 16356175
16763A6356175J40870O48553M80630P91602R13209L71979P06120R17899P38987
$$ 16356175 16497045 17145598 17626228 18417830 19331039 19703018 20409138 21327037 22066024
16754B2066024P50775Q14474J099946Q45820J251046R43642J200483J153386J482328
$$ 22066024 22816799 23631273 24731219 25577039 26828085 27771727 28972210 30125596 31607924
16745C1607924J609852J409956J285171J940166K122776J594484J994722K400058
$$ 31607924 33217776 34627732 35912903 37853069 39975845 41570329 43565051 45965109
16737D5965109K653566K217469K361828L238227L066394K709198L982901L644508
$$ 45965109 48618675 50836144 53197972 56436199 59502593 62211791 66194692 69839200
16729F9839200M012551L819311M641715M756896M369353N535940N513423N881869
$$ 69839200 73851751 77671062 82312777 87069673 91439026 96974966 102488389 108370258
16721A08370258O059441N584408O153087O192913O215905O052330O147554N575257
$$ 108370258 114429699 120014107 126167194 132360107 138576012 144628342 150775896 156351153
16713A56351153N006447M473842L896180L089600J938972J426549J34295n86115
$$ 156351153 161357600 165831442 169727622 172817222 174756194 176182743 176317038 175730923
16705A75730923j736262k776002l705489m349443n309186n426639n802560o396761
$$ 175730923 173994661 171218659 167513170 163163727 157854541 152427902 146625342 140228581
16697A40228581o294398o237885o400965n918495o396250n818562n593791n256320
$$ 140228581 133934183 127696298 121295333 115376838 108980588 103162026 97568235 92311915
16689I2311915n417943m700130m396217m391875l627794l983017l536655l267520
$$ 92311915 86893972 82193842 77797625 73405750 69777956 65794939 62258284 58990764
16681E8990764l380619k751205k568842k340310k417111k679610j961407j879954
$$ 58990764 55610145 52858940 50290098 47949788 45532677 42853067 40891660 39011706
16673C9011706j843159j871709j497588j426510j484566j285345j287868q83745
$$ 39011706 37168547 35296838 33799250 32372740 30888174 29602829 28314961 27431216
16665B7431216j475387q80134r84235j027783o01566j153681m51891p08185j027133
$$ 27431216 25955829 25075695 24091460 23063677 22462111 21308430 20856539 20148354 19121221
16656A9121221o80472o44816o88413m70567r49043m37116n0757r72216J1017o69426
$$ 19121221 18440749 17795933 17107520 16636953 15687910 15250794 15200037 14227821 14238838 13569412
16646A3569412l53679n92710k29364m80313l52091k61339m05531J8400o13317
$$ 13569412 13215733 12623023 12393659 11913346 11561255 11299916 10894385 10912785 10299468
16637A0299468k53214l45528j32638k08425k70661m52597j01615j90769j02360
$$ 10299468 10046254 9700726 9568088 9359663 9089002 8636405 8534790 8344021 8241661
16628H241661m92323K06136n02846J50402l82040q3394o6515m79451k4834j52113
$$ 8241661 7749338 7955474 7452628 7603030 7220990 7137596 7071081 6591630 6566796 6414683
16618F414683j91035j62023L3740j68627j14893N6035k53426m22659J78019J36304
$$ 6414683 6223648 6061625 6095365 5926738 5811845 5867880 5614454 5191795 5369814 5506118
16608E506118m51638k50187L23846k57006q8752Q8323l91513J80966j9171l39259
$$ 5506118 5054480 4804293 5128139 4871133 4782381 4870704 4479191 4660157 4640986 4301727
16598D301727J33274k16997j59708j95639O1429m25547K28957J4191k2454J08296
$$ 4301727 4435001 4218004 4058296 3862657 3924086 3498539 3727496 3741687 3719233 3827529
16588C827529l54664O3897k2753r4273r0354j47992o5745m3065O5404j63276j6640
$$ 3827529 3472865 3536762 3514009 3419736 3329382 3181390 3115645 3072580 3137984 2974708 2958068
16577B958068K26797j15725n10030M15310k50334Q6906J77055l63086j18032J94279
$$ 2958068 3184865 3069140 2559110 2974420 2724086 2810992 2988047 2624961 2506929 2701208
16567B701208j95694J16097p933j38124J53855l27717p2333M3993j6342k98779
$$ 2701208 2505514 2621611 2613678 2475554 2629409 2301692 2229359 2273352 2257010 1958231
16557A958231J56663L03057j08738j60121k39513P2088L41174k79901P0324J82545
$$ 1958231 2114894 2417951 2309213 2149092 1909579 1981667 2322841 2042940 2113264 2295809
16547B295809j05277j64138R9948m82072K2661L03107l66743J43316M7932O8270
$$ 2295809 2190532 2026394 2126342 1644270 1666931 1970038 1603295 1746611 1794543 1862813
16537A862813l54415L52776k60328k68313L61344j10101l1012k40767M58661k22915
$$ 1862813 1508398 1861174 1600846 1332533 1693877 1583776 1552764 1311997 1770658 1547743
16527A547743j25074O3669O8376J1154n2829o4177M02217m49367Q1202j51099
$$ 1547743 1422669 1486338 1554714 1565868 1513039 1448862 1851079 1401712 1482914 1331815
16517A331815K3117q7619j03929K05412k13166q1103L25190l11320M3869j78000
$$ 1331815 1354932 1267313 1163384 1368796 1155630 1074527 1399717 1088397 1132266 954266
16507I54266J17853O8259J51317l6115k92023l3884M45539j78585j09536M4770
$$ 954266 1072119 1140378 1291695 1255580 963557 929673 1375212 1196627 1087091 1131861
16497A131861M4896j08777j19406q4555O3852J09056J78099q2298j97515K43526
$$ 1131861 1176757 1067980 948574 864019 927871 1036927 1215026 1132728 935213 1178739
16487A178739j40533o0479p8651j86028L86267m4292q3894p8985j0011j93347
$$ 1178739 1038206 977727 899076 713048 1099315 1055023 971129 892144 882133 688786
16477F88786l3445K56879Q7982j44926j93577N4822K97910q0727m06182O059K12736
$$ 688786 655341 912220 1000202 855276 661699 716521 1014431 933704 527522 533581 746317
16466G46317n9190M34260m15434N32374n31187J04209m3387m4422K21112l83449
$$ 746317 687127 1121387 705953 1238327 707140 811349 767962 723540 944652 561203
16456E61203l5574J41886j57501R0246J47804P4399j53031n1809M8286L42348
$$ 561203 525629 667515 510014 600260 748064 822463 669432 617623 665909 1008257
16446A008257k90090J12304j80694J63916k08073L79115l28766j67692K46657
$$ 1008257 718167 830471 649777 813693 605620 984735 655969 488277 734934
16437G34934J13252k03402L1749j06583J4300O0954Q4081j45835k1996k260k58546
$$ 734934 848186 644784 676533 569950 584250 645204 729285 583450 561454 559194 300648
16426C00648J4934J91024j57968J88149k25995L07568J86169k24830k37429K97952
$$ 300648 315582 506606 348638 536787 310792 618360 804529 579699 342270 640222
16416F40222k65183j48572M75009Q8967l57709N9089j03506J76459j973O2676
$$ 640222 375039 226467 701476 790443 432734 491823 388317 564776 562803 625479
16406F25479k53564R9568L9830B41079N50835l28645M532J75139k11418A38836
$$ 625479 371915 471483 511313 241079 791914 463269 467801 642940 431522 138836
16395B02672J33129K83641r1046j26303P8540A50978L58846J62127J49180l06996
$$ 202672 335801 619442 528396 402093 480633 150978 509824 671951 821131 514135
16385E14135B12822L39298j44115j28120o014L64247o9396B31544K55847j11542
$$ 514135 212822 552120 408005 279885 273871 638118 568722 231544 487391 375849
16375C75849J23598J8359J27126j30186J27101l08697J61999M5417j91653l8468
$$ 375849 499447 517806 644932 514746 641847 333150 495149 540566 348913 310445
16365C10445M9760r259Q8291j71281L6528J64260L2677D5263J96033k1810K6243
$$ 310445 360205 350946 439237 267956 304484 468744 501421 45263 241296 219486 245729
16354B45729p5733J13384M0974o2585J92714J46122j66556j00533n3435K31195
$$ 245729 169996 283380 324354 261769 454483 600605 434049 333516 280081 511276
16344E11276A64474K36385J07341q6427R1003B46387J34391l4413L23847l09395
$$ 511276 164474 400859 508200 421773 512776 246387 380778 346365 670212 360817
16334C60817f0319E8160J34994J36607K26091B14371M61236B7963J57553H1367
$$ 360817 -60319 58160 193154 329761 555852 214371 675607 27963 185516 81367
16323D08890A92329J21234j01932m9022P0089K17032A94890K8677Q5074J60900
$$ 408890 192329 313563 211631 162609 232698 449730 194890 223567 308641 469541
16313D69541A39312f3846B69496J20568q0381m9537n31N8252K86173G9514K50615
$$ 469541 139312 -63846 269496 390064 309683 260146 259615 317867 604040 79514 330129
16302C30129J05588P6447A34211K73263k9944L3251j929b05435C93623K08212
$$ 330129 435717 512164 134211 407474 377530 410781 408852 -205435 393623 601835
16292F01835A05884K0776N35948B58791A19945J96519j53263J72222j32875K24942
$$ 601835 105884 126660 662608 258791 119945 316464 163201 335423 202548 427490
16282D27490j20774R3669j88580j3632D6020M16136A93031J69159A63267H1363
$$ 427490 306716 400385 211805 198173 46020 462156 193031 362190 163267 81363
16271C60823D8615L71867j58628L3437g4905A48949L51388G5990K44607n1105
$$ 360823 48615 420482 261854 295291 -74905 148949 500337 75990 320597 269492
16261B69492H682J05648j7579O9196d4820A21292J39312j16060j2526L59931k19422
$$ 269492 8682 114330 96751 165947 -44820 121292 260604 144544 132018 491949 272527
16250B72527A33728J57363o5631A11982R3366p6779b565B57750j06703J53658
$$ 272527 133728 291091 225460 111982 205348 128569 -2565 257750 151047 304705
16240C04705B3208b5773B10825j01904P5835P1134D3554N0222j3790J37761a2099
$$ 304705 23208 -25773 210825 108921 184756 255890 43554 93776 79986 217747 -12099
16228C16844K64034B12454G7695J83434e1396B51439r968a35072A82547G7972
$$ 316844 580878 212454 77695 261129 -51396 251439 241471 -135072 182547 77972
16217E14366a39074C39125o3652A11593J02785j3883B8663N55899d7071B1368
$$ 514366 -139074 339125 275473 111593 214378 200495 28663 584562 -47071 21368
16206D18723d7984j13239B0693b2239k210j68042E4141O3728J44990O5867G6611
$$ 418723 -47984 -161223 20693 -22239 -24449 -192491 54141 117869 262859 328726 76611
16194C58517a27609E35928B18112J30713b48450e4024m7884A73256O6032I4617
$$ 358517 -127609 535928 218112 348825 -248450 -54024 -101908 173256 239288 94617
16183A03251J13189J46798c9720o5588A27425B7168J23078a81176b8508k46F7378
$$ 103251 216440 363238 -39720 -105308 127425 27168 150246 -181176 -28508 -28754 67378
16171c836B23445a13304k2197j82294a33738G9530J47901m4079l8050J95008A30371
$$ -3836 223445 -113304 -135501 -317795 -133738 79530 227431 183352 145302 340310 130371
16159a11964j02444C18368e1992E42f2209b4842A51566n7178Q9984e06104b2161
$$ -111964 -214408 318368 -51992 542 -62209 -24842 151566 94388 184372 -506104 -22161
16147b3521A46865K28310r5781j37906R3864j07670J71637r4429a66848G6349
$$ -23521 146865 375175 279394 141488 235352 127682 299319 204890 -166848 76349
16136A19539N5383J40247a23036G3067B0920Q9104f1166A2911L80214c47306c3522
$$ 119539 174922 315169 -123036 73067 20920 110024 -61166 12911 393125 -347306 -33522
16124A65718D0617a25195p4199C52716n1541A34416F1206K68312J06961a63953
$$ 165718 40617 -125195 -199394 352716 301175 134416 61206 329518 436479 -163953
16113f607n8311B19608l5281b0195C3497J44039J52471A57690i0661a9783A16285
$$ -6607 -64918 219608 184327 -20195 33497 177536 330007 157690 -90661 -19783 116285
16101C24541c3616r3041A63952a70951A69060C5872J04633J34883a09989A73600
$$ 324541 -33616 -126657 163952 -170951 169060 35872 140505 275388 -109989 173600
16090F372c0854l5398A46054K38710H5682R8608b05785A43850f7931b2422l5914
$$ 6372 -30854 -66252 146054 384764 85682 184290 -205785 143850 -67931 -22422 -58336
16079e8336k8391A90090o6234m1446J29562q6694L1724b39163D6418a00194b0646
$$ -58336 -86727 190090 123856 82410 211972 125278 157002 -239163 46418 -100194 -20646
16067C58797g0130m2633C9405J53447c7336j95177C81984G808a9469j47820B1391
$$ 358797 -70130 -112763 39405 192852 -37336 -232513 381984 7808 -19469 -167289 21391
16055D8763J93405c04850A58689j3467a28402C6829P300J52623q524a02437L43
$$ 48763 242168 -304850 158689 145222 -128402 36829 44129 196752 188228 -102437 -102094
16044a02094b5637C05638B394a76358A04024B3729J48570g9418K0044j8530b5328
$$ -102094 -25637 305638 2394 -176358 104024 23729 172299 -79418 -59374 -77904 -25328
16032c14344J18335a8331r9149j57316B8002K01085a29959n258d3978n7786C8968
$$ -314344 -196009 -18331 -117480 -274796 28002 229087 -129959 -135217 -43978 -101764 38968
16020a83043a9731A79128A8766O7991B8178P0221b4634p2408k4185n1928B36073
$$ -183043 -19731 179128 18766 86757 28178 98399 -24634 -97042 -121227 -173155 236073
16008C3672c33016A26741a23473D0456b24293g2893A67875N8147a78567a6283
$$ 33672 -333016 126741 -123473 40456 -224293 -72893 167875 226022 -178567 -16283
15997a22209c016j93165G3334c9351B29490D5418g4988q087j21703A8810a31684
$$ -122209 -3016 -196181 73334 -39351 229490 45418 -74988 -83075 -204778 18810 -131684
15985a65494A28141i1762B47999h5810n197B9281b63479A80900A4617b07791e4813
$$ -165494 128141 -91762 247999 -85810 -91007 29281 -263479 180900 14617 -207791 -54813
15973G1014L736a39223K5909B79054A22709k9928J24744L6098J00398E4837N8998
$$ 71014 74750 -139223 -113314 279054 122709 92781 217525 253623 354021 54837 113835
15962A13835c27884I2254d03996c139l34222h2143p1465A19301f8671k2133A70664
$$ 113835 -327884 92254 -403996 -3139 -337361 -82143 -153608 119301 -68671 -90804 170664
15950B03910J37682j22406r9738a5013j92199B81681b61598i5406B18428r4442
$$ 203910 341592 219186 119448 -15013 -207212 281681 -261598 -95406 218428 123986
15940A23986b68097L6982E06365F2318J6477K5719b33173C2138i7930n0023M9652
$$ 123986 -268097 -231115 506365 62318 78795 104514 -233173 32138 -97930 -147953 -98301
15929i8301K2694c0799B6862K64386A394J04474Q6978L1729F3192O8914a65755
$$ -98301 -75607 -30799 26862 291248 1394 105868 192846 224575 63192 132106 -165755
15917A7455b1845j40528c7112G6522a59987A51461o4074l0789K12137c33371J26884
$$ 17455 -21845 -162373 -37112 76522 -159987 151461 87387 56598 268735 -333371 -206487
15906b06487B49129l5837b76206E6711g283A52611a75781B60723c7117a0920A05940
$$ -206487 249129 213292 -276206 56711 -7283 152611 -175781 260723 -37117 -10920 105940
15894b23456d9921m9168k28969i0576H0116a19809A76971b11583a6027j64132
$$ -223456 -49921 -99089 -328058 -90576 80116 -119809 176971 -211583 -16027 -180159
15884a80159C0376a41228I0997e3783j26225f4744A4794M3094a09939C53991h1945
$$ -180159 30376 -141228 90997 -53783 -180008 -64744 14794 57888 -109939 353991 -81945
15872a0574E6937J04216b41591D2581A4338a54706A32961d5341B68258a38355
$$ -10574 56937 161153 -241591 42581 14338 -154706 132961 -45341 268258 -138355
15861a34556A23182K9563f7773j80637C7283c76507a7436j80539A51420o5840
$$ -134556 123182 152745 -67773 -248410 37283 -376507 -17436 -197975 151420 85580
15851H5580b13919B35541G9326P0718b23342B13715a34452A8865b24223a01058
$$ 85580 -213919 235541 79326 150044 -223342 213715 -134452 18865 -224223 -101058
15840a13416B10031c62816a22539o9241R5722E0588j7322c381j38042o3236A9180
$$ -113416 210031 -362816 -122539 -191780 -96058 50588 33266 -3381 -141423 -204659 19180
15828A44315n6882b18694O9755M0195k3207B57767F371g7410A61621a89684q5601
$$ 144315 87433 -218694 -148939 -108744 -131951 257767 6371 -77410 161621 -189684 -275285
15817b75285d0673J4274j56560k2291C26767b31214P0860M6717j60015c61j02676
$$ -275285 -40673 -26399 -182959 -205250 326767 -231214 -160354 -113637 -273652 -361 -103037
15806a03037L4118r7555B01544i5787A39128b40445P2171F0844N4674c4126o4598
$$ -103037 -68919 -166474 201544 -95787 139128 -240445 -168274 60844 115518 -34126 -98724
15795i8724j36393A50374a18705f916l34195C068c9704A78448G3066I630O6308
$$ -98724 -235117 150374 -118705 -6916 -341111 3068 -39704 178448 73066 9630 75938
15784G5938b76313p8015M1547I2289k8413A6134Q5481n35g3989j06510Q0302B41245
$$ 75938 -276313 -354328 -312781 92289 63876 16134 101615 101080 -73989 -180499 -100197 241245
15771A61910k5708b80401C22111b8320J2470m08091J03705F6192a56208r2504
$$ 161910 136202 -280401 322111 -28320 -15850 -423941 -320236 66192 -156208 -248712
15761b48712A59463b21777F0084I580K7227f41731c09888F6056N5351a55379E2049
$$ -248712 159463 -221777 60084 9580 36807 -641731 -309888 66056 121407 -155379 52049
15749A66055f1744b5178k19896N2291B26824b34731H9081a72570C4919f9763F6731
$$ 166055 -61744 -25178 -245074 -192783 226824 -234731 89081 -172570 34919 -69763 66731
15737g6001B3010i3746n723A43410G1612A7624b19952j79421a07690d1033l23637
$$ -76001 23010 -93746 -99469 143410 71612 17624 -219952 -399373 -107690 -41033 -364670
15726c64670b3454B44525A06425g1178b7077E3132I121M3346J36536m0447R2390
$$ -364670 -23454 244525 106425 -71178 -27077 53132 9121 52467 189003 148556 240946
15715B40946N6496a58568d3000j05771c5307A37694g6668D5286N1019B6659J65786
$$ 240946 297442 -158568 -43000 -148771 -35307 137694 -76668 45286 96305 26659 192445
15704A92445a74497n2688C0828K8268f6505J1053j34644E7082b29365L4546A85920
$$ 192445 -174497 -227185 30828 59096 -66505 -55452 -190096 57082 -229365 -194819 185920
15692a462o1448b8159A62733a91869A11732E1126b19542N7454A74881b68925E409
$$ -1462 -62910 -28159 162733 -191869 111732 51126 -219542 -162088 174881 -268925 5409
15680a4030l0120j76934j24161N2954E3481d28871A09061r291C4419R7362a48243
$$ -14030 -44150 -221084 -345245 -292291 53481 -428871 109061 99770 34419 131781 -148243
15668a57080C4517d2636H4894k6125b89516A18714a60489j26154l3381a6860F4980
$$ -157080 34517 -42636 84894 58769 -289516 118714 -160489 -286643 -320024 -16860 64980
15656H8243A4820K87239e556j85123j61781G5093a96079r0048J8021k35195a45813
$$ 88243 14820 302059 -5556 -190679 -352460 75093 -196079 -286127 -268106 -503301 -145813
15644b53196P9285f556A430K02468H4935k5717a41065H6690J19356a43034a2336
$$ -253196 -173911 -6556 1430 203898 84935 59218 -141065 86690 206046 -143034 -12336
15632h917A17088a28703k09D6312M0792k7925a64719L6946j45367g1884B5128
$$ -8917 117088 -128703 -128912 46312 87104 59179 -164719 -127773 -273140 -71884 25128
15620D4959A9614a22500H8451a10170d0586q3553j20699J01859A65303g7392A32463
$$ 44959 19614 -122500 88451 -110170 -40586 -124139 -244838 -142979 165303 -77392 132463
15608D7924f2468j180G234M9838K30929a17354k06621J60869k0717d9691k60717
$$ 47924 -62468 -63648 7234 57072 288001 -117354 -323975 -163106 -183823 -49691 -310408
15597c10408i7548k62358J76918b9665j23798B09789a35358m3330H3026L9755
$$ -310408 -97548 -359906 -182988 -29665 -153463 209789 -135358 -178688 83026 122781
15587A22781a6202N182j25337E0065P4879M5111A5902K01219N5712A22186K7760
$$ 122781 -16202 -11020 -136357 50065 124944 170055 15902 217121 272833 122186 149946
15576A49946E9216b41826C63321G2107L633K42532A58931a12126H8069A0082c7377
$$ 149946 59216 -241826 363321 72107 75740 318272 158931 -112126 88069 10082 -37377
15564F0403c3598j26759D2108K15898A12877E1120j6597e4988A28647c5079k36805
$$ 60403 -33598 -160357 42108 258006 112877 51120 34523 -54988 128647 -35079 -271884
15553b71884f0597e690A7578f3125k3851A40027O5857a98207R6321j6514N1520
$$ -271884 -60597 -5690 17578 -63125 -86976 140027 205884 -198207 -101886 -118400 -66880
15542f6880B69095e7735h626A37595J81190a21246A11300C1710a9320m5849A71514
$$ -66880 269095 -57735 -8626 137595 318785 -121246 111300 31710 -19320 -65169 171514
15530g8180j3152j15812P0341K6990j22292b2464C11796j29941Q7159i0269E3421
$$ -78180 -91332 -207144 -136803 -109813 -232105 -22464 311796 181855 269014 -90269 53421
15518A27239a13749K8864j80420A70846N740G7763Q9457c35639D7834J72380b1984
$$ 127239 -113749 -84885 -265305 170846 176586 77763 167220 -335639 47834 220214 -21984
15506g7266l7667J6397D9475K9817g2395M20B1859K5025J3464c2919A0302J35208
$$ -77266 -114933 -98536 49475 79292 -72395 -71975 21859 46884 60348 -32919 10302 145510
15494A45510a48452a950E6598a70740G1661B792d6702A25424b0403k4101p6709
$$ 145510 -148452 -1950 56598 -170740 71661 2792 -46702 125424 -20403 -44504 -121213
15483a21213A00766D5493b74680A194c56900A2550L17597f1282j3684D4835a18750
$$ -121213 100766 45493 -274680 1194 -356900 12550 330147 -61282 -74966 44835 -118750
15471b24577E8013k1984a73615P0919a9739n0048A3741P650R2218a77587P6820
$$ -224577 58013 36029 -173615 -102696 -19739 -69787 13741 21391 113609 -177587 -100767
15460a00767c9527A90019a9043j65340k0520M2951f3224B76301a02102A01384
$$ -100767 -39527 190019 -19043 -184383 -204903 -161952 -63224 276301 -102102 101384
15449b37281A53577c14744E6184i2097B09065c54057a59899g2218j2415I715J42124
$$ -237281 153577 -314744 56184 -92097 209065 -354057 -159899 -72218 -84633 9715 151839
15438A51839L8694P7992o4822b384j17470D7337b9763k8661A24052a52819O0998
$$ 151839 190533 268525 203703 -2384 -119854 47337 -29763 -58424 124052 -152819 -91821
15427i1821r3759h674j75409k6728n5737M3816B03253J50814N1506g0272k0124
$$ -91821 -185580 -8674 -184083 -210811 -266548 -222732 203253 354067 405573 -70272 -90396
15416i0396C4274f3890B29228o1500D7621d8246O202A1878b294j06024A5972b7831
$$ -90396 34274 -63890 229228 167728 47621 -48246 -42044 11878 -2294 -108318 15972 -27831
15403A00453O5310A9175O2944e1950C042c6465B50717F6413L79251a01852n4446
$$ 100453 165763 19175 82119 -51950 3042 -36465 250717 66413 445664 -101852 -156298
15392a56298j39096C88977H0107b06755Q7981j48642Q2419p7771O9351c1382B43087
$$ -156298 -295394 388977 80107 -206755 -118774 -267416 -184997 -262768 -193417 -31382 243087
15380A30302b88948B03709K7a8706A7387M5902K9750c008j01574B00580E4720
$$ 130302 -288948 203709 203736 -18706 17387 63289 93039 -3008 -104582 200580 54720
15368A56058o8672N1960h9926B19600p9140A4857e7494k5828I175J4041d3573
$$ 156058 87386 139346 -89926 219600 140460 14857 -57494 -83322 9175 23216 -43573
15356a08415A58262a91076a0434j15396M3322A4110J4865K1763J6029M4221j4243
$$ -108415 158262 -191076 -10434 -125830 -82508 14110 28975 50738 66767 110988 96745
15345I6745a71437d7543m4275A62367b2072j3406k06926G3374b6487l63840G4062
$$ 96745 -171437 -47543 -91818 162367 -22072 -35478 -242404 73374 -26487 -390327 74062
15333A04723J16195C3720O8655K75187H9694J80826B0743a51110A66720b34848
$$ 104723 220918 33720 102375 377562 89694 270520 20743 -151110 166720 -234848
15322A98962e175j7269k00976h0523H7131M1971n0394c4032B6626a50299I8294
$$ 198962 -5175 -22444 -223420 -80523 87131 129102 78708 -34032 26626 -150299 98294
15310b9753B07346a17773A29755n2658a3542A43058b2365m1818A69622D2732c4307
$$ -29753 207346 -117773 129755 77097 -13542 143058 -22365 -64183 169622 42732 -34307
15298a02254K4538c4457C44026o1686i290D39208i8282L7861C44488b78355A08495
$$ -102254 -77716 -34457 344026 282340 -9290 439208 -98282 -60421 344488 -278355 108495
15286C45020c7937j8017A77312c20940A28340b98992A96009a46969k9290C07084
$$ 345020 -37937 -55954 177312 -320940 128340 -298992 196009 -146969 -176259 307084
15275B44732A09228N1509a78218a1385j93501n4337C33434a00839I7918b70503
$$ 244732 109228 160737 -178218 -11385 -204886 -259223 333434 -100839 97918 -270503
15264C67481b04246j11159e2617l8201A28110C3906Q4191j8289J25952G5263C4529
$$ 367481 -204246 -315405 -52617 -90818 128110 33906 118097 99808 225760 75263 34529
15252d6462Q817A9938a39918L3944D632J18057a27861A60681c05313A8174K03520
$$ -46462 -37645 19938 -139918 -105974 4632 122689 -127861 160681 -305313 18174 221694
15241B21694L8592r8114J90002B6781J75959k5575L75944j78810R68505N9519
$$ 221694 260286 162172 352174 26781 202740 177165 553109 374299 1342804 1402323
15231A402323k07824L93734p41314D13130n7563j70395K8109e7232l6926j18036
$$ 1402323 1194499 1588233 846919 413130 355567 185172 213281 -57232 -94158 -212194
15221b12194A02897K36057H7700R1988p6379M8148a34373A3066b4219B75605b59499
$$ -212194 102897 338954 87700 179688 103309 151457 -134373 13066 -24219 275605 -259499
15209B94697A11641b41442A19845B2530a85573A77700a71303e082A13930M3298
$$ 294697 111641 -241442 119845 22530 -185573 177700 -171303 -5082 113930 157228
15199A57228F8884l1439J960a7992B49528d31111a04889K733C86157c5845B7547
$$ 157228 68884 37445 39405 -17992 249528 -431111 -104889 -102156 386157 -35845 27547
15187A29772d607j37025J1293B24895A06727C0236a29109B2811c26480a23003
$$ 129772 -4607 -141632 -130339 224895 106727 30236 -129109 22811 -326480 -123003
15176A42821F6230B6947b10658D31074b57465D60053H2621j4533A6321J69479
$$ 142821 66230 26947 -210658 431074 -257465 460053 82621 68088 16321 185800
15166A85800f3529B4828a79058c8715C27915h0245o3206l88676c9831A56028j5481
$$ 185800 -63529 24828 -179058 -38715 327915 -80245 -143451 -532127 -39831 156028 140547
15155A40547k3412E2541m578J5013i8426C92191A16775a88033A9775K20858k7566
$$ 140547 117135 52541 47963 62976 -98426 392191 116775 -188033 19775 240633 213067
15144B13067a97168D45745j28719h1402B04551F8804K00174J43832A06088C1336
$$ 213067 -197168 445745 317026 -81402 204551 68804 268978 412810 106088 31336
15133b7758I0473L40253m633A1467N4475a29839I1568L2169a42633q1309A80217
$$ -27758 90473 430726 426093 11467 65942 -129839 91568 123737 -142633 -223942 180217
15121A41023K04095E8982K8922b66065a25638B26229H0611a30589A59334k2611
$$ 141023 345118 58982 87904 -266065 -125638 226229 80611 -130589 159334 136723
15111A36723E4330J74574A03785K36735K7150D1337J6548L97703j38047c9094
$$ 136723 54330 228904 103785 340520 367670 41337 57885 455588 317541 -39094
15100A34188C0427i277k32877B40074n2466F6818B5718J02311K9240D3950J66877
$$ 134188 30427 -9277 -242154 240074 187608 66818 25718 128029 157269 43950 210827
15089B10827H4599L37624a70498A15490a56545A2951K16767p9583B8008J49241
$$ 210827 84599 422223 -170498 115490 -156545 12951 229718 150135 28008 177249
15079A77249N794n0436e4164C59422M080l3519i0888r5606c9406B68627E1185
$$ 177249 183043 132607 -54164 359422 363502 329983 -90888 -186494 -39406 268627 51185
15067A83858M1997G4003L09356A19047J60201C8681J05688K1226b0566A26528
$$ 183858 225855 74003 383359 119047 279248 38681 144369 165595 -20566 126528
15056I0410K65149j47877L3131p7064E6399d0647B75607A33840c0292H7695a8203
$$ 90410 355559 207682 240813 163749 56399 -40647 275607 133840 -30292 87695 -18203
15044C18813A20514E0095J78635n4385E0697f5987M867N242C7639a0964I9474
$$ 318813 120514 50095 228730 174345 50697 -65987 -61120 -55878 37639 -10964 99474
15032C49800i819C0543K42715a27624B59705D5969i945A88397a77159Q1236H7146
$$ 349800 -9819 30543 273258 -127624 259705 45969 -9945 188397 -177159 -95923 87146
15020B86587m8556q1158p0923K18381A47176J75636p3602a98432A80393j3505
$$ 286587 238031 156873 85950 304331 147176 322812 249210 -198432 180393 166888
15010A66888O9578K2185C6871J55325L8315J81887A76083a60726C06080Q0325
$$ 166888 236466 258651 36871 192196 230511 412398 176083 -160726 306080 386405
15000C86405A09897L1812K26257C7748M9663K32046a66217B25397G5814P0284
$$ 386405 109897 141709 367966 37748 87411 319457 -166217 225397 75814 146098
14990A46098F1896M9723K29672j07235R0447h6533B30720l6641b1367F41682b3973
$$ 146098 61896 111619 341291 234056 324503 -86533 230720 194079 -21367 641682 -23973
14978B36391a25831C35339F6492P2201c5923j5134p1578J9450A8934P9768J73113
$$ 236391 -125831 335339 66492 138693 -35923 -51057 -122635 -103185 18934 98702 271815
14967B71815k2719g9474A76451J5560C7868J48561N5563J2617m8406J86421j18239
$$ 271815 249096 -79474 176451 192011 37868 186429 241992 254609 206203 392624 274385
14956B74385A22305f1983B71911R6715n8325K296h7542A78319M18459j93630a21192
$$ 274385 122305 -61983 271911 368626 310301 312597 -87542 178319 596778 403148 -121192
14944B2607K12615b01578a4232A95161M10627B19409K5738f8570a4470D04814
$$ 22607 235222 -201578 -14232 195161 605788 219409 245147 -68570 -14470 404814
14933A63764J85444p7387m5919J18730j48964J40552O3366A46561m9457J50878
$$ 163764 349208 271821 225902 344632 195668 336220 399586 146561 97104 247982
14923B47982q2812N5268o8178K39973j27184K1879j8899L51987A69979j9034a49856
$$ 247982 165170 220438 152260 392233 265049 286928 268029 620016 169979 150945 -149856
14911B15452Q1009g2135A95915j7061L2475I713J36190L34401B30033j0895o2669
$$ 215452 296461 -72135 195915 178854 211329 9713 145903 480304 230033 219138 156469
14900A56469a4556D07202j81799l7681J1219r1812L40892o5171j70372N9489K58145
$$ 156469 -14556 407202 225403 187722 198941 107129 448021 382850 212478 271967 530112
14889E30112r1294B07783K8426J19937A62228p598A1469K35863L7215O9218A36177
$$ 530112 438818 207783 236209 356146 162228 154630 11469 247332 284547 353765 136177
14877B32915j00249J961J51281L4079J0817m9044J7474K10958k40111L9464l581
$$ 232915 132666 134627 285908 319987 330804 281760 299234 510192 270081 309545 305964
14866C05964R9030A06555e8966A95548L12680A39794R3829b1928D84925A76763
$$ 305964 404994 106555 -58966 195548 508228 139794 233623 -21928 484925 176763
14855C22479M6009D0994b6918B02366n8582J63389K42774B08360M93066j11209
$$ 322479 368488 40994 -26918 202366 143784 307173 549947 208360 701426 590217
14845E90217B84876L61324A96783o1424n4554N15564L06462E3109M9387K57692
$$ 590217 284876 646200 196783 135359 80805 596369 902831 53109 102496 360188
14835C60188K73540A32720M66527B54244j9610J18789j54574J97613j35504A05786
$$ 360188 633728 132720 599247 254244 234634 353423 198849 396462 260958 105786
14824B00320K24730a01979B74505N0553L30687k05157J07735k47664J06722J0291
$$ 200320 425050 -101979 274505 325058 655745 450588 558323 310659 417381 427672
14814D27672L8588J87043k15662j02408A15176K95604J40143k2817M3303r907
$$ 427672 466260 653303 437641 335233 115176 410780 550923 528106 571409 561502
14804E61502J72870F3450K54524J55102J19737j08000O2925k3892K41267C54708
$$ 561502 734372 63450 317974 473076 592813 484813 547738 523846 765113 354708
14793C17290A31201N57972k24281j50122Q5016L95184A80697O2240J41634J13118
$$ 317290 131201 689173 464892 314770 399786 794970 180697 242937 384571 497689
14783D97689K46839A35147M81516B35460L27430J316k8521o7910j41876J80943
$$ 497689 744528 135147 616663 235460 562890 564206 535685 467775 325899 506842
14773E06842j99557j05229K76981J14975K19192j54222k33846M6408j60789K42974
$$ 506842 307285 202056 479037 594012 813204 658982 425136 471544 310755 553729
14763E53729A97933M88698k86541K09069O2778k36296p4924J11344j15607m205
$$ 553729 197933 686631 400090 609159 671937 435641 360717 472061 356454 352249
14753C52249J316J82824J42619k02710r0853M36996B06343L69051k77772M79667
$$ 352249 353565 536389 679008 476298 385445 822441 206343 575394 297622 777289
14743G77289j34261k46233n9076p0953K21087L23276j27803k02604j47584L27361
$$ 777289 643028 396795 337719 266766 487853 811129 683326 480722 333138 660499
14733F60499A88368M50184k67117L79898k43949J73186N7725r7087j76576K92561
$$ 660499 188368 638552 371435 751333 507384 680570 738295 641208 464632 757193
14723G57193K8503C59152M35199l47977R9428J11880J18957p5284J38902l24515
$$ 757193 785696 359152 794351 446374 545802 657682 776639 701355 840257 515742
14713E15742K67742J39742B85268K70600K48023q9049J9564K5454P3856j98087
$$ 515742 783484 923226 285268 555868 803891 714842 734406 759860 833716 635629
14703F35629N1432K0892L8613k74745L12426j78266P1858J87744k92538J27416
$$ 635629 687061 707953 746566 471821 784247 605981 677839 865583 573045 700461
14693G00461J15213j18987O9535l43336J56099k0722j1901P6851K12318l4382
$$ 700461 815674 696687 766222 422886 578985 558263 546362 623213 835531 801149
14683H01149j87082k9338K34011L72690E09027L13321K46689l63536J91313k37971
$$ 801149 614067 584729 818740 1191430 509027 822348 1069037 705501 896814 658843
14673F58843L01628j58093K53797k85170k05272L40575J8542j42852M7346j75076
$$ 658843 960471 802378 1056175 771005 565733 906308 924850 781998 829344 654268
14663F54268J25832K80324k64764K18633l87913K55613K38694n08917k0330L63124
$$ 654268 780100 1060424 795660 1014293 626380 881993 1120687 611770 591440 954564
14653I54564Q1889j48106j46668L3458K6501K08038J03772P8250P900o1349L18847
$$ 954564 1036453 888347 741679 775137 801638 1009676 1113448 1191698 1199598 1138249 1457096
14642A457096l12303J37414Q3911j65927m39934L37554Q6814J37161j63558j27735
$$ 1457096 1144793 1282207 1366118 1200191 760257 1097811 1184625 1321786 1158228 1030493
14632A030493J31356j72232r333j06009L10021j15988J38201k09350Q8892L7095
$$ 1030493 1161849 989617 980284 874275 1184296 1068308 1206509 997159 1086051 1123146
14622A123146K96667J24575n71110r7360M3110p2321L04893N5447J85161k24164
$$ 1123146 1419813 1544388 973278 875918 919028 846707 1151600 1207047 1392208 1168044
14612A168044k5377K9646j45974R9090j69270M37592K01377l77347R5042j26430
$$ 1168044 1142667 1172313 1026339 1125429 956159 1393751 1595128 1217781 1312823 1186393
14602A186393K95406O0995p4482l35059L00530j5348k47296m2321J28740P4054
$$ 1186393 1481799 1542794 1468312 1133253 1433783 1418435 1171139 1128818 1257558 1331612
14592A331612N41134l01701j70943j46439j3929Q9368K9114k58340M31407q9216
$$ 1331612 1872746 1571045 1400102 1253663 1239734 1329102 1358216 1099876 1531283 1442067
14582A442067n5127J02947j70669m7788M25125r2567n8559R1330n8029k2547j49839
$$ 1442067 1386940 1489887 1319218 1271430 1696555 1603988 1545429 1636759 1578730 1556183 1406344
14571A406344P7934J11902J66946o3650k1275J81274L28k15750M38517k99342
$$ 1406344 1484278 1596180 1763126 1699476 1678201 1859475 1859803 1644053 2082570 1783228
14561A783228K75474l98036J86442K69872j4161j63230J48964q3818n5049J61995
$$ 1783228 2058702 1660666 1847108 2116980 2102819 1939589 2088553 2004735 1949686 2111681
14551B111681J55317l6957M219K5486K56296M0906M1015M7605K04400N5002L37240
$$ 2111681 2266998 2230041 2234260 2259746 2516042 2556948 2597963 2645568 2849968 2904970 3242210
14540C242210M11800K69082M25469M65482J039063J932205K523117L704966O193627
$$ 3242210 3654010 3923092 4348561 4814043 5853106 7785311 10308428 14013394 20207021
14531B0207021J0587574k559884j0615213n635568m656910k695203j372600l06615
$$ 20207021 30794595 28234711 17619498 11983930 7327020 4631817 3259217 2952602
14523B952602p42127K80220k09835l21476j32478J44894o4660K32333m5359k6431
$$ 2952602 2210475 2490695 2280860 1959384 1826906 1971800 1907140 2139473 2094114 2067683
14513B067683l0176k6846Q4721L7450q9908L8149k57456K25724K00027J11160
$$ 2067683 2037507 2010661 2095382 2132832 2042924 2081073 1823617 2049341 2249368 2360528
14503B360528J09371N3979j98368L0714j78570K94323j24126J57913q6415k9941
$$ 2360528 2469899 2523878 2325510 2356224 2177654 2471977 2347851 2505764 2419349 2389408
14493B389408K20109L4568J01452j24731m4708j9301K10468n8180M18856l76870
$$ 2389408 2609517 2644085 2745537 2620806 2576098 2556797 2767265 2709085 3127941 2751071
14483B751071M68832k45519j29698p3969K60706J89842j2921k62973M3548J57109
$$ 2751071 3219903 2974384 2844686 2770717 3031423 3221265 3208344 2945371 2988919 3146028
14473C146028m086m9680K38564j57373J70349r9644P0005L06112k20419L5559
$$ 3146028 3141942 3092262 3330826 3173453 3343802 3244158 3314163 3620275 3399856 3435415
14463C435415j2338K58782p7241J87119o0373J26365k88678N18488k69767L9926
$$ 3435415 3423077 3681859 3604618 3791737 3731364 3857729 3569051 4087539 3817772 3857698
14453C857698J03815j90509r3904O27187J90758j12315p3292k7171K59057N9139
$$ 3857698 3961513 3771004 3677100 4304287 4495045 4382730 4309438 4282267 4541324 4600463
14443D600463l344Q5283J1662m4781j36803L33797J40146J01681j47122L83550
$$ 4600463 4597119 4682402 4694064 4649283 4512480 4846277 4986423 5088104 4940982 5324532
14433E324532j43510M0978L6590l91210L86740K68417k05463j54514L84669p1503
$$ 5324532 5181022 5222000 5258590 4867380 5254120 5522537 5317074 5162560 5547229 5475726
14423E475726K94393k14779O46563l70428J94872K3399k35346M02899j36364L0603
$$ 5475726 5770119 5555340 6201903 5831475 6026347 6049746 5814400 6217299 6080935 6111538
14413F111538L70844l05R9279M87203O1297m43398L87606J10565J41935j20703
$$ 6111538 6482382 6482077 6581356 7068559 7129856 6686458 7074064 7184629 7326564 7205861
14403G205861K52951K1346K38235o5854j29328M07191L8867J6492O688N54222
$$ 7205861 7458812 7480158 7718393 7652539 7523211 7930402 7969269 7985761 7992449 8546671
14393H546671L979J82668K43614L5828k4563K64302P5506J2295M36812J58999
$$ 8546671 8550650 8733318 8976932 9012760 8988197 9252499 9328005 9340300 9777112 9936111
14383I936111j03090J69383J09372N98717M7200R5095j16190J98879M65766J15185
$$ 9936111 9833021 10002404 10111776 10710493 10757693 10852788 10736598 10935477 11401243 11516428
14373A1516428N78239k00099N33266J46470J00574J29414Q5146N50706J36317
$$ 11516428 12094667 11894568 12427834 12574304 12674878 12804292 12889438 13440144 13576461
14364A3576461J22706M79444J62018J32927P89307j97407N80932J11119K88952
$$ 13576461 13699167 14178611 14340629 14473556 15262863 15065456 15646388 15757507 16046459
14355A6046459O78986P8146N59285K43590K64506L49243N97358N14378M85391
$$ 16046459 16725445 16803591 17362876 17606466 17870972 18220215 18817573 19331951 19817342
14346A9817342N07770J55103O55680J21259R16512J03117Q95950M2542O44157
$$ 19817342 20325112 20480215 21135895 21257154 22173666 22276783 23172733 23215275 23859432
14337B3859432Q79266M56832Q40531M95317O06784O15709Q76570R17704N23858
$$ 23859432 24738698 25195530 26036061 26531378 27138162 27753871 28630441 29548145 30072003
14328C0072003J030511P38899R58113J054235O20789J426754J070925P13121J260776
$$ 30072003 31102514 31841413 32799526 33853761 34474550 35901304 36972229 37685350 38946126
14319C8946126R70765J477631J289898J470808J405447J675622J292138J672677
$$ 38946126 39916891 41394522 42684420 44155228 45560675 47236297 48528435 50201112
14311E0201112J449286K065766J670867K126505J844471K385912K181905K314181
$$ 50201112 51650398 53716164 55387031 57513536 59358007 61743919 63925824 66240005
14303F6240005K544007K774170K844856L019183L093603L124638L723154M008220
$$ 66240005 68784012 71558182 74403038 77422221 80515824 83640462 87363616 91371836
14295I1371836L753425L965483M710344M601029N202835N386827N713809O141914
$$ 91371836 95125261 99090744 103801088 108402117 113604952 118991779 124705588 130847502
14287A30847502O316397P062826P062934P718702Q125562Q855897R198266R778268
$$ 130847502 137163899 144226725 151289659 159008361 167133923 175989820 185188086 194966354
14279A94966354J0670259J0695568J1436312J2392323J2742754J3389889J3653269
$$ 194966354 205636613 216332181 227768493 240160816 252903570 266293459 279946728
14272B79946728J4468137J4360567J4617752J4491457J4831750J4570708J4174692
$$ 279946728 294414865 308775432 323393184 337884641 352716391 367287099 381461791
14265C81461791J3515833J2758565J1947447J1045923R430917P598297N415590
$$ 381461791 394977624 407736189 419683636 430729559 440160476 447758773 453174363
14258D53174363J933884R65910J777021J474859m898227o844789o410180q171313
$$ 453174363 455108247 456074157 457851178 459326037 454427810 447583021 441172841 433001528
14250D33001528j1619485j2732922j3854805j4604763j5108225j5505290j4984644
$$ 433001528 421382043 408649121 394794316 380189553 365081328 349576038 334591394
14243C34591394j5103203j4889529j4432266j4145557j2983607j2789992j2839644
$$ 334591394 319488191 304598662 290166396 276020839 263037232 250247240 237407596
14236B37407596j2260822j1809828j1804933j0522935r891614r585584q658011
$$ 237407596 225146774 213336946 201532013 191009078 181117464 171531880 162873869
14229A62873869p999976p695879p206622o754460o592299n699859n513288m881528
$$ 162873869 154873893 147178014 139971392 133216932 126624633 120924774 115411486 110529958
14221A10529958n230539m361421m546786m178855l417965l698297l597784l211530
$$ 110529958 105299419 100937998 96391212 92212357 88794392 85096095 81498311 78286781
14213G8286781l084271k971093k397459l227783k386997k292625k326307j716068
$$ 78286781 75202510 72231417 69833958 66606175 64219178 61926553 59600246 57884178
14205E7884178j989066j858760k029464j691055j611982j564311j256444j293397
$$ 57884178 55895112 54036352 52006888 50315833 48703851 47139540 45883096 44589699
14197D4589699j546160j328096j151941j248705j023260r80734r75553j182667
$$ 44589699 43043539 41715443 40563502 39314797 38291537 37310803 36335250 35152583
14189C5152583r25893r33291o35812j044574p73151r28973p42749q09672o93921
$$ 35152583 34226690 33293399 32657587 31613013 30839862 29910889 29168140 28358468 27664547
14180B7664547n95917p04214p05176m76541p22256j79005q74529m89056n44405
$$ 27664547 27068630 26364416 25659240 25182699 24460443 24281438 23406909 22917853 22373448
14171B2373448n47663n13691m17792o59029m17270m05860l34258o12278m46622
$$ 22373448 21825785 21312094 20894302 20235273 19818003 19412143 19077885 18465607 18018985
14162A8018985q3562l59070m31337k15869k36285n42408q2473m45634l47926j88751
$$ 18018985 17935423 17576353 17145016 16929147 16692862 16150454 16067981 15622347 15274421 15085670
14152A5085670o10721L4987p43021L84097k27559n97915k19562j55177n137l25977
$$ 15085670 14474949 14509936 13766915 14151012 13923453 13325538 13105976 12950799 12945662 12619685
14142A2619685m76508j05254n20768M2190l9735l82m41650j72201j22576l88654
$$ 12619685 12143177 12037923 11517155 11559345 11519610 11519228 11077578 10905377 10782801 10394147
14132A0394147J0168m54685L74608m84580p5536L7542j22404l32807K941l20747
$$ 10394147 10404315 9949630 10324238 9839658 9764122 9801664 9679260 9346453 9349394 9028647
14122I028647O0622p5345k33446m06272L20697j34445l41607N6485N032l9916
$$ 9028647 9089269 9013924 8780478 8374206 8694903 8560458 8218851 8275336 8280368 8240452
14112H240452p08978l5663P7174j18561k33554J61894l6950j04140j93354k73123
$$ 8240452 7531474 7495811 7572985 7454424 7220870 7382764 7345814 7241674 7048320 6775197
14102F775197p5818k11456J37197k05216M49484l17191P4591n57242K28207N3045
$$ 6775197 6699379 6487923 6625120 6419904 6869388 6552197 6626788 6069546 6297753 6350798
14092F350798o80681K79149M43026m02612r1878m4252l01010k32766p9061j54522
$$ 6350798 5670117 5949266 6392292 5989680 5897802 5853550 5552540 5319774 5240713 5086191
14082E086191M08314m02231Q1149p6267K93932m44687k43228K58016j21472O4982
$$ 5086191 5494505 5092274 5173423 5097156 5391088 4946401 4703173 4961189 4839717 4904699
14072D904699j29528O9522l76788P8519n6857j81771l24490L71641j11713J43788
$$ 4904699 4775171 4844693 4467905 4546424 4489567 4307796 3983306 4354947 4243234 4387022
14062D387022N6005m39167K69014j06106j35453J38043m19068M11592k01675o7350
$$ 4387022 4443027 4003860 4272874 4166768 4031315 4169358 3750290 4161882 3960207 3892857
14052C892857j82064J69801l41025K78779j59401m0910p1862n9037J64463j99846
$$ 3892857 3710793 3880594 3539569 3818348 3658947 3618037 3546175 3487138 3651601 3451755
14042C451755M4019j30534k8441M05991m87450K84321l09761q3431j51482J46111
$$ 3451755 3495774 3365240 3336799 3742790 3255340 3539661 3229900 3146469 2994987 3141098
14032C141098M2188k40717K52988o7963j77866J07354J22001l21559K30177j15609
$$ 3141098 3183286 2942569 3195557 3127594 2949728 3057082 3179083 2857524 3087701 2972092
14022B972092N143l58771L64976q7793m25420L01913J71163l3507J06230m31317
$$ 2972092 2977235 2618464 2983440 2895647 2470227 2772140 2943303 2909796 3016026 2584709
14012B584709o7818J5635o0586K77977l32092r4881m7412p8455M49672l94859
$$ 2584709 2516891 2532526 2471940 2749917 2417825 2322944 2275532 2197077 2646749 2251890
14002B251890L46731l09112K27580P1960n94198J46233P7784M9061k40548J06505
$$ 2251890 2598621 2289509 2517089 2589049 1994851 2141084 2218868 2267929 2027381 2133886
13992B133886O3161r2510j81056J81789K89512l26208L20789l99092K7433K30409
$$ 2133886 2197047 2104537 1923481 2105270 2394782 2068574 2389363 1990271 2017704 2248113
13982B248113l16480K30144K44641m0943M74525K19712N92353J075237K320596
$$ 2248113 1931633 2161777 2406418 2365475 2840000 3059712 3652065 4727302 7047898
13973G047898L102822N722689J0411603K739676r486601o586343m491500j823055
$$ 7047898 10150720 15873409 26285012 29024688 19538087 12951744 8460244 6637189
13965F637189j670165n84166m46615m44207j83966l09869k39611Q9067J04876
$$ 6637189 4967024 4382858 3936243 3492036 3308070 2998201 2758590 2847657 2952533
13956B952533o94659K51982n6275r7582J05460l61156J42726J45753k65738j17229
$$ 2952533 2257874 2509856 2453581 2355999 2461459 2100303 2243029 2388782 2123044 2005815
13946B005815o2141n1795k43894L50612P5592l14511J25549k07752K72912k36277
$$ 2005815 1943674 1891879 1647985 1998597 2074189 1759678 1885227 1677475 1950387 1714110
13936A714110P5645K5938q5280j06160M03427j77940k47968n4733L05832j41404
$$ 1714110 1789755 1815693 1730413 1624253 2027680 1849740 1601772 1547039 1852871 1711467
13926A711467k71351J69094J32098j2759k85723j05858K29523j05643M13840j88601
$$ 1711467 1440116 1609210 1741308 1728549 1442826 1336968 1566491 1460848 1874688 1686087
13916A686087k24910k26989J66174K31451j8918k04014j07189K95290o4321K66526
$$ 1686087 1461177 1234188 1400362 1631813 1612895 1408881 1301692 1596982 1532661 1799187
13906A799187l92050m5254K5111k29376N65891l37231o781L0568j88539m7560
$$ 1799187 1407137 1361883 1386994 1157618 1723509 1386278 1379497 1410065 1221526 1173966
13896A173966j68015K74819J36525k60174K54210j27716k6049j2299Q4970K6849
$$ 1173966 1005951 1280770 1417295 1157121 1411331 1283615 1257566 1245267 1330237 1357086
13886A357086q1924k41808m4360J23356K04002R3108l21055n5200J65195N0808
$$ 1357086 1275162 1033354 988994 1112350 1316352 1409460 1088405 1033205 1198400 1249208
13876A249208p6002N7327j73934K15492m6085k0545K04291m91965R2400R9119
$$ 1249208 1173206 1230533 1056599 1272091 1226006 1205461 1409752 917787 1010187 1109306
13866A109306K38953k89468j17133J38432J00809m2648J40267j19142k06842J67298
$$ 1109306 1348259 1058791 941658 1080090 1180899 1138251 1278518 1159376 952534 1119832
13856A119832Q3449j42834L2814l2782k79516K18261J2403J51477J80422l79205
$$ 1119832 1203281 1060447 1093261 1060479 780963 999224 1011627 1163104 1343526 964321
13846I64321K5510J21694k8018p1266R0541m64334L40625J10825L316m2562j8139
$$ 964321 989831 1111525 1083507 1012241 1102782 638448 979073 1089898 1093214 1050652 1032513
13835A032513m40548K2272J78541K37008J05605j39087M4843j83031j92382K30828
$$ 1032513 591965 614237 792778 1029786 1135391 996304 1041147 858116 665734 896562
13825H96562J23035K09015m98096M16751k73612m7698K75991p9411k49103k8582
$$ 896562 1019597 1228612 730516 1147267 873655 825957 1101948 1022537 773434 744852
13815G44852K05610k02105j4240q1342L46003k80162K75389J9400l15375J46733
$$ 744852 950462 748357 734117 652775 998778 718616 994005 1013405 698030 844763
13805H44763J31482l53191k42481P05713k46206q3760k05959N74259j30480O7492
$$ 844763 976245 623054 380573 1086286 840080 756320 550361 1124620 994140 1061632
13795A061632k39866l38494K22064j66584L66843l24128L03685m17678M31356
$$ 1061632 821766 483272 705336 538752 905595 581467 885152 467474 898830
13786H98830r7999q105M1857r1402J21574l92335L52438j14416J46547p3547J18001
$$ 898830 800831 792726 834583 743181 864755 472420 824858 710442 856989 783442 901443
13775I01443j74284j22987B47063K93074k06692M37481k45998R9291L68977D37315
$$ 901443 727159 604172 247063 540137 333445 770926 524928 624219 993196 437315
13764H22594q4761k02629j10290J14417J84934R7317k32584L81754C28569L89927
$$ 822594 737833 535204 424914 539331 724265 821582 588998 970752 328569 718496
13754G18496k94110K18638k21059p2675q8082L35718K08846k84314K147J34034
$$ 718496 424386 643024 421965 349290 261208 596926 805772 521458 523605 657639
13744F57639j72297l3209o1802m3024J89115P6259j04684n5415J47027j20912
$$ 657639 485342 452133 390331 347307 536422 612681 507997 452582 599609 478697
13734D78697o4036P7399K97316A93943P06192B97946N2087J99314B72916L65020
$$ 478697 414661 492060 789376 193943 900135 297946 350033 549347 272916 637936
13724F37936L343K8956k52306K9028M33601C26121K1077J07746K36124m3135j77618
$$ 637936 641279 670235 417929 446957 880558 326121 347198 454944 691068 647933 470315
13713D70315j98545J13823P7659Q5468J97434C34398J06809L4924J95802j67483
$$ 470315 271770 385593 463252 548720 746154 334398 441207 476131 671933 504450
13703E04450N74689C98711K58211C15586l7284K61163Q0744m1901k09558K71070
$$ 504450 1079139 398711 656922 315586 278302 539465 620209 578308 368750 639820
13693F39820B77230K29315O5590B66909N42462k19834M7516A64968J49134J4263
$$ 639820 277230 506545 572135 266909 809371 589537 637053 164968 314102 328365
13683C28365J93764L3727L8297P8419B29821L62101J48885n0919j59335j61223
$$ 328365 522129 555856 594153 672572 229821 591922 740807 689888 530553 369330
13673C69330J34802p1203J67641j71547J80034j58574p4126A64201K47322j56960
$$ 369330 504132 432929 600570 429023 609057 450483 376357 164201 411523 254563
13663B54563P5344J39335m8464r9002J79443j40614L63518C07013O1334r8425
$$ 254563 329907 469242 420778 321776 501219 360605 724123 307013 368347 269922
13653B69922K78371m2504n0420o4324j29779M8193m070M29723j98527n4205M2099
$$ 269922 548293 505789 455369 391045 261266 309459 305389 735112 536585 482380 524479
13642E24479j14671L1856r7473l0330R9424A58407L37059j74387O1146J32614
$$ 524479 409808 441664 344191 313861 413285 158407 495466 321079 382225 514839
13632E14839j76223p6346L29705k18784m4168J34205j16965o0769k8144j11057
$$ 514839 338616 262270 591975 373191 329023 463228 346263 285494 257350 146293
13622A46293n4201K86088J42513p8457j37179J03865J7223m2077H3322K45260
$$ 146293 92092 378180 520693 442236 305057 408922 426145 384068 83322 328582
13612C28582K78850C00284J07169q5462q9501j7399L27985j49282D4741K45542
$$ 328582 607432 300284 407453 321991 232490 215091 543076 393794 44741 290283
13602B90283Q6222L1370l344K55039l19550j30198K83668j58446P2150j33621
$$ 290283 376505 407875 404531 659570 340020 209822 493490 335044 407194 273573
13592B73573L36728B72168N46698C33635r4556m6710M71752A30626J85049m8592
$$ 273573 610301 272168 818866 333635 239079 192369 664121 130626 315675 267083
13582B67083m9489m8663K87523R1475A08208L47541o0354M0904j91337L7680K25582
$$ 267083 217594 168931 456454 547929 108208 455749 395395 436299 244962 282642 508224
13571E08224H0368J86963j23564O11243C57617J1704j191j55003H5109M54883
$$ 508224 80368 267331 143767 755010 357617 369321 368130 213127 85109 539992
13561E39992j00092A37421M0268K33373A95837K58909J89319B91509p0689J1979
$$ 539992 439900 137421 177689 411062 195837 454746 644065 291509 220820 232799
13551B32799K16518A40389b5151A52821L20827a59857B08117R7648j04744j9869
$$ 232799 449317 140389 -25151 152821 473648 -159857 208117 305765 201021 181152
13541A81152P6965I6759O5721J46252e7584C65436r9611A17139j4243L42382k5284
$$ 181152 258117 96759 162480 308732 -57584 365436 265825 117139 102896 445278 419994
13530D19994j63732p8733J81721C9219M30063B31619m2545J33566K86153B42118
$$ 419994 256262 177529 359250 39219 469282 231619 189074 322640 608793 242118
13519D63252O3663B08156J24365J42670j94041A31320J37901K81370B52814d1607
$$ 463252 526915 208156 332521 475191 281150 131320 269221 550591 252814 -41607
13508D95049A05412K27594L7156I6572L62739j05254J68683j86326A07855K71842
$$ 495049 105412 333006 370162 96572 459311 354057 522740 336414 107855 379697
13498C79697A79328J33898r5219K62439j83835A17951K05685r1646K7919Q0563
$$ 379697 179328 313226 218007 480446 296611 117951 323636 231990 259909 340472
13488C40472A30262m6604J44699J71313A04274J69774M4787e0392A21336a31312
$$ 340472 130262 83658 228357 399670 104274 274048 318835 -50392 121336 -131312
13477a43698D30310j18714J18530a72620C03127a30430B11092J50940J2818j16441
$$ -143698 430310 311596 430126 -172620 303127 -130430 211092 362032 374850 258409
13467B58409R2156l0915q1121k2632a44391H0821M9262J20995K08811G2126J20416
$$ 258409 350565 319650 238529 215897 -144391 80821 130083 251078 459889 72126 192542
13456A92542N07497B16633F6312L38056A94321K19953B0064R9937K37838M4327
$$ 192542 700039 216633 66312 404368 194321 414274 20064 120001 357839 402166
13446D02166j2193j9668g4547B34850J96433m0048B9926h0706C9906L5974L51238
$$ 402166 389973 370305 -74547 234850 431283 391235 29926 -80706 39906 75880 427118
13435D27118L235j08304j03696M6730r457q6236J12853j6937L11891j81948D236
$$ 427118 430353 322049 218353 265083 255626 169390 282243 265306 577197 395249 4236
13423G4982N1947k3730j1892b3155C69952M6753h8480A04531a8101B71732A06822
$$ 74982 126929 103199 91307 -23155 369952 416705 -88480 104531 -18101 271732 106822
13411A22990J7025m4729J14580E7527o408a28458H7745J13714o360k8163J09708
$$ 122990 140015 95286 209866 57527 51119 -128458 87745 201459 195099 166936 276644
13400B76644e7353k41042C8006K15350j12357e7846H9998f8496b3846H2833K00217
$$ 276644 -57353 -298395 38006 253356 140999 -57846 89998 -68496 -23846 82833 283050
13389B83050a48941C74275P1678A94305a66053A1518J50028L82149F6676b7296
$$ 283050 -148941 374275 445953 194305 -166053 11518 161546 543695 66676 -27296
13378h2560D13942C5624a93420B64135k5712b40009B05778d373k4301C22388A15894
$$ -82560 413942 35624 -193420 264135 238423 -240009 205778 -4373 -28674 322388 115894
13366a34070A06536J67717K0940M9128j36791b5509B44513M2884j3698Q0051A70193
$$ -134070 106536 274253 295193 344321 207530 -25509 244513 287397 273699 353750 170193
13354C1168P532K66693r9872K38748A25374J45018l7066j07065J07266J8339Q1305
$$ 31168 38700 305393 205521 444269 125374 270392 233326 126261 233527 251866 333171
13343C33171A11510e2419F723J7344L5560j911J50161J17227O899A48517J39126
$$ 333171 111510 -52419 6723 24067 59627 57716 207877 325104 332003 148517 287643
13332B87643A32130J30770M8595A39209K8258k758E1944J82289j13422J98930
$$ 287643 132130 262900 311495 139209 167467 164709 51944 234233 120811 319741
13322C19741j51753K67201o4021j06504C5251J49428L61376B70336c31361A44357
$$ 319741 167988 435189 371168 264664 35251 184679 546055 270336 -331361 144357
13311A68984P8595r9698e6314A07270Q9408H0010J47531A00612J6041K65052e6047
$$ 168984 247579 147881 -56314 107270 196678 80010 227541 100612 116653 381705 -56047
13299D09639H5466m640J18680k3101B3865J20492J47061A10633K06289F2155O3223
$$ 409639 85466 80826 199506 176405 23865 144357 291418 110633 316922 62155 125378
13288A25378R4156j3845R345r9469k4886L6408K60439a2885B35498j1508f4780
$$ 125378 219534 205689 215034 115565 90679 127087 387526 -12885 235498 223990 -64780
13276B1532L45285I1683l387q669b8989F5166a3175k6149I4223J57591c6340A38216
$$ 21532 366817 91683 88296 79627 -28989 65166 -13175 -39324 94223 251814 -36340 138216
13263d5020A66418o5434O1769p8671C75M11518A92676P9131b86488D02877b28660
$$ -45020 166418 100984 162753 84082 375 411893 192676 271807 -286488 402877 -228660
13251I7843a4897I6047a6992l92649B04161G5892R335g6693A08442c4368C71938
$$ 97843 -14897 96047 -16992 -409641 204161 75892 85227 -76693 108442 -34368 371938
13239A83764J59489F7539c8603r469B47978j04357F1766L13582n7064A2798N5769
$$ 183764 343253 67539 -38603 -48072 247978 143621 61766 375348 318284 12798 68567
13228F8567a78448D68969a4742E5410i3811B60097B2838K8349N7021m7776L0086
$$ 68567 -178448 468969 -14742 55410 -93811 260097 22838 51187 108208 60432 90518
13217I0518K20406G9446R4459Q0882D0977K22852I0500a2248k46847B3652L02521
$$ 90518 310924 79446 173905 254787 40977 263829 90500 -12248 -259095 23652 326173
13206C26173G7012J40437o0090J31929j23823a15062a4320j3801B84897B557J84944
$$ 326173 77012 217449 157359 289288 165465 -115062 -14320 -28121 284897 2557 187501
13195A87501p2142k3744J12572a02716H1688O7572K46937r1109d0154D06812r9839
$$ 187501 115359 91615 204187 -102716 81688 149260 396197 305088 -40154 406812 306973
13184C06973n2116d918n7135A71689L0019n3795h7675B54507n7230a42967A27762
$$ 306973 254857 -4918 -62053 171689 201708 147913 -87675 254507 197277 -142967 127762
13172A7694c1105r725C6825R9874a6643p526C4199a77922A86236b0766A49790
$$ 17694 -31105 -40830 36825 136699 -16643 -24169 34199 -177922 186236 -20766 149790
13160A86645J68650j40527l7637J49377A00258g8076I0998D3128J16001Q8460
$$ 186645 355295 214768 177131 326508 100258 -78076 90998 43128 159129 247589
13150B47589b814n766B05105j01044M5546K8613d0800j59801C52996a55156K345
$$ 247589 -2814 -8580 205105 104061 149607 178220 -40800 -200601 352996 -155156 -152811
13139a52811A34471c4028B73454j33249D3779R1004b24183B60692F6417B3209
$$ -152811 134471 -34028 273454 140205 43779 134783 -224183 260692 66417 23209
13128A50889d2302C45055a79066A44147K5814o9287J98061A6752h6583p7610A76072
$$ 150889 -42302 345055 -179066 144147 169961 100674 298735 16752 -86583 -164193 176072
13116C43243r5935a4945A4694b5030I7752M9442c3235E161K77464o4234a79602
$$ 343243 247308 -14945 14694 -25030 97752 147194 -33235 5161 282625 218391 -179602
13104b9763k24782a13632e734C36899A25127b65262e7342A35535J11233a57951
$$ -29763 -254545 -113632 -5734 336899 125127 -265262 -57342 135535 246768 -157951
13093A44852K23331a36997D2951e1728A8282N4900a26483A52247m9635J74612
$$ 144852 368183 -136997 42951 -51728 18282 73182 -126483 152247 102612 277224
13083B77224H0519f1855A80734J85676q2695E7594f9872R884m04073G1109L5475
$$ 277224 80519 -61855 180734 366410 283715 57594 -69872 -59988 -464061 71109 106584
13072A06584B7397K32241e9458A56203o8208K09957D8774J034b03076F6349J50027
$$ 106584 27397 259638 -59458 156203 87995 297952 48774 49808 -203076 66349 216376
13061B16376G7794K15218a82835f4262C92567I4339g2348A69994j6638D5130b9127
$$ 216376 77794 293012 -182835 -64262 392567 94339 -72348 169994 153356 45130 -29127
13049D7259J0354J60706Q717L8164A09987K274K90547j27525M4849a94512B70133
$$ 47259 57613 218319 227036 265200 109987 112261 402808 275283 320132 -194512 270133
13037D9330J02737b23039N5094N9447K4435K960A22597C6862a33729k013d5859
$$ 49330 152067 -223039 -167945 -108498 -84063 -81103 122597 36862 -133729 -135742 -45859
13025A9704a6330j4518A56648F2493O1728a50819A11681c4830b795A58353E5548
$$ 19704 -16330 -30848 156648 62493 124221 -150819 111681 -34830 -2795 158353 55548
13013A28231J34942f0677B36455O2317j36533Q6221d13A88795b01176D34785b4283
$$ 128231 263173 -60677 236455 298772 162239 248460 -413 188795 -201176 434785 -24283
13001G2136L30918D9390a38044A62407L2405p0476m5496c9726m5354E5609c8275
$$ 72136 403054 49390 -138044 162407 194812 124336 78840 -39726 -85080 55609 -38275
12989D09352A89024i9948d7178I1029h8142A72754f5834A93753d6087D0898J64929
$$ 409352 189024 -99948 -47178 91029 -88142 172754 -65834 193753 -46087 40898 205827
12978B05827j8480O021a23004A46882O6870q4842a28804F2679B2076c27618k9206
$$ 205827 187347 193368 -123004 146882 213752 128910 -128804 62679 22076 -327618 -356824
12967c56824O7902A30290h2694d0980A26629N7791C7511a02867A72353J86152
$$ -356824 -288922 130290 -82694 -40980 126629 184420 37511 -102867 172353 358505
12957C58505b1877C41949A45974h5975j69928A66049n6069d9616B34702a17599
$$ 358505 -21877 341949 145974 -85975 -255903 166049 109980 -49616 234702 -117599
12946B30664B6360a9451k37370B53187A21462b0249E708J26494k9765f0846A14896
$$ 230664 26360 -19451 -256821 253187 121462 -20249 5708 132202 102437 -60846 114896
12934E6467i6308A81180b74997F8053B3021N7188L5590a55699H9148M0598n1752
$$ 56467 -96308 181180 -274997 68053 23021 80209 115799 -155699 89148 129746 77994
12923G7994j9119a70646A60332a33000k4652B3049r909P3731L9407J95124B1303
$$ 77994 58875 -170646 160332 -133000 -157652 23049 13140 86871 126278 321402 21303
12911C903L28092j18080c5660A12758c36235I6084a98502h6837r3908h1675j62199
$$ 3903 331995 213915 -35660 112758 -336235 96084 -198502 -86837 -180745 -81675 -243874
12900b43874f9220n7665D88518D4141J27311G1286M2702J23252B7992a8019N025
$$ -243874 -69220 -126885 488518 44141 171452 71286 113988 237240 27992 -18019 -12994
12889a2994G251J75864n7931K8703l0612B6313a03045B12283o3162N3327a21758
$$ -12994 7251 183115 125184 153887 123275 26313 -103045 212283 149121 202448 -121758
12877a72952A88177L8832A3734J69250k8002a17981d1923o5522J8159G7426d2893
$$ -172952 188177 227009 13734 182984 154982 -117981 -41923 -107445 -89286 77426 -42893
12865D58552B22144D5770a6318A76836E2681g8228o0352m1279A41054J15586e5794
$$ 458552 222144 45770 -16318 176836 52681 -78228 -138580 -179859 141054 256640 -55794
12853g8342D7900N6247O2097f1247B6136c41955A93463A9904R0563J46014a80804
$$ -78342 47900 104147 166244 -61247 26136 -341955 193463 19904 110467 256481 -180804
12841C64232I7538K57726a39418b4429B88686j07379q4311C5979L11206b0907
$$ 364232 97538 355264 -139418 -24429 288686 181307 96996 35979 347185 -20907
12830e6892q9492A76484b5141B96818C3461d0429G465b83782e6150R673A25214
$$ -56892 -146384 176484 -25141 296818 33461 -40429 7465 -283782 -56150 -46477 125214
12818c83305A09033Q1873a24995I3037f3983q0411G7001a87655H131b88956J13246
$$ -383305 109033 190906 -124995 93037 -63983 -144394 77001 -187655 8131 -288956 -175710
12807a75710P0389A03803C467L41046a24715o0107L6931Q100c1213A66699m8702
$$ -175710 -105321 103803 3467 344513 -124715 -184822 -147891 -139791 -31213 166699 117997
12796A17997n5955R3645J4143c42050f0665B72456b08836f2070q6870I7540a02528
$$ 117997 62042 155687 169830 -342050 -60665 272456 -208836 -62070 -148940 97540 -102528
12784a07484c9566B96528A22863O4211e2035A46058N7628a00617H5191J66314
$$ -107484 -39566 296528 122863 187074 -52035 146058 203686 -100617 85191 251505
12774B51505e1412A43335i0339F40850E9648a5926B21510a36550q2122A30764
$$ 251505 -51412 143335 -90339 640850 59648 -15926 221510 -136550 -218672 130764
12763a4214A29007c6545G9000L37829b1429A50749l4217J22504J04572a94542
$$ -14214 129007 -36545 79000 416829 -21429 150749 116532 239036 343608 -194542
12752a70841A20609c71044B11254r7939J367m5248a27529A42799a19171N0694
$$ -170841 120609 -371044 211254 113315 114682 69434 -127529 142799 -119171 -68477
12742f8477e342B78418L7646j33132G8164e3595l69820a15926D269J54154b722
$$ -68477 -5342 278418 316064 182932 78164 -53595 -423415 -115926 4269 158423 -2722
12730b61331D9928a98645A63234F2327h4998D1279L04430a24942B80260q6570
$$ -261331 49928 -198645 163234 62327 -84998 41279 345709 -124942 280260 193690
12720A93690q3885J17886C8160L4717o139J88365C2659J07906b245A44722O1707
$$ 193690 109805 227691 38160 72877 66738 255103 32659 140565 -2245 144722 206429
12709B06429k2144B5902b4160B54228a39634B45905a82987Q5555k67807f2230
$$ 206429 184285 25902 -24160 254228 -139634 245905 -182987 -97432 -365239 -62230
12698a46453A82832C7546f9259K662F6924d7867p3991A61004l7227P9939a47077
$$ -146453 182832 37546 -69259 -66597 66924 -47867 -121858 161004 123777 203716 -147077
12686C5629K57260m9758f3830k13550A38588N87260B61369o5303B9835b2922p7040
$$ 35629 292889 243131 -63830 -277380 138588 725848 261369 196066 29835 -22922 -99962
12675i9962j2223j46157H1248A042R727J68888g5070A01440R9585K7674j05869
$$ -99962 -112185 -258342 81248 1042 10769 179657 -75070 101440 201025 228699 122830
12664A22830J27063o0017K10455A23231l4094D3328j0834d0109A18680b59774
$$ 122830 249893 189876 400331 123231 89137 43328 32494 -40109 118680 -259774
12653b21656J07354G6666b3510m3847B05336e053B89268h4528j99628B52076j24871
$$ -221656 -114302 76666 -23510 -67357 205336 -5053 289268 -84528 -284156 252076 127205
12642A27205K15394a18173A00102C9736b28239B74508A28520n6746a61768O0253
$$ 127205 342599 -118173 100102 39736 -228239 274508 128520 71774 -161768 -101515
12632a01515j03866b1331k34789F7259P2988a29099A5283a09537A49110c43497
$$ -101515 -205381 -21331 -256120 67259 140247 -129099 15283 -109537 149110 -343497
12621F5382J72806C9987b60021B5316K63566a19838D19875A68372J50685O1267
$$ 65382 238188 39987 -260021 25316 288882 -119838 419875 168372 319057 380324
12611C80324A3749K85141A33460K57766n0282A68254N9752K7716n3249O9896q1586
$$ 380324 13749 298890 133460 391226 340944 168254 228006 255722 202473 272369 190783
12600A90783c6108B53940a40120B12992C504L00127a87915A4012L0155b4571B7788
$$ 190783 -36108 253940 -140120 212992 3504 303631 -187915 14012 44167 -24571 27788
12588a83466A80690J89715b108G4952J32768m441c5651A11267a5435I5329J36333
$$ -183466 180690 370405 -2108 74952 207720 203279 -35651 111267 -15435 95329 231662
12577B31662a19740A59414J39530A04629a12671L4087A19606a53277d8618B47814
$$ 231662 -119740 159414 298944 104629 -112671 -78584 119606 -153277 -48618 247814
12566b07394B04375b24037C8967b11874B5458a72946c4940B02072p8426o0238
$$ -207394 204375 -224037 38967 -211874 25458 -172946 -34940 202072 123646 63408
12556F3408R2262c87087a62017c4724G134J50677d1463F4923l0052K21156m512
$$ 63408 155670 -387087 -162017 -34724 7134 157811 -41463 64923 34871 256027 251515
12545B51515d1116j84736E4906L7444Q328e0180l22880A84237q5071j4287Q8741
$$ 251515 -41116 -225852 54906 92350 100678 -50180 -373060 184237 99166 84879 173620
12534A73620c36960i7625C12002B8555a45800C98811A72474g145G4405l0335a82074
$$ 173620 -336960 -97625 312002 28555 -145800 398811 172474 -7145 74405 44070 -182074
12522c3394k61235E3881J32784p4125A4999K92468O6624j04574j30131P8186P7783
$$ -33394 -294629 53881 186665 112540 14999 307467 374091 269517 139386 217572 295355
12511B95355a5691L425n4151l81061H5635c9976N356j18669k0114H4174l9278
$$ 295355 -15691 -12266 -66417 -447478 85635 -39976 -34620 -153289 -173403 84174 44896
12500D4896B598d2639F0441L37540l9066a38365m7027C69317d725A58526c39489
$$ 44896 2598 -42639 60441 397981 358915 -138365 -185392 369317 -4725 158526 -339489
12488c9063l1427C67052e6227A51440c65194C3359N7933L28152a79982A86000
$$ -39063 -70490 367052 -56227 151440 -365194 33359 91292 419444 -179982 186000
12477h023A50814a89468E7257L0320J31257J69249A81436J31784A2291M9792J79129
$$ -8023 150814 -189468 57257 87577 218834 388083 181436 313220 12291 62083 241212
12466B41212C6759M3172d74548D2109a80200n3719A4106b33622C7940c8501k31694
$$ 241212 36759 79931 -474548 42109 -180200 -233919 14106 -233622 37940 -38501 -270195
12455b70195k241e7m2353l4127A8129b3154j36938A61102a26273B79879B7030
$$ -270195 -272436 -57 -42410 -76537 18129 -23154 -160092 161102 -126273 279879 27030
12443E8735g4551c142k07093L6230A58608D527a13352M2679B23417a3514n3040
$$ 58735 -74551 -3142 -210235 -174005 158608 4527 -113352 -70673 223417 -13514 -66554
12432f6554J9186B66427b1122A26238e7232k7302k8672b5133I4133D624a5900
$$ -66554 -47368 266427 -21122 126238 -57232 -84534 -113206 -25133 94133 4624 -15900
12420f0659L512j60554l2173g3750A80586b42736A06975e9881k0448c3376A6184
$$ -60659 -57147 -217701 -249874 -73750 180586 -242736 106975 -59881 -80329 -33376 16184
12408a67087j1303C1213L29791j53911g6483j07865B66743r4550H4895a38689
$$ -167087 -178390 31213 361004 207093 -76483 -184348 266743 172193 84895 -138689
12397C6755a1075B5323N5286q761a29778K9667K7565m2392B0191a66890K6142
$$ 36755 -11075 25323 80609 71848 -129778 -100111 -72546 -114938 20191 -166890 -140748
12386a40748C28013C9920N39255A1233a1954D04141A4803N3075f8740A93069i6896
$$ -140748 328013 39920 579175 11233 -11954 404141 14803 67878 -68740 193069 -96896
12374B32052r836G0227E005K12652k3429i3196H5848a714B4592i702I3178r270
$$ 232052 222216 70227 5005 217657 194228 -93196 85848 -1714 24592 -9702 93178 83908
12362H3908N5616i4569j34205B81359a23569E4892J63563E152J6004Q1680i1124
$$ 83908 139524 -94569 -228774 281359 -123569 54892 218455 5152 21156 102836 -91124
12350a42325H9302b07414D4530h6937l85432F2837a36593f1510G4560K14605D4061
$$ -142325 89302 -207414 44530 -86937 -472369 62837 -136593 -61510 74560 289165 44061
12338a39684A33516b6139k18354B5103b59412a4938C15544A08455b85175b1624
$$ -139684 133516 -26139 -244493 25103 -259412 -14938 315544 108455 -285175 -21624
12327a19165C11971F0342N5431N0263h4341F9635a1620A38528g3639A15507A4996
$$ -119165 311971 60342 115773 166036 -84341 69635 -11620 138528 -73639 115507 14996
12315F0261J05471E8783J78374D4539a41630G066g9990o0692G863K09088a88514
$$ 60261 165732 58783 237157 44539 -141630 7066 -79990 -140682 7863 216951 -188514
12303B63405A12192L6157D1133L7872b06602J5278B69940R73g7647B38956C0377
$$ 263405 112192 148349 41133 79005 -206602 -191324 269940 270913 -77647 238956 30377
12291A08702a22765p108e4513q868H1400B9974c2794k65571c5813k44051R5071
$$ 108702 -122765 -129873 -54513 -63381 81400 29974 -32794 -298365 -35813 -279864 -184793
12280a84793k3636p1714B1528g2068K7662A43896m4069L30434F556g6407j41411
$$ -184793 -208429 -280143 21528 -72068 -44406 143896 99827 430261 6556 -76407 -217818
12269b17818B66980H0912a44631B20036l5389J71104C2480i6392r9996A8677b4845
$$ -217818 266980 80912 -144631 220036 184647 355751 32480 -96392 -196388 18677 -24845
12257A26163Q6025F4941J43558H7403a62553E7277J98417A24364e5250C9277c3973
$$ 126163 212188 64941 208499 87403 -162553 57277 255694 124364 -55250 39277 -33973
12245B10273g2817A57509b30822b6222k4901B53603M4980A19552R7734h6785B7152
$$ 210273 -72817 157509 -230822 -26222 -51123 253603 298583 119552 217286 -86785 27152
12233a90746F4000l05K06911j28759a90795K2782a3718p7374b2994r9993M2137
$$ -190746 64000 63695 270606 141847 -190795 -168013 -13718 -91092 -22994 -122987 -80850
12222h0850a3136p654A29592K04276K05318A17261L4747L60091j65994b30256
$$ -80850 -13136 -20790 129592 333868 539186 117261 152008 512099 346105 -230256
12211C26371K1689A26768i8164A78994B1468J3155M05034b6844k17438C27915
$$ 326371 348060 126768 -98164 178994 21468 34623 439657 -26844 -244282 327915
12200A44222g0384A48261b12308A10353J69865h4025G3686L57640h3604j86708
$$ 144222 -70384 148261 -212308 110353 280218 -84025 73686 431326 -83604 -270312
12190b70312B53990r9590J35330K0166a6147E7501J14976g8751E44979b5624C12799
$$ -270312 253990 154400 289730 309896 -16147 57501 172477 -78751 544979 -25624 312799
12178C28042D3508k168K43792j05391N2124C3650P7083J079m447a26256b4092
$$ 328042 43508 41340 285132 179741 231865 33650 110733 111812 107365 -126256 -24092
12166c7743A10637K1856e1607F8733c6390F5276J98565J4033b43315A9510C206
$$ -37743 110637 132493 -51607 68733 -36390 65276 263841 277874 -243315 19510 3206
12154G0382H149O2250c45045B05700I5939N64537g4253l0393l1146j66756L05
$$ 70382 8149 70399 -345045 205700 95939 660476 -74253 -104646 -135792 -302548 -302243
12143c02243C00181A28276a45287E287K48471I2403N5711O5777H5317P7522e9013
$$ -302243 300181 128276 -145287 5287 253758 92403 148114 213891 85317 162839 -59013
12131B35490B3109J95518c93A28919b10636h4725B42941a85918P2002H7782i2775
$$ 235490 23109 218627 -393 128919 -210636 -84725 242941 -185918 -113916 87782 -92775
12119F9695q071O3709C7539f0611A67533E1845e2899j46615g9785A56820F8221
$$ 69695 61624 125333 37539 -60611 167533 51845 -52899 -199514 -79785 156820 68221
12107A76530p0163M0720i9046M4257A69443k0948R8031H4118N6011a98046A81788
$$ 176530 106367 147087 -99046 -54789 169443 148495 246526 84118 140129 -198046 181788
12095A18282A1456K77019b05860B34603i96A46790L6586G829b206A61950b06046
$$ 118282 11456 288475 -205860 234603 -996 146790 183376 7829 -2206 161950 -206046
12083A0443J38294K63652c93247A78257b74269b4243j6863B36927i5113k5830
$$ 10443 148737 412389 -393247 178257 -274269 -24243 -41106 236927 -95113 -120943
12073a20943A0512a18998J8677j11012A90027p8609b77916J36977D0051a10173
$$ -120943 10512 -118998 -100321 -211333 190027 111418 -277916 -140939 40051 -110173
12062i0459H3927K05434c42051J08400l46692B35748L82883K09627l55065J42152
$$ -90459 83927 289361 -342051 -233651 -580343 235748 618631 828258 473193 615345
12052F15345E1240a036q7529K0663B44637g004H6802J79218A12222c0679l2886
$$ 615345 51240 -1036 -88565 -67902 244637 -7004 86802 266020 112222 -30679 -63565
12041f3565B2153b9098k05373B83019A34275Q1O0312d4437G7353j3865c99564
$$ -63565 22153 -29098 -234471 283019 134275 134356 194668 -44437 77353 63488 -399564
12029A95542d4756k22826R4170A25073m4716b28249k46329b19153k49560b16500
$$ 195542 -44756 -267582 -173412 125073 80357 -228249 -474578 -219153 -468713 -216500
12018A79373h921j95960A67128a33951A60268f6954m88114a48913D0238h9218
$$ 179373 -8921 -204881 167128 -133951 160268 -66954 -555068 -148913 40238 -89218
12007c6065H265b27621A73841d46512G6537h6486B7987b2935j96596B90882a1463
$$ -36065 8265 -227621 173841 -446512 76537 -86486 27987 -22935 -219531 290882 -11463
11995a35774G025a33146m2477L4802L0948C73436a49782A7673b38083a14151B60356
$$ -135774 7025 -133146 -175623 -140821 -109873 373436 -149782 17673 -238083 -114151 260356
11983a02093b5117B2580a16017A46505H175i5719d6459B27126d94728a67515b9455
$$ -102093 -25117 22580 -116017 146505 8175 -95719 -46459 227126 -494728 -167515 -29455
11971B24464a25786E1372K85905a71580A30327b71665D4020b0879G7187a03880
$$ 224464 -125786 51372 337277 -171580 130327 -271665 44020 -20879 77187 -103880
11960a64924C9250P208d752j62821Q968A29377J00290a73023e699A6494J78902
$$ -164924 39250 46458 -4752 -167573 -158605 129377 229667 -173023 -5699 16494 195396
11949A95396a58815F8014c3134A45847F2551A8983a19986p9626l3948n2428a06502
$$ 195396 -158815 68014 -33134 145847 62551 18983 -119986 -199612 -233560 -285988 -106502
11937a19126a115A24580l0448f0646A25335M5961a66131D9339a0744j76739B67400
$$ -119126 -1115 124580 94132 -60646 125335 171296 -166131 49339 -10744 -187483 267400
11925B30196c9176E9158b29709Q0574f7201o9282d6979A19409m4294d32216A01119
$$ 230196 -39176 59158 -229709 -149135 -67201 -136483 -46979 119409 75115 -432216 101119
11913b9101j882l18166J03999d7447C28073d0587l0897k39551a31231j67571B29919
$$ -29101 -30983 -349149 -245150 -47447 328073 -40587 -71484 -311035 -131231 -298802 229919
11901C8471R5926a27012j27355a12468o9356A03318e2849j60357p7710f8800A45382
$$ 38471 134397 -127012 -254367 -112468 -181824 103318 -52849 -213206 -290916 -68800 145382
11889c45054F3620g3646n3819B80822g188k6451p8558L8174D9038b060F8736a93676
$$ -345054 63620 -73646 -127465 280822 -7188 -33639 -112197 -74023 49038 -2060 68736 -193676
11876I3274a58416b5317B75206D167a70718B32871a10676D8079a5060A1425c79486
$$ 93274 -158416 -25317 275206 4167 -170718 232871 -110676 48079 -15060 11425 -379486
11864e1072n725B3758a03208l39360F0081J49890a15253k68888C38261A66301
$$ -51072 -56797 23758 -103208 -442568 60081 209971 -115253 -384141 338261 166301
11853a67675g5792j15610i060m636m9506k69437a34334L0490I472L08446k3413
$$ -167675 -75792 -191402 -9060 -13696 -63202 -332639 -134334 -103844 9472 317918 294505
11842B94505a71825O0800c1274E5726h4730D9608a8242A52678F7068a79452A65822
$$ 294505 -171825 -111025 -31274 55726 -84730 49608 -18242 152678 67068 -179452 165822
11830a9549E1280l702e5914l08042R8521A09912j2557c78609a47098j01778i062
$$ -19549 51280 47578 -55914 -363956 -265435 109912 97355 -378609 -147098 -248876 -9062
11818B34006b45160p7780A17219h0225o9628k48765e4118a6797G3634J42321c72579
$$ 234006 -245160 -322940 117219 -80225 -149853 -398618 -54118 -16797 73634 215955 -372579
11806a09488b9478l02B21753B4779c34103J22338P5585J6937D25P107f6262G6208
$$ -109488 -29478 -29780 221753 24779 -334103 -211765 -136180 -119243 425 7532 -66262 76208
11793A715a12883b1564j3861j89642j5185Q5010o8853D16425a97736b2818k43381
$$ 1715 -112883 -21564 -35425 -225067 -240252 -155242 -224095 416425 -197736 -22818 -266199
11782b66199B5552a49893m8067m5980C9665q534a42181B3454g5173b770j00267
$$ -266199 25552 -149893 -197960 -243940 39665 31131 -142181 23454 -75173 -2770 -103037
11771a03037b1369k34507g6432B52876g2185A11837a05162b340A72199D3015J58441
$$ -103037 -21369 -255876 -76432 252876 -72185 111837 -105162 -2340 172199 43015 201456
11760B01456J46857A12544a55221c2609n2923o1030j89647G8387L3649C3358i1724
$$ 201456 348313 112544 -155221 -32609 -85532 -146562 -336209 78387 112036 33358 -91724
11748C93225c03426b3733j16844C66414a09277j48035J22062m7814I5523R5448
$$ 393225 -303426 -23733 -140577 366414 -109277 -257312 -135250 -183064 95523 190971
11738A90971a03909k06373B00209d1089E0558a8432a416H12J10032a7643j0558
$$ 190971 -103909 -310282 200209 -41089 50558 -18432 -1416 812 110844 -17643 -28201
11727b8201m8740j88019a6992C1904j5534f742D2500p993a59176A7618R3621N4943
$$ -28201 -76941 -264960 -16992 31904 16370 -6742 42500 34507 -159176 17618 111239 166182
11715A66182Q4411a71751B25796b14925f4661B59983c74j17592e2315n6896d7774
$$ 166182 250593 -171751 225796 -214925 -64661 259983 -374 -117966 -52315 -109211 -47774
11703A02374i8759I4250a8240o7676n2345D2630a15274K5976A64977d0358B09308
$$ 102374 -98759 94250 -18240 -85916 -138261 42630 -115274 -89298 164977 -40358 209308
11691h8357B12807C5609K3722J14071h5866A99940A9827b60284k07177A39282
$$ -88357 212807 35609 59331 173402 -85866 199940 19827 -260284 -467461 139282
11680B04775b00217B98316A0917R487b9559A97668I6920l5293b6857D03215A89708
$$ 204775 -200217 298316 10917 20404 -29559 197668 96920 61627 -26857 403215 189708
11668G8070a06928K6556A18501b7972H0127B819N7666A8395K84798D5692J31116
$$ 78070 -106928 -80372 118501 -27972 80127 2819 60485 18395 303193 45692 176808
11657A76808m2629i829l27216e3878q1925l8012L0397N953a8396B30949b15262
$$ 176808 134179 -9829 -337045 -53878 -135803 -173815 -143418 -137465 -18396 230949 -215262
11645e3165A33681d6424G1210c6868k30942A7197a07277E4681e0323r4963d7973
$$ -53165 133681 -46424 71210 -36868 -267810 17197 -107277 54681 -50323 -145286 -47973
11633H7139a40667A43439c2455B97639B938f8654l32067g7421q7990j46246A79804
$$ 87139 -140667 143439 -32455 297639 2938 -68654 -400721 -77421 -165411 -311657 179804
11621b38213B6008P3384D3922J45946l7393d5421k24951I039a42980G8327b61215
$$ -238213 26008 99392 43922 189868 152475 -45421 -270372 9039 -142980 78327 -261215
11609b53368J12374B42360a96624j80858A33624a54209A83261b30913j5265f0701
$$ -253368 -140994 242360 -196624 -377482 133624 -154209 183261 -230913 -246178 -60701
11598d5169j06587J600j156B93075b52132J25312A23246a24973e5857l56079a63199
$$ -45169 -151756 -150156 -151312 293075 -252132 -126820 123246 -124973 -55857 -411936 -163199
11586A3839f1588G7452N877O8620a18012r4784k3892N4683A31179h5669B30714
$$ 13839 -61588 77452 83329 151949 -118012 -212796 -236688 -182005 131179 -85669 230714
11574C30852j29851N4236k5389F5741a18811a4672n7504p5772A87486m9069M183
$$ 330852 201001 255237 229848 65741 -118811 -14672 -72176 -147948 187486 138417 142600
11563A42600B8865b91406C4364C095K89161G9343J22119a19417A9617i7157B00848
$$ 142600 28865 -291406 34364 3095 292256 79343 201462 -119417 19617 -97157 200848
11551h5566l62804A51493a20136B41969C3454a67563e6759A27383e5512H7545
$$ -85566 -448370 151493 -120136 241969 33454 -167563 -56759 127383 -55512 87545
11540a56254j4613k7890Q4749A1301L2682J13756R6385r4792b84019I5293a9462
$$ -156254 -170867 -198757 -114008 11301 43983 157739 254124 159332 -284019 95293 -19462
11528d7925k75035A4192d2301C110d9538p7775l8040B87814A16381K44150A58219
$$ -47925 -322960 14192 -42301 3110 -49538 -127313 -165353 287814 116381 360531 158219
11516B57396q8505J11541G7574c42280a04454A36124Q2659j07781J12847a327
$$ 257396 168891 280432 77574 -342280 -104454 136124 218783 111002 223849 -1327
11505B43458P643m8890C6394N2561K29234G141a38580B00291N0419a0796B7922
$$ 243458 251101 202211 36394 88955 318189 7141 -138580 200291 250710 -10796 27922
11493A2559M25662F8958c16901f232j18380A12406E1932J31347q6214M25429e1900
$$ 12559 438221 68958 -316901 -6232 -124612 112406 51932 183279 97065 522494 -51900
11481C17999O5578j13892a7722n1922j5176C79367k5694j14155G76L05292n7461
$$ 317999 383577 269685 -17722 -69644 -84820 379367 353673 239518 776 306068 248607
11470B48607b8345B99266e5610j8260B50621k6204q4969F2549b3002j4279a6660
$$ 248607 -28345 299266 -55610 -73870 250621 224417 139448 62549 -23002 -37281 -16660
11458B30879m574a29444I1800a32820I7749O8235A1177J84013b7512A55271O0011
$$ 230879 226305 -129444 91800 -132820 97749 165984 11177 195190 -27512 155271 215282
11447B15282g5336E41929A285P1073J30170a08471j70014J23784G9006n674K0539
$$ 215282 -75336 541929 1285 72358 202528 -108471 -278485 -154701 79006 73332 93871
11436I3871J276a26556C64758a16964D20899a46176c0448n5273o192H8734i9239
$$ 93871 95147 -126556 364758 -116964 420899 -146176 -30448 -85721 -91913 88734 -99239
11424e1032E4769J42123l3801J5549A65M2942a10352e2678j28430h9338C79263
$$ -51032 54769 196892 163091 178640 165 43107 -110352 -52678 -181108 -89338 379263
11412B43383N179j05854k7776J49265A14421K71271j89614G2202b88014a13690
$$ 243383 248562 142708 114932 264197 114421 385692 196078 72202 -288014 -113690
11401a43187j53721a05693j10162E5293K32063D0357c8923J4663o1041A29190
$$ -143187 -296908 -105693 -215855 55293 287356 40357 -38923 -24260 -85301 129190
11390f6783j18523A9557b29180G6859k8096b7518j05799A01494B8685K7240B7633
$$ -66783 -185306 19557 -229180 76859 48763 -27518 -133317 101494 28685 55925 27633
11378b07578B42643b0730j01340k1137e996j49484c0643D926J00285K1475b7466
$$ -207578 242643 -20730 -122070 -143207 -5996 -155480 -30643 4926 105211 126686 -27466
11366b13595A53893F7000b1831k88607B29366c45805C9265Q5963c69335A19922
$$ -213595 153893 67000 -21831 -310438 229366 -345805 39265 125228 -369335 119922
11355c00442C39192a87676A71315a74754b8377A02337C058g3667k84894j35466
$$ -300442 339192 -187676 171315 -174754 -28377 102337 3058 -73667 -358561 -494027
11345d94027A39741O2887G3124B8456J68675a2275p1597B98600A0162c07007C7180
$$ -494027 139741 202628 73124 28456 197131 -12275 -83872 298600 10162 -307007 37180
11333B37112e4051D3738c19657a00178m9230C70768e0116B2683J11342b4017j83196
$$ 237112 -54051 43738 -319657 -100178 -149408 370768 -50116 22683 134025 -24017 -207213
11322b07213N4652j59397b6014l4507A92612a91558d4563m8337q9946o8041B07949
$$ -207213 -152561 -311958 -26014 -60521 192612 -191558 -44563 -92900 -182846 -250887 207949
11310d2037A49275O7237a33322A62352C7617K55786F7148J30883a68113K2721
$$ -42037 149275 216512 -133322 162352 37617 293403 67148 198031 -168113 -145392
11300a45392B98626a5857C3010b76590g3896K2822o3271A27194g3734A77722O824
$$ -145392 298626 -15857 33010 -276590 -73896 -51074 -114345 127194 -73734 177722 184546
11289A84546b69398e8734j65613A71205A9234c41322f2618A66421e7768C29322
$$ 184546 -269398 -58734 -224347 171205 19234 -341322 -62618 166421 -57768 329322
11278a53335I359j66b00052i1283A11577K5921b68923Q5302G4629L05440a71490
$$ -153335 9359 9193 -200052 -91283 111577 137498 -268923 -183621 74629 380069 -171490
11266g5633F0717g3977k70055a54698n4943l9516J00620L6026l4688B73563c36792
$$ -75633 60717 -73977 -344032 -154698 -209641 -249157 -148537 -112511 -147199 273563 -336792
11254a40934Q336b1388I7590a32522L5289A0734b08237O0808B4009O1940b45106
$$ -140934 -132598 -21388 97590 -132522 -97233 10734 -208237 -147429 24009 85949 -245106
11242h3078k5461r2046b2734D4394b31783a3769D04794j65764a6679j64456k23828
$$ -83078 -108539 -200585 -22734 44394 -231783 -13769 404794 239030 -16679 -181135 -404963
11231d04963E7075b04947A93904d8597k71776a8077A03879D8061a85187M5848
$$ -404963 57075 -204947 193904 -48597 -320373 -18077 103879 48061 -185187 -139339
11221a39339A94994p279d70107a04383M2618m9455a2399k36453F7768f5606G4450
$$ -139339 194994 187715 -470107 -104383 -61765 -111220 -12399 -248852 67768 -65606 74450
11209F0553c9013j69115L2094K3065L7906J6378c2083B19415a28485A05278b15840
$$ 60553 -39013 -208128 -176034 -152969 -115063 -98685 -32083 219415 -128485 105278 -215840
11197c16278A74570G0142J5580b0261p615I0212C2047K8095E213O0650d0215J9511
$$ -316278 174570 70142 85722 -20261 -27876 90212 32047 60142 5213 65863 -40215 -20704
11185b0704n4763D3035A6397d68516F3616B4950K85906c84734h2325j34468b7487
$$ -20704 -75467 43035 16397 -468516 63616 24950 310856 -384734 -82325 -216793 -27487
11173B09292a39598j10540I1055O577e1275o2611j4959J4763A01755g2341p5698
$$ 209292 -139598 -250138 91055 97632 -51275 -113886 -128845 -114082 101755 -72341 -148039
11162a48039j1183j6728B43167D1699K41516D8910j6839a17344L5573B48178r7414
$$ -148039 -159222 -175950 243167 41699 283215 48910 32071 -117344 -81771 248178 150764
11151A50764a21078J4655A30530n2665b61169e690j31053e7154j41920G7145l3399
$$ 150764 -121078 -106423 130530 77865 -261169 -5690 -136743 -57154 -199074 77145 43746
11140D3746i4763j86271G1161L2847d7045q4845A79032C4733a96482J7186b0861
$$ 43746 -94763 -281034 71161 104008 -47045 -131890 179032 34733 -196482 -179296 -20861
11128h3138l31518A51138c95104i0244r8219M0452f7872r1207A48462P2550j08398
$$ -83138 -414656 151138 -395104 -90244 -188463 -148011 -67872 -159079 148462 221012 112614
11117A12614b50381b2635o0699k04279J32715n1585C75363e30G3319b7110A77909
$$ 112614 -250381 -22635 -83334 -287613 -154898 -206483 375363 -530 73319 -27110 177909
11105E7789a17864B61002a71365j98375A00113j21c1013B5288h5790A92357l9148
$$ 57789 -117864 261002 -171365 -369740 100113 99992 -31013 25288 -85790 192357 153209
11094A53209a00569l0952k19909d816B09974a15558C89787E9104K62751e6086
$$ 153209 -100569 -131521 -351430 -4816 209974 -115558 389787 59104 321855 -56086
11083A77636J34246k8507b68823C48665q0731p2764K6161J26281F3375O3248n719
$$ 177636 311882 283375 -268823 348665 267934 195170 221331 347612 63375 126623 120904
11072A20904J03219k4472H8292J91241M7893J8918K7657I8023Q8465J06516J24193
$$ 120904 224123 199651 88292 279533 327426 346344 374001 98023 186488 293004 417197
11061D17197R4799B40040A12056J85152e4165C71485N319D9406K40132Q1242J05080
$$ 417197 511996 240040 112056 297208 -54165 371485 376804 49406 289538 370780 475860
11050D75860A30877K94094m2990o9824J37861j38995M0522J76646B19964M27352
$$ 475860 130877 424971 381981 312157 450018 311023 351545 528191 219964 647316
11040F47316k64177Q4034q8049j23524N26647q4106L77613l29182m3l02233J93166
$$ 647316 383139 467173 379124 255600 782247 698141 1075754 746572 746529 444296 637462
11029F37462K36549L29555E68761L91418D06295M06165M3970k40163J85792k06050
$$ 637462 874011 1203566 568761 960179 406295 812460 856430 616267 802059 596009
11019E96009J43686j01823o6607K65919l32365K84275Q6920l16122J31854k85909
$$ 596009 739695 637872 571265 837184 504819 789094 876014 559892 691746 405837
11009D05837N58223j51236J07053j50727C61916M48159l62239j97744K58062m2936
$$ 405837 964060 812824 919877 769150 361916 810075 447836 250092 508154 465218
10999D65218M14603m0215o3075l8165J34872k62501J50473o8995k64914K52838
$$ 465218 879821 839606 776531 738366 873238 610737 761210 692215 427301 680139
10989F80139K5834K80303l71417J56528k5243k906K29430j68626k78149K66236
$$ 680139 705973 986276 614859 771387 746144 743238 972668 804042 525893 792129
10979G92129Q6654j65666L67432l05649J02011l33775L96241k61635P45395m64705
$$ 792129 878783 713117 1080549 774900 876911 543136 939377 677742 1423137 958432
10969I58432R1639k80598K17354L54800l97661N24188J11380P6456p4181Q55456
$$ 958432 1050071 769473 986827 1341627 943966 1468154 1579534 1655990 1581809 2437265
10959B437265R6996J76657j80443K01365J71528o9597J52365n96941J15506o52862
$$ 2437265 2534261 2710918 2530475 2731840 2903368 2833771 2986136 2389195 2504701 1851839
10949A851839l14366k53957N2641K60028Q4347k67179m3828j76298J73537k41008
$$ 1851839 1537473 1283516 1336157 1596185 1680532 1413353 1369525 1193227 1366764 1125756
10939A125756p4162o8226j46786k79340p4114J56156p3967B41874K3026J43939
$$ 1125756 1051594 983368 836582 557242 483128 639284 565317 241874 264900 408839
10929D08839I8770j7175J95917k4590c1606A87622m0214F5400k8360b0416A28366
$$ 408839 98770 81595 277512 252922 -31606 187622 147408 65400 37040 -20416 128366
10917C5048a47036e2259j26052A77722g3588B82623o1258E4184h1840H2020d9339
$$ 35048 -147036 -52259 -178311 177722 -73588 282623 221365 54184 -81840 82020 -49339
10905a16884d8855A69865h0049j30154P8574D5630a34341f2813D0806J0822c4016
$$ -116884 -48855 169865 -80049 -210203 -131629 45630 -134341 -62813 40806 51628 -34016
10893D8485J95293C191a041C8199a47902k3420d6437m9852p1604A64079l2107
$$ 48485 243778 3191 -1041 38199 -147902 -171322 -46437 -96289 -167893 164079 131972
10882A31972k0612P3759e3508j30216C93923c6652j12745k9218P3624J299F103
$$ 131972 111360 185119 -53508 -183724 393923 -36652 -149397 -178615 -104991 -103692 6103
10870a31747j06968D2284F206c15100I9691L3270q931f7494A14783c8420l69983
$$ -131747 -238715 42284 6206 -315100 99691 132961 124030 -67494 114783 -38420 -408403
10859d08403b5285k27590N8586o6352A51507j1270A5680j324R277g9352n4417
$$ -408403 -25285 -252875 -194289 -260641 151507 140237 15680 14356 23633 -79352 -133769
10848a33769A76357b77619A10553n349b76505B59256d1054p1976D4060a53281
$$ -133769 176357 -277619 110553 105204 -276505 259256 -41054 -113030 44060 -153281
10837E2545a75659Q1677L5978B56043H021h6730n9573A79470B6662J1243b20603
$$ 52545 -175659 -93982 -58004 256043 8021 -86730 -146303 179470 26662 37905 -220603
10825B05600a81480i0387j20892R4631b3406B89800j36103C3596J13669e6207
$$ 205600 -181480 -90387 -211279 -116648 -23406 289800 153697 33596 147265 -56207
10814B32251c3007k76402C33169p4477A24105l8807e2122E7895k5428b18362d9955
$$ 232251 -33007 -309409 333169 258692 124105 85298 -52122 57895 32467 -218362 -49955
10802b6072k6964O26q0272j63338J35844c5696J5606A14616i3691c1358A21399
$$ -26072 -53036 -52410 -132682 -296020 -160176 -35696 -20090 114616 -93691 -31358 121399
10790a21345R278N3877C26311a22588J9994k473j01560B3407N9102a98973a2060
$$ -121345 -112067 -58190 326311 -122588 -102594 -105067 -206627 23407 82509 -198973 -12060
10778a71738M8941A17076J20079G9091k8849a33972b7282a2086A29918K68263
$$ -171738 -122797 117076 237155 79091 50242 -133972 -27282 -12086 129918 398181
10768C98181A4634R0057i4157C7292a50316A15202b14576E6785r661b22436f8222
$$ 398181 14634 104691 -94157 37292 -150316 115202 -214576 56785 47124 -222436 -68222
10756b73238B37538j16927K69211a22227c3584A08880c2433j57447c4936D7406
$$ -273238 237538 120611 389822 -122227 -33584 108880 -32433 -189880 -34936 47406
10745A63888i1421k20430a4993B57991a74837O3288C0703b9219l1366C1172J67444
$$ 163888 -91421 -311851 -14993 257991 -174837 -111549 30703 -29219 -60585 31172 198616
10734A98616b7655j7196k8122B6145d6145l5188l10964B37891b84559g643k49195
$$ 198616 -27655 -44851 -72973 26145 -46145 -81333 -392297 237891 -284559 -7643 -256838
10723b56838a26343K0070j3505l10847E2364B1986i8687B36366a00679K5132m3245
$$ -256838 -126343 -106273 -119778 -430625 52364 21986 -98687 236366 -100679 -75547 -118792
10712a18792b180j22348B5152a73742B02917J0786O303e1310j82083K3914P1925
$$ -118792 -2180 -124528 25152 -173742 202917 213703 220006 -51310 -233393 -209479 -137554
10701a37554G2761h5098b688k81109a26863B43647i1775j92178A51228a74205
$$ -137554 72761 -85098 -2688 -283797 -126863 243647 -91775 -283953 151228 -174205
10690f2828B13045L9196B8762F243a06974B9497b57800j60420A76678f1686K2208
$$ -62828 213045 252241 28762 6243 -106974 29497 -257800 -418220 176678 -61686 -39478
10679c9478j45100C6204a51661e138A88805H9689c29467a30031B9356J07017C0866
$$ -39478 -184578 36204 -151661 -5138 188805 89689 -329467 -130031 29356 136373 30866
10667F0322k2876b88425o3753A73609d37524e476I1065b34883Q5042f012n4680
$$ 60322 37446 -288425 -352178 173609 -437524 -5476 91065 -234883 -149841 -6012 -60692
10656f0692G7311d6679E8683G737a45858P1382L1145A11053P8393h2447o7825
$$ -60692 77311 -46679 58683 7737 -145858 -74476 -43331 111053 189446 -82447 -150272
10645a50272i044j26798B08344b03459M1173L099A09848b11104L5915A62097A4195
$$ -150272 -9044 -135842 208344 -203459 -162286 -159187 109848 -211104 -175189 162097 14195
10633a76052c7255A11808a83176k3661G3164R2941f8014A43055h6156Q619k4301
$$ -176052 -37255 111808 -183176 -206837 73164 166105 -68014 143055 -86156 -77537 -101838
10622a01838j27564C3399L6130a00229D0521K6368i8277A57637a28842r9744d8537
$$ -101838 -229402 33399 69529 -100229 40521 66889 -98277 157637 -128842 -228586 -48537
10610a73312F0450e691k90686B38925R0842a33026b1404A63432B0172J29175a08759
$$ -173312 60450 -5691 -296377 238925 329767 -133026 -21404 163432 20172 149347 -108759
10598A6612e708k22820m8248G5135K26320a30705G6619h1687C46008a93117I4575
$$ 16612 -5708 -228528 -276776 75135 301455 -130705 76619 -81687 346008 -193117 94575
10586b47937d5577C6300b5927n8872k48120g1985A7223h9606j0069d3700k14062
$$ -247937 -45577 36300 -25927 -84799 -332919 -71985 17223 -89606 -99675 -43700 -257762
10575b57762A38610d75028A77091j2940p0690m2453a16627m053b9942k9294k36203
$$ -257762 138610 -475028 177091 164151 93461 51008 -116627 -120680 -29942 -59236 -295439
10564b95439B01207a55412C03862c98893B85952a74525A79309H5148a35953j52501
$$ -295439 201207 -155412 303862 -398893 285952 -174525 179309 85148 -135953 -288454
10554b88454h9927C2752e3081k92582J35202J9537Q5464j39549F9334J82924i4543
$$ -288454 -89927 32752 -53081 -345663 -210461 -190924 -105460 -245009 69334 252258 -94543
10542f5130L0029C2644R7819J03464a68485d5696m51226i3446B07566a60594K5901
$$ -65130 -35101 32644 130463 233927 -168485 -45696 -496922 -93446 207566 -160594 -134693
10531a34693I7435e1419B42972n4094A8642J25033a56126k1726P0161e543k6489
$$ -134693 97435 -51419 242972 188878 18642 143675 -156126 -177852 -107691 -5543 -32032
10520c2032A02535b2256j08874K6426l9857f0149r0000j11479B91630a31366I6377
$$ -32032 102535 -22256 -131130 -104704 -144561 -60149 -150149 -261628 291630 -131366 96377
10508b23522C09387a34575a2080m3758F792b02471C76396b60379j40673L1968
$$ -223522 309387 -134575 -12080 -55838 6792 -202471 376396 -260379 -401052 -369084
10498c69084J02492a4215k3073k1138m28968a17044B07921A4101R8161K70269
$$ -369084 -266592 -14215 -37288 -58426 -487394 -117044 207921 14101 112262 382531
10488C82531a02204p3030G0413i5883J0331b6770C0293J55991c50968a4151m7435
$$ 382531 -102204 -175234 70413 -95883 -85552 -26770 30293 186284 -350968 -14151 -61586
10477f1586j9469b5508H6955c3193o7733B59913j00004Q1620b37496C34555A14752
$$ -61586 -81055 -25508 86955 -33193 -100926 259913 159909 241529 -237496 334555 114752
10465a11051C50795D0684M3214b4443n327B61426c15762H8226j2641a05155A04007
$$ -111051 350795 40684 83898 -24443 -29770 261426 -315762 88226 75585 -105155 104007
10453A8245L3120J07794B1981c3598l86208J4096i0348F1885Q1548b01265r6525
$$ 18245 51365 159159 21981 -33598 -419806 -405710 -90348 61885 143433 -201265 -297790
10442b97790e60r4837E8473g1453l59186b08007K3347g9566D4385a4551r7014
$$ -297790 -560 -95397 58473 -71453 -430639 -208007 -184660 -79566 44385 -14551 -111565
10431a11565G1599f9179j73411J2555f1871I9115c35715A07060a71344A16395
$$ -111565 71599 -69179 -242590 -230035 -61871 99115 -335715 107060 -171344 116395
10420a13289r9394B51060m7584b00634E23539d1497D66580e1836k74813a24175
$$ -113289 -212683 251060 203476 -200634 523539 -41497 466580 -51836 -326649 -124175
10409a46921A11922a45368l59629b48613K2066J13211j55252i9737J8795k0874
$$ -146921 111922 -145368 -504997 -248613 -226547 -113336 -268588 -99737 -80942 -101816
10399a01816g777m5726j91809a00746A81926a94331M7788A13638J13013a8796
$$ -101816 -7777 -53503 -245312 -100746 181926 -194331 -146543 113638 226651 -18796
10388b20397E8395B6358g1539p685o338k63285E852a09211A44287J17096n8208
$$ -220397 58395 26358 -71539 -79224 -85562 -348847 5852 -109211 144287 261383 203175
10377B03175j9743E0728J90917I7880j6517l3849J04621J48871A33323b15049
$$ 203175 183432 50728 241645 97880 81363 47514 152135 301006 133323 -215049
10366B81340A34513g605j14331A19455K73102m1889A09255L73644J01286A12721
$$ 281340 134513 -7605 -121936 119455 392557 350668 109255 482899 584185 112721
10355D55582D7833P7326J2214K33313m7491M0661o8171K25346J4059d9430B01617
$$ 455582 47833 125159 137373 370686 323195 363856 295685 521031 535090 -49430 201617
10343B78176g394A78390K583b11874F70551d4298C99794K29868j05515j10924
$$ 278176 -7394 178390 180973 -211874 670551 -44298 399794 629662 524147 413223
10333D13223k7747L1222A37238M88653C8148K67036o2294P2863J08256j29156
$$ 413223 385476 416698 137238 625891 38148 305184 242890 315753 424009 294853
10323B94853K6414p8374E0944Q2657e4972A38233i7384K5649C35180D6788d6890
$$ 294853 321267 242893 50944 133601 -54972 138233 -97384 -71735 335180 46788 -46890
10311A36548L09066j64170D9117J47728a24629C85699j57485m7905J16164a1250
$$ 136548 445614 281444 49117 196845 -124629 385699 228214 180309 296473 -11250
10300e3859D33840b1109E3209b5163p4607c2715k75803f8583m1524K134A66747
$$ -53859 433840 -21109 53209 -25163 -99770 -32715 -308518 -68583 -110107 -107973 166747
10288E4737O5689b45343l3744a0937j45925l5962g6928e426k02988B99N1410f5672
$$ 54737 120426 -245343 -279087 -10937 -156862 -192824 -76928 -5426 -208414 299 51709 -65672
10275A19060D6005h1801A16488a08944C2397a074k56155A14862b2847q7832B43864
$$ 119060 46005 -81801 116488 -108944 32397 -1074 -257229 114862 -22847 -110679 243864
10263D7100h6064C16778d8223j6658o7630I3046a54213k2486g001k12E1327K25583
$$ 47100 -86064 316778 -48223 -64881 -132511 93046 -154213 -176699 -7001 -7213 51327 276910
10251B76910c16642a29335B26488j0630k3691P7304C415K68946f4559B86088D5688
$$ 276910 -316642 -129335 226488 215858 192167 269471 3415 272361 -64559 286088 45688
10239A41707J18884d7421C03171E2374L1112c18167B71289f0837j97486h2487
$$ 141707 260591 -47421 303171 52374 83486 -318167 271289 -60837 -258323 -82487
10228f2358l2518c0036j42000A35300n3608J24141a16758A53164l5640b06662
$$ -62358 -94876 -30036 -172036 135300 81692 205833 -116758 153164 117524 -206662
10217A42230b66607A05308b78771L9814P5916O4250A16250k3433a00846L2750
$$ 142230 -266607 105308 -278771 -238957 -163041 -98791 116250 92817 -100846 -68096
10207f8096b5628B85047a24653A54632F1694g40l4581A72208a88449C8176J18178
$$ -68096 -25628 285047 -124653 154632 61694 -740 -35321 172208 -188449 38176 156354
10196A56354P661F5995O4333C6575b66515r259K7309A0089f0836H9505b49796
$$ 156354 164015 65995 130328 36575 -266515 -275774 -248465 10089 -60836 89505 -249796
10184B33128a52887k57433D8683i9448B06376e8930B15404b14382A5618K96223
$$ 233128 -152887 -410320 48683 -99448 206376 -58930 215404 -214382 15618 311841
10174C11841f9181A4766c4590j1086C16301d5124j2401C2030c7474n943j13006
$$ 311841 -69181 14766 -34590 -45676 316301 -45124 -57525 32030 -37474 -43417 -156423
10163a56423j5210O3849A59374D8550g9456A94184a39070e5565B5166a20576p6537
$$ -156423 -171633 -107784 159374 48550 -79456 194184 -139070 -55565 25166 -120576 -197113
10152a97113I336a20427e3150P679B2920J2773J64629b37195a04557p9866h2099
$$ -197113 9336 -120427 -53150 -45471 22920 35693 200322 -237195 -104557 -184423 -82099
10140a70585f2903J1703j93395A23681a76912p8589A22430B3310c987k75900G7173
$$ -170585 -62903 -51200 -244595 123681 -176912 -255501 122430 23310 -3987 -279887 77173
10128a65998B6176d56534h5799a58q8865H9718P2230e12213b10400A2871O4471
$$ -165998 26176 -456534 -85799 -158 -89023 89718 161948 -512213 -210400 12871 77342
10117G7342b19479a08354a4973A41309c22837C8462K66868a48028c0197B33373
$$ 77342 -219479 -108354 -14973 141309 -322837 38462 305330 -148028 -30197 233373
10106H1377A7728b87406J08699A12592c35927B38508c23671J28784a9010j05935
$$ 81377 17728 -287406 -178707 112592 -335927 238508 -323671 -194887 -19010 -124945
10096a24945L4825A90776p9115b94463A4775c9252j95078Q1060D52738I5766c41841
$$ -124945 -90120 190776 111661 -294463 14775 -39252 -234330 -153270 452738 95766 -341841
10084D9261a35337e056o8221a1518k1688j43222m2863B46491d5917j49780j7953
$$ 49261 -135337 -5056 -73277 -11518 -33206 -176428 -219291 246491 -45917 -195697 -213650
10073b13650e5082n3078b4200j51996M6106K663O2004n271G0300C2498a2289k6805
$$ -213650 -55082 -108160 -24200 -176196 -130090 -127427 -65423 -70694 70300 32498 -12289 -39094
10061c9094e775A30090b17541L3813C5469b47480d1265k43101I8659L7823b95766
$$ -39094 -5775 130090 -217541 -183728 35469 -247480 -41265 -284366 98659 136482 -295766
10049A46583J14502a16732A4978J37573g479A33567l3074d1172j38836n6353L8966
$$ 146583 261085 -116732 14978 152551 -7479 133567 100493 -41172 -180008 -236361 -197395
10038a97395r214n7268o2955l6988j24015b20568J5210n653A84525e7734j76069
$$ -197395 -206609 -263877 -326832 -363820 -487835 -220568 -205358 -211011 184525 -57734 -233803
10027b33803A90354c5871j22765J9062k9865A31743J31877b36161m3073R9342
$$ -233803 190354 -35871 -158636 -139574 -169439 131743 263620 -236161 -279234 -179892
10017a79892D1817c5916a2403k05812A85837b02633A08548l8805N8561B1348d5499
$$ -179892 41817 -35916 -12403 -218215 185837 -202633 108548 69743 128304 21348 -45499
10005f9251k44275M6819B20548a76300e1385A20245a51389l2635P5610H0533a00388
$$ -69251 -313526 -266707 220548 -176300 -51385 120245 -151389 -184024 -108414 80533 -100388
9993h2889o5292l11553d2629A9412Q3872b09658h0511a2635B01858a16127A42165
$$ -82889 -148181 -459734 -42629 19412 103284 -209658 -80511 -12635 201858 -116127 142165
9981b7404A35441E0608J9202Q2156O3767a95392M45A80712h9512A40264c4822
$$ -27404 135441 50608 69810 151966 215733 -195392 -194947 180712 -89512 140264 -34822
9969B19075r8189n4876G906b62790g1515b5571A9358J74262m2385e62990C7769
$$ 219075 120886 66010 7906 -262790 -71515 -25571 19358 193620 151235 -562990 37769
9957a92258M6715o0608l4791A52993b18526C7280i3372j66834a02270b4299C30462
$$ -192258 -145543 -206151 -240942 152993 -218526 37280 -93372 -260206 -102270 -24299 330462
9945a22327r8165B37824A08574c8678A567O244M1078h7876A01417a09813F947
$$ -122327 -220492 237824 108574 -38678 1567 7811 48889 -87876 101417 -109813 6947
9933B92539A6463b02905L7891K6688O8636A63134a12943B40424I585a23589c7369
$$ 292539 16463 -202905 -165014 -138326 -69690 163134 -112943 240424 9585 -123589 -37369
9921b34643G4048b46212A48307a37810a7027I3817c939k2168j80179o1316c3871
$$ -234643 74048 -246212 148307 -137810 -17027 93817 -3939 -26107 -206286 -267602 -33871
9909b0683C9506b15728a02395B93686g845k9055q2065A90442o2455a03118C0811
$$ -20683 39506 -215728 -102395 293686 -7845 -36900 -118965 190442 127987 -103118 30811
9897b77712K0978c1099m9105k5433j82164A25469b38534A29078d59831A83859
$$ -277712 -256734 -31099 -80204 -105637 -287801 125469 -238534 129078 -459831 183859
9886B7051h290k30399O9120Q3804N416B8819J73707c5838j46104B9206a62205
$$ 27051 -8290 -238689 -169569 -85765 -80349 28819 202526 -35838 -181942 29206 -162205
9874b16111C2558J47001b71993a1255q1586j90756A30511c92823i088l87433e8092
$$ -216111 32558 179559 -271993 -11255 -92841 -283597 130511 -392823 -9088 -396521 -58092
9862h6235l3665H2655a22944E5387b04564F4944O1295I134a83968M653C92119
$$ -86235 -119900 82655 -122944 55387 -204564 64944 126239 9134 -183968 -179315 392119
9850c2312h736j39941C34473a90243b5695j75978C67437a44679c9019n1893m4051
$$ -32312 -8736 -148677 334473 -190243 -25695 -201673 367437 -144679 -39019 -90912 -134963
9839a34963a613k94996A70983b41819J08956A43962e08542a13396C0524K16948
$$ -134963 -1613 -296609 170983 -241819 -132863 143962 -508542 -113396 30524 247472
9829B47472A1715a68793k37147d5325B37g39F1139A9421e6203k19390A23014d12093
$$ 247472 11715 -168793 -405940 -45325 237 -739 61139 19421 -56203 -275593 123014 -412093
9816a14566N2013n442C7590c7744k22532K6516J04888K6904l5296A66187o0953
$$ -114566 -62553 -67995 37590 -37744 -260276 -233760 -128872 -101968 -137264 166187 105234
9805A05234D2275d6964o1201m3689j8687B1406L4252a60152j01649Q1907n2440
$$ 105234 42275 -46964 -108165 -151854 -170541 21406 55658 -160152 -261801 -179894 -232334
9794b32334K9923A07292k2817c1523E8820J61484Q4032K5292b17103e3010A22669
$$ -232334 -202411 107292 84475 -31523 58820 220304 304336 329628 -217103 -53010 122669
9782B6948R7375a58217j51110J09831A42124o9525e3353K1179l22427a22693J0677
$$ 26948 124323 -158217 -309327 -199496 142124 72599 -53353 -32174 -354601 -122693 -112016
9771a12016k07230O8742N1957c7775m8279A45763f4120j15513B59272b52214m5927
$$ -112016 -319246 -250504 -198547 -37775 -86054 145763 -64120 -179633 259272 -252214 -298141
9760b98141f8482l9031a689j74675P4785L5500j41512i5490A10565J59353b40340
$$ -298141 -68482 -107513 -1689 -176364 -101579 -66079 -207591 -95490 110565 269918 -240340
9748a86405J1380e477A39894a50754E1577k1959b58412g6064j10908Q7597M0290
$$ -186405 -175025 -5477 139894 -150754 51577 29618 -258412 -76064 -186972 -99375 -59085
9737e9085H2207a70461A6184a87231m247j32255A07743B9904d402F9995b20389
$$ -59085 82207 -170461 16184 -187231 -191478 -323733 107743 29904 -4402 69995 -220389
9725A532h3579P74A83262O5093c83709F5980b46183A12572l2391a5582G7340d87355
$$ 1532 -83579 -82805 183262 248355 -383709 65980 -246183 112572 80181 -15582 77340 -487355
9712a44379A88413C8124b23241n8050N1379k71728C4563a10271k22275b0266A60758
$$ -144379 188413 38124 -223241 -281291 -229912 -501640 34563 -110271 -332546 -20266 160758
9700F0557h5247b7741A36105B2932L387a4173l14095c6608j48797O569L3802L4332
$$ 60557 -85247 -27741 136105 22932 26319 -14173 -328268 -36608 -185405 -178836 -145034 -110702
9688a10702N3931A534a41711e3030O314j54651l3328g5853B71521d06160B40256
$$ -110702 -56771 1534 -141711 -53030 -46716 -201367 -234695 -75853 271521 -406160 240256
9676b32820B55924c2023n5045o3066G7615h1831A18212D2234i3134j19445A6742
$$ -232820 255924 -32023 -87068 -150134 77615 -81831 118212 42234 -93134 -212579 16742
9664i6161B5045J79264f3835A16237b31230R7578H4271a79006j7971c5465j00452
$$ -96161 25045 204309 -63835 116237 -231230 -133652 84271 -179006 -196977 -35465 -135917
9653a35917G9300O2222J62136a40364n9381A47834g4241K537a2018B9186a72405
$$ -135917 79300 141522 303658 -140364 -199745 147834 -74241 -71704 -12018 29186 -172405
9641b98627P5825D6137b10938n0197i023p2697j45058l2057B62793A25787i1256
$$ -298627 -222802 46137 -210938 -261135 -9023 -81720 -226778 -258835 262793 125787 -91256
9629c3375j23655F9032a21387o6004A08880a8302k51347h4599A95852g5887r8016
$$ -33375 -157030 69032 -121387 -187391 108880 -18302 -269649 -84599 195852 -75887 -173903
9618a73903H8465L674J45077b88442A72358c26456a53407m3124c2869l6233j52859
$$ -173903 88465 92139 237216 -288442 172358 -326456 -153407 -196531 -32869 -69102 -221961
9607b21961I9148a08828j41648f6454r5143P3652G7655i6990j62542a22565j16031
$$ -221961 99148 -108828 -250476 -66454 -161597 -87945 77655 -96990 -259532 -122565 -238596
9596b38596k5748i4536I2432b43134E8894b248o5171q5605p9819f6317o9920c2329
$$ -238596 -264344 -94536 92432 -243134 58894 -2248 -67419 -153024 -232843 -66317 -136237 -32329
9583C79334a98873C2059J95818D0194a03257a7019B21255e8489B01877C6026h5892
$$ 379334 -198873 32059 227877 40194 -103257 -17019 221255 -58489 201877 36026 -85892
9571a41110J9003E4046a53614L2433A56691a0297m3650k0041C41002d3518G495
$$ -141110 -122107 54046 -153614 -121181 156691 -10297 -53947 -73988 341002 -43518 7495
9559A56142b43021e9628j51602j87331a49767G1270J68643a03369n5641j00875
$$ 156142 -243021 -59628 -211230 -398561 -149767 71270 239913 -103369 -159010 -259885
9549b59885a07713A73841b27999N8199G4772e1131l31109J50629H7360b189n24894
$$ -259885 -107713 173841 -227999 -169800 74772 -51131 -382240 -231611 87360 -2189 -527083
9538e27083b59782E2841a39251l591A96443b76279B22452b69305E1642P5494L9167
$$ -527083 -259782 52841 -139251 -142842 196443 -276279 222452 -269305 51642 127136 166303
9527A66303h5127k47476c6250j94561A23234J6918c4538A9627b90217i2990B55725
$$ 166303 -85127 -332603 -36250 -230811 123234 140152 -34538 19627 -290217 -92990 255725
9515A60282m6826b3926B9829b02133J8288B33976a86972B04464H1606a18039E4161
$$ 160282 113456 -23926 29829 -202133 -183845 233976 -186972 204464 81606 -118039 54161
9503b23420I0733a2535m94962A68249b06226q2839C09155A12429a2897F0703J78239
$$ -223420 90733 -12535 -507497 168249 -206226 -289065 309155 112429 -12897 60703 238942
9492B38942J04826b02697B1879a8673B21141H9405J7161a24527K0674j01567G9054
$$ 238942 343768 -202697 21879 -18673 221141 89405 106566 -124527 -103853 -205420 79054
9480a13925B08401d6453l76327a6222k21728a2380r7308c9242a6424I9335e614
$$ -113925 208401 -46453 -422780 -16222 -237950 -12380 -109688 -39242 -16424 99335 -5614
9468b08260j03319A33283J05486c9118I3260L06098c7479D8463h9140r9560B05144
$$ -208260 -311579 133283 238769 -39118 93260 399358 -37479 48463 -89140 -188700 205144
9456c4678A2975b10533b0126m3693B00023c26183G4975c69465a45691j95449A71840
$$ -34678 12975 -210533 -20126 -63819 200023 -326183 74975 -369465 -145691 -341140 171840
9444E9543O0699b22619R5209A41052a66607j8792m7639g401m5759C83992A6116
$$ 59543 120242 -222619 -127410 141052 -166607 -185399 -233038 -7401 -53160 383992 16116
9432d6364Q969l0979A40356a95029G8482c4741A70326a01559C9022g1494J5302
$$ -46364 -37395 -68374 140356 -195029 78482 -34741 170326 -101559 39022 -71494 -56192
9421e6192j80037I6380b13693H0515k7598a67523f3741k27907A15946a27799L0270
$$ -56192 -236229 96380 -213693 80515 52917 -167523 -63741 -291648 115946 -127799 -97529
9410i7529G1390G302L9275b1936l41783F3663J84256f0328k59233J21520A36590
$$ -97529 71390 7302 46577 -21936 -363719 63663 247919 -60328 -319561 -198041 136590
9398a01655M3447H898b41288K2640l9457N9052A97485b0526k15520J8147d40j68480
$$ -101655 -58208 8898 -241288 -218648 -258105 -199053 197485 -20526 -236046 -217899 -440 -168920
9386a68920n21675e8481k38922m6902C0499O6572N5352m1615O387c93805b4816
$$ -168920 -690595 -58481 -297403 -344305 30499 97071 152423 110808 117195 -393805 -24816
9374D6888P5850h5135m9594J0997d0755k4997K085G861K04848b62722Q6636e4349
$$ 46888 122738 -85135 -134729 -123732 -40755 -65752 -63667 7861 212709 -262722 -176086 -54349
9361b22405K7004i5207M894m2174C08361b46079a3691q5186L6381k02916A78920
$$ -222405 -195401 -95207 -90313 -132487 308361 -246079 -13691 -98877 -62496 -265412 178920
9349a56644K6414B28487d01640h1681k8332j5479B99789a53546I3047N5403A8409
$$ -156644 -130230 228487 -401640 -81681 -110013 -125492 299789 -153546 93047 148450 18409
9337B89275A14055a48510m1582j10795A69265a68368J2711f6089A1843a15824
$$ 289275 114055 -148510 -190092 -300887 169265 -168368 -155657 -66089 11843 -115824
9326a62735A46925E2436c92562J66294d3296F4325J04763d19831a60773D4739
$$ -162735 146925 52436 -392562 -226268 -43296 64325 169088 -419831 -160773 44739
9315c20610g0625F8362d4062l76277i8855j02554p3881Q1724E552c10619a9756
$$ -320610 -70625 68362 -44062 -420339 -98855 -201409 -275290 -193566 5552 -310619 -19756
9303B02447J1442r4516a48741j91498A66142b42457m3242E3082L43095a01319
$$ 202447 213889 119373 -148741 -340239 166142 -242457 -285699 53082 396177 -101319
9292i0165C8334J8128N6240a65028g2107b1049A99769h0467A56201C4447a5099
$$ -90165 38334 56462 112702 -165028 -72107 -21049 199769 -80467 156201 34447 -15099
9280D8160J28835a8565l71920C8406i7969m0120A17297a29636b5644A5828b51880
$$ 48160 176995 -18565 -390485 38406 -97969 -138089 117297 -129636 -25644 15828 -251880
9268b70957C41439b64341A05674a05468j45148F4991B3129c72023f5878p3236
$$ -270957 341439 -264341 105674 -105468 -250616 64991 23129 -372023 -65878 -139114
9258a39114j43055a02953k3693f1668B97667c61996A30426c538H6024c8212H5775
$$ -139114 -282169 -102953 -126646 -61668 297667 -361996 130426 -3538 86024 -38212 85775
9246c06045J02512j1177Q8701C50821h3595A54888H19g3337k17178B9220b98972
$$ -306045 -203533 -214710 -126009 350821 -83595 154888 819 -73337 -290515 29220 -298972
9234E31891j15216d0804B12276a05069B45569b19219a00775k9783b2720j52585
$$ 531891 416675 -40804 212276 -105069 245569 -219219 -100775 -130558 -22720 -175305
9224a75305N5474B4669O8717f692k5849j30432j65541f8958k15174a07730H4508
$$ -175305 -119831 24669 93386 -6692 -32541 -162973 -328514 -68958 -284132 -107730 84508
9212a31794j93509a61855A98900c4405B10347F4144i7985j49247B55423a43292
$$ -131794 -325303 -161855 198900 -34405 210347 64144 -97985 -247232 255423 -143292
9201b06945G9951b03260P1596L9112j01483A80660i4071j25839R9953B42846d6386
$$ -206945 79951 -203260 -131664 -92552 -194035 180660 -94071 -219910 -119957 242846 -46386
9189b18747b6074n722i344j2457l4557j07621C94K26980g45l62659a38551j95914
$$ -218747 -26074 -31796 -9344 -21801 -56358 -163979 394 227374 -745 -363404 -138551 -334465
9177c34465P3645G5266i8782j799R746A06467g3701k83515e8311M090B25326c41334
$$ -334465 -260820 75266 -98782 -100581 -90835 106467 -73701 -357216 -58311 -54221 225326 -341334
9164b84883a16080B40723f341k7570l55640h2679d028D556o10J08141j3086C4804
$$ -284883 -116080 240723 -6341 -33911 -389551 -82679 -4028 4556 3946 112087 99001 34804
9151F1908B9929F73b36513b2778k32006C67085a46962C20423d71250K26055D2062
$$ 61908 29929 673 -236513 -22778 -254784 367085 -146962 320423 -471250 -245195 42062
9139A16168a90337l4590A38983A0175b36935c8372j48351Q6302H7364L44317g9565
$$ 116168 -190337 -224927 138983 10175 -236935 -38372 -186723 -100421 87364 431681 -79565
9127a35687b7061C2745J92652h6537A16279M0902J01702a32332b1407k7421p3432
$$ -135687 -27061 32745 225397 -86537 116279 157181 258883 -132332 -21407 -48828 -122260
9116a22260a8527C5339a28678E4027K24174b1306A31817c69958a23k20418D8293
$$ -122260 -18527 35339 -128678 54027 278201 -21306 131817 -369958 -123 -220541 48293
9104d207p6797B30536H9678j792b78769d1581F6288f2205J7395k7768C7544r460
$$ -4207 -81004 230536 89678 87886 -278769 -41581 66288 -62205 -44810 -72578 37544 28084
9092B8084a81096f9626l75468f4164b1675A14847J27938e11256a12314F0254a62340
$$ 28084 -181096 -69626 -445094 -64164 -21675 114847 242785 -511256 -112314 60254 -162340
9080C07246a72851j29739e0830j12494l6470A3354a71372F6899B094J59845k7695
$$ 307246 -172851 -302590 -50830 -163324 -199794 13354 -171372 66899 2094 161939 134244
9069A34244b44483M6965r1350D3143L7430h5975F3473h746k10282e6380j13721
$$ 134244 -244483 -197518 -288868 43143 80573 -85975 63473 -8746 -219028 -56380 -170101
9058a70101f1517m8243q639I6419a01078q3626F6739f3126I3949N5334f0410n9149
$$ -170101 -61517 -109760 -118399 96419 -101078 -184704 66739 -63126 93949 149283 -60410 -119559
9046a19559j92441B04447a25408q5562B38192a59569N9236j52126Q9750k53740
$$ -119559 -312000 204447 -125408 -210970 238192 -159569 -100333 -252459 -162709 -416449
9036d16449B02593b16416I1846I311a09046k104A49885d4188k14061o3331e6176
$$ -416449 202593 -216416 91846 9311 -109046 -111150 149885 -44188 -258249 -321580 -56176
9024g1383j81011D30326a35726A66841n3639f9870j7827k28465A49248a79702
$$ -71383 -252394 430326 -135726 166841 113202 -69870 -87697 -316162 149248 -179702
9013A586a07346o3231A28133k4600g3667j81613f4708k09427a21842A18497b85399
$$ 1586 -107346 -170577 128133 103533 -73667 -255280 -64708 -274135 -121842 118497 -285399
9001a72165B53832B6218c97266J24899g642j4744j00361k28355J15333A88452
$$ -172165 253832 26218 -397266 -272367 -7642 -22386 -122747 -351102 -235769 188452
8990a61109O7357J3828k94847n1443A75294b30618a08703A90807h5422j78811
$$ -161109 -93752 -79924 -374771 -426214 175294 -230618 -108703 190807 -85422 -264233
8980b64233C8262a13779O097A2335O3543h1927b1293n1223b8366C4439f464B47527
$$ -264233 38262 -113779 -107682 12335 75878 -81927 -21293 -72516 -28366 34439 -6464 247527
8967a37182k03625R155b3056r4708C4807g9314o5467e1146j16704g8780B35537
$$ -137182 -340807 -331652 -23056 -117764 34807 -79314 -144781 -51146 -167850 -78780 235537
8955a61243m9150C4258a15171C9294L29233A24792j9961E0785a26924M7664k00327
$$ -161243 -210393 34258 -115171 39294 368527 124792 104831 50785 -126924 -79260 -279587
8944b79587F3185a53196k08881C3852K9464J25116m6024g9336E0196E465N229
$$ -279587 63185 -153196 -362077 33852 63316 188432 142408 -79336 50196 5465 10694
8933A0694b71916a26949A54838F344a27652L7339B7862J8501d3509j29652A38263
$$ 10694 -271916 -126949 154838 6344 -127652 -90313 27862 46363 -43509 -173161 138263
8921e7505H4688K0165Q375N1057a29094a5109A38320f7148a2937C06541J27157
$$ -57505 84688 104853 113228 164285 -129094 -15109 138320 -67148 -12937 306541 433698
8910D33698L13919L40282P04291J147102K726158L846757D209874k096163j039262
$$ 433698 747617 1087899 1792190 2939292 5665450 9512207 4209874 2113711 1074449
8901A074449j52429D17979A94385G4494J08581G5880L57624E9062K2944M00840
$$ 1074449 922020 417979 194385 74494 183075 75880 433504 59062 82006 482846
8891D82846A16742N2397a9031m09111a3911l20869B237i1252J5020B80426b67998
$$ 482846 116742 169139 -19031 -428142 -13911 -334780 2237 -91252 -76232 280426 -267998
8879G3389i8339l24814A29376C0800b28798J825c3100A85288c81859c7844A63934
$$ 73389 -98339 -423153 129376 30800 -228798 -226973 -33100 185288 -381859 -37844 163934
8867b44650G6993f5764O386k55036a47542k41788e6562l92035H7054b06713H8631
$$ -244650 76993 -65764 -59378 -314414 -147542 -389330 -56562 -448597 87054 -206713 88631
8855G860J48977b8019N562m67402R8491I2927h1766J2235A52357c8635o1557C58
$$ 7860 156837 -28019 -22457 -489859 -391368 92927 -81766 -69531 152357 -38635 -100192 358
$$ [...]
##END NTUPLES=NMR SPECTRUM
##END=
