
##TITLE=UV1148_M1-1003-1002_6301497_oaHm9oQJQT
##JCAMPDX= 6.0         $$ Bruker NMR JCAMP-DX V2.0
##DATA TYPE= NMR SPECTRUM
##DATA CLASS= NTUPLES
##ORIGIN= BRUKER
##OWNER= Administrator
$$ 1.72 TOPSPIN		Version 2.1
$$ 2012-06-06 00:40:57.281 -0500  Administrator@TOPSPIN
$$ Compression mode = diff/dup
##.OBSERVE FREQUENCY= 400.13188235
##.OBSERVE NUCLEUS= ^1H
##.ACQUISITION MODE= SIMULTANEOUS (DQD)
##.ACQUISITION SCHEME= undefined
##.AVERAGES= 64
##.DIGITISER RES= 22
##SPECTROMETER/DATA SYSTEM= spect
##.PULSE SEQUENCE= noesygpps1d.comp
##.SOLVENT NAME= COFFEE_meoh
##.SHIFT REFERENCE= INTERNAL, COFFEE_meoh, 1, 14.96694
##AUDIT TRAIL= $$ (NUMBER, WHEN, WHO, WHERE, PROCESS, VERSION, WHAT)
$$ ##TITLE= Audit trail, TOPSPIN		Version 2.1
$$ ##JCAMPDX= 5.01
$$ ##ORIGIN= Bruker BioSpin GmbH
$$ ##OWNER= Administrator
$$ $$ C:\Bruker\TOPSPIN/data/COFFEE/nmr/UV1148_M1-1003-1002_6301497_oaHm9oQJQT/12/pdata/1/auditp.txt
$$ ##AUDIT TRAIL=  $$ (NUMBER, WHEN, WHO, WHERE, PROCESS, VERSION, WHAT)
(   1,<2012-06-06 00:40:52.109 -0500>,<Administrator>,<TOPSPIN>,<go>,<TOPSPIN 2.1>,
      <created by zg
	started at 2012-06-06 00:29:21.812 -0500,
	POWCHK enabled, PULCHK disabled,
       configuration hash MD5:
       D5 CA 7A 23 FE 6B EE E2 50 67 74 61 24 F7 5E 3B
       data hash MD5: 64K
       A9 EC AD 35 68 4B ED 82 1E B9 01 80 7C 33 8B 5E>)
(   2,<2012-06-06 00:40:55.031 -0500>,<Administrator>,<TOPSPIN>,<proc1d>,<TOPSPIN 2.1>,
      <Start of raw data processing
       efp LB = 0.3 FT_mod = 6 PKNL = 1 PHC0 = 0 PHC1 = 0 SI = 128K 
       data hash MD5: 128K
       CA 89 4B 7E 07 62 11 AA 57 4D 90 7E 61 D3 92 B6>)
(   3,<2012-06-06 00:40:56.296 -0500>,<Administrator>,<TOPSPIN>,<proc1d>,<TOPSPIN 2.1>,
      <pk PHC0 = 31.40991 PHC1 = 0 
       data hash MD5: 128K
       DF DB 5D D3 4C 84 B1 79 C3 61 21 C3 54 9C F9 68>)
(   4,<2012-06-06 00:40:56.937 -0500>,<Administrator>,<TOPSPIN>,<proc1d>,<TOPSPIN 2.1>,
      <abs ABSG = 1 
       data hash MD5: 128K
       44 4E 9E FC 82 8E E4 E9 D4 80 A0 2F C8 B0 5C 6E>)
(   5,<2012-06-06 00:40:57.031 -0500>,<Administrator>,<TOPSPIN>,<proc1d>,<TOPSPIN 2.1>,
      <abs ABSG = 2 
       data hash MD5: 128K
       5B 70 A4 C5 99 D8 12 81 4E 97 05 66 D7 01 11 7F>)
(   6,<2012-06-06 00:40:57.078 -0500>,<Administrator>,<TOPSPIN>,<proc1d>,<TOPSPIN 2.1>,
      <abs ABSG = 3 
       data hash MD5: 128K
       E1 B2 C5 DC 2B DA 09 B4 69 03 97 54 79 3C 66 18>)
(   7,<2012-06-06 00:40:57.140 -0500>,<Administrator>,<TOPSPIN>,<proc1d>,<TOPSPIN 2.1>,
      <abs ABSG = 4 
       data hash MD5: 128K
       B3 94 AC B2 36 BE E0 EC BF 6E 57 F5 D6 82 01 55>)
(   8,<2012-06-06 00:40:57.187 -0500>,<Administrator>,<TOPSPIN>,<proc1d>,<TOPSPIN 2.1>,
      <abs ABSG = 5 
       data hash MD5: 128K
       6B 18 68 B3 79 E9 82 96 8C 45 4F 96 B2 15 41 A4>)
$$ ##END=
$$ 
$$ $$ hash MD5
$$ $$ F7 D0 66 9B 10 4D F5 F6 7E E2 5E F8 40 C7 06 3F
##$RELAX= 
##$RELAX= 
##$RELAX= 
##$RELAX= 
##$RELAX= 
##$RELAX= 
##$RELAX= 
##$RELAX= 
$$ Bruker specific parameters
$$ [...]
##$TP07= 0
##$TPNAME0= <>
##$TPNAME1= <>
##$TPNAME2= <>
##$TPNAME3= <>
##$TPNAME4= <>
##$TPNAME5= <>
##$TPNAME6= <>
##$TPNAME7= <>
##$TPOAL= (0..7)
0.5 0.5 0.5 0.5 0.5 0.5 0.5 0.5
##$TPOFFS= (0..7)
0 0 0 0 0 0 0 0
##$TUNHIN= 0
##$TUNHOUT= 0
##$TUNXOUT= 0
##$USERA1= <user>
##$USERA2= <user>
##$USERA3= <user>
##$USERA4= <user>
##$USERA5= <user>
##$V9= 5
##$VALIST= <valist>
##$VCLIST= <CCCCCCCCCCCCCCC>
##$VD= 0
##$VDLIST= <DDDDDDDDDDDDDDD>
##$VPLIST= <PPPPPPPPPPPPPPP>
##$VTLIST= <TTTTTTTTTTTTTTT>
##$WBST= 2048
##$WBSW= 25
##$XGAIN= (0..3)
0 0 0 0
##$XL= 0
##$YL= 0
##$YMAX_a= 9532271
##$YMIN_a= -6218610
##$ZGOPTNS= <>
##$ZL1= 120
##$ZL2= 120
##$ZL3= 120
##$ZL4= 120
##$ABSF1= 14.96694
##$ABSF2= -5.58559
##$ABSG= 5
##$ABSL= 3
##$ALPHA= 0
##$AQORDER= 0
##$ASSFAC= 0
##$ASSFACI= 0
##$ASSFACX= 0
##$ASSWID= 0
##$AUNMP= <proc_prof1d_extract.lims>
##$AXLEFT= 0
##$AXNAME= <>
##$AXNUC= <1H>
##$AXRIGHT= 0
##$AXTYPE= 0
##$AXUNIT= <>
##$AZFE= 0.1
##$AZFW= 0.1
##$BCFW= 0
##$BC_mod= 0
##$BYTORDP= 0
##$COROFFS= 0
##$CY= 15
##$DATMOD= 1
##$DC= 0
##$DFILT= <>
##$DTYPP= 0
##$F1P= 0
##$F2P= 0
##$FCOR= 0.5
##$FTSIZE= 131072
##$FT_mod= 6
##$GAMMA= 0
##$GB= 0
##$INTBC= 1
##$INTSCL= 1
##$ISEN= 128
##$LB= 0.3
##$LEV0= 0
##$LPBIN= 0
##$MAXI= 10000
##$MC2= 0
##$MEAN= 0
##$ME_mod= 0
##$MI= 0
##$NCOEF= 0
##$NC_proc= -3
##$NLEV= 6
##$NOISF1= 0
##$NOISF2= 0
##$NSP= 0
##$NTH_PI= 0
##$NZP= 0
##$OFFSET= 14.96694
##$PC= 1
##$PHC0= 31.40991
##$PHC1= 0
##$PH_mod= 1
##$PKNL= yes
##$PPARMOD= 0
##$PPDIAG= 0
##$PPIPTYP= 0
##$PPMPNUM= 2147483647
##$PPRESOL= 1
##$PSCAL= 4
##$PSIGN= 0
##$PYNMP= <proc.py>
##$REVERSE= no
##$SF= 400.130005470415
##$SI= 131072
##$SIGF1= 0
##$SIGF2= 0
##$SINO= 400
##$SIOLD= 131072
##$SPECTYP= <>
##$SREGLST= <1H.CDCl3>
##$SSB= 0
##$STSI= 131072
##$STSR= 0
##$SW_p= 8223.68421052632
##$SYMM= 0
##$S_DEV= 0
##$TDeff= 65536
##$TDoff= 0
##$TI= <>
##$TILT= no
##$TM1= 0
##$TM2= 0
##$TOPLEV= 0
##$USERP1= <user>
##$USERP2= <user>
##$USERP3= <user>
##$USERP4= <user>
##$USERP5= <user>
##$WDW= 1
##$XDIM= 131072
##$YMAX_p= 432945907
##$YMIN_p= -364157622
##$CURPLOT= <Network HP LaserJet P1505>
##$CURPRIN= <$Network HP LaserJet P1505>
##$DFORMAT= <normdp>
##$LAYOUT= <+/1D_H.xwp>
##$LFORMAT= <normlp>
##$PFORMAT= <normpl>
##$SURQMSG= 1
$$ End of Bruker specific parameters
$$ ---------------------------------
##NTUPLES= NMR SPECTRUM
##VAR_NAME=  FREQUENCY,     SPECTRUM/REAL,   SPECTRUM/IMAG
##SYMBOL=    X,             R,               I
##VAR_TYPE=  INDEPENDENT,   DEPENDENT,       DEPENDENT
##VAR_FORM=  AFFN,          ASDF,            ASDF
##VAR_DIM=   131072,        131072,          131072
##UNITS=     HZ,            ARBITRARY UNITS, ARBITRARY UNITS
##FACTOR=    0.0627417313425165, 1,          1
##FIRST=     8223.62146879498, -2492,        -92414
##LAST=      0,             -416,            -93285
##MIN=       0,             -364157622,      0
##MAX=       8223.62146879498, 432945907,    0
$$ Real data points
##PAGE= N=1
##DATA TABLE= (X++(R..R)), XYDATA
$$ [...]
61396E73599n76j304k06J513J607J40p66p4J307K474L403L852L378K710L343N283
$$ 573599 573023 571719 571513 573026 574633 574773 574007 573933 575240 577714 581117 584969 588347 591057 594400 599683
61380E99683O839P090O868O788O104M557L675M721O608P324O612N747N296M679
$$ 599683 606522 613612 620480 627268 633372 637929 641604 646325 652933 660257 666869 672616 677912 682591
61366F82591L703L163L678M978O490P828Q510P910N849L000N06p24o56k11m08
$$ 682591 686294 689457 693135 698113 704603 712431 720941 728851 734700 737700 738206 737482 736826 736615 736207
61351G36207j213j642j264r73j687k939l548l332l192l656m303m663m782m679
$$ 736207 734994 733352 732088 731115 729428 726489 722941 719609 716417 712761 708458 703795 699013 694334
61337F94334m027k740j282p3Q91J563J493M93q16j633j911k131k271j668n2J770
$$ 694334 690307 687567 686285 686212 687103 688666 690159 690652 689836 688203 686292 684161 681890 680222 680170 681940
61321F81940K675K451J963K023K506K720K447K191K420K988L572M372N794P470
$$ 681940 684615 687066 689029 691052 693558 696278 698725 700916 703336 706324 709896 714268 720062 727532
61307G27532Q237P413N709M405L914L719L607M059N170N991N703M996N377P248
$$ 727532 735769 743182 748891 753296 757210 760929 764536 768595 773765 779756 785459 790455 795832 803080
61293H03080R515J1134J2090J2607J2432J1500J0616J0561J1008J1067J0522R787
$$ 803080 812595 823729 835819 848426 860858 872358 882974 893535 904543 915610 926132 935919
61281I35919Q951P891P109P435Q684R464Q640O400L685J190q00k194l091l626
$$ 935919 944870 952761 959870 967305 975989 985453 994093 1000493 1004178 1005368 1004568 1002374 999283 995657
61267I95657l708l324l070l712n020n761n166l860k882k383j784p89L65J433K388
$$ 995657 991949 988625 985555 981843 976823 971062 965896 962036 959154 956771 954987 954198 954563 955996 958384
61252I58384L201L775M244N104O834R241J1240J1808J1269J1035J1546J1248Q552
$$ 958384 961585 965360 969604 974708 981542 990783 1002023 1013831 1025100 1036135 1047681 1058929 1067481
61239A067481M143R0k859n521q039r466r847j0669j2336j3133j1958j0304r931
$$ 1067481 1071624 1071714 1068855 1063334 1055295 1045829 1035982 1025313 1012977 999844 987886 977582 967651
61226I67651j0118r128p218n933n279l923j926q28q34j18K310M977O093N959O202
$$ 967651 957533 948405 941187 935254 929975 926052 924126 923298 922464 922346 924656 929633 935726 941685 947887
61211I47887P537R283J0482J0824J0839J1461J3066J4846J5769J5971J6420J7371
$$ 947887 955424 964707 975189 986013 996852 1008313 1021379 1036225 1051994 1067965 1084385 1101756
61199A101756J8224J8886J9862K0719J9942J6964J3285J0727R469Q506P226N676
$$ 1101756 1119980 1138866 1158728 1179447 1199389 1216353 1229638 1240365 1249834 1258340 1265566 1271242
61187A271242L920J942k13k629n399q036r634r942r583r091q584q591r827j1647
$$ 1271242 1275162 1277104 1276891 1274262 1268863 1260827 1251193 1241251 1231668 1222577 1213993 1205402 1195575 1183928
61173A183928j2156j0777r357r601j0566j0189q241o080m188j929L41R38q16l290
$$ 1183928 1171772 1160995 1151638 1142037 1131471 1121282 1113041 1106961 1102773 1100844 1101185 1102123 1101307 1098017
61159A098017m253l164j263m1L2l23oJ225K408K480J391j72j622k484k243j000
$$ 1098017 1093764 1090600 1089337 1089296 1089328 1089005 1088999 1090224 1092632 1095112 1096503 1096331 1094709 1092225 1089982 1088982
61143A088982K44R36J934L976N849N747M287M253P032J0923J3548J4422J4292
$$ 1088982 1089226 1090162 1092096 1096072 1101921 1107668 1111955 1116208 1123240 1134163 1147711 1162133 1176425
61130A176425J3452J1873J0063Q526O856M410J446j099k597k889k019o29K7p64
$$ 1176425 1189877 1201750 1211813 1220339 1227195 1231605 1233051 1231952 1229355 1226466 1224447 1223818 1223845 1223081
61116A223081k322l618m533n308n507m773m174n176p322q504p941p411q707j1099
$$ 1223081 1220759 1217141 1212608 1207300 1201793 1197020 1192846 1187670 1180348 1171844 1163903 1156492 1147785 1136686
61102A136686j2408j1798j0306r113q608q910r965j0824j0014p278m152k219j384
$$ 1136686 1124278 1112480 1102174 1093061 1084453 1075543 1065578 1054754 1044740 1037462 1033310 1031091 1029707
61089A029707n25P67J959K569K360P99k407o133q345q396p764p967q686q826q495
$$ 1029707 1029182 1029949 1031908 1034477 1036837 1037636 1035229 1029096 1020751 1012355 1004591 996624 987938 979112 970617
61074I70617q591q923q268o302m076k229j3L198O498Q504R191R702J0696J1869
$$ 970617 962026 953103 944835 938533 934457 932228 932215 935413 941911 950415 959606 969308 980004 991873
61060I91873J2997J4504J6642J8728J9640J9006J7677J6989J7540J8598J8904
$$ 991873 1004870 1019374 1036016 1054744 1074384 1093390 1111067 1128056 1145596 1164194 1183098
61049A183098J8127J7234J7176J7575J7192J5546J3387J1530R863P743M942J660
$$ 1183098 1201225 1218459 1235635 1253210 1270402 1285948 1299335 1310865 1320728 1328471 1333413 1335073
61037A335073j915n620r023j1644j3411j4545j5073j4947j4524j4391j4584j4561
$$ 1335073 1333158 1327538 1318515 1306871 1293460 1278915 1263842 1248895 1234371 1219980 1205396 1190835
61025A190835j4065j3417j2704j1401r323p269n987n054l714k440k437l585m021
$$ 1190835 1176770 1163353 1150649 1139248 1129925 1122656 1116669 1111615 1107901 1105461 1103024 1099439 1095418
61012A095418k305Q12L282M003L752M221O373R471J1782J2462J2480J3143J4324
$$ 1095418 1093113 1093925 1097207 1101210 1104962 1109183 1115556 1125027 1136809 1149271 1161751 1174894 1189218
60999A189218J5241J6462J9385K3617K6835K8011K8949L1403L4425L6189L7069
$$ 1189218 1204459 1220921 1240306 1263923 1290758 1318769 1347718 1379121 1413546 1449735 1486804
60988A486804L8832M1591M3839M5299M7631N1991N7469O2380O5870O8043O9735
$$ 1486804 1525636 1567227 1611066 1656365 1703996 1755987 1813456 1875836 1941706 2009749 2079484
60977B079484P2511P7712Q4903R2064R7649J02031J06766J13199J21609J31036
$$ 2079484 2151995 2229707 2314610 2406674 2504323 2606354 2713120 2826319 2947928 3078964
60967C078964J39893J47337J53914J60525J67686J76514J89151K06533K26533
$$ 3078964 3218857 3366194 3520108 3680633 3848319 4024833 4213984 4420517 4647050
60958D647050K46307K66018K88453L15410L46534L81339M20234M64090N15172
$$ 4647050 4893357 5159375 5447828 5763238 6109772 6491111 6911345 7375435 7890607
60949G890607N77805O54813P43581Q39287R41805J055174J181073J319843J479400
$$ 7890607 8468412 9123225 9866806 10706093 11647898 12703072 13884145 15203988 16683388
60940A6683388J674619J914544K200851K543875K955766L390857L690039L631512
$$ 16683388 18358007 20272551 22473402 25017277 27973043 31363900 35053939 38685451
60932C8685451L092901K180962J184042L82980r3064k49974j36104J74097N15333
$$ 38685451 41778352 43959314 45143356 45526336 45433272 45183298 45047194 45221291 45736624
60923D5736624O29253L04196m59253j434477k326502k945832l257795l320280
$$ 45736624 46365877 46670073 46210820 44776343 42449841 39504009 36246214 32925934
60915C2925934l211888l004068k755507k503555k261061k028011j804652j593100
$$ 32925934 29714046 26709978 23954471 21450916 19189855 17161844 15357192 13764092
60907A3764092j394169j209110j042203q97820p76448o75685n92940n24942m66911
$$ 13764092 12369923 11160813 10118610 9220790 8444342 7768657 7175717 6650775 6183864
60898F183864m15060l68881l29247k95434k65502k38152k12669j88394j65817
$$ 6183864 5768804 5399923 5070676 4775242 4509740 4271588 4058919 3870525 3704708
60889C704708j46989j33384j24219j17880j13509j10055j05379r8172q9693q2076
$$ 3704708 3557719 3424335 3300116 3182236 3068727 2958672 2853293 2755121 2665428 2583352
60879B583352p5864p0553o6261o3037n9572n4566m8803m4117m0810l7726l4412
$$ 2583352 2507488 2436935 2370674 2307637 2248065 2193499 2144696 2100579 2059769 2022043 1987631
60868A987631l1435k8871k6192k3547k1534j9779j7368j4724j3490j4205j5584
$$ 1987631 1956196 1927325 1901133 1877586 1856052 1836273 1818905 1804181 1790691 1776486 1760902
60857A760902j6488j7278j8644k0339k1769k2922k3962k4683k5014k5423k6107
$$ 1760902 1744414 1727136 1708492 1688153 1666384 1643462 1619500 1594817 1569803 1544380 1518273
60846A518273k6368k5581k4322k3740k4053k4443k4390k4189k3940k2857k0299
$$ 1518273 1491905 1466324 1442002 1418262 1394209 1369766 1345376 1321187 1297247 1274390 1254091
60835A254091j7044j4703j3936j3988j4032j4158j4643j5094j5015j4689j4640
$$ 1254091 1237047 1222344 1208408 1194420 1180388 1166230 1151587 1136493 1121478 1106789 1092149
60824A092149j4692j4402j4174j4863j6336j7348j7054j5858j4586j3591j2799
$$ 1092149 1077457 1063055 1048881 1034018 1017682 1000334 983280 967422 952836 939245 926446
60813I26446j1997j0930r692q951r157r647r385q401p554p011o144m932m187m175
$$ 926446 914449 903519 893827 884876 875719 866072 856687 848286 840732 833721 827577 822645 818458 814283
60799H14283m204l882l636l723l911m344n401o423o094m497l297l322l599l311
$$ 814283 810079 806197 802561 798838 794927 790583 785182 778759 772665 768168 764871 761549 757950 754639
60785G54639k952k806k209j386k024m549o728o647n374m677l944j831L94J67k334
$$ 754639 751687 748881 746672 745286 743262 738713 731985 725338 719964 715287 711343 709512 709906 710073 707739
60770G07739m239m052l135k896k827k031q43n6K24L83P43J442K096J887P98K15
$$ 707739 703500 699448 696313 693417 690590 688559 687716 687660 687884 688267 689010 690452 692548 694435 695233 695448
60754F95448J087K194J809N09K96J275J449n7j741k270k210k494k858k836k901
$$ 695448 696535 698729 700538 701047 701343 702618 704067 704010 702269 699999 697789 695295 692437 689601 686700
60739F86700l613m617n294n542n401m822m246m450n428o349o735o708o094m709
$$ 686700 683087 678470 673176 667634 662233 657411 653165 648715 643287 636938 630203 623495 617401 612692
60725F12692l652m492o697p596n779k950j418j342j697k451m046n650n675l795
$$ 612692 609040 604548 597851 590255 584476 581526 580108 578766 577069 574618 570572 564922 559247 555452
60711E55452j146J207K916L786L669K969K467K509K862L360M166N360O510O831
$$ 555452 554306 555513 558429 562215 565884 568853 571320 573829 576691 580051 584217 589577 596087 602918
60697F02918N980M815M777O002O678N242K744J621K351L024K328J204Q81R43L32
$$ 602918 608898 613713 618490 624492 631170 636412 639156 640777 643128 646152 648480 649684 650565 651508 651840
60682F51840j076k824m720o454p334p294p162p319p178o689o853p905q399p348
$$ 651840 650764 647940 643220 636766 629432 622138 614976 607657 600479 593790 586937 579032 570633 563285
60668E63285n855n261n016m048k942k846l159k408q51j22n80r63o52l98n90o12
$$ 563285 557430 552169 547153 543105 540163 537317 534158 531750 530899 530777 530197 529234 528582 528184 527594 526982
60652E26982k81l54j091j509p09R82K592L435L239K205J123P75J167J869K744
$$ 526982 526701 526347 525256 523747 523038 524020 526612 530047 533286 535491 536614 537389 538556 540425 543169
60637E43169L489L109J189o03j15K213L655L059K502M094O795P944O949N719N766
$$ 543169 546658 549767 550956 550353 550238 552451 556106 559165 561667 565761 572556 580500 587449 593168 598934
60622E98934O462O475N811N688O849Q544R353Q670P143N679M515L488K649J998
$$ 598934 605396 611871 617682 623370 630219 638763 648116 656786 663929 669608 674123 677611 680260 682258
60608F82258R86r58l515n726p084p669p445o334n080m919n978o868o369m849l503
$$ 682258 683244 682286 678771 673045 665961 658292 650847 644513 639433 634514 628536 621668 615299 610450 606947
60593F06947k799k404k122k082k059j423j4J294J375J14j450k420l065m090n172
$$ 606947 604148 601744 599622 597540 595481 594058 594044 595338 596713 596827 595377 592957 589892 585802 580630
60578E80630n204m108l205l136k666q11R39L42k035l101j374J113J871J179R50
$$ 580630 575426 571318 568113 564977 562311 561500 562439 562781 560746 557645 556271 557384 559255 560434 561384
60563E61384J657K122J760J469K113L288L908L487K491J778J733J956J927J950
$$ 561384 563041 565163 566923 568392 570505 573793 577701 581188 583679 585457 587190 589146 591073 593023
60549E93023K802M247M725L207Q21k72P35K766M395N001M536L270K009J723K519
$$ 593023 595825 600072 604797 608004 608825 608553 609288 612054 616449 621450 625986 629256 631265 632988 635507
60534F35507L549M193M630M990M794L885L144L310L618K801J284R53K418L890
$$ 635507 639056 643249 647879 652869 657663 661548 664692 668002 671620 674421 675705 676658 679076 682966
60520F82966L694K763L299N564P651Q359Q720J0108J2203J3757J4515J5299J6693
$$ 682966 686660 689423 692722 698286 705937 714296 723016 733124 745327 759084 773599 788898 805591
60507H05591J8558K0654K2895K5064K6727K7324K6093K2431J6871J1116O380K210
$$ 805591 824149 844803 867698 892762 919489 946813 972906 995337 1012208 1023324 1029704 1031914
60495A031914k209o245q473q715q014o711m034J03M434Q068J1556J5504J9284
$$ 1031914 1029705 1023460 1014987 1006272 998258 991547 987513 987616 992050 1000118 1011674 1027178 1046462
60482A046462K2175K4787K8223L2429L6566M0617M5409N1059N6400O0028O1171
$$ 1046462 1068637 1093424 1121647 1154076 1190642 1231259 1276668 1327727 1384127 1444155 1505326
60471A505326N9463N4631M6761L6426K4414J1647n93j0958j8744k4160k7858l0501
$$ 1505326 1564789 1619420 1666181 1702607 1727021 1738668 1738075 1727117 1708373 1684213 1656355 1625854
60459A625854l2553l3988l4007l1639k6956k1349j6294j2004p571k323L323Q388
$$ 1625854 1593301 1559313 1525306 1493667 1466711 1445362 1429068 1417064 1409493 1407170 1410493 1418881
60447A418881J2469J6173K0495K5964L2425L9486M6886N4432O1863O9007P5950
$$ 1418881 1431350 1447523 1468018 1493982 1526407 1565893 1612779 1667211 1729074 1798081 1874031
60436A874031Q2765Q9047R3748R5582R3655Q7861P8924O7999N6164M4248L3135
$$ 1874031 1956796 2045843 2139591 2235173 2328828 2416689 2495613 2563612 2619776 2664024 2697159
60425B697159K4104J8568J7298J9769K4133K7843K8576K4899J6341K942j4973
$$ 2697159 2721263 2739831 2757129 2776898 2801031 2828874 2857450 2882349 2898690 2901632 2886659
60414B886659l6390n9117q0331r7967j11414j20626j25127j24616j20343j14713
$$ 2886659 2850269 2791152 2710821 2612854 2501440 2380814 2255687 2131071 2010728 1896015
60404A896015j09045j02525r4117q4679p6062o8704o1550n4308m8141m3701l9961
$$ 1896015 1786970 1684445 1590328 1505649 1429587 1360883 1299333 1245025 1196884 1153183 1113222
60393A113222l5881l2046k9442k7558k5108k2026j9363j7528j5975j4505j3392
$$ 1113222 1077341 1045295 1015853 988295 963187 941161 921798 904270 888295 873790 860398
60382H60398j2256j0189p438n623n679o657p273p608q315r027q763p628o923p510
$$ 860398 848142 837953 830515 824892 819213 812556 805283 797675 789360 780333 771570 763942 757019 749509
60368G49509q728r246q430o767n187m235l783l419l085l139l764m541m759m062
$$ 749509 740781 731535 723105 716338 711151 706916 703133 699714 696629 693490 689726 685185 680426 676364
60354F76364k687j141K48J398K178K286J770J413J883K464J606o38j805N2L429
$$ 676364 673677 672536 672784 674182 676360 678646 680416 681829 683712 686176 687782 687144 685339 685391 688820
60339F88820M880L323J032K68O92R68J130J919K909K953K098J552J838K195K031
$$ 688820 693700 697023 698055 698323 699015 699983 701113 703032 705941 708894 710992 712544 714382 716577 718608
60324G18608J936K725M057M548L297J086j59O62K587L749L566L025K803K328J122
$$ 718608 720544 723269 727326 731874 735171 736257 736098 736760 739347 743096 746662 749687 752490 754818 755940
60309G55940l5k06L46R02J622K914M086L976K804K115K827M397N881O735O579
$$ 755940 755905 755699 756045 756947 758569 761483 765569 769545 772349 774464 777291 781688 787569 794304 800883
60294H00883N364M084M205N943Q008R320R983J0205R417P380N189M075L686K615
$$ 800883 806247 810331 814536 820479 828487 837807 847790 857995 867412 874792 879981 884056 887742 890357
60280H90357L15k432m833o819q324q752p723n928m663m525m921m849m041l132
$$ 890357 890672 888240 883407 876588 868264 859512 851789 845861 841198 836673 831752 826903 822862 819730
60266H19730k771k732k216j009jk76j755l088k916j111J319L419N115O848Q754
$$ 819730 816959 814227 812011 811002 811001 810725 808970 805882 802966 801855 803174 806593 811708 818556 827310
60251H27310J0572J2327J4531J7423K0379K2676K4657K7555L1819L5978L7525
$$ 827310 837882 850209 864740 882163 902542 925218 949875 977430 1009249 1045227 1082752
60240A082752L5046K9334K2396J5309P313k680j3868k3621l0056l3684l5764l5919
$$ 1082752 1117798 1147132 1169528 1184837 1192150 1189470 1175602 1151981 1121925 1088241 1052477 1016558
60228A016558l2998k8002k4190k3372k3573k1709j7583j3682j1597j0534r350
$$ 1016558 983560 955558 931368 907996 884423 862714 845131 831449 819852 809318 799968
60217G99968q246p624o874n533m636n471p476q660p994o175m137k212r52j193
$$ 799968 791722 784098 777224 771691 767055 761584 754108 745448 737454 731279 727142 724930 723978 722785
60203G22785k490k737p00J898K215o3k420k740j502l75j07n05j374k387k666j597
$$ 722785 720295 717558 716858 718756 720971 720908 718488 715748 714246 713871 713764 713259 711885 709498 706832 705235
60187G05235J92J535K129K493K775K593J956J471J445J610J894K654L837M703
$$ 705235 705427 706962 709091 711584 714359 716952 718908 720379 721824 723434 725328 727982 731819 736522
60173G36522M778M410L986L348K551K448L515M716M677L723L491M350M688L329
$$ 736522 741300 745710 749696 753044 755595 758043 761558 766274 770951 774674 778165 782515 787203 790532
60159G90532J541J450L195M946N520N613O175O841O693N844N287N495N963O101
$$ 790532 792073 793523 796718 801664 807184 812797 818972 825813 832506 838350 843637 849132 855095 861196
60145H61196N909N632N369N139N022M919M518L686K703J974J653J731K195K920
$$ 861196 867105 872737 878106 883245 888267 893186 897704 901390 904093 906067 907720 909451 911646 914566
60131I14566L565L757L309K239P25q51k051k745l089l086k533j568q91r20j085
$$ 914566 918131 921888 925197 927436 928161 927310 925259 922514 919425 916339 913806 912238 911347 910427 909342
60116I09342n62M67J035R01R99J979L070L163K499K282K760K705J104j462l588
$$ 909342 908780 909247 910282 911183 912182 914161 917231 920394 922893 925175 927935 930640 931744 930282 926694
60101I26694m544m549m095l681l675l701k565L01L516M940M245L188L179L734
$$ 926694 922150 917601 913506 909825 906150 902449 899884 900185 903701 908641 912886 916074 919253 922987
60087I22987L934M317O105R072J1317J1288R378P399O862P739Q688Q546P593P059
$$ 922987 926921 931238 937343 946415 957732 969020 978398 985797 992659 1000398 1009086 1017632 1025225 1032284
60073A032284P473Q153Q388Q226P674O247M027K169J353P09o13j733j481p60j465
$$ 1032284 1039757 1047910 1056298 1064524 1072198 1078445 1082472 1084641 1085994 1086703 1086090 1084357 1082876 1082116 1080651
60058A080651l310l843j904Q88K657L532M492N603O518P558R081J0541J1296J1591
$$ 1080651 1077341 1073498 1071594 1072482 1075139 1078671 1083163 1088766 1095284 1102842 1111923 1122464 1133760 1145351
60044A145351J1871J1750J0646Q843P077N478L719J787p3j757l066l563l225k772
$$ 1145351 1157222 1168972 1179618 1188461 1195538 1201016 1204735 1206522 1206449 1204692 1201626 1198063 1194838 1192066
60030A192066k803l135l362l417l288k951k971m125n885o605n987n976p962j0513
$$ 1192066 1189263 1186128 1182766 1179349 1176061 1173110 1170139 1166014 1160129 1153524 1147537 1141561 1133599 1123086
60016A123086j1526j1509j2705j5512j7880j8157j6766j4947j3435j2641j2664
$$ 1123086 1111560 1100051 1087346 1071834 1053954 1035797 1019031 1004084 990649 978008 965344
60005I65344j2866j2479j1770j1441j1091r688p557o283o353o466n621m443l787
$$ 965344 952478 939999 928229 916788 905697 896009 888452 882169 875816 869350 863729 859286 855499
59992H55499l455l027k796k967k991k437j754j393j009j98O92J169J261J006P7
$$ 855499 852044 849017 846221 843254 840263 837826 836072 834679 833670 833472 834164 835333 836594 837600 837677
59977H37677j382k359k199j540j342j568j654j650k050k900l789m438m736m581
$$ 837677 836295 833936 831737 830197 828855 827287 825633 823983 821933 819033 815244 810806 806070 801489
59963H01489m259m475n405o104n428l342q66P72P55r26l169m499m577m377m492
$$ 801489 797230 792755 787350 781246 775818 772476 771610 772382 773137 772211 769042 764543 759966 755589 751097
59948G51097m176k697o90P33J403J730J703J317J200J621J580K42j383j660p29
$$ 751097 746921 744224 743534 744267 745670 747400 749103 750420 751620 753241 754821 755063 753680 752020 751291
59933G51291j15l11n52p90j822l252l305j296J449L828O207Q529R100O927L813
$$ 751291 751176 750865 750313 749523 747701 744449 741144 739848 741297 745125 751332 759861 768961 775888 779701
59918G79701K305K547K827K426J947J356q2j808j970K8K472L562L375K940K609
$$ 779701 782006 784553 787380 789806 791753 793109 793027 791219 789249 789277 791749 795311 798686 801626 804235
59903H04235K203J813J436N68q49j693r18P54J454L52j498k548k334j555j099
$$ 804235 806438 808251 809687 810255 809406 807713 806795 807549 809003 809355 807857 805309 802975 801420 800321
59888H00321j118q54M94K605M050L861K617J596J358J786K875M476N666N612N017
$$ 800321 799203 798349 798843 801448 805498 809359 811976 813572 814930 816716 819591 824067 829733 835345 840362
59873H40362N431O896P571O264M239L610M636N596N050L429K491L619O483R162
$$ 840362 845793 852689 860260 866524 870763 874373 879009 884605 889655 893084 895575 899194 905677 914839
59859I14839R891Q922Q220R020J0387J0661R676Q624Q156P647O349M406K420O06
$$ 914839 924730 933652 941872 950892 961279 971940 981616 990240 998396 1006043 1012392 1016798 1019218 1019824
59845A019824j156k645l200k598j924k943o016q919q746n161r39J088Q74M27J178
$$ 1019824 1018668 1016023 1012823 1010225 1008301 1005358 999342 990423 981677 976516 975577 976665 977539 977966 979144
59830I79144K881M514N284M926L902L152L223L736M159M593N230N612N298M868
$$ 979144 982025 986539 991823 996749 1000651 1003803 1007026 1010762 1014921 1019514 1024744 1030356 1035654 1040522
59816A040522N314O594P598P432O052L838J299r29k507l776n150o402p032o955
$$ 1040522 1045836 1052430 1060028 1067460 1073512 1077350 1078649 1077720 1075213 1071437 1066287 1059885 1052853 1045898
59802A045898o192m557k518j690l153n604o547n226l132j700q51R6J423L288N882
$$ 1045898 1039706 1035149 1032631 1030941 1027788 1022184 1015637 1010411 1007279 1005579 1004728 1004824 1006247 1009535 1015417
59787A015417Q915J1731J4010J5482J5194J2356P881L708N87j928l284j891J932
$$ 1015417 1024332 1036063 1050073 1065555 1080749 1093105 1100986 1104694 1105281 1103353 1100069 1098178 1100110
59774A100110M961M435J056k611n505q334j1396j3879j4976j4558j2932j0902
$$ 1100110 1105071 1109506 1110562 1107951 1102446 1094112 1082716 1068837 1053861 1039303 1026371 1015469
59762A015469r666r719j0104r554q000o280m801l379k030j046n45o12j581l393
$$ 1015469 1005803 996084 985980 976426 968426 962146 957345 953966 951936 950890 950345 949733 948152 944759
59748I44759n101n813n930o563p804q481p643n714l907k941k492j876j175j426
$$ 944759 939658 933845 927915 921352 913548 905067 897424 891710 887803 884862 882370 880494 879319 877893
59734H77893l272n591o335m804k299j79J571L304M335L713J761j64j113j055l80
$$ 877893 874621 869030 862695 857891 855592 855413 856984 860288 864623 868336 870097 869933 868820 867765 867385
59719H67385K96K28p42j835k273k202k088j793j005j53P3k37m60l98k50j1L68
$$ 867385 867681 867909 867167 865332 863059 860857 858769 856976 855971 855818 855891 855654 855194 854796 854546 854535 854903
59702H54903N31K58O2M76J108J340J626K971N331P454Q303P793O330M611L657
$$ 854903 855434 855692 855754 856230 857338 858678 860304 863275 868606 876060 884363 892156 898486 903097 906754
59687I06754L942M410L504J296m07m87L8m68k098l434l300j789J69J708K404K126
$$ 906754 910696 915106 918610 919906 919499 919012 919050 918582 916484 913050 909750 907961 908130 909838 912242 914368
59671I14368Q50j125k922l560k972k169k066k454k512k003j426j210j307j451
$$ 914368 915218 914093 911171 907611 904639 902470 900404 897950 895438 893435 892009 890799 889492 888041
59657H88041j383r11m9J011K175L467M635N310N651O259P235Q050Q585R359J0255
$$ 888041 886658 885747 885698 886709 888884 892351 896986 902296 907947 914206 921441 929491 938076 947435 957690
59642I57690J0237R071Q213Q939J0544J1586J1983J2486J2859J2246J0807R342
$$ 957690 967927 976998 985211 994150 1004694 1016280 1028263 1040749 1053608 1065854 1076661 1086003
59630A086003P643M891J587o17j021m23M50J487K074J217q19k458k910l042l736
$$ 1086003 1093646 1098537 1100124 1099507 1098486 1098063 1098513 1100000 1102074 1103291 1102472 1100014 1097104 1094062 1090326
59615A090326m702n370n728n723n069m148l900m290m161l192k590l004l143j668
$$ 1090326 1085624 1080254 1074526 1068803 1063734 1059586 1055686 1051396 1047235 1044043 1041453 1038449 1035306 1033638
59601A033638O95K257K778L515N275P587R447J0029Q995O960N336M927M984M296
$$ 1033638 1034333 1036590 1039368 1042883 1048158 1055745 1065192 1075221 1084216 1091176 1096512 1101439 1106423 1110719
59587A110719K741R65r74l569o718r598j1728j3346j4586j5096j4688j3861j3256
$$ 1110719 1113460 1114425 1113451 1109882 1103164 1093566 1081838 1068492 1053906 1038810 1024122 1010261 997005
59574I97005j2961j2588j1805j0632r331q244p676p697p915p632o580n542n751
$$ 997005 984044 971456 959651 949019 939688 931444 923768 916071 908156 900524 893944 888402 882651
59561H82651p381r104r572q982q562q984r943j0921j1430j0711q400n542l831
$$ 882651 875270 866166 856594 847612 839050 830066 820123 809202 797772 787061 778661 773119 769288
59548G69288l619l588k741j700j459j853k013j631j110q21q99j297j638j352l41
$$ 769288 765669 762081 759340 757640 756181 754328 752315 750684 749574 748753 747854 746557 744919 743567 743226
59533G43226P97J561K035K336K108J094k47j130j273r70p05q53j452k133k612
$$ 743226 744023 745584 747619 749955 752063 753157 752910 751780 750507 749537 748832 747979 746527 744394 741782
59518G41782l186m121m704l905k159j347k493m366n082m273k970k028j608j652
$$ 741782 738596 734475 729771 725866 723707 722360 719867 715501 710419 706146 703176 701148 699540 697888
59504F97888j980k081j450m5J843L786N030M781L223J657J159J654K733M500O875
$$ 697888 695908 693827 692377 692332 694175 697961 702991 707772 710995 712652 713811 715465 718198 722698 729573
59489G29573Q813R315Q736Q212Q202Q516R335J1002J3039J4582J5888J8219K1788
$$ 729573 738386 747701 756437 764649 772851 781367 790702 801704 814743 829325 845213 863432 885220
59476H85220K4657K4231J9600J2238M790p13l855n452o260o302n455m184l127
$$ 885220 909877 934108 953708 965946 970736 970023 966168 960716 954456 948154 942699 938515 935388
59463I35388k307j457q94j285k533l622l875l751m091n046o150p114q012q746
$$ 935388 933081 931624 930730 929445 926912 923290 919415 915664 911573 906527 900377 893263 885251 876505
59449H76505q842q090p154p084q155r501j0101r739q695o977m571k213j045j358
$$ 876505 867663 859573 852419 845335 837180 827679 817578 807839 799144 792167 787596 785383 784338 782980
59435G82980k333l092l292k765j479j49J48n59r04L5J595K720L406M138M746M903
$$ 782980 780647 777555 774263 771498 770019 769870 770018 769459 768555 768590 770185 772905 776311 780449 785195 790098
59419G90098N109O002P021O978N794M633M271M258L754K397L10j891l096k459
$$ 790098 795207 801209 808230 815208 821002 825635 829906 834164 837918 840315 840625 838734 835638 833179
59405H33179m56J393J971J281q4j406j790o58J415L083L814M450N795P397Q262
$$ 833179 832723 834116 836087 837368 837284 835878 834088 833430 834845 837928 841742 846192 851987 859384 867646
59390H67646Q213P859P586P298O851O028M264J252k064l898l533k222j806k798
$$ 867646 875859 883718 891304 898602 905453 911481 915745 916997 914933 911035 907502 905280 903474 900676
59376I00676m342n508n877n162l366j302o1L57J004K321L535M228N307P586J0320
$$ 900676 896334 890826 884949 879787 876421 875119 875058 875415 876419 878740 882275 886503 891810 899396 909716
59361I09716J2299J3464J4254J4249J3152J2499J4454J9110K4701L0137L4977
$$ 909716 922015 935479 949733 963982 977134 989633 1004087 1023197 1047898 1078035 1113012
59350A113012L6847L1868J9289L808q244j3946j4190j1103o698k441J924Q070
$$ 1113012 1149859 1181727 1201016 1204824 1196580 1182634 1168444 1157341 1150643 1148202 1150126 1158196
59338A158196J5636K0024J6166M444r042j8264k1848k2027k1151k0022j8356j5780
$$ 1158196 1173832 1193856 1210022 1214466 1205424 1187160 1165312 1143285 1122134 1102112 1083756 1067976
59326A067976j2570r660p660o173m515k712j011R21L304N197N596N248N913P831
$$ 1067976 1055406 1045746 1038086 1031913 1027398 1024686 1023675 1024596 1027900 1033097 1038693 1043941 1049854 1057685
59312A057685R412R665R436R721J0179J0152J0004J0319J0564R613P435N259M082
$$ 1057685 1067097 1076762 1086198 1095919 1106098 1116250 1126254 1136573 1147137 1156750 1164185 1169444 1173526
59299A173526L630K988J841Q02O27J380K581L894N369O997Q586J0115J1621J2604
$$ 1173526 1177156 1180144 1181985 1182787 1183414 1184794 1187375 1191269 1196638 1203635 1212221 1222336 1233957 1246561
59285A246561J2434J1632J1772J3376J4898J4795J3737J3436J3915J3555J1610
$$ 1246561 1258995 1270627 1282399 1295775 1310673 1325468 1339205 1352641 1366556 1380111 1391721
59274A391721R121P127N400L274O39k257n005o718o665n673n851q156j1000j2058
$$ 1391721 1400842 1407969 1413369 1416643 1417282 1415025 1410020 1403302 1396637 1390964 1385113 1376957 1365957 1353899
59260A353899j0924r284q778r423j0128j0260j0315j1064j2262j2769j2039j0956
$$ 1353899 1342975 1333691 1324913 1315490 1305362 1295102 1284787 1273723 1261461 1248692 1236653 1225697
59248A225697j0726j1412j2062j1833j0412p840m670j879J99K344N127P852R851
$$ 1225697 1214971 1203559 1191497 1179664 1169252 1161412 1156742 1154863 1155062 1157406 1162533 1170385 1180236
59235A180236J1977J5024J7094J4619O387m909j5445k3037k7003k7358k5226k2623
$$ 1180236 1192213 1207237 1224331 1238950 1245337 1240428 1224983 1201946 1174943 1147585 1122359 1099736
59223A099736k0552j8226j5041j2162j0978j0866r873p180l739p22J623L610N529
$$ 1099736 1079184 1060958 1045917 1033755 1022777 1011911 1002038 994858 991119 990397 992020 995630 1001159
59210A001159P478R275J0464J0753J0360R656Q615O948M656K328P91L22K9j489
$$ 1001159 1008637 1017912 1028376 1039129 1049489 1059145 1067760 1074708 1079364 1081692 1082483 1082805 1082834 1081345
59196A081345m348o714o847n381m374m386m138l140k694l525m180l235j668j455
$$ 1081345 1076997 1070283 1063436 1058055 1053681 1049295 1045157 1042017 1039323 1035798 1031618 1028383 1026715 1025260
59182A025260k595l193k028M16L068N026N445M131K348J753K455L167L350L873
$$ 1025260 1022665 1019472 1017444 1017860 1020928 1025954 1031399 1035530 1037878 1039631 1042086 1045253 1048603 1052476
59168A052476N210O336O078M665L181K190J676J665K002J899O97r91j747j135
$$ 1052476 1057686 1064022 1070100 1074765 1077946 1080136 1081812 1083477 1085479 1087378 1088075 1087084 1085337 1084202
59154A084202l26o03j836k919l271l300l465l557l209k601k324k641l222l506
$$ 1084202 1083876 1083273 1081437 1078518 1075247 1071947 1068482 1064925 1061716 1059115 1056791 1054150 1050928 1047422
59140A047422l080j851j75J177J489P20m12j010o52L81J481K352L355M978O956
$$ 1047422 1044342 1042491 1042316 1043493 1044982 1045702 1045290 1044280 1043628 1044009 1045490 1047842 1051197 1056175 1063131
59125A063131Q292Q425Q039Q207Q955R125P780N385L404K778K878K142Qj990j680
$$ 1063131 1071423 1079848 1087887 1096094 1105049 1114174 1121954 1127339 1130743 1133521 1136399 1138541 1138549 1136559 1134879
59110A134879J081L968M698L285J294k57j324j832j467m80L91Q81J268J336J40
$$ 1134879 1135960 1139928 1144626 1147911 1149205 1148948 1147624 1145792 1144325 1143845 1144236 1145117 1146385 1147721 1147861
59095A147861k781o506r413j0624j0664j0818j1851j3323j4284j4509j4431j3974
$$ 1147861 1145080 1138574 1129161 1118537 1107873 1097055 1085204 1071881 1057597 1043088 1028657 1014683
59083A014683j2464j0163q640q752r254q582p180o603o939o760n374l544j979
$$ 1014683 1002219 992056 983416 974664 965410 956828 949648 943045 936106 929346 923972 920428 918449
59070I18449o31M48R00R85J513K731M319O371R023J1329J2042J1704J2198J4028
$$ 918449 917818 918266 919166 920151 921664 924395 928714 935085 944108 955437 967479 979183 991381 1005409
59056A005409J5599J5750J5255J5261J5766J6378J7087J7424J6375J4013J1827
$$ 1005409 1021008 1036758 1052013 1067274 1083040 1099418 1116505 1133929 1150304 1164317 1176144
59045A176144J0439Q605N623L220L332N164O207N425L740J898k97k653m130m221
$$ 1176144 1186583 1195188 1200811 1204031 1207363 1212527 1218734 1224159 1227899 1229797 1229500 1226847 1222717 1218496
59031A218496l748l883m875n946o218n714n525o719r026j1048j1950j2213j2579
$$ 1218496 1214748 1210865 1205990 1200044 1193826 1188112 1182587 1175868 1166842 1155794 1143844 1131631 1119052
59018A119052j3083j3485j3745j3654j2844j1754j1593j2698j3790j3647j2686
$$ 1119052 1105969 1092484 1078739 1065085 1052241 1040487 1028894 1016196 1002406 988759 976073
59007I76073j1935j1286r792p300m856l629l902m851n102l997k410j614j431p30
$$ 976073 964138 952852 943060 935760 930904 927275 923373 918522 913420 909423 907013 905399 903968 903238
58993I03238K97Q7j624k988k921k749l531l734j621J480K744J907J208J764K468
$$ 903238 903535 903622 901998 899010 896089 893340 889809 886075 884454 885934 888678 890585 891793 893557 896025
58978H96025K510K651L432M097M134M354N508P027Q007Q626R701J1326J2706J3227
$$ 896025 898535 901186 904618 908715 912849 917203 922711 929738 937745 946371 956072 967398 980104 993331
58964I93331J3353J4262J6477J8901J9758J8631J6875J5648J4432J2275R410O623
$$ 993331 1006684 1020946 1037423 1056324 1076082 1094713 1111588 1127236 1141668 1153943 1163353 1169976
58952A169976L897J002j279k046j952k361l066k560o58Q91Q75K53N75J807K586
$$ 1169976 1173873 1174875 1173596 1171550 1169598 1167237 1164171 1161611 1160953 1161844 1162719 1162972 1163547 1165354 1167940
58937A167940J939Rk458m747o471p568q072q053p772p577p450p089o761p363r087
$$ 1167940 1169879 1169888 1167430 1162683 1156212 1148644 1140572 1132519 1124747 1117170 1109720 1102631 1095870 1088507 1079420
58922A079420j0721j0983r875q011n504k541j24J128K252M546P373R006R225R331
$$ 1079420 1068699 1057716 1047841 1039830 1034326 1031785 1031661 1032789 1035041 1039587 1046960 1055966 1065191 1074522
58908A074522R758R615Q709Q104Q162P836O590N441N165M894L515J372m83j813
$$ 1074522 1084280 1093895 1102604 1110708 1118870 1126706 1133296 1138737 1143902 1148796 1152311 1153683 1153200 1151387
58894A151387l020m256n710q025j1273j4033j4625j3205j1654j1409j2066j2270
$$ 1151387 1148367 1144111 1138401 1130376 1119103 1105070 1090445 1077240 1065586 1054177 1042111 1029841
58882A029841j1302r525p687o191n050m235l799l634l451l174l116l444l734l453
$$ 1029841 1018539 1009014 1001327 995136 990086 985851 982052 978418 974967 971793 968677 965233 961499 958046
58868I58046k714k152k167k549k702k036n11Q99P32j434m246n860n589l974j846
$$ 958046 955332 953180 951013 948464 945762 943726 943215 944114 944846 943412 939166 933306 927717 923743 921897
58853I21897MQ05N11K53J216L203N041O141O885P761R003J0870J3279J5271J5756
$$ 921897 921901 922706 923217 923470 924686 927889 932930 939071 945956 953717 962720 973590 986869 1002140 1017896
58838A017896J4848J3636J2709J1783J0732J0038J0094J0842J2250J4432J7109
$$ 1017896 1032744 1046380 1059089 1070872 1081604 1091642 1101736 1112578 1124828 1139260 1156369
58827A156369J9480K0744K0433J8532J5821J3695J2799J2058R955O628L767K458
$$ 1156369 1175849 1196593 1217026 1235558 1251379 1265074 1277873 1289931 1299886 1306514 1310281 1312739
58815A312739K010J014j096l633n268n099l582k210j949k455l104l937m919n301
$$ 1312739 1314749 1315763 1314667 1311034 1305766 1300667 1297085 1294875 1292926 1290471 1287367 1283430 1278511 1273210
58801A273210m854m876o625r466j1986j4115j6539j8616j8859j7313j5633j4774
$$ 1273210 1268356 1263480 1256855 1247389 1235403 1221288 1204749 1186133 1167274 1149961 1134328 1119554
58789A119554j4274j3715j3203j2413j0964r787j0155j1340j1210r488q189q284
$$ 1119554 1105280 1091565 1078362 1065949 1054985 1045198 1035043 1023703 1012493 1003005 994816 986532
58777I86532q319p253o484p486r272r874r023p736o306m380k349j162j079j650
$$ 986532 978213 970960 964476 956990 947718 937844 928821 921085 914779 910399 908050 906888 905809 904159
58763I04159k507l305l380k406r93J13R62J905K683K811K469K306K493K523J839
$$ 904159 901652 898347 894967 892561 891568 891681 892643 894548 897231 900042 902511 904817 907310 909833 911672
58748I11672M16j104j879j745j499j840k411k617k855l770m612l930j970p77j501
$$ 911672 912088 910984 909105 907360 905861 904021 901610 898993 896138 892368 887756 883826 881856 881079 879578
58733H79578k996l536k656q24J313K808K860K014J762K507L203L354L755M732
$$ 879578 876582 873046 870390 869566 870879 873687 876547 878561 880323 882830 886033 889387 893142 897874
58719H97874N486N915P162R223R929P915M939L470L401L053K105J343L69k026
$$ 897874 903360 909275 916437 925660 935589 943504 948443 951913 955314 958367 960472 961815 962184 960158
58705I60158n366p558p629o719o157o030o000o106o246n850m669l270k307j756
$$ 960158 954792 947234 939605 932886 926729 920699 914699 908593 902347 896497 891828 888558 886251 884495
58691H84495j123k56L14j31j411k038n77K466M995N881O157P110Q312Q600Q121
$$ 884495 883372 883116 883430 883299 881888 879850 879273 881739 886734 892615 898772 905882 914194 922794 930915
58676I30915Q104R042J0288J1210J1736J1842J1486J0941J0488R800Q353O438
$$ 930915 939019 948061 958349 969559 981295 993137 1004623 1015564 1026052 1035852 1044205 1050643
58664A050643N030M640M763M581L814K881K491L049M298N625O655P253P119N952
$$ 1050643 1055673 1060313 1065076 1069657 1073471 1076352 1078843 1081892 1086190 1091815 1098470 1105723 1112842 1118794
58650A118794M056K113K74j959m779p807j0781j3730j6264j7675j8017j8235j8969
$$ 1118794 1122850 1124963 1125237 1123278 1118499 1110692 1099911 1086181 1069917 1052242 1034225 1015990 997021
58637I97021k0075k1374k2750k3270k1630j8134j4975j3869j4368j5022j4937
$$ 997021 976946 955572 932822 909552 887922 869788 854813 840944 826576 811554 796617
58626G96617j3610j0814p623o113o740p270n719l170k035k465k451j001O74J261
$$ 796617 783007 772193 764570 758457 751717 744447 738728 735558 733523 731058 728607 727606 728280 729541
58612G29541J092J313K408L935N204N973O681P817Q981R072P716N771M073K494
$$ 729541 730633 731946 734354 738289 743493 749466 756147 763964 772945 782017 789733 795504 799577 802071
58598H02071Q23m42r31j230j964k784l140l348l834m085l513k913l756o085q127
$$ 802071 802894 802452 801521 800291 798327 795543 792403 789055 785221 781136 777623 774710 770954 764869 756742
58583G56742q175o297m137l309l945m714m433l406k631k141j287l30k32o79j93
$$ 756742 748567 742270 738133 734824 730879 726165 721732 718326 715695 713554 712267 711937 711705 711026 710833
58568G10833J285J765J18k114l087l207l784m480l985k461j529k119l500m131
$$ 710833 712118 713883 714001 711887 708800 705593 701809 697329 693344 690883 689354 687235 683735 679604
58554F79604k726Q01M619O067M434J871Q16J558L184N445Q271J0560J1077R957
$$ 679604 676878 677679 682298 688365 692799 694670 695486 697044 700228 705673 713944 724504 735581 745538
58540G45538Q146O077M004K703K579K921L104L602M763N771O037O347P317P981
$$ 745538 753684 759761 763765 766468 769047 771968 775072 778674 783437 789208 795245 801592 808909 816890
58526H16890P568P389R125J2180J4503J5099J4247J2311J0161R518J0947J2404
$$ 816890 824458 831847 840972 853152 867655 882754 897001 909312 919473 928991 939938 952342
58514I52342J1792J0012R418J0323J1336J2216J3717J5218J5375J4991J6539K0440
$$ 952342 964134 974146 983564 993887 1005223 1017439 1031156 1046374 1061749 1076740 1093279 1113719
58502A113719K4123K5335K4526K3421K2878K2669K2041K0170J7045J3836J1452
$$ 1113719 1137842 1163177 1187703 1211124 1234002 1256671 1278712 1298882 1315927 1329763 1341215
58491A341215R177N850J775j885m845p409r335j0636j2617j6089j9393k0377j9664
$$ 1341215 1350392 1356242 1358017 1356132 1351287 1343878 1334543 1323907 1311290 1295201 1275808 1255431 1235767
58478A235767j9761k1437k3243k4141k4216k3200k0791j8311j7557j7984j7339
$$ 1235767 1216006 1194569 1171326 1147185 1122969 1099769 1078978 1060667 1043110 1025126 1007787
58467A007787j5070j2752j1127r295p064n523m851l929k638k302l231m019l870
$$ 1007787 992717 979965 968838 959543 952479 946956 942105 938176 935538 933236 930005 925986 922116
58454I22116l474l095k057q03j201l678o005o000l930j491O6J95r39j965j320
$$ 922116 918642 915547 913490 912687 911486 907808 901803 895803 891873 890382 890448 890643 889704 887739 886419
58439H86419O66K067K003J473J281J039O41R04K067L236L913M601N592O632Q093
$$ 886419 887085 889152 891155 892628 893909 894948 895589 896493 898560 901796 905709 910310 915902 922534 930627
58424I30627J0651J3476J4662J3924J3101J3446J4218J4567J4857J5293J4966
$$ 930627 941278 954754 969416 983340 996441 1009887 1024105 1038672 1053529 1068822 1083788
58413A083788J3201J0560P795N091K726J043o49l561p316r738r354o932m248k516
$$ 1083788 1096989 1107549 1115344 1120435 1123161 1124204 1123555 1119994 1112678 1102940 1093586 1086654 1082406 1079890
58399A079890k069k228j479Q00L060L506K891L465N528P138O978N361K782r3j477
$$ 1079890 1077821 1075593 1074114 1074914 1077974 1081480 1084371 1087836 1093364 1100502 1107480 1112841 1115623 1115530 1114053
58384A114053m16N80j870o606q719o355l235l050m767n298l874j621Q13L086M414
$$ 1114053 1113637 1114217 1112347 1105741 1097022 1090667 1087432 1084382 1079615 1074317 1070443 1068822 1069635 1072721 1077135
58369A077135M857N806P843R698J0441J0985J2224J3471J3904J3777J3088J0855
$$ 1077135 1081992 1087798 1095641 1105339 1115780 1126765 1138989 1152460 1166364 1180141 1193229 1204084
58357A204084O938K904L5k007l745m843n255n584n723m971l990m372n778n996
$$ 1204084 1211022 1213926 1213961 1211954 1208209 1203366 1198111 1192527 1186804 1181833 1177843 1173471 1167693 1161697
58343A161697m422k803j838j25K396L247J439k50Q64L724N756O474O633O014M327
$$ 1161697 1157275 1154472 1152634 1152509 1154905 1158152 1159591 1159341 1160205 1163929 1169685 1176159 1182792 1188806 1193133
58328A193133K692K087J762P93j39q4O40J507K828M503N494N638O200P563Q384
$$ 1193133 1195825 1197912 1199674 1200467 1200328 1200244 1200884 1202391 1205219 1209722 1215216 1220854 1227054 1234617 1243001
58313A243001Q124Q203R429J0411R850Q381P060O170O434Q806J2009J2989J1158
$$ 1243001 1251125 1259328 1268757 1279168 1289018 1297399 1304459 1310629 1317063 1325869 1337878 1350867 1362025
58300A362025R453R873J0978J1224J1597J2982J3980J3516J2816J2742J2067J0494
$$ 1362025 1371478 1381351 1392329 1403553 1415150 1428132 1442112 1455628 1468444 1481186 1493253 1503747
58288A503747J0382J2889J5313J4952J3058J2304J2715J2893J2999J3835J4970
$$ 1503747 1514129 1527018 1542331 1557283 1570341 1582645 1595360 1608253 1621252 1635087 1650057
58277A650057J6121J8299K1492K3375K2577K0795J9740J8683J7200J7237J9696
$$ 1650057 1666178 1684477 1705969 1729344 1751921 1772716 1792456 1811139 1828339 1845576 1865272
58266A865272K1787K0813J8114J6459J5985J5489J5269J5821J6052J5506J5977
$$ 1865272 1887059 1907872 1925986 1942445 1958430 1973919 1989188 2005009 2021061 2036567 2052544
58255B052544J8426K0818K1525K2041K3747K5022K4472K4006K5656K8334L0654
$$ 2052544 2070970 2091788 2113313 2135354 2159101 2184123 2208595 2232601 2258257 2286591 2317245
58244B317245L3731L7987M0707M0332L9755M1535M3189M1437L7924L6328L6591
$$ 2317245 2350976 2388963 2429670 2470002 2509757 2551292 2594481 2635918 2673842 2710170 2746761
58233B746761L6535L6536L8123M0290M1511M3117M6659N0421N2541N4927N9814
$$ 2746761 2783296 2819832 2857955 2898245 2939756 2982873 3029532 3079953 3132494 3187421 3247235
58222C247235O5192O8077O9654P2740P6696P9244Q0822Q2871Q4499Q5146Q7562
$$ 3247235 3312427 3380504 3450158 3522898 3599594 3678838 3759660 3842531 3927030 4012176 4099738
58211D099738R3674J00510J04742J08025J13181J18728J22418J26651J34789J45157
$$ 4099738 4193412 4293922 4398664 4506689 4619870 4738598 4861016 4987667 5122456 5267613
58201E267613J54151J62092J70672J78178J82943J87895J95845K04100K09783
$$ 5267613 5421764 5583856 5754528 5932706 6115649 6303544 6499389 6703489 6913272
58192F913272K16234K27312K39555K47547K53303K62685K76053K90176L05816
$$ 6913272 7129506 7356818 7596373 7843920 8097223 8359908 8635961 8926137 9231953
58183I231953L25174L45146L61567L77306L97924M22304M45799M69314M96784
$$ 9231953 9557127 9902273 10263840 10641146 11039070 11461374 11907173 12376487 12873271
58174A2873271N26951N56425N87530O24293O64381P04056P46855P97669Q52679
$$ 12873271 13400222 13956647 14544177 15168470 15832851 16536907 17283762 18081431 18934110
58165A8934110R05588R59336J020672J087957J156156J229262J315252J413327
$$ 18934110 19839698 20799034 21819706 22907663 24063819 25293081 26608333 28021660
58157B8021660J519327J639300J783835J953037K140323K345542K570200K806817
$$ 28021660 29540987 31180287 32964122 34917159 37057482 39403024 41973224 44780041
58149D4780041L049891L311543L609658L948695M331413M780288N323713N967052
$$ 44780041 47829932 51141475 54751133 58699828 63031241 67811529 73135242 79102294
58141G9102294O699505P521037Q438878R449786J0554923J1778480J3137899J4613014
$$ 79102294 85801799 93322836 101761714 111211500 121766423 133544903 146682802 161295816
58133A61295816J6189156J7921649J9924914K2327999K5254837K8670148L1956603
$$ 161295816 177484972 195406621 215331535 237659534 262914371 291584519 323541122
58126C23541122L3607397L1708833K5197572J4845810K974273p859769j6022883
$$ 323541122 357148519 388857352 414054924 428900734 431875007 424015238 407992355
58119D07992355k1078247k3444333k3989987k3689895k3261885k2938548k2575182
$$ 407992355 386914108 363469775 339479788 315789893 292528008 269589460 247014278
58112B47014278k1962410k1019617j9774987j8295383j6673314j5019126j3422680
$$ 247014278 225051868 204032251 184257264 165961881 149288567 134269441 120846761
58105A20846761j1933975j0580744r376985q311790p358281o502632n747945n090603
$$ 120846761 108912786 98332042 88955057 80643267 73284986 66782354 61034409 55943806
58097E5943806m513837m006117l566713l190724k865266k582506k341660k136910
$$ 55943806 51429969 47423852 43857139 40666415 37801149 35218643 32876983 30740073
58089C0740073j956939j796786j657323j533502j416034j304295j204942j117926
$$ 30740073 28783134 26986348 25329025 23795523 22379489 21075194 19870252 18752326
58081A8752326j035939r57251q86776q24287p63498p03637o51001o08100n71294
$$ 18752326 17716387 16759136 15872360 15048073 14284575 13580938 12929937 12321837 11750543
58072A1750543n39527n15165m95571m73748m48506m24923m04203l82233l58874
$$ 11750543 11211016 10695851 10200280 9726532 9278026 8853103 8448900 8066667 7707793
58063G707793l39311l24698l10209k93870k79128k67004k53633k37568k22278
$$ 7707793 7368482 7043784 6733575 6439705 6160577 5893573 5639940 5402372 5180094
58054E180094k09667j97804j86466j78186j72335j64784j54882j46591j41288
$$ 5180094 4970427 4772623 4586157 4407971 4235636 4070852 3915970 3769379 3628091
58045C628091j35672j28111j20978j15227j08577j00700r4540r0855q6813q1355
$$ 3628091 3492419 3364308 3243330 3128103 3019526 2918826 2824286 2733431 2646618 2565263
58035B565263p6724p3427o8982o3057n8509n5977n2517m7117m2539m0182l8105
$$ 2565263 2488539 2415112 2346130 2283073 2224564 2168587 2116070 2068953 2026414 1986232 1948127
58024A948127l5584l4674l5598l5575l3941l3611l5568l6623l4861l2736l2515
$$ 1948127 1912543 1877869 1842271 1806696 1772755 1739144 1703576 1666953 1632092 1599356 1566841
58013A566841l2856l2248l1739l1879l0688k7213k3734k2153k1350k0178j9839
$$ 1566841 1533985 1501737 1469998 1438119 1407431 1380218 1356484 1334331 1312981 1292803 1272964
58002A272964k1038k1848k0580j8309j6633j5527j4871j5430j6698j6610j4879
$$ 1272964 1251926 1230078 1209498 1191189 1174556 1159029 1144158 1128728 1112030 1095420 1080541
57991A080541j3842j4571j5132j4183j3205j3308j2971j1055r216q981r050p856
$$ 1080541 1066699 1052128 1036996 1022813 1009608 996300 983329 972274 963058 954077 945027 937171
57979I37171o546o977q712j0229j1308j2138j1791r863q101q271r569j0044r501
$$ 937171 930625 923648 914936 904707 893399 881261 869470 859607 851506 843235 833666 823622 814121
57966H14121r327j0252j1776j3095j3415j2200r974q070o954n894m640l984m157
$$ 814121 804794 794542 782766 769671 756256 744056 734082 726012 719058 713164 708524 704540 700383
57953G00383m294m104m416n341n646m843m197m646n330n200m633m415m417m243
$$ 700383 696089 691985 687569 682228 676582 671739 667542 662896 657566 652366 647733 643318 638901 634658
57939F34658m016l728k989j955j308r52j69O79L55r03j179L33K192L022K998K269
$$ 634658 630642 626914 623925 621970 620662 619710 619541 620220 620575 619672 618493 618826 621018 624040 627038 629307
57923F29307N5l391n876n837m429l768m352n319n918n686m349k583j705j903j978
$$ 629307 629362 625971 620095 614258 609829 606061 601709 596390 590472 584786 580437 577854 576149 574246 572268
57908E72268j427j129j319p33J081K467J962K98j149k409l851m622l807k120q89
$$ 572268 570841 569712 568393 567660 568741 571208 573170 573468 572319 569910 566059 561437 557630 555510 554621
57893E54621l91m05j328l167m427l729j863p05o49n33L05J366K145K687K981K800
$$ 554621 554230 553825 552497 549330 544903 541174 539311 538606 537957 537424 537729 539095 541240 543927 546908 549708
57877E49708K296K126K954M967P632R760J0301R359P954O847O204O174O658O548
$$ 549708 552004 554130 557084 562051 569683 579443 589744 599103 607057 613904 620108 626282 632940 639488
57863F39488M599J371j134k130k955m722o643p545p714q062q500q318p486o606
$$ 639488 644087 645458 644324 642194 639239 634517 627874 620329 612615 604553 596053 587735 580249 573643
57849E73643o064n807n452m430k716j487j948l473m269m037m205n242n733m958
$$ 573643 567579 561772 556320 551890 549174 547687 545739 542266 537997 533960 529755 524513 518780 513822
57835E13822m342n020n830n249l822k927k392j160N55J518J278L41q01j625j272
$$ 513822 509480 504460 498630 493381 489559 486632 484240 483080 483635 485153 486431 486772 485971 484346 483074
57820D83074L52J879K164J802J729J244p62l312m073k486m37K94j84q88j356j556
$$ 483074 483426 485305 487469 489271 491000 492244 491482 488170 484097 481611 481174 481468 481284 480396 479040 477484
57804D77484j411j020q28j108j545j510o54O58J520J360O39K04R0k30n56j20P60
$$ 477484 476073 475053 474225 473117 471572 470062 469408 470066 471586 472946 473585 473789 473879 473649 473093 472973 473733
57787D73733O84o14j512q64K52L02n16j174j652k321k512j468j18l3j106j924
$$ 473733 474417 473803 472291 471427 471679 471981 471465 470291 468639 466318 463806 462338 462220 462187 461081 459157
57771D59157k138k644l474l422k180j184j547k404k139n19J176J746J233O22O78
$$ 459157 457019 454375 450901 447479 445299 444115 442568 440164 438025 437506 438682 440428 441661 442283 442961
57756D42961J182J489J684K548M062M775L383M05k467m213m856m640l831l062
$$ 442961 444143 445632 447316 449864 453926 458701 462084 462489 460022 455809 450953 446313 442482 439420
57742D39420k820k765k411k176k752l618l359j547O32J836J850J298Q45Q51J185
$$ 439420 436600 433835 431424 429248 426496 422878 419519 417972 418604 420440 422290 423588 424433 425284 426469
57727D26469J222N60k45k57N10J031O34j17j46R26K498L639L995M101M613N214
$$ 426469 427691 428251 428006 427749 428259 429290 429924 429807 429661 430587 433085 436724 440719 444820 449433 454647
57711D54647M821L184J542J074J338J058pj015j509j815k008j612n99J68j40j507
$$ 454647 459468 462652 464194 465268 466606 467664 467657 466642 465133 463318 461310 459698 459099 459267 459127 457620
57695D57620l374n187o435o738o147n061l680k006m51J21o95k124k793k041m67
$$ 457620 454246 449059 442624 435886 429739 424678 420998 418992 418541 418662 417967 415843 413050 411009 410542
57680D10542Q12J307J334J182N98m39j012j69J519K421J868P41j82j176k332k755
$$ 410542 411354 412661 413995 415177 415775 415336 414324 414155 415674 418095 419963 420704 420522 419346 417014 414259
57664D14259j987j077j024j239r44j078k960n645o685n562m343m559n231m751
$$ 414259 412272 411195 410171 408932 407988 406910 403950 398305 391620 386058 381715 377156 371925 367174
57650C67174l250k078k008k896m276n344n099l398j512q62j453k157k101j195
$$ 367174 363924 361846 359838 356942 352666 347322 342223 338825 337313 336451 334998 332841 330740 329545
57636C29545K63J730K338J560Kj075j176j013j366j963j886p45R29K424L555M632
$$ 329545 329808 331538 333876 335436 335438 334363 333187 332174 330808 328845 326959 326214 327143 329567 333122 337754
57620C37754O094Q288J1201J4198J6497J8267K0791K4776K8995L1682L3189L5940
$$ 337754 343848 352136 363337 377535 394032 412299 433090 457866 486861 518543 551732 587672
57608E87672M1355M7952N2926N4323N0758M0641K3733L213j5653k9399l8074m3270
$$ 587672 629027 676979 729905 784228 834986 875627 899360 902573 886920 857521 819447 776177
57596G76177m5839m5874m3708m0033l5569l1162k7688k5347k3336k0618j6959
$$ 776177 730338 684464 640756 600723 565154 533992 506304 480957 457621 437003 420044
57585D20044j3058r907p975o824n582m113l304l721m270l327j015P16O62j12o8
$$ 420044 406986 397079 389104 382280 376698 372585 369281 365560 361290 357963 356948 357664 358326 358214 358146
57570C58146M65j04k137m043m156k535o57R2o70k309l614l543k145p66r19k610
$$ 358146 358611 358507 356370 352327 348171 345636 344979 345071 344401 342092 338478 334935 332790 332024 331105 328495
57554C28495m086l515r68J566K099M08j992l320k864j338j63k06r87j291o67q0
$$ 328495 324409 320894 319926 321492 323591 323999 322007 318687 315823 314485 314322 314116 313129 311838 311171 311091
57538C11091p04k401l797l877l123k869l727m909n207m453l608l379l362k994
$$ 311091 310387 307986 304189 300312 297189 294320 290593 285684 280477 276024 272416 269037 265675 262681
57524B62681k738l324m106l471j192Q21Q04q08k419l422m247m858m667l809l290
$$ 262681 259943 256619 252513 249042 247850 248671 249475 248667 246248 242826 238579 233721 229054 225245 221955
57509B21955l576l942l604k820k418k614k763k143p67O77J600K033K151J584n5
$$ 221955 218379 214437 210833 208013 205595 202981 200218 198075 197308 197985 199585 201618 203769 205353 205298
57494B05298j942k364q52R42J280M82oRn40j868k798k575j878j494j156m73n1
$$ 205298 203356 200992 200140 201082 202362 202844 202838 202847 202307 200439 197641 195066 193188 191694 190538 190065 190014
57477A90014o59j712j646J27K282K897J472o02j555j079l89n39j175j270n93K41
$$ 190014 189355 187643 185997 186124 188406 191303 192775 192173 190618 189539 189150 188611 187436 186166 185573 185814
57461A85814Q76J456J887J781J339J354J903J985J137O60K025M496N686M676L279
$$ 185814 186690 188146 190033 191814 193153 194507 196410 198395 199532 200192 202217 206713 212399 217075 220354
57446B20354L324L863K474j024l940m197k824j989k006j935k089l603n681n793
$$ 220354 223678 227541 230015 228991 225051 220854 218030 216041 214035 212100 210011 206408 200727 194934
57432A94934l405j248j560k944k729j056k86j149j953j627j266k013l112l168
$$ 194934 191529 190281 188721 185777 183048 181992 181706 180557 178604 176977 175711 173698 170586 167418
57418A67418k222j561k009l091l661k972j342J10O42O12O07L47o96j936k213j664
$$ 167418 165196 163635 161626 158535 154874 151902 150560 150670 151312 151924 152531 152878 152182 150246 148033 146369
57402A46369j853l458n057m899l108j316n94n51k76M54R81N35q15k028k065r88
$$ 146369 144516 141058 136001 131102 127994 126678 126084 125533 125257 125711 126692 127227 126412 124384 122319 121331
57386A21331J97O24K49l06j65J175L008L600J996o86k543l119l240l027j724L74
$$ 121331 121528 122152 122401 122095 121930 123105 126113 129713 131709 131023 128480 125361 122121 119094 117370 117744
57370A17744J541R39p5P7J046J468J088P60P91N94j59r48j073l97N84J083P32
$$ 117744 119285 120224 120149 120226 121272 122740 123828 124588 125379 125973 125814 124866 123793 123396 123980 125063 125795
57353A25795J45L36J257J584N29p72o08J055K518K463J274K25J10P55J398J382
$$ 125795 125940 126276 127533 129117 129646 128874 128266 129321 131839 134302 135576 135801 135911 136666 138064 139446
57337A39446Q32O08J320K522L272L263K899K409J604N86N0N53J831L150M061M620
$$ 139446 140278 140886 142206 144728 148000 151263 154162 156571 158175 158761 158811 159364 161195 164345 168406 173026
57321A73026N028N335N355M815L642K315J744K451L884M772M414L452L063L609
$$ 173026 178054 183389 188744 193559 197201 199516 201260 203711 207595 212367 216781 220233 223296 226905
57307B26905M434M994N524O307O897O662N826N299N540O108O300N764M582L249
$$ 226905 231339 236333 241857 248164 255061 261723 267549 272848 278388 284496 290796 296560 301142 304391
57293C04391K549K906L862M676N353O314P220P086N889N094N839P234P336N579
$$ 304391 306940 309846 313708 318384 323737 330051 337271 344357 350246 355340 361179 368413 375749 381328
57279C81328L552L314N388Q342J0029R265O711M248L374M065N190N791N902O230
$$ 381328 384880 388194 393582 401924 411953 421218 427929 432177 435551 439616 444806 450597 456499 462729
57265D62729P324R093J1012J2508J3077J2336J0454Q531P880Q585R289Q821P545
$$ 462729 470053 479146 490158 502666 515743 528079 538533 547064 554944 563529 572818 581639 589184
57252E89184O598O341O370O611P372Q465R244R557R777R925R641R125R023R225
$$ 589184 595782 602123 608493 615104 622476 630941 640185 649742 659519 669444 679085 688210 697233 706458
57238G06458Q834P737P157P989R547J0663J1255J1882J2318J1641R680P581O773
$$ 706458 715292 723029 730186 738175 747722 758385 769640 781522 793840 805481 815161 822742 829515
57225H29515P676R460J0763J0722R526Q087P198P133P793Q757R279Q794P578O505
$$ 829515 837191 846651 857414 868136 877662 885749 892947 900080 907873 916630 925909 934703 942281 948786
57211I48786O094O131O152N893N440N397O572Q845J0837J1650J2274J3914J5432
$$ 948786 954880 961011 967163 973056 978496 983893 990465 999310 1010147 1021797 1034071 1047985 1063417
57198A063417J4532J1576R812J0950J2730J2449J0879J0530J1425J1340R707Q715
$$ 1063417 1077949 1089525 1099337 1110287 1123017 1135466 1146345 1156875 1168300 1179640 1189347 1198062
57186A198062J0114J2953J5170J5941J5774J5497J5957J7754K0424K2560K3343
$$ 1198062 1208176 1221129 1236299 1252240 1268014 1283511 1299468 1317222 1337646 1360206 1383549
57175A383549K3559K4487K6254K7806K8296K7996K7924K8816L0402L1494L1071
$$ 1383549 1407108 1431595 1457849 1485655 1513951 1541947 1569871 1598687 1629089 1660583 1691654
57164A691654K9329K7603K7106K7960K9420L0738L1586L2026L2444L3419L5200
$$ 1691654 1720983 1748586 1775692 1803652 1833072 1863810 1895396 1927422 1959866 1993285 2028485
57153B028485L7230L8532L8818L8941L9846M1358M2632M3637M5273M7610M9058
$$ 2028485 2065715 2104247 2143065 2182006 2221852 2263210 2305842 2349479 2394752 2442362 2491420
57142B491420M8201M5899M4539M5352M7419M9083M9453M8609M7495M7618M9715
$$ 2491420 2539621 2585520 2630059 2675411 2722830 2771913 2821366 2869975 2917470 2965088 3014803
57131C014803N2483N3640N2607N1092N0784N1583N2536N3234N3531N2990N1624
$$ 3014803 3067286 3120926 3173533 3224625 3275409 3326992 3379528 3432762 3486293 3539283 3590907
57120C590907N0370M9881M9480M8132M5927M3682M1731L9940L8468L7555L6860
$$ 3590907 3641277 3691158 3740638 3788770 3834697 3878379 3920110 3960050 3998518 4036073 4072933
57109D072933L5724L3849L1231K7876K4096K0403J6498J1142L925l571r493j3903
$$ 4072933 4108657 4142506 4173737 4201613 4225709 4246112 4262610 4273752 4277677 4274106 4264613 4250710
57097D250710j8139k2548k6361k9534l3081l7402m1714m5671n0308n6644o4291
$$ 4250710 4232571 4210023 4183662 4154128 4121047 4083645 4041931 3996260 3945952 3889308 3825017
57086C825017p2212q0160q8394r6449j03455j09735j17002j26269j36387j45704
$$ 3825017 3752805 3672645 3584251 3487802 3384347 3274612 3157610 3031341 2894954 2749250
57076B749250j54823j66233j80894j96647k11172k25309k41811k61429k82280
$$ 2749250 2594427 2428194 2247300 2050653 1839481 1614172 1372361 1110932 828652
57067H28652l03097B00516a48969l75988m03663m33616m68234n08639n54050o03559
$$ 828652 525555 200516 -148969 -524957 -928620 -1362236 -1830470 -2339109 -2893159 -3496718
57057c496718o57567p17324p83799q57682r40553j035730j147293j278306j430805
$$ -3496718 -4154285 -4871609 -5655408 -6513090 -7453643 -8489373 -9636666 -10914972 -12345777
57048a2345777j607659j812993k050021k320193k626107k973898l371312l825718
$$ -12345777 -13953436 -15766429 -17816450 -20136643 -22762750 -25736648 -29107960 -32933678
57040c2933678m347102m951126n655148o471241p405623q462807r645950j0954847
$$ -32933678 -37280780 -42231906 -47887054 -54358295 -61763918 -70226725 -79872675 -90827522
57032i0827522j2387410j3936581j5573520j7236929j8859620k0413987k1905282
$$ -90827522 -103214932 -117151513 -132725033 -149961962 -168821582 -189235569 -211140851
57025b11140851k3278749k4312063k4607302k3716762k1326790j7395137j2184771
$$ -211140851 -234419600 -258731663 -283338965 -307055727 -328382517 -345777654 -357962425
57018c57962425o191789l408N847220J0963525J5093674J8110908K0008439K0900114
$$ -357962425 -364154214 -364157622 -358310402 -347346877 -332253203 -314142295 -294133856 -273233742
57010b73233742K0996203K0551717J9810519J8961165J8108494J7269791J6403183
$$ -273233742 -252237539 -231685822 -211875303 -192914138 -174805644 -157535853 -141132670
57003a41132670J5454389J4393143J3224619J1983062J0718690R482631Q314721
$$ -141132670 -125678281 -111285138 -98060519 -86077457 -75358767 -65876136 -57561415
56996e7561415P239996O272285N417304M673015M031577L483420L018897K626911
$$ -57561415 -50321419 -44049134 -38631830 -33958815 -29927238 -26443818 -23424921 -20798010
56988b0798010K295197K013133J772932J567909J391704J239563J108513R95476
$$ -20798010 -18502813 -16489680 -14716748 -13148839 -11757135 -10517572 -9409059 -8413583
56980h413583Q96715Q09547P32950O65734O05529N50489N00723M57075M19280
$$ -8413583 -7516868 -6707321 -5974371 -5308637 -4703108 -4152619 -3651896 -3194821 -2775541
56971b775541L86024L56103L28641L02862K78846K58350K43445K33128a66223
$$ -2775541 -2389517 -2033414 -1704773 -1401911 -1123065 -864715 -621270 -388142 -166223
56961C7576J78708J53584J35059J21525J05028Q1032N3490K9188J0062o672k3103
$$ 37576 216284 369868 504927 626452 731480 812512 866002 895190 905252 898580 875477
56950H75477l8646n2528o4936p5510q3034q7257q9369r0349r0160q8715B8804
$$ 875477 836831 784303 719367 643857 560823 473566 384197 293848 203688 114973 28804
56938e3239p5519o6887n7692m9053m0878l3007k6047k0698j6929j4086j1271p765
$$ -53239 -128758 -195645 -253337 -302390 -343268 -376275 -402322 -423020 -439949 -454035 -465306 -473071
56926d73071l775n23J129J814K551L001K043k33k479m002n263o307o168m483k538
$$ -473071 -476846 -477369 -476240 -474426 -471875 -468874 -466831 -467064 -469543 -473545 -478808 -485115 -491283 -495766 -498304
56911d98304j810k186k216p30K272N858Q804J0273J0348R911R882J0558J1563
$$ -498304 -500114 -502300 -504516 -505246 -502974 -497116 -488312 -478039 -467691 -457780 -447898 -437340 -425777
56898d25777J2281J2495J2576J2712J2003Q957L391k806p296r308r757r870j0186
$$ -425777 -413496 -401001 -388425 -375713 -363710 -354753 -351362 -354168 -361464 -370772 -380529 -390399 -400585
56885d00585j0303r247o608l562j793j110N42M056P617R385J0243J2232J5439
$$ -400585 -410888 -420135 -426743 -430305 -432098 -433208 -432666 -428610 -420993 -411608 -401365 -389133 -373694
56872c73694J8402K0631K2417K2583J9084J2247N143O0l655p400j0727j2194j1700
$$ -373694 -355292 -334661 -312244 -289661 -270577 -258330 -253187 -253127 -256782 -264182 -274909 -287103 -298803
56859b98803j0570r779r063p688n511l189j541p17j25O78J386J558J319J073J013
$$ -298803 -309373 -319152 -328215 -335903 -341414 -344603 -346144 -346861 -346986 -346308 -344922 -343364 -342045 -340972 -339959
56844c39959J409K623M209M862M293M120N541P130O731M970M615O547Q574Q794
$$ -339959 -338550 -335927 -331718 -326856 -322563 -318443 -312902 -305772 -299041 -294071 -289456 -282909 -274335 -265541
56830b65541Q090Q276R468J0563J1260J2156J3254J3511J1950Q744N116K268M00
$$ -265541 -257451 -249175 -239707 -229144 -217884 -205728 -192474 -178963 -167013 -158269 -153153 -150885 -150485
56817a50485j023k011j666M42L224N299O756Q731J1630J4711J7150J8639J9445
$$ -150485 -151508 -153519 -155185 -154743 -151519 -146220 -139464 -130733 -119103 -104392 -87242 -68603 -49158
56804d9158K0739d329B5024L3925L5509L4844L3862L2098K7393J9758J1911N747
$$ -49158 -28419 -4329 25024 58949 94458 129302 163164 195262 222655 242413 254324 260071
56792B60071P40l593o193o374n218l881k132N06L681P093J0982J5098J8710K2176
$$ 260071 260811 257218 251025 244651 239433 235552 233420 233926 237607 244700 255682 270780 289490 311666
56778C11666K6739L2177L6668L9783M3306M7750N0159M6996L7646K3769P269r319
$$ 311666 338405 370582 407250 447033 490339 538089 588248 635244 672890 696659 703928 694609
56766F94609k2410k9829l2672l3050l1458k8189k5362k4579k3688j9130j1187
$$ 694609 672199 642370 609698 576648 545190 517001 491639 467060 443372 424242 413055
56755D13055l892M07L509P805J3015J7768K2312K7693L3220L6239L4315K6899
$$ 413055 409163 409570 413079 420884 433899 451667 473979 501672 534892 571131 605446 632345
56743F32345J5398K136j0799k2081l0736l5811l7117l5976l4252l2501k9799k5486
$$ 632345 647743 649879 639080 616999 586263 550452 513335 477359 443107 410606 380807 355321
56731C55321k0300j5591j1961r036o144k925N91M279Q242J2596J6761J9285J8696
$$ 355321 335021 319430 307469 298433 292289 289364 289955 294234 302476 315072 331833 351118 369814
56718C69814J4533P581o13q451j5017k0247k4081k5739k4753k2459k1156k1332
$$ 369814 384347 391928 391315 382864 367847 347600 323519 297780 273027 250568 229412 208080
56706B08080k1037j8686j5270j2831j1818j1160j0177r051p862o404m891l915
$$ 208080 187043 168357 153087 140256 128438 117278 107101 98050 90188 83784 78893 74978
56694G4978l754m212m847m877l506j082P22O16q60k240k794k555j488J92J504
$$ 74978 71224 67012 62165 57288 53782 52700 53422 54038 53178 50938 48144 45589 44101 44293 45797
56679D5797J540N99m23j260k070k488j934n28R78J879J579j08k029k203l77J052
$$ 45797 47337 47936 47513 46253 44183 41695 39761 39233 40211 42090 43669 43561 41532 39329 38952 40004
56663D0004R2j952k378r26L85O82J091K124K627J916J027R96J447J728K125K971
$$ 40004 40096 38144 35766 34840 35225 35907 36998 39122 41749 43665 44692 45688 47135 48863 50988 53959
56647E3959L662L458K545J600Q72K71j79m96q34j104q94mJ254K286K456J401k98
$$ 53959 57621 61079 63624 65224 66096 66367 66188 65692 64858 63754 62860 62856 64110 66396 68852 70253 69955
56630F9955j083P3K219L326K525P30p82j397j023K9R26R67M56J68O8m63j343j727
$$ 69955 68872 68945 71164 74490 77015 77745 76963 75566 74543 74572 75498 76465 76921 77089 77157 76694 75351 73624
56612G3624j256l63N50J285J352M87m57l48N68R99N02k48r21j756k422k332k170
$$ 73624 72368 72005 72555 73840 75192 75679 75222 74874 75442 76441 76943 76695 75774 74018 71596 69264 67094
56595F7094l247n022n277l361j262n81m35L85J098N65k18O67L233N703O937P079
$$ 67094 63847 58825 53548 50187 48925 48344 47909 48294 49392 49957 49739 50406 53639 59342 66279 73358
56579G3358O307M658L026K703L657M416L963K793J940J769K033K484K957L164
$$ 73358 79665 84323 87349 90052 93709 98125 102088 104881 106821 108590 110623 113107 116064 119228
56565A19228K717J320q91l110m228l797k471j282o76m30j72K79Q81J446J830K230
$$ 119228 121945 123265 122374 119264 115036 111239 108768 107486 106810 106380 106208 106487 107368 108814 110644 112874
56549A12874K926L766M191L812K714J297K94N91K300M078M294L013J908K080K923
$$ 112874 115800 119566 123757 127569 130283 131580 131874 132465 134765 138843 143137 146150 148058 150138 153061
56534A53061L386L324K984K191P51q49j794j610l01J537K690K327J248J084J965
$$ 153061 156447 159771 162755 164946 165697 164848 163054 161444 161143 162680 165370 167697 168945 170029 171994
56519A71994K208Q23j010j761j578j372j116k88Q83K004L464N498O968O662N295
$$ 171994 174202 175025 174015 172254 170676 169304 168188 167900 168783 170787 174251 179749 186717 193379 198674
56504A98674M745N526O543P136P792Q766R484R631R545R162P773N342L088K201
$$ 198674 203419 208945 215488 222624 230416 239182 248666 258297 267842 277004 284777 290119 293207 295408
56490B95408K664L678M522M686M012L034K522K365J683L69m42J6R13R47Jj208
$$ 295408 298072 301750 306272 310958 314970 318004 320526 322891 324574 324943 324501 324517 325430 326377 326378 325170
56474C25170k523m289o092o720n667l914k808k624k552j882q08k01o81j818k372
$$ 325170 322647 318358 312266 305546 299879 295965 293157 290533 287981 286099 285291 285090 284409 282591 280219
56459B80219j642n46p93k770m900n483m637l721l384l201k994l199l601l028j104
$$ 280219 278577 278031 277238 274468 269568 264085 259448 255727 252343 249142 246148 242949 239348 236320 235216
56444B35216O90P01p42j904j917j387r92p13m73n83j081j488j470j301j402j812
$$ 235216 235906 236607 235865 233961 232044 230657 229665 228952 228479 227896 226815 225327 223857 222556 221154 219342
56428B19342k145j817m95J180J787P31p19q82J16P21L11j24K03Q31J174J477K041
$$ 219342 217197 215380 214885 216065 217852 218583 217864 216982 217098 217819 218130 218006 218209 219040 220214 221691 223732
56411B23732K515K617K671K834K615J795J069J112J650J949J636O64p28j622r44
$$ 223732 226247 228864 231535 234369 236984 238779 239848 240960 242610 244559 246195 246859 246131 244509 243565
56396B43565R96K326J681k10j620j730q20O17K099L067L358L363L191K372R41
$$ 243565 244561 246887 248568 248358 246738 245008 244188 244805 246904 249971 253329 256692 259883 262255 263196
56381B63196K3M90J732K536K643K545K399K084J905K240K709K526J633Q08P30
$$ 263196 263219 263709 265441 267977 270620 273165 275564 277648 279553 281793 284502 287028 288661 289469 290199
56366B90199J323J890J641M55p26p79J61Q57O13o5o30j213j732j615r82q56j457
$$ 290199 291522 293412 295053 295508 294782 294003 294164 295021 295634 295569 294939 293726 291994 290379 289397 288541 287084
56349B87084j564n47L09l39j943l220l980m375l641j424O61Q21k31l17R70K029
$$ 287084 285520 284973 285282 284943 283000 279780 275800 271425 267784 266360 267021 267842 267611 267294 268264 270293
56333B70293J877J064K10m60k19J462L248L024R51m69N4R83O62j72J80J680K618
$$ 270293 272170 273234 273444 272984 272765 274227 277475 280499 281450 280981 281035 282018 282680 282508 282688 284368 286986
56316B86986J787l30k158k397j228k72q15k023j822M42L183M558M223L025K042
$$ 286986 288773 288443 286285 283888 282660 282388 281573 279550 277728 278170 281353 285911 290134 293159 295201
56301B95201K124L317M457M290L168K569K911L173K918K964L517L306J644q6k28
$$ 295201 297325 300642 305099 309389 312557 315126 318037 321210 324128 327092 330609 333915 335559 335473 335245
56286C35245R02J855K163K242J964Q82m07n98N95K054K704K455J732R52O36J207
$$ 335245 336147 338002 340165 342407 344371 345253 344846 344248 344843 346897 349601 352056 353788 354740 355376 356583
56270C56583K373L277L454L174K773K264J913K479M239O077O319M583K297J109
$$ 356583 358956 362233 365687 368861 371634 373898 375811 378290 382529 388606 394925 399508 401805 402914
56256D02914J204J607J810K387L867N608O363N733M604M007L974L770L155K890
$$ 402914 404118 405725 407535 409922 413789 419397 425760 431493 436097 440104 444078 447848 451003 453893
56242D53893L643M741M752L465K395K876M404N701O507P184P296O292N199N649
$$ 453893 457536 462277 467029 470494 472889 475765 480169 485870 492377 499561 506857 513149 518348 523997
56228E23997P168P512O260N735P355R262R231Q116Q234R647J0484J0298J0765
$$ 523997 531165 538677 544937 550672 558027 567289 576520 584636 592870 602517 613001 623299 634064
56215F34064J2856J5218J5896J4572J2767J2380J3971J6080J6725J5940J5966
$$ 634064 646920 662138 678034 692606 705373 717753 731724 747804 764529 780469 796435
56204G96435J8261K1675K4435K6605K9088L1615L3511L5431L8360M1825M4988
$$ 796435 814696 836371 860806 887411 916499 948114 981625 1017056 1055416 1097241 1142229
56193A142229M8593N3688N9300O3774O7751P3116P9389Q3976Q6128Q7897R0652
$$ 1142229 1190822 1244510 1303810 1367584 1435335 1508451 1587840 1671816 1757944 1845841 1936493
56182A936493R3189R3956R2786Q9596Q3583P4693O4165N2724L9953K6148J2919
$$ 1936493 2029682 2123638 2216424 2306020 2389603 2464296 2528461 2581185 2621138 2647286 2660205
56171B660205J039j0593k2901l5096m5984n5302o2812o7735p0133p1669p3789
$$ 2660205 2661244 2650651 2627750 2592654 2546670 2491368 2428556 2360821 2290688 2219019 2145230
56160B145230p6134p7477p7340p6063p4195p2199o9985o6653o1814n6877n3561
$$ 2145230 2069096 1991619 1914279 1838216 1764021 1691822 1621837 1555184 1493370 1436493 1382932
56149A382932n1287m7894m2891l7969l4176l0923k8105k6668k6245k4677k1080
$$ 1382932 1331645 1283751 1240860 1202891 1168715 1137792 1109687 1083019 1056774 1032097 1011017
56138A011017j7280j5035j3828j2552j1348j0484r368p932p129o913n744l435
$$ 1011017 993737 978702 964874 952322 940974 930490 921122 913190 906061 899148 893404 889969
56126H89969k202l173m153k875m23Q35R29J327J822J216J88P74L224N609O419
$$ 889969 887767 884594 880441 877566 877143 877978 878907 880234 882056 883272 883460 884234 887458 893067 899486
56111H99486N838M629L393K767L054L792M687O348R089J1889J3652J4656J5459
$$ 899486 905324 909953 913346 916113 919167 922959 927646 933994 943083 954972 968624 983280 998739
56098I98739J5518J4452J3705J5081J8190K1168K3491K6325L0225L4150L6970
$$ 998739 1014257 1028709 1042414 1057495 1075685 1096853 1120344 1146669 1176894 1211044 1248014
56087A248014L8728M0194M2231M5701N1198N8660O7552P7235Q6993R6258J05079
$$ 1248014 1286742 1326936 1369167 1414868 1466066 1524726 1592278 1669513 1756506 1852764 1957843
56076A957843J13750J21533J26420J26464J20825J09720R4699P9006O6077N6994
$$ 1957843 2071593 2193126 2319546 2446010 2566835 2676555 2771254 2850260 2916337 2973331
56066B973331N0501M5470M1580L7436L0519K0179Q832r71q905j5504k0775k5696
$$ 2973331 3023832 3069302 3110882 3148318 3178837 3199016 3207848 3206877 3197972 3182468 3161693 3135997
56054C135997l2991m4375n8338p2132q4510r5060j02605j06102j05857j02415
$$ 3135997 3103006 3058631 3000293 2928161 2843651 2748591 2645986 2539884 2434027 2331612
56044B331612r5736q6655p7432o9181o0686n1403m3431l8405l4444k8825k2053
$$ 2331612 2235876 2149221 2071789 2002608 1941922 1890519 1847088 1808683 1774239 1745414 1723361
56033A723361j6570j2739q965m849j488Q49K869M476M987M889N526P261R408J1524
$$ 1723361 1706791 1694052 1685087 1680238 1678750 1679599 1682468 1686944 1691931 1696820 1702346 1709607 1719015 1730539
56019A730539J3462J4847J5744J7030J8978K0556K1185K1866K3543K5785K8126
$$ 1730539 1744001 1758848 1774592 1791622 1810600 1831156 1852341 1874207 1897750 1923535 1951661
56008A951661L0774L2925L2743L0589K9662L1555L3748L3851L3644L5925L9706
$$ 1951661 1982435 2015360 2048103 2078692 2108354 2139909 2173657 2207508 2241152 2277077 2316783
55997B316783M1854M1862M1639M1883M1685M0786L9708L8640L8191L9718M2962
$$ 2316783 2358637 2400499 2442138 2484021 2525706 2566492 2606200 2644840 2683031 2722749 2765711
55986B765711M5375M6029M7669N2405N7981O1361O3417O6558P0224P2534P4176
$$ 2765711 2811086 2857115 2904784 2957189 3015170 3076531 3139948 3206506 3276730 3349264 3423440
55975C423440P6745P9348Q0763Q2997Q8385R4985R9143J01075J03736J07797J12034
$$ 3423440 3500185 3579533 3660296 3743293 3831678 3926663 4025806 4126881 4230617 4338414 4450448
55964D450448J17139J24613J33195J40587J47503J55895J64793J72200J79383
$$ 4450448 4567587 4692200 4825395 4965982 5113485 5269380 5434173 5606373 5785756
55955E785756J88592J98267K05352K11034K19219K30436K41993K52935K64242
$$ 5785756 5974348 6172615 6377967 6589001 6808220 7038656 7280649 7533584 7797826
55946G797826K75523K86130K98117L13622L31066L48300L67050L89396M12946
$$ 7797826 8073349 8359479 8657596 8971218 9302284 9650584 10017634 10407030 10819976
55937A0819976M34992M58306M86531N17019N45176N72950O05628O42819O80452
$$ 10819976 11254968 11713274 12199805 12716824 13262000 13834950 14440578 15083397 15763849
55928A5763849P19176P62779Q10520Q59283R11007R69602J033064J097538J166595
$$ 15763849 16483025 17245804 18056324 18915607 19826614 20796216 21829280 22926818 24093413
55919B4093413J247354J340355J443110J560396J700153J862151K041780K241254
$$ 24093413 25340767 26681122 28124232 29684628 31384781 33246932 35288712 37529966
55911C7529966K464751K706756K959795L230668L534931L880047M271268M729897
$$ 37529966 39994717 42701473 45661268 48891936 52426867 56306914 60578182 65308079
55903F5308079N285453N950166O718486P587128Q554945R609735J0743084J1976602
$$ 65308079 70593532 76543698 83262184 90849312 99404257 109013992 119757076 131733678
55895A31733678J3348365J4881691J6600543J8563874K0837300K3432208K6297519
$$ 131733678 145082043 159963734 176564277 195128151 215965451 239397659 265695178
55888B65695178K9275109L1851200L2882587L0827591K4655695J4764020K994527
$$ 265695178 294970287 326821487 359704074 390531665 415187360 429951380 432945907
55881D32945907q329169j7497634k3843724k7500405k8985570k8925921k7898492
$$ 432945907 424616738 407119104 383275380 355774975 326789405 297863484 269964992
55874B69964992k6330308k4482396k2505236k0488572j8480102j6510223j4623124
$$ 269964992 243634684 219152288 196647052 176158480 157678378 141168155 126545031
55867A26545031j2874138j1299512r906965q693029p650049o757208n984748n311620
$$ 126545031 113670893 102371381 92464416 83771387 76121338 69364130 63379382 58067762
55859E8067762m727761m220944l775292l382106l039213k739983k474275k238810
$$ 58067762 53340001 49119057 45343765 41961659 38922446 36182463 33708188 31469378
55851C1469378k035205j858979j701082j558699j433934j323656j221238j126811
$$ 31469378 29434173 27575194 25874112 24315413 22881479 21557823 20336585 19209774
55843A9209774j045112r74346r07437q43137p85789p34952o85422o36996n94310
$$ 19209774 18164662 17190316 16282879 15439742 14653953 13919001 13233579 12596583 12002273
55834A2002273n57122n20211m82948m49727m20795l91644l61841l35661l13381
$$ 12002273 11445151 10924940 10441992 9992265 9571470 9179826 8817985 8482324 8168943
55825H168943k90553k66552k45222k26172k03902j77124j51212j30170j13923
$$ 8168943 7878390 7611838 7366616 7140444 6936542 6759418 6608206 6478036 6364113
55816F364113j04654j07504j22535j43057j63905j84709k03589k15425k19036
$$ 6364113 6259459 6151955 6029420 5886363 5722458 5537749 5334160 5118735 4899699
55807D899699k19267k19037k15626k07369j97566j88724j78853j66621j54705
$$ 4899699 4680432 4461395 4245769 4038400 3840834 3652110 3473257 3306636 3151931
55798C151931j44803j34591j22802j12231j04537r6893q7283p8433p2897o8450
$$ 3151931 3007128 2872537 2749735 2637504 2532967 2436074 2348791 2270358 2197461 2129011
55788B129011o2245n5810n2006m9990m6949m2587l8639l5832l3923l3075l3066
$$ 2129011 2066766 2010956 1958950 1908960 1862011 1819424 1780785 1744953 1711030 1677955 1644889
55777A644889l2823l2117l1794l1611l0376k9041l0192l3359l4387l1385k7727
$$ 1644889 1612066 1579949 1548155 1516544 1486168 1457127 1426935 1393576 1359189 1327804 1300077
55766A300077k6887k7589k6679k4070k1957k1243k1334k1799k2164k1500j9896
$$ 1300077 1273190 1245601 1218922 1194852 1172895 1151652 1130318 1108519 1086355 1064855 1044959
55755A044959j8822j8788j8445j7003j5395j3894j1136o918l579k982m141n277
$$ 1044959 1026137 1007349 988904 971901 956506 942612 931476 924558 920979 917997 913856 908579
55743I08579n956n969m465j808J3L43Q04J916J513j555m815n683n205n800p310
$$ 908579 902623 896654 892189 890381 890394 890737 891541 893457 894970 893415 888600 882917 877712 871912 864602
55728H64602q099q397r681j1748j3048j3280j3487j3946j3916j3204j2487j2330
$$ 864602 856503 848106 838425 826677 813629 800349 786862 772916 759000 745796 733309 720979
55716G20979j2833j3679j3772j1770p891m114j872o71J79j6j999m906p375r231
$$ 720979 708146 694467 680695 668925 661034 656920 655048 654377 654556 654540 652541 647635 640260 631029
55702F31029j1001j2481j2911j1887r562o692m706m522n091m653l583m080o537
$$ 631029 620028 607547 594636 582749 573187 566495 561789 557267 552176 547523 543940 539860 533323
55689E33323q575q570p878q210q973q793p889p202o734o332o659p753q112o837
$$ 533323 524748 516178 508300 500090 491117 482324 474435 467233 460499 454167 447508 439755 431643 424806
55675D24806n319n126n539n013l885l647m380m879m762m741n096n377n373n332
$$ 424806 419487 414361 408822 403809 399924 396277 391897 387018 382256 377515 372419 367042 361669 356337
55661C56337n464n893o575o787n582l314j620j208r64MR38J093J233K193L245
$$ 356337 350873 344980 338405 331618 326036 322722 321102 319894 318930 318934 319872 320965 322198 324391 327636
55646C27636L264K386J265k04k055l398l753m113n324o604p014p090p508p446
$$ 327636 330900 333286 334551 334347 332292 328894 325141 321028 315704 309100 302086 294996 287488 280042
55632B80042o058m372l745l495k174l99j08j478k739k858k411j749l69J620L034
$$ 280042 273984 269612 265867 262372 260198 259799 259691 258213 255474 252616 250205 248456 248087 249707 252741
55617B52741L172K552J771O51j039k907m228m466l586k325j869k599l521l534
$$ 252741 255913 258465 260236 260887 259848 256941 252713 248247 244661 242336 240467 237868 234347 230813
55603B30813k730j698k69J892L901M237K715Q55J36O15J406J869K135K708L592
$$ 230813 228083 226385 226116 228008 231909 236146 238861 239716 239852 240467 241873 243742 245877 248585 252177
55588B52177M043L455K364J763J502M66j493l087l488l430l862m755n874p334
$$ 252177 256220 259675 262039 263802 265304 265770 264277 261190 257702 254272 250410 245655 239781 232447
55574B32447q529q048n777l767l723m806n186m576l773k927j874j267j663k199
$$ 232447 223918 215870 210093 206326 202603 197797 192611 188035 184262 181335 179461 178194 176531 174332
55560A74332j867j305j680k417j959l77O31K63m76m65K51Q34L81j521m024n300
$$ 174332 172465 171160 169480 167063 165104 164727 165358 165621 165145 164680 164931 165765 166146 164625 160601 155301
55544A55301m642l578l752m549m306l056k095j466l2K000K849J760O6q70j163
$$ 155301 150659 147081 143329 138780 134474 131418 129323 127857 127825 129825 132674 134434 134500 133630 132467
55529A32467j345j227n77J28L05o6o74j088o88P50K405L101K642J705P67M5P9
$$ 132467 131122 129895 129318 129446 129751 129685 129011 127923 127235 127985 130390 133491 136133 137838 138605 138650 138729
55512A38729J127K316K732K960M001N002M038J358l80K74J508R64j137k837l192
$$ 138729 139856 142172 144904 147864 151865 156867 160905 162263 161883 162157 163665 164629 163492 160655 157463
55497A57463k694j833p83j88q49k537l985m282l710l055k654k305j823j315r22
$$ 157463 154769 152936 152153 151965 151116 148579 144594 140312 136602 133547 130893 128588 126765 125450 124528
55482A24528m90J50O67M27n30j210p80K94Q45N03L8L23J446K829L704L509K228
$$ 124528 124038 124188 124855 125282 124752 123542 122762 123056 123901 124404 124442 124765 126211 129040 132744 136253 138481
55465A38481N11q02j264r07kJ061J870K173J791M39j871m296n740o028n774n075
$$ 138481 138992 138190 136926 136019 136017 137078 138948 141121 142912 143351 141480 137184 131444 125416 119642 114567
55449A14567l502j594r50k123l659m146l974m044l959k930j445o03m80n55r11
$$ 114567 111065 109471 108521 106398 102739 98593 94619 90575 86616 83686 82241 81638 81158 80603 79692
55434G9692j607j676m09J088J336R05J409K587K491N97j380j991j534o66O74K286
$$ 79692 78085 76409 76000 77088 78424 79329 80738 83325 85816 86413 85033 83042 81508 80842 81516 83802
55418H3802L247L139K539J840P00r07k299l097l469l141j565N55J388K94j241
$$ 83802 87049 90188 92727 94567 95267 94360 92061 88964 85495 82354 80789 81344 82732 83026 81785
55403H1785j690j275r50q06n52n66j285k083j866o29M75N66L9%R91K329K837K155
$$ 81785 80095 78820 77870 77064 76512 75946 74661 72578 70712 70083 70558 71124 71163 71163 72154 74483 77320 79475
55385G9475J028J49n61j110q09O05J948J952J077P61J270J714J726J542P20j340
$$ 79475 80503 80652 80091 78981 78172 78777 80725 82677 83754 84515 85785 87499 89225 90767 91487 90147
55369I0147l583l877j890K99Q54O3q20j031k21J501K937K752J533J288K428L114
$$ 90147 86564 82687 80797 81096 81950 82013 81193 80162 79941 81442 84379 87131 88664 89952 92380 95494
55353I5494K309J380J559J750N64j169j763j410j543k312k571j910j063n36j94
$$ 95494 97803 99183 100742 102492 103056 101887 100124 98714 97171 94859 92288 90378 89315 88779 88585
55338H8585oK5M25J553K529K047J98j525k055j705j350j453j847j987j478q00
$$ 88585 88579 88604 89029 90582 93111 95158 95356 93831 91776 90071 88721 87268 85421 83434 81956 81156
55322H1156j048k441l617l227j743o77l97J37J523K949L378K841K028J221K36
$$ 81156 80108 77667 74050 70823 69080 68403 68006 68143 69666 72615 75993 78834 80862 82083 82319
55307H2319q03j239o93J99L32m66j104o63L13P50P77J435K653K874J182j175k116
$$ 82319 81516 80277 79584 79783 80115 79649 78545 77882 78195 78945 79722 81157 83810 86684 87866 86691 84575
55290H4575r22J411L350L792K602O83p46j338j572j598j030j48p0j099j873j076
$$ 84575 83653 85064 88414 92206 94808 95491 94745 93407 91835 90237 89207 89059 88989 87890 86017 84941
55274H4941P98K240K552K053J123J4p97r90r20j051j190q53k8R12J578J488L38
$$ 84941 85739 87979 90531 92584 93707 93721 92924 91934 91014 89963 88773 87920 87892 88804 90382 91870 92208
55257I2208j168j608p94m89k187m839n981m708k321l02J098K162K807K799K227
$$ 92208 91040 89432 88638 88149 85962 81123 75142 70434 68113 67811 68909 71071 73878 76677 78904
55242G8904J330K08r90j722j197Q38L242L924J972q28j720l00J095O54o64r95
$$ 78904 80234 80442 79452 77730 76533 77371 80613 84537 86509 85681 83961 83661 84756 85410 84746 83751
55226H3751k06N73R47J334J685J593J250J045N78o11j620r60J233L024L097K271
$$ 83751 83545 84118 85065 86399 88084 89677 90927 91972 92550 91939 90319 89359 90592 93616 96713 98984
55210I8984K076K537K094k66l182l911j541J333J430j060k743j792k37m03j320
$$ 98984 101060 103597 105691 105425 102243 98332 96791 98124 99554 98494 95751 93959 93722 93319 91999
55195I1999p54Q71J308M00K62J588K533J854P85P45J060L50j148j904j151M18
$$ 91999 91245 92116 93424 93824 94086 95674 98207 100061 100846 101591 102651 103001 101853 99949 98798 99216
55179I9216J571J594P51oj11j40r26k157k739k392j793j172NJ617K417J575j75
$$ 99216 100787 102381 103132 103126 103015 102875 101949 99792 97053 94661 92868 91696 91701 93318 95735 97310 97135
55162I7135j457j696j171l66L19O88Q70J003R14O28P90J708K229R07j750l467
$$ 97135 95678 93982 92811 92445 92764 93452 94322 95325 96239 96867 97657 99365 101594 102501 100751 97284
55146I7284k971j289mN15O67O91Q47J444K082J694K4j829k856l193l255k917k154
$$ 97284 94313 93024 93020 93535 94202 94893 95740 97184 99266 100960 100984 99155 96299 93106 89851 86934 84780
55129H4780j431p68M42K010K609J753P96Q57J060K59p37n79P1m06j518j054J347
$$ 84780 83349 82581 83023 85033 87642 89395 90191 91048 92108 92367 91630 91051 91122 90716 89198 88144 89491
55112H9491L376L379K488K423K936K797J970J282O95n22k236l404l531l081k418
$$ 89491 92867 96246 98734 101157 104093 106890 108860 110142 110837 110315 108079 104675 101144 98063 95645
55097I5645j417k17N38O38O53R79J271J326J728K800L574K858J056k91o43q86
$$ 95645 94228 94011 94549 95187 95840 96819 98090 99416 101144 103944 107518 110376 111432 111141 110498 109612
55081A09612j345q78J159L170K990P18j405j835j246j153k048l245l753k993j287
$$ 109612 108267 107389 108548 111718 114708 115426 114021 112186 110940 109787 107739 104494 100741 97748 96461
55066I6461J70L86k28m21J75P26P54R02J640K155J466%q71o05LN3l98o53l58Q5
$$ 96461 96631 97017 96789 96368 96543 97269 98023 98925 100565 102720 104186 104186 103315 102710 102713 102766 102368 101715 101357 101442
55046A01442J11j15K62J589K875K832J598O17P17J196J115N48P0j78l20k34Q7
$$ 101442 101553 101438 101700 103289 106164 108996 110594 111211 111928 113124 114239 114787 114857 114679 114359 114125 114212
55029A14212K04j66o82j008j296j583j393o05J03L60Q23J812K189R91o04o44O04
$$ 114212 114416 114250 113568 112560 111264 109681 108288 107683 107786 108146 108969 110781 112970 113961 113357 112713 113317
55012A13317J010q6q93j80P11N0j556k153j318m40m80r10q73k77N81J478K052
$$ 113317 114327 114241 113348 113168 113879 113929 112373 110220 108902 108462 107982 107072 106199 105922 106503 107981 110033
54995A10033J839J056O92J319K122J833M90m56q2O10j1j870l072k400q68j39j86
$$ 110033 111872 112928 113620 114939 117061 118894 119384 118928 118846 119456 119445 117575 114503 112103 111235 111096 110910
54978A10910K60J352J755Q37j90j20M49J93p92j251p51j71j82l91k74PJ29K03
$$ 110910 111170 112522 114277 115114 114924 114804 115253 115446 114654 113403 112652 112481 112299 111908 111634 111641 111770 111973
54960A11973L51K78j93n78k87N18J107J025L60n79j340j284q8J567K317J498j1
$$ 111973 112324 112602 112409 111831 111544 112062 113169 114194 114554 113975 112635 111351 111263 112830 115147 116645 116634
54943A16634o18L27J909K668K039O11q17j931k456j718N62L202M221K971R01k23
$$ 116634 116016 116343 118252 120920 122959 123570 122753 120822 118366 116648 117210 120412 124633 127604 128505 128282
54927A28282k43p0P0P22J747J999R30l78m65P25J951K236J723J022L66l55j036
$$ 128282 128039 127969 128039 128761 130508 132507 133437 133059 132594 133319 135270 137506 139229 140251 140617 140262 139226
54910A39226j201m95P20J384O07j396l294l688k159N14K990M091L344J272q00
$$ 139226 138025 137530 138250 139634 140241 138845 135551 131863 129704 130218 133208 137299 140643 141915 141115
54895A41115j547p22O11J179Q97P92J313J395p9k300l199k175q10m72o02l88o03
$$ 141115 139568 138846 139457 140636 141533 142325 143638 145033 144954 142654 139455 137280 136470 135998 135396 135008 134405
54878A34405k050l180j578K228M795M089J885R30J451J898J710J690K329L313
$$ 134405 132355 129175 127597 129825 134620 138709 140594 141524 142975 144873 146583 148273 150602 153915
54864A53915M460N875P217P809P433O463N427M970N769P720R606J0192R200O781
$$ 153915 158375 164250 171467 179276 186709 193172 198599 203569 209338 217058 226664 236856 246056 252837
54850B52837K943j587m943n937n743o238p243p107n694m782n207n661n121m642
$$ 252837 255780 254193 249250 243313 237570 231332 224089 216982 211288 206506 201299 195638 190517 185875
54836A85875n510o889o785m643j780L74J347J269M98k21m6J292L272M947N466
$$ 185875 180365 173476 166691 162048 160268 160642 161989 163258 163756 163535 163489 164781 168053 173000 178466
54821A78466M572K968J894J983K743L406L964M970O490P767P987P126N920M983
$$ 178466 183038 186006 187900 189883 192626 196032 199996 204966 211456 219223 227210 234336 240256 245239
54807B45239M043K246o71l790n956o988p450p571p160o449o069o026n623m731
$$ 245239 249282 251528 250857 247067 241111 234123 226673 219102 211942 205493 199424 193398 187775 183044
54793A83044m204m463m646l922k978l125m259m811l715j667j35J18o11j609k228
$$ 183044 178840 174377 169731 165809 162831 159706 155447 150636 146921 145254 145119 145237 144626 143017 140789
54778A40789k124j496j132j762l111l833k814n79J051R27j91p28k02O07J058J376
$$ 140789 138665 137169 136037 134275 131164 127331 124517 123938 124989 125916 125725 124997 124795 125402 126460 127836
54762A27836J820J991J377J13j112j687j403n27L84R12J127J125N27r14k304k180
$$ 127836 129656 131647 133024 133137 132025 130338 128935 128408 128792 129704 130831 131956 132483 131569 129265 127085
54746A27085m52J198J321L79j29M37J515K308K358J563M54J47J131K303K009J48
$$ 127085 126633 127831 129152 129531 129402 129839 131354 133662 136020 137583 138037 138184 139315 141618 143627 143775
54730A43775j545j490L7J488J841J336P65N46O60J060J667J992J425K85J04J980
$$ 143775 142230 140740 140777 142265 144106 145442 146207 146753 147413 148473 150140 152132 153557 153842 153946 155926
54714A55926M787N934M312J668O15J924M342O418P639Q078P953P706P864Q473
$$ 155926 160713 166647 170959 172627 173242 175166 179508 185926 193565 201643 209596 217302 225166 233639
54700B33639Q936Q580P161M928K383J8j955l659n207o381o864o685o228n884n815
$$ 233639 242575 251155 258316 263244 265627 265645 263690 260031 254824 248443 241579 234894 228666 222782 216967
54685B16967n939n926n293l784j787k23J24p18j893k480k290j762j110m7J467
$$ 216967 211028 205102 199809 196025 194238 194015 194139 193421 191528 189048 186758 184996 183886 183839 185306
54670A85306K701K986K736K886L587M194M442M669M885M615M033M187N575P171
$$ 185306 188007 190993 193729 196615 200202 204396 208838 213507 218392 223007 227040 231227 236802 243973
54656B43973P530O257L941J296j026k459l070l676m813o022o658o901p239p481
$$ 243973 251503 257760 261701 262997 261971 259512 256442 252766 247953 241931 235273 228372 221133 213652
54642B13652p087o083m908l624k184j134j149j933k477k409k306k515k509j773
$$ 213652 206565 200482 195574 191950 189766 188632 187483 185550 183073 180664 178358 175843 173334 171561
54628A71561p00j54m84j258j781j644j060p78j470k926m010l634j879O7J173J627
$$ 171561 170861 170707 170223 168965 167184 165540 164480 163702 162232 159306 155296 151662 149783 149850 151023 152650
54612A52650K267L002K565L74k034k494j001K70j05j106j097j98K99J6k21L9J64
$$ 152650 154917 157919 160484 160858 158824 156330 155329 155599 155494 154388 153291 153093 153392 153408 153187 153226 153390
54595A53390m76j457j667n17J347K529K236J073J32n03j528k833l299k549j585
$$ 153390 152914 151457 149790 149273 150620 153149 155385 156458 156590 156087 154559 151726 148427 145878 144293
54580A44293j024q8J635K711J690m83j532p87N44J545K253K350J234l24m60J195
$$ 144293 143269 143181 144816 147527 149217 148734 147202 146415 146959 148504 150757 153107 154341 154017 153557 154752
54564A54752K677K328R54L45O74N84o26k065k446j492J5J145J573J523J187N81
$$ 154752 157429 159757 160711 161056 161730 162314 161688 159623 157177 155685 155700 156845 158418 159941 161128 161709
54548A61709K0Q3O84Q30O5n22J71J255Q31j161k700k493j469r36p52l29j12p00
$$ 161709 161729 161812 162496 163326 163391 162869 163040 164295 165126 163965 161265 158772 157303 156367 155615 155286 155174 154474
54530A54474j252k37K370M697N028L539J871J319J670J720Q42k79o94n31n57o96
$$ 154474 153222 152985 155355 160052 165080 168619 170490 171809 173479 175199 176041 175762 175068 174537 173980 173284
54514A73284j56R31J252K40r24r37l2R45K060L625M753M141K156O51N12O99K17
$$ 173284 173128 174059 175311 175551 174627 173690 173658 174603 176663 180288 185041 189182 191338 191989 192501 193200 193417
54497A93417k10O25K307L077K031O8j478k252k490k047o71R99J739J303Q84J563
$$ 193417 193207 193832 196139 199216 201247 201315 199837 197585 195095 193048 192377 193376 195115 196418 197302 198865
54481A98865K887L639L485L032K650K132J484J196J498K007K237J952J111J00
$$ 198865 201752 205391 208876 211908 214558 216690 218174 219370 220868 222875 225112 227064 228175 228275
54467B28275r0J102K476J973n98k819k442j26J611J597R81J122J691J266p89l544
$$ 228275 228185 229287 231763 233736 233138 230319 227877 227751 229362 230959 231940 233062 234753 236019 235230 231686
54451B31686n401n444l972j974k85P18R45N46L5NN93J395K008K240J871P52o31
$$ 231686 226285 220841 216869 214895 214610 215328 216273 216819 216854 216859 217452 218847 220855 223095 224966 225718 225087
54434B25087j229n35P58J537J499J297J652K614L555L761L100K209J829K005K258
$$ 225087 223858 223323 224081 225618 227117 228414 230066 232680 236235 239996 243096 245305 247134 249139 251397
54419B51397K390K568K537J604j30j227m64J472K718K585K257K914M058M301L293
$$ 251397 253787 256355 258892 260496 260366 259139 258675 260147 262865 265450 267707 270621 274679 278980 282273
54404B82273K059J504J422J202P54L11j42n58m11N09J247O71p59j444r95p67j596
$$ 282273 284332 285836 287258 288460 289214 289525 289383 288825 288414 288923 290170 290841 290082 288638 287643 286876 285280
54387B85280k511k606k709l751m694l819j432N09J065Q58L27p38j944k391k182
$$ 285280 282769 280163 277454 273703 269009 265190 263758 264267 265332 266190 266517 265779 263835 261444 259262
54372B59262k193k266j526n74j249l504m746l268m91J408K244K794K793J898J327
$$ 259262 257069 254803 253277 252703 251454 247950 243204 239936 239445 240853 243097 245891 248684 250582 251909
54357B51909K394M063L998J738q12j965j893j675j917k473k664j786Q1J921K918
$$ 251909 254303 258366 262364 264102 263290 261325 259432 257757 255840 253367 250703 248917 248998 250919 253837
54342B53837L195K978J963K63q87n12P48J722K289K768K650J490K46Pk2j357l398
$$ 253837 257032 260010 261973 262236 261349 260837 261585 263307 265596 268364 271014 272504 272750 272757 272735 271378 267980
54325B67980l925k424q47n93o80K23J632K233J834J197P02K08k10j94L51J054
$$ 267980 264055 261631 260784 260191 259511 259734 261366 263599 265433 266630 267332 267540 267330 267136 267487 268541
54309B68541J257N01q04j484r89l85r81k249k383q57R16J680J623J215K98r01
$$ 268541 269798 270299 269495 268011 267022 266637 265656 263407 261024 260167 261083 262763 264386 265601 265899 264998
54293B64998j237k04J027J088J11r94j955k791k931j975p74m95r94j289j292j738
$$ 264998 263761 263557 264584 265672 265783 264789 262834 260043 257112 255137 254363 253868 252874 251585 250293 248555
54277B48555k594k866k217j522j537j968k218k224k092j723j289j339j885k025
$$ 248555 245961 243095 240878 239356 237819 235851 233633 231409 229317 227594 226305 224966 223081 221056
54263B21056j201k71m37j452j775o03J095J707O26j462l251l605k343o36m2p12
$$ 221056 219855 219584 219147 217695 215920 215317 216412 218119 218745 217283 214032 210427 208084 207448 207406 206694
54247B06694j117j29J309J553P10L62R68J185K05o70R9J891K661J632k1r33j015
$$ 206694 205577 205448 206757 208310 209020 209382 210350 211535 211740 211070 211169 213060 215721 217353 217332 216399 215384
54230B15384r56j207j712k114k006j261k57M38N45J83k74k83M17J141O97r58k215
$$ 215384 214428 213221 211509 209395 207389 206128 205871 206309 206854 207037 206763 206480 206897 208038 208735 207777 205562
54213B05562j779n80n62j835k386q51J571K572J412m69j171k38J125J515R48O37
$$ 205562 203783 203203 202641 200806 198420 197569 199140 201712 203124 202655 201484 201246 202371 203886 204834 205471
54197B05471J155J512P01n51o94L43J060O22n6J34R31J334J038N41K47P8k14o75
$$ 205471 206626 208138 208839 208288 207594 207937 208997 209619 209563 209697 210628 211962 213000 213541 213788 213866 213652 212977
54179B12977j024q82k76J53j05o80q26m87l04o63j401k204k634k030l72R68N72
$$ 212977 211953 211071 210795 210948 210843 210163 209337 208850 208546 207883 206482 204278 201644 199614 199242 200210 200782
54162B00782r71j645q51j98r62k171k195j052J1L98L92N9q69k090k709k163o76
$$ 200782 199811 198166 197315 197117 196155 193984 191789 190737 190748 191146 191538 191597 190728 188638 185929 183766 183090
54145A83090J080K313K410J461L47j48p1J44M68J119J863K102J665J077R28J099
$$ 183090 184170 186483 188893 190354 190701 190553 190482 190626 191094 192213 194076 196178 197843 198920 199848 200947
54129B00947Q31l88j925k362j124O82J588J517J335J193O11m0J74Q11K20j756
$$ 200947 201778 201390 199465 197103 195979 196661 198249 199766 201101 202294 202905 202865 203039 203850 204070 202314
54113B02314k999k158q02j035k358k629j280K93J059J290J417J475J629J986J982
$$ 202314 199315 197157 196355 195320 192962 190333 189053 189346 190405 191695 193112 194587 196216 198202 200184
54098B00184J096j4l26l6m1k37J12N70r4j568j924l94J460J999J392O41J45J29
$$ 200184 201280 201266 200940 200904 200863 200626 200738 201308 201214 199646 197722 197328 198788 200787 202179 202820 202965 203094
54080B03094R72K170K235P74n64m08K74j08j171j405p78n69r89r78k89K17M37
$$ 203094 204066 206236 208471 209245 208681 208273 208547 208439 207268 205863 205085 204516 203527 202549 202260 202477 202914
54063B02914J224K150J214k042m842m258r18J975K627K039J762K043K347K379
$$ 202914 204138 206288 207502 205460 200618 196360 195442 197417 200044 202083 203845 205888 208235 210614
54049B10614J999J162L17J39N73Q65O97M84L72Ql80J53J722K918K615J518Q98
$$ 210614 212613 213775 214092 214231 214804 215669 216366 216850 217222 217230 216850 217003 218725 221643 224258 225776 226674
54032B26674O96M8r42j431j365j321j121j87Q83Q08j45k09J089J964J148o8J82
$$ 226674 227370 227418 226476 225045 223680 222359 221238 221051 221934 222742 222597 222388 223477 225441 226589 226521 226703
54015B26703J597K490K468K570L330M179M724N312O132O828P052O709N687M069
$$ 226703 228300 230790 233258 235828 239158 243337 248061 253373 259505 266333 273385 280094 285781 289850
54001B89850K451J279J31j542l156l582k881k304k389k245j020R09K680L890M240
$$ 289850 292301 293580 293711 292169 289013 285431 282550 280246 277857 275612 274592 275501 278181 282071 286311
53986B86311L287J463N60J980M676O034M911K986K750M747P298Q543Q143P135
$$ 286311 289598 291061 291621 293601 298277 304311 309222 312208 314958 319705 327003 335546 343689 350824
53972C50824O757P572R282J0947J1549J0763R158P581O466N895N833N845N024
$$ 350824 357581 365153 374435 385382 396931 407694 416852 424433 430899 436794 442627 448472 453496
53959D53496K978N94j011k036l314m317l500j069M43n70k554l307l357m749p330
$$ 453496 456474 457068 456057 454021 450707 446390 442890 441821 442264 441694 439140 435833 432476 427727 420397
53944D20397q734p984o774o631o769n879m391l701m114m751m909m543l874l353
$$ 420397 411663 403679 396905 390274 383505 377626 373235 369534 365420 360669 355760 351217 347343 343990
53930C43990l516m222m500l794k890k810l273l128k091j183j294k074k415j680
$$ 343990 340474 336252 331752 327958 325068 322258 318985 315857 313766 312583 311289 309215 306800 305120
53916C05120k94O14J96j233k391k305j306m88l34k18P05K377L660L354J551j49
$$ 305120 304826 305440 305636 304403 302012 299707 298401 297913 297579 297361 298066 300443 304103 307457 309008 308859
53900C08859j77J122J808Q21n61l90J339K780K782K235K517L632M622N166N773
$$ 308859 308682 309804 311612 312433 311872 311482 312821 315601 318383 320618 323135 326767 331389 336555 342328
53885C42328O579O976O693O420O943Q175R478J0466J0954J0632R548Q630Q727
$$ 342328 348907 355883 362576 368996 375939 384114 393592 404058 415012 425644 435192 443822 452549
53872D52549R306R063P938P271P650P838O765N487N952Q397J1258J3312J4716
$$ 452549 461855 470918 478856 486127 493777 501615 508380 513867 519819 528216 539474 552786 567502
53859E67502J5968J6960J7298J6648J4692J1431P609M152J357o01p59J612N054
$$ 567502 583470 600430 617728 634376 649068 660499 668108 672260 673617 673016 672257 673869 678923
53846F78923O570M930K073N17M53L52n84j846k855l506l691l401l332m400o449
$$ 678923 685493 690423 692496 693013 693466 693818 693234 691388 688533 685027 681336 677935 674603 670203 663754
53831F63754q194q723q532q772r877j1213j1874j1533j0563r679r588j0691j2650
$$ 663754 655560 646837 638305 629533 619656 608443 596569 585036 574473 564794 555206 544515 531865
53818E31865j4179j3895j1784r402q141p761p333o974p485q555q827p953p151
$$ 531865 517686 503791 492007 482605 474464 466703 459370 452396 444911 436356 427529 419576 412425
53805D12425p246p466o976o302o201o183n384m188l661l829l791l277k835k576
$$ 412425 405179 397713 390737 384435 378234 372051 366667 362479 358818 354989 351198 347921 345086 342510
53791C42510j916p28J49l4j052k095k671l021l744m884n398m162j789m40j180
$$ 342510 340594 339866 340015 339981 338929 336834 334163 331142 327398 322514 317116 312954 311165 310725 309545
53776C09545k405k045m36M28o6o62n83m86p62o94p8q0j379k662k265n44O69N73
$$ 309545 307140 305095 304659 305087 305021 304359 303776 303290 302528 301834 301756 301676 300297 297635 295370 294826 295495 296068
53758B96068J63N23J432J927J740J737K926N090O653O347M822L898M256M851M864
$$ 296068 296231 296754 298186 300113 301853 303590 306516 311606 318259 324606 329428 333326 337582 342433 347297
53743C47297N093O527Q516R610R636R614R809R275P623O015N717O559P489P952
$$ 347297 352390 358917 367433 377043 386679 396293 406102 415377 423000 429015 434732 441291 448780 456732
53729D56732P989P421N925L846K157J404J258J218J194J133O08p05k467m047n267
$$ 456732 464721 472142 478067 481913 484070 485474 486732 487950 489144 490277 490885 490180 487713 483666 478399
53714D78399o257o845o771o456o781p814q519q140p221o615o130n001l441k688
$$ 478399 472142 465297 458526 452070 445289 437475 428956 420816 413595 406980 400850 395849 392408 389720
53700C89720l383m713n458n290m732m271l969l698l412l202l160l171k963k526
$$ 389720 386337 381624 376166 370876 366144 361873 357904 354206 350794 347592 344432 341261 338298 335772
53686C35772k261k385k396j650m31J62m66j664k316j984j129n15n55r33q96j18
$$ 335772 333511 331126 328730 327080 326649 326811 326345 324681 322365 320381 319252 318737 318182 317249 316353 316235
53670C16235Q00J161J271J986L205L675K701J163L37K74%j118k732l906l681j756
$$ 316235 317035 318196 319467 321453 324658 328333 331034 332197 332534 332808 332808 331690 328958 325052 321371 319615
53654C19615R17K696K948K779L415M356M051K165K20j05J365L459M786M676L567
$$ 319615 320532 323228 326176 328955 332370 336726 340777 342942 343162 343057 344422 347881 352667 357343 360910
53639C60910K696K910L796M359M410M559M859M434K921J433J335K548L738L966
$$ 360910 363606 366516 370312 374671 379081 383640 388499 392933 395854 397287 398622 401170 404908 408874
53625D08874L346K253P03j105k375k427j640j120j335j606j194m55l89j214k073
$$ 408874 412220 414473 415176 414071 411696 409269 407629 406509 405174 403568 402374 401919 401530 400316 398243
53610C98243k249j996j774j310j54J122J224k63k178k996k301q47M61J267J678
$$ 398243 395994 393998 392224 390914 390760 391882 393106 392843 390665 387669 385368 384521 384982 386249 387927
53595C87927J847J709J167M63K02P09J496J728J165K80m82j100j571j725j668
$$ 387927 389774 391483 392650 393113 393315 394024 395520 397248 398413 398693 398211 397111 395540 393815 392147
53580C92147j808k085j661M8K289L613L494K713K142J766J218P16Q34J584K306
$$ 392147 390339 388254 386593 386641 388930 392543 396037 398750 400892 402658 403876 404592 405426 407010 409316
53565D09316K623K925L516L797K997J567R78J865L218L863L958M260M667M570
$$ 409316 411939 414864 418380 422177 425174 426741 427719 429584 432802 436665 440623 444883 449550 454120
53551D54120M202M281M462L727K449K536M735P253Q031P242O323N717N006M430
$$ 454120 458322 462603 467065 470792 473241 475777 480512 487765 495796 503038 509361 515078 520084 524514
53537E24514M428M163K410m7q33P67K643K604R35o08j110q58m20l56j100k195
$$ 524514 528942 533105 535515 535468 534635 535402 538045 540649 541584 540976 539866 539008 538588 538232 537132 534937
53521E34937k424j452n81r49j859j992j422j069q67j22O95L39j002j740j349j046
$$ 534937 532513 531061 530480 529531 527672 525680 524258 523189 522322 522200 522895 523234 522232 520492 519143 518097
53505E18097j358q43J598M536N660M757L536L021K764K561L235N050O525N878
$$ 518097 516739 515896 517494 522030 527690 532447 535983 539004 541768 544329 547564 552614 559139 565017
53491E65017L342J181J357L638O275Q043R032R521R047P272N183M338N050O378
$$ 565017 568359 569540 570897 574535 580810 588853 597885 607406 616453 623725 628908 633246 638296 644674
53477F44674P844R840J2053J3022J2193J1206J1844J3723J5303J6385J7880J9604
$$ 644674 652518 662358 674411 687433 699626 710832 722676 736399 751702 768087 785967 805571
53465H05571K0233J9602J9333K0691K3114K5213K6154K5755K4510K3845K5063
$$ 805571 825804 845406 864739 885430 908544 933757 959911 985666 1010176 1034021 1059084
53454A059084K7587K9581L0681L2504L5800L8923M0323M0800M1638M2087M0841
$$ 1059084 1086671 1116252 1146933 1179437 1215237 1254160 1294483 1335283 1376921 1419008 1459849
53443A459849L8890L8447L9543M0050L9066L7995L7999L8452L8456L7997L6959
$$ 1459849 1498739 1537186 1576729 1616779 1655845 1693840 1731839 1770291 1808747 1846744 1883703
53432A883703L4813L2139L0754L1257L1963L1354L0117K9493K9001K7428K5079
$$ 1883703 1918516 1950655 1981409 2012666 2044629 2075983 2106100 2135593 2164594 2192022 2217101
53421B217101K3282K2294K1229J9717J8176J6754J5277J3969J2960J1393Q310
$$ 2217101 2240383 2262677 2283906 2303623 2321799 2338553 2353830 2367799 2380759 2392152 2400462
53410B400462M217M43k820o502j0853j5065j8758k2295k5395k6918k6561k5566
$$ 2400462 2404679 2405122 2402302 2395800 2384947 2369882 2351124 2328829 2303434 2276516 2249955 2224389
53398B224389k5330k6280k8357l1293l3987l4966l4178l3230l3290l3797l3783
$$ 2224389 2199059 2172779 2144422 2113129 2079142 2044176 2009998 1976768 1943478 1909681 1875898
53387A875898l3155l1953k9812k7145k5578k5915k6629k5615k2624j8846j5080
$$ 1875898 1842743 1810790 1780978 1753833 1728255 1702340 1675711 1650096 1627472 1608626 1593546
53376A593546j1679r347q332p405n129j685J862N378R144J2405J4396J6283J9727
$$ 1593546 1581867 1572520 1564188 1556783 1551654 1549969 1551831 1557209 1566353 1578758 1593154 1609437 1629164
53363A629164K3798K5812K5502K5694K8205L1633L4346L7028M0570M3666M4842
$$ 1629164 1652962 1678774 1704276 1729970 1758175 1789808 1824154 1861182 1901752 1945418 1990260
53352A990260M5303M7294N0688N3622N5819N8786O2835O6340O8265O9446P0891
$$ 1990260 2035563 2082857 2133545 2187167 2242986 2301772 2364607 2430947 2499212 2568658 2639549
53341B639549P2621P4820P8279Q2772Q6411Q7845Q8007Q8542Q9441Q9526Q8629
$$ 2639549 2712170 2786990 2865269 2948041 3034452 3122297 3210304 3298846 3388287 3477813 3566442
53330C566442Q7896Q7955Q7963Q6645Q3651P9643P5513P1678O7962O4125O0401
$$ 3566442 3654338 3742293 3830256 3916901 4000552 4080195 4155708 4227386 4295348 4359473 4419874
53319D419874N7109N3621M8515M1378L3718K7229K1555J4998P195m84p504j5496
$$ 4419874 4476983 4530604 4579119 4620497 4654215 4681444 4702999 4717997 4725192 4724708 4717204 4701708
53307D701708k5865l7229m6867n4252o1471p0013p8654q5186q9052r1386r3230
$$ 4701708 4675843 4638614 4591747 4537495 4476024 4406011 4327357 4242171 4153119 4061733 3968503
53296C968503r4748r5719r5949r5335r4211r3357r3058r2540r0918q8384q5697
$$ 3968503 3873755 3778036 3682087 3586752 3492541 3399184 3306126 3213586 3122668 3034284 2948587
53285B948587q3014q0217p7900p6656p5601p3138o9296o5785o3327o0679n6882
$$ 2948587 2865573 2785356 2707456 2630800 2555199 2482061 2412765 2346980 2283653 2222974 2166092
53274B166092n2756m9048m4808l9270l4017l1144l0000k7896k3856j9709j7305
$$ 2166092 2113336 2064288 2019480 1980210 1946193 1915049 1885049 1857153 1833297 1813588 1796283
53263A796283j6428j5853j4868j3187j0744q273o882o393n147k135J688M862P213
$$ 1796283 1779855 1764002 1749134 1735947 1725203 1716930 1710048 1703655 1698508 1696373 1698061 1702923 1710136
53250A710136R383J1478J3133J4374J5553J6927J8827K1688K5142K7819K8887
$$ 1710136 1719519 1730997 1744130 1758504 1774057 1790984 1809811 1831499 1856641 1884460 1913347
53239A913347K9305L0705L3402L6331L8553L9977M0907M1728M2834M4109M4633
$$ 1913347 1942652 1973357 2006759 2043090 2081643 2121620 2162527 2204255 2247089 2291198 2335831
53228B335831M3679M1704L9615L7407L4510L1269K8838K7367K5387K1560J6265
$$ 2335831 2379510 2421214 2460829 2498236 2532746 2564015 2592853 2620220 2645607 2667167 2683432
53217B683432J1055P023M120J641j145m602q640j3020j7761k2959k8266l2930
$$ 2683432 2694487 2701510 2705630 2707271 2706126 2701524 2692884 2679864 2662103 2639144 2610878 2577948
53205B577948l6507l9263m1869m4858m8248n1397n3418n4144n4410n5024n5683
$$ 2577948 2541441 2502178 2460309 2415451 2367203 2315806 2262388 2208244 2153834 2098810 2043127
53194B043127n5546n4553n3556n3261n3758n4722n5180n3583m9440m4916m3250
$$ 2043127 1987581 1933028 1879472 1826211 1772453 1717731 1662551 1608968 1559528 1514612 1471362
53183A471362m5061m7501m7656m5534m2951m0862l9062l7508l6339l5053l2957
$$ 1471362 1426301 1378800 1331144 1285610 1242659 1201797 1162735 1125227 1088888 1053835 1020878
53172A020878l0271k7728k5434k3159k1364k0713k0664j9882j8084j6345j5432
$$ 1020878 990607 962879 937445 914286 892922 872209 851545 831663 813579 797234 781802
53161G81802j5025j4745j4778j5079j5074j4691j4660j5138j5098j3791j2021
$$ 781802 766777 752032 737254 722175 707101 692410 677750 662612 647514 633723 621702
53150F21702j1020j0782j0430r774r479r846j0382j0607j0592j0485j0059q969
$$ 621702 610682 599900 589470 579696 570217 560371 549989 539382 528790 518305 508246 499277
53138D99277p359o118o363q170r862r303o367l458k922m505o019o045m995l904
$$ 499277 491918 485800 479437 471267 461405 452102 445735 442277 439355 434850 428831 422786 417791 413887
53124D13887l289l230l656m191m347m066l626l088k420j974k094k201j355J12
$$ 413887 410598 407368 403712 399521 395174 391108 387482 384394 381974 380000 377906 375705 374350 374462
53110C74462N69q25k816l572k813j725j250j295j442j622j942k284k293j702o99
$$ 374462 375031 374206 371390 367818 365005 363280 362030 360735 359293 357671 355729 353445 351152 349450 348751
53095C48751J34N26R30J765K328J425p81k497k489j606j363j844k087j875j781
$$ 348751 348885 349411 350341 352106 354434 355859 355078 352581 350092 348486 347123 345279 343192 341317 339536
53080C39536j727r22O37J808J761R06M5m87m67M67K105L451L816L543L149K360
$$ 339536 337809 336887 337524 339332 341093 341999 342044 341557 341090 341557 343662 347113 350929 354472 357621 359981
53064C59981P81j079k227k461k342k034r91R58K878L474K341K19j768k882k866
$$ 359981 360762 359683 357456 354995 352653 350619 349628 350586 353464 356938 359279 359498 357730 354848 351982
53049C51982j821k84O53Pj940l527l359j926r10j034j448j326j071j362j931k065
$$ 351982 350161 349877 350530 350537 348597 345070 341711 339785 338875 337841 336393 335067 333996 332634 330703 328638
53033C28638j779j612j604j343q19m06j15M23J251J954K222J876N78j633l529
$$ 328638 326859 325247 323643 322300 321481 321075 320960 321383 322634 324588 326810 328686 329264 327631 324102
53018C24102l543j714J16N36J71L84J197J466O88m20j129j516j825j746r49M7
$$ 324102 320559 318845 318961 319497 319668 320052 321249 322715 323403 322983 321854 320338 318513 316767 315818 315865
53002C15865J66r70k455l047k500j674j351j360j160p81p15j011j156q82n62n51
$$ 315865 316031 315061 312606 309559 307059 305385 304034 302674 301514 300733 300018 299007 297851 296969 296407 295856
52986B95856o99p28o34m00J92R87J150M6j700k636k008n05N78N51k64r42p05M45
$$ 295856 295157 294429 293795 293395 293587 294574 295724 295770 294070 291434 289426 288921 289499 290050 289786 288844 288139 288584
52968B88584J652J976J370P26Q55J541J737P45r69k187k154j217j90N45J021J137
$$ 288584 290236 292212 293582 294308 295163 296704 298441 299186 298217 296030 293876 292659 292469 293014 294035 295172
52952B95172P89M00O38J331J437N05n32n38L39J050J041N45j32p72q67n0J030
$$ 295172 295961 296361 296999 298330 299767 300272 299740 299202 299541 300591 301632 302177 302045 301273 300406 300356 301386
52935C01386J055m56k415l192k030M37K601K966J478k60o06K99R67O13j09m41
$$ 301386 302441 301985 299570 296378 294348 294785 297386 300352 301830 301570 300964 301263 302230 302843 302734 302293
52919C02293m85n32l14M57J503K402L105L589L586L015K151J114j82j236j139
$$ 302293 301808 301276 300962 301419 302922 305324 308429 312018 315604 318619 320770 321884 321702 320466 319327
52904C19327j3O39j31j265j278n16n09j526k158j511m79l73j156j711j366o55
$$ 319327 319314 319953 319822 318557 317279 316763 316254 314728 312570 311059 310580 310207 309051 307340 305974 305319
52888C05319n83j480k567k772j865m74R10K255L212K836Q51j551k900l023k662
$$ 305319 304736 303256 300689 297917 296052 295578 296488 298743 301955 304791 305642 304091 301191 298168 295506
52873B95506k139j388q55j189k174k869k732j849m07J115J616M51j364k141j585
$$ 295506 293367 291979 291124 289935 287761 284892 282160 280311 279904 281019 282635 283086 281722 279581 277996
52858B77996o63K04J346K324K026N51n83n87k37r6M07J419J844J144M81Q77J566
$$ 277996 277333 277537 278883 281207 283233 283784 283201 282614 282377 282281 282688 284107 285951 287095 287576 288453 290019
52841B90019J410P03J96m77j794k729j875L09K132L001L503L501K026o50k493
$$ 290019 291429 292132 292328 291851 290057 287328 285453 285762 287894 290895 294398 297899 299925 299275 296782
52826B96782j912M59K603L059J868K25n89l54j9l62r73r67j87R61K218L210L210
$$ 296782 294870 295329 297932 300991 302859 303084 302495 302141 302122 301760 300787 299820 299633 300594 302812 306022 309232
52809C09232K199J484K082L019K621J089J83N97J163Q09j83j077j535j368o46
$$ 309232 311431 312915 314997 318016 320637 321726 321909 322506 323669 324478 324295 323218 321683 320315 319669
52794C19669k78j307l353m838m797l484j405P77J603j9k732l694k192n58q66k473
$$ 319669 319391 318084 314731 309893 305096 301612 300207 300984 302587 302568 299836 296142 293950 293392 292526 290053
52778B90053l660l850l195j698j01L8j340j938j28K525L559L028K543K161P54
$$ 290053 286393 282543 279348 277650 277549 277587 276247 274309 274181 276706 280265 283293 285836 287997 288751
52763B88751j131j580n82m15k128l888l816k535j613r48O18K792L688K303J09
$$ 288751 287620 286040 285458 285043 282915 279027 275211 272676 271063 270115 270733 273525 277213 279516 279625
52748B79625m10J534M150M999L563J483J99p67k577m858n963n198l621k385j532
$$ 279625 279215 280749 284899 289898 293461 294944 295143 294376 291799 286941 280978 275780 272159 269774 268242
52733B68242q74q96j914k998k836j523m80m84o06L61J979K614J720P27J093K276
$$ 268242 267368 266472 264558 261560 258724 257201 256721 256237 255631 255992 257971 260585 262305 263032 264125 266401
52717B66401K624J837J201J424J596Q55k98j041j484j864j599l22R75J170P46
$$ 266401 269025 270862 272063 273487 275083 275938 275640 274599 273115 271251 269652 269330 270305 271475 272221
52702B72221Q79J360J029o6o80m42k71m92l30L21L28p15j437o49Q38J448R83M39
$$ 272221 273100 274460 275489 275423 274743 274301 274030 273538 273208 273529 273857 273142 271705 271056 271894 273342 274325 274764
52684B74764M38R37J911L190L971L557K417J674J688J866J683J096J07j172j951
$$ 274764 275202 276139 278050 281240 285211 288768 291185 292859 294547 296413 298096 299192 299299 298127 296176
52669B96176j133J352M025N096M041J763m63j978k784l066k913k488k102j928
$$ 296176 295043 296395 300420 305516 309557 311320 310857 308879 306095 303029 300116 297628 295526 293598
52655B93598j773j454j114p97j17J031J614L80k109l495k255L30J653P36j018
$$ 293598 291825 290371 289257 288460 288343 289374 290988 291368 289259 285764 283509 283839 285492 286228 285210
52640B85210j755j026K11P51J51r80j570j118j65M56M87K48Mk21l94m86n93o54
$$ 285210 283455 282429 282640 283391 283542 282562 280992 279874 279709 280165 280652 280900 280904 280683 280289 279803 279210 278556
52622B78556k51Q64K124K615K160J473J106Q02R1r03j595j650j142l02N96J140
$$ 278556 278305 279169 281293 283908 286068 287541 288647 289449 289540 288637 287042 285392 284250 283948 284544 285684
52606B85684J067P04P83J513K150J824O09o63j504j994j962q13J290K987L339
$$ 285684 286751 287455 288238 289751 291901 293725 294334 293671 292167 290173 288211 287398 288688 291675 295014
52591B95014L311M450O342O737M471J041j204j464m70P65J303K62k266m576m892
$$ 295014 298325 302775 309117 315854 320325 321366 320162 318698 318228 318993 320296 320558 318292 313716 308824
52576C08824l337j488j41J229K727L226J952n7j052n60N73J676K742L522L196
$$ 308824 305487 303999 303858 305087 307814 311040 312992 312935 311883 311323 311896 313572 316314 319836 323032
52561C23032J510n18j660j925k288l114l584k854j230K00P45N99L50L79N96N26
$$ 323032 324542 324024 322364 320439 318151 315037 311453 308599 307369 307569 308314 308913 309263 309642 310238 310764
52545C10764k01j285j962j980j895k023j756n07J147K231K850L727M504L948K025
$$ 310764 310563 309278 307316 305336 303441 301418 299662 299155 300302 302533 305383 309110 313614 317562 319587
52530C19587L09k37n35j618k823k793j414L95J987K937K568R96KJ129L175L372
$$ 319587 319896 319659 319124 317506 314683 311890 310476 310871 312858 315795 318363 319359 319361 320490 323665 327037
52514C27037J095j370k138j956k289k809k240o68N60Q08O70O37M18k11q07p78
$$ 327037 328132 326762 324624 322668 320379 317570 315330 314662 315222 316030 316700 317337 317755 317544 316737 315959
52498C15959p9Q41J406J221M75L0N92J654J865O98p03q37K37R12J4j732k516j480
$$ 315959 315880 316721 318127 319348 319823 319853 320445 322099 323964 324662 323959 323122 323359 324271 324285 322553 320037 318557
52480C18557M14J503J092j15r26p80q5L73K42n8J41R32J655J564N37q88j873j655
$$ 318557 318971 320474 321566 321451 320525 319745 319660 320033 320275 320217 320358 321290 322945 324509 325046 324158 322285 320630
52462C20630m4K108L263K578Q25n20q85p36l33O72K132K836J817j27j071r9J829
$$ 320630 320586 322694 325957 328535 329360 328840 327955 327219 326886 327558 329690 332526 334343 334216 333145 333046 334875
52445C34875L158L336K901K561K568K745K651J797O1k020l628m380m477m188l546
$$ 334875 338033 341369 344270 346831 349399 352144 354795 356592 356653 354633 351005 346625 342148 337960 334414
52430C34414k642j787j088k71P20J301R82K24p6J17K3n76q38j11J069J739J702
$$ 334414 331772 329985 328897 328626 329346 330647 331629 331853 331777 331894 331917 331341 330503 330392 331461 333200 334902
52413C34902J389J030O60N76J062J802K220K314K532K948L177L061K878K827K789
$$ 334902 336291 337321 337981 338557 339619 341421 343641 345955 348487 351435 354612 357673 360551 363378 366167
52398C66167K648K310J437k94k438l861l844k885k204k530l444l720k446j7K122
$$ 366167 368815 371125 372562 372268 369830 365969 362125 359240 357036 354506 351062 347342 344896 344879 347001
52383C47001K902K497J535Q1j837l261l053j689j064k137l705m009k705o85J261
$$ 347001 349903 352400 353935 354016 352179 348918 345865 344176 343112 340975 337270 333261 330556 329871 331132
52368C31132K755L327K633J150Kq3P22J707K198J782M92j072k001j695l74J018
$$ 331132 333887 337214 339847 340997 340999 340916 341638 343345 345543 347325 347817 346745 344744 343049 342675 343693
52352C43693J673J780K323L683M860M693L492K687K987L837M740N857O891O585
$$ 343693 345366 347146 349469 353152 358012 362705 366197 368884 371871 375708 380448 386305 393196 399781
52338C99781M236R23j657k944l311k894j719n48l01p51q90o11q89k037k873k218
$$ 399781 404017 404940 403283 400339 397028 394134 392415 391867 391566 390815 389925 389314 388425 386388 383515 381297
52322C81297n28O59N85m7j27N83J453J987K489L466M623N066M665M446N240O389
$$ 381297 380769 381428 382013 381966 381839 382422 383875 385862 388351 391817 396440 401506 406171 410617 415857 422246
52306D22246O543N362L786K705K104J464N93r8J01J397K885L153J905L80l51p59
$$ 422246 428789 434151 437937 440642 442746 444210 444803 444705 444806 446203 449088 452241 454146 454526 454175 453416
52290D53416j637k246j097J706M295N281M949M059K998K408L206N081O116M974
$$ 453416 451779 449533 448436 450142 454437 459718 464667 468726 471724 474132 477338 482419 488535 493509
52276D93509K710J559K543N003P803R970J0654R613P837P039Q252J1012J3701
$$ 493509 496219 497778 500321 505324 513127 523097 533751 543364 551201 558240 566492 577504 591205
52263E91205J4712J3809J2525J2549J3648J4106J3361J2853J3637J4617J4382
$$ 591205 605917 619726 632251 644800 658448 672554 685915 698768 712405 727022 741404
52252G41404J3489J3285J3440J2706J1576J1958J4123J6015J6149J5381J5010
$$ 741404 754893 768178 781618 794324 805900 817858 831981 847996 864145 879526 894536
52241H94536J4754J3763J2433J1935J2637J3869J4650J4021J1449P714M693L404
$$ 894536 909290 923053 935486 947421 960058 973927 988577 1002598 1014047 1021761 1026454 1029858
52229A029858L026K495K144K520K675J212j302k816k683k387k959l291j880Q65
$$ 1029858 1032884 1035379 1037523 1040043 1042718 1043930 1042628 1039812 1037129 1034742 1031783 1028492 1026612 1027477
52215A027477L124L792L168K070J211J196K222L749N010N815O404O753O679O580
$$ 1027477 1030601 1034393 1037561 1039631 1040842 1042038 1044260 1048009 1053019 1058834 1065238 1071991 1078670 1085250
52201A085250P173Q411R335R376R181R667J0722J1480J1523J1214J0924J0691
$$ 1085250 1092423 1100834 1110169 1119545 1128726 1138393 1149115 1160595 1172118 1183332 1194256 1204947
52189A204947J0513J0410J0068R047P553O376N793N170M083L133K927K840J681
$$ 1204947 1215460 1225870 1235938 1244985 1252538 1258914 1264707 1269877 1273960 1277093 1280020 1282860 1284541
52176A284541o26k907m173m386l854k796j675j176j480k154k888l646m063l613
$$ 1284541 1283915 1281008 1276835 1272449 1268595 1265799 1264124 1262948 1261468 1259314 1256426 1252780 1248717 1245104
52162A245104k731k627l443l590j849P28K106J922J687K593M231N451N685N280
$$ 1245104 1242373 1239746 1236303 1232713 1230864 1231592 1233698 1235620 1237307 1239900 1244131 1249582 1255267 1260547
52148A260547N161O037P482Q104P283O258O550P764Q164P139N765M804L742K226
$$ 1260547 1265708 1271745 1279227 1287331 1294614 1300872 1307422 1315186 1323350 1330489 1336254 1341058 1344800 1347026
52134A347026J080J094J752K083K090K571L996O000P544P291M658R26j576k013
$$ 1347026 1348106 1349200 1350952 1353035 1355125 1357696 1361692 1367692 1375236 1382527 1387185 1388111 1386535 1384522
52120A384522j961l173n312o802p150p184p474p669p349o608n819n350n338n291
$$ 1384522 1382561 1379388 1374076 1367274 1360124 1352940 1345466 1337797 1330448 1323840 1318021 1312671 1307333 1302042
52106A302042m402k839k037k880m255m487l564k663j972o36J255K333J965J163
$$ 1302042 1297640 1294801 1292764 1289884 1285629 1281142 1277578 1274915 1272943 1272307 1273562 1275895 1277860 1279023
52092A279023R92J310J560J610J230o5j798k263n06K193L742L569K646J875J500
$$ 1279023 1280015 1281325 1282885 1284495 1285725 1285660 1283862 1281599 1281093 1283286 1287028 1290597 1293243 1295118 1296618
52077A296618J656K346K947K749K048J955L003M593N993P281Q939J0922J2488
$$ 1296618 1298274 1300620 1303567 1306316 1308364 1310319 1313322 1317915 1323908 1331189 1340128 1351050 1363538
52064A363538J3040J2944J3397J5261J8136K0752K2235K2622K2295K1507K0590
$$ 1363538 1376578 1389522 1402919 1418180 1436316 1457068 1479303 1501925 1524220 1545727 1566317
52053A566317K0019J9938J9996J9817J9139J7538J4821J1901J0299J0293J0462
$$ 1566317 1586336 1606274 1626270 1646087 1665226 1682764 1697585 1709486 1719785 1730078 1740540
52042A740540R702Q609Q011P301N541L478K680K999K539L85k253l977m894n767
$$ 1740540 1750242 1758851 1766862 1774163 1779704 1783182 1785862 1788861 1791400 1791785 1789532 1785555 1780661 1774894
52028A774894o597p002p294q282j0299j2887j5107j5910j4707j1973r013o890
$$ 1774894 1768297 1761295 1754001 1745719 1735420 1722533 1707426 1691516 1676809 1664836 1655823 1648933
52016A648933n855n707o049o131n174l240j137P56K843N226P077P596P004O103
$$ 1648933 1643078 1637371 1631322 1625191 1620017 1616777 1615640 1616396 1619239 1624465 1631542 1639138 1646142 1652245
52002A652245N448N338N851O337N683L833K322K454L556M000L438K880K908K972
$$ 1652245 1657693 1663031 1668882 1675219 1680902 1684735 1687057 1689511 1693067 1697067 1700505 1703385 1706293 1709265
51988A709265K474J477J99j347l014m544o133q242j0718j2719j3794j4400j4980
$$ 1709265 1711739 1713216 1713415 1712068 1709054 1704510 1698377 1690135 1679417 1666698 1652904 1638504 1623524
51975A623524j5075j3927j1730r848r531j0592j1603j1539j0840j0389r954q691
$$ 1623524 1608449 1594522 1582792 1572944 1563413 1552821 1541218 1529679 1518839 1508450 1498496 1489805
51963A489805p073o697p709q239p478p430r654j1972j1265q646q308j1155j3190
$$ 1489805 1482732 1476035 1468326 1460087 1452609 1445179 1435525 1423553 1412288 1403642 1395334 1384179 1370989
51950A370989j1460q242p341r029j1338j4059j8008k1695k2370k0329j8993k0179
$$ 1370989 1359529 1351287 1343946 1334917 1323579 1309520 1291512 1269817 1247447 1227118 1208125 1187946
51938A187946k2004k2204k1177k0518k0587k0911k1467k2046k1451j8855j5404
$$ 1187946 1165942 1143738 1122561 1102043 1081456 1060545 1039078 1017032 995581 976726 961322
51927I61322j3168j2832j3386j3746j3765j3845j4263j4942j5440j5224j4278
$$ 961322 948154 935322 921936 908190 894425 880580 866317 851375 835935 820711 806433
51916H06433j3199j2489j2058j1572j0860r804q290o553n136m262l642k991k172
$$ 806433 793234 780745 768687 757115 746255 736451 728161 721608 716472 712210 708568 705577 703405
51903G03405p84J572M416O557P464P652P492O700N475M807M781L855J092j920
$$ 703405 702621 704193 708609 715166 722630 730282 737774 744474 749949 754756 759537 763392 764484 762564
51889G62564k939k083j265j112m23J282K708K967L255N242Q675J1587J2459J1497
$$ 762564 759625 757542 756277 755165 754742 756024 758732 761699 764954 770196 778871 790458 802917 814414
51875H14414J0125R743J0751J2440J3819J4409J3996J2047Q198L295j030m003
$$ 814414 824539 834282 845033 857473 871292 885701 899697 911744 919942 923237 922207 918204
51863I18204o274q737j1437j3810j5253j5316j4111j2653j1929j1439r721o496
$$ 918204 911930 903193 891756 877946 862693 847377 833266 820613 808684 797245 787524 781028
51851G81028l156o20J966N603R615J2554J3897J3753J1708P457K009l074p317
$$ 781028 777872 777252 779218 784821 794436 806990 820887 834640 846348 853805 855814 852740 845423
51838H45423j0989j3595j4353j4013j4421j5932j6919j6444j5824j6579j8007
$$ 845423 834434 820839 806486 792473 778052 762120 745201 728757 712933 696354 678347
51827F78347j8158j6386j3688j0991q434o144m516l317j541J274M103N321M508
$$ 678347 660189 643803 630115 619124 610690 604546 600030 596713 595172 596446 600549 605870 610378
51814F10378L002K583L675M994N058L862K635K063J425j45k163l329l226k778
$$ 610378 613380 615963 619638 624632 629690 633552 636187 638250 639675 639530 637367 634038 630812 628034
51800F28034k963l801m698n108m656l167j174N3l83j887k866k497j676j974l727
$$ 628034 625071 621270 616572 611464 606808 603641 602467 602520 602137 600250 597384 594887 593211 591237 587510
51785E87510n483n599m251l389m415o315o812n193l203k832m015n125n073m155
$$ 587510 582027 576428 572177 568788 564373 558058 551246 546053 542850 540018 536003 530878 525805 521650
51771E21650l082k093j052K45J934L655M263K770j63k393k416q59M65N35k89j118
$$ 521650 518568 516475 515423 515668 517602 521257 525520 528290 528127 525734 523318 522459 522924 523459 523170 522052
51755E22052j382j034m42P7P57K138L959M878L960K075J029J414K080J715K49
$$ 522052 520670 519636 519194 519271 520028 522166 526125 531003 534963 537038 538067 539481 541561 543276 543525
51740E43525j490k762l246k958k220j417o23K30P52K58j227k555k583j412j86
$$ 543525 542035 539273 536027 533069 530849 529432 528809 529039 529791 530049 528822 526267 523684 522272 522086
51725E22086J50l99j144j378q64ON11J98q33k126l119l260k256n24R97J829K456
$$ 522086 522236 521837 520693 519315 518451 518457 518968 519166 518333 516207 513088 509828 507572 507048 508045 509874 512330
51708E12330L502M665N086M725M672N699P106P581O971O355O268N748L771J057
$$ 512330 515832 520497 525583 530308 534980 540679 547785 555366 562337 568692 574960 580708 584479 585536
51694E85536p13j215j835l431m987n265m774m871n535n493m296k855j787o44P16
$$ 585536 584823 583608 581773 578342 573355 568090 563316 558445 552910 547417 543121 540266 538479 537835 538551
51679E38551J381Q11J09P94K917N279P083Q359R094Q912P793O317N040M085L526
$$ 538551 539932 540743 540852 541646 544563 549842 556925 565284 574378 583290 591083 597400 602440 606525 610051
51664F10051L702M853O518P555O807M065M03k627m333n160n603n350l929j919
$$ 610051 613753 618606 625124 632679 639486 643551 643954 641327 636994 631834 626231 620881 616952 615033
51650F15033q74j899m449o665p026n834m830m945m824k463J685M467L519j2k990
$$ 615033 614159 612260 607811 601146 594120 588286 583456 578511 573687 571224 572909 577376 580895 580883 577893
51635E77893l687k664j104K40P60K19m87n9J226J432n56l405m958m762l998l375
$$ 577893 574206 571542 570438 570678 571438 571657 571170 571111 572337 573769 573213 569808 564850 560088 556090 552715
51619E52715k259q0K434L973M102L463K731K136K071L309N891Q276Q595O980N759
$$ 552715 550456 550376 552810 556783 560885 564348 567079 569215 571286 574595 580486 588762 597357 604337 610096
51604F10096O832R488J1267J0619Q078N156K727M95k398o177r697j1233j0231
$$ 610096 616928 626416 637683 648302 656380 661536 664263 664758 662360 656183 646486 635253 625022
51591F25022p914n832m420l381k651k202j528m65o1j383l721n257n568n981p249
$$ 625022 617108 611276 606856 603475 600824 598622 597094 596629 596568 595185 591464 586207 580639 574658 567409
51576E67409q375q468q286q792r162p717m506j568n52j054j635j554j069n68j16
$$ 567409 559034 550566 542280 533488 524326 516609 512103 510535 509983 508929 507294 505740 504671 504103 503987
51561E03987K67M14K82Q7nj07k18J94J611L391L921K300n42k835l643l078j467
$$ 503987 504254 504668 504950 505037 505032 504925 504707 504901 506512 509903 513824 516124 515582 512747 509104 506026 504559
51544E04559P52K588L099K521K004K019J968J585J779L329N508O809O782O397
$$ 504559 505311 507899 510998 513519 515523 517542 519510 521095 522874 526203 531711 538520 545302 551699
51530E51699O598O959N996K764j787n213n682l745j570m75J75J538L572N266O099
$$ 551699 558297 565256 571252 574016 572229 567016 561334 557589 556019 555544 555719 557257 560829 566095 572194
51515E72194O654P838R887J2086J3326J3158J2403J2428J3654J5082J5383J4215
$$ 572194 578848 586686 596573 608659 621985 635143 647546 659974 673628 688710 704093 718308
51503G18308J2276J0531R687J0011J1406J3624J6603K0275K4109K7099K8341K7367
$$ 718308 730584 741115 750802 760813 772219 785843 802446 822721 846830 873929 902270 929637
51491I29637K4138J9170J3578Q360L565j285o072j0230j3905j7794k1608k3933
$$ 929637 953775 972945 986523 994883 998448 997163 991091 980861 966956 949162 927554 903621
51479I03621k4261k4047k4730k5680k5289k3458k1606k0464j9172j6819j3805
$$ 903621 879360 855313 830583 804903 779614 756156 734550 714086 694914 678095 664290
51468F64290j1255r728q897q178p444p162p735q626q542o906m619k897j760m29
$$ 664290 653035 643307 634410 626232 618788 611626 603891 595265 586723 579817 575198 572301 570541 570112
51454E70112J100J778Q90r93k491k465p63J529K749K220J042O07N91n36k951m677
$$ 570112 571212 572990 573880 572887 570396 567931 567168 568697 571446 573666 574708 575315 575906 575370 572419 567742
51438E67742m053k070j282k702m803n636n114m657m979n118l953k062j156j716
$$ 567742 563689 561619 560337 557635 552832 547196 542082 537425 532446 527328 523375 521313 520157 518441
51424E18441k283j585m46n24j798k671k375j859k018k417k454k461k664k115o9
$$ 518441 516158 514573 514127 513603 511805 509134 506759 504900 502882 500465 498011 495550 492886 490771 490702
51409D90702K065J929n95k934l095k003j661k163k084j198r71k037k847j822L79
$$ 490702 492767 494696 494101 491167 488072 486069 484408 482245 480161 478963 477992 475955 473108 471286 471665
51394D71665J947K534L296M600N253M358K648J377Q57Q95J865M292P721J0816
$$ 471665 473612 476146 479442 484042 489295 493653 496301 497678 498535 499430 501295 505587 513308 524124
51380E24124J2586J2857J1735R328O160L336J860J818K253J941M28j577l082l964
$$ 524124 536710 549567 561302 570630 576790 580126 581986 583804 586057 587998 588426 586849 583767 579803
51366E79803m904o220p391p949q076q004p438o239n073m732n060n090l883r73
$$ 579803 574899 568679 561288 553339 545263 537259 529821 523582 518509 513777 508717 503627 499744 498771
51352D98771L306P336Q805O900L535J548J801K913L373K994K463K540L644N302
$$ 498771 502077 509413 518218 525118 528653 530201 532002 534915 538288 541282 543745 546285 549929 555231
51338E55231O105N162L496K925L650M196L820L486M045M854N046N033N765P287
$$ 555231 561336 566498 569994 572919 576569 580765 584585 588071 592116 596970 602016 607049 612814 620101
51324F20101Q981J0602J2208J3614J4838J6617J9602K3350K6911L0141L3535L6904
$$ 620101 629082 639684 651892 665506 680344 696961 716563 739913 766824 796965 830500 867404
51312H67404L9117L9158L6747L1975K5219J7544J0367M213j675q052j4379j9462
$$ 867404 906521 945679 982426 1014401 1039620 1057164 1067531 1071744 1070069 1062017 1047638 1028176
51300A028176k3094k6356l0020l3300l4710l3990l2514l1717l1594l1050k9236
$$ 1028176 1005082 978726 948706 915406 880696 846706 814192 782475 750881 719831 690595
51289F90595k6117k2216j8442j5902j4977j4531j2884r811o876n510n427n446
$$ 690595 664478 642262 623820 607918 592941 578410 565526 555715 548839 543329 537902 532456
51277E32456n262n657p151r082j0090r252o933m625l732m222m690l972k374j028
$$ 532456 527194 521537 514386 505304 495214 485962 479029 474404 470672 466450 461760 457788 455414 454386
51263D54386n24o02q62j106j168j010r98j450j872j244O10K502L155K610J893
$$ 454386 453862 453260 452398 451292 450124 449114 448116 446666 444794 443550 444160 446662 449817 452427 454320
51248D54320J578J330Q91P49J399K396K801K436K091K372K788K278L17k588n181
$$ 454320 455898 457228 458119 458868 460267 462663 465464 467900 469991 472363 475151 477429 477746 475158 469977
51233D69977o140m963k589p35k73n29m88j89m16j365k365k645j812J64K696M459
$$ 469977 463837 458874 456285 455550 455277 454748 454260 454071 453655 452290 449925 447280 445468 445632 448328 452787
51217D52787M392K879J359P43R14J568K582L415L236K133J346J753K715L050K526
$$ 452787 457179 460058 461417 462160 463074 464642 467224 470639 473875 476008 477354 479107 481822 484872 487398
51202D87398J839J492J366J170P73J96m17r04j304j759k127k028j444q21m83l08
$$ 487398 489237 490729 492095 493265 494038 494234 493817 492913 491609 489850 487723 485695 484251 483430 482947 482639
51186D82639j18O2K10K57k37j617l271l988l439k516j821q51P39K001J800M33
$$ 482639 482521 482583 482793 483050 482813 481196 477925 473937 470498 467982 466161 465310 466049 468050 469850 470283
51170D70283p77j101q18l90p0j51o88j091o66M12J240J263Q17O81J376K617L262
$$ 470283 469506 468405 467587 467197 467127 466976 466288 465197 464531 464943 466183 467446 468263 468944 470320 472937 476199
51153D76199K383O96J41J464L098L360K800L020L920L933K782K035K580L266K932
$$ 476199 478582 479278 479419 480883 483981 487341 490141 493161 497081 501014 503796 505831 508411 511677 514609
51138E14609K208K143K204J157o58j566r80k59o80j681j973j673k165l808m997
$$ 514609 516817 518960 521164 522321 521663 520097 519117 518858 518178 516497 514524 512851 510686 506878 501881
51123E01881m159j963m44k84k43M83R15J27q61m21J100J763R15L7M21J399J537
$$ 501881 497722 495759 495315 495031 494788 495271 496186 496313 495452 495031 496131 497894 498809 498846 499267 500666 502203
51106E02203N83n87j287j433j019J9J442K615K853J868J30j219j258j93R71J581
$$ 502203 502786 502199 500912 499479 498460 498479 499921 502536 505389 507257 507387 506168 504910 504717 505688 507269
51090E07269J668J277L45n97n14P49J952J936J015K38j99r60k293l587m136l777
$$ 507269 508937 510214 510559 509962 509448 510197 512149 514085 515100 515338 515139 514179 511886 508299 504163 500386
51074E00386k755j514n60%O57J733K601K413J569J509K720L811L286J625P12J393
$$ 500386 497631 496117 495557 495557 496214 497947 500548 502961 504530 506039 508759 512570 515856 517481 518193 519586
51058E19586K566K879K428K219K614L157L635M383N354N707M868L513K863L187
$$ 519586 522152 525031 527459 529678 532292 535449 539084 543467 548821 554528 559396 562909 565772 568959
51044E68959L584L194K116J070N24L83K94K8k96l02L19J436K421K490J241r45
$$ 568959 572543 575737 577853 578923 579447 579830 580124 580152 579856 579554 579873 581309 583730 586220 587461 586516
51028E86516l009l923l369j806k5J137J094J46l71N27J953K098Q99L86J711L235
$$ 586516 583507 579584 576215 574409 574384 575521 576615 576761 576390 576917 578870 580968 581867 582253 583964 587199
51012E87199K827R76j44J42O87J016J997L715M808M639M421N195O334P114Q395
$$ 587199 590026 591002 590858 591000 591687 592703 594700 598415 603223 607862 612283 617478 623812 630926 639321
50997F39321J1073J3846J4295J1881Q501O176N461O043P684J0032J2302J3616
$$ 639321 650394 664240 678535 690416 698917 705093 710554 716597 724281 734313 746615 760231
50985G60231J3601J2614J1430J0448R057O301K327j397l681m624m653l732k336
$$ 760231 773832 786446 797876 808324 817381 823682 826009 824612 820931 816307 811654 807922 805586
50972H05586k141m203p153q715q692q866j0063j1002j0298q102n292k394P5J386
$$ 805586 803445 799242 792089 783374 774682 765816 755753 744751 734453 726351 721059 718665 718740 720126
50958G20126J543J588K283L275M096N075O475P649P897P606P635Q115Q546Q711
$$ 720126 721669 723257 725540 728815 732911 737986 744461 752110 760007 767613 775248 783363 791909 800620
50944H00620Q737Q711Q830R453J0365J0565R565Q298P858P952P692P425Q294J0131
$$ 800620 809357 818068 826898 836351 846716 857281 866846 875144 883002 890954 898646 906071 914365 924496
50930I24496J1210J0495Q848P601P014O801P194Q572J0550J2231J3082J3084J2361
$$ 924496 935706 946201 955049 962650 969664 976465 983659 992231 1002781 1015012 1028094 1041178 1053539
50917A053539J1261J0432J0217J0089R291Q085P824R610J3194J7376K1287K4942
$$ 1053539 1064800 1075232 1085449 1095538 1104829 1112914 1120738 1130348 1143542 1160918 1182205 1207147
50905A207147K8545L1656L3598L4643L6061L8578M1441M3619M5256M6849M7592
$$ 1207147 1235692 1267348 1300946 1335589 1371650 1410228 1451669 1495288 1540544 1587393 1634985
50894A634985M6116M2945M0411L9527L8530L5536L1243K7615K5068K2625K0121
$$ 1634985 1681101 1724046 1764457 1803984 1842514 1878050 1909293 1936908 1961976 1984601 2004722
50883B004722J8426J7779J7593J7876J9077K0381J9808J6538J1810P048K518j639
$$ 2004722 2023148 2040927 2058520 2076396 2095473 2115854 2135662 2152200 2164010 2171058 2173576 2171937
50871B171937m614o291q110j1369j5503j9223k2559k6477l1012l5170l8444m1181
$$ 2171937 2167323 2161032 2152922 2141553 2126050 2106827 2084268 2057791 2026779 1991609 1953165 1911984
50859A911984m3393m4458m4253m3714m3850m4619m5015m3946m1066l7133l3516
$$ 1911984 1868591 1824133 1779880 1736166 1692316 1647697 1602682 1558736 1517670 1480537 1447021
50848A447021l0932k8785k6115k3017k0533j9324j8971j8645j7946j6949j5848
$$ 1447021 1416089 1387304 1361189 1338172 1317639 1298315 1279344 1260699 1242753 1225804 1209956
50837A209956j4674j3356j2004j0965j0280r167o837l899k066k012k493k299j934
$$ 1209956 1195282 1181926 1169922 1158957 1148677 1139510 1132673 1128774 1126708 1124696 1122203 1119904 1117970
50824A117970k275k489r42K171M761N521N276N473O539P967R015R036Q143P720
$$ 1117970 1115695 1113206 1112264 1114435 1119196 1124717 1129993 1135466 1142005 1149972 1158987 1168023 1176166 1183886
50810A183886R250J2366J5173J6685J7810J9701K2386K5493K8827L1618L2596
$$ 1183886 1193136 1205502 1220675 1237360 1255170 1274871 1297257 1322750 1351577 1383195 1415791
50799A415791L1937L1997L4813L9594M4014M7322N0845N5671O1131O5848O9464
$$ 1415791 1447728 1479725 1514538 1554132 1598146 1645468 1696313 1751984 1813115 1878963 1948427
50788A948427P3054P8001Q4367R0343R3886R5162R6533R9657J03429J05457J04678
$$ 1948427 2021481 2099482 2183849 2274192 2368078 2463240 2559773 2659430 2762859 2868316 2972994
50777B972994J01558R6551Q9791Q1962P4035O6088N7434M8094L9210L1812K5890
$$ 2972994 3074552 3171103 3260894 3342856 3416891 3482979 3540413 3588507 3627717 3659529 3685419
50766C685419K0844J6424J2984J1267J1777J4087J7021J9791K2503K4942K5676
$$ 3685419 3706263 3722687 3735671 3746938 3758715 3772802 3789823 3809614 3832117 3857059 3882735
50755C882735K3288J8039J1189L095o804j8295l0139m1624n3105o4562p4729q2273
$$ 3882735 3906023 3924062 3935251 3938346 3931542 3913247 3883108 3841484 3788379 3723817 3649088 3566815
50743C566815q7028q9644r0733r0696q9667q7123q2268p5250o7411n9926n2746
$$ 3566815 3479787 3390143 3299410 3208714 3119047 3031924 2949656 2874406 2806995 2747069 2694323
50732B694323m5231l7212k9036k1147j4088q333l717M93M504P473Q660Q508Q006
$$ 2694323 2649092 2611880 2582844 2561697 2547609 2539276 2535559 2536052 2540556 2548029 2556689 2565197 2573203
50719B573203P310N694K780p70l934o425r011j2694j7531k2419k6358k9680l3536
$$ 2573203 2580513 2586207 2588987 2588217 2584283 2577858 2568847 2556153 2538622 2516203 2489845 2460165 2426629
50706B426629l8308m3174m7234n0217n2009n2393n1664n0645m9554m7553m4022
$$ 2426629 2388321 2345147 2297913 2247696 2195687 2143294 2091630 2040985 1991431 1943878 1899856
50695A899856l9607l5381l1515k7503k3251j9211j5673j2552r684o777l395O10
$$ 1899856 1860249 1824868 1793353 1765850 1742599 1723388 1707715 1695163 1685479 1678702 1675307 1675917
50683A675917M985R721J5249K1444K7048L0966L3683L6562M0111M3834M7521N1614
$$ 1675917 1680902 1690623 1705872 1727316 1754364 1785330 1819013 1855575 1895686 1939520 1987041 2038655
50671B038655N6232O0650O3821O4992O3992O1606N9380N8184N7123N4660N0620
$$ 2038655 2094887 2155537 2219358 2284350 2348342 2409948 2469328 2527512 2584635 2639295 2689915
50660B689915M6184M2284L8998L6261L3617K9391K1971J2360L858j547m877p458
$$ 2689915 2736099 2778383 2817381 2853642 2887259 2916650 2938621 2950981 2954839 2953292 2948415 2940957
50648B940957q421o479k730M64K695N518R609J3869J7518K1003K4335K6118K5159
$$ 2940957 2932536 2926057 2923327 2923791 2926486 2932004 2941613 2955482 2973000 2994003 3018338 3044456 3069615
50635C069615K1813J7016J1115M508j654o493j0343j3658j5750j5733j4157j2350
$$ 3069615 3091428 3108444 3119559 3124067 3122413 3115920 3105577 3091919 3076169 3060436 3046279 3033929
50623C033929j0432p342k808J980O042R742J3883J8646K4065L0685L8795M7514
$$ 3033929 3023497 3016155 3013347 3015327 3021369 3031111 3044994 3063640 3087705 3118390 3157185 3204699
50611C204699N5483O2290O8552P4655Q0013Q3549Q4476Q2665P8706P3694O8620
$$ 3204699 3260182 3322472 3391024 3465679 3545692 3629241 3713717 3796382 3875088 3948782 4017402
50600D017402O4000O0167N7561N6071N4473N1390M6959M2556L8662L3966K7419
$$ 4017402 4081402 4141569 4199130 4255201 4309674 4361064 4408023 4450579 4489241 4523207 4550626
50589D550626K0306J5092J2580J1431J0487J0204J1325J3464J5918J9059K3579
$$ 4550626 4570932 4586024 4598604 4610035 4620522 4630726 4642051 4655515 4671433 4690492 4714071
50578D714071K8820L3126L5857L7738L8868L7745L3163K6217J9324J3648Q480
$$ 4714071 4742891 4776017 4811874 4849612 4888480 4926225 4959388 4985605 5004929 5018577 5027057
50567E027057K949k723p907j2631j7620k3795l1967m2295n3532o3226o9242p0958
$$ 5027057 5030006 5027283 5019376 5006745 4989125 4965330 4933363 4891068 4837536 4774310 4705068 4634110
50555D634110o8818o3258n4834m4951l5530k7596k0767j4475r289o570p066j0320
$$ 4634110 4565292 4502034 4447200 4402249 4366719 4339123 4318356 4303881 4294592 4288022 4280956 4270636
50543D270636j5441k1993k9976l9314m9719o0841p2048q2135q9830r4859r8082
$$ 4270636 4255195 4233202 4203226 4163912 4114193 4053352 3981304 3899169 3809339 3714480 3616398
50532C616398j00164j00521r8169r3364q7691q2496p7846p3112o7928o2235n6084
$$ 3616398 3516234 3415713 3317544 3224180 3136489 3053993 2976147 2903035 2835107 2772872 2716788
50521B716788m9774m3889l8716l3893k8867k3359j7228j0517m031R05M004O877
$$ 2716788 2667014 2623125 2584409 2550516 2521649 2498290 2481062 2470545 2466514 2467419 2471423 2478300
50509B478300J1273J6729K1008K2944K3823K5657K8931L2670L6020L9038M2179
$$ 2478300 2489573 2506302 2527310 2550254 2574077 2599734 2628665 2661335 2697355 2736393 2778572
50498B778572M5709M9771N4696O0964O8623P6732Q3772Q9045R3387R7839J01738
$$ 2778572 2824281 2874052 2928748 2989712 3058335 3135067 3218839 3307884 3401271 3499110 3600848
50487C600848J03169J01596R9073R8122R9137J00694J02000J03840J07250J12229
$$ 3600848 3704017 3805613 3904686 4002808 4101945 4202639 4304639 4408479 4515729 4627958
50477D627958J18023J23938J29525J34560J39334J44536J50473J56637J62280
$$ 4627958 4745981 4869919 4999444 5134004 5273338 5417874 5568347 5724984 5887264
50468E887264J67193J71556J75438J78763J81510J83434J83777J81822J77673
$$ 5887264 6054457 6226013 6401451 6580214 6761724 6945158 7128935 7310757 7488430
50459G488430J71778J63650J51755J35107J14349R0791O4960L6847P206k2459
$$ 7488430 7660208 7823858 7975613 8110720 8225069 8315860 8380820 8417667 8424873 8402414
50449H402414n1339p9779j07867j34205j56654j73789j85143j90515j89874j83886
$$ 8402414 8351075 8271296 8163429 8029224 7872570 7698781 7513638 7323123 7133249 6949363
50439F949363j73725j60150j43178j22984j00763p8397n7183l7223j8323j625
$$ 6949363 6775638 6615488 6472310 6349326 6248563 6170166 6112983 6075760 6057437 6055812
50429F055812J0081J4204J0537R72j3066l1931n5899q2814j08781j31121j49694
$$ 6055812 6065893 6080097 6090634 6091606 6078540 6046609 5990710 5907896 5799115 5667994 5518300
50418E518300j65309j77791j86098j89640j89029j85806j81540j76820j70886
$$ 5518300 5352991 5175200 4989102 4799462 4610433 4424627 4243087 4066267 3895381
50409C895381j62775j52870j42785j33558j24650j15152j05286r6028q7667p9488
$$ 3895381 3732606 3579736 3436951 3303393 3178743 3063591 2958305 2862277 2774610 2695122
50399B695122p0884o2160n4166m7402m1478l5346k8339k1161j5566j2603j1351
$$ 2695122 2624238 2562078 2507912 2460510 2419032 2383686 2355347 2334186 2318620 2306017 2294666
50388B294666r885p358m483j996N78M122Q474J2602J6039J9287K2512K4651K4604
$$ 2294666 2284781 2277423 2272940 2270944 2271522 2275644 2284118 2296720 2312759 2332046 2354558 2379209 2403813
50375B403813K2875K1160K0427K0432K1190K3583K7821L2307L5299L7116L9621
$$ 2403813 2426688 2447848 2468275 2488707 2509897 2533480 2561301 2593608 2628907 2666023 2705644
50364B705644M3791M8875N3772N8096O1910O5464O9340P3803P7927Q0583Q2464
$$ 2705644 2749435 2798310 2852082 2910178 2972088 3037552 3106892 3180695 3258622 3339205 3421669
50353C421669Q5756R1349R7620J02561J05818J07783J08084J06276J03058R9377
$$ 3421669 3507425 3598774 3696394 3798955 3904773 4012556 4120640 4226916 4329974 4429351
50343D429351R4950Q9005Q1841P4207O5490N4124L9867K4264Q532p827k5835m5404
$$ 4429351 4524301 4613306 4695147 4769354 4834844 4888968 4928835 4953099 4961631 4953804 4927969 4882565
50331D882565o5272q3914j00030j12594j20812j24007j21938j15644j07559r9819
$$ 4882565 4817293 4733379 4633349 4520755 4399943 4275936 4153998 4038354 3930795 3830976
50321C830976r2452q3851p2941o0144m6555l3299k1720j3015p254l607j854k863
$$ 3830976 3738524 3654673 3581732 3521588 3475033 3441734 3420014 3406999 3399745 3396138 3394284 3391421
50309C391421p236j4384k3349l3720m5162n6742o7295p6003q2270q5755q7012
$$ 3391421 3384185 3369801 3346452 3312732 3267570 3210828 3143533 3067530 2985260 2899505 2812493
50298B812493q7460q8042q8319q7284q4563q0414p5280o9941o5527o2428n9655
$$ 2812493 2725033 2636991 2548672 2461388 2376825 2296411 2221131 2151190 2085663 2023235 1963580
50287A963580n6065n1868m8088m4816m1034l6226l1205k7004k3623k0302j6493
$$ 1963580 1907515 1855647 1807559 1762743 1721709 1685483 1654278 1627274 1603651 1583349 1566856
50276A566856j2152p494k957P04K916L869M151L670J451k874p741j0693j0841
$$ 1566856 1554704 1547210 1544253 1544957 1547873 1551742 1555893 1559563 1561014 1558140 1550399 1539706 1528865
50263A528865r579q543p790o590n029l605j920P40L713N433N728O109P373Q445
$$ 1528865 1519286 1510743 1502953 1496363 1491334 1487729 1485809 1486549 1490262 1495695 1501423 1507532 1514905 1523350
50249A523350Q441Q292R094J0107R929Q938Q871J0246J1633J1597J0257Q770Q204
$$ 1523350 1531791 1540083 1549177 1559284 1569213 1578151 1587022 1597268 1608901 1620498 1630755 1639525 1647729
50236A647729Q914J0315J1203J1027J0641J1147J2220J2523J1601J0371R877J0757
$$ 1647729 1656643 1666958 1678161 1689188 1699829 1710976 1723196 1735719 1747320 1757691 1767568 1778325
50224A778325J3785J9357K5665K8614K4842J4680J802r620j7251k1022k2111k1509
$$ 1778325 1792110 1811467 1837132 1865746 1890588 1905268 1907070 1897450 1880199 1859177 1837066 1815557
50212A815557j9334j5633j1481q303o059l286O00M098N593N551N599O142O223
$$ 1815557 1796223 1780590 1769109 1760806 1754747 1751461 1752061 1756159 1761752 1767303 1772902 1779044 1785267
50199A785267N539N197O225Q418J1023J3656J6078J7860J8952K0237K2791K6796
$$ 1785267 1790806 1796003 1802228 1810646 1821669 1835325 1851403 1869263 1888215 1908452 1931243 1958039
50187A958039L1566L6539M1723M7190N2672N7863O2778O7600P2198P5898P7604
$$ 1958039 1989605 2026144 2067867 2115057 2167729 2225592 2288370 2355970 2428168 2504066 2581670
50176B581670P6116P0866O2779N4338M8086M4666M2509L9574L5009K8963K1321
$$ 2581670 2657786 2728652 2791431 2845769 2893855 2938521 2981030 3020604 3055613 3084576 3105897
50165C105897J1376j406j6885l4406n2687o9512q2448r0530r4821r6829r6788
$$ 3105897 3117273 3115867 3098982 3064576 3011889 2942377 2859929 2769399 2674578 2577749 2480961
50154B480961r4044q8644q1681p4187o6558n9467n4399n2404n2507n2223n0017
$$ 2480961 2386917 2298273 2216592 2142405 2075847 2016380 1961981 1909577 1857070 1804847 1754830
50143A754830m6772m4355m3066m1305l7788l3290k9551k7016k4591k1622j8981
$$ 1754830 1708058 1663703 1620637 1579332 1541544 1508254 1478703 1451687 1427096 1405474 1386493
50132A386493j7639j6933j5201j1935q584o945p253q074p853o343m645m017m680
$$ 1386493 1368854 1351921 1336720 1324785 1316201 1309256 1302003 1293929 1286076 1279733 1275088 1271071 1266391
50119A266391n747o207n746m576k762k70K389M064M036K888K026K151K689K819
$$ 1266391 1260644 1254437 1248691 1244115 1241353 1241083 1243472 1247536 1251572 1254460 1256486 1258637 1261326 1264145
50105A264145K767L566N668Q224R978J0508J0380J0361J0806J1657J2660J3651
$$ 1264145 1266912 1270478 1276146 1284370 1294348 1304856 1315236 1325597 1336403 1348060 1360720 1374371
50093A374371J4868J6880J9870K3061K5234K5886K5640K5574K6364K7893K9338
$$ 1374371 1389239 1406119 1425989 1449050 1474284 1500170 1525810 1551384 1577748 1605641 1634979
50082A634979K9749K8989K8148K8599L0690L3678L6889M0414M4712N0007N6183
$$ 1634979 1664728 1693717 1721865 1750464 1781154 1814832 1851721 1892135 1936847 1986854 2043037
50071B043037O2759O9157P5534Q3098R2751J03505J13406J21961J30139J37617
$$ 2043037 2105796 2174953 2250487 2333585 2426336 2529841 2643247 2765208 2895347 3032964
50061C032964J41807J40903J36388J31108J25867J19821J13390J08447J05436
$$ 3032964 3174771 3315674 3452062 3583170 3709037 3828858 3942248 4050695 4156131
50052D156131J02193R6124Q6107P1767N2574K8653J495k6975n5292q1988j05395
$$ 4156131 4258324 4354448 4440555 4512322 4564896 4593549 4595044 4568069 4512777 4430789 4325394
50041D325394j24758j40540j52800j60175j61814j59388j55685j51482j45372
$$ 4325394 4200636 4060096 3907296 3747121 3585307 3425919 3270234 3118752 2973380
50032B973380j36622j26662j17160j07998r8114q7649p8171p0824o5029n9223
$$ 2973380 2836758 2710096 2592936 2484938 2386824 2299175 2221004 2150180 2085151 2025928
50022B025928n2490m5307l8850l3865l0250k7438k4912k2291j9360j6333j3824
$$ 2025928 1973438 1928131 1889281 1855416 1825166 1797728 1772816 1750525 1731165 1714832 1701008
50011A701008j2214j1157j0147r391r588j0747j1777j1618j0412r226q922r628
$$ 1701008 1688794 1677637 1667490 1658099 1648511 1637764 1625987 1614369 1603957 1594731 1585809 1576181
49999A576181j1024j2489j2999j1733r162p052o640p085o469m291k066j301j741
$$ 1576181 1565157 1552668 1539669 1527936 1518774 1511722 1505082 1497997 1491528 1487237 1485171 1483870 1482129
49986A482129k236k480k799k771j433J046L169M131M983O991R623J1108J0651
$$ 1482129 1479893 1477413 1474614 1471843 1470410 1471456 1474625 1478756 1483739 1490730 1500353 1511461 1522112
$$ [...]
##END NTUPLES=NMR SPECTRUM
##END=
