
##TITLE=UV1149_M1-1003-1002_6301541_ibaWxrmksL
##JCAMPDX= 6.0         $$ Bruker NMR JCAMP-DX V2.0
##DATA TYPE= NMR SPECTRUM
##DATA CLASS= NTUPLES
##ORIGIN= BRUKER
##OWNER= Administrator
$$ 1.72 TOPSPIN		Version 2.1
$$ 2012-06-05 23:50:55.015 -0500  Administrator@TOPSPIN
$$ Compression mode = diff/dup
##.OBSERVE FREQUENCY= 400.13188235
##.OBSERVE NUCLEUS= ^1H
##.ACQUISITION MODE= SIMULTANEOUS (DQD)
##.ACQUISITION SCHEME= undefined
##.AVERAGES= 8
##.DIGITISER RES= 22
##SPECTROMETER/DATA SYSTEM= spect
##.PULSE SEQUENCE= zg30
##.SOLVENT NAME= COFFEE_meoh
##.SHIFT REFERENCE= INTERNAL, COFFEE_meoh, 1, 14.98061
##AUDIT TRAIL= $$ (NUMBER, WHEN, WHO, WHERE, PROCESS, VERSION, WHAT)
$$ ##TITLE= Audit trail, TOPSPIN		Version 2.1
$$ ##JCAMPDX= 5.01
$$ ##ORIGIN= Bruker BioSpin GmbH
$$ ##OWNER= Administrator
$$ $$ C:\Bruker\TOPSPIN/data/COFFEE/nmr/UV1149_M1-1003-1002_6301541_ibaWxrmksL/10/pdata/1/auditp.txt
$$ ##AUDIT TRAIL=  $$ (NUMBER, WHEN, WHO, WHERE, PROCESS, VERSION, WHAT)
(   1,<2012-06-05 23:50:48.203 -0500>,<Administrator>,<TOPSPIN>,<go>,<TOPSPIN 2.1>,
      <created by zg
	started at 2012-06-05 23:49:41.421 -0500,
	POWCHK enabled, PULCHK disabled,
       configuration hash MD5:
       D5 CA 7A 23 FE 6B EE E2 50 67 74 61 24 F7 5E 3B
       data hash MD5: 64K
       5D 2A 49 85 37 BA 7D A0 E2 7E 48 9F 28 D7 7D 42>)
(   2,<2012-06-05 23:50:50.828 -0500>,<Administrator>,<TOPSPIN>,<proc1d>,<TOPSPIN 2.1>,
      <Start of raw data processing
       efp LB = 0 FT_mod = 6 PKNL = 1 PHC0 = 0 PHC1 = 0 SI = 32K 
       data hash MD5: 32K
       FE 69 68 04 61 AA B8 27 06 E6 D2 2D 94 C5 52 F3>)
(   3,<2012-06-05 23:50:51.296 -0500>,<Administrator>,<TOPSPIN>,<proc1d>,<TOPSPIN 2.1>,
      <pk PHC0 = 214.2279 PHC1 = 0 
       data hash MD5: 32K
       EE EB F5 71 F0 BA 1A 40 C2 F3 04 62 29 40 35 A2>)
(   4,<2012-06-05 23:50:51.390 -0500>,<Administrator>,<TOPSPIN>,<proc1d>,<TOPSPIN 2.1>,
      <abs ABSG = 1 
       data hash MD5: 32K
       2B 76 23 8F D1 9C 9D 82 69 B8 A6 94 AE 53 40 F3>)
(   5,<2012-06-05 23:50:51.421 -0500>,<Administrator>,<TOPSPIN>,<proc1d>,<TOPSPIN 2.1>,
      <abs ABSG = 2 
       data hash MD5: 32K
       FE DF 0D 3E 83 14 2F 38 3F B4 67 AE BA 5A 3F C0>)
(   6,<2012-06-05 23:50:51.453 -0500>,<Administrator>,<TOPSPIN>,<proc1d>,<TOPSPIN 2.1>,
      <abs ABSG = 3 
       data hash MD5: 32K
       E1 D5 57 58 15 28 BB AF 31 72 93 02 DD 07 E9 C4>)
(   7,<2012-06-05 23:50:51.484 -0500>,<Administrator>,<TOPSPIN>,<proc1d>,<TOPSPIN 2.1>,
      <abs ABSG = 4 
       data hash MD5: 32K
       57 75 88 82 54 29 2D 2D FE 0D BF 18 4E 22 2E 24>)
(   8,<2012-06-05 23:50:51.500 -0500>,<Administrator>,<TOPSPIN>,<proc1d>,<TOPSPIN 2.1>,
      <abs ABSG = 5 
       data hash MD5: 32K
       2A 26 42 40 A1 3A DB B9 15 49 6B 1C 4C 73 3A 84>)
$$ ##END=
$$ 
$$ $$ hash MD5
$$ $$ 42 DC A3 6B AA 1F 9F 7B CA 97 93 A3 C0 F2 1A 8A
##$RELAX= 
##$RELAX= 
##$RELAX= 
##$RELAX= 
##$RELAX= 
##$RELAX= 
##$RELAX= 
$$ Bruker specific parameters
$$ --------------------------
$$ [...]
150 150 150 150 150 150 150 150
##$TP07= 0
##$TPNAME0= <>
##$TPNAME1= <>
##$TPNAME2= <>
##$TPNAME3= <>
##$TPNAME4= <>
##$TPNAME5= <>
##$TPNAME6= <>
##$TPNAME7= <>
##$TPOAL= (0..7)
0.5 0.5 0.5 0.5 0.5 0.5 0.5 0.5
##$TPOFFS= (0..7)
0 0 0 0 0 0 0 0
##$TUNHIN= 0
##$TUNHOUT= 0
##$TUNXOUT= 0
##$USERA1= <user>
##$USERA2= <user>
##$USERA3= <user>
##$USERA4= <user>
##$USERA5= <user>
##$V9= 5
##$VALIST= <valist>
##$VCLIST= <CCCCCCCCCCCCCCC>
##$VD= 0
##$VDLIST= <DDDDDDDDDDDDDDD>
##$VPLIST= <PPPPPPPPPPPPPPP>
##$VTLIST= <TTTTTTTTTTTTTTT>
##$WBST= 2048
##$WBSW= 25
##$XGAIN= (0..3)
0 0 0 0
##$XL= 0
##$YL= 0
##$YMAX_a= 506833
##$YMIN_a= -596974
##$ZGOPTNS= <>
##$ZL1= 120
##$ZL2= 120
##$ZL3= 120
##$ZL4= 120
##$ABSF1= 14.98061
##$ABSF2= -5.57192
##$ABSG= 5
##$ABSL= 3
##$ALPHA= 0
##$AQORDER= 0
##$ASSFAC= 0
##$ASSFACI= 0
##$ASSFACX= 0
##$ASSWID= 0
##$AUNMP= <proc_prof1d_extract_pilot.lims>
##$AXLEFT= 0
##$AXNAME= <>
##$AXNUC= <1H>
##$AXRIGHT= 0
##$AXTYPE= 0
##$AXUNIT= <>
##$AZFE= 0.1
##$AZFW= 0.1
##$BCFW= 0
##$BC_mod= 0
##$BYTORDP= 0
##$COROFFS= 0
##$CY= 15
##$DATMOD= 1
##$DC= 0
##$DFILT= <>
##$DTYPP= 0
##$F1P= 0
##$F2P= 0
##$FCOR= 0.5
##$FTSIZE= 32768
##$FT_mod= 6
##$GAMMA= 0
##$GB= 0
##$INTBC= 1
##$INTSCL= 1
##$ISEN= 128
##$LB= 0
##$LEV0= 0
##$LPBIN= 0
##$MAXI= 10000
##$MC2= 0
##$MEAN= 0
##$ME_mod= 0
##$MI= 0
##$NCOEF= 0
##$NC_proc= -8
##$NLEV= 6
##$NOISF1= 0
##$NOISF2= 0
##$NSP= 0
##$NTH_PI= 0
##$NZP= 0
##$OFFSET= 14.98061
##$PC= 1
##$PHC0= 214.2279
##$PHC1= 0
##$PH_mod= 1
##$PKNL= yes
##$PPARMOD= 0
##$PPDIAG= 0
##$PPIPTYP= 0
##$PPMPNUM= 2147483647
##$PPRESOL= 1
##$PSCAL= 4
##$PSIGN= 0
##$PYNMP= <proc.py>
##$REVERSE= no
##$SF= 400.13
##$SI= 32768
##$SIGF1= 0
##$SIGF2= 0
##$SINO= 400
##$SIOLD= 32768
##$SPECTYP= <>
##$SREGLST= <1H.CDCl3>
##$SSB= 0
##$STSI= 32768
##$STSR= 0
##$SW_p= 8223.68421052632
##$SYMM= 0
##$S_DEV= 0
##$TDeff= 65536
##$TDoff= 0
##$TI= <>
##$TILT= no
##$TM1= 0
##$TM2= 0
##$TOPLEV= 0
##$USERP1= <user>
##$USERP2= <user>
##$USERP3= <user>
##$USERP4= <user>
##$USERP5= <user>
##$WDW= 1
##$XDIM= 32768
##$YMAX_p= 453625854
##$YMIN_p= -707114
##$CURPLOT= <Network HP LaserJet P1505>
##$CURPRIN= <$Network HP LaserJet P1505>
##$DFORMAT= <normdp>
##$LAYOUT= <+/1D_H.xwp>
##$LFORMAT= <normlp>
##$PFORMAT= <normpl>
##$SURQMSG= 1
$$ End of Bruker specific parameters
$$ ---------------------------------
##NTUPLES= NMR SPECTRUM
##VAR_NAME=  FREQUENCY,     SPECTRUM/REAL,   SPECTRUM/IMAG
##SYMBOL=    X,             R,               I
##VAR_TYPE=  INDEPENDENT,   DEPENDENT,       DEPENDENT
##VAR_FORM=  AFFN,          ASDF,            ASDF
##VAR_DIM=   32768,         32768,           32768
##UNITS=     HZ,            ARBITRARY UNITS, ARBITRARY UNITS
##FACTOR=    0.250966925370066, 1,           1
##FIRST=     8223.43324360095, -55391,       -195990
##LAST=      0,             -81887,          -111539
##MIN=       0,             -707114,         0
##MAX=       8223.43324360095, 453625854,    0
$$ Real data points
##PAGE= N=1
##DATA TABLE= (X++(R..R)), XYDATA
$$ [...]
$$ plain form
19559 276982 -4062 74259 -197947 212284 16354 -324412 433880 -130444 -50398 105751
19548 -60690 -34069 -95219 -21345 150281 180669 -199671 152343 -175569 -178048 -29196 -312456
19537 -312456 87894 -507447 -30399 153945 246480 54264 87287 -73723 -110008 -43639 116520
19525 -269325 -91622 -53017 -257480 -91579 -7402 -14272 -64627 75509 -208668 -122950 -256847
19514 -256847 421269 -104691 67448 -213820 43706 14729 -70344 50880 -284188 -155982
19504 -155982 55851 274127 24326 -14527 -204449 -104615 -166284 -106954 149326 -84003 -178696
19493 -178696 15199 -117040 -167258 -81276 31420 45593 -299575 230647 -211242 -1482 213817
19481 -81080 -130468 10960 -41299 -80515 -3983 69583 107102 209357 -67599 -14496 -287070
$$ packed form
19559B76982d062G4259a97947B12284A6354c24412D33880a30444e0398A05751
19548f0690K6621o1150b1345A50281L0388a99671A52343a75569k479b9196k83260
19537c12456H7894e07447c0399A53945R2535E4264L3023g3723l6285d3639A16520
19525b69325i1622L8605k04463i1579g402o870n0355G5509b08668Q5718j33897
19514b56847D21269a04691F7448b13820D3706A4729g0344E0880b84188J28206
19504a55982E5851K18276B4326a4527j89922R9834o1669N9330A49326h4003r4693
19493a78696A5199a17040n0218h1276C1420J4173b99575B30647b11242a482B13817
19481h1080m9388A0960d1299l9216c983F9583L7519J02255f7599a4496k72574
$$ plain form
19470 -287070 37269 93816 102707 -123578 -59267 -145766 -83965 -206982 -338027 -359885 -103142
19458 66332 -484866 -224040 80181 -323321 -438820 -14856 15292 -14698 224896 -82291 162839
19446 173577 59566 -39992 -461365 -138030 -17312 -259361 70516 -360111 59904 -68032 63802
19434 115422 513675 -259028 -100288 -14656 101249 -319315 174314 -36917 268192 -254586
19423 -297106 -229778 200425 -168462 122840 -239238 28869 -43824 175860 -124984 25305
19412 -152009 -136788 282988 -266517 -154805 -87400 -44227 65458 133273 102629 58305 -141062
19400 79179 -308569 -61471 -380889 -182899 99297 -230845 -39488 -148149 -7414 163225 -84202
19388 150304 232435 -128024 3475 -236014 -51262 93610 -98324 -183615 -188761 85361 -281469
$$ packed form
19470b87070C7269N6547Q891a23578e9267q6499O1801j23017j31045k1858a03142
19458F6332d84866b24040H0181c23321j15499a4856A5292a4698B24896h2291A62839
19446A73577E9566c9992m21373a38030a7312k42049G0516c60111E9904f8032F3802
19434A15422L98253b59028a00288a4656A01249c19315A74314c6917B68192b54586
19423b97106O7328B00425a68462A22840b39238B8869d3824A75860a24984B5305
19412a52009J5221B82988b66517J11712O7405M3173F5458O7815l0644m4324a41062
19400G9179c08569f1471l19418a82899I9297b30845c9488j08661g414A63225h4202
19388A50304Q2131a28024C475b36014e1262I3610i8324q5291n146H5361b81469
$$ plain form
19376 10490 101626 -84816 123938 3087 -433642 -29389 -199353 -244750 77889 7673 61727
19365 61727 180643 93481 -85046 -117062 -92421 -254122 154538 -127211 -246424 -131621
19355 -131621 4115 119379 485 293455 -7281 247375 76638 -62065 -418786 250733 114239
19343 77918 -117250 -70851 -171977 -20360 163630 130334 -141800 21440 -77598 -34630 -269032
19332 -269032 73675 -116146 -51380 -69491 179107 -124749 21929 340950 -131037 10993
19321 -79723 24751 -59409 -39226 -243163 245619 25852 -64425 -235397 -141890 -157744 -276326
19310 -276326 -33488 10473 46124 -114522 -238951 -258317 -339140 64688 -91835 -262002 88729
19298 261127 -94749 -176130 -293123 -246823 -26628 -87992 -33923 159623 -213021 -115191 -359244
$$ packed form
19376A0490R1136h4816A23938C087d33642b9389j69964m5397G7889G673N4054
19365F1727J18916q7162h5046l2016K4641j61701A54538a27211j19213J14803
19355a31621D115J15264D85K92970g281B47375G6638f2065l56721B50733A14239
19343G7918a17250M6399j01126b0360A63630l3296a41800B1440g7598c4630k34402
19332b69032G3675a16146e1380j8111A79107a24749B1929L19021a31037A0993
19321g9723B4751e9409K0183k03937B45619B5852f4425j70972R3507j5854j18582
19310b76326c3488A0473L5651a14522j24429j9366q0823F4688i1835j70167H8729
19298B61127i4749q1381j16993M6300b6628o1364c3923A59623b13021R7830k44053
$$ plain form
19287 -359244 -28423 -54812 -160497 -68656 152350 -68364 -116333 -40757 257399 20404 -50384
19275 -231447 207430 -183434 -36226 141420 139496 7587 -154706 -45907 154932 27756 -94243
19263 -219642 -22497 -9227 -76610 -34044 173793 59523 172934 -110432 132683 269620 -354897
19251 -113373 111134 202393 -22831 -79451 35706 -42693 -58754 253616 96976 -17114 -156924
19240 -156924 89414 -299029 -191230 234439 -24679 95934 -176845 47864 -82380 155720
19229 -85276 21442 80673 -92977 -73006 193959 -112237 -208645 -43758 108383 -315426 67403
19217 -187221 91689 -55300 290255 84504 -79949 -443808 -235804 153560 -56794 41105 424563
19206 424563 -180375 -23593 -154460 64945 -113703 7285 -154161 -458362 -44672 -111049 -23543
$$ packed form
19287c59244b8423k6389j05685f8656A52350f8364m7969d0757B57399B0404e0384
19275b31447B07430a83434c6226A41420j924G587a54706d5907A54932B7756i4243
19263b19642b2497i227o7383c4044A73793E9523J13411a10432A32683J36937c54897
19251a13373A11134R1259b2831n6620C5706d2693j6061B53616I6976a7114j39810
19240a56924H9414b99029J07799B34439b4679I5934a76845D7864h2380A55720
19229h5276B1442N9231i2977J9971A93959a12237r6408d3758A08383c15426F7403
19217a87221I1689e5300B90255H4504g9949l63859K08004A53560e6794D1105L83458
19206D24563a80375b3593j30867F4945a13703G285a54161l04201d4672o6377b3543
$$ plain form
19194 -162022 20670 119758 49720 122617 -42170 -4070 107458 -147156 -182752 -191034 55145
19182 -20261 -142352 -199075 -349507 28954 -104593 -24742 38303 -189723 -63510 29316 -219586
19170 -42418 139314 63022 -336311 163833 -97067 -171656 -124571 277285 -199228 491 -33268
19158 -450785 -139042 -201320 44881 -158836 -139398 -235853 -271359 20324 41810 108407 -364869
19146 -384120 -217486 609943 184871 -66728 -336536 -66443 186298 51963 -141779 179963
19135 -23351 202925 132078 33874 10018 -148319 138272 -17772 57016 -229308 62711 -45474
19123 -148665 2431 188458 -120660 47066 -77074 -245481 34154 155593 -253230 -124381
19112 135181 -47171 -96081 39119 250689 -14981 -311818 -220360 43962 7529 -132827 10281
$$ packed form
19194a62022B0670R9088D9720P2897d2170d070A07458a47156l5596q282E5145
19182b0261j22091n6723j50432B8954a04593b4742C8303a89723f3510B9316b19586
19170d2418A39314F3022c36311A63833i7067p4589M7085B77285a99228D91c3268
19158d50785a39042o2278D4881a58836J9438r6455l5506B0324K1486O6597c64869
19146c84120J66634F09943A84871f6728k69808f6443A86298E1963a41779A79963
19135b3351B02925p0847C3874A0018a48319A38272a7772E7016b29308F2711d5474
19123a48665B431J86027a20660D7066g7074j68407C4154J21439b53230a24381
19112A35181d7171m8910C9119K11570a4981k96837R1458D3962G529a32827A0281
$$ plain form
19100 -338279 -124582 43789 135267 -279603 200849 -104327 67692 -143135 22173 -442306
19089 10516 -33772 83796 -239613 -95359 37550 -136864 -108162 21505 -192346 -459984 329407
19077 12991 51491 109922 -82656 84680 -256374 -122563 -146724 -147763 138541 -14936 -165220
19066 -165220 -26130 -354732 -241305 106365 -50400 -82358 159679 -105639 -206078 -331892
19056 -331892 -200260 277610 -341204 -35862 -280885 -193962 59406 5718 -263505 -46015 138397
19044 105705 -333547 -5874 9879 188101 -270007 -76537 -63188 -68297 -9799 27504 -127377
19032 197147 -12721 -26358 249814 -227663 -181075 -17659 -38130 -195034 55352 101874 -41110
19020 186801 -168575 -120738 -104086 45272 289697 45339 -275168 42261 -26069 4328 -15784
$$ packed form
19100c38279a24582D3789R1478b79603B00849a04327F7692a43135B2173d42306
19089A0516c3772H3796b39613i5359C7550a36864K8702B1505a92346k67638C29407
19077A2991L8500N8431h2656H4680b56374a22563k4161j039A38541a4936j50284
19066a65220b6130l28602J13427A06365e0400l1958A59679a05639j00439j25814
19056c31892J31632B77610c41204c5862k45023Q6923E9406E718b63505d6015A38397
19044A05705c33547e874I879J78222b70007g6537J3349n109i799B7504a27377
19032A97147a2721j3637B49814b27663M6588a7659k0471j56904E5352M6522d1110
19020A86801a68575M7837J6652D5272K44425D5339b75168D2261b6069D328a5784
$$ plain form
19008 -309469 -91037 -57432 21691 57886 -85527 -36108 166335 -44343 -27253 -179358 -212377
18997 -212377 -1095 -110379 -443857 253866 -88049 -95020 -112420 -450165 -67480 9242 -437803
18985 -202596 -36166 242185 -230060 -108039 -2648 -17158 -275084 170397 -189438 -5059 141876
18973 -369988 -421080 152264 -113500 51870 262615 -119531 -139576 -45770 -70712 210356
18962 55933 -248984 120487 -2266 -159400 275547 190289 -47817 -22243 -155871 -122725 -222854
18951 -222854 -33774 -202589 -118834 -194171 20719 -303292 -105798 -109866 -133019 -2594 21198
18939 45320 -65011 -393767 -169940 -7515 69781 -87680 -101558 133563 -2476 120631 150152
18928 150152 -53754 197072 40520 134003 -285694 -100014 -83215 -154641 -359 -224563 -127887
$$ packed form
19008c09469i1037L3605B1691L6195h5527c6108A66335d4343J7090j52105l3019
18997b12377a095j09284l33478B53866h8049o971j7400l37745f7480I242d37803
18985b02596c6166B42185b30060a08039b648j4510k57926A70397a89438e059A41876
18973c69988n1092A52264a13500E1870K10745a19531k0045d5770k4942B10356
18962E5933b48984A20487b266j57134B75547q5258d7817b2243j33628L3146j00129
18951b22854c3774j68815Q3755p5337B0719c03292a05798m068k3153b594B1198
18939D5320f5011l28756a69940g515F9781h7680j3878A33563b476A20631K9521
18928A50152e3754A97072D0520R3483b85694a00014J6799p1426c59k24204R6676
$$ plain form
18917 -127887 -159035 -168802 9169 -164579 32434 68098 41008 -314143 -35889 129616 -212159
18905 -48640 -446026 280586 51782 -212858 32019 -162167 13571 -112077 135439 44580
18894 -3425 -245705 -132460 125509 111757 -85629 87696 -548 -229549 -86639 -502017 -248130
18882 199465 -90769 -88990 105319 54039 3498 -94109 -14078 -234884 228691 202199 22298
18870 63426 -67823 221567 -18303 -47306 241117 -273582 -21400 -154634 -331712 -162941
18859 -29043 -188730 318859 -169428 -6298 -205658 -180541 61646 -375349 -106850 139155
18848 -16212 17286 62900 -167756 -23122 -344486 126451 -265825 -12937 -263691 100836
18837 125710 60376 -179669 -109259 -230456 -55825 -237996 -303690 -314018 -321825 -7847 -41959
$$ packed form
18917a27887l1148r767I169a64579C2434L5664k7090c14143c5889A29616b12159
18905d8640l97386B80586E1782b12858C2019a62167A3571a12077A35439D4580
18894c425k42280J13245A25509j3752h5629H7696e48k29001h6639m15378b48130
18882A99465i0769J779A05319n1280C498i4109a4078k20806B28691k6492B2298
18870F3426f7823B21567a8303k9003B41117b73582b1400j33234j77078a62941
18859b9043j59687C18859a69428f298j99360K5117F1646c75349a06850A39155
18848a6212A7286M5614a67756b3122l21364A26451b65825a2937k50754A00836
18837A25710F0376a79669P0410j21197e5825j82171o5694j0328p807g847l4112
$$ plain form
18826 -41959 54815 -19632 196916 104008 -169528 -86668 152871 391875 -50459 173478 -99481
18814 -254890 90626 28446 -163656 139547 -236540 -21183 5611 -78946 -8301 -304921 -101504
18802 -120045 -232883 -260596 -100777 -172531 50868 115231 48653 -23133 -190225 10771 -219784
18790 -596077 -254148 171064 161420 330007 81382 -43168 -184114 55801 188457 -110957
18779 -425739 -377913 41555 -338599 159181 -35755 -84508 339091 -204415 -375970 -90196
18768 -31218 -154 -52515 -179892 -49545 -112116 -275934 -80276 254461 -161401 160985 -13192
18756 -65301 76156 302094 -75218 -163101 -228234 -125744 -47528 -324017 -124835 -268548 -301751
18745 -301751 -158803 226882 180890 78765 32292 -166383 288071 -44410 -72962 -103187 -164300
$$ packed form
18826d1959E4815a9632A96916r2908a69528Q2860A52871K39004e0459A73478i9481
18814b54890I0626B8446a63656A39547b36540b1183E611g8946h301k96620a01504
18802a20045j12838k7713a00777p1754E0868O4363D8653b3133j67092A0771b19784
18790e96077b54148A71064r644J68587H1382d3168j40946E5801J32656a10957
18779d25739M7826D1555c38599A59181c5755m8753C39091b04415j71555i0196
18768c1218a54n2361j27377d9545o2571j63818h0276B54461a61401A60985a3192
18756f5301G6156K25938g5218q7883o5133J02490d7528k76489a24835j43713l3203
18745c01751J42948B26882m5992G8765C2292a66383B88071d4410k8552l0225o1113
$$ plain form
18734 -164300 -115475 -7731 41512 187058 -97884 -101975 -179485 -67355 -86220 -189230 -53784
18722 155880 -79698 -413117 -125869 79418 159028 -178906 225233 379201 -96515 4327 -106831
18710 -263226 -94670 -60807 -205942 28508 107174 -26133 191231 -119371 -25545 -309312 -93447
18698 -197892 -232383 75080 -53537 142387 256897 31580 303636 -333577 5417 -84420 -179124
18687 -179124 1550 -74647 188952 100 28558 121543 233248 -69022 -7054 -27558 -140108 -185706
18675 -185706 -36746 -2339 -202104 -20125 -215655 155077 -58658 -37161 -230693 17433 -68118
18663 -88500 133028 70515 42800 -58976 -38293 89155 84734 137260 -160061 72021 83419
18652 83419 173445 81917 -33900 162558 -336976 -156403 -29358 -1009 -196728 240396 188911
$$ packed form
18734a64300M8825g731D1512J45546i7884m091p7510f7355j8865j03010e3784
18722A55880g9698l33419a25869G9418P9610a78906B25233J53968i6515D327a06831
18710b63226i4670L3863j45135B8508P8666b6133A91231a19371b5545k83767i3447
18698a97892l4491G5080e3537A42387J14510C1580K72056c33577E417h4420r4704
18687a79124A550g4647A88952A00K8458R2985J11705f9022g054k0504j12550m5598
18675a85706c6746b339j99765b0125j95530A55077e8658K1497j93532A7433f8118
18663h8500A33028o2513k7715e8976K0683H9155m421N2526a60061G2021J1398
18652H3419R0026H1917c3900A62558c36976a56403b9358a009j95719B40396n1485
$$ plain form
18641 188911 -496308 -154734 -265988 88025 -164363 -92519 154895 74407 -302210 87429
18630 104018 90283 -186956 -139354 220818 -352193 90755 -405475 24564 -139886 -198020
18620 -198020 -185767 -281555 -474796 214989 186616 -204969 -92274 -66106 -346666 367503
18609 -117475 -100018 210869 -131673 -158465 -9794 -252254 39439 44377 112588 331824 121423
18597 -208985 -76152 -102381 -163106 -180746 208046 -215009 21545 -61208 -318089 9850 107825
18586 107825 -110566 160694 -51682 91094 -47787 -84156 -70093 260784 73770 76184 -181061
18574 -200505 24467 -117723 -70831 71536 -161532 169263 -166785 -293350 -189629 -316482
18564 -316482 -190589 -5004 -207748 -41881 358788 76971 -90659 -25368 36982 79912 38425
$$ packed form
18641A88911d96308a54734j11254H8025a64363P1844A54895G4407c02210H7429
18630A04018j3735a86956M7602B20818c52193I0755d05475B4564a39886n8134
18620a98020J2253r5788j93241B14989k8373b04969i2274K6168k80560C67503
18609a17475J7457B10869a31673k6792i794k42460C9439M938O8211K19236A21423
18597b08985g6152k6229o0725j7640B08046b15009B1545f1208k56881I850R7975
18586A07825a10566A60694e1682I1094d7787l6369J4063B60784G3770K414a81061
18574b00505B4467a17723M6892G1536a61532A69263a66785j26565J03721j26853
18564c16482J25893e004k02744d1881C58788G6971i0659b5368C6982M2930C8425
$$ plain form
18552 269633 -363213 131085 73250 -186974 -50797 360475 -14643 -54824 20027 -162295
18541 -287911 -219719 -188380 -154581 69534 124332 185999 -41994 149004 -164407 201676 -20819
18529 34109 25133 -367786 46133 -247476 9296 -107105 75526 -101714 217149 -128540 -255059
18518 -255059 -70248 -196694 16220 -52085 -215266 75381 -54145 82616 13364 -10985 402139
18506 46212 -190997 -33619 157756 75864 44429 27305 -124750 100845 129167 -131076 52063
18494 -572077 333630 116291 76907 -97484 -96802 49613 200084 275990 -242341 164269 178286
18483 178286 -82063 -132630 151533 -210715 -176910 86242 158604 -227744 -183707 -438779 192138
18471 185486 113358 -115665 -132975 79554 -201370 -122701 -243236 -551858 18267 89229 -52746
$$ packed form
18552B69633c63213A31085n7835a86974e0797C60475a4643m0181B0027a62295
18541b87911O8192L1339L3799F9534N4798O1667d1994A49004a64407B01676b0819
18529C4109q976c67786D6133b47476I296a07105G5526a01714B17149a28540j26519
18518b55059g0248j26446A6220e2085j63181G5381e4145H2616A3364a0985D02139
18506D6212a90997c3619A57756G5864l1435j7124a24750A00845K8322a31076E2063
18494e72077C33630A16291l9384i7484O82D9613J50471P5906b42341A64269J4017
18483A78286h2063n0567A51533b10715L3805H6242P2362b27744M4037k55072A92138
18471A85486p2128a15665j7310G9554b01370P8669j20535l08622A8267P0962e2746
$$ plain form
18459 -7665 -111637 -36595 -225952 57151 237333 -150349 -300041 -89517 109986 26257 8756
18447 -128967 -30761 378739 274979 -37713 -79899 -46084 108735 -386500 -162691 -112337
18437 -112337 -303328 -268598 -3174 93679 -63931 -42752 -470542 -381964 427645 39075 797
18425 159763 -55841 242558 -237151 4469 -272225 -194290 -240147 -59738 -106330 -172537 -213255
18414 -213255 123131 -16043 -257468 -212798 -347515 -370005 -21309 -142380 296164 -51361
18403 285532 -7889 211322 -274266 146548 -156985 -264522 184780 -125262 -112587 143417
18392 -211085 233144 -155266 39755 215993 -183512 100289 -158715 146665 -153697 -288545
18382 -288545 -110452 -211678 -279061 -203348 -212458 -89251 -105031 15852 -316578 -313254 -228593
$$ packed form
18459g665j03972c6595j89357E7151J80182a50349j49692h9517A09986B6257H756
18447a28967c0761C78739j03760c7713m2186L3815A08735c86500a62691N0354
18437a12337j90991L4730c174I3679f3931K1179m27790Q8578D27645C9075G97
18425A59763e5841B42558b37151D469b72225P7935m5857e9738m6592o6207m0718
18414b13255A23131a6043k41425M4670j34717k2490b1309j21071B96164e1361
18403B85532g889B11322b74266A46548a56985j07537A84780a25262J2675A43417
18392b11085B33144a55266C9755J76238a83512A00289a58715A46665a53697j34848
18382b88545a10452j01226o7383P5713r110h9251j5780A5852c16578L324Q4661
$$ plain form
18371 -228593 -90700 -138376 -18889 -41610 -136658 -48571 -150137 299185 -319753 -298504 200462
18359 -64155 -337837 58192 -5903 87968 -107861 -38402 11587 -327901 32657 -114733 110726
18347 98046 -295807 -120963 -205561 161846 -87961 86579 -103812 9116 -95994 -227299 -38565
18335 80655 43975 244255 -44755 49439 -314413 133060 -235856 -51366 -40918 -218733 103448
18323 -167870 -123888 -6531 -109251 -79843 116548 87461 -469542 139234 -252127 251275
18312 195389 -138145 53292 -76545 -10091 355365 -144664 -69898 -285643 -2230 -106659 49293
18300 38749 -269931 -196708 45448 38602 104578 -57391 -39771 55383 -202018 -144561 121242
18288 -57053 -347257 -73266 50214 189094 -203982 -160734 -277657 8611 9699 -53443 -260258
$$ packed form
18371b28593i0700m7676a8889k2721r5048d8571j01566B99185c19753K1249B00462
18359f4155k73682E8192e903H7968a07861c8402A1587c27901C2657a14733A10726
18347I8046b95807a20963q4598A61846h7961H6579a03812I116i5994j31305c8565
18335H0655l6680K00280d4755D9439c14413A33060b35856e1366J0448j77815A03448
18323a67870M3982f531j02720K9408A16548k9087d69542A39234b52127B51275
18312A95389a38145E3292g6545a0091C55365a44664f9898k15745b230j04429D9293
18300C8749b69931P3223D5448o846O5976e7391J7620E5383b02018N7457A21242
18288e7053k90204g3266E0214J38880b03982M3248j16923H611J088e3443k06815
$$ plain form
18277 -260258 -239786 85827 -114664 23982 -205439 -76157 -236081 106374 -276673 338191
18266 86339 -27169 330662 -143447 72792 184257 -144960 -44490 58632 -39331 -74161 151226
18254 -53764 -312609 -38968 74726 -151826 146734 64817 -94995 115804 -46158 -78057 -54083
18243 -54083 205848 105834 -6350 189358 61404 31421 -213178 97588 -76247 164009 62089
18231 -305271 -224818 -224125 -96487 44680 -307676 205100 35222 -4390 -283657 276556 -89598
18219 -104639 129958 56074 -44785 -135272 93186 -149045 56785 -120939 -65137 -258479 -321917
18208 -321917 15716 4306 137095 101285 -285623 -179392 53909 17960 -72131 -252961 -48127
18196 -46897 294092 -42623 -295171 47236 -12696 396437 -32641 145187 -65418 -63013 -179195
$$ packed form
18277b60258K0472H5827a14664B3982b05439g6157j59924A06374b76673C38191
18266H6339b7169C30662a43447G2792J11465a44960d4490E8632c9331l4830A51226
18254e3764k58845c8968G4726a51826A46734F4817i4995A15804d6158l1899K3974
18243e4083B05848j00014f350A89358F1404k9983b13178I7588g6247A64009F2089
18231c05271Q0453O93i6487D4680c07676B05100C5222d390k79267B76556h9598
18219a04639A29958E6074d4785r0487I3186a49045E6785a20939N5802j93342o3438
18208c21917A5716D306J32789l5810b85623J06231E3909A7960g2131j80830d8127
18196d6897B94092d2623k52548D7236a2696C96437c2641A45187f5418K405j16182
$$ plain form
18185 -179195 -75776 -169486 -71333 -205844 -64405 -170832 -59343 116968 25178 -324315 171559
18173 -108034 -144339 -117466 -139696 -173450 -83357 -47895 -215439 -271774 -143535 -197433 -108208
18162 -108208 61133 69614 9478 107013 112005 276029 260431 191166 -157448 -186304 -229778 -215194
18150 -215194 94471 23207 -212864 -255780 -179180 78615 100298 -273379 118894 68801 -31517
18138 380770 180879 -64504 -272494 287232 158028 34695 2249 15037 -62172 -102169 -318571
18127 -318571 42465 -66851 29201 -7544 8307 -83956 -35378 40605 -38274 -263111 -135303
18116 -135303 74046 -279451 -16019 -86469 -48022 324790 22194 176435 -154095 -85317 -76141
18105 -76141 53658 -89944 -186826 -30200 -1194 332698 -75863 -253183 -236945 149712 89713
$$ packed form
18185a79195g5776r3710g1333j34511f4405j06427e9343A16968B5178c24315A71559
18173a08034l6305K6873k2230l3754h3357L5462j67544n6335J28239n3898Q9225
18162a08208F1133Q481I478R7535M992J64024j5598o9265a57448k8856m3474J4584
18150b15194I4471B3207b12864m2916P6600G8615K1683b73379A18894n0093c1517
18138C80770A80879f4504k07990B87232j29204C4695B249J2788f2172l9997k16402
18127c18571D2465f6851B9201g544H307h3956c5378D0605c8274k24837J27808
18116a35303G4046b79451a6019p0450L8447C24790B2194J54241a54095O8778R176
18105g6141E3658h9944r6882c0200a194C32698g5863j77320J6238A49712n9999
$$ plain form
18094 89713 118324 220216 -28270 -11523 -72520 -60524 117599 -58271 -387807 11213 -277397
18082 -25009 -180789 -142649 -33709 -173233 -47314 -251808 217570 -182347 -94817 31506 30246
18071 30246 16358 -70812 223500 -289198 -306541 -22561 -183952 19631 284071 37270 -239730
18059 -246786 -302036 30322 -312499 7622 -213115 -59403 -142861 168029 -159977 -196883 -46546
18047 -46891 353489 109969 142281 -454173 62447 -310177 -186720 38425 -25566 117849
18036 -76558 -87821 136816 84578 209730 -255401 31095 -98542 -174626 40832 59287 -159898
18024 -223223 5553 24950 -8946 -309381 -26852 140873 -95564 -15786 -39866 -312428 185502
18012 161681 -227088 63712 25660 -48505 3023 164316 -186915 -88994 -20331 -250065 158284
$$ packed form
18094H9713K8611J01892b8270a1523o0997J1996A17599e8271l29536A1213b77397
18082b5009j55780L8140c3709j39524d7314k04494B17570a82347Q7530C1506j260
18071C0246j3888g0812B23500b89198j7343b2561j61391A9631K64440C7270b39730
18059b46786n5250C0322c12499G622b13115e9403q3458A68029a59977l6906d6546
18047d6891C53489A09969L2312d54173F2447c10177J23457C8425b5566A17849
18036g6558j1263A36816n2238J25152b55401C1095i8542p6084D0832J8455a59898
18024b23223E553J9397h946l00435b6852A40873i5564a5786k4080k72562A85502
18012A61681b27088F3712B5660d8505C023J61293a86915h8994b0331k29734A58284
$$ plain form
18000 -1122 151057 17722 228688 36455 340128 -257564 -34283 -89311 105082 233229 -36274
17988 -460569 -155807 134015 -78119 -161678 112642 117447 264166 -11315 147214 -144099
17977 121027 -16339 47752 229440 -171854 -105481 -486571 131124 -213733 91358 142916
17967 142916 -126497 -45274 62460 155059 748 237090 72531 -72065 -28288 -306178 -100930
17955 -31217 355468 -15873 -231808 -48550 -70637 294567 13843 -210 -59200 -172576 -25110
17943 -179982 63251 -218486 -71203 -201517 -69994 61642 -71281 20810 64061 -281633 279238
17931 -244111 175439 56117 55017 -252532 -195062 102221 -107787 -302389 -184415 327221
17920 -539783 -225658 -98403 -66855 84043 -114776 -11979 -355895 -259241 141591 -313019
$$ packed form
18000a122A51057A7722K10966C6455L03673b57564c4283n5028A05082J28147c6274
17988d60569a55807A34015g8119q3559A12642M805J46719a1315A47214a44099
17977A21027a6339D7752J81688a71854O6373l81090A31124b13733I1358N1558
17967A42916a26497d5274F2460R2599G48K36342G2531g2065b8288k77890a00930
17955c1217C55468a5873k15935d8550k2087B94567A3843b10n8990j13376b5110
17943a79982F3251b18486g1203j30314f9994F1642g1281B0810M3251b81633B79238
17931b44111A75439E6117j100b52532N7470A02221a07787j94602J17974C27221
17920e39783b25658i8403L1548H4043a14776a1979l43916R6654A41591c13019
$$ plain form
17909 -12667 215306 64323 -155055 29249 -132180 139588 106749 126491 80363 150756 -278803
17897 -11628 41839 151288 -132109 -356230 -219166 -96534 -37680 97180 64795 -164978 46145
17885 79843 30608 63619 176500 -148670 27773 11996 89590 -239396 -134200 -310637 92436
17873 -129143 -185631 127079 -50059 76075 -99127 32560 86296 130305 -115148 -111655 57812
17861 262256 169282 -61751 -169224 -150704 132863 171274 129945 237947 -107051 283568
17850 -167943 956 201628 -140450 160708 137644 256364 -197920 -88884 -101424 82228 159857
17839 159857 -84734 -47684 163500 19069 127264 -36375 177737 -55784 71430 46905 -8882
17827 108273 -89382 -363170 -55984 259162 -28224 199961 63214 -137724 -82892 45765 -319371
$$ packed form
17909a2667B15306F4323a55055B9249a32180A39588l2839J9742m6128P0393b78803
17897a1628D1839J09449a32109k24121J37064i6534c7680I7180l2385a64978D6145
17885G9843C0608L3011J12881a48670B7773A1996P7594b39396J05196j76437I2436
17873a29143n6488A27079e0059G6075i9127C2560N3736M4009a15148L493E7812
17861B62256r2974f1751j07473J8520A32863L8411m1329J08002a07051B83568
17850a67943I56K00672a40450A60708k3064J18720a97920h8884j2540H2228P7629
17839A59857h4734L7050A63500A9069J08195c6375A77737e5784G1430k4525h882
17827A08273h9382k73788e5984B59162b8224A99961F3214a37724N4832D5765c19371
$$ plain form
17815 -101644 -57283 -17297 -86036 11822 -28800 109120 128679 -23628 -64273 204375 -7450
17803 -124582 278902 -297421 -201432 332641 -34742 -47254 -402042 -139604 271846 -280524
17792 -451459 223448 -119788 190712 85509 162622 -30397 25551 -10335 -67922 261510 -81878
17780 -226115 -101366 163560 -49776 -53027 214586 -44948 -41946 53935 49853 -43273 129703
17768 -71714 18724 -7458 -197994 -97441 5942 -70991 -127380 -141412 68657 270813 392465
17757 392465 525287 -256332 216050 -372591 -219742 -18504 -109161 -179715 2272 -42943 -243936
17746 -243936 270961 -167121 269638 141740 -67995 -240906 -173965 130161 -120317 47697
17735 123805 -48837 -280228 175394 158048 -87084 93368 -38816 -55442 59757 -120121 -184501
$$ packed form
17815a01644M4361a7297o8739A1822b8800A09120J9559b3628m0645B04375g450
17803a24582B78902b97421R5989C32641c4742j2512l54788a39604B71846b80524
17792d51459B23448a19788A90712H5509P7113c0397B5551a0335n7587B61510h1878
17780b26115a01366A63560d9776l251B14586d4948L002E3935m082d3273A29703
17768g1714A8724g458j90536i7441E942g0991n6389j4032F8657K02156J21652
17757C92465J32822b56332B16050c72591J52849a8504r0657p0554B272d2943k00993
17746b43936B70961a67121B69638j27898f7995j72911O6941A30161a20317D7697
17735A23805d8837k31391A75394j7346h7084I3368c8816j6626E9757a20121o4380
$$ plain form
17724 -184501 154372 156323 18322 -212389 233049 -65231 -116761 -13047 -261912 -182351 110023
17712 -283377 -188708 227254 -38194 -20812 115030 96358 -140621 -76784 8557 91594 253952
17701 253952 432171 165125 200678 -109043 -53076 299685 -168001 60560 83750 -69162
17690 40076 -263651 8829 -78319 41883 -4201 86873 -175896 -128902 -82007 -379646 -38566
17678 12270 -17176 142254 -59183 215462 96463 -1240 -155436 -30765 -233898 342901 -282920
17666 29542 58006 -22393 -105873 254307 -22383 386152 59589 286153 327508 177028 104809
17655 104809 -350230 -172339 220600 7994 458301 -11253 406965 43288 163012 418520
17645 418520 99795 259578 183976 118135 17924 300118 -67302 4259 -255780 -53400 30094
$$ packed form
17724a84501A54372J951A8322b12389B33049f5231n1530a3047k48865P9561A10023
17712b83377R4669B27254c8194J7382A15030j8672a40621O3837H557Q3037J62358
17701B53952J78219A65125L5553a09043e3076B99685a68001F0560K3190f9162
17690D0076b63651H829g8319D1883d201H6873a75896M6994M6895k97639c8566
17678A2270a7176A42254e9183B15462I6463a240j54196c0765k03133C42901b82920
17666B9542K8464b2393q3480B54307b2383C86152E9589K26564M1355j50480p2219
17655A04809c50230a72339B20600G994M50307a1253D06965D3288J19724K55508
17645D18520I9795J59783p5602o5841A7924K82194f7302D259b55780e3400C0094
$$ plain form
17633 183088 221110 43185 190435 105042 107783 128863 -6691 -26418 -217123 339044 186549
17622 186549 -13173 318352 22568 -150829 -138433 -76142 46951 -50106 38552 426260 -230152
17610 -254442 119037 10401 -127837 281143 106360 10013 -57599 -16521 -17031 162523 708
17598 261416 -12347 -164090 -149714 -87089 31849 394423 56505 261180 365264 -164106
17587 387632 96626 215079 47710 -279865 200475 36832 547496 -52821 284734 -72660
17576 177966 -7175 120703 -25702 -60723 59126 -142968 -118265 213678 -229139 44908 34517
17565 34517 -53986 -96263 281624 55314 56164 -142119 224134 -100867 157128 343747 -192135
17553 127957 162447 -32878 181698 -47077 -37983 37371 -286603 124448 147680 -186519 259903
$$ packed form
17633A83088L8022D3185J47250q5393K741K1080f691j9727j90705C39044j52495
17622A86549a3173C18352B2568a50829J2396O2291D6951e0106C8552L87708b30152
17610b54442A19037A0401a27837B81143A06360A0013e7599a6521n10A62523G08
17598B61416a2347j51743J4376O2625C1849L62574E6505K04675J04084a64106
17587C87632I6626J18453D7710b79865B00475C6832N10664e2821B84734g2660
17576A77966g175A20703b5702l5021E9126a42968K4703B13678b29139D4908j0391
17565C4517e3986m2277B81624E5314Q50a42119B24134a00867A57128J86619a92135
17553A27957L4490c2878A81698d7077R094C7371b86603A24448K3232a86519B59903
$$ plain form
17541 249070 367853 138704 -140707 -270951 179858 -203644 -187322 -188335 -25605 154897
17530 -88659 117379 -81621 -68182 -134962 290266 47049 -38940 -116269 -24734 116262 -289095
17518 -108193 -152834 -337723 -85519 180475 -142427 -68790 -9434 -265097 -338215 -18450 273371
17506 321603 31933 337323 -227511 246094 61293 125806 -149704 287949 -294114 152116
17495 83632 -57120 106630 81287 248548 -264486 -111273 -68689 253177 232915 -307846
17484 -39905 205094 256556 -11222 326878 166163 193489 298044 438954 130846 151523
17474 151523 319968 -68608 -127847 170523 -168083 -70063 177127 -38526 57824 -168732
17463 289263 436092 222319 170961 -398 -127096 115832 315217 29999 4525 -177548 221289
$$ packed form
17541B49070J18783A38704a40707j30244A79858b03644J6322j013b5605A54897
17530h8659A17379h1621J3439o6780B90266D7049c8940p7329b4734A16262b89095
17518a08193m4641j84889h5519A80475a42427f8790i434k55663p3118a8450B73371
17506C21603C1933L05390b27511B46094F1293O4513a49704B87949b94114A52116
17495H3632e7120A06630k5343J67261b64486a11273M2584B53177k0262c07846
17484c9905B05094N1462a1222C26878j60715K7326J04555J40910A30846K0677
17474A51523J68445f8608n9239A70523a68083g0063A77127c8526E7824a68732
17463B89263J46829k13773n1358c98j26698A15832J99385B9999D525a77548B21289
$$ plain form
17451 419753 121575 89962 -89441 260174 246875 100956 -203972 188396 417619 71498
17440 94703 382404 282341 198670 37022 324196 230662 210281 116971 40780 245306 195307
17429 195307 374382 73611 361389 66968 351812 363674 240242 190896 49325 219027
17419 219027 524317 45210 330170 -190690 253291 357055 115149 401019 -9814 225705
17408 406074 319969 165801 489365 170441 409688 229032 -19079 395973 165295 157424
17398 157424 373466 -3329 -22731 280946 122432 -71804 204074 142694 115536 -45888 172399
17386 14779 319166 120462 -200785 76627 61961 362627 -2895 189751 244465 164530 27025
17374 337606 203612 -37575 303738 23968 47494 10174 161556 199543 -24749 212851 110802
$$ packed form
17451D19753A21575l1613h9441B60174j3299A00956b03972A88396K29223G1498
17440I4703K87701j00063q3671C7022K87174r3534k0381r3310D0780K04526m9999
17429A95307J79075G3611K87778F6968K84844J1862j23432m9346D9325J69702
17419B19027L05290D5210K84960a90690B53291J03764A15149K85870i814B25705
17408D06074q6105j54168L23564A70441K39247j80656a9079C95973A65295p871
17398A57424K16042c329j9402B80946A22432g1804B04074o1380k7158d5888A72399
17386A4779L04387A20462b00785G6627j4666L00666b895A89751N4714p9935B7025
17374C37606j33994c7575C03738B3968K3526A0174J51382L7987b4749B12851j02049
$$ plain form
17363 110802 229875 191229 77208 67613 -168262 80924 182059 -134144 34783 283456 114248
17351 221587 -174035 61091 338188 -91646 273222 -71770 -21558 241092 -143547 10256
17340 200781 93203 88018 300972 437991 318050 125850 285376 106273 313971 270361
17330 270361 -174781 59898 141973 -23224 39592 164525 379185 -46197 73134 -112398 141109
17318 343371 222382 -56292 197418 -172925 -115875 173981 178013 224813 256354 58145 354662
17307 354662 118329 174456 -177167 -18172 368369 60702 137016 13400 198719 -155043
17296 -83660 441228 272979 139074 260869 15136 343647 88685 243008 222882 150859
17286 150859 -25706 350923 302025 238938 357353 162865 189157 335054 34183 236785
$$ packed form
17363A10802J19073l8646G7208r595a68262H0924J01135a34144C4783K48673A14248
17351B21587a74035F1091K77097i1646B73222g1770b1558B41092a43547A0256
17340B00781I3203n185K12954J37019j19941A25850J59526A06273K07698m3610
17330B70361a74781E9898Q2075b3224C9592J24933K14660d6197G3134a12398A41109
17318C43371j20989e6292A97418a72925N7050A73981M032M6800L1541E8145K96517
17307C54662A18329N6127a77167a8172C68369F0702P6314A3400J85319a55043
17296h3660D41228j68249j33905J21795A5136L28511H8685J54323k0126p2023
17286A50859b5706C50923m8898o3087J18415A62865K6292J45897C4183K02602
$$ plain form
17276 236785 37629 247660 116151 -177074 55092 156996 185249 9651 502176 96709 -151980
17264 460343 160378 569170 46379 141511 -99156 54290 277287 451769 -96755 211745
17253 123642 326581 -55310 111194 -9703 357827 170176 641684 236731 8868 66011 -107117
17241 168842 138054 178717 306041 141884 -166254 49489 103157 -43737 289769 -196428
17230 12188 234661 -84734 134712 203044 126208 323926 185739 149892 114213 142830 299779
17219 299779 142368 82929 186397 31834 215614 225309 -60387 87553 287061 76233 181534
17208 181534 315469 240423 142530 364999 410524 190170 429804 7347 -141549 118659
17197 82901 219678 210853 149226 84816 74850 176458 80211 348809 137918 352584 205684
$$ packed form
17276B36785C7629K10031A16151a77074E5092J01904K8253I651M92525I6709a51980
17264D60343A60378M08792D6379R5132i9156E4290K22997J74482i6755B11745
17253A23642K02939e5310A11194i703C57827A70176M71508B36731H868N7143a07117
17241A68842l0788M0663J27324A41884a66254D9489N3668d3737B89769a96428
17230A2188K22473h4734A34712O8332p6836J97718j38187l5847l5679K8617J56949
17219B99779A42368n9439J03468C1834J83780R695f0387H7553J99508G6233J05301
17208A81534J33935p5046r7893K22469M5525A90170K39634G347a41549A18659
17197H2901J36777q825o1627o4410r966J01608H0211K68598A37918K14666j46900
$$ plain form
17186 205684 -337257 142938 290627 237919 126093 72679 -16002 188482 214636 27229
17175 51453 374195 248485 95589 104579 21797 -3644 76964 320996 528033 251298 424184
17164 424184 167869 -125 351372 247327 448965 230441 -29118 370675 206456 208411 301259
17153 301259 247611 432433 576077 212777 261388 352086 302596 -102646 224762 302574
17143 302574 301573 -43622 418415 123325 -85356 264038 271027 618551 2864 264242 304232
17132 304232 46831 204809 400967 339507 432649 323754 -117470 443680 110936 315043
17122 315043 432766 265728 260008 147903 204566 171480 300964 242850 93980 346174 270438
17111 270438 117440 360705 320264 193624 221846 524679 604687 265581 278734 277311 336487
$$ packed form
17186B05684c37257A42938J47689n2708j11826n3414a6002A88482K6154B7229
17175E1453L22742j25710I5589Q990B1797c644G6964K44032K07037B51298J72886
17164D24184A67869a25C51372j04045K01638k18524b9118C70675j64219J955R2848
17153C01259n3648J84822J43644B12777M8611R0698m9490a02646B24762P7812
17143C02574j001d3622D18415A23325h5356B64038O989L47524B864K61378L9990
17132C04232D6831J57978J96158o1460R3142j08895a17470D43680A10936K04107
17122C15043J17723j67038n720j12105N6663l3086J29484n8114I3980K52194p5736
17111B70438A17440K43265m0441j26640K8222L02833Q0008B65581J3153j423N9176
$$ plain form
17100 336487 442402 -1485 398352 648643 410728 464516 226543 -74090 258283 391655
17090 391655 97911 296873 499044 43609 624675 332202 538146 328190 503306 166916
17079 155017 170125 266685 286650 491949 104519 358026 371134 231536 496395 447622
17069 447622 227485 147153 419107 384092 470075 305831 279475 326410 363111 486598 551118
17058 551118 355148 264085 421674 282782 291238 290465 459481 570215 425612 390080 631895
17047 631895 248539 496200 654941 568881 659576 508032 644374 413467 301872 665755
17037 665755 518535 672625 457167 296981 501063 488792 647322 370023 571153 306975
17027 306975 375441 482570 514867 406320 395993 561734 425419 477193 508783 552742 720311
$$ packed form
17100C36487J05915a485C98352K50291k37915N3788B26543g4090B58283J33372
17090C91655I7911J98962K02171D3609N81066k92473K05944k09956J75116A66916
17079A55017J5108R6560J9965K05299A04519K53507J3108j39598K64859m8773
17069D47622k20137q0332K71954l5015Q5983j64244k6356M6935L6701J23487O4520
17058E51118j95970r1063J57589j38892Q456p73J69016J10734j44603l5532K41815
17047F31895B48539K47661J58741q6060R0695j51544J36342k30907j11595L63883
17037F65755j47220J54090k15458j60186K04082j2271J58530k77299K01130k64178
17027C06975O8466J07129L2297j08547j0327J65741j36315N1774L1590M3959J67569
$$ plain form
17016 720311 504604 673620 431930 538006 601347 672755 617330 430046 561201 434729
17006 434729 928816 560872 542897 290971 594823 527353 705752 738574 975851 555468
16996 555468 625336 190620 767111 359011 688745 662486 881703 648410 579689 701799
16986 701799 606773 850907 622703 339275 541281 286843 478501 668735 1017873 841482
16976 841482 584964 923724 785525 709542 604030 612166 495500 972357 962925 580160
16966 580160 279797 620880 570123 675278 656534 855019 657218 708434 727636 701871
16956 701871 960867 862167 923777 819402 694062 889825 796015 737298 859405 690857
16946 690857 961948 1134976 1074779 837553 558785 703082 945385 1052340 1197423 659229
$$ packed form
17016G20311k15707J69016k41690J06076O3341P1408n5425j87284J31155j26472
17006D34729M94087l67944j7975k51926L03852o7470J78399L2822K37277m20383
16996E55468O9868A90620N76491C59011L29734k6259K19217k33293o8721J22110
16986G01799r5026K44134k28204k83428K02006k54438J91658J90234L49138j76391
16976H41482k56518L38760j38199p5983j05512Q136j16666M76857r432l82765
16966E80160B79797L41083n0757J05155j8744J98485j97801N1216J9202k5765
16956G01871K58996r8700O1610j04375j25340J95763r3810n8717J22107j68548
16946F90857K71091J73028o0197k37226k78768J44297K42303J06955J45083n38194
$$ plain form
16936 659229 855760 924253 1077985 551387 1119096 931601 1034584 779435 1071702 905915
16926 905915 1181173 1115258 933716 1244218 1188839 1171901 959200 1236507 1377681 1236414
16916 1236414 1147038 1057565 767165 1201349 942767 912611 1247348 899082 1193945 1439979
16906 1439979 1356513 1427911 1076197 1329199 1360592 1301327 1171896 1662548 1658715 1504582
16896 1504582 1288594 1357015 1476014 1384333 1414943 1358389 1822601 1452594 1797538 1474626
16886 1474626 1273083 1670477 1802936 1851409 1594490 1795890 1697875 1822151 2090811 1629131
16876 1629131 1796339 1938514 1806840 1764974 2113988 2132465 1731910 1746159 2146584 1907805
16866 1907805 2155599 2077795 2044619 2111513 2436098 2084646 1859520 2086648 2047255 2445872
$$ packed form
16936F59229J96531O8493J53732n26598N67709j87495J02983k55149K92267j65787
16926I05915K75258o5915j81542L10502n5379j6938k12701K77307J41174j41267
16916A236414q9376q9473k90400M34184k58582l0156L34737l48266K94863K46034
16906A439979q3466P1398l51714K53002L1393n9265j29431M90652l833j54133
16896A504582k15988O8421J18999r1681L0610n6554M64212l70007L44944l22912
16886A474626k01543L97394J32459M8473k56919K01400r8015J24276K68660m61680
16876A629131J67208J42175j31674m1866L49014J8477m00555J4249M00425k38779
16866A907805K47794p7804l3176O6894L24585l51452k25126K27128l9393L98617
$$ plain form
16856 2445872 2683134 2437041 2321131 2493916 2341013 2593517 2661751 2611908 2490129 2483292
16846 2483292 2708992 2598219 2547448 2999682 3002854 3141890 2878350 2702436 2697156 3109252
16836 3109252 3390273 3305123 3492525 3169359 3131273 3453124 3354959 3572076 3438472 3894463
16826 3894463 3773532 3603317 4040546 3791670 3809879 3973817 4205259 3963454 3876000 4290041
16816 4290041 4366416 4272091 4394955 4259044 4690726 4971069 4808084 5131820 5407547 5140961
16806 5140961 5036751 5233869 5526053 5504963 5348164 6036127 5865232 6421851 6299566 6625203
16796 6625203 6822658 6584019 6900164 6960379 7217223 7143760 7331498 7779067 7707787 8212994
16786 8212994 8616833 8414079 9007528 8675047 8909702 9532397 9572749 9817869 9862208 10341698
$$ packed form
16856B445872K37262k46093j15910J72785j52903K52504O8234m9843j21779o837
16846B483292K25700j10773n0771M52234L172J39036k63540j75914n280M12096
16836C109252K81021q5150J87402l23166l8086L21851r8165K17117j33604M55991
16826C894463j20931j70215M37229k48876J8209J63938K31442k41805q7454M14041
16816D290041P6375r4325J22864j35911M31682K80343j62985L23736K75727k66586
16806E140961j04210J97118K92184k1090j56799O87963j70895N56619j22285L25637
16796F625203J97455k38639L16145O0215K56844p3463J87738M47569p1280N05207
16786H212994M03839k02754N93449l32481K34655O22695M0352K45120M4339M79490
$$ plain form
16776 10341698 11063972 11084597 11454369 11528864 11943743 12338426 12607994 13321655 13549897 14006151
16766 14006151 14567858 14659775 15112337 15833855 16556626 17071587 17626819 18076444 18752547
16757 18752547 19306008 20358003 20733167 21882549 22708995 23740051 24184163 25515889 26307276
16748 26307276 27913981 29081798 30145163 31636721 33450526 34532555 36250468 37643764
16740 37643764 40016227 41799515 43610725 45942615 48594156 51119202 53905829 56880693
16732 56880693 59888169 63153170 67047575 70495808 74724028 79141104 83788217 88740557
16724 88740557 94029345 99133837 104967148 110894183 116983292 123225390 129189215 135828534
16716 135828534 142114466 148520708 154417081 159896079 164967463 169512975 173094675 176089063
$$ packed form
16776A0341698P22274K0625L69772P4495M14879L94683K69568P13661K28242M56254
16766A4006151N61707R1917M52562P21518P22771N14961N55232M49625O76103
16757A8752547N53461J051995L75164J149382Q26446J031056M44112J331726P91387
16748B6307276J606705J167817J063365J491558J813805J082029J717913J393296
16740C7643764K372463J783288J811210K331890K651541K525046K786627K974864
16732E6880693L007476L265001L894405L448233M228220M417076M647113M952340
16724H8740557N288788N104492N833311N927035O089109O242098N963825O639319
16716A35828534O285932O406242N896373N478998N071384M545512L581700K994388
$$ plain form
16708 176089063 177894350 178516235 178414596 176950860 175131023 171273722 167554799 162721357
16700 162721357 157578355 151578537 145686261 139357786 133014752 126446498 120078629 113780931
16692 113780931 107983077 102047627 96654670 91323973 86430205 81333836 76773356 72722414
16684 72722414 68694460 65144354 61261016 58007838 54835233 52395700 49463994 46666249
16676 46666249 44533577 42337603 40197782 38211988 36843376 34844452 33211897 31674379
16668 31674379 30390892 29091031 27894165 26660292 25843515 24380291 23357888 22838539
16660 22838539 21756974 20809664 20130249 19252534 18792723 17981054 17192869 17150965 16365060
16651 16365060 16084304 15004130 14877496 14494863 13948626 13384080 13267546 12680052 12258509
$$ packed form
16708A76089063J805287O21885j01639j463736j819837l857301l718923m833442
16700A62721357n143002n999818n892276o328475o343034o568254o367869o297698
16692A13780931n797854n935450n392957n330697m893768n096369m560480m050942
16684G2722414m027954l550106l883338l253178l172605k439533k931706k797745
16676D6666249k132672k195974k139821j985794j368612j998924j632555j537518
16668C1674379j283487j299861j196866j233873q16777j463224j022403n19349
16660B2838539j081565r47310o79415q77715m59811q11669p88185m1904p85905
16651A6365060k80756j080174j26634l82633n46237n64546j16534n87494m21543
$$ plain form
16642 12258509 11899273 11354429 10887313 10938712 10169795 10406863 10048536 9518521 9618098 9164430
16632 9164430 9011339 8758811 8442082 8333420 8025500 8014002 7818816 7541928 7217134 7206140
16622 7206140 6996699 6921509 6631959 6853622 6061312 6097070 5857370 6202014 5770788 6169577
16612 6169577 5557303 5567344 5619586 5440325 5538237 4901719 4832611 4878459 4758051 4666207
16602 4666207 4532967 4365371 4447914 4132012 4390134 4298336 4094858 4291482 4056234 3863166
16592 3863166 3873024 3792501 3445559 3794646 3372991 3676695 3474222 3461576 3048576 3161621
16582 3161621 3212422 3418858 3256336 2950708 3003340 3261965 2870678 2753487 2789879 3051044
16572 3051044 2491052 2718805 2890625 2520602 2395319 2292227 2526183 2244366 2312948 2128554
$$ packed form
16642A2258509l59236n44844m67116N1399p68917K37068l58327n30015R9577m53668
16632I164430j53091k52528l16729j08662l07920j1498j95186k76888l24794j0994
16622G206140k09441p5190k89550K21663p92310L5758k39700L44644m31226L98789
16612F169577o12274J0041N2242j79261R7912o36518o9108M5848j20408r1844
16602D666207j33240j67596Q2543l15902K58122r1798k03478J96624k35248j93068
16592C863166R858q0523l46942L49087m21655L03704k02473j2646m13000J13045
16582C161621N0801K06436j62522l05628N2632K58625l91287j17191L6392K61165
16572C051044n59992K27753J71820l70023j25283j03092K33956k81817O8582j84394
$$ plain form
16562 2128554 2185003 2557569 1938980 2618942 2432312 2339579 2097336 2188677 2037790 2178234
16552 2178234 2230405 2020486 1640197 2367161 1927476 1775663 1759520 2068623 1764838 1572724
16542 1572724 2009557 1591601 1877572 1667259 1642239 1782548 1584518 1816501 1431455 1407477
16532 1407477 1436506 1335845 1688477 1266125 1194312 1265504 1604405 1282093 1202771 1302475
16522 1302475 1499238 1321346 1296995 1852650 1469224 1300379 1346541 1435274 1134059 1541677
16512 1541677 1182369 1565960 1453478 1652429 1349266 1136849 1253885 1200265 980242 858621
16502 858621 1231053 1466421 1132137 1464311 1099144 986407 1087987 1244758 1139313 1045301
16492 1045301 936165 1134731 989421 1183498 896590 1080210 1336340 1017059 1081418 1185730
$$ packed form
16562B128554N6449L72566o18589O79962j86630r2733k42243R1341j50887J40444
16552B178234N2171k09919l80289P26964m39685j51813j6143L09103l03785j92114
16542A572724M36833m17956K85971k10313k5020J40309j98030K31983l85046k3978
16532A407477K9029j00661L52632m22352p1813P1192L38901l22312p9322R9704
16522A302475J96763j77892k4351N55655l83426j68845M6162Q8733l01215M07618
16512A541677l59308L83591j12482J98951l03163k12417J17036n3620k20023j21621
16502H58621L72432K35368l34284L32174l65167j12737J01580J56771j05445r4012
16492A045301j09136J98566j45310J94077k86908J83620K56130l19281O4359J04312
$$ plain form
16482 1185730 1048972 865552 1048627 818401 1132862 904544 940486 754179 584576 980668
16472 980668 1042256 1124170 841986 907739 1149119 1119647 713168 772584 770683 570301 952199
16461 952199 904113 965354 921258 857958 755831 865593 715499 952849 541443 550104 1004556
16450 1004556 919269 1054957 872967 491676 673028 579716 489336 575129 552841 837613
16440 837613 720417 550878 690246 721586 502078 683782 446840 770637 472386 507275
16430 507275 542316 507782 566166 553258 756243 224422 713180 971939 407661 745075
16420 745075 744961 717627 259886 444252 498575 339985 598361 548528 274104 424090 276888
16409 276888 595817 697015 446045 547949 754818 557430 565828 727482 498075 191163
$$ packed form
16482A185730j36758j83420J83075k30226L14461k28318L5942j86307j69603L96092
16472I80668O1588Q1914k82184O5753K41380k9472m06479N9416j901k00382L81898
16461I52199m8086O1241m4096o3300j02127J09762j50094K37350m11406Q661M54452
16450A004556q5287J35688j81990l81291J81352r3312r0380Q5793k2288K84772
16440H37613j17196j69539J39368L1340k19508J81704k36942L23797k98251L4889
16430E07275L5041l4534N8384j2908K02985B24422M88758K58759D07661L37414
16420G45075j14k7334B59886J84366N4323j58590K58376m9833B74104J49986j47202
16409B76888L18929J01198k50970J01904K06869j97388Q398J61654k29407A91163
$$ plain form
16398 417551 402216 616381 410580 794754 509672 326289 422026 392714 357715 592205
16388 592205 328614 471728 647633 335721 402616 525992 397871 293331 615712 370136
16378 370136 654030 629066 399022 746670 662411 206547 396071 491756 333467 126135
16367 290267 504383 536135 350516 650360 503201 517044 386799 275650 410951 283645
16357 283645 254160 520055 326483 335291 584899 43688 455355 202716 268296 152004
16347 152004 277499 287735 252022 81032 213287 514564 444144 556829 133044 222733
16337 222733 454359 299615 151573 149087 284849 210209 175055 221113 630295 133625
16326 372615 146070 146608 392048 331310 137149 233364 484236 283844 1857 537382 478156
$$ packed form
16398D17551j5335K14165k05801L84174k85082j83383R5737k9312l4999K34490
16388E92205k63591J43114J75905l11912O6895J23376j28121j04540L22381k45576
16378C70136K83894k4964k30044L47648q4259B06547J89524R5685j58289A26135
16367B90267K14116L1752j85619K99844j47159J3843j30245j11149J35301j27306
16357B83645k9485K65895j93572Q808K49608D3688M11667B02716O5580j16292
16347A52004J25495J0236l5713H1032J32255L01277p0420J12685A33044Q9689
16337B22733K31626j54744j48042k486J35762p4640l5154M6058M09182A33625
16326C72615A46070N38K45440o0738A37149R6215K50872k00392A857N35525n9226
$$ plain form
16315 478156 377604 347270 -108569 229957 414383 348506 524442 272116 614261 258934
16304 350745 -13806 157376 242680 381276 544362 223058 142402 84609 265547 305860
16294 305860 43236 306997 164798 464963 132901 138700 109918 494289 432485 333451 78253
16282 600773 244959 66297 229934 228511 352166 274305 190328 40764 249984 501653 5463
16270 288915 234713 138480 228749 332229 151962 154894 148547 235755 35033 218691 142225
16259 142225 28744 301832 393877 -175220 29934 -277167 186643 -104947 385372 370733
16249 370733 149339 -61305 262414 154614 70265 219915 197346 144492 612876 251371
16238 203877 138947 -78116 410480 25840 59308 248169 342114 13762 41663 142127 264645
$$ packed form
16315D78156j00552l0334a08569B29957J84426o5877J75936k52326L42145B58934
16304C50745a3806A57376Q5304J38596J63086B23058q0656n7793J80938M0313
16294C05860D3236K63761j42199L00165A32901N799k8782L84371o1804r9034G8253
16282F00773B44959F6297J63637j423J23655p7861q3977D0764K09220K51669E463
16270B88915n4202r6233R0269J03480A51962K932o347Q7208C5033J83658p6466
16259A42225B8744K73088R2045a75220B9934b77167A86643a04947C85372j4639
16249C70733A49339f1305B62414j07800G0265J49650k2569n2854M68384B51371
16238B03877o4930g8116D10480B5840L3468J88861R3945A3762K7901J00464J22518
$$ plain form
16227 264645 142443 329494 343355 54487 96532 -75769 215364 321252 139198 68847
16216 487097 43411 356945 344638 108445 327689 66046 335985 220696 196837 83057
16205 385925 368119 459650 439955 530787 40514 344171 332573 208011 541213 -2599 -14977
16194 -14977 113564 21583 163573 -201106 26411 255862 537872 134210 259823 169718
16184 169718 175730 300136 237939 -135440 106288 114847 276566 -21881 -310363 260301 201079
16173 201079 -45748 615011 -86415 -21018 -131761 -14826 -278944 -45675 164116 321826
16163 321826 143432 -319136 -118159 34352 4733 125382 94603 183270 268872 14175 -207746
16151 195154 -132633 -137976 101138 245734 241228 -208443 47919 190937 80527 18908 -423875
$$ packed form
16227B64645j22202J87051J3861E4487M2045g5769B15364J05888A39198F8847
16216D87097D3411L13534j2307A08445K19244F6046K69939j15289k3859H3057
16205C85925j7806R1531j9695R0832D0514L03657j1598j24562L33202b599j2378
16194a4977A13564B1583J41990b01106B6411K29451K82010A34210J25613r0105
16184A69718O012J24406o2197a35440A06288Q559J61719b1881k88482B60301n9222
16173B01079d5748F15011h6415b1018j10743a4826k64118d5675A64116J57710
16163C21826A43432c19136a18159C4352D733J20649l0779Q8667Q5602A4175b07746
16151A95154a32633n343A01138J44596m506b08443D7919J43018H0527A8908d23875
$$ plain form
16139 297789 16787 -38393 -187773 109400 -11752 -60636 147780 283006 -242188 71309
16128 -31200 16748 303641 -61111 19207 175639 147957 -425288 354975 80672 148034 -18270
16116 31199 109514 202396 75011 -36794 156753 105487 128790 270455 97046 6037 -7151 -148143
16104 -148143 114405 -8809 -215164 358493 -182540 347655 -44220 87042 -63894 255108
16093 312206 -16294 -130216 163312 313110 -71372 -66787 348828 -61952 -194411 -20137 173698
16081 -50389 -102745 -12308 50944 -233832 164433 85769 -137619 -109124 65083 291205 136584
16069 365881 98526 1958 228923 204412 -138573 58419 97162 306280 43235 134103 67440
16058 67440 -62756 42815 -67418 134187 12848 -142752 -169504 -287304 28664 -201441 76878
$$ packed form
16139B97789A6787c8393j49380A09400a1752m8884A47780J35226b42188G1309
16128c1200A6748K86893f1111A9207J56432k7682d25288C54975H0672O7362a8270
16116C1199P8315R2882G5011c6794A56753n1266K3303J41665I7046F037g151j40992
16104a48143A14405h809k06355C58493a82540C47655d4220H7042f3894B55108
16093C12206a6294j13922A63312J49798g1372M585C48828f1952j32459b0137A73698
16081e0389n2356a2308E0944b33832A64433p8664a37619K8495F5083K26122A36584
16069C65881I8526A958K26965k4511a38573E8419L8743K09118D3235R0868o6663
16058F7440f2756D2815f7418A34187A2848a42752k6752j17800B8664b01441G6878
$$ plain form
16046 -109408 -258935 -170884 -90347 -134247 193093 270393 34450 -54484 -144327 235111 114824
16034 178151 343434 -230171 60612 -117887 -159899 87489 -132187 280002 78118 -93020
16023 -135578 -253326 225731 -358527 -313465 -276918 -10460 45957 82286 261276 -170560
16012 62556 85841 109794 -22665 295427 220385 -262923 54331 19525 50003 -141410 92606
16000 -6831 69527 -25362 -80224 -57687 -98481 -28532 123733 289953 27097 439169 115746
15988 -305201 -283788 -340748 180839 -128679 -75431 142909 -249641 132079 -194552 136989
15977 -89123 4206 -11502 -104365 -347488 64621 55562 64964 90970 38920 224993 54476 160195
15965 160195 33178 372299 153391 75465 -72870 -199541 -73609 202123 -20622 -207659
$$ packed form
16046a09408j49527Q8051Q0537m3900A93093P7300C4450e4484q9843B35111A14824
16034A78151J65283b30171F0612a17887m2012H7489a32187B80002G8118i3020
16023a35578j17748B25731c58527M5062L6547a0460D5957L6329J78990a70560
16012F2556K3285K3953b2665B95427p5042b62923E4331A9525L0478a41410I2606
16000f831F9527b5362n4862K2537m0794b8532A23733J66220B7097M12072A15746
15988c05201K1413n6960A80839a28679N3248A42909b49641A32079a94552A36989
15977h9123D206a1502r2863k43123F4621r059R402K6006C8920J86073E4476J05719
15965A60195C3178L39121A53391G5465g2870j26671g3609B02123b0622j87037
$$ plain form
15955 -207659 63212 -68076 -104871 -111606 -145118 -154038 -43757 358617 -63122 -56214 237084 45422
15942 -23296 -227363 -116836 -325309 -81549 -138115 -25986 -281869 39184 -136091 -556235
15932 -556235 56565 -214281 -108990 11957 -84184 219656 -147109 -48954 -31889 211258
15921 74647 -169074 183733 447975 -110381 -248517 -4714 231964 -234770 -206083 79426
15910 158811 94025 258521 -46442 152319 225802 -178488 -437737 -17300 -49987 -31856 109231
15898 -33720 169734 197605 123142 5707 -522345 30787 -190615 -45631 -119451 -120377 -156984 64954
15885 -192532 52940 169085 63460 -87361 258876 -158726 -54109 -254329 -355659 22672
15874 -216899 171020 166678 -204425 -125378 -212790 -13468 -451728 4006 118857 -188378 258552
$$ packed form
15955b07659F3212f8076l6795o735l3512q920d3757C58617f3122O908B37084D5422
15942b3296k04067J10527k08473h1549n6566b5986k55883C9184a36091m20144
15932e56235E6565b14281J05291A1957h4184B19656a47109d8954J7065B11258
15921G4647a69074A83733K64242a10381j38136d714B31964b34770K8687G9426
15910A58811o4786J64496d6442A52319P3483a78488k59249a7300l2687J8131A09231
15898c3720A69734K7871p4463E707e22345C0787a90615d5631p3820r26l6607F4954
15885a92532E2940J16145F3460h7361B58876a58726e4109k00220j01330B2672
15874b16899A71020m342b04425P9047q7412a3468m38260D006J14851a88378B58552
$$ plain form
15862 -165453 -154666 136957 16682 -180345 -287369 141088 5339 -2264 47064 -30862 -66973
15851 -66973 -109728 -201102 264787 -47523 56336 -158472 -76292 -138353 -64769 192816 239478
15840 239478 -221162 211778 31760 478404 12318 -82667 104213 -77632 -213885 347179
15829 -251015 -197140 22726 85033 291112 115510 -33445 235660 -46089 87625 194254 -116468
15817 -534851 -170745 -4047 258882 97630 130261 -59351 131390 142661 -65684 -328697 -24462
15805 19020 -33621 -7136 -103503 -273833 -39338 -7810 -179630 81456 102312 -93635 -130965 112378
15792 -94914 150691 247721 -52332 -280896 -36976 -151055 -49297 24640 -27892 -14118 -117658
15781 -117658 -3006 62066 89351 166855 -238969 -28303 -29311 -251660 -189478 -44557 3102 -283206
$$ packed form
15862a65453J0787A36957A6682a80345j07024A41088E339b264D7064c0862l6111
15851f6973m2755r1374B64787d7523E6336a58472g6292o2061f4769A92816M6662
15840B39478b21162B11778C1760M46644A2318h2667A04213g7632j36253C47179
15829b51015N3875B2726O2307K06079A15510c3445B35660d6089H7625J06629a16468
15817e34851a70745d047B58882I7630L2631e9351A31390J1271f5684k63013b4462
15805A9020c3621g136r6367j70330c9338g810j71820H1456K0856i3635l7330A12378
15792i4914A50691R7030e2332k28564c6976j14079d9297B4640b7892J3774j03540
15781a17658c006F2066K7285P7504b38969b8303j008k22349O2182d4557C102b83206
$$ plain form
15768 -53377 -181707 -251507 257172 -85779 -71530 -266243 -58855 -224480 -67933 -163697 -17128
15756 156142 261577 72127 128501 -27601 -139272 -313657 76384 130512 -148556 10746 9998
15745 9998 116217 -342660 117366 -37409 -98469 43069 -18966 -90602 132266 515231 -53958
15733 -256145 -124888 75590 155840 165338 121264 12224 -95401 -146688 -7570 -119751 81975
15721 -13844 -210741 -191560 233918 -24667 -145087 28583 26355 -66520 -56611 71212 -51084
15709 -23471 90008 -23494 -178298 -230614 148700 -84762 -95127 -98339 -178316 9849 -137654
15697 -20429 -3103 119742 -160228 -24086 -130670 -145709 -6874 137168 -198300 -222655 -174353
15686 -174353 -84489 -271224 47957 -36554 -212168 204203 -55399 -160418 57760 -192767
$$ packed form
15768e3377j28330o9800B57172h5779J4249j94713e8855j65625f7933r5764a7128
15756A56142J05435G2127N6374b7601j11671j74385G6384N4128a48556A0746p48
15745I998J06219c42660A17366c7409o1060D3069a8966p1636A32266L82965e3958
15733b56145a24888G5590Q0250R498m4074A2224i5401n1287g570j12181H1975
15721a3844j96897J9181B33918b4667j20420B8583k228f6520R909G1212e1084
15709b3471I0008b3494j54804n2316A48700h4762j0365l212p9977I849a37654
15697b0429c103A19742a60228b4086j06584j5039f874A37168a98300k4355M8302
15686a74353h4489j86735D7957c6554j75614B04203e5399j05019E7760a92767
$$ plain form
15675 67623 -131288 -263585 -246159 -24121 77143 96226 -66722 -19656 29202 -93357 58207
15663 -294128 -219688 -10325 -222775 -71835 115783 151521 158369 -83014 254153 141563 159051
15652 159051 396719 69224 -175225 -101312 -200577 -279589 196172 -39455 3379 179309 68505
15640 83738 50222 -164672 -264719 -957 -202166 93211 423963 -25619 -60964 -339035 -105687
15628 -96184 276 -151132 -64488 -157303 -23055 251117 -211288 83319 -3282 230620 -211033
15616 145610 134049 229615 -56667 -71866 -154721 214455 -104105 117523 -122060 -81475 -20292
15604 -28305 -109035 199178 129816 50714 -253927 -42472 -405494 54901 161983 146524 -35121
15592 -312484 183044 -151706 267790 253279 167164 49246 36128 73874 32486 51654 52202
$$ packed form
15675F7623a31288j32297J7426b4121G7143J9083f6722a9656B9202i3357E8207
15663b94128P4440a0325k12450g1835A15783L5738O848h3014B54153j12590J7488
15652A59051K37668F9224a75225P3913r9265p9012A96172c9455C379J75930F8505
15640H3738l3516a64672j00047i57k01209I3211L30752b5619l5345k78071a05687
15628i6184B76a51132f4488r2815b3055B51117b11288H3319c282B30620b11033
15616A45610j1561R5566e6667j5199q2855B14455a04105A17523a22060M0585b0292
15604b8305q0730A99178o9362E0714b53927d2472l63022E4901J07082j5459c5121
15592c12484A83044a51706B67790j4511q6115D9246j3118L7746C2486J9168N48
$$ plain form
15581 52202 18845 -189662 -222574 6340 172612 -152983 22233 18782 12549 -54879 -266650
15570 -266650 -108565 -12203 -281826 3764 -43973 102694 224242 184365 -109637 -186730 45190
15558 -162012 -119839 122902 -209004 126145 -80055 -115404 95838 124128 -86431 -105841 -6976
15546 -145662 209541 -196929 97040 -10836 180069 -152881 113116 194041 -170124 -63882
15535 -167870 -535233 81751 -200901 -62617 196600 138871 -467446 -300817 88644 313664
15525 313664 28597 352249 -288487 38141 125273 -90799 21793 8465 96264 90492 61284
15514 61284 -138269 284920 -132974 40535 -194606 81989 -81637 -236760 -32223 -76864 41170
15502 -66283 162482 220141 245936 -195734 3123 51819 -181893 -66081 -126239 -3763 -100559
$$ packed form
15581E2202A8845a89662l2912F340J66272a52983B2233l451o233e4879k11771
15570b66650a08565a2203k69623C764d3973A02694J21548l9877a09637p7093D5190
15558a62012M2173A22902b09004A26145h0055l5349I5838K8290h6431j9410f976
15546a45662B09541a96929I7040a0836A80069a52881A13116Q0925a70124f3882
15535a67870l67363H1751b00901f2617A96600n7729d67446J66629H8644K25020
15525C13664B8597L23652b88487C8141Q7132i0799B1793H465Q7799n772k9208
15514F1284a38269B84920a32974D0535a94606H1989h1637j55123c2223m4641D1170
15502f6283A62482N7659K5795a95734C123M8696a81893f6081o0158c763r6796
$$ plain form
15491 -100559 -249983 -116676 9129 4473 -92331 -200066 -40131 -77290 92294 -43038 41326
15479 -50043 34677 171894 -180252 -192991 187760 -376558 -258960 -207546 -74991 -118607 -36265
15467 168965 -228048 -84622 8707 -141167 -79245 102038 47323 -231019 202095 -204940
15456 255270 -3331 246492 -33167 182518 72276 -2920 191241 -45129 102269 269267 -185910
15444 18271 -45864 230672 -9887 -58671 274879 356073 127058 -168291 166728 28567 -67659
15432 -104284 105952 -47370 105728 217209 -11719 78912 427972 -130322 -57429 -259052
15422 -259052 65547 523 -109119 131934 -349961 -127875 -105628 -60353 71993 -281698 -85834
15410 23305 -156227 343452 -132748 411654 -121606 -143191 -137160 599174 22892 -181251
$$ packed form
15491a00559j49424a16676I129D473i2331j07735d0131l7159I2294d3038D1326
15479e0043C4677J37217a80252j2739A87760c76558J17598N1414g4991m3616c6265
15467A68965b28048h4622H707a41167O1922A02038D7323b31019B02095b04940
15456B55270c331B46492c3167A82518G2276b920A91241d5129A02269J66998a85910
15444A8271d5864B30672i887m8784B74879Q1194A27058a68291A66728B8567f7659
15432a04284A05952d7370A05728J11481a1719G8912L49060a30322e7429k01623
15422b59052F5547E23a09119A31934c49961a27875K2247M5275G1993b81698h5834
15410B3305a56227C43452a32748D11654a21606k1585O031E99174B2892a81251
$$ plain form
15399 -166801 20384 -163980 73361 41047 80122 109771 -56238 -41823 -145146 -251025 -170119
15388 -170119 -9873 45040 121899 -97888 -235738 39591 -101593 194160 35092 -491367 -66433
15376 -181592 -19374 -49151 397448 6628 -1830 25356 89233 -140868 455094 -133475 136894
15364 65043 112226 54543 -101228 427763 -3540 239117 -148336 -399880 268491 296068 -83721
15352 -108521 289047 90560 49323 -81984 -219480 -86943 286 -257079 18909 -63987 -38549
15341 -38549 292186 -85507 20277 -400152 252967 -466453 -38734 1106 305902 -296898 -193827
15330 -193827 -244679 -380733 151857 49167 253965 -124447 -13195 -232271 -114249 6538
15319 55760 209915 -158990 278132 111313 368700 -142551 -358195 95437 -65168 -93183
$$ packed form
15399a66801B0384a63980G3361l2314L9075K9649e6238J4415j03323j05879Q0906
15388a70119i873D5040P6859i7888j37850C9591a01593A94160C5092d91367f6433
15376a81592a9374k9777C97448F628a830B5356O3877a40868D55094a33475A36894
15364F5043M7183E4543a01228D27763c540B39117a48336k51544B68491K7577h3721
15352a08521B89047I0560m1237h1984j37496h6943B86b57079A8909f3987K5438
15341c8549B92186h5507B0277d00152B52967d66453c8734A106L04796b96898J03071
15330a93827n0852j36054A51857D9167K04798a24447a3195k19076a14249F538
15319E5760J54155a58990B78132A11313K57387a42551k15644I5437f5168k8015
$$ plain form
15309 -93183 232817 -81712 179573 220152 10513 -203965 177192 148495 33481 370798 341504
15298 341504 76967 141731 65690 -215658 161422 -43732 163777 74360 -102175 42199 -77884
15286 -45860 378664 -33276 223222 37757 -2285 4558 16044 -6799 322564 96502 132415 -226315
15273 51605 18869 -161933 272022 140147 37750 155004 -26190 -40086 36695 1654 55 -278215
15260 213603 -203863 215712 24593 226561 73500 96576 156953 214088 -62099 245051 211716
15249 211716 92474 371504 15128 11402 209935 -442200 83511 140083 300989 107631 266243
15238 266243 204192 132974 156384 359172 923150 999444 1804014 1614665 1719170 1359880
15228 1359880 710313 327272 189047 341496 451222 410563 30736 49616 -158781 84729
$$ packed form
15309i3183B32817h1712A79573M0579A0513b03965A77192k8697C3481L37317k9294
15298C41504G6967O4764F5690b15658A61422d3732A63777G4360a02175D2199g7884
15286d5860C78664c3276B23222C7757b285D558J1486f799C22564I6502L5913b26315
15273E1605A8869a61933B72022j31875C7750J17254b6190j3896C6695A654E5b78215
15260B13603b03863B15712B4593K01968G3500K3076O0377N7135f2099B45051l3335
15249B11716I2474K79030A5128l726J98533d42200H3511N6572J60906A07631J58612
15238B66243o2051p1218K3410K02788N63978P6294Q04570j89349J04505l59290
15228A359880o49567C27272j38225J52449J09726m0659C0736J8880a58781H4729
$$ plain form
15217 269547 -115372 -217644 183842 401927 233709 -55566 -353 278139 -280033 179132
15206 80683 -88087 41437 -53815 97365 35580 88739 176555 186763 286957 207825 -270284
15194 117009 186554 -153319 190037 -190959 147335 -1899 57989 -32358 -20215 -67910 32467
15182 -5949 -86018 290121 265298 155109 196820 -63898 -211820 -147313 202774 -345870 3800
15170 -205026 -69917 226457 -183275 66688 218489 108458 212356 225029 240774 -142306
15159 -233537 -17576 156678 -7968 296567 -66822 -54430 140067 159772 19239 -59839 365144
15147 237972 225772 80889 125526 38061 102071 -99149 -270839 38741 -156615 143489 -135062
15135 146432 52304 248656 261308 71251 377956 78396 46938 36070 469861 229587 -183675
$$ packed form
15217B69547a15372j02272A83842K18085j68218e5566c53B78139b80033A79132
15206H0683h8087D1437e3815I7365C5580N3159Q7816J0208J00194p9132b70284
15194A17009O9545a53319A90037a90959A47335a899E7989c2358J2143m7695C2467
15182e949q0069B90121k4823j10189M1711f3898j47922O4507B02774c45870C800
15170b05026f9917B26457a83275F6688J51801A08458J03898J2673J5745a42306
15159b33537a7576A56678g968B96567f6822J2392A40067J9705A9239e9839C65144
15147B37972j2200H0889M4637C8061O4010i9149j71690C8741a56615A43489a35062
15135A46432E2304J96352J2652G1251L06705G8396l1458j0868M33791B29587a83675
$$ plain form
15123 -44030 -19624 -78335 -159480 141790 154755 100000 60551 -36515 294157 -27515 -192351
15112 -192351 -146575 -94540 334324 26278 296545 343266 114960 -30966 -102832 105416 404528
15101 404528 -55927 -287894 -64203 271707 -28987 -183062 -124901 90845 -1585 427460 -96930
15089 26006 -186200 112567 46984 110848 -131016 177113 -108052 49534 302756 467944
15079 467944 -45445 83682 86719 140478 233741 -39765 375373 226199 -45796 278657 130263
15067 252170 168268 139543 177699 363297 -187893 175991 158891 158804 1699 -51770 -236662
15056 -236662 -20626 347730 648268 503381 59687 227217 149197 -1409 47544 100465 64489
15045 64489 204808 318694 220548 201211 184597 715 -38512 97191 32681 141347 -44684
$$ packed form
15123d4030a9624n8711q1145A41790J2965n4755l9449c6515B94157b7515j64836
15112a92351M5776N2035C34324B6278K70267M6721A14960c0966p1866A05416K99112
15101D04528e5927k31967f4203B71707b8987j54075N8161I0845a585D27460i6930
15089B6006a86200A12567D6984O3864a31016A77113a08052D9534K53222J65188
15079D67944d5445H3682L037N3759R3263c9765C75373j49174d5796B78657A30263
15067B52170q3902k8725L8156J85598a87893A75991j7100q7A699e1770j84892
15056b36662b0626C47730L00538j44887E9687J67530p8020a409D7544N2921l5976
15045F4489J40319J13886r8146j9337j6614G15c8512I7191C2681J08666d4684
$$ plain form
15033 -167782 -7966 -99763 242983 318907 -14161 -60893 173691 234651 194300 383436 62822
15021 194332 37014 268560 255875 147948 -307724 5416 389890 269487 161954 149024
15011 149024 11321 350274 -22379 317250 -217072 318657 10835 227085 -21934 -86415
15001 -86415 230315 322637 266794 -77687 205664 187953 -44425 14060 308287 170552 315353
14990 315353 570043 317269 192634 267810 -20434 -57269 155220 333873 -195875 247743
14979 361433 331053 54530 337512 18155 134035 258012 119745 -42712 52256 187977
14969 187977 323347 426620 54905 376815 -134159 205551 115644 -33798 453187 223950
14958 202832 179620 78527 364592 127115 65428 215649 381113 127529 190015 89667
$$ packed form
15033a67782g966r1797B42983P5924a4161m6732A73691O0960m0351J89136F2822
15021A94332C7014K31546j2685j07927c07724E416L84474j20403j07533j2930
15011A49024A1321L38953b2379C17250b17072C18657A0835K16250b1934o4481
15001h6415B30315R2322n5843g7687B05664j7711d4425A4060K94227j37735J44801
14990C15353K54690k52774j24635P5176b0434l6835A55220J78653a95875B47743
14979C61433l0380E4530K82982A8155J15880J23977A19745d2712E2256J35721
14969A87977J35370J03273E4905L21910a34159B05551q9907c3798D53187B23950
14958B02832k3212G8527K86065A27115o1687J50221J65464A27529O2486H9667
$$ plain form
14947 322454 39949 -76917 113692 176448 291964 559090 276848 440410 191304 -2745
14936 155929 583359 333697 308812 208870 84557 337958 -62832 232713 495197 376584
14926 376584 415478 397523 17683 101220 154789 206784 82411 366922 360646 310071 -40792
14914 296263 471264 93944 365873 354868 303518 -134697 294480 316704 168792 314507
14904 314507 64581 249230 266804 351352 254516 347650 115763 235654 318665 436828 81986
14892 431574 295959 134243 429194 105191 324441 540650 571290 312911 155164 284163
14882 284163 375545 237530 103992 458592 499410 239961 252957 -6096 288930 333374 247549
14871 247549 354886 116841 471530 143829 204601 371903 243103 211758 262160 209997
$$ packed form
14947C22454C9949g6917A13692O2756J15516K67126B76848J63562A91304b745
14936A55929M27430k49662k4885r9942H4557K53401f2832B32713K62484j18613
14926C76584L8894j7955A7683Q3537N3569N1995H2411K84511o276n0575d0792
14914B96263J75001I3944K71929j1005n1350a34697B94480K2224j47912J45715
14904C14507F4581J84649J7574Q4548r6836R3134A15763J19891Q3011J18163H1986
14892D31574j35615A34243K94951A05191K19250K16209L0640k58379A55164J28999
14882B84163R1382j38015A03992L54600M0818B39961J2996f096B88930M4444q5825
14871B47549J07337A16841L54689A43829O0772J67302j28800l1345N0402n2163
$$ plain form
14861 209997 438369 -32301 148909 632524 280862 411529 441696 295193 217607 360517
14851 360517 456706 420464 390716 269250 400876 587051 573672 643393 465979 85933 277772
14840 277772 731636 335802 251651 410593 334843 408960 275881 460157 312822 14254
14829 533282 334308 489057 532123 591192 129669 141782 548184 340073 713078 436932
14819 436932 192777 403076 250758 408136 347504 133652 191540 665658 611134 332686
14809 332686 432352 406606 680613 116874 226108 597130 547059 126254 405790 183670
14798 447797 406160 423202 498405 345275 432409 301463 503377 579503 736880 389703
14788 389703 662943 733102 670995 539172 286063 -77575 548655 810462 441317 517488
$$ packed form
14861B09997K28372c2301A48909M83615B80862J30667L0167j46503p7586J42910
14851C60517R6189l6242k9748j21466J31626J86175j3379O9721j77414H5933J91839
14840B77772M53864C35802q4151J58942p5750P4117j33079J84276j47335A4254
14829E33282j98974J54749M3066N9069A29669J2113M06402k08111L73005k76146
14819D36932A92777K10299j52318J57378o0632A33652N7888M74118n4524k78448
14809C32686R9666k5746K74007A16874J09234L71022n0071A26254K79536A83670
14798D47797m1637J7042P5203j53130Q7134j30946K01914P6126J57377l47177
14788C89703K73240P0159o2107j31823k53109g7575E48655K61807l69145P6171
$$ plain form
14778 517488 427212 348064 651148 198605 237753 516636 531536 233427 629412 655031
14768 655031 434857 629089 358494 676236 432645 -22578 511924 727117 276661 541956
14758 541956 497896 477858 584233 601263 866748 546989 662858 506203 550895 426960
14748 426960 479979 530972 623992 370824 640451 488552 467160 814476 341678 639195
14738 639195 580287 510691 472466 666385 586089 497073 716867 833331 807364 410865 428518
14727 428518 530120 754395 855455 277937 521410 520223 955348 954173 624958 763701
14717 763701 602367 799049 479347 709926 413120 441798 607787 547478 977791 432160
14706 969172 419654 658720 560956 1077413 754451 694470 754508 697742 626782 559358 1099928
$$ packed form
14778E17488r0276p9148L03084A98605L9148K78883J4900B33427L95985K5619
14768F55031k20174J94232k70595L17742k43591b2578E11924K15193B76661K65295
14758E41956m4060k0038J06375J7030K65485l19759J15869j56655M4692j23935
14748D26960N3019N0993R3020k53168K69627j51899k1392L47316C41678K97517
14738F39195n8908o9596l8225J93919q0296q9016K19794J16464k5967l96499J7653
14727D28518J01602K24275J01060B77937K43473j187M35125j175l29215J38743
14717G63701j61334J96682l19702K30579k96806K8678J65989o0309M30313D32160
14706I69172D19654K39066r7764N16457l22962n9981O0038n6766p0960o7424N40570
$$ plain form
14695 1099928 956794 1023726 517070 354377 700332 284343 772419 743360 742812 547867
14685 547867 660411 760496 814765 869986 830736 560288 823997 666657 586003 815396
14675 815396 702899 1093657 502743 834963 906578 434517 817979 677243 901672 803729
14665 803729 935990 692946 1145654 714595 1090961 1071632 1011884 794787 602722 631763
14655 631763 847687 934647 983405 576561 928885 997233 1132507 1086053 763485 513701
14645 513701 967014 999223 1023321 1107354 846609 1124724 946143 569398 1066383 1230199
14635 1230199 1214364 1196068 1330773 1109596 1102322 1004147 1055078 1168372 1120650 1021741 1293099
14624 1293099 1063347 1364554 969700 1312442 1142373 1236125 1151922 926080 1019260 1421238
$$ packed form
14695A099928j43134O6932n06656j62693L45955B84343M88076k9059n48j94945
14685E47867J12544J00085N4269N5221l9250k70448K63709j57340q0654K29393
14675H15396j12497L90758E02743L32220P1615D34517L83462j40736K24429r7943
14665H03729J32261k43044M52708m31059L76366j9329n9748k17097j92065K9041
14655F31763K15924Q6960M8758m06844L52324O8348J35274m6454l22568k49784
14645E13701M53313L2209K4098Q4033k60745K78115j78581l76745M96985J63816
14635A230199j5835j8296J34705k21177p274r8175N0931J13294m7722r8909K71358
14624A293099k29752L01207l94854L42742j70069R3752q4203k25842R3180M01978
$$ plain form
14614 1421238 1063838 1554857 1254864 1124877 1278131 1125804 1294951 1247829 1090753 1317609
14604 1317609 1389393 1280852 1164785 1176304 1261440 1131536 1394407 1692321 1206102 1392584
14594 1392584 1254446 1253307 1097045 1623017 1355567 1203796 1509364 1575452 1450143 1212343
14584 1212343 1461605 1475715 1615763 1545946 1630792 1472480 1687173 1634423 1533769 1643628
14574 1643628 1751084 1670989 1664982 1907462 1817485 1435367 1687476 1765725 1709421 1797548 1767536
14563 1767536 1415429 1924810 1944855 1848254 2048312 1877276 2145333 1887172 2133196 1872345
14553 1872345 1994763 2351903 2047368 2046490 2288819 2264072 2152048 2712738 2674822 2862485
14543 2862485 2996541 3311862 3414684 4176512 4006113 4609250 5044160 5905473 7453785
$$ packed form
14614A421238l57400M91019k99993j29987J53254j52327J69147m7122j57076K26856
14604A317609P1784j08541j16067J1519Q5136j29904K62871K97914m86219J86482
14594A392584j38138j139j56262N25972k67450j51771L05568O6088j25309k37800
14584A212343K49262J4110J40048o9817Q4846j58312K14693n2750j00654J09859
14574A643628J07456q0095o007K42480q9977l82118K52109P8249n6304Q8127l0012
14563A767536l52107N09381K0045r6601K00058j71036K68057k58161K46024k60851
14553A872345J22418L57140l04535q78K42329k4747j12024N60690l7916J87663
14543B862485J34056L15321J02822P61828j70399O03137M34910Q61313J548312
$$ plain form
14534 7453785 10169081 13543083 19588487 28364566 26471231 17916490 13274279 8283308
14526 8283308 5660898 4039933 3360930 2814936 2597162 2566779 2350884 2203467 2325315
14517 2325315 2177269 2014417 2059805 2073500 2055607 2041743 2042318 2270652 2100750 2247174 2708625
14506 2708625 2154607 2670871 2240115 2104685 2226926 2345018 2266167 2515961 2475493 2199814
14496 2199814 2713027 2420735 2822072 2987880 2496068 2670957 2759445 2851501 2551607 2840851
14486 2840851 2851018 2822494 2915143 3100193 2931682 3082114 3010841 2923204 2927155 3192797 3169155
14475 3169155 3049774 3169805 3176394 3172504 3405400 3356017 3447943 3426552 3607208 3335833 3100701
14464 3100701 3774838 3744551 3465138 3860816 3621241 3728392 3600593 4114293 3779831 3847126
$$ packed form
14534G453785K715296L374002O045404Q776079j893335q554741m642211m990971
14526H283308k622410j620965o79003n45994k17774l0383k15895j47417J21848
14517B325315j48046j62852M5388J3695j7893j3864N75K28334j69902J46424M61451
14506B708625n54018N16264m30756j35430J22241J18092p8851K49794m0468k75679
14496B199814N13213k92292M01337J65808m91812J74889Q8488R2056k99894K89244
14486B840851J0167k8524R2649J85050j68511J50432p1273q7637L951K65642k3642
14475C169155j19381J20031O589l890K32896m9383R1926k1391J80656k71375k35132
14464C100701O74137l0287k79413L95678k39575J07151j27799N13700l34462O7295
$$ plain form
14454 3847126 4160104 3692402 4068433 3957257 4233805 4132455 4587127 4538992 4359610 4408840
14444 4408840 4498085 4583973 4420735 4390190 4784992 4517983 5031303 4574759 4877332 4738249
14434 4738249 5068030 5184771 5285146 5240224 5549501 5553364 5362714 5036835 5540372 5629902
14424 5629902 5701026 5856982 5638933 5835189 5835003 6021553 6166629 6149033 6257197 6495704
14414 6495704 6299011 6510088 6371706 6790821 6703632 7133332 7132943 7035862 7562477 7296254
14404 7296254 7663167 7602929 7476517 7654946 7554901 7759939 8436103 7994951 8347355 8167964
14394 8167964 8211461 8578716 8476189 8831435 9063535 9228220 9298680 9654842 9557337 9701164
14384 9701164 9800724 10065062 10238818 10373072 10677029 10434965 10949214 10844585 11200642 11510900
$$ packed form
14454C847126L12978m67702L76031j11176K76548j01350M54672m8135j79382M9230
14444D408840Q9245Q5888j63238l0545L94802k67009N13320m56544L02573j39083
14434D738249L29781J16741J00375m4922L09277L863j90650l25879N03537Q9530
14424E629902P1124J55956k18049J96256j86J86550J45076j7596J08164K38507
14414F495704j96693K11077j38382M19115q7189M29700l89r7081N26615k66223
14404G296254L66913o0238j26412J78429j00045K05038O76164m41152L52404j79391
14394H167964M3497L67255j02527L55246K32100J64685P0460L56162r7505J43827
14384I701164R9560K64338J73756J34254L03957k42064N14249j04629L56057L10258
$$ plain form
14374 11510900 11612003 11918911 12232319 12187420 12759743 12649591 12826871 13061087 13434355
14365 13434355 13657151 14146580 14287929 14421420 14795962 15439477 15303813 15412894 15579022
14356 15579022 16530476 16708257 16769499 17144201 17498155 17853310 17808424 18557283 18936473 19580459
14346 19580459 20091842 20421614 20753062 20920529 21592129 21790523 22420006 23057927 23874091
14337 23874091 24137055 24926721 25448184 26137038 26996825 27411895 28319858 28592396 29734716
14328 29734716 30507432 31108273 32151347 33038564 34379658 35351467 35795865 37308120 38060810
14319 38060810 39275085 40509609 41777508 43038064 44228992 45508123 47194192 48545413
14311 48545413 50144007 52005572 53753627 55666548 57811645 59880083 61889277 64346782
$$ packed form
14374A1510900J01103L06908L13408m4899N72323j10152J77280K34216L73268
14365A3434355K22796M89429J41349J33491L74542O43515j35664J09081J66128
14356A5579022R51454J77781O1242L74702L53954L55155m4886P48859L79190O43986
14346A9580459N11383L29772L31448J67467O71600J98394O29483O37921Q16164
14337B3874091K62964P89666N21463O88854Q59787M15070R07963K72538J142320
14328B9734716P72716O00841J043074Q87217J341094R71809M44398J512255P52690
14319C8060810J214275J234524J267899J260556J190928J279131J686069J351221
14311D8545413J598594J861565J748055J912921K145097K068438K009194K457505
$$ plain form
14303 64346782 66236376 69200839 71860169 74478465 77349293 80858274 84093816 87665061
14295 87665061 91594998 95332383 99673931 104099016 108798257 114131083 119301198 124791839
14287 124791839 131055792 137493368 144255452 151413555 159163244 167568742 176145237 185576702
14279 185576702 195060434 205404214 216509111 228208897 240239382 252982213 266659469
14272 266659469 280354563 294505574 308860640 323264635 337685246 351794158 365676295
14265 365676295 379002356 391313882 403193899 414151044 424463366 433800896 441209074
14258 441209074 445000961 447907749 451125825 453625854 451590100 445879625 441239775 435666561
14250 435666561 425823395 414797474 402281121 389428722 375753472 361701552 347516550
$$ packed form
14303F4346782J889594K964463K659330K618296K870828L508981L235542L571245
14295H7665061L929937L737385M341548M425085M699241N332826N170115N490641
14287A24791839O263953O437576O762084P158103P749689Q405498Q576495R431465
14279A85576702R483732J0343780J1104897J1699786J2030485J2742831J3677256
14272B66659469J3695094J4151011J4355066J4403995J4420611J4108912J3882137
14265C65676295J3326061J2311526J1880017J0957145J0312322R337530P408178
14258D41209074L791887K906788L218076K500029k035754n710475m639850n573214
14250D35666561r843166j1025921j2516353j2852399j3675250j4051920j4185002
$$ plain form
14243 347516550 333338099 319023065 305196265 291245593 277867103 265580825 253117860
14236 253117860 241285000 229709707 217897949 207364416 196536901 186180489 176658694
14229 176658694 167687553 159345218 151509869 143800006 136722166 130591035 124641757 119008312
14221 119008312 113305944 108209717 102947667 98793668 94771337 90701743 86871612 83747380
14213 83747380 80443377 77145921 74296600 71408216 68735810 66085346 63915858 61300737
14205 61300737 59519548 57359454 55345411 53540855 51402429 49998024 48606579 47216076
14197 47216076 45685216 44588612 43050382 41751023 40508720 39568566 38471144 37235250
14189 37235250 36199303 35065058 34081011 33441598 32742320 31724577 30801704 30014127 29187420
$$ packed form
14243C47516550j4178451j4315034j3826800j3950672j3378490j2286278j2462965
14236B53117860j1832860j1575293j1811758j0533533j0827515j0356412r521795
14229A76658694q971141q342335p835349p709863p077840o131131n949278n633445
14221A19008312n702368n096227n262050m153999m022331m069594l830131l124232
14213H3747380l304003l297456k849321k888384k672406k650464k169488k615121
14205F1300737j781189k160094k014043j804556k138426j404405j391445j390503
14197D7216076j530860j096604j538230j299359j242303r40154j097422j235894
14189C7235250j035947j134245r84047o39413o99278j017743r22873p87577q26707
$$ plain form
14180 29187420 28296204 27827822 27271387 26412736 25808182 25167839 24622790 24064771 23736644
14171 23736644 22880086 22470044 21892848 21536372 20789371 20525356 19914397 19500936 19342935
14162 19342935 18820185 18321173 18093750 18055876 17217416 17064712 16882874 16417751 15803035
14153 15803035 15686840 15361075 15240592 14698112 14588722 14249032 14049558 13733713 13600091
14144 13600091 13209518 13281598 12776760 12786554 12473139 11920362 12131587 11575726 11794648 11412151
14134 11412151 11369431 10868661 11016085 10710639 10623138 10210023 10136654 10088378 10117171 9654122
14124 9654122 9525878 9468402 9243298 9070159 8793695 8916766 8966115 8281380 8484394 8159781
14114 8159781 8329209 7818463 8075196 7415252 7724661 7832955 7530587 7409846 7337872 7295420
$$ packed form
14180B9187420q91216m68382n56435q58651o04554o40343n45049n58019l28127
14171B3736644q56558m10042n77196l56476p47001k64015o10959m13461j58001
14162A9342935n22750m99012k27423l7874q38460j52704j81838m65123o14716
14153A5803035j16195l25765j20483n42480j09390l39690j99474l15845j33622
14144A3600091l90573P2080n04838R794l13415n52777K11225n55861K18922l82497
14134A1412151m2720n00770J47424l05446q7501m13115p3369m8276K8793m63049
14124I654122j28244n7476k25104j73139k76464J23071M9349o84735K03014l24613
14114H159781J69428n10746K56733o59944L09409J08294l02368j20741p1974m2452
$$ plain form
14104 7295420 7448943 6980537 7039016 6778601 6917468 7017048 6742178 6313606 6600733 6561146
14094 6561146 6451001 6316772 6411672 6195947 5910665 6304584 5770893 5844552 5701291 5403314
14084 5403314 5373076 5659134 5360240 5558753 5492066 5347569 5220311 5316855 5109165 5050251
14074 5050251 5055725 4846984 4900074 4872611 4434265 4389581 4724341 4619551 4380049 4340186
14064 4340186 4463165 4218113 4272415 4351016 4673341 4063739 4380242 4163726 4129025 3898503
14054 3898503 4205164 4270850 4257338 4114571 3874153 3862885 3633231 4039139 3595384 3772479
14044 3772479 3694006 3437472 3636063 3691973 3558193 3399010 3528592 3560690 3501722 3623191
14034 3623191 3389452 3123989 3326924 3157047 3191989 3052066 2890853 3630784 3088929 2812878
$$ packed form
14104G295420J53523m68406N8479k60415J38867R9580k74870m28572K87127l9587
14094F561146j10145j34229R4900k15725k85282L93919n33691P3659j43261k97977
14084E403314l0238K86058k98894J98513o6687j44497j27258R6544k07690n8914
14074E050251N474k08741N3090k7463m38346m4684L34760j04790k39502l9863
14064D340186J22979k45052N4302P8601L22325o09602L16503k16516l4701k30522
14054C898503L06661O5686j3512j42767k40418j1268k29654M05908m43755J77095
14044C772479p8473k56534J98591N5910j33780j59183J29582L2098n8968J21469
14034C623191k33739k65463K02935j69877L4942j39923j61213P39931n41855k76051
$$ plain form
14024 2812878 3061372 3186641 3221241 2973728 2985525 2595975 3018541 2674519 2713991 2767843
14014 2767843 3097265 2774455 2886644 2820141 2723414 2571632 2744880 2927549 2404232 2207871
14004 2207871 2740985 2290132 2600294 2230564 2479226 2596861 2355523 2003507 2258480
13995 2258480 2326786 2454282 2066824 2153015 2211022 2260772 2281862 2261253 1912813 2204631
13985 2204631 2327883 2449779 2185348 2436741 2272290 2784492 2693729 2857062 3322852 3811478
13975 3811478 4451823 7011817 9793749 15614972 25108935 27578188 19828394 14009155
13967 14009155 9275988 7201953 5371671 4701808 4388697 3828165 3590228 3219949 3161938
13958 3161938 3102659 3080677 2768217 2770448 2650717 2748313 2418466 2521728 2436797 2303511
$$ packed form
14024B812878K48494J25269L4600k47513J1797l89550M22566l44022L9472N3852
14014B767843L29422l22810J12189o6503r6727j51782J73248J82669n23317j96361
14004B207871N33114m50853L10162l69730K48662J17635k41338l52016K54973
13995B258480O8306J27496l87458Q6191N8007M9750K1090k0609l48440K91818
13985B204631J23252J21896k64431K51393j64451N12202r0763J63333M65790M88626
13975C811478O40345K559994K781932N821223R493963K469253p749794n819239
13967A4009155m733167k074035j830282o69863l13111n60532k37937l70279n8011
13958C161938n9279k1982l12460K231j19731R7596l29847J03262q4931j33286
$$ plain form
13948 2303511 2180295 2212353 2443510 1593945 2260680 2019696 1706573 1949016 2006764 2112796
13938 2112796 1762916 1721192 2028763 1660576 1959955 1622145 1570348 1749070 1733119 1732497
13928 1732497 1876705 1514197 1834824 1626916 1588230 1925021 1492867 1454808 1620711 1570903
13918 1570903 1499432 1190650 1705588 1725289 1813922 1388073 1618996 1631830 1766512 1659899
13908 1659899 1426731 1544520 1480333 1306770 1602734 1422693 1304134 1503695 1529706 1254675
13898 1254675 1626410 1532985 1075498 1377261 1162083 1544237 1192747 1102382 1364726 1371090
13888 1371090 1356476 1363495 1270573 1165219 1276783 1070273 1186682 1218090 1026505 1195552
13878 1195552 1423663 1201124 1440936 1275103 1293847 1275113 1127182 1134782 1167658 907253
$$ packed form
13948B303511j23216L2058K31157q49565O66735k40984l13123K42443N7748J06032
13938B112796l49880m1724L07571l68187K99379l37810n1797J78722j5951o22
13928A732497J44208l62508L20627k07908l8686L36791m32154l8059J65903m9808
13918A570903p1471l08782N14938J9701Q8633m25849K30923J2834J34682j06613
13908A659899k33168J17789o4187j73563K95964j80041j18559J99561K6011k75031
13898A254675L71735r3425m57487L01763k15178L82154l51490r0365K62344O364
13888A371090j4614P019r2922j05354J11564k06510J16409L1408j91585J69047
13878A195552K28111k22539K39812j65833J8744j8734j47931P600L2876k60405
$$ plain form
13868 907253 1103104 1184783 1001204 1217908 840592 1235002 1087665 1024334 799703 1439362
13858 1439362 1065661 1158048 917241 1140635 1369098 915253 1317427 1064673 985392 1175958
13848 1175958 978120 1415185 401579 978779 1007992 1034817 1050255 1087467 1131921 941061
13838 941061 815158 1177127 986960 976370 787426 741566 1130343 961484 1016295 845646
13828 845646 875213 1184230 876935 887056 986398 742574 854963 840206 1018402 653684
13818 653684 1207796 958268 737986 880751 931347 673309 871049 866787 706324 1148037
13808 1148037 1224032 1181761 937550 953386 821946 706976 855296 674995 723277 778700
13798 778700 837626 733269 804666 829863 981208 811891 759584 786160 792072 901560 596928
$$ packed form
13868I07253J95851Q1679j83579K16704l77316L94410j47337o3331k24631O39659
13858A439362l73701R2387k40807K23394K28463m53845M02174k52754p9281J90566
13848A175958j97838M37065D01579N77200K9213K6825J5438L7212M4454j90860
13838I41061j25903L61969j90167j0590j88944m5860L88777j68859N4811j70649
13828H45646K9567L09017l07295J0121R9342k43824J12389j4757J78196l64718
13818F53684N54112k49528k20282J42765N0596k58038J97740m262j60463M41713
13808A148037P5995m2271k44211J5836j31440j14970J48320j80301M8282N5423
13798G78700N8926j04357P1397K5197J51345j69317n2307K6576N912J09488l04632
$$ plain form
13787 596928 961208 656883 892302 818661 703228 751265 852902 519730 618880 750240
13777 750240 823565 733162 695022 1052372 849719 583032 608879 514788 266456 673635
13767 673635 745441 1039693 723009 786812 884551 929473 696764 360748 641711 529164
13757 529164 707867 295707 505984 524193 573772 870123 769481 755932 695878 818382
13747 818382 678618 559909 662013 601455 839766 355493 806000 783972 570640 665132
13737 665132 721124 415730 555226 470707 229652 279012 621159 576200 737678 612770
13727 612770 651889 737955 824652 734212 547061 878209 313737 598589 820228 754007
13717 754007 507213 478045 441711 591423 705659 644707 407594 683002 501327 613000
$$ packed form
13787E96928L64280l04325K35419p3641j15433M8037J01637l33172R9150J31360
13777G50240P3325r0403l8140L57350k02653k66687K5847r4091k48332M07179
13767F73635P1806K94252l16684O3803R7739M4922k32709l36016K80963j12547
13757E29164J78703B95707K10277J8209M9579K96351j00642j3549o0054J22504
13747H18382j39764j18709J02104o0558K38311C55493M50507k2028k13332R4492
13737F65132N5992l05394J39496q4519B29652M9360L42147m4959J61478j24908
13727F12770L9119Q6066Q6697r0440j87151L31148C13737K84852K21639o6221
13717G54007k46794k9168l6334J49712J14236o0952k37113K75408j81675J11673
$$ plain form
13707 613000 739499 440684 388434 539370 487702 320980 397210 959798 384100 857459
13697 857459 685122 573082 766874 687231 745348 348017 493949 570130 516441 423840
13687 423840 230029 446437 524747 307462 522390 462531 346850 490338 512477 530746
13677 530746 395705 288068 532207 450467 204714 373239 444961 247121 512870 478412
13667 478412 452336 606715 652785 355184 164776 222181 617678 433717 620610 470431
13657 470431 629199 669540 576287 615167 451776 340601 454517 292592 673878 321701
13646 434739 211399 354821 355580 489582 655226 427789 297385 443041 629152 314656
13636 314656 280986 727090 228058 594650 503561 456093 420173 245300 294536 289554 409023
$$ packed form
13707F13000J26499k98815n2250J50936n1668j66722P6230N62588C84100M73359
13697H57459j72337j12040J93792p9643N8117C48017J45932P6181n3689r2601
13687D23840j93811K16408P8310k17285K14928n9859j15681J43488K2139J8269
13677E30746j35041j07637K44139q1740B04714J68525P1722j97840K65749l4458
13667D78412k6076J54379M6070k97601A64776N7405L95497j83961J86893j50179
13657D70431J58768M0341r3253L8880j63391j11175J13916j61925L81286C21701
13646D34739B11399J43422P59J34002J65644k27437j30404J45656J86111l14496
13636C14656l3670M46104B28058L66592r1089m7468l5920j74873M9236m982J19469
$$ plain form
13625 409023 314335 296593 368631 425707 284882 473034 651625 275431 301579 77730 106030
13614 106030 496650 315757 334467 661146 681722 122344 205312 475112 321368 354247
13604 354247 369946 799624 706152 198755 372149 436730 325952 413076 664698 144329
13593 398149 391129 401472 199027 363964 310816 514328 356253 346064 307544 201388 393009
13582 393009 534445 261701 655799 258103 632763 26380 207063 489601 353852 372579
13572 372579 299073 269413 185063 83456 350501 -97742 419098 417445 168986 523143 644103
13561 644103 491006 350330 247285 270683 216351 525908 142300 -73196 30708 436531
13551 436531 418845 227746 525881 369975 318712 282813 268448 352501 617598 270941
$$ packed form
13625D09023r4688j7742P2038N7076j40825J88152J78591B75431K6148G7730K8300
13614A06030L90620j80893J8710L26679K0576A22344Q2968K69800j53744L2879
13604C54247J5699M29678r3472A98755J73394O4581j10778Q7124K51622A44329
13593C98149p020J0343A99027J64937n3148K03512j58075j0189l8520j06156J91621
13582C93009J41436B61701L94098B58103L74660B6380J80683K82538j35749J8727
13572C72579p3506k9660q4350H3456K67045i7742D19098j653A68986L54157J20960
13561F44103j53097j40676j03045K3398n4332L09557A42300g3196C0708M05823
13551D36531j7686j91099K98135j55906n1263l5899j4365Q4053K65097B70941
$$ plain form
13540 434393 488006 230606 287917 291231 489094 222787 212871 495765 -39654 272969 218452
13529 218452 -42043 401817 278147 182420 605346 334166 124947 159142 227845 524125
13519 524125 350339 36671 88473 345194 11580 172635 425876 62088 265781 243716
13509 243716 304414 -106191 189929 361483 351393 254990 387566 260805 130537 528859
13499 528859 107187 339935 142590 437051 570049 428772 456458 650647 239940 252429
13489 252429 251408 118354 494801 236849 662472 226889 317584 370629 -60532 322640
13478 193855 376187 72193 96701 264621 245613 466018 269865 227947 438449 255447
13468 255447 161647 -77274 -256785 217619 472214 138515 46087 104163 114824 130886 391480
$$ packed form
13540D34393N3613B30606N7311L314J97863B22787r916K82894c9654B72969n4517
13529B18452d2043D01817j23670r5727M22926k71180A24947L4195O8703K96280
13519E24125j73786C6671N1802K56721A1580J61055K53241F2088K03693k2065
13509B43716O0698a06191A89929J71554j0090r6403J32576j26761j30268L98322
13499E28859A07187K32748A42590K94461J32998j41277K7686J94189B39940J2489
13489B52429j021A18354L76447B36849M25623B26889R0695N3045f0532C22640
13478A93855J82332G2193K4508J67920j9008K20405j96153m1918K10502j83002
13468B55447r3800g7274j79511B17619K54595A38515D6087N8076J0661J6062K60594
$$ plain form
13457 391480 58305 135877 469546 17329 213151 205325 -60211 302644 -52162 128512 70868
13446 70868 79338 264520 256916 -61674 398468 352139 21388 -26682 303354 -8300 203005
13434 -85913 438142 218328 148129 898018 188227 188172 571966 348551 253757 295285 -46623
13422 -63703 357331 320452 149025 -155774 225377 -214067 157990 327146 -11970 139093
13411 241427 264421 -365397 233891 369435 -232930 161061 117627 -171886 429317 119525
13400 268821 220217 58507 88413 78549 20480 97391 93030 214424 188118 180304 376179 304204
13388 304204 -99727 273769 -51947 81705 115584 196730 312885 -56301 366904 212813 112596
13377 112596 -45383 387740 135289 234744 462612 359400 284837 -105447 361932 142852
$$ packed form
13457C91480E8305P7572L33669A7329J95822p826f0211C02644e2162A28512n7644
13446G0868Q470J85182p604f1674C98468m6329B1388b6682C03354h300B03005
13434h5913D38142B18328p0199P49889A88227n5L83794k23415r4794M1528d6623
13422f3703C57331l6879A49025a55774B25377b14067A57990J69156a1970A39093
13411B41427K2994c65397B33891J35544b32930A61061m3434a71886D29317A19525
13400B68821m8604E8507K9906r864B0480P6911m361J21394k6306p814J95875p1975
13388C04204i9727B73769e1947H1705L3879Q1146J16155e6301C66904j54091j00217
13377A12596d5383C87740A35289R9455K27868j03212p4563a05447C61932A42852
$$ plain form
13366 532997 -231249 81748 -15055 377041 363285 24409 -41754 263721 466590 274806
13356 274806 205290 145935 577281 473083 404674 42228 236075 273977 41523 373188 291034
13345 291034 379654 329154 63813 -53066 139590 116233 175785 207695 57119 76824 163180
13334 163180 103879 283749 133577 454896 546928 445598 494761 95813 352166 68304
13323 424849 493477 76723 168154 206078 36863 312206 348193 77132 382697 206479 144453
13312 144453 75552 41342 103574 362138 28516 145860 272574 326476 292255 398315 96077
13300 272738 251568 422240 261477 301978 -1616 63867 209286 212136 204327 249102 -293645
13288 -132934 167990 215752 277675 302662 369184 206872 92409 243078 -155828 194011
$$ packed form
13366E32997b31249H1748a5055C77041j3756B4409d1754B63721K02869j91784
13356B74806o9516n9355M31346j04198o8409D2228J93847L7902D1523L31665q2154
13345B91034Q8620n0500F3813e3066A39590k3357N9552L1910E7119J9705Q6356
13334A63180n9301J79870A33577L21319R2032j01330M9163I5813K56353F8304
13323D24849O8628G6723R1431L7924C6863K75343L5987G7132L05565j76218o2026
13312A44453o8901l4210O2232K58564B8516J17344J26714N3902l4221J06060I6077
13300B72738k1170J70672j60763M0501a616F3867J45419K850p809M4775b93645
13288a32934A67990M7762O1923K4987O6522j62312I2409J50669a55828A94011
$$ plain form
13277 19290 14108 125494 -117151 146430 228801 122303 -39798 -157396 49220 -60866 47036
13265 356967 -83682 241480 170182 135489 166082 306145 91568 42305 218958 -91875 313265
13253 -79455 -315772 24161 278979 184314 424340 268026 433620 107920 323083 457662
13243 457662 -127515 65162 190087 -77414 123610 420552 -15838 115221 547574 198769
13232 221079 79786 36151 53037 361111 24107 13463 -280641 27689 69729 -63799 95372
13220 144458 60445 73909 -239136 34441 159651 251197 350530 180583 236553 94745 343285
13209 343285 -16408 -265019 -172946 -276374 62975 81112 -27758 213726 300166 270114 316252
13198 316252 211247 -222678 218276 267377 295285 337356 123728 290777 278032 -194313
$$ packed form
13277A9290n182J11386a17151A46430Q2371j06498c9798j17598D9220f0866D7036
13265C56967h3682B41480p1298l4693L0593J40063I1568D2305J76653i1875C13265
13253g9455k36317B4161K54818r4665K40026j56314J65594A07920K15163J34579
13243D57662a27515F5162J24925g7414A23610K96942a5838A15221M32353A98769
13232B21079G9786C6151J6886L08074B4107j0644b80641B7689M2040f3799I5372
13220A44458F0445J3464b39136C4441J25210R1546R9333j69947N5970I4745K48540
13209C43285a6408k48611R2073j03428F2975J8137b7758B13726Q6440l0052M6138
13198C16252j05005b22678B18276M9101K7908M2071A23728J67049j2745a94313
$$ plain form
13187 -43837 168846 14619 70505 -93076 103358 263723 -107363 4547 459524 -148412 157495
13175 378839 133725 100075 176646 139388 327607 -32826 -80722 -4865 129870 -320937 89043
13163 -44748 293187 71925 201832 -126907 3650 -65945 124775 -47337 412758 8180 117932
13152 117932 76582 3600 -204352 315617 179605 98042 14855 -24619 -234258 -186288 -56764
13140 139726 -35330 164779 -292756 -206701 138528 -18307 192192 -3858 209226 83857 158060
13129 158060 77045 -213078 -10263 -272560 373400 240252 2006 93324 -67371 8796 -75883
13117 -19854 -54508 216638 265014 -92342 -65189 520749 387795 308910 284972 68319 -115216
13105 -158706 -221878 -138430 215595 -192238 190841 75707 160688 -182089 270901 342225
$$ packed form
13187d3837A68846A4619N5886i3076A03358J60365a07363D547M54977a48412A57495
13175C78839A33725l3650P6571l7258J88219c2826m7896d865A29870c20937H9043
13163d4748B93187G1925J29907a26907C650f5945A24775d7337D12758H180J09752
13152A17932m1350C600b04352C15617j36012q1563A4855b4619k09639M7970e6764
13140A39726c5330A64779b92756Q6055A38528a8307A92192c858B09226H3857P4203
13129A58060G7045b13078a0263k62297C73400j33148B006R1318f7371H796g5883
13117a9854l4654B16638M8376i2342K7153E20749j32954p8885k3938F8319a15216
13105a58706o3172Q3448B15595a92238A90841G5707Q4981a82089B70901P1324
$$ plain form
13095 342225 276766 146746 74944 162772 241677 -86476 88271 -79012 -33074 249006 -124863
13083 19965 276497 305930 56945 -217183 315191 395833 49226 -249821 133669 123764 376951
13072 376951 -283507 -218176 88169 95023 41166 140919 94033 158190 296672 -64255 449718
13060 278737 380993 -70049 -272298 29445 417130 159027 134315 213530 225824 181966 206690
13049 206690 49784 222021 -87796 4922 293719 -39049 40945 -61346 228205 -102183 71614
13037 42566 -93978 -163424 -115541 -39453 49642 86995 179933 268859 86800 -347900 -244711
13026 -244711 141620 -36222 74419 298218 84603 104049 203331 88201 271362 206717 81324
13014 149953 223690 -37810 -87382 -41753 23117 318823 -68280 68783 -141065 23863 -34966
$$ packed form
13095C42225o5459j30020p1802Q7828P8905h6476H8271g9012c3074B49006a24863
13083A9965K56532K9433E6945b17183C15191Q0642D9226b49821A33669r905K53187
13072C76951b83507O5331H8169O854D1166R9753m6886O4157J38482f4255D49718
13060B78737J02256g0049k02249B9445L87685A59027k4712P9215J2294m3858K4724
13049B06690D9784J72237h7796D922K88797c9049D0945f1346B28205a02183G1614
13037D2566i3978o9446M7883c9453D9642L7353R2938Q8926H6800c47900J03189
13026b44711A41620c6222G4419K23799H4603J9446R9282H8201J83161o4645H1324
13014A49953P3737c7810m9572d1753B3117K95706f8280F8783a41065B3863c4966
$$ plain form
13002 54415 120044 48320 279120 -80665 96456 377266 42855 -118881 -22536 70108 -14406
12990 229244 251819 94166 -45999 -241153 63866 -81208 17727 85432 28755 315044 40178
12978 96898 390278 343006 -308400 -59271 43021 468544 -309438 -34023 -12633 -64386 250679
12966 111759 88536 88561 268142 344429 40771 59751 245589 -141663 -91996 312376 228081
12955 228081 31193 173984 158728 76624 84494 -2349 -98058 -70463 282917 -156259 427894
12943 -98417 97486 -225769 83983 160189 20753 73749 400543 109536 56 134897 153443
12932 153443 -127006 -100537 201199 109466 -18989 -85867 280790 -91029 189486 22365 176729
12921 176729 340396 -108831 -33997 109515 -244457 208545 65341 219491 402349 -3943
$$ packed form
13002E4415O5629D8320K30800h0665I6456K80810D2855a18881b2536G0108a4406
12990B29244K2575I4166d5999j95154F3866h1208A7727O7705B8755K86289D0178
12978I6898K93380m7272c08400e9271D3021M25523c09438c4023a2633n1753B50679
12966A11759k3223K5J79581P6287D0771J8980J85838a41663M9667C12376q4295
12955B28081C1193J42791j5256G6624P870b349r5709K7595B82917a56259D27894
12943i8417I7486b25769H3983P6206B0753N2996L26794A09536E6J34841J8546
12932A53443a27006K6469B01199r1733a8989o6878B80790i1029A89486B2365J54364
12921A76729J63667a08831c3997A09515b44457B08545F5341J54150J82858c943
$$ plain form
12910 7943 -255806 206832 -174069 -85898 175329 321838 44202 92042 -25931 144207 25541
12898 141159 195519 -5699 -104670 186806 74128 20034 202108 -134463 17892 -233132 356600
12886 -127404 100645 -125966 -29047 221389 -138927 9206 24511 80521 -71262 -173422 -100072
12875 -100072 58590 156700 -247385 45527 302674 297862 262936 1262 -218877 223567 -252365
12863 -210370 166869 280775 54261 51718 125499 -320328 -57872 -9739 -120894 2374 -234626
12851 45336 -61315 -5004 16925 170594 -127653 -24542 -277664 214221 -387349 220658 93403
12839 456861 -82229 83254 251461 -252569 176827 91932 -86571 -89311 -128993 269643 149348
12828 149348 144600 -285216 -151612 101381 -164202 -58321 16519 26223 190904 -75425 7599
$$ packed form
12910G943b55806B06832a74069h5898A75329J46509D4202M7840b5931A44207B5541
12898A41159N4360e699r8971A86806G4128B0034J82074a34463A7892b33132C56600
12886a27404A00645a25966b9047B21389a38927I206J5305N6010g1262j02160P3350
12875a00072E8590R8110b47385D5527K57147m812l4926A262b18877B23567b52365
12863b10370A66869J13906E4261k543P3781c20328e7872i739j11155B374b34626
12851D5336f1315e004A6925J53669a27653b4542k53122B14221c87349B20658I3403
12839D56861h2229H3254J68207b52569A76827q4895h6571k740l9682B69643j20295
12828A49348m748b85216J33604A01381a64202e8321A6519R704J64681g5425G599
$$ plain form
12816 80480 206766 124696 -13381 91390 -134785 103649 336325 336567 33528 -138119 69081
12804 44651 133909 -431316 -286674 -344809 211341 5595 -5084 139871 51070 -202074 -273565
12793 -273565 403892 -154925 -18234 -39486 384698 14161 239900 80257 261788 112971
12782 122247 123708 -289729 216960 102303 -220987 66174 -72986 -218646 -146877 -442041
12772 -442041 -127886 -175386 -24626 -101424 -273318 -61523 360830 246287 -32271 -292821
12762 -292821 -99933 155103 202052 70874 120551 -59504 -270125 6861 111225 69911 147621
12751 147621 -41529 290687 326877 25164 -207 -260380 146123 -128890 328574 -221172 -83689
12739 -40270 -275070 49360 -71755 -102663 -9013 -121312 362 18938 -208528 -19500 68587 -3400
$$ packed form
12816H0480J26286q2070a3381I1390a34785A03649K32676K42C3528a38119F9081
12804D4651Q9258d31316J44642n8135B11341E595e084A39871E1070b02074p1491
12793b73565D03892a54925a8234k1252C84698A4161K25739H0257J81531A12971
12782A22247J461b89729B16960A02303b20987F6174g2986j45660P1769k95164
12772d42041a27886m7500b4626p6798j71894f1523C60830j14543c2271k60550
12762b92821i9933A55103M6949G0874M9677e9504k10621F861J04364m1314P7710
12751A47621d1529B90687L6190B5164b07k60173A46123a28890C28574b21172h3689
12739d0270k34800D9360g1755l0908i013j12299C62J8576b08528a9500F8587c400
$$ plain form
12726 -151867 1411 -86723 -298174 -109535 -2662 -328977 204761 51817 77211 -46933 -3706
12714 151802 96592 21204 -76570 115879 -131608 -222195 400318 -23769 177324 -77612 -203302
12703 -203302 309420 -270252 -729 -26147 322485 -245752 81564 217318 -55271 -56815 75494
12691 39615 -18368 122670 55194 220193 -65933 -72963 -173161 85365 -3438 80849 180155
12680 180155 86389 551122 244541 -88693 174061 -198066 104063 346829 -45326 271606
12669 -211460 74786 -211074 -42195 54289 49716 -25123 112615 -146590 -87188 418801 61314
12657 -305920 165294 -96301 196543 51183 -6148 -11902 56230 169368 275761 167294 -69253
12645 217335 223707 223802 -9290 65600 23858 233352 -131077 41891 -45721 -33664 -66763 388584
$$ packed form
12726a51867A411h6723k11451a09535b662l26315B04761E1817K5394d6933c706
12714A51802n5210B1204g6570A15879a31608r0587D00318b3769A77324g7612j25690
12703b03302C09420b70252g29k5418C22485b45752H1564J35754e5271j544G5494
12691C9615a8368A22670E5194J64999f5933p030j00198H5365c438H0849R9306
12680A80155H6389M64733B44541h8693A74061a98066A04063K42766d5326B71606
12669b11460G4786b11074d2195E4289m573b5123A12615a46590N9402D18801F1314
12657c05920A65294i6301A96543E1183f148n754E6230J13138J06393j08467f9253
12645B17335O372R5i290F5600B3858K09494a31077D1891d5721J2057l3099C88584
$$ plain form
12632 9191 6923 -127282 165993 -183741 4069 374949 75555 -138540 303389 134632 75344
12621 75344 1954 399206 313608 68839 78370 160068 91644 211902 88270 365026 61540
12609 357693 26819 129462 567031 200605 -188771 352086 110936 253004 164505 -30643
12598 39937 -22805 -46816 112694 -71204 -152127 -37857 -3250 -151815 202699 64930 322794
12587 322794 371815 81864 331013 111691 192662 193283 148592 -88179 349070 -70419 -190487
12576 -190487 146645 19543 230413 -78830 167841 -29762 248366 -10424 67238 160744 26387
12564 -346348 -30502 -18615 269344 -164413 -86920 125992 158387 -55031 77016 -155374 -83699
12553 -83699 154719 -359767 -87498 127796 221700 266395 131824 64192 154568 187787 -41870
$$ packed form
12632I191k268a27282A65993a83741D069L70880G5555a38540C03389A34632n9288
12621G5344A954L97252q5598F8839R531Q1698o8424J20258H8270K76756F1540
12609C57693B6819J02643M37569B00605a88771C52086A10936J42068q8499c0643
12598C9937b2805k4011A12694g1204q0923c7857c250j48565B02699F4930K57864
12587C22794M9021H1864K49149A11691Q0971O21m4691h8179C49070g0419j20068
12576a90487A46645A9543K10870g8830A67841b9762B48366a0424F7238R3506B6387
12564c46348c0502J1887B69344a64413P7493A25992L2395e5031G7016a55374P1675
12553h3699A54719c59767h7498A27796R3904M4695A31824F4192R0376L3219d1870
$$ plain form
12541 29622 -56029 -204777 36398 133883 359889 68298 -243143 448560 -165309 153847
12530 47534 -39969 177171 85775 106121 -91954 -105884 158498 -286137 333168 -111337 181819
12518 -47402 118193 -151557 8825 12997 252087 97073 220835 -55163 109605 -36807 351924
12506 111272 376509 -30891 108060 -42074 309659 -45723 -126999 -235803 -174214 -140929 57072
12494 87452 -194154 7909 146684 -27196 68750 -102813 -285248 320300 -236873 -303786 62771
12482 6042 -131303 125242 100505 133397 172474 -230442 -84189 158310 123426 217246 -115103
12470 -11993 134068 -11835 43478 -20405 53962 -49100 38345 -27513 -176106 -173312 58690
12458 126362 270148 178715 -32197 -203876 -304432 -37190 229608 206275 293234 260667 -441
$$ packed form
12541B9622e6029j48748C6398R7485K26006F8298b43143D48560a65309A53847
12530D7534c9969A77171H5775K0346i1954j3930A58498b86137C33168a11337A81819
12518d7402A18193a51557H825M172K39090I7073J23762e5163A09605c6807C51924
12506A11272K65237c0891A08060d2074C09659d5723q1276j08804O1589L3285E7072
12494H7452a94154G909J38775b7196F8750a02813j82435C20300b36873o6913F2771
12482F042a31303A25242k4737L2892L9077b30442h4189A58310l4884R3820a15103
12470a1993A34068a1835D3478b0405E3962d9100C8345b7513j48593K794E8690
12458A26362J43786r1433c2197j71679j00556c7190B29608k3333Q6959l2567d41
$$ plain form
12446 -58115 -144570 10764 -63129 -243398 -102141 64222 62225 99251 2603 420779 55886
12434 -13135 -59360 -33306 240843 166713 -237024 102357 -158264 209163 33056 -38837 121066
12422 -54423 27236 -10678 -2007 165266 -53919 90671 -191546 -30756 -90140 -43718 264413
12410 -113206 102291 -44828 118222 -10452 -23836 132514 47803 108792 16532 -87238 -2720
12398 279443 -144947 37468 198470 -51714 283414 -282983 74405 150310 46389 167871
12388 167871 138408 232647 -80817 -80547 -129797 -62491 -64125 64311 -347377 62449 -68600 221623
12375 313126 -32095 -76645 -282667 4482 -37869 131600 -47009 9386 -128128 -53604 -18488
12363 -14446 40845 86245 187101 -338772 124981 -43680 101752 58530 268847 1088 -31092
$$ packed form
12446e8115q6455A0764f3129j80269a02141F4222j997L7026B603M18176E5886
12434a3135m6225K6054B40843p4130b37024A02357a58264B09163C3056c8837A21066
12422e4423B7236a0678b007A65266e3919I0671a91546c0756n9384d3718B64413
12410a13206A02291d4828A18222a0452j3384A32514D7803O0989A6532h7238b720
12398B79443a44947C7468J61002e1714B83414b82983G4405P5905D6389J21482
12388A67871k9463R4239h0817K70m9250f2491j634F4311c47377F2449f8600B21623
12375C13126c2095m4550k06022D482c7869A31600d7009I386a28128e3604a8488
12363a4446D0845M5400J00856c38772A24981d3680A01752m3222K10317A088c1092
$$ plain form
12351 -26246 100982 -60777 82911 -100328 -213914 -86200 -101802 49259 59895 99741 43652
12339 -119106 419432 -13743 -299877 195569 -81874 79300 84390 125485 -83464 25262 -201118
12327 114647 60792 133328 -248948 -32113 185260 -31742 42421 8013 -130212 358412 -261206
12315 212133 -81920 34440 125472 117094 -75692 19189 -33738 -148997 -144083 -164456 229711
12303 86676 -166584 -143127 108295 -432899 15347 81295 -98282 -50552 188236 -118421 -210735
12292 -210735 -73511 463078 -88285 136165 -206167 55412 237258 -336723 41107 -239603
12281 9886 105697 332509 243156 123868 -172667 -144098 20236 -42509 -34325 226385 80133
12269 -353729 178795 -5183 231600 -149842 7411 -208633 -35652 -165350 -12473 133074 60651
$$ packed form
12351b6246A00982f0777H2911a00328j13586h6200j5602D9259J0636L9846D3652
12339a19106D19432a3743k86134A95569h1874G9300N090M1095h3464B5262b01118
12327A14647n3855P2536b48948c2113A85260c1742D2421H013a30212C58412b61206
12315B12133h1920C4440R1032q378g5692A9189c3738j15259M914k0373B29711
12303H6676a66584K3457A08295d32899A5347O5948i8282M7730A88236a18421r2314
12292b10735g3511D63078h8285A36165b06167E5412J81846c36723D1107b39603
12281I886R5811K26812q9353j19288a72667K8569B0236d2509Q184B26385H0133
12269c53729A78795e183B31600a49842G411b08633c5652j29698a2473A33074F0651
$$ plain form
12257 -215365 93541 -102963 175543 -34084 102098 -121931 -259230 -17189 101834 -25890
12246 238843 -24146 -25936 -91202 -185716 -119461 -90613 131766 234697 -104856 190148 -119151
12234 231896 383038 68014 5688 136655 2541 54041 -278330 -316343 168356 109763 -150927
12222 17740 404389 -303074 158370 -121791 -49845 421379 53328 -164702 -63177 154280
12211 325518 -13069 192908 -10997 -65512 8115 161995 207365 261105 601640 91591 99737
12200 99737 180419 395676 459360 143079 178852 -13269 -117654 201348 -45513 24641 223805
12189 223805 263676 38482 215268 288469 -145448 -105889 385333 247612 156325 -155395
12178 243687 285677 323125 -24412 99175 175362 313513 343278 -21524 -135119 135910 52714
$$ packed form
12257b15365I3541a02963A75543c4084A02098a21931j37299a7189A01834b5890
12246B38843b4146j790o5266r4514O6255K8848A31766J02931a04856A90148a19151
12234B31896J51142F8014E688J30967B541N1500b78330l8013A68356n8593a50927
12222A7740L86649c03074A58370a21791d9845D21379E3328a64702f3177A54280
12211C25518a3069A92908a0997n4515H115J53880M5370N3740L40535I1591Q146
12200I9737Q0682K15257O3684A43079L5773a3269j04385B01348d5513B4641J99164
12189B23805L9871C8482J76786P3201a45448L9559C85333j37721r1287a55395
12178B43687M1990L7448b4412I9175P6187J38151K9765b1524j13595A35910E2714
$$ plain form
12166 215368 -46992 -29483 128620 63022 -19797 316423 -31681 -255931 182789 -142191
12155 -187913 23882 202238 -38639 -83006 435991 830 121287 264827 222380 265729 -109747
12143 51777 44102 -38681 105928 31785 504939 14329 185040 14147 77182 -125543 -104168
12132 -104168 -48394 148057 3071 45221 100967 210810 190047 133740 -122558 356492 96869
12120 58380 11299 72123 -29854 -273450 140030 9939 -104465 152625 -100058 -194399 144716
12108 -90719 -67052 -107842 -93050 52985 -402185 -304856 304222 108901 92509 -105709 46385
12096 78798 -127659 107182 223105 -208076 235578 90409 -49993 66712 -19415 -183859
12086 -183859 260263 -298163 13402 294608 21125 24679 531384 -114663 -157884 166781
$$ packed form
12166B15368d6992J7509A28620F3022a9797C16423c1681k24250A82789a42191
12155a87913B3882J78356c8639m4367D35991H30J20457J43540m2447M3349a09747
12143E1777p675c8681A05928C1785M73154A4329J70711A4147O3035a25543K1375
12132a04168d8394A48057C071M2150N5746J09843k0763n6307a22558C56492I6869
12120E8380A1299O0824b9854k43596A40030I939a04465A52625a00058r4341A44716
12108i0719K3667m0790J4792E2985d02185R7329C04222A08901j6392a05709D6385
12096G8798a27659A07182J15923b08076B35578I0409d9993F6712a9415j64444
12086a83859B60263b98163A3402K81206B1125L554N06705a14663m3221A66781
$$ plain form
12075 -270582 -137878 -45557 22645 316324 -90571 237758 147891 294364 -57973 49166 -130140
12063 -154486 46149 -182408 74699 -129313 -7969 21454 -12849 361870 6625 289780 -165548
12051 275791 506956 895011 377994 207455 141823 -61209 -102046 6994 97615 40047 407548
12040 407548 61539 -155011 -251035 5907 224840 -11430 178149 125084 45749 189504 -4968
12028 211472 140785 82557 -328172 -142128 105142 -50683 175665 65251 -97638 -125377 68674
12016 21215 107477 289234 -187305 -60855 -32032 -329401 -65374 -20649 377718 -218450 186016
12004 -130932 271212 363823 287345 230468 108059 -290861 330970 5028 -174376 -166020 43899
11992 -157473 -180903 85727 -55490 119645 116753 77756 -87966 -105384 -177724 -295818 158456
$$ packed form
12075b70582J32704d5557B2645K93679i0571B37758q9867J46473e7973D9166a30140
12063a54486D6149a82408G4699a29313g969B1454a2849C61870F625K83155a65548
12051B75791K31165L88055C77994j70539o5632f1209m0837F994R0621D0047L67501
12040D07548F1539a55011r6024E907K18933a1430A78149n3065D5749J43755d968
12028B11472p0687n8228c28172a42128A05142e0683A75665F5251i7638k7739F8674
12016B1215Q6262J81757a87305f0855K8823k97369f5374b0649C77718b18450A86016
12004a30932B71212R2611p6478n6877A08059b90861C30970E028a74376Q356D3899
11992a57473k3430H5727e5490A19645k892l8997h7966j7418p2340j18094A58456
$$ plain form
11980 228279 -341223 204910 86112 41923 89660 -342656 37323 216138 -135092 343731
11969 -208472 68940 169172 73593 89923 165948 29223 24113 -363017 -15271 -132423 -49852
11957 -36670 -241865 254050 55681 -43129 -124491 31071 78792 -246959 -123410 -292057 -324746
11946 -324746 -147615 -226688 -456539 -262100 -284668 50957 239102 221803 87450 -164153
11935 -321364 88098 -125111 79951 -272069 343862 128353 -18050 -302867 90643 227695
11925 227695 -87593 -19527 82865 109448 -133155 -32133 125126 21206 86114 -22450 54093
11913 -66681 235954 158290 111714 -165241 88994 -131947 -107420 -130227 -239671 103232 51578
11901 -42157 69033 -1591 -122537 14264 -201469 -49295 -58542 -36727 -241304 -16702 -125598
$$ packed form
11980B28279c41223B04910H6112D1923M7737c42656C7323J78815a35092C43731
11969b08472F8940J00232G3593J6330P6025B9223n110c63017a5271j17152d9852
11957c6670k05195B54050E5681d3129q1362C1071M7721b46959a23410j68647l2689
11946c24746a47615p9073k29851J94439k2568E0957J88145j7299H7450a64153
11935c21364H8098a25111G9951b72069C43862A28353a8050k84817I0643J37052
11925B27695h7593a9527H2865K6583a33155c2133A25126B1206O4908b2450E4093
11913f6681B35954p7664m6576a65241H8994a31947K4527k2807j09444A03232E1578
11901d2157F9033a591j20946A4264b01469d9295r247K1815k04577a6702j08896
$$ plain form
11890 -125598 -79632 5699 -106668 -71377 4557 -75807 -432504 42444 549544 211484 -56991
11878 123558 -214564 -175470 61281 -155649 -83451 -157680 -299384 -85004 -349357 -132715
11867 -201747 122996 -117949 161329 -10126 -288582 -74133 -198922 -148729 -176877 234846
11856 227091 -161274 184732 -245171 -177919 -58288 24248 -48356 -39875 23718 14866 191612
11845 191612 -179601 -268444 121944 145400 120230 159424 -28040 -17199 -369198 -41645 1379
11833 -137818 -112387 -30585 81861 -167184 -71814 44665 -120338 144752 -72053 -211348 46909
11821 47570 118077 -66671 -234114 36551 -177066 -199616 14662 86745 -111894 -53589 258768
11809 130274 -366617 -83882 -99307 -69795 87359 -219079 26070 -32543 -181235 -239988 6955
$$ packed form
11890a25598M5966E699a06668L5291D557g5807l56697D2444N07100B11484e6991
11878A23558b14564L9094F1281a55649P2198p4229j41704h5004k64353a32715
11867b01747A22996a17949A61329a0126k78456g4133j24789N0193k8148B34846
11856B27091a61274A84732b45171O7252e8288B4248d8356Q481B3718q852J76746
11845A91612a79601q8843A21944K3456k5170L9194b8040J0841l51999d1645A379
11833a37818K5431c0585H1861a67184g1814D4665a20338A44752g2053j39295D6909
11821D7570P0507f6671j67443C6551a77066k2550A4662P2083a11894e3589B58768
11809A30274c66617h3882j5425K9512H7359b19079B6070c2543j48692n8753F955
$$ plain form
11797 -140137 147842 103472 75589 183552 -96580 -51455 353104 -65574 81162 -215010 818
11785 61613 51459 178130 198404 -227972 -134299 -34701 -100207 61432 4279 -339682 269834
11773 -48890 -51506 -107949 -23294 -224159 -197085 67025 64863 115581 153662 -47532 -122140 310935
11760 -187911 -26720 114821 109940 96378 202521 310649 -36094 -251074 -192381 272475 18693
11748 415732 -146265 -156211 266727 12251 -106766 -92324 16796 -156003 -214285 231821 197052
11737 197052 44719 -283124 19589 -9501 -303019 -277327 -414219 49506 303259 -198679 -143502
11726 -143502 10060 -9490 77390 -120087 87964 468480 -219474 -92946 -283425 57893 -122794
11714 -374995 292933 -55067 84774 -191706 -125029 -13764 -187428 122653 223081 -95264
$$ packed form
11797a40137A47842m4370k7883J07963i6580M5125C53104f5574H1162b15010H18
11785F1613j0154J26671K0274b27972R3673c4701o5506F1432D279c39682B69834
11773d8890k616n6443b3294k00865K7074F7025k162N0718L8081d7532p4608C10935
11760a87911b6720A14821m881j3562J06143J08128c6094k14980N8693B72475A8693
11748D15732a46265r946B66727A2251a06766J4442A6796a56003n8282B31821l4769
11737A97052D4719b83124A9589i501k93518K5692j36892D9506K53753a98679N5177
11726a43502A0060i490G7390a20087H7964L80516b19474i2946j90479E7893a22794
11714c74995B92933e5067H4774a91706O6677a3764j73664A22653J00428i5264
$$ plain form
11703 176834 -195352 -123701 -135624 -10020 -129262 -216929 66422 -28440 68286 -315034 135144
11691 159967 -63507 -384390 -21366 178465 41205 -235335 -130127 -149908 229178 -149644
11680 -275940 -17212 -147396 89106 177860 -9820 -11306 -12215 24075 172762 -85881 -82768 -203812
11668 -203812 256611 -182228 161883 -182890 -128458 -16170 87941 -183439 -313614 63925
11657 -24243 336196 -128172 202469 117589 -146804 -190022 -357129 -392968 -88964 -93270 159574
11645 -182990 113216 -2976 -334324 -122358 -408095 -305975 -60141 -85339 139241 -36946
11634 -137435 -18268 147017 -389466 -290234 -89412 -4156 -298638 -252144 -97263 -7911 145698
11622 155396 -67638 -24120 -47817 43694 -205153 81120 -57544 -234728 113425 66596 175472
$$ packed form
11703A76834a95352P1651j1923a0020j19242q7667F6422b8440F8286c15034A35144
11691A59967f3507l20883b1366A78465D1205b35335J05208j9781B29178a49644
11680b75940a7212j30184H9106Q8754i820j486r09B4075J48687h5881L113j21044
11668b03812B56611a82228A61883a82890N4432a6170H7941a83439j30175F3925
11657b4243C36196a28172B02469q4880a46804m3218j67107l5839h8964m306A59574
11645a82990A13216b976l31348a22358k85737J02120f0141k5198A39241c6946
11634a37435a8268A47017c89466R9232h9412d156k94482M6494i7263g911A45698
11622A55396f7638b4120k3697D3694b05153H1120e7544j77184A13425m6829J08876
$$ plain form
11611 175472 172876 -286272 102749 149069 -215048 -99332 -94460 -239456 402920 -160954 253481
11599 126351 239283 -1661 -101671 -66278 90017 133327 166321 25610 56464 101728 51444
11588 51444 -110720 -7035 -48675 -83847 -44608 -33891 263037 77971 190710 -127689 -62732
11576 -278348 69185 263029 -185263 -55441 -97709 278411 -44078 28981 325033 322132 -324879
11564 -13052 -104814 -143654 -4068 316221 25225 -92288 -124102 236842 -42571 -7218 -57554 -318019
11552 -318019 4031 207807 118569 151847 -3072 -65304 -22824 -160626 93891 -79054 148744
11540 -30870 -114579 -109996 -201051 -261393 -204000 212011 134549 121381 -46389 156399 168967
11529 168967 -213186 150420 9372 -31519 -316419 52346 -113903 -97846 -19159 42184 205248
$$ packed form
11611A75472k596b86272A02749M6320b15048i9332M872j44996D02920a60954B53481
11599A26351J12932a661j00010L5393I0017M3310L2994B5610L0854M5264n0284
11588E1444a10720g035m1640l5172L9239J0717B63037G7971J12739a27689f2732
11576b78348F9185J93844a85263e5441m2268B78411d4078B8981K96052k901c24879
11564a3052r1762l8840d068C16221B5225i2288l1814B36842d2571g218n0336k60465
11552c18019D031K03776q9238L3278c072o2232b2824j37802I3891g9054A48744
11540c0870q3709M583r1055o0342N7393B12011p7462j3168d6389A56399J2568
11529A68967b13186A50420I372c1519k84900E2346a13903J6057a9159D2184J63064
$$ plain form
11518 205248 109915 -116118 289170 -186978 -64074 153078 60234 529195 -159810 -239377
11508 -239377 16144 21005 158718 56102 22129 175839 76692 588262 -57726 208564 139696
11497 139696 268431 429856 -36376 -259846 283115 384817 32853 247571 -21785 314858
11486 47526 73589 -213528 49879 -12486 71256 142821 228924 137120 326278 31337 103499
11475 103499 -83402 24226 85259 192743 -65884 232934 -27041 -113595 643128 -9894 52312
11463 504893 282763 188005 286008 252653 -150509 373769 416618 -201884 37032 30568 317796
11452 317796 -351766 -126587 46807 298772 381842 236715 224145 -2283 171756 -57131 205537
11440 -29320 -90198 193748 80871 -111925 158080 239584 -9558 374078 27602 178596 -192781
$$ packed form
11518B05248r5333a16118B89170a86978f4074A53078F0234M68961a59810p9567
11508b39377A6144M861J37713E6102B2129J53710G6692N11570e7726B08564o8868
11497A39696J28735J61425c6376k23470B83115J01702C2853K14718b1785C14858
11486D7526K6063b13528D9879a2486G1256P1565Q6103r1804J89158C1337P2162
11475A03499h3402B4226O1033J07484f5884B32934b7041q6554F43128i894E2312
11463E04893k22130r4758R8003l3355a50509C73769M2849b01884C7032o464K87228
11452C17796c51766a26587D6807K51965Q3070j45127j2570b283A71756e7131B05537
11440b9320o0878A93748H0871a11925A58080Q1504i558C74078B7602J50994a92781
$$ plain form
11428 35914 108622 128732 125348 276916 -16415 108895 -183590 324149 -420088 39034 -214437
11416 -19246 137625 9438 22122 27061 227948 -84991 10740 -131993 -134893 31672 136173
11405 136173 -116411 -94341 74169 174533 80472 -81442 -53170 -13580 -200017 -88682 329887
11393 -57836 -228742 -49764 6997 -88914 71128 -323721 128910 334262 -71812 -142524 -230268
11382 -230268 -203151 144549 76105 -77102 219734 -284810 -70435 35469 -143911 -120274 -230167
11371 -230167 -134983 -206438 56611 -45221 174608 32127 -365369 -59341 43199 15607 -33110
11359 207435 -73784 -60042 -131725 -115519 210777 357397 205004 -8645 -318075 -179997 -128102
11348 -128102 -205063 -28296 81086 152091 -78214 -129358 265174 -197199 150111 -67349 -122589
$$ packed form
11428C5914P2708K0110l384J51568a6415A08895a83590C24149d20088C9034b14437
11416a9246A37625I438J2684M939K00887h4991A0740a31993k900C1672J04501
11405A36173a16411K2070G4169J00364H0472h1442K8272a3580j86437h8682C29887
11393e7836j70906d9764F997h8914G1128c23721A28910K05352g1812p0712q7744
11382b30268K7117A44549o8444g7102B19734b84810g0435C5469a43911K3637j09893
11371b30167R5184p1455E6611d5221A74608C2127c65369e9341D3199A5607c3110
11359B07435g3784J3742p1683J6206B10777J46620j52393h645l09430J38078N1895
11348a28102p6961b8296H1086P1005g8214n1144B65174a97199A50111f7349n5240
$$ plain form
11337 -122589 -44527 -159113 -195440 -85465 -129445 -262622 48310 244280 120827 84904 127212
11326 127212 226180 14581 -20114 216892 435923 127936 -113650 8897 115284 -224252
11315 -338516 145243 -94989 -5354 56025 -33104 -24161 -432693 154833 5402 147945 28086
11303 -196020 76734 7912 -173107 -40300 148480 71598 -115223 53160 377389 17105 -60862
11291 66679 116935 236880 -265530 -21934 -150712 -291778 -156948 147688 98694 -242246
11280 128401 -49209 -221833 -53177 -67559 -172649 172831 -68123 -67053 -17514 210746 5331
11268 -43387 -92559 57152 -160647 52637 263506 -85873 -48302 -67247 177105 -20939 301384
11256 20856 249761 -137083 -96414 -209982 -330555 -66240 -277460 90437 48780 -238561
$$ packed form
11337a22589d4527j14586l6327h5465m3980j33177D8310J95970A20827l5923M2308
11326A27212R8968A4581b0114B16892K19031A27936a13650H897J06387b24252
11315c38516A45243i4989e354E6025c3104Q943m08532A54833E402J42543B8086
11303a96020G6734G912a73107d0300A48480G1598a15223E3160L24229A7105f0862
11291F6679N0256J19945b65530b1934j28778j41066J34830A47688m8994b42246
11280A28401d9209j72624e3177j4382j05090A72831f8123J070a7514B10746E331
11268d3387m9172E7152a60647E2637K10869h5873L7571j8945A77105b0939C01384
11256B0856K28905a37083M0669j13568j20573f6240k11220I0437m1657b38561
$$ plain form
11245 26357 220502 -130711 41120 -298289 133993 -341307 27762 -205155 -86839 -50732
11235 -50732 -47065 -292456 -315294 -144512 17545 243541 -44791 -33908 -173833 -141197 133957
11223 -18044 -67483 313735 40009 -13814 -58024 -192489 -29495 56461 -268260 5300 138413
11212 138413 -148885 192318 9079 84200 -115981 -24223 -141842 192216 10147 -222319
11201 19969 324518 -112161 -44807 80007 -84107 48858 313810 -39329 -242507 45805 -210303
11189 -219984 -23232 -11353 -97649 -4217 -75715 100971 -300155 95447 -196085 43542 297380
11178 297380 -24418 -85864 193003 -105001 -110697 -23103 4302 137931 -113642 -194430 224138
11166 -222413 -232657 1728 21341 -306783 39386 187491 267888 -122584 -252248 101285 -144002
$$ packed form
11245B6357J94145a30711D1120b98289A33993c41307B7762b05155h6839L6107
11235e0732L667k45391k2838a44512A7545K25996d4791J0883j39925L2636A33957
11223a8044m9439C13735D0009a3814m4210j34465b9495E6461b68260E300J33113
11212A38413a48885A92318I079P5121a15981b4223j17619A92216A0147b22319
11201A9969L04549a12161d4807H0007h4107D8858K64952c9329k03178D5805b10303
11189b19984b3232a1353q6296d217p1498A00971c00155I5447a96085D3542K53838
11178B97380b4418o1446A93003a05001n696b3103D302J33629a13642q0788B24138
11166b22413j0244A728J9613c06783C9386J48105Q0397a22584j29664A01285a44002
$$ plain form
11154 -83451 127459 68885 -109348 41048 -178259 -292024 -161026 -87071 100947 -153893
11143 10791 -316164 -160487 -91962 117642 -68438 -109097 -96884 156621 180529 -248823 28233
11131 -275075 143850 -107589 -125105 453496 380372 2948 -1051 -133690 -3784 335354 -81421
11119 -171999 138372 8281 132379 126195 176611 303163 107386 -143605 -99172 -266625 408454
11107 -134908 231144 235960 50894 -6510 157766 -214851 220918 -108404 -562196 945 179109
11096 179109 254632 221217 -185714 -248932 359759 327315 79 -128621 124577 350042 -71643
11084 -14744 155608 -371716 -103050 275391 172214 89608 138256 327521 254447 311029
11074 311029 157211 113906 -283285 92410 88598 184169 89517 401073 314158 171885 252563
$$ packed form
11154h3451A27459n8574a09348D1048a78259j13765J30998P3955A00947a53893
11143A0791c16164J55677O8525A17642f8438m0659J2213A56621K3908b48823B8233
11131b75075A43850a07589j7516D53496p3124B948a051j32639c784C35354h1421
11119a71999A38372H281J24098o184N0416J26552A07386a43605M4433j67453D08454
11107a34908B31144M816E0894f510A57766b14851B20918a08404m53792I45J78164
11096A79109P5523l3415a85714o3218C59759l2444G9a28621A24577K25465g1643
11084a4744A55608c71716a03050B75391j03177q2606M8648J89265p3074N6582
11074C11029j53818m3305b83285I2410l812R5571H9517L11556q6915j42273Q0678
$$ plain form
11063 252563 403749 319248 98197 345773 -125194 414450 251770 101999 38856 -137154
11052 260628 39580 157751 371754 218324 412642 495713 407320 688479 633314 558737
11042 558737 -57961 475295 230497 784924 632624 677233 516846 734785 783631 784360 634119
11031 634119 702048 545912 814083 495866 923572 965447 564320 813138 808948 810830 515495
11020 515495 765062 788874 958787 802950 735749 624628 662987 872386 490490 466573
11010 466573 439071 624093 723446 712305 655163 765886 678658 554959 563197 531204 477018
10999 477018 564685 864930 723828 515794 638951 742775 815684 710809 473506 688025
10989 688025 593053 484360 704105 814875 507345 388752 616218 689150 811484 867238
$$ packed form
11063B52563J51186q4501I8197K47576a25194D14450j62680A01999C8856a37154
11052B60628C9580J18171K14003j53430J94318Q3071q8393K81159n5165p4577
11042E58737e7961D75295B30497N54427j52300M4609j60387K17939M8846P29j50241
11031F34119O7929j56136K68171l18217M27706M1875m01127K48818m190J882k95335
11020E15495K49567K3812J69913j55837o7201j11121L8359K09399l81896k3917
11010D66573k7502J85022R9353j1141n7142J10723q7228j23699Q238l1993n4186
10999D77018Q7667L00245j41102k08034J23157J03824P2909j04875k37303K14519
10989F88025r4972j08693K19745J10770l07530j18593K27466P2932J22334N5754
$$ plain form
10979 867238 375084 768302 548552 533495 767789 1083523 841771 1031489 1198546 735798
10969 735798 1025188 951423 1192513 1209472 1453981 1519528 1871097 1617488 1914929 2358304
10959 2358304 2674931 2453157 3002669 3317725 2842601 2684776 2930194 2676453 2532739
10950 2532739 2041264 1700880 1839597 1402693 995437 1350592 1038277 1292777 1225902 899150
10940 899150 1176453 748091 758662 688323 600561 463589 69570 504331 433186 111415
10929 -112722 244695 100882 48152 233582 -122692 30036 278373 514477 -10766 -46790
10919 -46790 199454 102759 178300 -55830 229147 86762 -178676 -86471 148609 96790 -54646
10907 -77501 -204877 -21874 -82665 32348 45845 -154093 69606 -22873 80147 45380 123825
$$ packed form
10979H67238C75084L93218k19750j5057K34294L15734k41752J89718J67057m62748
10969G35798K89390p3765K41090J6959K44509O5547L51569k53609K97441M43375
10959B358304L16627k21774N49512L15056m75124j57825K45418k53741j43714
10950B532739m91475l40384J38717m36904m07256L55155l12315K54500o6875l26752
10940H99150K77303m28362J0571p0339q7762j36972F9570M34761p1145A11415
10929a12722B44695A00882D8152J85430a22692C0036K48337K36104a0766l6024
10919d6790A99454r6695P5541e5830B29147H6762a78676h6471A48609n1819e4646
10907g7501j27376b1874o0791C2348J3497a54093F9606b2873H0147l4767P8445
$$ plain form
10896 123825 -52224 -283326 -144237 79239 -134553 -242111 44533 -27890 -186649 58934
10885 -43150 108524 -29324 -38770 117989 12172 -162290 -83844 -359219 166130 -93726 55870
10873 138240 30819 304174 68021 128293 -187879 115309 -48938 -289650 -88020 101720
10862 44667 122252 -439539 235388 -229561 103711 -215609 69002 -2381 -175300 -31772 146643
10850 -248386 23026 113416 -295177 -7318 -398071 -33375 274396 -49981 -165042 -98988 -75718
10839 -75718 -111637 135234 -150834 -128155 -104979 -57871 -60465 27799 -153968 44539 123503
10828 123503 57491 22460 -31759 55868 296515 278527 367038 -75048 95318 -70266 -3796
10816 141135 93849 68576 63129 114859 -132074 81460 101215 -6060 67654 216364 99338
$$ packed form
10896A23825e2224k31102J39089G9239a34553j07558D4533b7890j58759E8934
10885d3150A08524b9324r446A17989A2172a62290P8446k75375A66130i3726E5870
10873A38240C0819K73355F8021O0272a87879A15309d8938k40712h8020A01720
10862D4667P7585d39539B35388b29561A03711b15609F9002b381j72919c1772A46643
10850b48386B3026R0390b95177g318l90753c3375B74396d9981j15061O6054K3270
10839g5718l5919A35234a50834K2679K3176M7108k594B7799a53968D4539P8964
10828A23503E7491B2460c1759E5868K40647j7988Q8511g5048I5318g0266c796
10816A41135m7286k5273n447N1730a32074H1460J9755f060F7654J48710I9338
$$ plain form
10804 218771 -193943 -110052 -292424 -48982 58880 66878 -143487 129558 -62034 -163221 47875
10792 41315 -81859 16379 -10925 15544 -179996 -380654 -145244 265464 100223 -9850 -250338
10781 -250338 42712 -80116 223751 -52976 271967 -63024 105728 -120625 -133785 275438
10770 -18684 -274724 -78372 -202032 -98335 70206 -102835 -134013 87636 -76452 134266 77018
10759 77018 49493 80308 40377 -391634 221889 -51382 58124 133152 -68514 -195017 -96528
10747 -122406 -124875 41884 98661 -230044 -35792 310472 -87663 -275138 -358629 371546 56439
10735 -37511 -271441 41374 5142 -33392 -120669 -131084 -54788 335450 -434530 230065 35632
10723 126167 -74312 212345 78910 228644 -23738 -170172 -205195 145195 14196 -432921
$$ packed form
10804B18771a93943Q3891j82372d8982E8880P998a43487A29558f2034j01187D7875
10792D1315h1859A6379a0925A5544a79996k00658a45244B65464A00223i850k40488
10781b50338D2712h0116B23751e2976B71967f3024A05728a20625j3160B75438
10770a8684k56040g8372j23660i8335G0206a02835l1178H7636g6452A34266n7248
10759G7018k7525L0815l9931c91634B21889e1382E8124P5028f8514j26503i6528
10747a22406k469D1884N6777b30044c5792C10472h7663j87475q3491C71546E6439
10735c7511k33930D1374E142c3392q7277j0415e4788C35450d34530B30065C5632
10723A26167g4312B12345G8910J49734b3738j46434l5023A45195A4196d32921
$$ plain form
10712 429471 -122725 -126418 -326493 203923 -55386 -227441 -82162 -154952 117682 -131419
10701 -267682 120782 -71271 -198778 79462 -55755 -242281 -199794 -251228 69116 -434122 -38544
10689 71909 81158 239813 -74507 -65284 -49915 212254 -81718 150078 -114291 308612 14042
10677 151565 -35396 -196090 168831 205134 -116095 -397264 171372 73459 233192 196485
10667 196485 112629 -236020 -126274 -171145 218426 -268611 -52558 -222831 -12398 11484
10656 -137020 40507 -57540 411441 120659 -43221 -110920 -302059 -265928 -341224 37239 190016
10645 190016 -64417 77075 -178630 134612 -31678 46244 -196081 -305121 76858 -307645
10634 -408734 -143407 -10338 -72990 -84830 129028 -366457 -115036 232577 1580 -195715
$$ packed form
10712D29471a22725l693k00075B03923e5386j72055h2162p2790A17682a31419
10701b67682A20782g1271j27507G9462e5755j86526M2487n1434F9116d34122c8544
10689G1909R249J58655g4507R223J5369B12254h1718A50078a14291C08612A4042
10677A51565c5396j60694A68831L6303a16095k81169A71372G3459J59733l6707
10667A96485q3856b36020J09746m4871B18426b68611e2558j70273a2398A1484
10656a37020D0507e7540D11441A20659d3221o7699j91139L6131p5296C7239J52777
10645A90016f4417G7075a78630A34612c1678D6244a96081j09040G6858c07645
10634d08734a43407a0338o2652j1840A29028c66457a15036B32577A580a95715
$$ plain form
10623 -140383 84323 80631 -27278 64191 -22483 -11481 -50069 -276446 -195996 -377405 166567
10611 341780 86477 -138720 184825 -102341 -90291 -266783 -39270 107154 -290943 68845
10600 -131668 -31252 -186121 -148109 -186919 278269 -93990 -146677 -101713 168982 -259245 30508
10588 -190660 1953 161260 -40463 441744 -325004 -5246 159607 -24232 36600 251633 133975
10577 133975 110451 -209347 -81551 -252225 113339 7192 -128533 -10676 -314692 184453
10566 64396 3391 -312423 -67905 -381118 -23874 97962 -79713 -273044 -204091 -183214 81459
10554 26970 -114507 -37552 -217309 -294381 -114398 15549 -4954 -88008 -23627 -72768 -13699
10542 -76036 -308897 -200185 -66222 -34248 -173149 89658 331720 162343 -204852 -179496
$$ packed form
10623a40383H4323l692b7278F4191b2483J1002l8588k26377Q0450j81409A66567
10611C41780H6477a38720A84825a02341J2050j76492c9270A07154b90943F8845
10600a31668c1252j54869L8012l8810B78269i3990n2687M4964A68982b59245C0508
10588a90660A953J59307d0463D41744c25004e246A59607b4232C6600K15033j17658
10577A33975k3524b09347h1551j70674A13339G192a28533a0676l04016A84453
10566F4396C391c12423f7905l13213b3874I7962g9713j93331O8953K0877H1459
10554B6970a14507c7552j79757p7072a14398A5549d954q3054b3627m9141a3699
10542g6036k32861J08712f6222L1974j38901H9658K42062A62343b04852K5356
$$ plain form
10532 -179496 -137083 61952 -94580 127891 126403 185879 -134692 -17601 77315 -36039 -57418
10521 -57418 80004 -127687 -118503 117075 -11495 -410144 -55603 -140838 -169965 53870 -141554
10509 48179 186080 -18806 182118 -37086 100782 -257936 -71019 -28132 -77295 -154612 108325
10497 -12928 439 -1675 -55786 63094 -187576 -365579 -209696 122347 125449 -143218 48872
10485 -176997 -13976 132379 143865 209945 224753 -110804 -103295 -203596 -7513 10916 -7102
10473 -74552 82761 -89761 167404 -109954 180081 155202 -39650 -232510 -66993 -3711 -17816
10462 -17816 -124456 -124671 136541 -55570 -103146 -227961 -254226 175445 -494406 -58039 -263015
10451 -263015 18341 -258335 78431 -3789 203195 -227351 -112654 172943 -115010 -259676
$$ packed form
10532a79496M2413F1952i4580A27891j488N9476a34692a7601G7315c6039k1379
10521e7418H0004a27687R184A17075a1495l98649e5603q5235k9127E3870a41554
10509D8179J37901a8806A82118c7086A00782b57936g1019b8132m9163p7317A08325
10497a2928D39a675n4111F3094a87576j78003J55883A22347L102a43218D8872
10485a76997a3976A32379J1486O6080J4808a10804P509j00301g513A0916g102
10473g4552H2761h9761A67404a09954A80081k4879c9650j92860f6993c711j4105
10462a7816j06640k15A36541e5570m7576j24815k6265A75445d94406e8039k04976
10451b63015A8341b58335G8431c789B03195b27351a12654A72943a15010j44666
$$ plain form
10441 -259676 -71118 -33528 85572 -294612 352275 153826 -140372 175563 10710 27812
10431 27812 1338 -214618 -280137 -53573 -445183 107193 -54611 134289 333758 -457 -238485
10420 -238485 217060 76243 255585 -60644 159153 -78553 -212668 238995 -122096 7083
10409 498745 49766 -222780 -246868 77420 69225 -10960 153877 -263131 34952 -30013 210903
10397 -115819 -56596 -123267 -26805 205698 73812 -232112 -79845 -165048 39564 239377 -191871
10385 -112490 45774 225471 274224 131443 353895 293189 -105544 39950 371176 105718
10374 181514 -63951 60130 123036 86965 -54 77729 104278 177723 -82315 -95208 -46272 75692
10361 -20429 417188 93143 232915 113033 -7187 623629 105263 498338 314855 178605
$$ packed form
10441b59676g1118c3528H5572b94612C52275A53826a40372A75563A0710J7102
10431B7812A338b14618o5519e3573l91610A07193e4611A34289J99469d57k38028
10420b38485B17060G6243J79342f0644A59153g8553j34115B38995a22096G083
10409D98745D9766b22780k4088G7420q195a0960A53877b63131C4952c0013B10903
10397a15819e6596o6671b6805B05698G3812b32112g9845q5203C9564J99813a91871
10385a12490D5774J79697M8753A31443K22452o0706a05544C9950L31226A05718
10374A81514f3951F0130O2906l6071e4G7729K6549P3445h2315j2893d6272G5692
10361b0429D17188I3143J39772A13033g187F23629A05263L93075j83483j36250
$$ plain form
10351 178605 332071 416990 481136 392236 280582 179779 266895 19516 282183 246219 230809
10340 230809 13661 627449 408043 324867 392185 467081 611715 315018 380424 177396
10329 309009 354773 403568 84479 237578 251838 108325 237405 159940 225340 -51470 126131
10317 224040 121423 266057 150381 128137 -84887 107531 250972 -6462 360221 150157
10306 287393 -15035 82798 75293 -2411 443946 187444 -383 -12344 165895 -350588 -76477
10294 111315 32823 68692 -100196 221920 102437 -39306 -170556 34969 -275207 -1820 111459
10282 -322045 -307828 -326521 -148233 -28811 -233163 -248761 -13436 -92790 -70601 -82548 -105251
10271 -105251 -187287 -26607 44327 13702 368051 -77245 63890 -17993 -51311 57904 -327137
$$ packed form
10351A78605J53466Q4919O4146q8900j11654j00803Q7116A9516K62667l5964j5410
10340B30809A3661O13788k19406q3176O7318P4896J44634k96697O5406A77396
10329C09009M5764M8795H4479J53099J4260A08325J29080p7465O5400e1470A26131
10317B24040j02617J44634j15676k2244h4887A07531J43441f462C60221A50157
10306B87393a5035H2798p505b411D43946A87444c83j1961A65895c50588g6477
10294A11315C2823L5869a00196B21920A02437c9306j31250C4969b75207a820A11459
10282c22045J4217j8693a48233b8811k04352j5598a3436p9354K2189j1947k2703
10271a05251q2036b6607D4327A3702L54349g7245F3890a7993l3318E7904c27137
$$ plain form
10259 135922 319133 -159435 53934 120094 -147137 -304127 36168 18949 172995 36780
10248 -150481 -36945 -207136 42291 122137 352944 -176717 209864 -80844 314372 -5765 -16706
10237 -16706 219010 115832 366262 -10772 275180 130101 -172661 -354407 8485 174498
10227 174498 389121 376884 -411904 26271 341829 14252 -33883 110336 -59893 -50529 68162
10215 -247555 -204021 -187744 -226829 -238729 134173 -43089 -228445 -72346 -229560 -364778 -77670
10203 209225 240738 275145 -31770 -226184 95635 224340 3837 131081 -190435 105937 -4504
10191 -21769 83720 -93301 226388 -257812 -125492 74668 -197602 -149862 -172579 -9866 112938
10179 -23584 194206 -176156 -291200 58049 -68020 -310620 -43150 -157350 -449840 6933 -56456
$$ packed form
10259A35922J83211a59435E3934O6160a47137j56990C6168j7219J54046C6780
10248a50481c6945j70191D2291P9846K30807a76717B09864h0844C14372e765j0941
10237a6706B19010j03178K50430a0772B75180A30101a72661j81746H485J66013
10227A74498K14623j2237d11904B6271L15558A4252c3883A10336e9893R364F8162
10215b47555M3534J6277l9085j1900A34173d3089j85356g2346j57214j35218g7670
10203B09225L1513L4407c1770j94414I5635J28705C837J27244a90435A05937d504
10191b1769H3720i3301B26388b57812a25492G4668a97602M7740k2717i866A12938
10179b3584A94206a76156j15044E8049f8020k42600d3150j14200k92490F933e6456
$$ plain form
10167 -263896 -91616 -154799 -23116 -66495 132821 156107 -24986 64075 -203978 9164 290871
10156 290871 -125820 -260781 284167 -46355 144095 -77282 -367113 151541 176439 -122000
10145 -191940 -310464 62319 25651 94116 -105208 182047 -130958 63571 111431 30860 86553
10134 86553 -16720 -421576 32102 142252 -193796 20884 -112514 266197 109676 -36399
10123 -241352 40523 -400802 -166550 83051 121779 -179280 -387465 19192 -361680 -90920
10112 -82255 -104204 67294 -356945 -155855 178799 62176 120003 10941 -183953 -231714 -302329
10101 -302329 -121536 -83918 99514 -125586 -217093 -36321 -234468 -181383 -106552 -296267 -3545
10089 29170 -152602 -33172 -54332 -144743 125025 -219975 132061 182941 -64516 -15947 -199882
$$ packed form
10167b63896i1616o3183b3116m3379A32821K3286b4986F4075b03978I164K81707
10156B90871a25820j34961B84167d6355A44095g7282k89831A51541K4898a22000
10145a91940j18524F2319B5651O8465a05208A82047a30958F3571M7860C0860N5693
10134H6553a6720m04856C2102J10150a93796B0884a12514B66197A09676c6399
10123b41352D0523d00802a66550H3051L8728a79280k08185A9192c61680i0920
10112h2255k1949F7294c56945a55855A78799F2176N7827A0941a83953m7761p0615
10101c02329a21536L7618I9514a25586r1507c6321j98147N3085P4831j89715c545
10089B9170a52602c3172k1160r0411A25025b19975A32061N0880f4516a5947j83935
$$ plain form
10078 -199882 -353086 -372776 33503 20299 -72384 -234902 23204 -197706 -4783 -58110 -79020
10067 -79020 -319712 263557 265272 -44483 110110 -50582 -30184 39818 -262680 -111317 -197607
10056 -197607 -23307 -105403 -110835 -291580 -58326 30555 -59467 -129221 -206110 129778 -4300
10044 -133576 -137690 -52951 -373234 54927 -190952 -45390 -239064 -8413 -50667 146424 68959
10032 -16134 -67619 -95298 -225921 -707114 141344 -230551 -77248 -161067 153190 -357236
10021 -235566 -181162 203634 -189937 378569 -26871 -235237 -183080 -230453 -426723 -104003
10010 -25554 -125853 -60174 -237097 40827 84378 -136230 -236416 -113981 -60435 -168734
10000 -168734 -315794 -72248 330787 -17526 -7239 161467 -131638 -451862 132629 138586 -29585
$$ packed form
10078a99882j53204j9690C3503j3204g2384j62518B3204a97706d783n3327k0910
10067g9020k40692B63557J715d4483A10110e0582K0398C9818b62680a11317q6290
10056a97607b3307q2096n432j80745e8326C0555e9467o9754p6889A29778d300
10044a33576m114e2951l20283E4927a90952d5390j93674h413m2254A46424F8959
10032a6134n1485k7679j30623m81193A41344b30551g7248q3819A53190c57236
10021b35566N4404B03634a89937C78569b6871k08366N2157m7373j96270a04003
10010b5554j00299f0174j76923D0827M3551a36230j00186a13981N3546j08299
10000a68734j47060g2248C30787a7526g239A61467a31638l20224A32629N957b9585
$$ plain form
9988 12312 -142944 4760 -50829 -58903 105709 79400 -254027 -62165 14372 -149994 -237034
9977 -237034 72252 -139056 15242 -130824 -5065 139834 -298950 69832 47678 -179168 -270200
9966 -270200 -110535 5716 -273350 118739 -228507 -266867 -135179 -15308 110211 -75517 27809
9954 -234006 -270639 -228730 108681 -245744 -13626 -218512 -210969 -111538 -211820 -40543 33976
9942 239660 44972 -258778 45631 -53376 101508 -173047 7986 -190928 -2260 85736 117114
9931 117114 189312 -25052 -349585 -268694 -226642 178222 69454 -302359 253715 188 23628
9920 23628 -83974 -151298 62798 27357 -78924 -100132 -71573 68287 -242367 -295802 -442437
9909 -442437 135663 92824 245432 -253451 -265016 2395 -38650 8296 -31013 80965 -213782
$$ packed form
9988A2312a42944D760e0829q074A05709k6309b54027f2165A4372a49994q7040
9977b37034G2252a39056A5242a30824e065A39834b98950F9832k2154a79168r1032
9966b70200a10535E716b73350A18739b28507l8360J31688a5308A10211g5517B7809
9954b34006l6633M1909A08681b45744a3626k04886P543R9431j00282d0543C3976
9942B39660D4972b58778D5631e3376A01508a73047G986a90928b260H5736L1378
9931A17114P2198b5052l24533Q0891M2052A78222F9454c02359B53715A88K3440
9920B3628h3974o7324F2798B7357g8924k1208K8559F8287b42367n3435j46635
9909d42437A35663m2839J52608b53451j1565B395c8650H296c1013H0965b13782
$$ plain form
9897 53544 -379485 113790 -194055 -9576 145793 -283200 -288100 -208254 -152786 53587 -149242
9885 -210375 -121178 -201330 -62134 -3367 -4663 38952 -75991 -65306 -257134 -222575 -109707 58218
9872 -107248 -165406 -197786 -45824 263702 -16225 112705 -311752 -66440 22741 -490664 -82461
9860 -313150 -184919 95699 -93261 164272 12143 -49944 198179 -243187 -94795 -55490 -17143
9848 9211 217238 -308020 -262353 -59542 174278 -13068 -37235 26186 -26580 -306884 -57122
9836 -288459 -33591 -208379 -168880 -152685 -148743 52203 -91779 -371769 244661 -222373 -68866
9824 -46321 -103477 48282 -426762 -5684 167736 -217792 -9866 113544 -261526 -335865 -170398
9813 -170398 -256821 -143063 -16841 117065 30839 31028 -164922 52040 210516 -202471 -23237
$$ packed form
9897E3544c79485A13790a94055i576A45793b83200m900P9846N5468E3587a49242
9885b10375Q9197q0152f2134c367j296C8952g5991J0685j91828L4559a09707E8218
9872a07248n8158l2380d5824B63702a6225A12705c11752f6440B2741d90664h2461
9860c13150J28231I5699i3261A64272A2143d9944A98179b43187i4795L9305a7143
9848I211K08027c08020M5667e9542A74278a3068k4167B6186b6580k80304e7122
9836b88459c3591j74788L9499J6195L942E2203i1779k79990B44661b22373f8866
9824d6321n7156D8282d26762e684A67736b17792i866A13544b61526p4339J65467
9813a70398q6423J13758a6841A17065C0839J89a64922E2040J58476b02471b3237
$$ plain form
9801 -12361 351251 15905 225238 95920 228997 115234 -98542 -198387 -77371 -11657 -311016
9790 -311016 -181538 -323081 296852 61982 79244 238252 170305 59976 -102007 146660
9779 63604 -197953 -186331 -124874 -31803 -129465 38599 -2336 -236479 -251034 -385335 -13764
9767 -219310 -197661 -127358 104407 32877 4401 26175 197544 -55307 82397 96872 135279
9756 135279 76113 -29422 -309136 -49075 -389726 -107618 -154962 -152740 -243588 -206155 102143
9744 -34891 -153405 26492 -55828 -21927 -4396 -166257 -180164 173734 -43895 -11278 -40350
9733 -40350 -60247 -325902 -216671 -24010 -142850 56452 310294 277095 39334 168727 -210847
9721 70803 147969 29198 -123258 -161799 -33090 -117949 18541 -124676 -76565 -33903 -156008
$$ packed form
9801a2361C51251A5905K09333I5920J33077j13763i8542r9845g7371a1657k99359
9790c11016J29478j41543B96852F1982J7262J59008o7947E9976a02007A46660
9779F3604a97953J1622O1457c1803r7662C8599b336k34143j4555j34301a3764
9767b19310K1649P0303A04407C2877D401K1774J71369e5307H2397J4475L8407
9756A35279n9166b9422k79714d9075l40651a07618m7344K222r0848L7433A02143
9744c4891j18514B6492e5828b1927d396j61861j3907A73734d3895a1278k9072
9733d0350j9897k65655J09231b4010j18840E6452K53842l3199C9334J29393b10847
9721G0803P7166B9198a23258l8541c3090q4859A8541a24676M8111c3903j22105
$$ plain form
9710 -156008 -258535 -257874 33476 -43638 147851 21832 264788 -178572 168423 -158798 204712
9698 -181506 153809 81524 45966 -200616 -238040 -133176 -436118 122569 -67926 169508
9687 208029 -197899 -234126 106171 -20000 81292 -151681 275628 -313148 -176070 -95661
9677 -95661 -73156 -185478 -20799 -181399 -20643 -157632 218723 -154935 60933 239962 -157478
9665 64138 -275574 -355329 -29458 -70871 142163 206909 -263000 -130795 -147516 -213851 163041
9653 74507 -300534 -130305 -162255 424964 -156768 135960 -77243 -318049 -31890 -15142 -150659
9642 -150659 -78993 -125039 187507 231552 -202788 -5358 -146026 45201 -90856 59679 -28280
9630 168559 -169782 370984 70884 -216888 194408 -128545 87241 223945 31325 -22624
$$ packed form
9710a56008j02527O61C3476d3638A47851B1832K42956a78572A68423a58798B04712
9698a81506A53809p2285l5558b00616l7424J04864l02942A22569f7926A69508
9687B08029a97899l6227A06171b0000H1292a51681B75628c13148J37078Q0409
9677i5661K2505j12322b0799j60600b0643j36989B18723a54935F0933J79029a57478
9665F4138b75574p9755b9458m1413A42163O4746b63000a30795j6721o6335A63041
9653G4507c00534a30305l1950D24964a56768A35960g7243k40806c1890a5142j35517
9642a50659P1666m6046A87507M4045b02788e358j40668D5201i0856E9679b8280
9630A68559a69782C70984G0884b16888A94408a28545H7241J36704C1325b2624
$$ plain form
9619 154177 187770 2095 -278752 -42763 -88254 -314510 -235142 195581 255812 80305 6204
9607 -384168 72467 -273326 -65570 -48839 -199313 -228982 -10511 -218161 8687 -84160 17266
9595 126963 2662 -62681 -164100 -64375 -135704 10916 233887 -442509 -104183 -14727 -332840
9584 -332840 -33122 -173563 36475 100493 -483599 -190083 -113901 -112666 -301213 34866 -59218
9572 -192005 -116203 -217510 39089 84498 -105522 147214 -55423 189263 -161487 -244202 -117404
9560 -49269 117850 -34661 -405624 205958 213760 -112469 -148836 -230926 -43824 -13394 118212
9548 -153528 2956 -25650 -69843 -81047 65279 7201 -70338 32302 29581 -128596 -222105 -212152
9536 -212152 -190046 -316514 116957 117629 37556 -83681 281741 161549 -38077 -109029 -250203
$$ packed form
9619A54177L3593B095b78752d2763m5491k26256P9368A95581O0231H0305F204
9607c84168G2467b73326f5570J6731j50474k9669a0511k07650H687h4160A7266
9595A26963B662f2681j01419f4375p1329A0916K22971d42509a04183a4727l18113
9584c32840c3122j40441C6475O4018d83599a90083P6182J235j88547C4866e9218
9572a92005P5802j01307C9089M5409a05522A47214e5423A89263a61487q2715a17404
9560d9269A17850c4661l70963B05958P802a12469l6367q2090d3824a3394A18212
9548a53528B956b5650m4193j1204F5279G201g0338C2302k721a28596r3509R953
9536b12152K2106j26468A16957O72C7556h3681B81741j20192c8077p0952j41174
$$ plain form
9525 -250203 86667 -135283 -194718 74384 -337157 -226124 -36940 15130 -132197 269531 -289547
9513 -51291 -357637 -311352 -97936 -82266 88710 -14046 49173 197407 -318605 347421 -246321
9501 8592 10444 -64589 -270188 -23505 209535 -57365 -248350 -333185 -63113 35389 -97930 151460
9488 -308438 -362161 -112827 -43644 -12161 -180091 -111497 -101406 -19270 337121 258953 114177
9476 -153917 41248 61659 15825 34729 -214914 4848 -322018 292015 108950 132850 204787
9465 204787 -15883 -81031 -43358 -297953 8012 -52392 -1379 125418 -182307 199926 4090
9453 265521 -10875 9018 -304345 137636 -122060 -34174 96829 126784 -119559 132423 -151874
9441 245203 -139007 -126552 20084 -248213 -53976 -59197 96375 41601 46037 -144739 -144575 -133275
$$ packed form
9525b50203H6667a35283n9435G4384c37157J11033c6940A5130a32197B69531b89547
9513e1291l06346M6285i7936J5670H8710a4046D9173J48234c18605C47421b46321
9501H592J852f4589k05599b3505B09535e7365j90985q4835f3113C5389i7930A51460
9488c08438n3723a12827d3644a2161j67930O8594J0091a9270C37121p8168A14177
9476a53917D1248K0411A5825J8904b14914D848c22018B92015A08950K3900P1937
9465B04787a5883o5148L7673k54595H012e2392a379A25418a82307A99926D090
9453B65521a0875I018c04345A37636a22060c4174I6829K9955a19559A32423a51874
9441B45203a39007J2455B0084b48213e3976n221I6375D1601M436a44739J64J1300
$$ plain form
9429 -133275 21253 -181934 39326 -284282 13716 -353961 -194790 118250 -47335 262382
9418 -250785 -37672 -98514 73795 5146 -130366 21553 100334 -25574 -26758 55528 -61963 -45699
9406 -45699 -45974 -114625 -184272 -401826 -9215 45375 -81983 -291106 -101627 107660 -233871
9394 4924 -111600 75100 -155937 77740 53717 -17734 1827 62120 36365 20784 -334218 -299668
9382 -299668 -168178 -14718 -338301 -20597 -45345 -126395 51418 -390854 -214487 -238373 -121870
9371 -121870 317951 -54265 -81712 299673 -199539 -159845 35599 140248 -232145 114318
9360 -56256 15556 -6163 34084 229477 -124241 343193 -16267 -163074 -328181 145292 141608
9349 141608 -386233 -75409 116677 205825 -90715 33975 -204081 -94744 6525 -474701 35958
$$ packed form
9429a33275B1253a81934C9326b84282A3716c53961J59171A18250d7335B62382
9418b50785c7672o0842G3795E146a30366B1553P8781b5574j184E5528f1963J6264
9406d5699k75o8651o9647k17554i215D5375h1983k09123a01627A07660b33871
9394D924a11600G5100a55937G7740k4023a7734A827O0293k5755j5581c34218L4550
9382b99668J31490a4718l23583b0597k4748q1050E1418c90854J76367k3886J16503
9371a21870C17951e4265k7447B99673a99539L9694C5599J04649b32145A14318
9360e6256A5556f163C4084J95393a24241C43193a6267j46807j65107A45292l684
9349A41608c86233g5409A16677Q9148i0715C3975b04081i4744F525d74701C5958
$$ plain form
9337 -279480 -538010 -2793 -26926 266601 239197 63778 340461 -161458 28310 -47072 -48553
9326 -48553 197209 59804 241618 -211863 52203 -109322 -55139 182826 262075 133359 -124492
9314 -167304 -224437 244323 -189178 155548 126400 -146966 -376514 165686 -101528 17347
9303 -45063 -26220 -238524 168299 210712 -78758 -72205 -147497 -29175 92941 -235039 -503110
9292 -503110 14629 174896 -53626 -119314 35851 -97369 -339176 -310639 -330234 155568 15097
9280 12228 301853 49254 171204 -42807 -54796 -347560 122962 -251734 -449214 213386
9269 76842 181695 229002 82185 -157521 154943 -312975 48487 338726 188309 126763 -329437
9257 -118773 -92276 45979 -255441 -11977 7922 424220 -51402 215013 -126813 -245499 12122
$$ packed form
9337b79480k58530b793k4133B66601k7404F3778K76683a61458B8310d7072j481
9326d8553A97209E9804J81814b11863E2203a09322N4183A82826P9249j28716a24492
9314a67304n7133B44323a89178A55548k9148a46966k29548A65686a01528A7347
9303d5063J8843k12304A68299M2413g8758O553p5292b9175I2941b35039k68071
9292e03110A4629J60267e3626o5688C5851i7369k41807K8537j9595A55568A5097
9280A2228K89625D9254J21950d2807j1989k92764A22962b51734j97480B13386
9269G6842J04853M7307H2185a57521A54943c12975D8487K90239j50417o1546c29437
9257a18773K6497D5979b55441a1977G922M16298e1402B15013a26813j18686A2122
$$ plain form
9245 185 137051 -73975 236843 -48647 -280037 -102646 181517 -252951 -42027 -4948 -195843
9234 -195843 -174222 -43392 96949 -94650 -120008 -220247 118012 -233751 -127618 -45442 128771
9222 -253224 80043 -221081 -117821 -15030 108022 -9714 -170230 63965 1907 226803 52838
9210 -93311 119822 -82204 -155699 31554 -181210 192297 179648 127173 60849 -57174 289182
9198 -175176 152664 -41974 -78517 -217067 -119770 -277840 -83552 -230908 101489 -22978 -139385
9187 -139385 115301 440210 -218719 58745 -98217 -4751 190204 246300 -34083 -45794 -63674
9176 -63674 3336 255647 -10574 -182284 -111037 87429 -104315 132066 101128 -177707 241591
9164 -393894 -10463 -204697 46476 128761 33872 -209537 -4155 -18935 -228226 -39290 -231408
$$ packed form
9245A85J36866g3975B36843d8647k31390a02646A81517b52951d2027d948j90895
9234a95843K1621d3392I6949i4650k5358j00239A18012b33751J06133d5442A28771
9222b53224H0043b21081J03260a5030A08022i714j60516F3965A907K24896E2838
9210i3311A19822h2204p3495C1554a81210A92297j2649n2475F0849e7174B89182
9198a75176A52664d1974l6543j38550R7297j58070h3552j47356A01489b2978j16407
9187a39385A15301L24909b18719E8745i8217d751A90204N6096c4083j1711j7880
9176f3674C336K52311a0574j71710P1247H7429a04315A32066l0938a77707B41591
9164c93894a0463j94234D6476Q2285C3872b09537d155j4780k09291c9290j92118
$$ plain form
9153 -231408 194693 -102666 -276686 -59047 61742 184260 82990 -239348 113526 -13818
9142 -143691 -158624 -204321 -390216 175310 337464 -42881 -260783 -91392 -232058 -182541 -5294
9130 79713 -81431 106263 228402 109148 -340169 -125555 -123708 -132534 50824 11345 51260
9119 51260 12490 -149298 -162063 46335 33418 196957 -143040 223922 -196925 -28269 23381
9107 -151014 69259 61081 -5963 -130083 -72632 -23605 -154635 -209737 -48025 -190508 -360311
9096 -360311 -18214 86247 -165043 52775 -121826 29601 -90913 -173564 -239735 -283660 -400868
9085 -400868 12603 -248627 -337624 154252 -339440 -339208 -219555 -122951 271399 -170331 -119541
9074 -119541 -129922 -111109 -16829 14584 136035 -84363 -153736 -221338 160692 -250024 -50609
$$ packed form
9153b31408A94693a02666j74020e9047F1742J22518H2990b39348A13526a3818
9142a43691j4933m5697j85895A75310J62154d2881k17902i1392j40666M9517e294
9130G9713h1431A06263J22139A09148c40169a25555J847q826E0824A1345L9915
9119E1260A2490a49298j2765D6335j2917J63539a43040B23922a96925b8269B3381
9107a51014F9259q178e963j24120N7451b3605j31030n5102d8025j42483j69803
9096c60311a8214H6247a65043E2775a21826B9601i0913q2651o6171m3925j17208
9085d00868A2603b48627q8997A54252c39440K32J19653R6604B71399a70331N0790
9074a19541j0381J8813a6829A4584J21451h4363o9373o7602A60692b50024e0609
$$ plain form
9062 -168742 232802 137619 133689 -83214 -133366 -216426 -232927 -499864 -217867 -132885 -190441
9051 -190441 -14189 885 -438529 -78451 -148888 -45129 -58037 -270821 -66223 -167793 -97327
9040 -97327 -33905 -220029 -351296 114280 70345 369358 140711 68475 -26420 -319200 -157213
9028 -109400 182476 -94734 47445 -101196 208337 -152348 -13584 -317272 -66055 399965
9017 -134970 183460 261922 22418 -132985 -89102 -12013 -123284 -74269 -27333 69284 -25190
9005 190386 136483 247344 -247932 274146 -345366 288750 -165932 -208968 92054 148657
8995 148657 -341931 -307501 244020 -70708 191931 -119014 -189014 -43765 -77514 -166456 -2922
8983 -231277 32123 254073 -138507 32098 -91064 -36006 -138055 -56434 -15301 -311806 -235328
$$ packed form
9062a68742B32802r5183l930h3214n0152q3060j6501k66937b17867Q4982n7556
9051a90441a4189H85d38529g8451p0437d5129j2908k12784f6223j01570P0466
9040i7327c3905j86124j31267A14280m3935K99013A40711F8475b6420k92780a57213
9028a09400A82476i4734D7445a01196B08337a52348a3584l03688f6055C99965
9017a34970A83460P8462B2418a32985M3883a2013j11271M9015b7333F9284b5190
9005A90386n3903J10861b47932B74146c45366B88750a65932m3036I2054N6603
8995A48657c41931L4430B44020g0708A91931a19014p0000d3765l3749q8942b922
8983b31277C2123K21950a38507C2098i1064c6006j02049e6434a5301k96505P6478
$$ plain form
8972 -235328 22331 -149772 133820 -20302 275806 151046 -381754 -101593 -178018 -382957
8962 -382957 33582 -177743 70568 -45391 -117649 2410 204297 -258546 -84564 -8133 -246868
8951 -246868 -378431 -3249 29632 11913 -113033 106901 85373 -254102 -15312 -223383 218312
8939 -180997 -504239 -14198 -6542 145792 99973 -224586 91132 127627 82018 -236904 5770
8927 -151948 148258 -98961 -75659 -58820 -119354 67478 75183 58823 203449 287356 42805
8915 228467 -89394 19785 343052 270620 540037 732483 1026369 1334688 2705206 5848927
8905 5848927 8777174 4319075 2457929 1351930 504715 574888 138663 411392 231031
8896 231031 252188 367875 197978 89652 77576 244033 229649 -38694 94301 21149 -8896
$$ packed form
8972b35328B2331a49772A33820b0302B75806j24760c81754a01593p6425k04939
8962c82957C3582a77743G0568d5391p2258B410K01887b58546h4564h133k38735
8951b46868j31563c249B9632A1913a13033A06901k1528b54102a5312k08071B18312
8939a80997l23242a4198f542A45792m5819b24586I1132L6495m5609b36904E770
8927a51948A48258i8961K3302J6839o0534F7478P705j6360J44626Q3907D2805
8915B28467h9394A9785L23267p2432K69417J92446K93886L08319J370518L143721
8905E848927K928247D319075j861146j105999E04715P0173A38663K72729j80361
8896B31031K1157J15687j69897H9652j2076J66457j4384c8694I4301B1149h896
$$ plain form
8884 23579 -225565 -212909 9324 120351 -132042 -345280 -110731 -54962 62706 342726 84253
8872 -196165 -307628 110805 -23898 -32724 223686 -128762 -32658 139540 136174 -389080 -13164
8860 -1565 50059 -30853 338739 -219554 58119 194223 -227669 -58655 -158546 -141665 33545
8848 -230143 -424086 -36723 147019 22952 -125018 28853 -132820 22640 7078 122804 128813
8837 128813 82023 -141882 297421 -225648 -241554 415034 20689 -92726 -144502 82276 -161144
$$ packed form
8884B3579b25565J2656I324J11027a32042k13238a10731e4962F2706K80020H4253
8872a96165j11463A10805b3898q826B23686a28762c2658A39540l366c89080a3164
8860a565E0059c0853C38739b19554E8119J36104b27669e8655r9891J6881C3545
8848b30143j93943c6723A47019B2952a25018B8853a32820B2640G078J15726O009
8837A28813m6790a41882B97421b25648j5906D15034B0689i2726n1776H2276a61144
$$ [...]
##END NTUPLES=NMR SPECTRUM
##END=
