
##TITLE=UV1149_M1-1003-1002_6301541_ibaWxrmksL
##JCAMPDX= 6.0         $$ Bruker NMR JCAMP-DX V2.0
##DATA TYPE= NMR SPECTRUM
##DATA CLASS= NTUPLES
##ORIGIN= BRUKER
##OWNER= Administrator
$$ 1.72 TOPSPIN		Version 2.1
$$ 2012-06-06 00:03:59.796 -0500  Administrator@TOPSPIN
$$ Compression mode = diff/dup
##.OBSERVE FREQUENCY= 400.13188235
##.OBSERVE NUCLEUS= ^1H
##.ACQUISITION MODE= SIMULTANEOUS (DQD)
##.ACQUISITION SCHEME= undefined
##.AVERAGES= 64
##.DIGITISER RES= 22
##SPECTROMETER/DATA SYSTEM= spect
##.PULSE SEQUENCE= noesygpps1d.comp
##.SOLVENT NAME= COFFEE_meoh
##.SHIFT REFERENCE= INTERNAL, COFFEE_meoh, 1, 14.96692
##AUDIT TRAIL= $$ (NUMBER, WHEN, WHO, WHERE, PROCESS, VERSION, WHAT)
$$ ##TITLE= Audit trail, TOPSPIN		Version 2.1
$$ ##JCAMPDX= 5.01
$$ ##ORIGIN= Bruker BioSpin GmbH
$$ ##OWNER= Administrator
$$ $$ C:\Bruker\TOPSPIN/data/COFFEE/nmr/UV1149_M1-1003-1002_6301541_ibaWxrmksL/12/pdata/1/auditp.txt
$$ ##AUDIT TRAIL=  $$ (NUMBER, WHEN, WHO, WHERE, PROCESS, VERSION, WHAT)
(   1,<2012-06-06 00:03:54.593 -0500>,<Administrator>,<TOPSPIN>,<go>,<TOPSPIN 2.1>,
      <created by zg
	started at 2012-06-05 23:52:24.359 -0500,
	POWCHK enabled, PULCHK disabled,
       configuration hash MD5:
       D5 CA 7A 23 FE 6B EE E2 50 67 74 61 24 F7 5E 3B
       data hash MD5: 64K
       E5 06 AE 99 73 CA 9F 24 5B 03 6B 59 42 69 9B DE>)
(   2,<2012-06-06 00:03:57.593 -0500>,<Administrator>,<TOPSPIN>,<proc1d>,<TOPSPIN 2.1>,
      <Start of raw data processing
       efp LB = 0.3 FT_mod = 6 PKNL = 1 PHC0 = 0 PHC1 = 0 SI = 128K 
       data hash MD5: 128K
       89 43 51 6A DA 35 28 D2 F7 D2 03 99 73 6D 96 84>)
(   3,<2012-06-06 00:03:58.875 -0500>,<Administrator>,<TOPSPIN>,<proc1d>,<TOPSPIN 2.1>,
      <pk PHC0 = 33.75 PHC1 = 0 
       data hash MD5: 128K
       10 69 94 9C 3C 72 31 FA 2C 2F 86 30 3D 4A F7 1A>)
(   4,<2012-06-06 00:03:59.500 -0500>,<Administrator>,<TOPSPIN>,<proc1d>,<TOPSPIN 2.1>,
      <abs ABSG = 1 
       data hash MD5: 128K
       C8 4B DB 01 69 7A 06 3A BD A4 36 00 2E 8C 22 7B>)
(   5,<2012-06-06 00:03:59.562 -0500>,<Administrator>,<TOPSPIN>,<proc1d>,<TOPSPIN 2.1>,
      <abs ABSG = 2 
       data hash MD5: 128K
       B8 89 5C B6 44 8A E7 EF C5 D7 9B 3D 8B 91 0A FC>)
(   6,<2012-06-06 00:03:59.609 -0500>,<Administrator>,<TOPSPIN>,<proc1d>,<TOPSPIN 2.1>,
      <abs ABSG = 3 
       data hash MD5: 128K
       48 EE A0 98 29 1D 08 1F 5E AD E0 FF B4 94 EA 05>)
(   7,<2012-06-06 00:03:59.671 -0500>,<Administrator>,<TOPSPIN>,<proc1d>,<TOPSPIN 2.1>,
      <abs ABSG = 4 
       data hash MD5: 128K
       50 BB D6 98 2F F3 21 E6 64 00 50 83 8F 12 A6 94>)
(   8,<2012-06-06 00:03:59.718 -0500>,<Administrator>,<TOPSPIN>,<proc1d>,<TOPSPIN 2.1>,
      <abs ABSG = 5 
       data hash MD5: 128K
       0B C8 0D 9B 87 51 2D 0F A0 01 05 AC 41 6F AD 96>)
$$ ##END=
$$ 
$$ $$ hash MD5
$$ $$ 15 35 78 74 63 E2 0C 6C 90 6B 01 AE 0D A9 89 5C
##$RELAX= 
##$RELAX= 
##$RELAX= 
##$RELAX= 
##$RELAX= 
##$RELAX= 
##$RELAX= 
##$RELAX= 
$$ Bruker specific parameters
$$ [...]
##$TP07= 0
##$TPNAME0= <>
##$TPNAME1= <>
##$TPNAME2= <>
##$TPNAME3= <>
##$TPNAME4= <>
##$TPNAME5= <>
##$TPNAME6= <>
##$TPNAME7= <>
##$TPOAL= (0..7)
0.5 0.5 0.5 0.5 0.5 0.5 0.5 0.5
##$TPOFFS= (0..7)
0 0 0 0 0 0 0 0
##$TUNHIN= 0
##$TUNHOUT= 0
##$TUNXOUT= 0
##$USERA1= <user>
##$USERA2= <user>
##$USERA3= <user>
##$USERA4= <user>
##$USERA5= <user>
##$V9= 5
##$VALIST= <valist>
##$VCLIST= <CCCCCCCCCCCCCCC>
##$VD= 0
##$VDLIST= <DDDDDDDDDDDDDDD>
##$VPLIST= <PPPPPPPPPPPPPPP>
##$VTLIST= <TTTTTTTTTTTTTTT>
##$WBST= 2048
##$WBSW= 25
##$XGAIN= (0..3)
0 0 0 0
##$XL= 0
##$YL= 0
##$YMAX_a= 9494560
##$YMIN_a= -6063669
##$ZGOPTNS= <>
##$ZL1= 120
##$ZL2= 120
##$ZL3= 120
##$ZL4= 120
##$ABSF1= 14.96692
##$ABSF2= -5.58561
##$ABSG= 5
##$ABSL= 3
##$ALPHA= 0
##$AQORDER= 0
##$ASSFAC= 0
##$ASSFACI= 0
##$ASSFACX= 0
##$ASSWID= 0
##$AUNMP= <proc_prof1d_extract.lims>
##$AXLEFT= 0
##$AXNAME= <>
##$AXNUC= <1H>
##$AXRIGHT= 0
##$AXTYPE= 0
##$AXUNIT= <>
##$AZFE= 0.1
##$AZFW= 0.1
##$BCFW= 0
##$BC_mod= 0
##$BYTORDP= 0
##$COROFFS= 0
##$CY= 15
##$DATMOD= 1
##$DC= 0
##$DFILT= <>
##$DTYPP= 0
##$F1P= 0
##$F2P= 0
##$FCOR= 0.5
##$FTSIZE= 131072
##$FT_mod= 6
##$GAMMA= 0
##$GB= 0
##$INTBC= 1
##$INTSCL= 1
##$ISEN= 128
##$LB= 0.3
##$LEV0= 0
##$LPBIN= 0
##$MAXI= 10000
##$MC2= 0
##$MEAN= 0
##$ME_mod= 0
##$MI= 0
##$NCOEF= 0
##$NC_proc= -3
##$NLEV= 6
##$NOISF1= 0
##$NOISF2= 0
##$NSP= 0
##$NTH_PI= 0
##$NZP= 0
##$OFFSET= 14.96692
##$PC= 1
##$PHC0= 33.75
##$PHC1= 0
##$PH_mod= 1
##$PKNL= yes
##$PPARMOD= 0
##$PPDIAG= 0
##$PPIPTYP= 0
##$PPMPNUM= 2147483647
##$PPRESOL= 1
##$PSCAL= 4
##$PSIGN= 0
##$PYNMP= <proc.py>
##$REVERSE= no
##$SF= 400.130005477278
##$SI= 131072
##$SIGF1= 0
##$SIGF2= 0
##$SINO= 400
##$SIOLD= 131072
##$SPECTYP= <>
##$SREGLST= <1H.CDCl3>
##$SSB= 0
##$STSI= 131072
##$STSR= 0
##$SW_p= 8223.68421052632
##$SYMM= 0
##$S_DEV= 0
##$TDeff= 65536
##$TDoff= 0
##$TI= <>
##$TILT= no
##$TM1= 0
##$TM2= 0
##$TOPLEV= 0
##$USERP1= <user>
##$USERP2= <user>
##$USERP3= <user>
##$USERP4= <user>
##$USERP5= <user>
##$WDW= 1
##$XDIM= 131072
##$YMAX_p= 408861697
##$YMIN_p= -310861219
##$CURPLOT= <Network HP LaserJet P1505>
##$CURPRIN= <$Network HP LaserJet P1505>
##$DFORMAT= <normdp>
##$LAYOUT= <+/1D_H.xwp>
##$LFORMAT= <normlp>
##$PFORMAT= <normpl>
##$SURQMSG= 1
$$ End of Bruker specific parameters
$$ ---------------------------------
##NTUPLES= NMR SPECTRUM
##VAR_NAME=  FREQUENCY,     SPECTRUM/REAL,   SPECTRUM/IMAG
##SYMBOL=    X,             R,               I
##VAR_TYPE=  INDEPENDENT,   DEPENDENT,       DEPENDENT
##VAR_FORM=  AFFN,          ASDF,            ASDF
##VAR_DIM=   131072,        131072,          131072
##UNITS=     HZ,            ARBITRARY UNITS, ARBITRARY UNITS
##FACTOR=    0.0627417313425165, 1,          1
##FIRST=     8223.62146879498, 107,          -100186
##LAST=      0,             1287,            -99516
##MIN=       0,             -310861219,      0
##MAX=       8223.62146879498, 408861697,    0
$$ Real data points
##PAGE= N=1
##DATA TABLE= (X++(R..R)), XYDATA
$$ [...]
64812 250977 248016 245048 242993 242256 242228 242150 242064 242477 243343 243852 243163 241119 238406 236105 234754 233663 231493
64795 231493 227784 223537 220027 217527 215515 213583 211534 209022 205940 203001 201080 199906 198173 195248
64781 195248 192165 190491 190592 191417 191814 191610 191365 191473 191835 192388 193454 195105 196442 196291 194861 193990 195134
64764 195134 197746 200381 202910 206430 211045 215014 216778 217010 217869 220563 224336 227787 230543 233485 237586
64749 237586 242793 248118 252719 256632 260245 263438 265712 267039 267894 268338 267774 265906 263319 260590 257402
64734 257402 253261 248837 245723 244728 245038 245301 245108 245056 245670 246691 247375 247125 245712 243142 239689 236077
64718 236077 233411 232672 234233 237797 242579 247443 251234 253491 254968 257113 260874 266131 272213 278552
64704 278552 284618 289527 292321 292875 292421 292858 295228 298794 301841 303466 304392 305884 308273 310829 312697
64689 312697 313421 312910 311605 310533 310390 310498 309429 306777 303493 300306 296789 292383 287392 282237 276642
64674 276642 270514 264923 261050 258570 256345 254535 254608 256950 259665 260468 259076 257132 256361 257433 260067
64659 260067 263375 266151 267530 267666 267488 267740 268459 269417 270778 273023 276177 279308 281007 280491 278141 274955
64643 274955 271604 268242 265024 262482 261165 260948 260828 259537 256590 252824 249772 248390 248427 248943 249154 248845
64627 248845 248507 249215 251814 255784 259426 261660 263217 265433 268396 271124 273276 275561 278428 281398 284019
64612 284019 286524 289168 291757 294429 298055 303027 308211 311969 313918 314738 314409 311737 306041 298580 291638
64597 291638 286352 282013 277558 273350 271009 271551 274110 276753 278221 278452 277802 276635 275847 276997 281270
64582 281270 288446 297060 305217 311237 314355 315533 317167 321196 327395 333862 338939 342261 344323 345852
64568 345852 347597 349922 352224 353254 352315 349871 346789 343333 339197 334176 328414 322129 315567 309293
64554 309293 304122 300509 298161 296424 294888 293302 291095 287652 283288 279389 277059 276014 275365 275034 275512
64539 275512 276449 276686 275938 275324 275623 276011 275351 273992 273332 274161 276465 280393 286191 293227 300258 306893
64523 306893 313921 321973 330616 338881 345887 350772 353050 353655 354876 358418 363674 368307 370344 369531 367116
64508 367116 364793 363563 363088 362144 359762 355798 350440 343683 335566 326597 317613 309361 302294 296433 291335
64493 291335 286619 282641 280165 279133 278399 277071 275591 274971 275453 276489 277592 278500 278831 278416 277831 277775
64477 277775 277859 276837 274233 271088 268768 267615 267100 266776 266555 266369 266206 266394 267400 269192 271101 272414
64461 272414 273016 273434 274377 276139 278261 279826 280300 280149 280446 281855 284166 286772 289218 291192 292450 293067
64445 293067 293400 293513 293159 292901 294610 299641 306673 312752 316736 320312 324929 329370 331770 332826 334885
64430 334885 338256 340535 339912 337439 335341 334535 334514 334441 333427 330831 327346 324974 324891 325920 326000 324561 322510
64413 322510 320555 318790 317520 317156 317237 316612 314834 312772 311843 313210 317412 323864 330744 336282 340315
64398 340315 343919 347632 350921 353369 355338 357127 358469 359432 361009 364170 368748 373945 379603 386350
64384 386350 394536 403510 412144 419991 427957 437781 450687 466497 484106 502592 521650 541295 561903
64371 561903 584537 610575 640618 674071 709973 748019 788684 832690 880583 932670 989200
64360 989200 1050530 1116834 1187417 1260601 1334668 1408630 1481552 1551443 1615657 1672357 1720795
64349 1720795 1760144 1789122 1807222 1815362 1814510 1804247 1783669 1753465 1716049 1673269 1624707 1568837
64337 1568837 1505584 1437076 1365878 1293343 1220252 1148356 1079996 1016165 956214 899924 848524
64326 848524 802622 760320 719080 679087 643125 613089 588012 565723 545072 526050 508940
64315 508940 494056 481537 470852 461113 452120 444340 437658 431056 423729 415549 406304 395842 385383
64302 385383 377189 372063 368365 364414 360530 357652 355353 352835 350818 350526 351342 351407 350392 350000 351506
64287 351506 354306 357188 359747 362053 363942 365171 365699 365578 365084 364813 364943 364589 362812 360135 358001 356824
64271 356824 355767 354548 354087 354945 356368 357536 358693 360315 362113 363685 365288 367020 367968 367284 365598
64256 365598 364239 363276 361551 358655 355715 353707 351906 348716 343667 337883 332670 328181 323602 318285
64242 318285 312467 307070 303000 300510 298998 297457 295400 293340 292139 291927 291951 291510 290593 289506 288376
64227 288376 287379 287095 288247 291165 295613 300757 305256 308092 309824 312439 317358 323943 330484 336047 340646
64212 340646 344286 346984 349375 352058 354362 354984 353986 353036 353343 354477 355694 357257 359666 362415 364553
64197 364553 366047 367641 369527 370931 371034 369751 367545 364902 362124 359324 356520 353839 351732 350818 351373
64182 351373 352859 354124 354375 354113 354739 357012 360222 363291 366377 370778 377341 385519 394063 402234 410237
64167 410237 418757 428114 437762 446858 455443 464586 474978 486018 496882 507789 519216 530467 540248
64154 540248 548395 555642 561771 565436 566101 564742 562202 558052 551704 543533 534209 523883 512789 501839
64140 501839 491858 482728 473735 464288 454100 443544 434041 427050 422338 418348 414622 412444 412440 413175 413252
64125 413252 413360 414694 416535 417099 415999 414148 411737 408114 403402 398560 393791 388374 382169 375956 370126
64110 370126 364271 358247 352470 346910 340986 334864 329880 327152 326390 326306 325591 323438 319957 316258 313488
64095 313488 311614 309747 307529 305468 303968 302984 302648 303253 304496 305623 306535 307896 310059 312765 315868
64080 315868 319180 321471 321117 318393 315881 315669 317102 318148 318066 317560 316994 315844 313867 311760 310467 310423
64064 310423 311543 313458 315741 318311 321628 326157 331604 336977 341491 345352 349624 355300 362416 370156
64050 370156 377934 386015 394534 402250 407269 409266 410107 411694 413762 414484 412897 410035 407812 407381 408643
64035 408643 410819 413106 414863 415493 414583 412290 409316 406125 402307 397016 389947 381601 372930 365122 359306
64020 359306 355606 352605 348615 343622 339295 336981 336439 336570 336575 336225 335779 335831 336494 336705 335375 333292 332569
64003 332569 333760 334982 334698 333946 334528 336165 337132 337123 337668 339718 342298 343911 344256 344174 344686 346430 349513
63986 349513 353596 358355 363777 369725 375461 380185 383885 387077 389876 391943 393287 394477 395962 397598
63972 397598 398884 399374 399030 398518 398880 400512 402684 404442 405642 406795 408426 411047 414985 419428 422395
63957 422395 422793 421993 422188 423588 424560 424211 423172 421909 420058 417921 416937 417791 419371 420497 421559 423515
63941 423515 426316 429399 432816 436652 440003 441887 442880 444882 449488 457346 468407 481586 494565 505449
63927 505449 514754 524614 535943 547621 558761 570473 584596 601564 620328 639793 659554 679724
63915 679724 700820 723564 748122 773751 799782 826667 855322 885756 917406 950862 988064
63904 988064 1030161 1076066 1124029 1174151 1228342 1287988 1352706 1421541 1494617 1573330 1659662
63893 1659662 1755711 1863313 1983510 2116670 2263417 2425191 2603680 2800215 3016044 3252459
63883 3252459 3509881 3787017 4081397 4390399 4711309 5040969 5376059 5713203 6047825
63874 6047825 6373239 6681822 6966829 7222231 7441656 7619439 7752971 7842345 7887095 7884651
63864 7884651 7832572 7730903 7581623 7387468 7152746 6884223 6589555 6275247 5947180 5612059
63854 5612059 5276430 4944344 4617485 4297776 3988819 3694890 3419607 3165475 2933370
63845 2933370 2722196 2530114 2356266 2200424 2061114 1935501 1821427 1718314 1625740 1542516
63835 1542516 1467719 1401132 1341657 1286616 1233994 1184524 1140127 1100827 1064625 1030071 997477
63824 997477 967524 940192 915539 894333 877071 863067 851303 841733 834929 830648 827651 825214
63812 825214 824210 826254 832031 840983 852392 866052 881696 898498 915764 933636 952467 971826
63800 971826 990955 1009971 1029578 1049526 1068400 1085253 1100382 1113918 1124679 1131377 1134265 1134559
63788 1134559 1132611 1127689 1119423 1108505 1095769 1081155 1063736 1042526 1017391 989440 960220 930294
63776 930294 899266 867602 837372 810007 783998 756514 727245 699060 674485 652899 631861
63765 631861 609964 587404 564738 542526 521953 504630 491282 480985 471854 462376 452179 441849
63753 441849 432206 423848 417113 411942 407514 402707 397520 393447 391400 389753 385902 379753 374077 370942
63739 370942 369316 366997 363474 359642 355852 351815 347806 344417 341336 337677 333482 329705 326683 323717
63725 323717 320253 316512 312806 309226 306287 304982 305717 307718 309765 311075 311389 310828 309822 308610 306722
63710 306722 303665 300261 298535 299774 303169 306671 308753 309113 308268 306933 305512 303804 301455 298787 296716
63695 296716 295707 295411 295646 297017 299879 303189 305329 306043 306761 308757 311609 313956 315426 317143 320241
63680 320241 324489 328830 332887 337145 341642 345500 348328 351261 355701 361423 366989 371832 376884 383078
63666 383078 390236 397696 405086 412102 418386 424188 430459 437679 445150 451945 457993 463598 468355 471164
63652 471164 471103 467921 462122 454989 448040 441852 435836 429664 424421 421656 421678 423528 426233 429268 432054
63637 432054 433946 434884 435388 435922 436871 439060 443475 450199 458067 465461 471105 474338 475402 475552 476264 478093
63621 478093 480743 484054 488078 492054 494363 494220 492901 492673 494788 498839 503644 508259 512432 516566 521139
63606 521139 525889 529844 532377 533825 534604 534191 531666 526971 520898 513973 506255 498354 491650 486914 483320
63591 483320 479458 474940 470410 466333 462642 459497 457580 457338 458449 460279 462408 464584 466750 469440
63577 469440 473537 479158 485265 490992 496882 504113 512843 522299 532415 544417 559416 577120 596249
63564 596249 615796 635647 656409 678738 702414 726178 749212 772808 799587 830683 864579
63553 864579 899180 934146 970486 1008787 1048807 1090151 1132129 1173201 1211580 1246294 1276894
63542 1276894 1302381 1321436 1333670 1339827 1340847 1337626 1331597 1324321 1316081 1305835 1292993 1278433
63530 1278433 1263142 1246549 1227074 1204234 1179655 1155963 1134824 1115983 1098096 1080475 1063886
63519 1063886 1049510 1037532 1027298 1018625 1012236 1008955 1009091 1012638 1019247 1027819 1036965 1046309 1056780
63506 1056780 1069248 1083422 1098500 1114311 1131253 1149506 1168845 1189020 1209841 1231081 1252686
63495 1252686 1274954 1298299 1322994 1349370 1378046 1409749 1445092 1484562 1528234 1575006 1622174
63484 1622174 1665964 1702692 1729945 1747412 1756685 1759745 1757565 1750467 1739482 1726353 1712191 1697199
63472 1697199 1681924 1667380 1653206 1636968 1616486 1592106 1565489 1536867 1504869 1468798 1429807
63461 1429807 1389811 1350285 1312063 1275314 1239635 1205013 1172601 1143622 1117678 1093319 1070295
63450 1070295 1049862 1032516 1016843 1001332 986242 972783 961316 951320 942435 934488 926936 919224
63438 919224 911509 904292 897628 891392 885948 881642 877916 873932 870018 867408 866391 865748 864388 862643
63424 862643 861353 860604 860266 861209 864777 870898 877519 882280 884450 885074 885534 886197 886253 884697 881385 876972
63408 876972 871665 864431 853935 840207 824833 809540 795305 782998 773857 768361 765047 761500 756632
63395 756632 751383 747291 745139 745008 746592 749082 751580 754356 759023 766773 777009 788474 801170 815995
63381 815995 832873 850715 869433 890647 915689 943997 974259 1006113 1039494 1073025 1104699
63370 1104699 1134165 1162854 1191396 1218292 1242148 1264321 1288184 1316041 1347723 1381984 1418163
63359 1418163 1456340 1496892 1540282 1586470 1633898 1679569 1720629 1755445 1782845 1801324 1810079
63348 1810079 1810426 1804999 1795576 1782715 1767431 1751768 1736901 1721606 1703455 1681045 1654468 1624342
63336 1624342 1591541 1557649 1524576 1493363 1463874 1435664 1408643 1382863 1358305 1335065 1313394
63325 1313394 1293574 1276264 1262839 1254514 1250849 1249857 1250116 1252145 1257112 1264715 1273346 1282243 1292582
63312 1292582 1306107 1323166 1342544 1362908 1384066 1406861 1432219 1460382 1490919 1523193 1556728
63301 1556728 1591262 1626817 1663892 1703273 1745147 1788279 1830433 1869880 1906290 1939808 1969420
63290 1969420 1992718 2007547 2013682 2012767 2006938 1997731 1985848 1971171 1952853 1930058 1903069 1873421
63278 1873421 1842645 1811158 1778572 1744533 1708676 1670311 1629278 1587210 1546919 1510044 1475950
63267 1475950 1443366 1412317 1383773 1358161 1335449 1316413 1302358 1292975 1285346 1275783 1262367 1245456
63255 1245456 1226424 1206619 1187058 1168176 1149750 1131512 1113752 1096904 1080800 1065001 1049701
63244 1049701 1035482 1022123 1008582 994448 980506 967357 954393 940995 927993 916765 907135
63233 907135 897339 886188 874334 863148 853240 844417 836339 828666 821111 813846 807466 802060 796657
63220 796657 790054 781973 773073 764127 755589 747669 740367 733528 727163 721426 715949 709473 700727 689765
63206 689765 678129 667643 659117 652028 645295 638429 631946 626488 621834 617422 613706 611779 611208 609500
63192 609500 604838 598466 593108 589691 587185 585252 585061 587040 589522 590492 589593 587639 585206 582588 580382
63177 580382 579137 578959 580050 582916 587310 591794 595342 598642 602637 606425 608215 608277 609318 613394 619563
63162 619563 625206 628843 630965 632772 634903 637310 639884 643034 647583 653793 660591 666246 670030 672827
63148 672827 675992 679956 684019 687106 688634 689134 690150 692966 697215 701304 704467 707688 712168 717595
63134 717595 722730 727316 732570 739879 749607 761117 773291 785116 796424 808289 822271 839079
63122 839079 858151 878344 898541 917754 935372 951622 967350 983138 998956 1014654 1030163
63111 1030163 1044980 1058077 1068743 1077182 1083979 1089427 1093688 1096898 1098337 1095940 1087689 1073705 1056351
63098 1056351 1038110 1019868 1001310 982237 962923 943539 923895 903852 883795 864553 846904
63087 846904 831129 817000 804162 792452 781849 772349 764082 757318 752002 747386 742543 737299 732332
63074 732332 728364 725573 723835 723158 723739 725844 729626 734681 739876 744207 747916 752086 756996 761803 766322
63059 766322 772151 780921 792004 803135 813135 822765 832927 843338 853488 863641 874030 883928
63047 883928 892652 900978 910356 920803 930700 938977 946603 955338 965624 976305 986128 994924 1003369
63034 1003369 1012120 1021249 1030132 1037662 1042744 1044884 1044465 1042559 1040400 1038734 1037259 1034732 1029963 1022784
63020 1022784 1013768 1002952 989434 972776 954502 937414 923147 910920 899071 887432 877590 870958
63008 870958 867194 864824 862971 861911 861996 862548 862344 861151 860343 861652 865481 870780 876569 883134 891499
62993 891499 902038 914005 926368 938683 951053 963590 976298 989448 1003741 1019732 1037073
62982 1037073 1054521 1070802 1085424 1098633 1110867 1122479 1133764 1144853 1155565 1165714 1175440
62971 1175440 1184849 1193273 1199448 1202708 1203686 1203647 1203409 1203023 1201935 1199148 1193790 1186140 1177840 1170495 1164242
62956 1164242 1158137 1151763 1145941 1142047 1141142 1143568 1148722 1155347 1162792 1172043 1184753 1201152 1219685
62943 1219685 1238923 1259025 1280930 1304911 1330549 1357435 1385028 1412217 1438036 1462845 1488009
62932 1488009 1514215 1540623 1565894 1589533 1611949 1633549 1654054 1672496 1687599 1698300 1704171
62921 1704171 1705249 1701354 1691821 1676218 1655164 1629973 1601356 1568921 1532241 1492133 1450486 1408954
62909 1408954 1368275 1328722 1290492 1253407 1216856 1180709 1146030 1114304 1085918 1059831 1034738
62898 1034738 1010207 986607 964316 943189 922706 902567 883129 865094 848598 832805 816633
62887 816633 799613 781897 763943 746771 732024 720767 712093 703699 694101 683749 673906 665124
62875 665124 657132 649564 642351 635713 630002 625246 620809 616035 611277 607586 605211 603224 601004 599149
62861 599149 598291 597801 596605 594723 593085 592186 591870 592135 593130 594372 594870 594263 593163 592243 591570 590993 590646
62844 590646 590893 592164 594914 599304 604909 611131 617949 625825 634883 644665 654761 665197 676056 687065
62830 687065 697653 707160 715059 721248 725953 729060 729939 728530 726077 723810 721111 716186 708531 699385
62816 699385 689515 678239 665599 653988 645880 640578 634923 627116 618336 610456 603638 596829 589401
62803 589401 581381 572818 564050 556314 551029 548298 546706 544776 542151 539215 536158 532866 529442 526310
62789 526310 523729 521557 519631 518182 517668 518207 519240 519748 518973 517203 515880 516491 518975 521327 521232 518228
62773 518228 514158 511480 511314 513066 515451 517443 518350 517688 515619 513443 512909 514393 516107 515928 514097
62758 514097 513250 515308 519072 521686 521959 521253 521314 522436 523943 525321 526175 525867 524213 522284 521751 523290
62742 523290 526007 528439 529845 530586 531547 533132 534706 535206 534546 534168 535801 539724 544571 548729 551650
62727 551650 553886 556382 559892 564783 571084 578632 587161 596354 606045 616502 628223 641203 654711
62714 654711 668102 681539 695351 708788 720177 728557 734607 739610 743925 746897 747883 746758 743563
62701 743563 738356 731579 724037 716135 707466 697603 687054 676788 666835 656037 643690 630892 619553
62688 619553 610275 602000 593754 585722 578155 570269 561358 552532 545988 542337 539799 536574 533015 530597
62674 530597 529481 528435 527028 526587 528379 531702 534585 535998 536702 538159 541330 546443 553101 560348 567310
62659 567310 574290 582784 593828 606681 619768 632735 646660 662173 678363 694216 710535 729557
62647 729557 752773 779794 809345 840696 873938 909478 947707 988955 1033370 1080759 1130525
62636 1130525 1181543 1232211 1281112 1327897 1373216 1417495 1460052 1499665 1535544 1567223 1593693
62625 1593693 1613300 1624590 1626868 1620003 1604254 1580480 1550061 1514310 1474207 1430726 1384979 1337747
62613 1337747 1289374 1240449 1192202 1145749 1101313 1058632 1017829 979226 942609 907511 874205
62602 874205 843589 815883 790262 766153 744149 724974 708075 692082 676477 662076 649826
62591 649826 639688 630775 622174 613611 605712 599594 595652 592638 588608 583133 577974 575034 574021 572916
62577 572916 570551 567792 565978 565123 564343 563416 562879 562766 562324 561262 560274 559704 558443 555105 549867 544195
62561 544195 538980 533994 529180 525279 522759 521051 519442 518036 517306 517417 518601 521310 525132 528227 529007
62546 529007 528018 527116 527044 526981 526339 525675 525569 525809 526218 527353 529807 533436 537757 542529 547639 553063 559183
62529 559183 566343 573731 579600 583153 585344 587170 588161 587484 585670 583940 582269 579403 574673 568730 562528
62514 562528 556549 551019 545979 541153 536574 533175 531821 531830 531591 530612 529700 529026 527512 524624 521392 518873
62498 518873 516870 515114 514386 515056 515500 513718 510184 507501 507307 508898 510913 512849 514569 515731 516482
62483 516482 517737 519976 522525 524701 526956 530113 534051 538034 541937 546227 550959 555646 560119 564801
62469 564801 570106 576249 583716 593153 604621 617545 631743 647789 665874 684810 703058 720747
62457 720747 740133 763773 792382 824347 856988 888248 917650 946046 974572 1003722 1033207
62446 1033207 1062396 1090557 1116756 1139949 1159454 1175210 1187392 1195922 1200652 1201905 1200523 1197293
62434 1197293 1192761 1187799 1183999 1182843 1184370 1187126 1189877 1193317 1199734 1210940 1226725 1245421 1265579
62421 1265579 1286703 1308537 1330418 1351751 1372584 1392827 1410882 1423978 1430437 1431034 1427456 1419786
62409 1419786 1406406 1386284 1360330 1330202 1296663 1259708 1219715 1177748 1135052 1092850 1052201
62398 1052201 1013437 975994 939547 905076 874028 846641 822046 799960 781089 765526 751934
62387 751934 738992 726724 715533 704833 693940 683864 676680 672923 670758 668166 664959 661979 659155
62374 659155 655383 650153 644478 640093 638125 638502 640114 641391 641185 639446 636924 634118 630897 627408 624839
62359 624839 624502 626098 627607 627275 625282 623066 621475 620220 618907 617795 617459 618259 620247 623079 625955
62344 625955 628279 630492 633605 637714 641828 645653 650667 658548 669013 680098 690216 699098 707037
62331 707037 714405 722083 731337 742714 755502 768556 781351 794241 808296 824947 844997 867562
62319 867562 890551 912727 934982 959232 986390 1015840 1046548 1078150 1110955 1145330 1181348
62308 1181348 1219116 1259376 1303500 1352488 1406017 1462842 1522245 1584734 1651314 1722535 1798357
62297 1798357 1878369 1961621 2046471 2131003 2213670 2293465 2369484 2440087 2502176 2551659 2585562
62286 2585562 2604084 2610148 2606674 2594623 2573601 2543313 2503832 2455307 2398563 2335824 2270030 2203248
62274 2203248 2136138 2068810 2001755 1935923 1872309 1811562 1753845 1699202 1648133 1601381 1558830
62263 1558830 1519028 1480238 1441663 1403245 1364901 1326807 1290112 1256276 1225540 1196808 1169185
62252 1169185 1142952 1118896 1097378 1078273 1061078 1044772 1028314 1011776 996408 983088 971374
62241 971374 960733 952060 946970 945773 947165 949869 953553 957879 961778 964549 967089 971109 977317 985133
62227 985133 994025 1004217 1015892 1028536 1041508 1054705 1068216 1081969 1096358 1112657 1131885 1153424
62215 1153424 1175719 1198339 1222450 1249035 1277572 1306952 1336997 1368520 1402523 1440019 1482216
62204 1482216 1530008 1583310 1641344 1703454 1769274 1838338 1910189 1984810 2062421 2142730 2224667
62193 2224667 2306787 2387506 2464925 2536661 2599896 2651507 2688645 2709899 2716023 2709083 2690773 2661736
62181 2661736 2622266 2573034 2515014 2449232 2376920 2299733 2219596 2138449 2058040 1979643 1903875
62170 1903875 1830988 1761397 1695800 1634819 1578716 1527383 1480414 1437340 1398090 1362977 1331872
62159 1331872 1303613 1276936 1251977 1230075 1211816 1195859 1180225 1164366 1149461 1136879 1126892
62148 1126892 1118880 1112304 1107181 1103871 1102664 1103634 1106667 1111448 1117432 1124064 1131272 1139759 1150570 1164140
62134 1164140 1179737 1196119 1213038 1232069 1255422 1283527 1314058 1343832 1371622 1398739 1427152
62123 1427152 1457760 1490264 1523544 1555821 1585637 1613560 1642177 1673496 1706880 1740365 1773433
62112 1773433 1807343 1843087 1880402 1919036 1960017 2005169 2055842 2112147 2172779 2235397 2297575
62101 2297575 2357409 2413032 2462102 2502622 2533988 2556356 2569200 2571526 2563411 2546143 2520674 2486999
62089 2486999 2445277 2396509 2341761 2281834 2218171 2153156 2088952 2026730 1967292 1911369 1858896
62078 1858896 1809079 1761857 1718252 1678640 1641874 1607120 1575484 1548590 1526262 1506842 1489116
62067 1489116 1472707 1457264 1442826 1430597 1421734 1415342 1409241 1403008 1398826 1398792 1402669 1409109 1417978
62054 1417978 1430051 1444699 1459059 1469923 1476085 1478664 1479483 1479544 1479062 1478411 1478324 1478966 1479322 1477858 1473547
62039 1473547 1466080 1455617 1442867 1429181 1416141 1405110 1397217 1393117 1392346 1393632 1396651 1403013 1414596
62026 1414596 1431185 1450654 1471346 1493365 1517596 1544527 1574288 1606933 1642191 1679587 1719195
62015 1719195 1761702 1807255 1854640 1902074 1948647 1994720 2041105 2088192 2135820 2183708 2231763
62004 2231763 2279782 2326912 2371799 2413406 2451290 2484728 2511962 2530884 2540295 2540255 2531543 2515205
61992 2515205 2492122 2462374 2425281 2380635 2329481 2273186 2212444 2148136 2082421 2017509 1953591
61981 1953591 1889553 1825734 1764364 1706948 1652880 1601318 1552897 1508523 1467751 1429697 1394732
61970 1394732 1363867 1337009 1313066 1291538 1272779 1256612 1241585 1225775 1207956 1188234 1168173
61959 1168173 1150008 1134806 1121289 1107003 1090674 1073010 1055447 1038897 1023704 1010026 997952
61948 997952 987720 979951 975195 973092 972546 973036 975309 980201 987018 993624 998268 1000884 1002392 1003139 1002540
61933 1002540 1000135 996215 991053 984109 974623 962714 949292 935124 920611 906177 891971 877295
61921 877295 861364 844787 829288 815665 803070 790711 779208 769544 761648 754863 749055 744293
61909 744293 740137 736160 732711 730234 728425 727112 727415 730804 737198 745049 753057 760788 768006 774804
61895 774804 782350 792127 804168 817115 830252 844343 860318 878446 899254 924011 953546 987373
61883 987373 1024488 1064159 1105536 1147733 1191226 1238243 1290549 1347174 1405044 1461461 1515350
61872 1515350 1566793 1616302 1664243 1710123 1752546 1790404 1823754 1852974 1877567 1896571 1909647
61861 1909647 1916832 1917594 1911372 1899231 1884128 1869256 1856616 1847075 1840950 1838267 1839076 1843856 1853349
61848 1853349 1867914 1887331 1910999 1937743 1965540 1992110 2015832 2035538 2049678 2056748 2056705 2050847
61836 2050847 2039778 2022461 1998180 1968640 1936990 1905020 1872416 1838754 1804996 1772401 1740727
61825 1740727 1708480 1674872 1640899 1608331 1578074 1549689 1522058 1494099 1465192 1435682 1407128
61814 1407128 1381508 1359743 1341208 1324926 1310813 1299473 1291259 1286169 1284455 1286578 1292510 1301674
61802 1301674 1313809 1329527 1349820 1375230 1405540 1440088 1478558 1521707 1570941 1626669 1687391
61791 1687391 1751265 1818231 1889505 1964954 2042254 2119095 2194924 2269650 2341575 2407722 2465604
61780 2465604 2513686 2550674 2575636 2588836 2591672 2585823 2573058 2555515 2535290 2514057 2493870 2477781
61768 2477781 2468213 2464768 2465003 2467510 2472931 2481684 2492230 2502200 2509682 2512417 2507226 2491963 2467325
61755 2467325 2435194 2395615 2346950 2288836 2223403 2153399 2080578 2006372 1932727 1861308 1792627
61744 1792627 1726780 1664502 1606677 1553211 1503165 1455938 1411782 1371249 1334563 1301399 1270848
61733 1270848 1241686 1213160 1185619 1160107 1137287 1116934 1098382 1081131 1065043 1050288 1037242
61722 1037242 1026086 1016265 1006509 995779 984305 973497 964681 958058 953016 949148 946404 944238 941414
61709 941414 937337 933181 930909 931157 932825 934805 937265 940800 945142 949555 954173 960030 967660 976202
61695 976202 984032 989861 993157 993990 992892 990719 988270 985767 982636 978005 971709 964688 957999 951455
61681 951455 943891 934974 925990 918316 911831 905595 899495 894153 889684 885870 883430 883507 885474 886586 884747
61666 884747 880782 877237 875691 875975 877201 878520 879369 879885 880731 881890 882300 881575 881236 882908 885824 887719
61650 887719 887946 887866 887908 886067 880207 870514 858755 846254 833705 821978 811666 802245 792877 783888
61636 783888 776399 770524 764829 757713 748825 739154 730253 723313 718409 714685 711530 709294 708340 707857 706465
61621 706465 703898 701240 699363 697837 695603 692204 688171 684535 682010 680402 678911 677351 676668 677599 679162
61606 679162 679474 678015 676106 675062 674925 675340 676557 678918 682203 686204 691238 697332 703541 708959 713943
61591 713943 719484 725782 732373 739353 747339 756196 764845 772627 780022 787597 795014 801679 807864 814385
61577 814385 821250 827234 830945 831928 830556 827244 822248 816166 809991 804284 798665 792682 786962 782699
61563 782699 779963 777414 774121 770857 768858 767958 766914 765244 763725 763046 762844 762178 760136 755780 748409
61548 748409 738408 727237 716120 705118 693818 682305 670866 659220 646852 633986 621568
61537 621568 610215 599648 589363 579442 570463 562735 555867 549151 542380 536154 531197 527413 523884
61524 523884 519872 515509 511419 508020 505385 503415 501802 500161 498525 497351 496649 495561 493458 491083
61510 491083 489666 489056 487784 485228 482618 481265 480672 479414 477438 476390 477554 480318 482969 484468 485066
61495 485066 485583 486533 487921 489564 491365 493234 494926 496296 497740 500021 503392 507230 510781 513893 516658
61480 516658 518863 520365 521648 523310 525353 527863 531964 538768 547261 554617 559142 561773 564042 565751
61466 565751 565662 563606 560669 557776 555125 552562 549597 545508 540392 535642 532409 530179 528086 526809 527363
61451 527363 528416 527186 523458 520562 521339 524849 528312 530772 533204 536044 538412 539479 539239 538127 536915
61436 536915 536651 537623 538663 538531 537745 537995 539935 542588 544766 545860 545301 542626 538555 534954 533116 532690
61420 532690 532654 532631 532903 533771 535397 537760 540242 541646 541107 538898 536151 533958 532782 532400 532283 532212 532478
61403 532478 533208 533789 533550 532895 533028 534471 536600 538773 541068 543507 545374 545960 545541 544977 544682 544586 544927
61386 544927 546460 549761 554588 559970 564922 569278 573925 579969 587563 595764 603517 610419 616566 622229
61372 622229 627898 633997 640272 645951 650852 655680 660747 665107 667839 669722 672690 677653 683653 689147
61358 689147 693386 696538 699284 702559 706795 710950 712883 711451 707925 704707 702778 700955 697645 692658
61344 692658 687060 681808 677124 673008 669709 667310 665153 662098 657516 652005 647071 644145 643759 645485
61330 645485 648450 651889 655287 658320 660994 663875 667823 673186 679251 684690 688573 690979 692770 694872
61316 694872 697663 700923 704449 708605 713870 719781 724915 728408 731080 734391 738560 742536 745814 749289
61302 749289 753903 759164 763693 766923 769655 773067 777692 783395 789832 796678 803670 810871 819063 829689
61288 829689 843904 861366 879987 897165 911434 922998 932936 942157 951063 959726 968032 975591 981733
61275 981733 985955 988583 990798 993543 996378 997880 997261 994972 991585 986951 981046 974775 968897 962668
61261 962668 954811 945629 936924 929750 923434 917140 911356 907236 905233 904909 905496 906262 906859 907592 908854
61246 908854 910292 911505 913762 919807 931057 945700 960173 971783 979351 982531 981954 979576 977408
61233 977408 975740 973249 968744 962182 954426 947027 941979 940473 941589 942982 943116 942409 942390 944475 949493
61218 949493 957311 966510 975170 982429 988948 995835 1003751 1013142 1024405 1037219 1050393 1063050 1075524
61205 1075524 1088412 1101160 1112516 1122436 1132683 1145193 1160318 1177085 1194678 1212903 1231262
61194 1231262 1248428 1263232 1275774 1286912 1296667 1303812 1307244 1307210 1304643 1299703 1291601 1279898 1265442
61181 1265442 1249793 1234080 1218639 1203496 1188662 1173913 1158666 1142538 1126022 1110307 1096395
61170 1096395 1084613 1075000 1067594 1062042 1057335 1052582 1047873 1043965 1041234 1039325 1037626 1035565 1032694 1029177
61156 1029177 1026088 1024501 1024307 1024601 1025088 1026168 1027621 1028364 1027947 1027330 1027619 1028879 1030764 1033510 1037472 1042252
61140 1042252 1047056 1051674 1056584 1062457 1069942 1079520 1091198 1104753 1120419 1138539 1158186 1177112
61128 1177112 1193676 1208069 1221061 1232546 1242140 1250177 1256948 1261856 1264661 1266872 1270324 1274739 1278124
61115 1278124 1279491 1279750 1279992 1280246 1280066 1279019 1276277 1270915 1263084 1254006 1244472 1234149 1222535 1209612
61101 1209612 1195281 1179201 1161673 1143858 1126561 1109523 1092570 1076876 1064331 1055761 1050205 1045885
61089 1045885 1041684 1037790 1035010 1033435 1031999 1029505 1025647 1020567 1013819 1004547 992605 978863 964518
61076 964518 950717 938665 929252 922412 917302 913132 909469 906239 904103 904332 907280 911349 914712 917879
61062 917879 923245 932055 943242 955389 968307 982108 996293 1010857 1027185 1046624 1068652 1091337
61050 1091337 1113159 1133641 1152838 1171160 1189384 1207855 1225662 1241387 1254772 1267054 1279349
61039 1279349 1291025 1299961 1304299 1303694 1298935 1290889 1280377 1268828 1257886 1247758 1236736 1223277
61027 1223277 1208203 1193963 1181978 1171527 1160981 1149238 1136188 1122774 1110597 1100640 1092525 1085711
61015 1085711 1080846 1078707 1078275 1077550 1076257 1075980 1077374 1079113 1080353 1082496 1087267 1094345 1102216 1110553 1120447
61000 1120447 1132735 1147191 1163130 1180103 1198244 1218516 1242208 1269557 1299188 1329480 1360340
60989 1360340 1393233 1429705 1470226 1514300 1561412 1611681 1665383 1721884 1779907 1839562 1903432
60978 1903432 1974474 2053118 2137447 2225788 2317884 2413946 2514321 2620258 2733550 2855223
60968 2855223 2985695 3125987 3277143 3438556 3608687 3787511 3976431 4175897 4385528
60959 4385528 4606992 4844557 5102302 5383081 5690511 6028979 6400689 6805696 7246456
60950 7246456 7730195 8266244 8864438 9537273 10299353 11162174 12132938 13220901 14441423
60941 14441423 15813104 17359062 19116288 21136004 23466827 26144423 29201208 32652784
60933 32652784 36413882 40198409 43544565 46020443 47465599 48054631 48141293 48057942 48041373
60924 48041373 48255386 48762443 49416631 49828423 49524927 48213997 45929971 42956210 39633425
60915 39633425 36226025 32901668 29760809 26855397 24197879 21779046 19587342 17614569
60907 17614569 15852288 14290760 12919842 11726186 10690175 9788536 8999649 8305515
60899 8305515 7691178 7145119 6659165 6225943 5837102 5485163 5165698 4876200 4614048
60890 4614048 4376791 4162735 3969287 3791709 3625123 3467085 3317055 3174528 3039128
60881 3039128 2911475 2792168 2680376 2574664 2474584 2380308 2291364 2206935 2126807 2050954
60871 2050954 1978814 1909890 1844435 1782647 1724112 1669040 1619069 1575393 1536650 1499907 1463261
60860 1463261 1426493 1389982 1354417 1321147 1291247 1264128 1238066 1212068 1186425 1161706 1138238
60849 1138238 1116523 1097190 1080294 1065108 1050703 1036502 1022526 1009384 997688 987294 977532
60838 977532 968258 959965 952725 945955 939517 933932 929065 923821 917902 912686 909398 907396 905205 902284
60824 902284 898826 894934 891201 889037 888956 889396 888771 888040 889597 894032 899519 904190 907709 910735 914248
60809 914248 919286 925983 932885 938407 943022 948822 956947 966501 975980 984562 992030 998677 1005627 1014309
60795 1014309 1025296 1038079 1051718 1064976 1076382 1085475 1093883 1103914 1116140 1129369 1142704 1156072
60783 1156072 1168856 1179830 1188955 1197535 1205836 1212007 1214450 1214041 1212757 1210916 1207159 1200701 1192163 1182087
60769 1182087 1169802 1154423 1136486 1117854 1099928 1082340 1063778 1043863 1023565 1003693 983942
60758 983942 964091 945301 928966 914548 899906 884033 868357 854872 843879 834220 825106 816919
60746 816919 810443 805837 802374 798970 795080 791196 788252 786403 784543 781151 775634 768889 762633 758074
60732 758074 755146 753036 751215 749466 747094 743174 738022 733387 730318 727511 722814 715829 708061 700962
60718 700962 695040 690463 687075 683780 679254 673492 667499 661343 653981 645505 638109 633811 632085 630723
60704 630723 628359 625281 622365 620232 619209 619115 619013 617794 615164 611677 607880 603941 600179 597489 596749
60689 596749 597916 600059 602394 604965 608034 611222 613965 616680 620447 625247 629489 631945 633236 634500
60675 634500 635414 634824 632768 630393 628020 624775 620304 615540 611288 607147 602312 596667 590653 584851 579958
60660 579958 576379 573487 570031 565612 561064 557133 553578 549853 545853 541629 537186 532946 529707 527761
60646 527761 526693 526224 526453 527080 527453 527703 528676 530226 530828 529754 528534 529193 531780 534680 536718 537864
60630 537864 538415 538626 538955 539770 540934 542294 544197 546840 549590 551801 553917 556829 560528 564420 568793
60615 568793 574752 582421 590203 596392 601102 606204 613489 623005 632946 641046 646196 648827 650010 650508
60601 650508 650493 649604 647322 643996 641497 641852 644903 648354 650585 652261 654456 656522 657115 656351 655370 654350
60585 654350 652491 649658 646538 643306 639545 635372 631227 626488 619971 612066 604907 599809 595897 591923
60571 591923 588134 585334 583186 580639 577403 573968 570638 567616 565876 566894 571186 577451 583261 586554
60557 586554 586834 585354 584079 584232 585863 588584 592149 596216 600224 603906 607531 611277 614838 617956 620882
60542 620882 623937 627094 630445 634604 640060 646382 652473 657273 659905 659795 657498 655114 654996 657807 662215
60527 662215 666378 669372 671388 673165 675330 677994 681020 684751 689980 696908 704804 713296 723270 735406
60513 735406 748451 760447 771687 784826 801684 821404 842505 865339 891259 920203 950461
60502 950461 980299 1008507 1033630 1054055 1069076 1078959 1083840 1083461 1078208 1069574 1059445 1049643 1042250
60489 1042250 1039181 1040854 1046008 1053545 1063959 1078407 1097025 1119043 1144213 1173303 1207283 1246835
60477 1246835 1292709 1345767 1406112 1472256 1541272 1609857 1675423 1736331 1790913 1836372 1869275
60466 1869275 1887632 1892274 1885806 1870503 1847623 1818285 1784192 1747451 1710227 1674608 1642330 1614487
60454 1614487 1591614 1573783 1560356 1550174 1542815 1539490 1542059 1551268 1566634 1587790 1615033 1648552
60442 1648552 1688253 1734632 1788978 1852322 1924820 2006296 2096425 2193901 2296214 2400623 2504467
60431 2504467 2604103 2694717 2772233 2834896 2882510 2915453 2935887 2949074 2961472 2977165 2997094
60420 2997094 3021440 3050866 3084729 3119267 3148536 3166542 3168005 3148150 3103385 3032779 2938710
60409 2938710 2826144 2701262 2570025 2437038 2305243 2176579 2052842 1935814 1826808
60400 1826808 1726386 1634519 1550937 1475261 1406868 1344796 1288119 1236582 1190561 1150067 1114043
60389 1114043 1081101 1050756 1023370 998910 976468 955211 935258 917374 902251 890223 881045
60378 881045 873494 865814 857137 848168 839964 832456 824752 816446 807748 798552 788452 777865 768144 760050
60364 760050 752817 745342 737828 731568 727310 724380 721304 716872 710767 703750 697267 692481 689529 687832
60350 687832 686844 686161 685192 683462 681203 679106 677511 676427 676231 677410 679434 680880 681089 680815 680657 679848
60334 679848 677597 674858 673519 674273 676445 679574 683743 688339 692008 694250 695875 697458 698518 698811 699235
60319 699235 700587 702377 703744 704698 705452 705398 703968 701919 700508 699860 699584 700552 704269 710189 715387 717665
60303 717665 717813 718011 719140 720657 722182 723913 725948 728449 732272 738162 745208 751312 755664 759905 766220
60288 766220 774948 784705 794218 803105 811160 818021 823780 828994 833584 836353 836253 833706 829993 825674
60274 825674 820438 814375 808494 803677 799849 796539 793682 791372 789335 787262 785366 784042 783175 782338 781590
60259 781590 781535 782570 784577 787414 791331 796736 803910 812990 823812 835613 847322 858694 871103
60246 871103 886893 907852 934361 965812 1001223 1039110 1077108 1112443 1142989 1167461 1184433
60235 1184433 1191796 1187891 1172976 1149066 1118574 1083686 1046696 1009815 974386 941082 910996 885501
60223 885501 864547 846151 828369 811106 795373 781682 770090 760861 753750 747153 739554 731615
60211 731615 725395 721523 718620 715655 713176 711575 709759 706748 703480 701595 701026 700232 698569 697064 696614
60196 696614 696577 695771 694110 692426 690929 688792 685586 682596 681887 683962 686964 688599 688400 687584 687192 687256
60180 687256 687563 688206 689217 690537 692642 696288 701226 706091 710180 714520 720397 727482 734361 740429 746154
60165 746154 751617 755896 758170 758738 758660 758836 759553 760576 761537 762509 764196 767312 771888 777341 782911 787747
60149 787747 791159 793514 796510 801634 808458 815297 821476 827883 835082 842022 847208 850345 852320 854218
60135 854218 856917 860867 865393 868790 870006 869962 870506 872342 874711 876720 877981 878150 876991 875134 873814
60120 873814 873451 873165 872045 870185 868116 865994 864039 863176 864434 867922 872945 878859 885190 891176 895919
60105 895919 899066 900905 901849 902249 902455 902424 901411 898837 895514 893199 892713 893283 894150 895969 899844 905531
60089 905531 911570 917290 923962 933698 947430 964025 981138 996920 1011198 1025125 1039671 1054512
60077 1054512 1068425 1080386 1089914 1096562 1099699 1099138 1095784 1091399 1087524 1084413 1080928 1075554 1067764 1058452
60063 1058452 1049191 1041268 1035267 1030973 1027370 1023262 1018524 1014524 1012873 1013925 1016916 1021195 1026539 1032478
60049 1032478 1038331 1044187 1051018 1059358 1068515 1077684 1087285 1098486 1111690 1126138 1140783 1154763 1167037
60036 1167037 1176455 1182731 1186968 1190677 1194376 1197410 1198998 1198994 1197572 1194646 1190083 1184438 1178990 1174657 1170925
60021 1170925 1166130 1159001 1149937 1140808 1133458 1128224 1123591 1117238 1107727 1095539 1082576 1070506 1059396
60008 1059396 1047847 1034457 1019214 1003546 989046 976181 964220 952242 940002 927790 915786
59997 915786 903926 892345 881619 872392 864860 858712 853408 848291 842565 835619 827800 820730 816259
59984 816259 814747 814679 814384 813849 814225 815650 816535 815433 812872 810487 808749 806562 803136 799319 796589 795283
59968 795283 794358 792600 789564 785467 780787 776137 772039 768365 764059 757902 749854 741487 734910 731242
59954 731242 730122 730296 730405 729601 728111 727153 727668 729099 730135 730664 731951 734454 736727 737511 738012 740574
59938 740574 745472 750556 754132 756705 759432 762325 764902 767510 770724 773927 775691 775480 774161 772873
59924 772873 772208 772571 774552 778495 784077 790622 797556 804367 810509 815766 820643 825976 832097 838602 845072
59909 845072 851696 858889 866396 873185 878318 881709 884000 886041 888645 892444 897528 903280 908741 912991
59895 912991 915265 915254 913666 911972 911016 910131 908105 904629 900228 895264 889904 884758 880413 876362 871556
59880 871556 866279 862348 860925 860978 860507 858464 854909 850160 844890 840553 838583 838982 840385 841560 842506
59865 842506 844181 847618 853252 860631 868621 876147 882850 889096 895507 902544 910280 918436 926782 935482
59851 935482 944736 954162 963074 971399 979726 988213 996053 1002345 1006982 1010375 1012829 1014389 1014705 1012808
59837 1012808 1007900 1000828 993845 988237 983065 977044 970692 965369 961003 956380 951379 947286 944866 943689
59823 943689 943728 946065 951094 957033 961350 963325 964567 967297 972539 979658 986980 992918 996834 999036 1000113
59808 1000113 1000563 1000880 1001516 1002638 1004199 1006124 1008053 1009118 1008662 1007226 1006182 1006223 1006731 1006689 1005670 1003967
59792 1003967 1002459 1002430 1004633 1008364 1012261 1016370 1022539 1032196 1044517 1057260 1068637 1077658 1083562 1086080
59778 1086080 1085956 1084231 1081353 1077935 1075912 1077246 1080903 1082289 1076899 1064336 1048210 1032363 1017977
59765 1017977 1004315 991127 979136 968244 956630 942668 927330 913591 903461 896654 892222 890061
59753 890061 889951 890294 889200 886362 882755 878929 874858 871228 869213 868617 867501 864304 859391 853873 847894
59738 847894 840969 833416 826380 820547 815498 810362 804693 798768 793238 788325 783287 777083 769782 762729
59724 762729 756897 751679 745874 739413 733317 728312 724289 721051 718723 717232 715906 713856 710667 706869
59710 706869 703863 702833 703229 702876 700359 696817 694576 694538 696056 698822 703146 708489 713551 718259 723815
59695 723815 730120 735067 737657 740083 745002 752171 759723 767475 776368 785304 791459 794074 795321 796758
59681 796758 797467 797002 797648 801422 806262 807856 804942 800695 798659 799041 799515 798251 795296 791862 789154
59666 789154 787619 786746 785729 784575 784258 785497 787621 789132 789371 789263 790227 792610 795538 798302 801387
59651 801387 805785 811549 817614 823082 828241 834092 841236 849463 858249 867381 877093 887614 898580 909092
59637 909092 918604 927505 936461 945448 953949 961788 969042 975311 980037 983572 986900 990117 992250 992964
59623 992964 993301 994126 994936 995033 994869 995152 995430 994699 992775 989884 985556 979400 972645 967353 963989 961011
59607 961011 957084 952557 948597 945909 944655 944648 945305 946183 947768 950911 955361 959845 963821 968036 973036
59592 973036 978289 983352 988766 994938 1001057 1005971 1009282 1010647 1008838 1002873 993707 983551 973532 963080
59578 963080 951643 939975 929394 920457 912737 905414 897849 889936 882112 874814 867963 861239 854693
59565 854693 848554 842455 835486 827243 818352 809667 801293 792711 783638 774447 765831 758215 751372 744605
59551 744605 737484 730457 724399 719491 714986 710386 706370 703991 703194 702816 701982 700701 698905 695916 691662
59536 691662 687866 686817 688733 691137 691253 688633 685193 683099 683035 684154 685078 684815 683051 679989 676207
59521 676207 672709 670595 670039 669686 667790 664123 660127 656959 654311 651620 649451 648568 648250 646979 644697
59506 644697 643099 643305 644358 644610 643746 642746 642454 642953 644064 645734 648019 651187 655681 661462 667447
59491 667447 672218 675514 678617 682995 688842 695290 701856 709232 718576 730380 744191 759142 774583
59478 774583 790639 808566 829953 854442 878086 895125 902230 900795 894902 887833 881036 875304 871369
59465 871369 869294 868389 868030 867940 867625 866314 863827 861013 859056 858522 858996 859242 857874 854381 849473 844016
59449 844016 837895 830469 821763 812435 802823 793080 784129 777132 771664 765630 757656 748753 740913 734804
59435 734804 729631 724734 720496 717861 717435 718877 720883 722124 722465 722915 724286 726519 729456 733358 738110
59420 738110 742764 746724 750731 755781 761444 766232 769472 771954 774712 777832 780541 781881 781335 779322
59406 779322 777169 776146 776440 777304 778110 778842 779638 780339 780688 780790 781270 783021 786691 792249 799051 806245
59390 806245 812949 818298 822003 825039 829104 834920 841474 847226 851529 854379 855387 853857 849711 843696
59376 843696 836729 829579 823032 817739 813771 810714 808269 806571 806040 807157 810149 814547 819273 823608
59362 823608 828008 833687 841509 851492 863202 876306 890812 906986 925006 944963 967627 994665
59350 994665 1026504 1059327 1085553 1098872 1098818 1089937 1077447 1064733 1053962 1046873 1044545 1047558 1056346
59337 1056346 1069782 1083104 1089119 1083030 1065792 1042348 1017426 993575 971853 952638 935719 920738
59325 920738 907902 897820 890633 885836 882952 881818 882144 883365 885344 888811 894567 902210 910153 917228
59311 917228 924065 932343 942623 953549 963591 972944 982938 993882 1004594 1014236 1023535 1033478 1043646
59298 1043646 1052837 1060970 1069192 1077962 1086282 1093589 1101621 1113097 1128492 1145163 1160140 1173023 1185575
59285 1185575 1199222 1214022 1229638 1245873 1261875 1276037 1287519 1297238 1306632 1315923 1324143 1330349
59273 1330349 1334106 1335382 1334856 1333973 1333679 1333187 1330792 1325828 1319015 1311094 1302175 1292480 1282649 1272861 1262515
59258 1262515 1251228 1239523 1228095 1217061 1206395 1196574 1188223 1181478 1176055 1171612 1167789 1164372 1161799
59245 1161799 1161009 1162344 1164985 1167941 1171193 1175421 1181080 1188354 1197667 1209416 1223291 1238518 1254684
59232 1254684 1271404 1286846 1297377 1299520 1292348 1277747 1258569 1236809 1213446 1189286 1165322 1142270
59220 1142270 1120265 1099404 1080506 1064954 1053650 1046182 1041063 1036733 1032457 1028570 1025948 1025126 1025855
59207 1025855 1027548 1029971 1033209 1037034 1040766 1043886 1046374 1048145 1048534 1046839 1043185 1038276 1032199 1024145
59193 1024145 1013768 1002399 992115 983514 975231 966108 957162 950475 946455 943398 940002 937072 935922
59180 935922 936000 935325 932942 929737 926905 924773 923336 922881 923563 925249 928264 933344 940017 945825 948415
59165 948415 948251 948153 950072 953268 955881 957321 958371 959591 960468 960162 958495 956274 955074 956548 961206
59150 961206 967570 973110 976560 979048 982563 987666 993334 998817 1004675 1011666 1019362 1026571 1032792 1038642
59136 1038642 1044875 1051433 1057495 1062188 1065262 1067310 1069324 1071898 1074997 1078602 1083195 1089144 1095813 1101867
59122 1101867 1106510 1109935 1112505 1114031 1114176 1113204 1111870 1110721 1109799 1108934 1107953 1106561 1104387 1101475 1098627
59107 1098627 1097022 1097437 1099921 1104049 1109087 1113889 1117283 1119121 1120684 1123465 1127522 1131476 1134051 1135107
59093 1135107 1135175 1134604 1133393 1131346 1128191 1123873 1118818 1113427 1107241 1099281 1089405 1078800 1068908 1060448
59079 1060448 1053540 1047851 1042228 1035168 1026420 1017452 1009650 1002795 996120 990122 986193 984776 984895 985421
59065 985421 986044 987210 989862 995034 1002993 1012961 1024227 1037020 1051542 1066760 1081256 1094993 1109057
59052 1109057 1123724 1137960 1150956 1163212 1175832 1189431 1203797 1217983 1230711 1241278 1249984
59041 1249984 1257319 1263251 1267950 1272389 1276927 1279933 1279349 1275482 1270784 1266930 1263609 1260107 1256297 1251699
59027 1251699 1245275 1236901 1227726 1218411 1208172 1196090 1182154 1166447 1148698 1129426 1110308 1092487
59015 1092487 1075592 1059230 1044218 1031178 1018941 1005678 991120 976661 963800 953317 945289
59004 945289 938901 932631 925536 918166 911590 905977 900744 895622 890808 886375 882132 877957 874030 870962
58990 870962 869612 870093 870992 870586 868998 868125 869244 871896 875310 879347 883535 886918 889694 893373 898324
58975 898324 902980 906703 911497 919080 927957 935690 942690 951217 961588 972151 982674 994948 1009770
58962 1009770 1025692 1041375 1057164 1073686 1090563 1107309 1124056 1140736 1156562 1170732 1182604
58951 1182604 1191042 1194895 1194496 1191640 1187894 1184076 1181256 1180554 1181457 1181974 1181215 1180488 1181091 1182257 1182248 1180449
58935 1180449 1177365 1173256 1167722 1160266 1150633 1138981 1126110 1113093 1100424 1087961 1075646 1063581
58923 1063581 1051447 1038858 1026338 1014905 1004577 994566 985179 978063 973968 971669 969994 969661 971919
58910 971919 976294 980908 984619 987905 991993 997736 1004869 1011771 1016560 1019029 1020937 1023874 1027589 1030974
58896 1030974 1033741 1036178 1037940 1038099 1035962 1031065 1023015 1012343 1001008 991043 982901 975786 969057 962375
58882 962375 955221 947585 940858 936614 934429 932034 927841 922379 917169 913215 910846 909924 909535 908114 904551
58867 904551 898958 892214 885328 879476 875869 874727 874600 873500 870850 867833 865649 863910 861215 857067
58853 857067 852586 849230 847531 847407 849000 852342 856681 861203 866294 872964 880954 888764 895972 904214
58839 904214 915015 927695 940340 951859 961984 970293 976775 982882 990371 999252 1008316 1017613 1028818
58826 1028818 1042793 1058303 1073750 1088966 1104464 1119922 1134363 1147138 1157897 1166157 1171863 1176043
58814 1176043 1179963 1183640 1185874 1185773 1183658 1180404 1176529 1172258 1168107 1164798 1162420 1159910 1155712 1149067
58800 1149067 1140441 1130703 1120266 1109323 1098288 1087284 1075515 1062124 1047767 1034295 1022489 1010969
58788 1010969 998031 983918 970469 958924 948863 939138 929050 918557 908022 898036 889105 881318
58776 881318 874432 868170 862209 856044 849326 842300 835541 829312 823661 819008 815953 814296 812895 810920
58762 810920 808906 808108 809031 810951 812677 813405 812964 811688 810153 808888 808331 809089 811867 816625 821831 825138
58746 825138 825202 822721 819561 817048 815259 813670 812020 810374 808655 806545 803926 801314 799605 799308 799976
58731 799976 800432 799728 798075 796932 797941 801580 806950 812955 819367 826401 833612 840060 845679 851608 858701
58716 858701 866389 873697 880788 888378 895794 900837 902056 900312 897570 894790 891771 888598 886175 885095
58702 885095 884623 883345 880655 877246 874067 871048 867130 861646 855467 850531 848124 847688 847365 845826 843667
58687 843667 842920 844847 848360 851214 852988 856038 862778 872689 883091 892539 902034 912735 923970 934402
58673 934402 944175 954731 966829 979571 991310 1001044 1009080 1016741 1025181 1034200 1042573 1049723 1056457
58660 1056457 1063517 1070182 1075229 1078843 1082574 1087447 1092988 1098159 1102410 1105593 1107501 1107898 1106577 1103267
58646 1103267 1097798 1090506 1082083 1072765 1061895 1048491 1032208 1013730 994221 974315 953758 932339
58634 932339 911032 891435 873763 856299 837562 818424 801210 787211 776078 767161 759969 753356
58622 753356 745856 737632 730975 727852 727468 727011 724503 720354 716477 714652 715578 718647 722256 724731 725465
58607 725465 725388 726264 729375 734667 741031 747313 752972 757870 761777 764357 765457 765169 763700 761379 758674
58592 758674 755937 753146 749976 746203 742110 738589 736440 735106 732498 727071 719978 713977 710014 706367
58578 706367 701744 697432 694907 692890 689080 684071 681091 681748 684269 686433 688090 689846 691134 691184 690787
58563 690787 691587 694086 697432 700696 703437 705368 706491 707553 709786 714147 720813 728916 736595 742116
58549 742116 745441 748138 751292 754329 756447 758248 760892 764266 767232 769484 771983 775455 779464 783193
58535 783193 786335 788899 790798 792156 793708 796485 801159 807762 815842 824741 833895 843064 852289 861712
58521 861712 871520 881973 893211 904977 916737 928286 940073 952605 965440 977129 986589 994468
58509 994468 1002801 1013327 1026544 1042280 1060367 1080300 1101012 1121782 1143069 1165709 1189469 1213038
58497 1213038 1235323 1256116 1275508 1293234 1308694 1321189 1330238 1336026 1339344 1340602 1339079 1333536
58485 1333536 1323413 1309176 1292052 1273855 1256307 1239623 1222344 1203311 1183082 1162487 1140894
58474 1140894 1117573 1093978 1072590 1053797 1036108 1019364 1005223 993868 982772 970067 957248
58463 957248 946974 939769 934471 930615 928477 927476 926306 924410 922084 919415 916238 912900 910092 908004
58449 908004 906321 904794 903190 901062 898212 895102 892310 889884 887591 885302 882947 880827 880156 882143
58435 882143 886014 889137 890010 890034 891376 894185 897183 900043 903594 908189 913499 919820 928205 939082 951657
58420 951657 964909 978558 993058 1009102 1026889 1045385 1062534 1076741 1087913 1096804 1103828 1108819
58408 1108819 1111299 1110566 1106396 1100171 1094380 1090164 1086189 1080705 1073866 1067138 1061310 1056285 1052165 1049365
58394 1049365 1048057 1048457 1051113 1055986 1061761 1067011 1071460 1075321 1078123 1079197 1078544 1076203 1071634 1064964
58380 1064964 1058031 1052739 1048988 1045522 1042166 1039734 1038418 1037917 1038779 1041922 1047023 1052908 1059373 1067165
58366 1067165 1076306 1085974 1095984 1106967 1119127 1132213 1146560 1162589 1179118 1193548 1203980 1210115
58354 1210115 1212232 1210769 1207041 1202953 1199579 1196838 1194449 1192134 1189145 1185063 1181061 1178973 1178980 1179450 1179135
58339 1179135 1178303 1177799 1178438 1181344 1187246 1195006 1202078 1206845 1209601 1211338 1212943 1215468 1219556 1224343 1228361
58324 1228361 1231744 1235960 1241172 1245614 1248108 1249502 1250947 1252489 1254304 1257704 1263613 1271172 1279156 1287919
58310 1287919 1298639 1311128 1323499 1333926 1342107 1349198 1356753 1365647 1375761 1386605 1397868 1409098
58298 1409098 1419562 1429249 1439392 1450866 1462602 1472990 1482469 1493076 1505527 1518474 1530800 1542902
58286 1542902 1555293 1567682 1580110 1593475 1608102 1622971 1637250 1651636 1667555 1685803 1706342
58275 1706342 1728429 1750559 1771300 1790623 1809583 1828551 1846839 1864237 1881612 1899555 1917607
58264 1917607 1935219 1952428 1969251 1985484 2001338 2017178 2032524 2046553 2059742 2073689 2089109
58253 2089109 2105371 2122073 2139555 2157776 2176564 2197276 2222154 2251180 2281347 2309958 2337146
58242 2337146 2364340 2392051 2420462 2450753 2484271 2520923 2559265 2597710 2635356 2672557 2710949
58231 2710949 2751910 2794840 2838081 2881449 2926394 2973714 3023005 3074510 3129404 3187744 3248106
58220 3248106 3309860 3373834 3440180 3507776 3576625 3648691 3725212 3805115 3887167 3971797 4059781
58209 4059781 4151132 4246562 4348037 4456456 4570465 4688999 4813402 4945731 5086422 5234845
58199 5234845 5390713 5553803 5723681 5900557 6085097 6276998 6475748 6683232 6903109
58190 6903109 7136721 7382167 7638445 7907863 8192999 8494117 8811395 9147193 9504119
58181 9504119 9882894 10283798 10708150 11156951 11630435 12130519 12661425 13226539 13827173
58172 13827173 14465505 15145480 15869206 16635925 17446589 18306172 19219406 20188005 21214721
58163 21214721 22306624 23471445 24714007 26039057 27454372 28968329 30587955 32322096
58155 32322096 34182878 36181678 38328352 40637641 43131643 45832986 48761516 51942149
58147 51942149 55410772 59209230 63382904 67990485 73109906 78827246 85224269 92380769
58139 92380769 100379931 109305397 119246886 130323699 142697163 156551008 172068398
58132 172068398 189431990 208820984 230387345 254243790 280426694 308650915 337781990
58125 337781990 365398988 388080201 402576391 407174352 402268393 389835617 372405581
58118 372405581 352284881 331252842 310475495 290456020 271119639 252128277 233267069
58111 233267069 214633252 196545177 179334089 163217117 148299046 134622124 122190875
58104 122190875 110971963 100898970 91887577 83847286 76685837 70313329 64646202 59605904
58096 59605904 55115442 51101676 47501012 44259817 41330357 38670486 36246730 34032702
58088 34032702 32003036 30131899 28397799 26786217 25286616 23889985 22589884 21382052
58080 21382052 20260862 19218049 18245740 17338474 16491818 15701589 14964899 14278690 13635928
58071 13635928 13026190 12441988 11882816 11351828 10850419 10377094 9929396 9505181 9103138
58062 9103138 8723140 8365113 8027281 7706885 7402639 7114565 6841414 6580664 6331457
58053 6331457 6094868 5870402 5654702 5444994 5241657 5046165 4858456 4677514 4502603
58044 4502603 4332712 4166706 4005197 3850391 3702901 3560713 3422614 3290401 3165970
58035 3165970 3048269 2935311 2827597 2727163 2634327 2547582 2466066 2390177 2320151 2255634
58025 2255634 2196360 2141901 2091078 2042706 1996522 1952466 1909766 1867684 1826462 1786571 1747817
58014 1747817 1710129 1674288 1640653 1607951 1574558 1540269 1505771 1471263 1436890 1403626 1372156
58003 1372156 1341581 1310926 1281506 1255936 1234778 1215793 1196721 1177390 1158656 1140538 1122238
57992 1122238 1103306 1084111 1065326 1047222 1029425 1011460 993602 976880 961979 948576 935987
57981 935987 923905 912078 899966 887358 874699 862156 849072 835254 822066 811011 801609 791959
57969 791959 781259 770412 760004 749076 736544 722914 709858 698552 688960 680379 672163 664136
57957 664136 656640 650083 644220 638094 630970 623200 615850 609485 603618 597517 591308 585898 581853 578781
57943 578781 576060 573649 571656 569566 566766 563772 561922 561495 560934 558608 554880 551757 550703 551239 551639
57928 551639 550625 548440 546549 546374 548118 550649 552250 551468 547708 541552 534433 527516 521026 514964 509943
57913 509943 506471 503793 500557 496658 493322 491316 490325 490208 491423 493552 494893 494446 493161 492190 491087
57898 491087 489027 486794 485996 486937 488772 491207 494367 497346 498831 499352 501092 504898 508999 511493 512800
57883 512800 514640 517581 520662 522857 523935 524320 525031 527439 532168 538234 543848 548103 551456 554785 558489
57868 558489 562344 565707 567941 569109 570024 570937 570361 566166 558111 548478 539738 532273 524975 517373 510140
57853 510140 503712 497458 490506 482764 474860 467543 461279 455992 451047 446018 441514 438525 436715 434212
57839 434212 429664 423859 418654 414949 412510 411153 410998 411726 412636 413420 414083 414239 413464 412229 411436 410929
57823 410929 409601 407254 405125 404059 403269 401648 399371 397322 395650 393816 391500 388613 384921 380536
57809 380536 376269 372474 367966 361358 353435 346933 343577 342271 340636 337517 333407 329208 325628 323691
57795 323691 324746 329344 336279 343232 348559 352313 355560 359046 362850 366970 371458 375765 378571 378916
57781 378916 377376 375794 375826 377800 380689 382924 383430 382222 380004 377232 373892 370322 367688 367084 368328
57766 368328 370073 371129 371410 371724 372938 375256 378041 380402 382062 383477 385027 386460 387374 387753 387687 387142
57750 387142 386599 387377 390235 393705 394767 391564 384917 377048 369454 362287 355066 347414 339452 332009 326196
57735 326196 322370 319699 317137 314554 312386 310316 307105 302156 296773 293215 292418 293151 293714 294090 295875
57720 295875 300089 305711 310738 314246 316902 319713 323003 326713 330976 335916 341192 346185 350490 354013
57706 354013 356791 359056 361188 363067 363528 361050 355293 347602 339798 332797 326719 321855 318797 317567
57692 317567 317217 316590 315097 312552 308759 303889 299100 296068 295529 296533 297417 297375 296871 296730 297214 298014 298754
57675 298754 299268 299609 300129 301406 303647 306097 307461 307092 305440 303164 300391 297320 294984 294519 295843
57660 295843 297960 300500 303879 307650 309828 308743 304982 300698 297312 294510 291156 286561 281109 276187
57646 276187 273252 272460 272527 272315 271947 271732 270783 267903 263440 259044 255770 253643 252947 254330 257252 259817
57630 259817 260927 261654 263652 267094 270879 274119 276580 278367 280185 283487 289425 297823 307886 319658
57616 319658 333920 350793 369322 388765 409810 434321 464172 500415 543224 592259 646671
57605 646671 704188 759944 806691 837083 846654 835414 807361 768475 724309 678444 632681 588332
57593 588332 546878 509372 475796 445459 417866 393090 371611 353873 339631 327697 316857
57582 316857 307180 299745 294809 290986 286788 282296 278617 276247 274838 274238 274662 275711 276073 274677 271806
57567 271806 268759 266579 265278 264140 262503 260152 257155 253745 250548 248380 247295 246151 243877 240944
57553 240944 238705 237413 236030 234136 232578 231675 230095 226637 222118 218306 215668 213424 211291 209722
57539 209722 208566 206831 204049 200949 198505 196871 195355 192939 188969 183891 179118 175584 172686 169296
57525 169296 165380 161744 158539 155153 151390 147628 143808 139472 134997 131577 129486 127416 124089 119698
57511 119698 115222 111127 107378 104022 100977 97738 94035 90521 88173 87117 86468 85212 82957 80077
57497 80077 77433 75807 75297 75386 75686 76328 77514 79090 80853 82923 85400 87821 89348 89505 88559 87243
57481 87243 86313 86233 87047 88464 90103 91688 93053 94087 94708 94855 94506 93728 92643 91321 89831 88424
57465 88424 87438 86935 86569 85830 84292 81761 78606 75816 74158 73326 72608 72325 73484 75894 77990 79136
57449 79136 80539 82782 83983 82079 77830 73574 69825 65371 60254 56058 53083 49736 45400 41584
57435 41584 39270 37313 34763 32757 32428 32609 31607 30032 29791 30961 31643 30623 28577 26734 25687
57420 25687 25362 24903 22886 18895 14682 12415 11977 11312 9389 7261 6034 5233 3734 1166 -2237 -6344
57404 -6344 -10993 -15689 -19792 -22689 -23840 -23278 -21984 -20985 -20089 -18415 -16126 -14560 -14414 -14947 -15388 -16037
57388 -16037 -17398 -19199 -21050 -23195 -25703 -27657 -28124 -27530 -27175 -27696 -28839 -30420 -32484 -34560 -35736
57373 -35736 -35817 -35720 -36343 -37528 -38494 -38975 -39452 -40308 -41089 -40860 -39264 -37034 -35410 -35226 -36676 -39633 -43642
57356 -43642 -47681 -50479 -51366 -50572 -48765 -46699 -45244 -45031 -45821 -46817 -47837 -49529 -52106 -54695 -56480 -57670
57340 -57670 -58612 -58861 -58180 -57726 -58758 -60431 -60489 -58336 -56001 -55665 -57497 -60449 -63815 -67018 -68998 -69198
57324 -69198 -68711 -69358 -71827 -75502 -79661 -83889 -87567 -90052 -91482 -92624 -93919 -95310 -96821 -98455 -99588
57309 -99588 -99469 -98494 -98094 -99113 -101102 -103488 -106479 -110276 -114129 -116826 -117684 -116725 -114472 -112104 -111076 -111945
57293 -111945 -113951 -116240 -118882 -122165 -125687 -129083 -133013 -138146 -143505 -147088 -148289 -148576 -149584 -151550
57279 -151550 -153914 -156413 -158981 -161324 -163318 -165320 -167496 -169325 -170333 -170997 -172226 -174101 -175696 -176173 -175667
57264 -175667 -175094 -175420 -177121 -180019 -183449 -186683 -189337 -191537 -193862 -196984 -201002 -205051 -207909 -209257 -210212
57249 -210212 -212386 -216488 -221835 -227056 -231179 -234235 -236877 -239370 -241125 -241602 -241543 -242639 -245753 -250004 -253955
57234 -253955 -257181 -260190 -263253 -266031 -268268 -270216 -272281 -274662 -277398 -280413 -283424 -286155 -288745 -291831
57220 -291831 -296115 -301909 -308905 -316224 -322885 -328574 -333726 -338486 -341755 -342035 -339381 -335808 -333268 -331634
57206 -331634 -329266 -325263 -320337 -315295 -309481 -301503 -291368 -281132 -272977 -266842 -260417 -251575 -240491
57193 -240491 -229156 -219083 -210041 -201138 -192533 -185308 -179636 -173828 -165822 -155320 -143796 -132544 -121639
57180 -121639 -111082 -101954 -95400 -90686 -85318 -77268 -66473 -54042 -40818 -27171 -13506 -142 13145
57166 26879 41221 55945 70973 86440 102199 117700 132571 147045 161590 176303 190847 204966
57154 204966 218984 233796 250304 268807 288907 309944 331337 352553 373302 394161 416592
57143 416592 441630 468616 495944 523141 551292 581029 610978 639175 665643 692604 722187
57132 722187 754601 788402 821516 851965 878815 903138 927243 952216 976817 999472 1020529
57121 1020529 1041397 1061986 1080457 1095611 1108292 1120116 1131915 1143946 1156511 1169395 1181237
57110 1181237 1190391 1196438 1200394 1203570 1206432 1208349 1208297 1206028 1202506 1198645 1193761 1186225 1175996 1165515
57096 1165515 1157484 1152449 1149091 1145910 1141739 1135546 1127068 1117187 1106429 1093147 1074147 1046906 1010291
57083 1010291 963437 905175 834719 751944 656791 549022 428438 294604 146498 -16683
57072 -194537 -385977 -590625 -808770 -1040465 -1285997 -1547133 -1826634 -2126546 -2448437 -2795404
57062 -2795404 -3172280 -3583336 -4031122 -4518214 -5048818 -5627950 -6260117 -6949810 -7702681
57053 -7702681 -8525750 -9427176 -10416402 -11504035 -12701542 -14022060 -15481894 -17100620 -18900078
57044 -18900078 -20904669 -23142985 -25648212 -28457696 -31615099 -35175122 -39206691 -43793401
57036 -43793401 -49033988 -55042101 -61940601 -69850539 -78881103 -89122309 -100635501 -113441408
57028 -113441408 -127512352 -142768592 -159072607 -176229353 -194011423 -212195565 -230548675
57021 -230548675 -248721879 -266114846 -281846349 -294904525 -304401601 -309778088 -310861219
57014 -310861219 -307798816 -300948652 -290785257 -277843766 -262692441 -245913295 -228072989
57007 -228072989 -209685060 -191183754 -172925723 -155211640 -138304050 -122427070 -107753353
57000 -107753353 -94392282 -82387611 -71724410 -62341819 -54147873 -47032947 -40879762
56993 -40879762 -35570269 -30990959 -27037173 -23615885 -20646748 -18061850 -15804372 -13826202
56985 -13826202 -12085642 -10546683 -9179417 -7959542 -6866508 -5882358 -4992372 -4185592
56977 -4185592 -3453472 -2787944 -2181100 -1626103 -1117564 -651194 -223247 170366 534916
56968 534916 875880 1196812 1499310 1785743 2060226 2326033 2584918 2841513 3104434 3375721
56958 3375721 3637705 3856394 4003275 4074031 4086201 4062795 4020752 3970180 3916710 3862273 3806854
56947 3806854 3751355 3697449 3644465 3588726 3526933 3458721 3385264 3307049 3224037 3136663 3045271
56936 3045271 2948963 2845848 2734280 2613662 2484812 2350212 2213618 2078877 1948884 1825381
56926 1825381 1709180 1600592 1499998 1407976 1324435 1247708 1175003 1103873 1033205 963293 895466
56915 895466 831110 770285 711582 654054 598768 547518 500466 456323 414653 376547 342837
56904 342837 312950 285988 261966 241633 225955 215955 211911 212149 213479 213254 210337 204120 194063
56891 194063 180855 166694 153322 140512 127243 113506 100145 87858 77320 69441 64315 60589
56879 60589 57135 54829 55411 59090 64704 71982 81992 95106 109845 124122 136438 145420 149400
56866 149400 147394 139981 128634 114644 98999 82687 66557 51270 37652 26587 18277 12143
56854 12143 7786 5363 4550 3939 2279 -120 -2017 -2922 -3276 -3284 -2610 -1397 -601 -836 -1354 -539 2871 9179
56836 9179 17827 27674 37475 46604 55321 64214 73478 82876 92256 101821 111812 121952 131247 138479
56822 138479 143102 145592 146758 146801 145391 142585 139161 135945 133299 131611 131778 134683 140373 148235 157894
56807 157894 169588 183725 200517 220060 242455 267917 297004 330464 367979 406723 441738
56796 441738 468482 485215 492988 493883 489770 482438 473839 465442 457558 449854 442566 436798 433580 433237
56782 433237 436121 443455 456597 475551 499102 526758 559725 599246 644328 691529 736422 774604
56770 774604 802040 816017 816417 805457 785925 760088 730183 698873 668489 640216 614414 591301
56758 591301 571009 553568 539532 530271 526982 529514 536729 547996 563768 584624 610117 638570
56746 638570 667442 693546 713352 723900 723964 714418 697390 675025 649016 620905 592210 564084
56734 564084 537366 513224 493142 477633 465414 454649 444923 437282 432576 430649 431070 433675 438231
56721 438231 444419 452141 460682 467448 468968 463890 453894 441144 426201 409272 391808 375130 358530
56708 358530 340614 321924 304364 288334 272470 256366 241680 229970 220822 212803 204997 197035
56696 197035 188712 180321 172571 165629 158985 152576 147039 142430 137827 132952 129192 128022 129069 130614
56682 130614 131475 131584 131222 130583 129870 129089 127957 126592 126012 127353 130627 134581 137567 138370 136783 133877
56666 133877 131362 130231 130304 131206 133059 135780 138504 140407 141586 142454 142893 142754 142628 143296 144764 146550
56650 146550 148451 150284 151512 152038 152768 154257 155355 154538 152234 150394 149897 149876 149606 149417 149423 148999 148263
56633 148263 148581 150554 152620 152885 151616 150784 151610 153527 155243 155893 155315 153978 152679 151852 151319 151037
56617 151037 151672 153826 157079 160460 163655 167011 170407 172880 173584 172732 171480 171134 172372 174875 177721
56602 177721 180266 182520 184502 185730 185916 185809 186637 188722 191262 193454 195213 196720 197940 198779 199129
56587 199129 198525 196420 193292 190909 190708 192130 193240 192987 192160 191952 192307 192327 191889 191960 193126 194493 194630
56570 194630 193315 191735 190989 190910 190541 189326 187486 185506 183654 181901 180013 177694 174857 171804 169012
56555 169012 166805 165296 164562 164684 165613 167030 168315 168730 167907 166269 164713 163698 162848 161667 160353 159625
56539 159625 159955 161360 163792 167198 171214 175210 178766 181840 184488 186752 188778 190545 191406 190522 188105
56524 188105 185769 185162 186547 189175 192624 197028 202046 206624 210279 214049 219408 226357 233186 238247
56510 238247 241475 243975 246579 249317 252218 255952 261298 268147 275364 281775 287204 292614 299435 308603
56496 308603 319798 331288 340864 347523 352406 357729 364635 372359 379519 385580 390583 393992 394881 393417
56482 393417 391328 390433 391073 392325 393247 393472 392935 391595 389329 385730 380248 372996 365196 358337 352966
56467 352966 348677 344952 341358 337155 331679 325340 319422 314542 309938 304769 299558 295751 294101 294040 294494
56452 294494 294804 294778 294188 292547 289526 285569 281799 279015 276959 274956 273068 272020 272034 272429 272414 271566 269381
56435 269381 265297 259667 254056 249895 247211 244991 242311 238822 234911 231924 231427 233397 235702 236283 235386
56420 235386 234754 235024 235080 233884 231869 230273 229820 230271 230841 231089 231789 234530 239677 245115 248096 248376 248468
56403 248468 250602 254423 258049 260389 261720 262619 263183 263239 262882 262695 263360 264925 266639 267840 268783 270184
56387 270184 272288 275006 278594 283167 287661 290391 290921 290513 290510 291160 292279 294071 296704 299879 303395 307501
56371 307501 312094 316130 318391 318590 317416 315944 315141 315272 315437 314324 311726 308687 305995 303501 301349
56356 301349 300640 301887 303657 303879 302128 299682 297726 296395 295269 293908 291942 289370 286709 284370 282115
56341 282115 279661 277417 275972 275230 274843 275251 277422 281503 286356 290469 292926 293763 294010 295206 298246
56326 298246 302630 307195 311320 314975 318032 320281 322008 323818 325916 328019 329879 331412 332608 333791
56312 333791 335668 338439 341157 342719 343234 343657 344342 344738 344347 343120 341169 339042 338101 339487 342628 345808
56296 345808 348270 350683 353384 355520 356430 356715 357206 357832 358362 359361 361466 364299 367085 369799 372660 374846
56280 374846 374949 372873 370245 368619 368021 367738 367797 368877 371098 373781 376547 379937 384438 389365 393458
56265 393458 396535 399777 404043 408556 411893 413905 415832 418556 421574 424071 426316 429228 432703 435160
56251 435160 435210 433428 431932 432276 434367 437483 441451 446121 450443 453339 455326 457975 461541 464351 465019
56236 465019 464110 462874 461612 460402 460434 463004 467521 471989 475501 479113 484067 490200 496403 501877 506639
56221 506639 511254 516364 522089 527874 533037 537252 540331 542270 544058 547621 553959 561863 569458 576483
56207 576483 583858 591725 599643 608493 620182 634959 650631 665233 679166 693926 709837 726049
56195 726049 741998 758011 774956 793888 815480 839393 864732 891462 920657 953020 988017
56184 988017 1024999 1064244 1106018 1149234 1191838 1232201 1269589 1303881 1335580 1365549 1393708
56173 1393708 1418119 1436192 1446968 1451612 1451583 1446922 1436773 1421277 1402251 1381689 1359903 1335782
56161 1335782 1308816 1280041 1250703 1220952 1190671 1160719 1132261 1105402 1079760 1055953 1034970
56150 1034970 1016183 997638 978638 960584 944779 930792 917622 905237 894054 883867 874015
56139 874015 864042 853766 843571 834807 828718 824511 819842 813933 808835 806646 806831 807516 808185 809472
56125 809472 811156 812221 812669 813678 815964 819230 823328 828660 835081 841322 846164 849786 853563 858601
56111 858601 864594 870229 874878 879732 886749 896499 907749 919195 930574 941741 951900 960720 969447
56098 969447 979949 993029 1008434 1025899 1045290 1066161 1088052 1111033 1135301 1160585 1186740
56087 1186740 1214613 1245573 1280409 1319305 1362615 1410843 1464054 1522139 1585764 1656527 1736007
56076 1736007 1824907 1922914 2028899 2141066 2256996 2373542 2486955 2593771 2692027 2781572
56066 2781572 2863427 2939218 3010731 3078585 3140696 3192728 3230655 3252763 3259558 3252909 3235564 3210341
56054 3210341 3178943 3141849 3099144 3050209 2992423 2922004 2837499 2741835 2640310 2537531 2436947
56043 2436947 2341789 2254534 2175620 2103951 2038780 1980479 1929626 1885971 1848297 1815111 1785725
56032 1785725 1760710 1740824 1725653 1714044 1705643 1700758 1698565 1696920 1694571 1692512 1692575 1695642 1701446
56019 1701446 1709031 1717215 1725851 1736745 1751648 1769197 1785880 1800595 1816042 1834651 1855414 1876164
56007 1876164 1896858 1918702 1941696 1965120 1989448 2015993 2045306 2077000 2110244 2143692 2176395
55996 2176395 2209692 2246423 2287118 2328814 2368893 2408024 2447828 2488012 2527928 2568822 2612057
55985 2612057 2656862 2702326 2749963 2801557 2855812 2910018 2964122 3020483 3080210 3142194 3205320
55974 3205320 3269588 3335568 3404486 3478155 3557204 3640254 3726150 3815638 3909616 4007702 4110202
55963 4110202 4219199 4335603 4457561 4584289 4718977 4864923 5021138 5185059 5357286
55954 5357286 5540057 5733257 5935980 6150191 6378615 6620522 6873781 7139660 7421259
55945 7421259 7718607 8030069 8357615 8705756 9075591 9464468 9871450 10299002 10749643
55936 10749643 11225095 11728524 12263575 12831462 13432709 14070949 14750833 15473043 16235618
55927 16235618 17039562 17889176 18788298 19740822 20753603 21833822 22984748 24209136 25515416
55918 25515416 26915284 28416998 30027042 31756744 33620904 35631559 37799921 40143235
55910 40143235 42683514 45442231 48444382 51726242 55332204 59308253 63709212 68610237
55902 68610237 74100418 80266180 87189729 94958758 103665856 113406275 124297372 136504108
55894 136504108 150237581 165740117 183288489 203186616 225696457 250930648 278744667
55887 278744667 308542254 338907071 367297238 390317525 404761720 408861697 402858701
55880 402858701 388569826 368438753 344767637 319393743 293652588 268436479 244294308
55873 244294308 221551473 200401121 180949569 163242180 147280417 133019652 120361328
55866 120361328 109166925 99286423 90571767 82875538 76057843 70000043 64604380 59782061
55858 59782061 55451552 51546898 48016815 44814667 41897158 39231619 36794987 34564386
55850 34564386 32515632 30630404 28896591 27300437 25825008 24456835 23187369 22006956
55842 22006956 20903614 19868924 18899604 17992113 17140500 16340334 15589963 14887036 14227916
55833 14227916 13610888 13035762 12499919 11998873 11531008 11097721 10698639 10330734 9992552
55824 9992552 9685307 9409170 9162060 8942696 8751459 8587601 8448333 8330232 8227648
55815 8227648 8129115 8018900 7883681 7716661 7516647 7286848 7034589 6768446 6494341 6215895
55805 6215895 5937569 5664380 5399004 5142265 4896033 4662482 4441046 4229738 4029311
55796 4029311 3842514 3669367 3507061 3354845 3215085 3088715 2973297 2866609 2768733 2679359
55786 2679359 2596272 2518042 2445536 2379358 2318278 2261447 2209809 2163898 2122193 2082812 2045155
55775 2045155 2009073 1974164 1940369 1907383 1873207 1835500 1794859 1754537 1716444 1679711 1643438
55764 1643438 1608053 1573119 1536765 1498769 1461842 1428345 1397668 1368152 1339543 1312082 1285102
55753 1285102 1258347 1233387 1212135 1194855 1180522 1168001 1156034 1143427 1130262 1117979 1107686
55742 1107686 1099488 1093612 1090471 1089008 1086828 1082899 1078591 1075269 1072513 1069542 1066561 1063503 1059161 1052893
55728 1052893 1045761 1038550 1030105 1019267 1007367 996950 988425 979363 966996 950488 931128 911069
55716 911069 891704 872788 853395 833806 815794 800868 789151 780145 773563 768925 765271 761834
55704 761834 758323 754326 749225 742906 735694 727512 718179 708494 699735 691878 683674 674696 665865 657536
55690 657536 648616 638236 626923 615453 603813 591994 580583 569887 559674 550331 542955 537621
55678 537621 532875 527678 522440 517334 511132 502906 493728 485517 479163 474674 471866 469711 466125 459906
55664 459906 452225 445106 439141 433749 428791 424591 420868 417028 413321 410703 409659 409787 410257 410176 409032
55649 409032 407332 406305 406565 407733 409610 412518 415769 417081 414773 409802 404502 399954 395623 390863
55635 390863 385536 379548 372943 366283 359997 353732 347140 340883 335856 331856 328081 324714 322894 323094
55621 323094 324458 325789 326503 326553 326108 325365 324288 322564 320179 317750 315778 313825 310922 306639 301337
55606 301337 295755 290824 287479 285918 285122 283715 281336 278898 277753 278874 282364 287125 291327 293902
55592 293902 295520 297600 300473 303044 304237 304262 304287 305155 306599 307713 308111 308357 308987 309320 307880 304071
55576 304071 298851 293523 288421 283057 277123 270992 265594 261886 259956 258523 255988 252292 249024 247262
55562 247262 246038 243654 239954 236406 234056 232354 230285 227987 226583 226460 226406 225010 222582 220712 219871
55547 219871 218614 215810 212486 210235 208675 206202 202770 200091 198980 198300 197011 195590 194762 194158 193170
55532 193170 191992 190965 189752 187998 186147 185000 185075 186586 189148 191255 191224 189095 186517 184488 182669
55517 182669 181351 182192 185808 190198 193049 194560 196562 199878 204006 208522 213191 217213 219819 221341
55503 221341 222578 223515 223661 223065 221886 219577 215686 210938 206280 201397 195492 189141 183909 180285 177250
55488 177250 173829 170006 166281 163339 161900 161864 161800 160421 158319 157137 157233 157366 156609 155365 154498 154487 155466
55471 155466 157036 158003 157276 155108 152692 150630 148611 146376 144027 141635 139534 138643 139304 140062 139036
55456 139036 136477 134577 134702 136202 138114 140409 143049 145267 146557 147278 147651 147200 145866 144571 143919
55441 143919 143327 142334 141788 142614 144053 144341 142870 140622 138654 137139 136070 135952 137278 139713 142258 144210
55425 144210 145663 147018 148203 148656 148097 146948 145798 144882 144415 144960 146733 148787 149708 149155 148023 147034
55409 147034 146071 145099 144850 145831 147229 147642 146740 145437 144420 143154 140713 137119 133311 130030 127464 126045
55393 126045 126624 129117 131626 132104 130783 129779 130148 130511 129148 126320 123668 122261 122155 123015 123990 123630
55377 123630 121349 118800 118562 121388 125662 129434 131977 133344 133639 133169 132572 132300 132348 132524 132608 132375 131974
55360 131974 132119 133325 135230 137376 140186 144129 148139 150172 149569 147807 146643 146462 146789 147330 147907 148157
55344 148157 148048 148214 149168 150433 150882 149800 147478 144952 143209 142263 141058 138660 135490 132840 131324
55329 131324 130431 129641 129178 129409 130116 130687 130693 130163 129659 130077 131902 134563 136840 137840 137332 135537 133216
55312 133216 131558 131105 131028 130265 129071 128481 128512 128209 127374 126840 126807 126277 124668 122776 121567 121129 121386 122631
55294 122631 124436 125033 122909 118589 114163 111554 111781 114992 120196 125423 129038 130733 130837 129382 126647
55279 126647 123997 123054 124141 126308 128651 130842 132544 133267 132962 132187 131550 131367 131837 132973 134229 134675
55263 134675 133896 132567 131912 132519 133795 134643 134658 134432 134588 134910 134786 134105 133121 131776 129905 127971 126640
55246 126640 125632 123991 121722 120223 120703 123037 126460 130390 134052 136351 136979 136946 137238 137674 137789 138060
55230 138060 139280 141316 143476 145577 147583 148650 147861 145817 144341 144338 144853 144424 142624 140055 137536 135635
55214 135635 134509 133913 133542 133334 133171 132604 131496 130704 131261 132836 133901 133769 133598 134809 137074 138670
55198 138670 138528 137153 135506 133805 131895 130269 129837 130576 131096 130132 128040 126143 124754 122862 120104
55183 120104 118138 119085 122888 127167 129903 131502 133684 136830 139247 139264 137342 135515 135012 135301 135507 135763
55167 135763 136408 136684 135414 132737 130039 128146 126674 125295 124480 124449 124491 124078 123858 124750 126640 128740 130662
55150 130662 132324 133339 133492 133428 133895 134385 133506 130872 127947 126746 128080 131051 133845 135012 134439 133231
55134 133231 132500 132424 132510 132335 131661 130368 128921 128503 129921 132570 135113 136893 137968 138096 136837 134716
55118 134716 133145 132770 132688 131807 130260 128898 127930 126831 125328 123800 122700 122082 121901 122464 124265 127317
55102 127317 130811 133670 135533 136968 138598 140303 141583 142414 143262 144370 145578 146750 147810 148289 147524
55087 147524 145585 143396 141511 139326 136099 132398 129748 128902 129166 129611 130323 132023 134817 137805 139836
55072 139836 140303 139295 137389 135436 134205 133912 134030 133708 132502 130861 129886 130436 132290 134351 135848 137072
55056 137072 138679 140597 142185 143216 143923 144124 143225 141359 139615 138800 138792 139508 141377 144152 146425 147486
55040 147486 148679 151452 154805 156289 155100 152513 149642 146710 144522 144503 146684 149358 151281 152578 153057
55025 153057 151772 149261 148082 149526 151494 151431 149931 149428 150469 151478 151478 150823 149596 147564 145766 145954
55009 145954 147914 149053 147377 143639 140036 137933 137398 137862 138519 138748 138541 138073 136940 134720 132249 131126
54993 131126 131686 132519 132397 131680 131386 131809 132655 133750 135013 136257 137443 138658 139670 140109 140186 140502 140955
54976 140955 140759 139787 138946 138821 138911 138738 138734 139443 140673 142098 143797 145452 145945 144732 142936 142028 141957 141661
54958 141661 141026 141080 142376 144301 146069 147458 148396 148673 148434 148330 148843 149852 150997 152048 152765 152848 152282
54941 152282 151425 150644 150167 150370 151714 153969 155855 155988 154359 152554 152229 153496 155095 156149 157262 159499
54925 159499 162638 165203 166325 166875 168304 170757 172885 173256 171499 168202 164305 160768 158469 158074 159830
54910 159830 163308 167291 170272 171545 171869 172775 175083 178182 180725 181838 181687 181101 180825 181032 181327 181046
54894 181046 179640 177097 174201 172156 171595 172027 172603 173265 174528 176053 176340 174479 171650 170006 170214 170999
54878 170999 171237 171539 173152 175889 178092 178559 177796 177070 176920 177145 177909 180042 183989 189013 193940 198542
54862 198542 203724 210283 217798 224959 230801 235518 240193 245948 253267 261788 270528 278354 284449 288406
54848 288406 289909 288476 283890 276906 269093 261566 254186 246487 239122 233583 230409 228501 226612 224744
54834 224744 223453 222389 220560 217796 215010 212847 210859 208366 205550 203328 202450 203045 204836 207489 210815
54819 210815 214787 219319 224042 228441 232306 235982 240215 245775 253072 261869 271330 280339 287683 292035
54805 292035 292335 288639 282301 274896 267112 259028 251066 244039 238276 233263 228188 222554 216403 210359
54791 210359 205217 200989 196595 191228 185879 182653 182370 183541 183933 182570 179952 176915 173792 170465 166979
54776 166979 164021 162536 162698 163680 164883 166703 169230 170857 169726 166448 163830 163558 164634 165562 166425
54761 166425 167761 168803 168334 166561 164803 163849 163700 164327 165468 166101 165441 164303 164304 165815 167786 169402
54745 169402 170800 172169 173427 174984 177594 180993 183633 184275 183102 180985 178521 176228 174757 174266 174245
54730 174245 174575 175988 178724 181398 182280 181472 180860 181838 183985 186189 188257 190751 193614 195783 196387 195953
54714 195953 195950 197214 199229 201176 203262 206485 211199 216583 221808 227267 234156 242914 252467 261158 268283
54699 268283 274624 281437 288976 296133 301483 304398 304867 302615 297113 288658 278936 270010 262815 256787
54685 256787 250898 244892 239670 236547 236064 237475 239447 241159 242397 242804 241758 239309 236646 234992 234283
54670 234283 233503 232179 230897 230357 230595 231548 233759 237892 243614 249544 254561 258855 263411 268596 273672
54655 273672 277842 281379 285230 289529 293025 294240 292795 289297 284291 277962 270622 262774 254632 246341
54641 246341 238816 233480 230516 228100 224287 219357 215303 213075 211413 208734 205259 202559 201523 201507 201304
54626 201304 200350 199006 198062 197915 197930 196760 193774 190074 187601 187115 187440 186891 185101 183121 182003 181716
54610 181716 181535 181130 180861 180974 180907 179784 177454 174699 172438 171170 171171 172491 174396 175491 175178 174584 175206
54593 175206 176758 177360 176085 174447 174762 177522 181053 183515 184614 185252 186097 186923 187195 186859 186258 185494
54577 185494 184335 182861 181751 181604 182236 183045 183791 184508 184852 184279 183024 182249 182818 184347 185941 187558
54561 187558 190014 193531 196767 197745 195712 191805 187806 184634 182364 181241 181780 183744 185930 187519 188958
54546 188958 190920 192942 193900 193470 192373 191460 191377 192767 195721 199124 201540 202812 203851 204936 205421 205275
54530 205275 205526 206578 207191 205948 202990 199657 197230 196605 198355 202149 206669 210811 214533 218070 221155
54515 221155 223741 226524 229656 231730 231337 229172 227259 226371 225531 223953 222039 220340 218911 218159 219108
54500 219108 221992 225396 227528 227960 227638 227615 228330 229803 232007 235000 238772 242873 246314 248274 248981 249490
54484 249490 250592 252340 254581 257273 260069 262248 263603 265046 267829 272240 277282 281537 284245 285767
54470 285767 287162 289190 291572 293222 293127 290971 287276 283322 280622 279691 279208 277098 272797 268090 265476
54455 265476 266008 268793 272001 274026 274233 273256 272437 272494 272783 272132 270269 268051 266362 265254 264406 264047 264916
54438 264916 267100 269297 269872 268795 268043 269537 272964 276236 277997 278874 280044 281391 281863 281411 281739 284783
54422 284783 290627 297208 302137 304787 306531 309011 312480 315981 318757 320973 323202 325782 328714 331677
54408 331677 334013 335350 336450 338839 343076 347799 351028 352198 352430 353054 354493 356516 358850 361178 362881
54393 362881 363246 362031 359783 357514 355884 354499 352175 348290 343946 341404 341983 344563 346439 345715 342729
54378 342729 339182 336274 334027 332075 330345 328679 326444 323223 319652 316873 315107 313485 311489 309904
54364 309904 309790 310954 312076 312225 311668 311210 311280 311813 312611 313597 314917 316940 319829 322900 324730 324372 322438
54347 322438 320649 320215 320899 321651 321720 320912 319214 316832 314549 313375 313491 314024 314233 314464 315370 316543 316848
54330 316848 316163 315902 317291 319701 321280 320903 318925 316387 314198 313018 313086 313890 314583 314985 315623 316462 316246
54313 316246 313875 310257 308027 309199 313411 318537 322673 325404 327510 329792 332154 333713 333728 332344 330358
54298 330358 328407 326539 324409 321655 318202 314499 311313 308976 307056 305173 303759 303210 302516 299908 295170
54283 295170 290231 286876 284844 282900 280820 279136 277594 275295 272207 269312 267194 265526 264093 263311
54269 263311 263461 264235 265273 266430 267317 267384 266650 265662 264586 263111 261415 260374 260504 261494 262951 264709
54253 264709 266196 266585 266028 265646 265736 265054 262580 258949 255369 252201 249561 248239 248785 250418 252041 253596
54237 253596 255221 255962 254838 252623 250862 249536 247453 244784 243249 243527 244213 243867 242524 240615 238065
54222 238065 235396 234187 235088 236389 235960 233942 232193 231550 231088 230042 229053 228995 229459 229125 227335 224769
54206 224769 222613 221358 220523 219502 218499 218410 219754 221942 223804 224743 225205 226018 227447 229101 230678 232490
54190 232490 234891 237335 238564 237883 235812 233290 230696 228025 225552 223717 222587 221924 221590 221495 221389 221187
54174 221187 221215 221634 221858 221138 219609 218296 218208 219728 222484 225309 226707 226075 224259 222415 220734 218874
54158 218874 217040 215730 214859 214134 213921 214643 215614 215694 214923 214289 213918 212937 211265 210222 210962 213381 216723
54141 216723 220089 222165 221897 220008 218633 218807 219415 219123 218144 217362 216881 216376 215912 215531 214849 213903 213635
54124 213635 214645 216106 216663 215881 214222 212307 210784 210135 209962 209267 207991 207365 208110 209413 210476 211804
54108 211804 213794 215201 214505 212086 209701 208417 208323 209439 211317 212306 210963 208145 206279 206655 208582
54093 208582 210882 212861 214043 214424 214941 216338 217668 217319 215452 213905 213663 214016 214380 215215 216670 217931
54077 217931 218544 218986 219265 218509 216806 216002 217458 220192 222400 223749 224791 225056 223492 220445 217643 216151
54061 216151 215569 215381 215924 217567 219701 221086 220878 219145 216704 214634 213681 213988 215389 217688 220446 222874
54045 222874 224503 225762 227362 229246 230683 231334 231510 231347 230536 229231 228468 228968 229949 229940 228695 227497 227465
54028 227465 228329 229230 229963 230737 231159 230406 228354 225781 223359 221214 219698 219736 221827 225203 228611 231531
54012 231531 234096 236264 237927 239663 242396 246016 249045 250162 249783 249755 251626 255393 259757 263285 265362
53997 265362 266315 266969 268105 270028 272299 274012 274743 275200 276546 279077 282141 285425 289574 295123 301534
53982 301534 307913 314218 321016 328386 335802 342987 350258 358179 367359 378337 391039 404542 417955
53969 417955 431277 444661 457084 466757 472926 476463 478605 479945 480758 481432 482173 482898 483577 483900 482498
53954 482498 477690 469778 461700 456384 453795 451472 447600 442534 437463 432757 428119 423460 418751 413329
53940 413329 406202 397345 388232 380663 375152 370714 366161 361247 356479 352220 348281 344297 340180 336211
53926 336211 332740 329827 327227 324815 322858 321534 320306 318317 315446 312478 310153 308667 308226 309135 310912
53911 310912 312254 312648 313151 314622 316014 315713 314029 312857 313057 313725 314213 315283 317662 320665 322944 323748
53895 323748 322971 320996 319200 319674 323499 329753 336752 343518 349486 353874 356582 359096 363083 368224 372753
53880 372753 376256 380723 388203 398204 408151 416162 422818 430209 439599 450097 459502 466315 470861 474611
53866 474611 478777 483752 489422 495468 501385 506770 511887 517684 525022 533957 543852 553989 563855 573101
53852 573101 581657 589992 598917 608854 619446 629995 639978 648854 655856 660710 664431 668548 673289 677282
53838 677282 679377 679941 679827 678942 676733 673444 669669 664934 658024 648989 639825 632684 627975 624462 620624
53823 620624 615658 609741 603805 598745 594695 591340 588839 587692 587405 585994 581355 572942 561801 549382
53809 549382 536719 524438 512846 501787 490624 478693 465966 453292 441798 431897 423054 414594
53797 414594 406480 399073 392472 386367 380336 374085 367828 362621 359709 358981 358684 357243 354868 352741 351371
53782 351371 350624 350524 350759 350004 347274 343586 340780 338881 336317 332728 329728 328505 328364 328212 327951 327813
53766 327813 327811 328529 330910 334447 337011 337387 336553 335618 334116 331657 329643 329742 331787 334797 338882 344294
53750 344294 349609 353077 355331 358666 363725 368846 372867 376714 381734 387932 394548 401231 408012 414877
53736 414877 421874 429092 436244 442790 448534 453655 458255 462376 466243 469813 472477 473942 475090 477020
53722 477020 479579 481810 483519 485213 486636 486701 484988 482187 478980 475495 471847 468034 463273 456778 449318
53707 449318 442625 436974 430870 423619 416674 411571 407864 404074 399448 393776 386740 378892 372330 368739
53693 368739 367129 364884 360815 355922 351446 347712 344831 343024 341683 339402 335653 331565 328390 326067
53679 326067 324068 322879 323407 325200 326467 326081 324713 323639 323202 322983 322901 323366 324523 326011 327514 329074
53663 329074 330777 332506 334043 335168 335770 336226 337467 340072 343361 346027 347584 348440 348610 347554 345662
53648 345662 344692 345868 348417 350867 353035 355636 358585 360965 362442 363527 364570 365626 367278 370404
53634 370404 374881 379363 382657 384710 386311 388463 391828 395866 398690 398874 397348 396330 396464 396452 395612
53619 395612 394975 395169 394992 393401 391586 391423 392687 393454 392934 392368 393087 394940 396881 398186 398723 398670 398233
53602 398233 397333 395620 393204 391053 390034 389779 389283 388514 388477 389550 390624 390398 388894 387229 386201 385597
53586 385597 384752 383519 382655 383166 385114 387254 388318 388508 389099 390594 392083 392723 392928 393469 394161 394451 394899
53569 394899 396821 400297 403550 404779 404011 402709 402198 402998 405161 408465 412429 416681 421207 425823 429734
53554 429734 432321 434189 436659 440181 444004 447550 451332 456163 462047 468233 473861 478309 481446 483911
53540 483911 486550 489256 491119 492137 493791 497005 500331 501520 500521 499535 499977 500788 500249 498338 496413
53525 496413 495159 493866 491731 489230 487850 488480 490235 491129 490080 488002 486656 486740 487531 488044 487862 486923
53509 486923 485351 483800 483328 484515 486937 489679 492077 493870 494973 495394 495204 494529 493673 493139 493336 494396
53493 494396 496428 499669 504015 508828 513779 519526 526720 534499 541003 545646 550041 556286 564902 574734
53479 574734 584419 593602 603119 614217 627424 642024 656871 671483 685977 700390 714962 730906
53467 730906 749695 771303 794051 816448 838363 860170 881932 904018 927527 953253 980966
53456 980966 1010465 1042503 1077610 1114530 1151055 1186353 1221552 1257945 1295444 1333073 1370343
53445 1370343 1407691 1445694 1484197 1522458 1560187 1598151 1637350 1677753 1718332 1758254 1797388
53434 1797388 1835683 1872888 1909088 1944678 1979515 2012930 2044919 2076406 2107744 2137790 2165120
53423 2165120 2189497 2211561 2231968 2251602 2271646 2292358 2312328 2329908 2344751 2356961 2365580
53412 2365580 2369463 2369284 2367174 2364410 2360713 2355603 2348856 2339410 2325458 2306386 2283578 2258635 2231808
53399 2231808 2202906 2172789 2142848 2113326 2082998 2050479 2015401 1978374 1940295 1901861 1863754
53388 1863754 1827120 1793318 1762665 1733697 1704392 1674160 1644053 1615267 1588408 1564260 1543972
53377 1543972 1527778 1514372 1502421 1492223 1485107 1481634 1481226 1483381 1488407 1496826 1508629 1523327 1540436
53364 1540436 1559814 1581745 1606705 1634791 1665408 1697736 1731497 1767071 1804904 1845100 1887675
53353 1887675 1932979 1981604 2033788 2088949 2145966 2204140 2263935 2326592 2392898 2462507 2534608
53342 2534608 2609047 2686376 2766795 2849510 2933513 3018821 3106382 3196624 3288477 3380194 3470884
53331 3470884 3560788 3650250 3739043 3826743 3913068 3997437 4078660 4155591 4227823 4295383 4358059
53320 4358059 4415573 4468182 4516364 4559801 4597188 4627383 4650505 4667692 4679799 4686370 4685874 4676936
53308 4676936 4659259 4633117 4598123 4553116 4497500 4432104 4358375 4277426 4190525 4099807 4007297
53297 4007297 3913369 3817188 3718666 3618922 3518768 3418021 3316933 3217226 3120762 3027688 2936683
53286 2936683 2846665 2757580 2669857 2583890 2500001 2418330 2338785 2261575 2187661 2118175 2053455
53275 2053455 1993148 1937112 1885571 1838331 1794623 1754164 1717777 1686376 1659602 1636039 1614701
53264 1614701 1595749 1579668 1566306 1555056 1545641 1538281 1533190 1530340 1529728 1531512 1535725 1542040 1549980
53251 1549980 1559296 1570184 1583307 1599458 1618839 1640629 1663653 1687575 1713036 1740581 1770116
53240 1770116 1801651 1835785 1872631 1910796 1948502 1985773 2024623 2066750 2111619 2157134 2201764
53229 2201764 2245575 2289309 2332795 2374447 2412450 2446380 2477308 2506166 2532613 2555942 2576466
53218 2576466 2595024 2611344 2623975 2631888 2635182 2634061 2628255 2618005 2604684 2589593 2572515 2551993
53206 2551993 2526572 2495458 2458690 2417301 2372821 2325927 2276171 2223617 2169983 2117030 2064285
53195 2064285 2009610 1951997 1892652 1833265 1774483 1716530 1660188 1606322 1554981 1505602 1457674
53184 1457674 1410645 1363711 1316421 1269310 1223295 1178613 1134912 1092319 1051773 1014141 979427
53173 979427 947099 916875 888876 863140 839233 816503 794720 774340 755847 738807 721952
53162 721952 704598 687672 672677 659605 646586 632027 616569 602291 590251 579594 569127
53151 569127 558905 549710 541449 532877 522960 512047 501562 492879 486557 482206 478783 475246 471248
53138 471248 467151 463271 459285 454537 448783 442501 436678 432361 429969 428647 426717 423340 419559 416984
53124 416984 415610 413717 410054 405222 400608 396860 393999 392127 390961 389195 385606 380824 377011 375606
53110 375606 376139 377356 378537 379287 378859 376470 372027 366292 360679 356953 356328 358278 360796 362386 363404
53095 363404 364996 367257 369147 369763 368937 366868 363982 361059 358757 357024 355431 353950 352866 352170 351646
53080 351646 351335 351254 350986 350302 349945 350797 352446 353636 354139 354928 356262 356792 355218 351894 348140 344778 342092
53063 342092 340553 340640 342154 344257 346065 347000 346908 346186 345488 345174 345395 346527 348679 350792 351331 350259 349251
53046 349251 349432 349963 349489 347817 345346 342003 338053 334940 333877 334068 333667 332095 330172 328467 327039
53031 327039 326490 327574 329573 330535 329557 327668 326071 324641 322672 320200 317953 316601 316404 317003 317268 316033
53015 316033 313370 310747 309689 310675 313276 316685 319964 322406 323906 324642 324495 323320 321634 320279 319440
53000 319440 318714 318065 317896 318210 318586 318948 319394 319282 317687 314961 312673 311639 311135 310381 309562 308810 307430
52983 307430 305103 302869 301865 301732 301175 299632 297639 296047 295536 296339 297680 297954 296164 292918 289532
52968 289532 286750 284821 284003 284071 283901 282580 280681 279610 279957 281208 282853 284908 287365 289774 291515
52953 291515 292162 291728 290741 289778 288795 287439 286191 286269 287844 289341 289402 288727 288888 289987 290773 290684 290358 290170
52935 290170 289519 287809 285243 282510 280424 279785 280660 281782 281616 280168 278966 279167 280491 282113 283657
52920 283657 285053 286240 287291 288175 288333 287325 285995 285973 287638 289637 290937 292292 294811 297923 299951
52905 299951 300371 300421 301455 303477 305507 306806 307417 307732 307776 306989 304816 301521 298154 295629 294058 293075
52889 293075 292356 291541 290084 287832 285658 284909 285984 287697 288308 287069 284694 282461 281053 280257 279511 278409
52873 278409 276729 274314 271212 267879 265048 263383 263251 264608 266953 269508 271687 273360 274568 275173 274975
52858 274975 274074 272914 272051 271938 272686 273802 274426 274159 273541 273422 273987 274626 274627 273755 272265 270612 269094 267695
52840 267695 266388 265432 264876 263912 261592 258512 256794 257723 260259 262767 265276 268738 272741 275716 277258
52825 277258 278592 280391 281650 281227 279233 276272 272585 268695 265858 264925 265546 267217 270164 274300 278266
52810 278266 280789 282412 284554 287205 288863 288705 287650 287118 287797 289823 293054 296570 298769 298837 297896 297954
52794 297954 299631 301313 300804 297657 293638 290818 289595 288864 287799 286659 285894 285444 285276 285668 286279 285794
52778 285794 283523 280734 279178 278641 277301 274481 271697 270570 270870 271209 270775 269756 268836 268960 270942 274461
52762 274461 277775 279104 278158 275946 273587 271880 271475 272496 274086 275165 275700 276614 278380 280373 281837
52747 281837 282920 284427 286883 290015 292742 293497 291132 286121 280715 277309 276459 276691 276243 274713 272913
52732 272913 271593 270767 270160 269645 268832 266710 262478 256888 252154 250172 251087 253692 256713 259243 260525
52717 260525 260203 258785 257298 256427 256354 257204 258975 261046 262494 263014 262873 261887 259354 255356 251336 248823
52701 248823 248128 248773 250455 252868 255098 256197 256179 255851 255801 256031 256250 256031 255160 254422 255384 258457 261776
52684 261776 263162 262790 262599 263496 264860 266729 270330 275702 280614 283057 283476 283350 282858 281516 280148 280358
52668 280358 282347 284760 286661 288274 289732 290383 289682 287889 285636 283495 281953 281032 279922 277835 275316
52653 275316 273803 273854 274610 275139 275348 275444 275540 276125 277819 280098 281197 280135 278203 277590 278898 280638 280900
52636 280900 279030 275979 273526 272890 273614 274125 273669 273229 273996 275492 276077 275114 273831 273844 275426 277385 278319
52619 278319 277834 276745 276158 276340 276611 276363 275782 275362 275216 275345 276109 277729 279561 280715 281356 282615 284998
52602 284998 287518 288692 287864 285347 282011 279190 278409 280313 283974 287820 291223 294749 298878 303167 306822
52587 306822 309490 311044 311033 309045 305580 302000 299420 297962 297306 297498 298726 300475 301555 301314 300497 300500
52571 300500 301777 303233 303256 301154 297677 294500 293370 295294 299782 304814 308123 309005 308637 308426 308450 308027
52555 308027 307321 307373 308467 309447 309177 307921 306596 305099 302367 298036 293265 289718 288181 288332 289431 290888
52539 290888 292356 293539 294135 294118 294103 295084 297491 300624 303224 304462 304268 303128 301941 301680 302634 304220
52523 304220 305988 308415 311936 315615 317853 318451 318788 319732 320531 320339 319805 320168 321382 322148 321562 319863
52507 319863 317694 315459 313516 312344 312157 312654 313305 313698 313546 312617 310853 308478 305980 303859 302354 301436
52491 301436 301205 302036 303854 305398 305039 302686 300245 299579 300496 301468 301927 302903 305334 308674 311550 313180
52475 313180 313644 313227 312129 310786 309871 309740 310072 310233 309869 309007 307791 306457 305513 305500 306385 307526 308473
52458 308473 309434 310618 311561 311671 311175 310800 310758 310919 311805 314240 317704 320250 320721 320165 320261 321262 322406
52441 322406 323533 324885 325753 324885 322451 320336 319993 320881 321463 321010 319913 318850 318231 318167 318542 319229 320266
52424 320266 321560 322481 322443 321981 322547 324780 327595 329463 330145 330620 331768 333729 336206 338663 340406 341204
52408 341204 341872 343620 346663 349910 352108 352808 352195 350694 349177 348926 350572 353120 354653 354217 352645
52393 352645 351371 350826 350313 349198 347662 346208 344882 343262 341044 338348 335535 332943 330766 329025 327667
52378 327667 326785 326578 326847 326794 325795 324431 324159 325701 328164 330150 331375 332736 334994 338007 341218 344247
52362 344247 346775 348344 348682 348030 346909 345745 344816 344206 343601 342540 341376 341691 345019 351086 357777 363014
52346 363014 366346 368695 371119 374111 377630 381282 384463 386711 387970 388530 388896 389719 391313 392896 392727
52331 392727 389675 384576 379467 375529 372484 370103 369341 371093 374248 376128 375292 373203 372513 374087 376558
52316 376558 378597 380541 383269 386403 388677 389718 390331 391096 391788 392530 394372 398034 402847 407646 412048
52301 412048 416065 419107 420455 420354 419672 418679 417195 415701 415089 415250 415158 414669 415069 417251 420398 423199
52285 423199 425470 427682 429653 430805 431375 432255 433677 434982 435808 436750 438600 441555 445495 450450 456298
52270 456298 462332 467762 472701 478243 485373 494108 503984 515087 527899 541960 555321 565966 573674
52257 573674 579975 586359 592971 599077 604291 609187 614962 622526 631590 640667 648292 654260 659406 664439
52243 664439 669559 675044 681352 688366 695215 701301 707060 713363 720406 727487 733660 738422 741916 744595
52229 744595 746628 747855 748445 749112 750130 750674 750038 749137 749697 752054 754944 757430 759764 762229 764660 767584
52213 767584 772203 778360 783857 786967 788589 790851 794516 798878 803260 807311 810630 813440 817075 822447
52199 822447 828512 833514 837291 841050 845409 850169 855675 862695 870902 878943 886203 893252 900515 907878
52185 907878 915602 924079 932314 938166 940812 941895 943633 946837 951251 956610 962552 968441 974118 980097
52171 980097 986271 991319 994319 996371 999625 1004998 1011619 1018196 1024125 1029409 1034319 1039348 1044995 1051328
52157 1051328 1057970 1064681 1071901 1080519 1090857 1101837 1111594 1119262 1125830 1132830 1140643 1148788 1157350
52144 1157350 1166905 1177032 1186126 1193197 1198905 1204451 1210267 1216386 1223225 1231077 1239186 1246089 1250834 1253583
52130 1253583 1255235 1256815 1258934 1261424 1263554 1264747 1265032 1264835 1264593 1264501 1264284 1263302 1261292 1258843 1256597 1254089
52114 1254089 1250189 1244837 1239592 1236092 1234294 1232392 1228301 1221458 1213639 1207638 1204551 1202705 1200075 1197007
52100 1197007 1195310 1195152 1194770 1193334 1192099 1192156 1192814 1193144 1193512 1194455 1195409 1195802 1196265 1197474 1198793 1199278 1199099
52083 1199099 1198777 1198060 1196988 1197036 1199428 1202990 1205427 1206281 1206810 1207226 1206088 1202701 1198376 1194894 1193076 1193220
52067 1193220 1195535 1199536 1204184 1209319 1216116 1225627 1237702 1251735 1267459 1284358 1301117 1316468
52055 1316468 1330209 1342880 1354815 1365883 1375839 1384634 1392671 1400739 1409072 1416418 1420806 1421602 1420180
52042 1420180 1418284 1416383 1414078 1411384 1408914 1407186 1406426 1406827 1408419 1410656 1412515 1413099 1412112 1409940 1407296
52027 1407296 1404544 1401286 1396947 1391828 1387111 1383568 1380591 1376864 1371825 1366266 1361554 1358321 1355763 1352369
52013 1352369 1347721 1343469 1341921 1343570 1346687 1349605 1352544 1356568 1361499 1365971 1369237 1371766 1373920 1375141
51999 1375141 1375002 1374161 1373443 1372561 1370808 1368768 1368136 1369477 1371132 1370855 1367908 1363021 1357231 1351598 1347219
51984 1347219 1344090 1340203 1333325 1323860 1314593 1307170 1300306 1292262 1283763 1277059 1272818 1269368 1264863 1259194
51970 1259194 1253825 1250491 1249948 1251321 1252758 1253091 1252504 1251270 1248820 1244996 1241357 1239789 1240152 1240558 1239761
51955 1239761 1237833 1234720 1229840 1223457 1216935 1211001 1204869 1197651 1189433 1180335 1169580 1156455 1141415
51942 1141415 1125451 1108956 1091828 1074088 1055808 1037053 1018403 1000740 983919 966449 947411
51931 947411 928033 910445 895333 881698 868452 855250 842074 829060 816739 805594 795333
51920 795333 785169 774678 763834 752588 741298 731235 723440 716908 709091 698762 687627 678580
51908 678580 673023 670495 670221 671958 675379 679563 683629 687539 691836 696661 701449 705725 709947 715205
51894 715205 722084 729983 737473 743087 745892 745778 743453 739892 735768 731626 728510 727664 729285 732216 735468
51879 735468 739568 745789 754477 765009 777117 791153 806789 822494 836975 850474 863845 876572
51867 876572 886586 892135 893171 890536 884363 874077 859990 844059 828471 813718 798577 781927
51855 781927 764011 745901 728462 712237 697823 685644 675488 666760 659232 653216 648970 646249
51843 646249 644517 643428 643093 644071 647113 652665 660519 669882 679772 689335 698071 706045 713837 722090 731004
51828 731004 740331 749913 760189 772006 785490 798892 808907 812809 810319 803047 792376 778790
51816 778790 763223 747830 734651 724281 716517 711460 708877 707085 703848 698462 691994 685501 679055
51803 679055 672546 666260 660118 653281 645168 636388 628152 621146 615307 610209 605419 600958 597616 596172
51789 596172 595891 594543 590601 584944 579623 575346 571018 565668 559940 555321 552304 549731 546023 540982
51775 540982 536054 532568 530078 527239 524260 523240 525434 529147 531428 531280 530085 529265 528760 527841 526246
51760 526246 524229 522372 521600 522495 524275 525249 524717 523710 523469 523966 524461 524788 525351 526304 527407 528411 529008
51743 529008 528782 527830 527205 528072 530448 533199 535178 536029 536130 536177 536643 537197 536823 534881 531792 528259 524234
51726 524234 519332 514008 509556 506914 506045 506326 506875 506660 505182 503209 502083 502142 502599 503065 504166 506145
51710 506145 507876 508295 508295 510139 514984 521717 528343 533901 538766 543560 548187 551986 554582 556413 558275
51695 558275 560406 562206 562880 562168 560318 557547 553749 548801 543094 537622 533314 530196 527512 524835 522638
51680 522638 521482 521236 521752 523870 528653 535668 543087 549710 555993 562866 570426 578214 585777 592472 597630
51665 597630 601694 606373 612862 620449 627548 633325 637495 639332 638175 634545 629691 624350 618940 614417
51651 614417 611500 609230 605797 600970 596269 592381 587904 581483 574008 567602 563189 560226 558385 558206
51637 558206 559878 562307 564025 564676 565050 565681 565938 564986 563325 562509 563153 564022 563616 561835 559278 555731
51621 555731 550716 545198 541186 539420 538693 537820 537062 537147 538050 539571 542129 546172 551458 557709 565317 574589
51605 574589 584868 595309 606059 617679 629647 640267 648044 652453 653462 651082 645616 637917 629299
51592 629299 621210 614626 609359 604319 599011 594492 592194 591935 591712 589500 584756 578227 570930 563575 556496
51577 556496 549763 543327 537204 531544 526575 522424 518812 515015 510522 505748 501652 498660 496552 495472
51563 495472 496038 497992 499789 500462 501133 503509 507327 510489 511510 510659 508765 506205 503306 500621 498337
51548 498337 496270 494724 494451 495373 496326 496584 496786 497699 498973 499995 501262 503925 508372 514157 520981 528752
51532 528752 536918 544774 552485 560836 569703 577529 582741 585245 586323 587450 589421 592078 594611 596493
51518 596493 598375 601704 607245 614343 621880 629502 637551 646237 655473 665366 676260 688194 700707
51505 700707 713310 725928 738751 751723 764266 775671 785990 796508 808987 824371 842638
51494 842638 863832 888269 915044 941121 963138 979963 992512 1001154 1004590 1001687 993305 981438
51482 981438 967106 949811 928752 904072 877232 850513 825740 803041 781168 759359 738338
51471 738338 719114 701502 684584 668155 652975 639919 629534 622031 616903 612773 608353 603346
51459 603346 597896 591793 585062 578789 574078 570485 566628 562147 557806 553882 549967 546382 544089 542810
51445 542810 540864 537560 534261 532315 531367 530663 530539 531304 531820 530770 528532 526347 524348 522000 519909
51430 519909 519415 520525 521921 523176 525382 529150 533388 536714 539071 541162 543083 544286 544480 543842 542525
51415 542525 540452 537623 534376 531287 528754 526539 523789 519672 514037 507527 501294 496507 493524 491345
51401 491345 488534 484980 481950 479953 477641 473739 469114 465609 463631 462450 462237 463827 466576 468646
51387 468646 469892 472540 478092 485331 492497 499884 508735 518797 528780 538488 548636 558756 566989
51374 566989 572313 575768 579119 583129 587332 590562 591402 588907 583457 576545 569493 562674 556008 549632
51360 549632 543881 539016 535090 531733 528062 523296 517631 512132 507791 505241 505278 508568 514318 520093 523840
51345 523840 525751 527350 529142 530118 529579 528412 528130 529339 531686 534875 539132 544803 551923 560112 568644
51330 568644 576685 583822 590355 596956 604122 612226 621910 634014 649008 666745 686868 709207 733610
51317 733610 759572 786334 813467 841318 870655 901660 933268 963678 991440 1015757 1035835
51306 1035835 1050699 1059989 1064288 1063895 1057693 1044134 1023311 997238 968009 936420 902561 866963
51294 866963 830759 795242 761592 730574 702200 676068 652203 631003 612303 595305 579784
51283 579784 566482 555702 546295 536883 527543 519467 513389 509180 506554 505016 503199 499409 493269 486197
51269 486197 479965 475231 471692 469112 467678 467489 468038 468418 468073 467145 465878 463939 460945 457609 455415
51254 455415 454693 453879 451403 447716 444620 443047 442366 441495 439795 437134 434056 431760 430989 431001 430465 429366
51238 429366 429145 430906 434323 438342 442064 444803 446234 446905 447958 449939 452369 454611 456593 458498 460230
51223 460230 461443 461746 460972 459622 458709 458487 457758 455567 453398 454208 458817 464445 467529 467095 464781 462505
51207 462505 461110 460756 461517 463416 466202 469142 471166 471742 471654 472289 473994 475775 476690 476637 475533 472858
51191 472858 468739 464596 461785 460138 458698 457418 457202 458445 460402 462100 463290 464326 465440 466289 466196
51176 466196 464943 463246 462219 462377 463360 464460 465031 464720 463990 464196 466206 469101 471251 472618 474636 477665
51160 477665 480103 480661 480094 479849 480261 481080 482450 484118 484737 483529 481860 481711 483124 484574 485343 485983
51144 485983 486811 487702 489393 493359 499817 506961 512525 515336 515278 512873 509333 506217 504532 504419 505557
51129 505557 507309 508786 509701 511017 513749 517184 519321 519219 517891 516707 515853 514672 512676 509870 506807
51114 506807 504421 503102 501888 499511 496243 493662 492509 492074 491919 492656 494303 495306 494363 492208 490459
51099 490459 489577 489226 489841 492254 495970 499207 500771 500917 500401 499727 499469 500197 501654 502778 503021 503118 504049
51082 504049 505654 506734 506282 504305 501661 499465 498576 499300 501332 503858 505773 506189 505094 503445 502300
51067 502300 501944 502197 503395 506293 510765 515284 518300 519822 521039 522634 524253 525657 527444 530092 532910
51052 532910 534769 535656 536743 538863 541707 544795 548468 553201 558342 562359 564512 565747 567791 571654
51038 571654 577078 582905 587600 589843 589396 587607 586634 587728 590321 592914 594669 595786 596611 597037 596937
51023 596937 596439 595265 592417 587408 581667 577859 577541 579962 583151 585499 586285 585615 584351 583551 583526 583872
51007 583872 584560 586197 588853 591617 594105 597505 602963 609647 615831 621641 629087 639000 649294 657062
50993 657062 661489 663991 666264 669228 673582 680177 689291 699835 709807 717835 724461 731750 741280 752295
50979 752295 762029 767974 769740 768791 766795 764587 762416 760439 758444 755320 749581 740889 730802 721466
50965 721466 713656 706628 699746 693366 687944 683265 679238 676648 676218 677430 679238 681640 685442 690558
50951 690558 695598 699372 702032 704510 707504 711267 715814 721069 727174 734633 743619 753212 762093 770086
50937 770086 778216 787051 795861 803770 810905 817838 824609 831015 837435 844599 852759 861597 870732 879849
50923 879849 888576 896741 904624 912510 920083 926660 931871 935718 938017 938301 936301 932164 926185 918858
50909 918858 911509 906342 904920 906407 908098 908517 909653 915084 925708 938427 949719 959615 971029
50896 971029 985841 1003102 1021096 1039690 1060031 1082872 1107966 1134571 1161958 1189622 1217295
50885 1217295 1244671 1271384 1297862 1325982 1357820 1393560 1431614 1470828 1511183 1551720 1589367
50874 1589367 1621264 1647357 1669407 1688144 1702843 1713148 1719544 1722036 1720087 1714228 1706158 1696439
50862 1696439 1683313 1664877 1641637 1615838 1588821 1560226 1529610 1497600 1465127 1432497 1399948
50851 1399948 1368685 1340469 1316084 1294635 1274532 1254907 1235954 1218254 1202133 1187437 1173506
50840 1173506 1159363 1144384 1128951 1114202 1101019 1089401 1078767 1068477 1058080 1047631 1037971
50829 1037971 1030116 1023885 1017583 1009697 1000753 992940 987962 985705 984859 984235 983502 983269 984626 988034 992339
50814 992339 995325 995677 994211 992982 993551 996337 1001107 1007378 1014484 1022022 1030437 1040650 1052822 1065967
50800 1065967 1079126 1092528 1107032 1122679 1138534 1154120 1170423 1189006 1210280 1233018 1255560
50789 1255560 1277354 1299342 1323019 1349219 1377843 1408653 1441863 1477588 1514975 1552628 1590160
50778 1590160 1628759 1669830 1713355 1758008 1802633 1847210 1892479 1939012 1986773 2035516 2085609
50767 2085609 2138274 2194585 2254221 2315843 2378855 2444178 2512847 2584517 2657886 2731898 2805632
50756 2805632 2877458 2945254 3007282 3062073 3107722 3142374 3165581 3178382 3181793 3175688 3159213 3131926
50744 3131926 3094780 3050470 3002429 2952760 2901668 2849694 2799741 2755256 2716648 2681371 2647795
50733 2647795 2617343 2592366 2573698 2561259 2555394 2556208 2562590 2573142 2587246 2604178 2622202 2639856
50721 2639856 2657282 2674910 2691569 2705501 2716584 2725669 2731943 2732914 2727422 2716922 2703094 2685516
50709 2685516 2662466 2632884 2596626 2553794 2504973 2451614 2395065 2335458 2272456 2207089 2142056
50698 2142056 2080050 2022317 1968817 1918972 1871894 1826650 1783150 1742631 1706655 1675623 1648850
50687 1648850 1626059 1607848 1594250 1583737 1574628 1567132 1563019 1563391 1567685 1574840 1584438 1596407 1610544
50674 1610544 1626840 1645659 1667157 1691069 1717385 1746468 1777983 1810378 1842077 1872757 1902909
50663 1902909 1932584 1961240 1988470 2014302 2038955 2062670 2085450 2106682 2125549 2142312 2158799
50652 2158799 2177043 2197760 2220439 2244421 2269399 2295496 2323519 2354757 2389922 2428646 2470414
50641 2470414 2515366 2563529 2613929 2665343 2717345 2769624 2820642 2868113 2910782 2948939 2983255
50630 2983255 3013903 3040816 3064264 3085225 3105512 3127009 3150152 3173733 3196948 3221038 3247920
50619 3247920 3277872 3309900 3344065 3381953 3424913 3473217 3527202 3587938 3656269 3732148 3815224
50608 3815224 3905039 4000200 4098134 4196224 4292703 4386417 4476596 4563122 4646267 4725832 4801157
50597 4801157 4872098 4939171 5002444 5060994 5113625 5159322 5196867 5225027 5243867 5255288 5261857
50586 5261857 5265400 5266812 5266556 5265226 5264216 5265830 5271869 5282023 5294633 5309074 5326244 5346399 5367860
50573 5367860 5388417 5406775 5421822 5431743 5435076 5431815 5422393 5406468 5383995 5356628 5326182 5291560
50561 5291560 5248664 5193904 5127125 5051174 4969884 4887168 4807125 4733620 4669143 4614143 4567726
50550 4567726 4529128 4498501 4476084 4460667 4449339 4438945 4427419 4413337 4394577 4368065 4331013
50539 4331013 4282262 4222460 4153184 4075967 3992140 3903349 3811709 3719009 3625987 3532946 3440942
50528 3440942 3351842 3267337 3188537 3116347 3051265 2992673 2939454 2891736 2851122 2818637 2793381
50517 2793381 2773922 2760043 2752061 2749182 2749958 2754226 2763325 2778107 2797617 2820060 2844398 2870636
50505 2870636 2898998 2929370 2961507 2995535 3032015 3071399 3113659 3158836 3207975 3262818 3324395
50494 3324395 3392643 3467952 3552267 3647604 3753648 3867607 3986310 4107627 4229941 4351435
50484 4351435 4470735 4587985 4704805 4823172 4944424 5069167 5197903 5331500 5470751
50475 5470751 5615383 5763973 5915272 6069431 6227522 6390103 6556848 6727465 6902115
50466 6902115 7080539 7261331 7442662 7623518 7803702 7982625 8158465 8328511 8489722
50457 8489722 8638553 8770627 8881503 8968180 9029505 9064788 9072313 9049682 8995507 8910442 8796725
50446 8796725 8657262 8495329 8314927 8121183 7920246 7718394 7520994 7332468 7157175
50437 7157175 6999473 6862256 6746057 6650442 6575736 6522320 6488507 6470173 6462255 6459322 6454894
50426 6454894 6441951 6414829 6369641 6302990 6212313 6098432 5966033 5819985 5662042 5492369
50416 5492369 5313092 5128588 4942824 4758136 4576330 4399142 4227297 4060576 3899470
50407 3899470 3745836 3601456 3466707 3341068 3224234 3116220 3016900 2926078 2843857 2770434
50397 2770434 2705392 2647409 2594988 2547617 2505998 2470705 2440852 2414719 2391716 2372816 2358695
50386 2358695 2348325 2339991 2333097 2328359 2326894 2329825 2338108 2351832 2369912 2391002 2414282 2438957
50374 2438957 2463895 2488741 2514688 2543157 2574386 2608395 2646517 2690298 2739218 2791161 2845266
50363 2845266 2902826 2965160 3032132 3103336 3179299 3260592 3346657 3436525 3530245 3628732 3732354
50352 3732354 3840270 3951278 4064954 4181609 4300906 4420713 4537932 4650585 4758336
50343 4758336 4860723 4955980 5042388 5119617 5187450 5243982 5286534 5313645 5324394 5316320 5286290
50332 5286290 5233833 5161959 5074394 4973759 4862817 4745374 4624774 4502908 4381729 4264509
50322 4264509 4154487 4053306 3961831 3881568 3814136 3759883 3717812 3686280 3663149 3646031 3632959
50311 3632959 3622065 3610157 3592900 3567376 3533563 3492333 3443039 3384237 3315983 3240152 3159006
50300 3159006 3074489 2988318 2901521 2814198 2726607 2640065 2555980 2474665 2396097 2321027 2250158
50289 2250158 2182838 2117993 2055946 1998017 1944669 1895331 1849664 1807522 1767979 1730083 1694636
50278 1694636 1663587 1637351 1614116 1592188 1571698 1553564 1538014 1524739 1513345 1503017 1492720
50267 1492720 1482438 1473419 1466622 1461634 1457565 1454176 1451686 1450389 1451067 1454803 1461657 1470353 1480124 1491973
50253 1491973 1506993 1524027 1540213 1553641 1564412 1573351 1580933 1587692 1594566 1602144 1610097 1617856 1625521
50240 1625521 1633625 1642093 1649851 1655768 1660000 1664207 1670007 1677186 1683879 1688816 1692897 1697956 1704350 1710751
50226 1710751 1716368 1722372 1730465 1740854 1752873 1767475 1787381 1813384 1840823 1861197 1867986 1860795
50214 1860795 1844031 1822767 1800492 1779443 1761045 1745499 1732125 1720656 1711550 1704643 1698422 1691480
50202 1691480 1684293 1678775 1676232 1676330 1677978 1680586 1684287 1689316 1695458 1701982 1708123 1713663 1718988 1724622
50188 1724622 1730935 1738369 1747481 1758411 1770593 1783431 1797130 1812495 1830087 1850041 1872580 1898164
50176 1898164 1926914 1958398 1992302 2029172 2070183 2116125 2166730 2221083 2278757 2340516 2407782
50165 2407782 2481275 2560144 2642181 2724490 2803973 2877864 2944572 3004146 3057659 3106162 3150310
50154 3150310 3190586 3227214 3259694 3286568 3305486 3313164 3305631 3279449 3233294 3168297 3087037 2992784
50142 2992784 2889699 2782763 2676472 2573473 2474717 2380693 2292163 2209998 2134971 2067720
50132 2067720 2008242 1955085 1905436 1856697 1808154 1760986 1716684 1675649 1637304 1601155 1567404
50121 1567404 1536602 1509129 1485061 1464239 1446237 1430439 1416296 1403384 1391196 1379377 1368427
50110 1368427 1359613 1353537 1349092 1344599 1339852 1336258 1334972 1335772 1337977 1341408 1345915 1350820 1355694 1361155
50096 1361155 1368130 1376740 1386600 1397748 1410327 1423617 1436438 1448542 1460859 1474321 1489174 1505309
50084 1505309 1522289 1538931 1553891 1567133 1580085 1594042 1609113 1625041 1642116 1660677 1680458
50073 1680458 1701167 1723126 1746752 1772013 1799139 1829198 1862890 1899106 1935796 1972351 2010286
50062 2010286 2051626 2097492 2148397 2204903 2267390 2335641 2409188 2487990 2572773 2665075 2766989
50051 2766989 2880329 3005706 3142635 3290360 3447870 3612724 3780385 3945411 4103537
50042 4103537 4252857 4393593 4527037 4654407 4776275 4892786 5003687 5107041 5197655 5267904
50032 5267904 5311240 5324846 5308619 5262483 5186099 5080998 4951452 4802526 4638167 4461875
50022 4461875 4278208 4092238 3907630 3726374 3550491 3383002 3226742 3082994 2951745
50013 2951745 2832580 2724661 2626488 2536746 2455311 2382586 2317876 2259276 2205281 2155670 2110548
50002 2110548 2069368 2031524 1997220 1966963 1940450 1916528 1894052 1872251 1850525 1828503 1806284
49991 1806284 1784160 1762215 1740611 1720005 1701065 1683615 1666949 1651055 1636886 1625193 1615712
49980 1615712 1607865 1601680 1597428 1594651 1592359 1590340 1589698 1591518 1595159 1598442 1599819 1600033 1601233 1604688
49966 1604688 1609800 1615220 1620078 1623972 1626610 1628123 1629217 1630340 1631014 1630640 1629722 1629576 1630929 1633382 1636089
49951 1636089 1638336 1639628 1640085 1640923 1643827 1649548 1657481 1666777 1677435 1690195 1705908 1725207 1748406
49938 1748406 1775563 1806893 1843208 1885628 1934856 1990973 2053765 2122851 2197694 2278026 2363956
49927 2363956 2454892 2548536 2641856 2733011 2821280 2905048 2981257 3047608 3104550 3154560 3200113
49916 3200113 3242627 3282062 3316174 3340506 3350102 3341385 3312315 3261698 3189467 3097506 2989456
49905 2989456 2869695 2742772 2613220 2484974 2360819 2242719 2132236 2030176 1936330 1850380
49895 1850380 1772788 1704026 1643198 1588450 1538878 1495231 1458472 1428217 1402891 1380928 1361617
49884 1361617 1345097 1331796 1321643 1313585 1305922 1297189 1286812 1275219 1263457 1252419 1242059 1231401
49872 1231401 1219385 1205526 1189857 1172846 1155638 1139703 1125635 1112725 1100201 1088407 1078151
49861 1078151 1069366 1061205 1053145 1045218 1037480 1030105 1023802 1019252 1016221 1014046 1012767 1012816 1013660 1014044 1013834
49846 1013834 1014472 1017024 1020671 1023896 1026461 1029479 1033894 1039630 1046112 1053016 1060411 1068324 1076254 1083209
49832 1083209 1088514 1092452 1095781 1098745 1101029 1102392 1102602 1100770 1095818 1087959 1078886 1069987 1061045 1051171
49818 1051171 1040266 1028873 1017207 1005276 993696 983544 975358 968770 963153 958309 954455 951688
49806 951688 949398 946368 942045 937810 936230 938591 943780 949961 956487 963398 969999 975396 980213 986381
49792 986381 995000 1005359 1016208 1026847 1036671 1044758 1050793 1055785 1061175 1067535 1074402 1080819 1085569
49779 1085569 1087583 1086917 1084957 1082860 1080076 1075280 1068641 1062147 1057378 1053744 1049457 1043690 1037238 1031405
49765 1031405 1026993 1024349 1023684 1024853 1027056 1029249 1031044 1033145 1036741 1042318 1049104 1055745 1061610 1067361
49751 1067361 1074114 1082060 1090101 1096916 1102136 1106234 1109456 1111479 1112314 1112892 1114038 1115106 1114424 1111149 1105893
49736 1105893 1099319 1091144 1081334 1071394 1063109 1056197 1048575 1039304 1030026 1022777 1017290 1011493 1004137 995934
49722 995934 988282 981881 976733 972699 969580 967001 964542 961965 959365 957212 956128 956349 957573 959592
49708 959592 962799 967682 974054 981279 989054 997329 1005589 1012865 1018583 1022902 1026285 1029291 1032715 1037087
49694 1037087 1041832 1045606 1047698 1048533 1048619 1047758 1045633 1042437 1038446 1033538 1027693 1021490 1015566 1009972 1004541
49679 1004541 999569 995635 993032 991741 991656 992455 993548 994522 995426 996439 997616 999095 1001062 1003296 1005405
49664 1005405 1007761 1011446 1016817 1022857 1028523 1034040 1040293 1047677 1056326 1066687 1078893 1092090 1105271
49651 1105271 1118152 1130199 1139537 1144324 1145105 1144480 1144389 1144750 1144692 1143834 1142081 1139270 1135531 1131408 1127400
49636 1127400 1123859 1121158 1119219 1117090 1113954 1110386 1107555 1105299 1102364 1098701 1096118 1096134 1098352 1101568
49622 1101568 1105430 1110256 1116165 1123246 1131902 1142111 1152786 1162739 1172130 1182492 1195318 1210673 1226784
49609 1226784 1240820 1250563 1255625 1257009 1255843 1253130 1250264 1248562 1248049 1247685 1247026 1246829 1247872 1250075 1252797
49594 1252797 1254764 1253566 1246747 1234149 1218126 1201013 1183680 1166985 1152796 1142199 1133965 1126207
49582 1126207 1118702 1112433 1107845 1104950 1104238 1105882 1108633 1110878 1112355 1113629 1114540 1114708 1114925 1116250 1117939
49567 1117939 1117986 1115787 1112769 1110321 1108523 1106968 1105333 1102913 1099143 1095031 1092698 1092846 1093778 1093509 1091891
49552 1091891 1090216 1089669 1090685 1093034 1096049 1099463 1104173 1111212 1119782 1127508 1133121 1137777 1143162 1149447
49538 1149447 1155817 1161894 1167630 1172719 1177204 1181957 1187465 1192749 1196573 1199324 1202525 1206750 1211126 1214858
49524 1214858 1218180 1221571 1224927 1227895 1230388 1232432 1233971 1235273 1237265 1241042 1246930 1254164 1261653 1268960
49510 1268960 1276334 1283698 1290155 1295094 1299444 1304935 1312088 1319829 1327220 1334514 1342099 1349572 1356665 1364016
49496 1364016 1371776 1378080 1380356 1377967 1372493 1365690 1358470 1351786 1346882 1344086 1342448 1341114 1340132 1339500
49482 1339500 1338639 1337625 1337834 1340107 1342960 1344024 1343064 1342324 1343819 1347491 1352271 1357759 1364094 1371067 1378382
49467 1378382 1386518 1396440 1408577 1422820 1439590 1459941 1483985 1509646 1533823 1554889 1573493 1590786
49455 1590786 1606531 1619570 1629639 1637677 1644225 1648619 1650444 1651053 1652649 1656129 1660744 1665583 1670057
49442 1670057 1672670 1670746 1662434 1648421 1630902 1611479 1590979 1570651 1552010 1535267 1518936 1501526
49430 1501526 1483087 1464938 1448573 1435047 1424647 1416542 1409191 1401644 1394238 1387711 1381945 1376097 1369793
49417 1369793 1363763 1359189 1356573 1355243 1353886 1351587 1348361 1344719 1341023 1337519 1334604 1332448 1330485 1327894
49403 1327894 1324665 1321591 1319207 1317420 1316236 1315958 1316280 1315961 1314040 1310922 1307726 1304887 1301782 1297487 1291702
49388 1291702 1285217 1279545 1275573 1272561 1269131 1265147 1261611 1258711 1255414 1251425 1247947 1245569 1243033 1239501
49374 1239501 1236597 1236336 1238138 1240042 1242167 1246386 1252757 1258969 1264036 1270131 1279526 1291533 1303990 1316406
49360 1316406 1330044 1345788 1363473 1382678 1402518 1420724 1434422 1442498 1446693 1450068 1454637 1460366
49348 1460366 1465965 1470529 1474710 1480550 1490188 1504508 1522696 1542790 1562882 1582216 1601160 1620029
49336 1620029 1638441 1656234 1674395 1694039 1714783 1735145 1754377 1772629 1789356 1803055 1812979
49325 1812979 1819754 1823820 1824808 1823283 1821459 1820745 1819687 1815941 1809491 1802322 1795567 1788908 1782591 1777919
49311 1777919 1775197 1772907 1769901 1767272 1767037 1769729 1774250 1779517 1785124 1790629 1795252 1798601 1801091 1803338
49297 1803338 1805454 1807087 1807759 1806984 1804538 1801085 1798193 1797062 1797252 1797328 1796863 1797022 1798860 1801932 1805256 1808850
49281 1808850 1813250 1817973 1821773 1824356 1826619 1829065 1831204 1832798 1834350 1835677 1835099 1831100 1824245 1816687
49267 1816687 1810267 1805546 1801968 1798118 1792430 1784645 1776367 1769495 1764347 1759913 1755578 1751746 1748854 1746468
49253 1746468 1743587 1739643 1735293 1732166 1731390 1732419 1733975 1736079 1739961 1745714 1751557 1756273 1760993 1767259
49239 1767259 1774524 1781177 1787125 1793591 1800983 1808912 1818003 1829584 1843459 1857871 1872021 1886785 1902408
49226 1902408 1917343 1930338 1942175 1954193 1966310 1977738 1988767 2000477 2013035 2025187 2035092
49215 2035092 2041006 2041694 2037100 2028527 2017658 2005666 1993405 1981673 1970496 1958742 1945225 1930017
49203 1930017 1914107 1898230 1882664 1867853 1854425 1842650 1832389 1823430 1815530 1808470 1802591 1798941
49191 1798941 1798300 1800326 1804206 1809761 1817032 1824821 1830524 1831743 1827648 1818750 1805967 1790278 1772795
49178 1772795 1754612 1736396 1718163 1699429 1679726 1659308 1639515 1622294 1609013 1599563 1592542 1586422
49166 1586422 1580589 1575286 1570666 1566351 1562050 1558104 1554834 1551710 1548028 1544303 1541937 1541162 1540318 1537928
49152 1537928 1534858 1533546 1535309 1539154 1543113 1546041 1547973 1549308 1550172 1550774 1552235 1556491 1564597 1575152
49138 1575152 1585337 1593824 1601861 1611014 1620936 1630337 1639317 1649219 1660461 1671889 1682422 1692110 1701312
49125 1701312 1710060 1718743 1728318 1739053 1749848 1759657 1769062 1779625 1792093 1806062 1821184 1837826
49113 1837826 1856536 1877507 1900686 1925944 1953044 1981900 2012844 2045880 2079241 2109131 2131598
49102 2131598 2144944 2150311 2150142 2146363 2139959 2131790 2123221 2115726 2110042 2105935 2102701 2099686 2096355 2092338
49088 2092338 2087633 2082656 2077896 2073709 2070535 2068988 2069437 2071685 2075352 2080174 2085596 2090623 2095056 2100692
49074 2100692 2110118 2123923 2140034 2156301 2172884 2191361 2212327 2234852 2257736 2280159 2301439
49063 2301439 2321519 2341791 2364376 2390220 2418613 2448548 2479639 2511785 2545121 2580505 2618893
49052 2618893 2660024 2703084 2749022 2800456 2858514 2921735 2989734 3066380 3156927 3262185 3376708
49041 3376708 3491905 3599827 3696332 3784236 3872513 3967380 4061614 4135320 4170285 4163607 4127038
49030 4127038 4075283 4016262 3949889 3872086 3779575 3673518 3560178 3447674 3341779 3244884
49020 3244884 3157771 3080734 3013144 2953590 2901092 2855582 2817189 2785727 2760646 2740576 2723206
49009 2723206 2706678 2691163 2678076 2667799 2659244 2651650 2645501 2641257 2638257 2635484 2632693 2630407 2629473
48996 2629473 2630943 2635523 2642642 2650807 2659411 2669610 2682782 2698563 2714878 2729673 2742481 2754875
48984 2754875 2769659 2788944 2812402 2837641 2862398 2885889 2908085 2928860 2948490 2968129 2988807
48973 2988807 3010450 3032544 3055189 3078585 3101960 3124021 3144360 3163588 3182270 3200619 3219091
48962 3219091 3238218 3257649 3276331 3294015 3311910 3331407 3352758 3375434 3399191 3424165 3450198
48951 3450198 3476765 3503592 3530877 3558838 3587393 3616378 3645739 3675318 3704723 3733863 3763457
48940 3763457 3794417 3826449 3857802 3886900 3913880 3939824 3964822 3987763 4007949 4025683 4040892
48929 4040892 4052533 4060405 4066549 4073472 4081444 4088856 4094931 4100610 4106650 4112390 4116997 4120851 4124981 4129948
48915 4129948 4135885 4142904 4150719 4158430 4165325 4171456 4176939 4181325 4184353 4186678 4188988 4190758 4190869 4189330
48901 4189330 4187540 4186952 4188271 4191882 4198092 4206590 4216350 4226504 4237056 4248632 4261915 4277424 4295515
48888 4295515 4316452 4340725 4369034 4401481 4436857 4473482 4510923 4550359 4593107 4639238 4687803
48877 4687803 4737835 4788973 4841580 4896473 4954094 5013934 5075297 5138627 5205120 5274781 5345914
48866 5345914 5417159 5489078 5562928 5638741 5715813 5794396 5875466 5958881 6043218 6127546 6212123
48855 6212123 6296885 6380473 6461664 6540971 6619901 6698983 6777373 6854121 6928948 7001628 7071467
48844 7071467 7137971 7201772 7264306 7326246 7386427 7442659 7493757 7540610 7585064 7627873 7668103
48833 7668103 7704493 7736921 7766099 7792000 7813197 7828133 7836858 7840935 7841442 7837544 7827522 7810826
48821 7810826 7788259 7760256 7726125 7685506 7639636 7590320 7538197 7482862 7424161 7362243 7296536
48810 7296536 7225905 7150217 7071016 6990357 6909469 6828709 6748241 6668358 6589453 6511845 6435596
48799 6435596 6360731 6287818 6217784 6150696 6085485 6021860 5961779 5907542 5858783 5813028 5769277
48788 5769277 5729144 5694072 5663355 5635833 5611758 5591655 5574924 5561215 5551962 5548676 5550479 5555166
48776 5555166 5562247 5573083 5588249 5606633 5627342 5650805 5677570 5707328 5739639 5774450 5811324
48765 5811324 5849134 5887101 5925463 5964874 6005846 6048828 6093763 6139354 6183945 6227701 6272811
48754 6272811 6320820 6370678 6420304 6469310 6519099 6570767 6623999 6677920 6732011 6785957 6839380
48743 6839380 6892221 6945064 6998618 7052886 7107210 7161366 7216271 7273060 7331365 7389279 7445468
48732 7445468 7500602 7555911 7610834 7663271 7712010 7757625 7800715 7840412 7875283 7904980 7930293
48721 7930293 7951897 7969337 7980866 7984101 7977513 7961635 7938401 7909153 7873834 7832097 7784278 7730932
48709 7730932 7672347 7609054 7542030 7471727 7397555 7318918 7236185 7150055 7060726 6968454 6874297
48698 6874297 6779432 6684100 6588039 6491578 6395603 6300889 6208284 6119152 6034620 5954491 5877690
48687 5877690 5803660 5732674 5665044 5600939 5540818 5485143 5433618 5385490 5340665 5299797 5263255
48676 5263255 5230703 5201738 5176149 5153407 5132676 5113634 5096799 5082867 5072211 5064943 5060725 5058398
48664 5058398 5056649 5055383 5055716 5058252 5062132 5066336 5071312 5078461 5088170 5099061 5109227 5117961 5126304 5136149
48650 5136149 5148733 5163723 5179701 5195403 5210258 5223911 5235948 5246505 5256702 5267865 5280326
48639 5280326 5293378 5306353 5319452 5333507 5349226 5366696 5385381 5404439 5423149 5441234 5458935
48628 5458935 5476881 5495780 5515879 5536617 5556927 5575970 5593427 5609110 5622781 5634737 5646205
48617 5646205 5658424 5671293 5683465 5693905 5702725 5710081 5715033 5716422 5714583 5711068 5706456 5699456 5688606
48604 5688606 5673955 5656229 5635109 5609362 5578291 5541895 5499749 5450912 5395231 5333878 5268430
48593 5268430 5200196 5130544 5060820 4991505 4922331 4853588 4786410 4721335 4657646 4594847 4533882
48582 4533882 4476040 4421486 4369688 4320424 4273274 4226870 4179970 4132859 4086610 4041541 3997593
48571 3997593 3955593 3916445 3879320 3842459 3805891 3771617 3740642 3711458 3682182 3652728 3623940
48560 3623940 3595980 3568915 3543986 3522728 3505172 3490032 3476536 3465068 3456153 3449802 3445999 3445033
48548 3445033 3446941 3451080 3456679 3463657 3472578 3483673 3495936 3507483 3517188 3525961 3535964 3548399 3562341
48535 3562341 3575902 3588100 3599351 3610531 3622050 3633729 3645104 3655669 3664830 3671732 3675427 3675524
48523 3675524 3672694 3668294 3663441 3658597 3653848 3649271 3645024 3641312 3638124 3634826 3630425 3624703 3618668 3613353
48509 3613353 3608629 3604037 3600211 3598245 3597823 3597411 3596382 3595483 3594808 3592868 3588498 3582306 3575105 3566087 3553833
48494 3553833 3538343 3520675 3501157 3479414 3455860 3431801 3408087 3384792 3362173 3340655 3319702
48483 3319702 3297876 3274448 3250060 3225503 3200709 3175448 3150154 3125358 3100770 3075600 3049559
48472 3049559 3023160 2997260 2972740 2950407 2930750 2913701 2898794 2885400 2872781 2860319 2848219
48461 2848219 2837853 2830790 2827097 2824685 2820579 2812897 2801578 2787475 2771228 2753225 2734236 2715555
48449 2715555 2698449 2683685 2671522 2661789 2653975 2647750 2643546 2642281 2644252 2648638 2654308 2660821 2668404
48436 2668404 2677251 2687120 2697200 2705819 2710482 2709083 2701639 2690706 2679698 2670578 2663068 2655892 2648418
48423 2648418 2640894 2633439 2625468 2616294 2605823 2594417 2582528 2570842 2560135 2550386 2540530 2529885
48411 2529885 2519390 2510428 2502856 2495428 2488069 2482199 2478429 2475284 2470891 2464896 2458096 2451333 2445601 2442203
48397 2442203 2441591 2442515 2443313 2443609 2443931 2444228 2443769 2442058 2438797 2433099 2423833 2410879 2395415 2378868 2362032
48382 2362032 2345055 2327831 2310522 2294042 2279565 2266944 2253907 2237446 2215994 2190107 2161787
48371 2161787 2133668 2108069 2085612 2064912 2044379 2023989 2004486 1985442 1965445 1944223 1923339
48360 1923339 1904423 1887554 1871677 1855926 1840265 1825461 1812660 1802431 1794023 1785950 1777357 1768468
48348 1768468 1759853 1751959 1745318 1740457 1737259 1734898 1732590 1730038 1727053 1723294 1718664 1713594 1708614 1703814
48334 1703814 1698910 1693836 1689158 1685750 1683836 1682378 1679807 1675433 1669772 1663442 1656417 1648615 1640497 1632536
48320 1632536 1624632 1616575 1608589 1600936 1593552 1586575 1580481 1574988 1568555 1559981 1550016 1540534 1532562 1525998
48306 1525998 1520568 1515788 1510336 1503020 1494651 1487821 1484375 1483685 1483519 1481929 1478223 1472897 1467084 1461773
48292 1461773 1457317 1453622 1450511 1447731 1445011 1442469 1440556 1439337 1438315 1437241 1436476 1436178 1435884 1435313 1434876
48277 1434876 1435008 1435868 1438037 1442309 1448198 1453804 1457863 1460741 1462884 1463897 1464147 1465609 1469711 1475758 1482736
48262 1482736 1491034 1501109 1512315 1524767 1540320 1559499 1579380 1597113 1613849 1632259 1651595
48251 1651595 1668436 1681488 1692511 1703163 1713926 1725654 1739279 1754298 1770065 1787975 1809870
48240 1809870 1835277 1863051 1894579 1932124 1975053 2021187 2071013 2127001 2189725 2258277 2333412
48229 2333412 2416503 2506832 2604195 2712591 2836554 2975689 3128512 3300103 3499664 3731936
48219 3731936 3997695 4300896 4647391 5038377 5474528 5965732 6527428 7169867 7903508
48210 7903508 8752439 9746417 10902554 12235811 13777092 15522411 17320469 18840613
48202 18840613 19722727 19798509 19169876 18087910 16784576 15406882 14042428 12746440 11543354
48193 11543354 10434228 9416038 8489092 7651085 6897383 6227745 5644035 5141558 4709621
48184 4709621 4339176 4023330 3752225 3514850 3305549 3123028 2963828 2822245 2695691
48175 2695691 2584464 2486615 2398008 2317120 2245033 2180940 2121977 2067223 2017745 1973028 1931365
48164 1931365 1893351 1860767 1831994 1802638 1771175 1740438 1713067 1688849 1667030 1647927 1631278
48153 1631278 1615714 1600817 1587659 1576717 1566926 1556766 1544515 1527837 1505450 1479132 1452105
48142 1452105 1425779 1400037 1375906 1355007 1336525 1317566 1296876 1275929 1256187 1237701 1220587
48131 1220587 1205345 1191161 1176229 1160562 1146502 1135715 1127372 1119837 1112425 1104835 1096520 1087492
48119 1087492 1078624 1070646 1063741 1058197 1054226 1051080 1047621 1043829 1040434 1037142 1032741 1027087 1021586 1017455
48105 1017455 1014667 1012593 1010452 1007254 1002709 998164 995322 994081 992923 991219 989673 988657 987714 986729
48091 986729 986140 986011 986235 987297 989250 990340 988658 985091 982505 981847 981125 978640 975192 972411 970781
48076 970781 970117 970321 970812 970589 969538 968435 967311 965345 962898 961937 963577 966612 969225 970884 971856 972316
48060 972316 972836 974481 977421 980403 982245 982861 982497 981487 981338 984227 990103 995809 998590 999451 1001446
48045 1001446 1005518 1009722 1012202 1013301 1014564 1016850 1019922 1023263 1026875 1031239 1036491 1041739 1045632 1047643
48031 1047643 1048451 1049055 1049961 1051153 1052319 1053191 1054188 1056429 1060361 1064754 1068021 1070139 1072135 1074082 1075184
48016 1075184 1075581 1076171 1076468 1074703 1070801 1067369 1066679 1068160 1069937 1071324 1072391 1072449 1070742 1068104 1066408
48001 1066408 1066532 1067848 1069480 1071197 1073274 1076079 1079576 1082796 1084130 1082536 1078189 1072044 1065366 1059484
47987 1059484 1054771 1049737 1042469 1033307 1024685 1017916 1011841 1005449 999857 996205 993131 988228 981030 972801
47973 972801 964186 954938 945477 936832 929152 921840 915130 909952 906223 902768 899228 896659 895753 895584 894633
47958 894633 892197 888286 882984 876630 870241 865084 861727 859586 857288 853640 848586 843280 839066 836449
47944 836449 835060 834264 833535 832686 832036 832000 832248 831810 830449 829317 829586 830983 832453 833809 835693 838078
47928 838078 839835 840015 838883 837480 836672 836752 837498 838402 839074 839420 839256 838053 835572 832575 830277 828909
47912 828909 827264 823839 818282 811695 805738 801365 798162 794822 790394 785116 780043 776029 773173 771032
47898 771032 769088 767041 764824 762420 759808 757242 755417 754999 755875 757040 757268 755874 753173 750544 749647
47883 749647 750914 752881 753519 752144 749549 746721 744312 743021 743183 743841 743423 741765 740425 740630 742014
47868 742014 743840 746187 748995 751003 750969 749494 748505 749078 750560 751735 752173 752369 753017 754193 755198 755301
47852 755301 754495 753129 751117 748349 745725 744550 744649 744279 742445 740253 739295 739689 740391 740498 739525 737445
47836 737445 735382 735428 738660 743880 749041 753224 756575 759242 761412 763644 766117 768156 769350 770324 771561
47821 771561 772487 772897 774160 777364 781018 782471 781352 779815 779388 779309 778335 776758 775937 776727 778888 781410
47805 781410 783059 783046 781408 778690 775565 773020 772260 773609 775845 777226 776927 775085 772182 769051 766736
47790 766736 765504 764567 763412 762511 761943 760648 758295 756609 757136 758693 759006 758104 757886 758831 759509 759295 759185
47773 759185 759582 759404 758050 756465 755622 755494 756044 757646 759921 761721 762884 764500 766940 769183 770790
47758 770790 772956 776701 781462 786403 791795 798201 805591 814149 824554 836463 848158 859009 871023
47745 871023 886368 904409 922825 940885 959801 980048 1000061 1017970 1033512 1047842 1061965
47734 1061965 1075503 1086778 1094326 1098484 1100946 1102491 1101892 1097704 1090493 1082551 1075851 1070928 1067194 1063510
47720 1063510 1058796 1052931 1047025 1042368 1039267 1037109 1035068 1032443 1028932 1025184 1022571 1021889 1022685 1024066
47706 1024066 1025367 1025582 1023268 1018060 1011588 1005751 1000504 994382 986873 979218 972992 968849 966480 964896
47692 964896 962699 958958 953981 948673 943214 937017 929921 922609 915632 908675 901037 892483 883428 874567
47678 874567 866447 859165 852408 845832 839314 832785 826161 819620 813618 808415 803975 800586 799025 799577
47664 799577 801295 802736 803092 802138 799599 795466 790732 786957 784892 783937 782890 780819 777364 772820 768013
47649 768013 763732 760323 757973 756932 756870 756413 754272 750837 747849 746298 745374 743723 741059 738146 735789
47634 735789 734376 733994 734347 734697 734478 734005 734152 735242 736702 738068 739923 743354 748568 754556 760240 765452
47618 765452 770562 775638 780406 784679 788288 790858 792334 793548 795533 798260 800779 802576 804048 805545
47604 805545 806863 808035 809589 811372 811862 809671 805374 801106 798475 797466 797138 796691 795934 795315 795611 797185
47588 797185 799597 802278 805467 809941 815753 821713 826391 829552 832433 836605 842521 849232 855609 861724
47574 861724 868662 877056 886334 895624 904904 914829 925827 937886 951111 965979 982873 1001483 1020745
47561 1020745 1039499 1057573 1076261 1097280 1120880 1145188 1167650 1186999 1203649 1218365 1230881
47550 1230881 1239859 1244071 1243501 1239052 1231203 1219458 1203390 1183618 1161045 1135747 1107653 1077954
47538 1077954 1048510 1019868 991263 962783 935971 911666 888862 866783 846728 830404 817318
47527 817318 805350 793355 781796 771186 761425 752610 745134 738786 732737 726635 720874 715803 711460
47514 711460 708073 705920 704723 704039 704225 705912 708448 710119 710401 710843 712926 715856 717484 717016 715892
47499 715892 715969 717540 719383 720370 720631 721106 722232 723455 724064 724032 723683 722939 721581 720068 719311 719437 719304
47482 719304 717588 714023 709465 705096 701695 699263 697046 694195 690671 687348 684977 683248 681159 678197
47468 678197 674784 671453 668014 663970 659622 656237 654844 655233 656402 657528 658096 657604 656028 654254 653063
47453 653063 651805 649258 645937 644252 645673 648819 651141 651660 651230 650922 651177 651899 652272 650900 647200 642435
47437 642435 638460 635664 633013 629862 626798 624867 624780 626660 629780 632793 635069 637401 640527 643462 644701
47422 644701 644744 645857 649175 653510 657361 660650 663841 666610 668290 668884 668995 669471 671559 676386 683499
47407 683499 690702 696201 700336 704515 709125 713472 717241 720878 724559 727781 730159 731999 733884 736117
47393 736117 738714 741643 744906 748563 752696 757219 761821 766280 770801 775828 781557 787789 794304 801311
47379 801311 809499 819597 831765 845386 859521 873633 887860 902689 918463 935127 952321 969692
47367 969692 987101 1004361 1020889 1035992 1049650 1062501 1074748 1085450 1093270 1097552 1098342 1095854
47355 1095854 1090542 1083313 1074918 1065319 1054278 1042324 1030441 1018990 1007725 996677 986179 976046
47343 976046 965599 954609 943406 931964 919781 907017 895008 885184 877808 871947 866239 859690
47331 859690 852344 845356 839910 836009 832796 829833 827194 824470 820864 816665 813520 812657 813588 815137 816936
47316 816936 819272 822144 825322 828848 832791 836776 840336 843376 845699 846419 844592 840431 835308 830419
47302 830419 825813 820929 815805 811316 807968 804733 799883 793254 786921 782848 780468 777533 772816 766711
47288 766711 759563 751169 742191 734333 728399 723497 718823 714778 711450 707505 702049 696425 692494 689812
47274 689812 686195 680770 674899 670167 666849 664522 662967 662135 662175 663686 667122 671744 675853 678194 678554
47259 678554 677173 674542 671866 670604 671016 671855 671989 671658 671674 671926 671421 669624 667172 665158 663933 662744
47243 662744 660530 656993 652716 648257 643497 638188 632806 628344 625370 623745 623184 623462 623913 623297 620679
47228 620679 616400 611975 608937 607736 607638 607644 607387 607099 606969 607004 607544 609293 612533 616657 620870 624961 629071
47211 629071 633071 636576 639282 641013 641844 642530 644198 646988 649602 650926 651600 653024 655200 656763 657053
47196 657053 656963 657532 658805 660463 662572 665095 667348 668639 669126 669691 671375 675097 681252 689097 697048
47181 697048 704064 710339 716357 721941 726888 732100 739281 749617 763093 778726 794836 809362 820689
47168 820689 828303 832495 833742 832931 831684 831483 832390 833379 834039 835198 837653 841112 844879 848961 853831
47153 853831 859408 864827 869175 872169 874331 876627 879500 881945 882127 879524 875965 873702 872722 870907 866829
47138 866829 861357 856236 852010 847922 843252 838116 833327 829896 828274 827694 826715 824942 823764 824720 827470
47123 827470 830065 831184 831468 832655 835873 840827 846288 851382 856572 863132 871463 880372 888503 895954
47109 895954 903734 912046 920113 927540 934753 941990 948770 954619 959405 962718 963867 963089 961907 961583 961662
47094 961662 960648 957633 952683 946139 938455 930592 923660 917775 911704 904057 894799 885396 877431 871285
47080 871285 866268 861742 857492 853058 847748 841998 837906 837244 839196 841172 841749 841663 841916 842281 842124 841523
47064 841523 840896 840403 840180 840238 839646 836989 832474 828463 826765 826218 824298 820514 816706 814243 812410 809852
47048 809852 806344 802577 799012 795627 792334 789108 785754 781874 777174 771887 766915 763300 761332 760234
47034 760234 758837 756413 752883 748634 744275 740205 736242 732033 727870 724499 721949 719250 715623 711278
47020 711278 706689 701944 697275 693358 690277 687018 682903 678788 675783 673359 670049 665726 661879 659567
47006 659567 658271 656938 655172 653076 650848 648950 648069 648438 649537 650675 651589 652430 653536 655210 657243
46991 657243 658542 657695 654279 649611 646129 645736 648197 651025 651569 649653 647729 648083 650611 653864 657370
46976 657370 661755 666951 671611 674485 675613 676021 676822 678618 681125 683347 684530 684966 685608 687184 690013
46961 690013 694110 698832 702843 705227 706374 707202 708005 708704 709557 710627 711110 710312 708854 707742 706734 705002
46945 705002 703026 702190 702615 703002 702828 703044 704170 705223 705264 704735 704526 704732 705076 705649 706505 707266 707732 708318
46927 708318 709473 711272 713823 717248 720964 723876 725751 727588 730267 733598 737024 740402 743778 747375
46913 747375 752112 759014 767466 775107 780178 783181 785611 788080 790314 792005 792764 792199 790983 791099 793843
46898 793843 798144 801809 803906 805020 805753 806123 806250 806597 807475 808880 810635 812192 812683 811830 810607 810457
46882 810457 812028 814964 818444 821505 823408 824288 825045 826154 827073 827243 826921 826468 825590 824096 822772 822666
46866 822666 824001 826481 830010 834201 837896 840201 841592 843055 844602 845649 846288 847028 847658 847585 846998 846516
46850 846516 845959 844814 843746 844194 846310 848608 849935 850533 850871 850771 850303 850461 852154 855338 859673 865184
46834 865184 871619 877988 883646 889292 896045 903842 911579 918670 925756 933797 942994 952636 961656 969238
46820 969238 975253 980290 985200 990481 996011 1001220 1005462 1008405 1010279 1011870 1014197 1017933 1022862 1027905
46806 1027905 1031971 1034868 1037200 1039487 1041857 1044643 1048518 1053551 1058724 1063108 1067226 1072524 1079605 1087491
46792 1087491 1094544 1099647 1102753 1104939 1107842 1112360 1117794 1122679 1126442 1129808 1133683 1138122 1142302 1145067
46778 1145067 1145686 1144676 1143750 1144438 1146863 1150292 1154310 1158593 1162004 1163403 1163478 1164432 1167359 1171016 1173783
46763 1173783 1175835 1178597 1182886 1188534 1195208 1202551 1209688 1215588 1220113 1224324 1229653 1236835 1245370 1253831
46749 1253831 1261064 1267273 1273552 1280278 1286723 1292601 1298947 1306612 1314672 1321565 1327358 1333523 1340487 1346708
46735 1346708 1350565 1352169 1352886 1353962 1356038 1359211 1362910 1366328 1369513 1373471 1378726 1384539 1390289 1396781
46721 1396781 1404990 1413995 1421668 1427499 1433370 1441037 1449955 1458377 1465718 1472833 1480477 1488570 1496970 1506155
46707 1506155 1516749 1528727 1541231 1553116 1563772 1573523 1583103 1592823 1602628 1612921 1624469 1637156
46695 1637156 1649739 1661664 1674376 1689666 1707157 1724678 1741016 1756943 1773290 1789244 1803165
46684 1803165 1814321 1823309 1831438 1840009 1849434 1858590 1865721 1870379 1873781 1876875 1879019 1879290 1878269 1877532
46670 1877532 1877826 1878678 1879515 1880247 1880852 1881136 1881092 1881066 1881475 1882461 1883658 1884284 1883953 1883486 1884167 1885911 1886979 1886011
46652 1886011 1883471 1880436 1876908 1872263 1866484 1859673 1850995 1839593 1826306 1813067 1800615 1787966 1774108
46639 1774108 1758875 1742085 1723339 1703261 1683765 1666221 1649981 1633274 1615005 1595356 1575268
46628 1575268 1555822 1537611 1520346 1503413 1486830 1471067 1455951 1440719 1425455 1411460 1399584
46617 1399584 1389016 1378522 1368249 1359461 1352756 1347227 1341245 1333571 1323985 1313414 1303432 1295190 1288752
46604 1288752 1283507 1278825 1274079 1268523 1261723 1254010 1246130 1238544 1231311 1224461 1218151 1212668 1208516 1206187
46590 1206187 1205339 1204410 1201598 1196412 1189970 1183783 1178570 1174275 1170779 1168197 1166541 1165470 1164514 1163409 1162012
46575 1162012 1160178 1158140 1157057 1158568 1163380 1170473 1178028 1184939 1191153 1196995 1202784 1208892 1215586 1222843
46561 1222843 1230786 1239921 1250193 1259983 1267158 1271398 1274625 1278762 1283805 1288391 1291404 1292476 1291845 1290679
46547 1290679 1290923 1293675 1297855 1301380 1303590 1305588 1308176 1310556 1311708 1312221 1313792 1317137 1321291 1325149
46533 1325149 1328890 1333374 1338613 1343661 1347909 1351767 1355840 1360097 1364183 1367997 1371451 1374078 1375474 1375821
46519 1375821 1375491 1374611 1373612 1373645 1375412 1377901 1379476 1380151 1381451 1383857 1385910 1386546 1386952 1388989 1392658 1396501
$$ [...]
##END NTUPLES=NMR SPECTRUM
##END=
