
##TITLE=UV1150_M2-1005-1001_6301592_ZFADy4AhCl
##JCAMPDX= 6.0         $$ Bruker NMR JCAMP-DX V2.0
##DATA TYPE= NMR SPECTRUM
##DATA CLASS= NTUPLES
##ORIGIN= BRUKER
##OWNER= Administrator
$$ 1.72 TOPSPIN		Version 2.1
$$ 2012-06-06 01:04:57.796 -0500  Administrator@TOPSPIN
$$ Compression mode = diff/dup
##.OBSERVE FREQUENCY= 400.13188235
##.OBSERVE NUCLEUS= ^1H
##.ACQUISITION MODE= SIMULTANEOUS (DQD)
##.ACQUISITION SCHEME= undefined
##.AVERAGES= 8
##.DIGITISER RES= 22
##SPECTROMETER/DATA SYSTEM= spect
##.PULSE SEQUENCE= zg30
##.SOLVENT NAME= COFFEE_meoh
##.SHIFT REFERENCE= INTERNAL, COFFEE_meoh, 1, 14.98061
##AUDIT TRAIL= $$ (NUMBER, WHEN, WHO, WHERE, PROCESS, VERSION, WHAT)
$$ ##TITLE= Audit trail, TOPSPIN		Version 2.1
$$ ##JCAMPDX= 5.01
$$ ##ORIGIN= Bruker BioSpin GmbH
$$ ##OWNER= Administrator
$$ $$ C:\Bruker\TOPSPIN/data/COFFEE/nmr/UV1150_M2-1005-1001_6301592_ZFADy4AhCl/10/pdata/1/auditp.txt
$$ ##AUDIT TRAIL=  $$ (NUMBER, WHEN, WHO, WHERE, PROCESS, VERSION, WHAT)
(   1,<2012-06-06 01:04:50.921 -0500>,<Administrator>,<TOPSPIN>,<go>,<TOPSPIN 2.1>,
      <created by zg
	started at 2012-06-06 01:03:43.890 -0500,
	POWCHK enabled, PULCHK disabled,
       configuration hash MD5:
       D5 CA 7A 23 FE 6B EE E2 50 67 74 61 24 F7 5E 3B
       data hash MD5: 64K
       73 3C 7B 96 AA 96 B1 87 74 0C 32 71 04 80 6C 7C>)
(   2,<2012-06-06 01:04:53.671 -0500>,<Administrator>,<TOPSPIN>,<proc1d>,<TOPSPIN 2.1>,
      <Start of raw data processing
       efp LB = 0 FT_mod = 6 PKNL = 1 PHC0 = 0 PHC1 = 0 SI = 32K 
       data hash MD5: 32K
       4E 69 ED 26 2D 0E 6E 2E 68 2D 99 90 6B D5 0D C7>)
(   3,<2012-06-06 01:04:54.062 -0500>,<Administrator>,<TOPSPIN>,<proc1d>,<TOPSPIN 2.1>,
      <pk PHC0 = 208.7897 PHC1 = 0 
       data hash MD5: 32K
       82 99 89 3D 1F 14 C5 A8 4B 44 B8 68 8F 17 56 89>)
(   4,<2012-06-06 01:04:54.140 -0500>,<Administrator>,<TOPSPIN>,<proc1d>,<TOPSPIN 2.1>,
      <abs ABSG = 1 
       data hash MD5: 32K
       AB 66 11 65 D9 14 D9 E7 0B FD 9D 8E 94 D0 A2 62>)
(   5,<2012-06-06 01:04:54.171 -0500>,<Administrator>,<TOPSPIN>,<proc1d>,<TOPSPIN 2.1>,
      <abs ABSG = 2 
       data hash MD5: 32K
       14 B2 7A EA 06 D0 F5 BA 53 2C 2E F0 EE A1 1D 8D>)
(   6,<2012-06-06 01:04:54.203 -0500>,<Administrator>,<TOPSPIN>,<proc1d>,<TOPSPIN 2.1>,
      <abs ABSG = 3 
       data hash MD5: 32K
       61 95 15 02 37 E7 0A 6A 50 55 52 A4 16 A0 EF 3A>)
(   7,<2012-06-06 01:04:54.234 -0500>,<Administrator>,<TOPSPIN>,<proc1d>,<TOPSPIN 2.1>,
      <abs ABSG = 4 
       data hash MD5: 32K
       E4 6C B5 96 44 0E 9A 56 22 E3 6D FD 7E 62 AB 07>)
(   8,<2012-06-06 01:04:54.250 -0500>,<Administrator>,<TOPSPIN>,<proc1d>,<TOPSPIN 2.1>,
      <abs ABSG = 5 
       data hash MD5: 32K
       7C 36 7E DE 47 C6 48 84 5B E1 F8 F5 1C 66 40 81>)
$$ ##END=
$$ 
$$ $$ hash MD5
$$ $$ 32 A2 73 15 C8 79 2F 24 43 F7 D7 D7 C7 20 DF 00
##$RELAX= 
##$RELAX= 
##$RELAX= 
##$RELAX= 
##$RELAX= 
##$RELAX= 
##$RELAX= 
$$ Bruker specific parameters
$$ --------------------------
$$ [...]
##$TP= (0..7)
150 150 150 150 150 150 150 150
##$TP07= 0
##$TPNAME0= <>
##$TPNAME1= <>
##$TPNAME2= <>
##$TPNAME3= <>
##$TPNAME4= <>
##$TPNAME5= <>
##$TPNAME6= <>
##$TPNAME7= <>
##$TPOAL= (0..7)
0.5 0.5 0.5 0.5 0.5 0.5 0.5 0.5
##$TPOFFS= (0..7)
0 0 0 0 0 0 0 0
##$TUNHIN= 0
##$TUNHOUT= 0
##$TUNXOUT= 0
##$USERA1= <user>
##$USERA2= <user>
##$USERA3= <user>
##$USERA4= <user>
##$USERA5= <user>
##$V9= 5
##$VALIST= <valist>
##$VCLIST= <CCCCCCCCCCCCCCC>
##$VD= 0
##$VDLIST= <DDDDDDDDDDDDDDD>
##$VPLIST= <PPPPPPPPPPPPPPP>
##$VTLIST= <TTTTTTTTTTTTTTT>
##$WBST= 2048
##$WBSW= 25
##$XGAIN= (0..3)
0 0 0 0
##$XL= 0
##$YL= 0
##$YMAX_a= 525010
##$YMIN_a= -644838
##$ZGOPTNS= <>
##$ZL1= 120
##$ZL2= 120
##$ZL3= 120
##$ZL4= 120
##$ABSF1= 14.98061
##$ABSF2= -5.57192
##$ABSG= 5
##$ABSL= 3
##$ALPHA= 0
##$AQORDER= 0
##$ASSFAC= 0
##$ASSFACI= 0
##$ASSFACX= 0
##$ASSWID= 0
##$AUNMP= <proc_prof1d_extract_pilot.lims>
##$AXLEFT= 0
##$AXNAME= <>
##$AXNUC= <1H>
##$AXRIGHT= 0
##$AXTYPE= 0
##$AXUNIT= <>
##$AZFE= 0.1
##$AZFW= 0.1
##$BCFW= 0
##$BC_mod= 0
##$BYTORDP= 0
##$COROFFS= 0
##$CY= 15
##$DATMOD= 1
##$DC= 0
##$DFILT= <>
##$DTYPP= 0
##$F1P= 0
##$F2P= 0
##$FCOR= 0.5
##$FTSIZE= 32768
##$FT_mod= 6
##$GAMMA= 0
##$GB= 0
##$INTBC= 1
##$INTSCL= 1
##$ISEN= 128
##$LB= 0
##$LEV0= 0
##$LPBIN= 0
##$MAXI= 10000
##$MC2= 0
##$MEAN= 0
##$ME_mod= 0
##$MI= 0
##$NCOEF= 0
##$NC_proc= -8
##$NLEV= 6
##$NOISF1= 0
##$NOISF2= 0
##$NSP= 0
##$NTH_PI= 0
##$NZP= 0
##$OFFSET= 14.98061
##$PC= 1
##$PHC0= 208.7897
##$PHC1= 0
##$PH_mod= 1
##$PKNL= yes
##$PPARMOD= 0
##$PPDIAG= 0
##$PPIPTYP= 0
##$PPMPNUM= 2147483647
##$PPRESOL= 1
##$PSCAL= 4
##$PSIGN= 0
##$PYNMP= <proc.py>
##$REVERSE= no
##$SF= 400.13
##$SI= 32768
##$SIGF1= 0
##$SIGF2= 0
##$SINO= 400
##$SIOLD= 32768
##$SPECTYP= <>
##$SREGLST= <1H.CDCl3>
##$SSB= 0
##$STSI= 32768
##$STSR= 0
##$SW_p= 8223.68421052632
##$SYMM= 0
##$S_DEV= 0
##$TDeff= 65536
##$TDoff= 0
##$TI= <>
##$TILT= no
##$TM1= 0
##$TM2= 0
##$TOPLEV= 0
##$USERP1= <user>
##$USERP2= <user>
##$USERP3= <user>
##$USERP4= <user>
##$USERP5= <user>
##$WDW= 1
##$XDIM= 32768
##$YMAX_p= 450239209
##$YMIN_p= -719770
##$CURPLOT= <Network HP LaserJet P1505>
##$CURPRIN= <$Network HP LaserJet P1505>
##$DFORMAT= <normdp>
##$LAYOUT= <+/1D_H.xwp>
##$LFORMAT= <normlp>
##$PFORMAT= <normpl>
##$SURQMSG= 1
$$ End of Bruker specific parameters
$$ ---------------------------------
##NTUPLES= NMR SPECTRUM
##VAR_NAME=  FREQUENCY,     SPECTRUM/REAL,   SPECTRUM/IMAG
##SYMBOL=    X,             R,               I
##VAR_TYPE=  INDEPENDENT,   DEPENDENT,       DEPENDENT
##VAR_FORM=  AFFN,          ASDF,            ASDF
##VAR_DIM=   32768,         32768,           32768
##UNITS=     HZ,            ARBITRARY UNITS, ARBITRARY UNITS
##FACTOR=    0.250966925370066, 1,           1
##FIRST=     8223.43324360095, -85927,       -252
##LAST=      0,             -28244,          -102019
##MIN=       0,             -719770,         0
##MAX=       8223.43324360095, 450239209,    0
$$ Real data points
##PAGE= N=1
##DATA TABLE= (X++(R..R)), XYDATA
$$ [...]
$$ plain form
19540 105623 477290 -83863 -82374 163339 -164211 -19024 -168318 77621 25344 -145413 -220526
19529 -220526 -179277 -194656 114505 1127 -185047 137712 100500 37879 96658 205988 1461
19517 -7292 189195 -134797 -37255 -108912 -239439 -255683 -70982 -130150 -289401 -329120 218262
19505 -73963 -67843 29195 61286 23057 -90876 22476 -392616 64158 -246897 -222279 -214628 81062
19492 92919 130857 207158 308188 -136029 134994 -75087 -120552 -17661 -196067 262943 24063
19480 41897 -46184 47603 54663 -16 -248366 -207357 -88385 297934 -152279 10757 1982 -7770
19467 79028 -266229 -286604 -87846 188217 -168562 -196626 -379788 362105 -491048 93148
19456 11863 -182613 -231210 -131488 -144025 -52055 -435 -42512 -19909 -54362 -43608 22047 6808
$$ packed form
19540A05623L71667h3863J489A63339a64211a9024j49294G7621B5344a45413p5113
19529b20526M1249j5379A14505A127a85047A37712l7212C7879N8779J09330A461
19517g292A89195a34797c7255p1657j30527j6244g0982n9168j59251l9719B18262
19505g3963O120B9195L2091B3057i0876B2476c92616F4158b46897K4618P651H1062
19492I2919L7938P6301J01030a36029A34994g5087m5465a7661j78406B62943B4063
19480D1897d6184D7603P060a6k48350M1009h8385B97934a52279A0757A982g770
19467G9028b66229k0375h7846A88217a68562k8064j83162C62105d91048I3148
19456A1863a82613m8597R9722j2537e2055d35m2077a9909l4453J0754B2047F808
$$ plain form
19443 192364 180610 38763 -193094 162961 78952 85735 -181980 -26725 269000 -189928 -99705
19432 -99705 -247001 -3182 -92439 379110 393061 -190338 180845 16754 195048 -60157 -101203
19421 -101203 -166386 -394602 -24073 46194 37201 116651 -152642 -330736 49434 26900 -144812
19409 188265 63212 -94316 -4413 -107651 93156 -41932 169575 -213349 -145372 -205173 -92103
19397 190935 4357 -66664 -94350 -127241 123229 88124 -328873 112098 -35991 -91993 -102043
19386 -102043 62494 -374275 74945 -121057 -41986 -20414 -58271 268893 -7710 118817 6812
19374 -35062 -170641 277987 -253049 -152051 -206154 194103 333441 -130767 -49035 263813
19363 -84801 128961 43646 -69935 -227813 -107630 66980 -224874 -40474 -74074 123258 -68958
$$ packed form
19443A92364j1754C8763a93094A62961G8952O783a81980b6725B69000a89928R0223
19432i9705j47296c182q9257C79110J3951a90338A80845A6754J78294f0157m1046
19421a01203o5183k28216b4073D6194q993P9450a52642j78094D9434k2534a44812
19409A88265F3212i4316d413j03238I3156d1932A69575b13349O7977n9801i2103
19397A90935D357f6664k7686l2891A23229l5105c28873A12098c5991n6002j0050
19386a02043F2494c74275G4945a21057d1986b0414l7857B68893g710A18817F812
19374c5062j35579B77987b53049J00998n4103A94103J39338a30767d9035B63813
19363h4801A28961D3646f9935j57878a07630F6980b24874d0474l3600A23258f8958
$$ plain form
19351 19229 84767 139944 96389 34485 -88645 -340277 118433 30334 -311485 137536 54856
19339 141514 51346 98182 -382628 -104614 -37710 -83954 -160917 5963 -117362 -110283 -34194
19327 14999 -19773 -134859 18696 -24705 -178086 -89180 140351 66921 -10622 -48032 -145860
19316 -145860 -182875 203406 -251774 19990 -60996 -177935 -103317 -133315 -223990 7618 93505
19305 93505 -159589 6242 -169806 -264284 170960 -127731 -340671 23408 340531 -45583 -169065
19294 -169065 -137245 -172684 418999 251380 -172208 -207282 -268381 -298170 40172 -344388 -300026
19283 -300026 -50559 -33588 -153163 262729 -77214 -66757 20371 -247325 93391 129455 -105951
19271 381342 109935 -211092 -113570 35047 -20370 -73474 29803 -342561 -161654 237164
$$ packed form
19351A9229O5538N5177m3555C4485h8645k51632A18433C0334c11485A37536E4856
19339A41514E1346M6836c82628a04614c7710m6244p6963E963a17362P079c4194
19327A4999a9773j15086A8696b4705j53381Q8906A40351F6921a0622l7410r7828
19316a45860l7015B03406b51774A9990f0996j16939P4618k9998r0675G618Q5887
19305I3505a59589F242a69806r4478A70960a27731k12940B3408L17123d5583j23482
19294a69065L1820l5439D18999j67619a72208l5074o1099k9789D0172c44388M4362
19283c00026e0559J6971j19575B62729g7214J0457B0371b47325I3391L6064a05951
19271C81342A09935b11092R7522C5047b0370n3104B9803c42561a61654B37164
$$ plain form
19260 113026 -277417 51438 60876 120320 -96173 43606 -93714 -366742 -139759 -210330 -44215
19248 -295601 56032 -260648 183617 14426 -34081 23102 -146845 -233963 -204896 -210179 73087
19236 -81554 -151991 10529 -67548 -120191 -123168 148806 -242604 -58875 -422332 -214219 -20355
19224 -222352 -281103 -166733 -154939 -56739 176250 -166764 340109 -103606 -134720 -116101
19214 -116101 127542 -80648 -213716 103117 249493 43848 6973 -40307 -81994 65549 -78505
19202 14832 180348 -184152 184289 -247650 -423585 18699 -129169 -323043 -247109 -120223
19191 288694 146628 169155 -85075 -51455 41002 78635 25753 -103242 200700 161962 -76024
19179 -64977 91693 151989 3831 -210661 213540 3875 -128328 -269726 67430 26796 154074
$$ packed form
19260A13026b77417E1438R438N9444i6173D3606i3714k73028a39759p0571d4215
19248b95601E6032b60648A83617A4426c4081B3102a46845q7118K9067n283G3087
19236h1554p0437A0529f7548n2643k977A48806b42604e8875l63457K08113b0355
19224b22352n8751J14370J1794e6739A76250a66764C40109a03606l1114J8619
19214a16101A27542h0648j33068A03117J46376D3848F973d0307m1687F5549g8505
19202A4832J65516a84152A84289b47650j75935A8699a29169j93874P5934a20223
19191B88694j42066K2527h5075L3620D1002L7633B5753a03242B00700l8738g6024
19179f4977I1693O0296C831b10661B13540C875a28328j41398F7430B6796J27278
$$ plain form
19168 154074 -182933 -405419 6004 79879 63930 -246136 -80768 5266 210374 40644 -20923
19156 -40139 -161926 -21649 -61384 -529421 13629 -46603 -195383 -257735 -267683 170416 -378117
19144 29481 253190 299237 76283 -110898 -74838 1049 -227576 -15253 -410551 -459295 35736
19132 169996 298992 149906 3434 -205225 -173172 75488 -123012 -165287 -39132 72843 -274628
19120 -54919 -178543 -37008 371007 -83127 8702 -130316 84344 -91841 -132824 -31338 11944
19108 -79473 -118439 59003 18559 43692 92809 -138011 -9174 80256 160342 427989 -89459
19096 -38916 -323259 -121664 28233 -50418 -573580 194935 25370 102819 78465 -1387 70847
19084 -295662 -145341 20830 120104 -72237 43404 38274 -77587 -127274 -194042 78711 -140153
$$ packed form
19168A54074a82933k22486F004P3875j5949b46136h0768E266K05108D0644b0923
19156d0139j21787b1649l9735m68037A3629d6603j48780o2352r948A70416c78117
19144B9481K23709M6047G6283a10898L6060A049b27576a5253l95298m8744C5736
19132A69996J28996j49086C434b05225L2053G5488a23012m2275c9132G2843b74628
19120e4919j23624c7008C71007h3127H702a30316H4344i1841m0983c1338A1944
19108g9473l8966E9003A8559K5133M9117a38011i174H0256Q0086K67647h9459
19096c8916k84343a21664B8233e0418n23162A94935B5370P7449k4354a387G0847
19084b95662a45341B0830R9274g2237D3404n130g7587m9687o6768G8711a40153
$$ plain form
19072 -72368 -8582 178009 143082 -175535 -81781 100572 -69062 -238423 233483 -65137 -69407
19061 -69407 206939 -156986 141717 -302180 -169069 -285739 229494 -134487 -199172 -128781
19051 -128781 -119324 -25079 -40134 34374 126993 163956 316221 75147 67955 -183975 55629
19039 105118 -236339 -180189 2006 96031 -312761 -377419 -198284 -67540 180797 82697 -293092
19027 -283100 67641 239720 -355327 -70285 -154640 -88809 -168650 57592 -164871 -216450 35386
19015 -114114 -221989 108540 11039 16438 101912 -231362 -288986 337296 -13406 108747 -60915
19003 -56320 -221514 801 148388 -85609 -251810 73557 36234 -200825 -462271 -99031 -113360
18992 -113360 -85032 -128350 -8618 -182394 -225163 131837 143810 167901 115755 -77448 86945
$$ packed form
19072g2368h582A78009l4927a75535h1781A00572f9062j69361B33483f5137m270
19061f9407B06939a56986A41717c02180J33111j16670B29494a34487o4685P0391
19051a28781R457b5079j5055C4374R2619L6963J52265G5147p192a83975E5629
19039A05118b36339N6150B006R4025c12761o4658J79135f7540A80797H2697b93092
19027b83100F7641J72079c55327g0285q4355O5831p9841E7592a64871n1579C5386
19015a14114j07875A08540A1039N399Q5474b31362n7624C37296a3406A08747f0915
19003e6320j65194H01J47587h5609j66201G3557C6234b00825k61446i9031j4329
18992a13360K8328m3318h618j73776m2769A31837J1973K4091n2146g7448H6945
$$ plain form
18980 73022 1136 -112973 -99001 62083 -41305 -66835 41109 -203814 -293081 -272030 -223532
18969 -223532 -134514 -123683 -163679 133883 445597 -236761 -254318 -163981 -188504 -361496 219172
18957 200392 -87360 155336 -141824 359409 185982 -153848 18343 236691 -117615 -101898
18947 -101898 -97278 -281276 -8889 -119739 87398 -111592 -240914 -445887 4305 -211934 61333
18935 -23505 -57947 -48333 -253688 79450 45764 167681 -107078 41395 -131676 99860 205566
18924 205566 77926 30454 148197 -144655 130120 -347540 -314187 -142662 -263873 -288152
18914 -288152 -70388 50668 138395 -285768 -58154 12909 -24020 35386 -100978 -80121 -28148
18902 976 -117855 -136164 -149606 -192733 102175 -6041 39661 19717 -99476 137543 -272424
$$ packed form
18980G3022A136a12973J3972F2083d1305k5530D1109b03814q9267K1051M8498
18969b23532Q9018J0831l9996A33883L11714b36761j7557R0337k4523j72992B19172
18957B00392h7360A55336a41824C59409j73427a53848A8343K18348a17615J5717
18947a01898M620j83998h889j10850H7398a11592j29322k04973D305b11934F1333
18935b3505l4442R614k05355G9450l3686J21917a07078D1395a31676I9860J05706
18924B05566G7926C0454J17743a44655A30120c47540L3353a42662j21211k4279
18914b88152g0388E0668Q7727b85768e8154A2909b4020C5386a00978K0857b8148
18902I76a17855j8309j3442m3127A02175f041C9661A9717i9476A37543b72424
$$ plain form
18890 -69562 -9586 -122381 -198795 54202 194708 -22803 -51167 231568 -104286 -156232 -2067
18878 -94888 -5461 44279 -141608 -182372 -100954 -36292 324253 266463 -178024 -201966 203239
18866 93539 -28749 -461940 -53945 -273942 312330 15294 -26415 -100122 22129 57250 -126448
18854 -57357 331753 -178673 275685 205024 -90102 -185875 -55720 -46680 -199125 -28583 -57615
18843 -57615 131653 -368783 -69174 -67764 -170730 -20093 -225082 250832 -225319 -273346 -123015
18831 -200221 -243288 142546 -64572 -138155 -111997 175148 -246375 -67529 128719 -129360
18820 -175451 -285819 -69475 998 320373 -234953 -244552 -154353 -55093 -26145 -232142 54810
18808 -56185 -149501 -195477 -90874 -40221 -184295 -59270 92571 -41611 76638 65474 -46174
$$ packed form
18890f9562i586j12795p6414E4202J40506b2803k8364B31568a04286n1946b067
18878i4888e461D4279a41608m0764Q1418c6292C24253n7790a78024k3942B03239
18866I3539b8749m33191e3945k19997C12330A5294b6415p3707B2129L5121a26448
18854e7357C31753a78673B75685p0661i0102r5773e5720R040j52445b8583k9032
18843e7615A31653c68783f9174J410j02966b0093k04989B50832b25319m8027a23015
18831b00221m3067A42546f4572p3583K6158A75148b46375f7529A28719a29360
18820a75451j10368f9475I98L19375b34953r599R0199e5093b6145k05997E4810
18808e6185r3316m5976i0874d0221j44074e9270I2571d1611G6638j1164d6174
$$ plain form
18796 -28830 -64988 -141354 187073 -304005 -278814 50502 64909 44892 -181715 5504 -340911
18784 43691 -60080 -8473 448132 139015 -16811 62195 -179750 -68378 -344577 126937 -146752
18772 -395627 394770 76647 -148200 -247637 -295274 79726 -51331 -83000 149340 58358 -153152
18760 76007 12125 248987 19277 161831 -212870 -189794 -107419 -187521 114979 90757 -283990
18748 348256 -348412 130557 -105429 254409 -8080 129203 173119 263604 133492 -300378
18737 76909 -249464 61452 91247 -51489 -118948 8290 121701 103602 45901 107677 -140395
18725 327155 -99187 25797 -481855 245899 59580 38974 283883 -162288 -306145 -79020
18714 -31346 146551 -278539 -105176 -196388 -70722 -67630 -260849 -102672 -77402 -99858 -29589
$$ packed form
18796b8830l6158p6366A87073c04005K5191E0502J4407k0017a81715E504c40911
18784D3691f0080h473D48132A39015a6811F2195a79750f8378k76199A26937a46752
18772c95627C94770G6647a48200r9437m7637G9726e1331l1669A49340E8358a53152
18760G6007A2125K36862A9277J42554b12870K3076Q2375q0102A14979k4222b83990
18748C48256c48412A30557a05429B54409h080A29203M3916R0485j30112c00378
18737G6909b49464F1452K9795e1489o7459H290J13411j8099D5901O1776a40395
18725C27155i9187B5797d81855B45899E9580k0606K44909a62288j43857g9020
18714c1346A46551b78539a05176r1212g0722L092j93219a02672K5270k2456b9589
$$ plain form
18702 82005 -443352 159455 129284 32166 10511 -43599 -230076 -465676 316276 -271831
18691 -163841 -200753 -101994 -17417 180313 99415 68273 124437 182427 -129317 -118320 73519
18679 -85981 -5367 -58708 -94234 -5570 78643 -12597 147373 -225319 74798 207093 -161235
18667 16561 -154826 236289 118744 33742 -56458 -119886 -78230 222031 -41982 -214205 92397
18655 -229462 -168669 57149 -234782 -177447 -91678 51022 -251825 -131215 -18400 104762 -149296
18643 -81706 -61123 -378443 127157 -313499 -25377 216950 -98993 43131 -146544 64620 -113878
18631 -363395 -316009 -104261 273026 -24194 -312603 152088 265335 154759 117246 5410
18620 -208933 23124 87431 -300384 -369504 94307 -62669 3264 63578 129841 -284805 -169310
$$ packed form
18702H2005d43352A59455l0171C2166A0511d3599j86477k35600C16276b71831
18691a63841l6912R8759a7417A80313q0898l1142N6164N7990a29317J0997G3519
18679h5981e367n3341l5526e570G8643a2597A47373b25319G4798J32295a61235
18667A6561a54826B36289j17545C3742e6458o3428M1656B22031d1982j72223I2397
18655b29462O0793E7149b34782N7335Q5769E1022b51825J20610a8400A04762a49296
18643h1706K0583l17320A27157c13499b5377B16950i8993D3131a46544F4620a13878
18631c63395M7386a04261B73026b4194k88409A52088J13247j10576l7513E410
18620b08933B3124O4307c00384o9120I4307f2669C264O0314O6263b84805J15495
$$ plain form
18609 -169310 -235583 -203548 83269 -274581 53925 -139588 -187709 -148586 -128710 -71829 -21887
18597 -31553 -313783 -368601 -380491 67181 -186913 -300274 -148090 -213422 362385 -109087
18586 -238902 -143071 -293288 135056 -295898 157505 30122 -236148 -183024 -26420 92578
18575 -193578 81157 265783 271278 -105361 -31700 18956 115422 71607 -30439 -261857 -242058
18564 -242058 -250084 4315 -177478 -193077 -236408 -89690 66480 169042 -246608 -53514 -220018
18553 -220018 72671 -10027 -34090 -71249 -83912 -57410 84026 209290 16913 -281940 -313554
18542 -313554 -8757 25801 -142335 -61972 890 182097 -165659 47798 -69422 -101415 -288814
18531 -288814 201419 -46186 75740 308406 -161522 -50444 -237522 -194228 -114110 42347 -34805
$$ packed form
18609a69310o6273L2035H3269b74581E3925a39588m8121L9123J9876N6881b1887
18597c1553k82230n4818j1890F7181a86913j13361a48090o5332C62385a09087
18586b38902R5831j50217A35056b95898A57505C0122b36148N3124b6420I2578
18575a93578H1157J84626N495a05361c1700A8956R6466m3815c0439k31418J9799
18564b42058q026D315a77478j5599m3331h9690F6480J02562b46608e3514j66504
18553b20018G2671a0027k4063l7159j2663K6502H4026J25264A6913b81940l1614
18542c13554h757B5801a42335f1972H90J81207a65659D7798f9422l1993j87399
18531b88814B01419d6186G5740K32666a61522e0444j87078M3294Q0118D2347c4805
$$ plain form
18519 -273240 -100297 -66168 -422567 47817 90199 85251 -459474 -87252 71008 45725 143800
18508 143800 36174 -52549 56243 -105613 229067 -282819 -361395 -36452 -45494 67638 -172639
18496 15121 -264873 -80853 -276803 -203654 -214019 -209350 -246985 -74719 118577 162757 134338
18485 134338 200578 -252020 195908 91838 301339 100003 -92706 -110015 -403185 94626
18474 73949 164300 403292 4042 -162927 -118179 -289900 -18002 -261144 47168 -86625 635207
18462 -201117 -222884 -67628 20733 -59276 -60051 -158477 -72246 -14034 266538 241770 -127122
18450 -238601 57168 -58080 -276218 4354 75105 40001 -135496 -256705 -32712 -2151 9268
18438 -235273 117393 -94511 -38816 -96693 -157327 35386 -246012 -38030 -298084 -137838 287429
$$ packed form
18519b73240a00297L4129l56399D7817M2382m948d59474h7252G1008k5283R8075
18508A43800C6174e2549E6243a05613B29067b82819p8576c6452r042F7638a72639
18496A5121b64873h0853j95950P3149j0365M669l7635g4719A18577M4180k8419
18485A34338O6240b52020A95908I1838K09501A00003i2706j7309k93170I4626
18474G3949R0351K38992D042a62927M4748j71721a8002k43142D7168h6625F35207
18462b01117k1767f7628B0733e9276p75r8426g2246a4034B66538k4768a27122
18450b38601E7168e8080k18138D354P0751l5104a35496j21209c2712b151I268
18438b35273A17393i4511c8816n7877o0634C5386b46012c8030k60054a37838B87429
$$ plain form
18426 -59558 -145703 188596 -162534 -447210 -282896 43443 -48180 267054 -302160 17529
18415 105897 -303660 -29884 28595 100215 -348160 17989 32764 53576 91721 -25808 81878
18403 165717 -41662 -3029 -931 12593 116592 -53833 14376 -163342 -188772 182272 86468
18391 23831 384049 -148169 201716 61404 -205946 -170473 51078 24046 -279785 74332 155001
18380 155001 -253340 53275 -188665 140791 184568 -87666 -146814 33832 -67237 6489 39376
18369 39376 111685 -130910 148034 -69604 -121314 -87866 -159971 -81462 148754 -111329 -110454
18358 -110454 -58937 -311169 28199 -57372 -122793 34077 353297 -279827 -156513 -302459
18348 -302459 -37185 202424 -120011 25034 -64505 -173627 170487 3054 -120609 -342019
$$ packed form
18426e9558q6145A88596a62534k84676J64314D3443d8180B67054c02160A7529
18415A05897c03660b9884B8595P1620c48160A7989J4775K0812L8145b5808H1878
18403A65717d1662c029i31A2593J03999e3833A4376a63342k5430A82272H6468
18391B3831L60218a48169B01716F1404b05946L5473E1078B4046b79785G4332Q0669
18380A55001b53340E3275a88665A40791M3777h7666n9148C3832f7237F489L2887
18369C9376P2309a30910A48034f9604n1710L3448p2105P8509A48754a11329Q75
18358a10454N1517k52232B8199e7372o5421C4077L19220b79827J23314j45946
18348c02459c7185B02424a20011B5034f4505j09122A70487C054a20609k21410
$$ plain form
18338 -342019 -95502 139843 92474 -161804 -46388 112978 -172073 90093 223315 25696
18327 -287422 85784 82276 -197761 -252928 7560 49812 64013 -120709 -97763 -70370 -112150
18316 -112150 -228998 -30127 -129935 -355975 109340 263206 125485 86716 -26548 176434
18305 -135097 22178 -349155 151300 26077 199450 -120678 -176411 -44062 50511 -267328
18294 -309950 173335 -320770 -363949 1296 310687 32051 123249 -198584 80854 -39849 -90866
18283 -90866 -198759 -38147 -16123 -204688 -78357 -157591 -24822 207083 -76735 -296437 -246094
18272 -246094 -199833 -120110 -61962 -24847 18087 89629 -206641 56171 179066 347666 -290365
18260 -303405 -212673 -232257 -69020 116347 111377 -362332 -221684 -209338 48454 119071 -126623
$$ packed form
18338c42019i5502A39843m7369a61804d6388A12978a72073I0093J33222B5696
18327b87422H5784l508a97761n5167G560M2252J4201a20709K2946K7393m1780
18316a12150j16848c0127r9808k26040A09340J53866A25485l8769b6548A76434
18305a35097B2178c49155A51300B6077J73373a20678n5733d4062E0511b67328
18294c09950A73335c20770m3179A296L09391C2051R1198a98584H0854c9849n1017
18283i0866j07893c8147a6123j88565g8357p9234b4822B07083g6735k19702N0343
18272b46094M6261P9723N8148b4847A8087P1542b06641E6171J22895J68600b90365
18260c03405R0732j9584f9020A16347m970c62332J40648J2346D8454P0617a26623
$$ plain form
18248 45108 -290201 -148381 30913 -335055 31870 -114763 -24506 -299644 -226824 -24491 -290123
18237 -290123 -95399 -222706 -112631 -30563 -220142 164133 -95457 166242 -44046 -45085 83386
18225 321161 170737 75415 -79990 274224 -94720 12546 -207884 -58371 -47528 -184330 -149598
18214 -149598 82118 -109590 -29484 -86098 -16125 -18458 263340 -214852 175905 89767 -28731
18202 -69501 176817 -256143 10794 -109756 -170004 -271381 101392 -70279 71626 161581 -170529
18190 -449250 -104098 -5729 -67170 -276988 16762 -101341 157290 213131 -139942 -31942 29697
18178 4973 57805 34787 127823 -282606 -344056 -173147 275386 -136490 -374705 -338549 -39271
18166 -399187 203171 53877 -53774 181144 -150971 -50369 -195638 -203173 65391 -72163 -161751
$$ packed form
18248D5108b90201J41820C0913c35055C1870a14763b4506k75138P2820b4491k65632
18237b90123i5399j27307J10075c0563j89579A64133i5457A66242d4046j039H3386
18225C21161j50424G5415g9990B74224i4720A2546b07884e8371J0843j36802L4732
18214a49598H2118a09590b9484n6614a6125k333B63340b14852A75905q6138b8731
18202f9501A76817b56143A0794a09756o0248j01377A01392g0279G1626Q9955a70529
18190d49250a04098e729o1441k09818A6762a01341A57290N5841a39942c1942B9697
18178D973N2832k3018R3036b82606o1450J70909B75386a36490k38215L6156c9271
18166c99187B03171E3877e3774A81144a50971e0369j45269p535F5391g2163q9588
$$ plain form
18155 -161751 -227098 45218 -187320 155481 -98860 17875 -55738 -188099 -132569 114491 -96327
18143 -15914 -83361 -122137 68893 -36197 164861 -164573 -167092 42901 28278 -242749 -347418
18132 -347418 93187 -215717 -164262 -194055 297044 223853 -125690 80348 -56765 89994 101525
18121 101525 52892 -193490 38609 -17898 151796 -21907 -67750 57532 -406981 19864 -72642
18109 118989 -165765 -148239 121718 25116 -18027 280112 84012 -37342 -45712 129371 -234559
18097 -41419 -208030 -377742 69631 315737 -293684 -375411 211107 180948 -320023 160347
18086 59660 -230504 -76132 22898 47142 -17114 70663 227048 -418406 -11068 75827 -165658
18074 -78798 44585 -138057 353983 111504 -45486 88345 -315136 127929 -214334 -331171
$$ packed form
18155a61751o5347D5218a87320A55481i8860A7875e5738j32361N5530A14491i6327
18143a5914o7447l8776F8893c6197A64861a64573k519D2901j4623b42749j04669
18132c47418I3187b15717N1455k9793B97044p3191a25690H0348e6765H9994J1531
18121A01525m8633a93490C8609a7898A51796b1907m5843E7532d06981A9864g2642
18109A18989a65765J7526A21718B5116a8027B80112H4012c7342q370A29371b34559
18097d1419j66611j69712F9631K46106b93684q1727B11107l0159c20023A60347
18086E9660b30504g6132B2898K4244a7114G0663J56385d18406a1068G5827a65658
18074g8798D4585a38057C53983A11504d5486H8345c15136A27929b14334j16837
$$ plain form
18064 -331171 -218935 -9473 -293369 -357040 -274134 167002 -290146 -59536 153289 194126 166172
18053 166172 22648 -376154 -42820 -105508 33211 -123901 -125672 304010 174930 216051 170147
18042 170147 117403 166889 162269 48140 343267 -126385 120239 319324 -4699 141556 -442208
18030 97077 333707 -146342 -10647 -33176 -238594 -10225 155209 -209203 -245585 288859
18019 -3471 283948 -187978 19554 -81416 23392 -130281 290823 186943 154331 -5387 118835
18007 1953 -134805 21098 -285208 -304524 -116122 -268017 -283205 68615 -72324 22458 32757
17996 32757 48097 -81333 -185727 19018 150273 -78439 -125613 122439 -70150 -46301 -34408
17985 -34408 -185616 -276091 -81420 -648 89087 -152930 -129787 9565 -168789 254363 -341157
$$ packed form
18064c31171J12236i473k83896o3671Q2906A67002b90146e9536A53289M0837k7954
18053A66172B2648c76154d2820o2688C3211a23901j771C04010j29080M1121m5904
18042A70147n2744M9486m620D8140K95127a26385A20239J99085d699A41556d42208
18030I7077K36630a46342a0647k2529k05418a0225A55209b09203l6382B88859
18019c471B83948a87978A9554h1416B3392a30281B90823j03880l2612e387A18835
18007A953a34805B1098b85208j9316a16122j51895j5188F8615g2324B2458J0299
17996C2757J5340h1333j04394A9018J31255g8439m7174A22439g0150K3849J1893
17985c4408j51208r0475h1420f48H9087a52930K3143I565a68789B54363c41157
$$ plain form
17973 -218021 -1012 40980 -109522 -32609 -324938 92303 -207883 86685 36493 -174742 -50434
17961 -263087 271437 306712 143535 -97198 81374 -234163 -111688 -248258 -110626 33960
17950 271780 -76782 -91671 208869 -37507 -29853 50529 -91363 -69440 124927 294290 -24099
17938 20565 42179 -33341 59067 193180 28656 -18941 78315 -174330 -269765 45997 -245263
17926 184542 92597 30820 2475 218492 -2442 158797 132959 44102 -92867 -201035 -50516
17914 131383 189091 -36108 123308 245315 -260273 -63547 138997 124762 -82139 35043 65443
17903 65443 -194351 -146534 -289195 -251555 350460 126369 -20743 28570 -147075 -76539 208049
17891 153738 -57677 -61235 -91942 -20905 -159238 -244166 90181 26067 159970 77396 -27043
$$ packed form
17973b18021a012D0980a09522c2609k92329I2303b07883H6685C6493a74742e0434
17961b63087B71437L5275A43535i7198H1374b34163a11688j36570a10626C3960
17950B71780g6782j4889B08869c7507P654E0529i1363K1923A24927J69363b4099
17938B0565K1614c3341E9067J34113B8656a8941G8315a74330r5435D5997b45263
17926A84542r1945C0820B475K16017b442A58797k5838D4102i2867j08168e0516
17914A31383N7708c6108A23308J22007b60273f3547A38997j4235h2139C5043L0400
17903F5443a94351M7817j42661L7640C50460A26369b0743B8570a47075P0536B08049
17891A53738e7677l558l0707b0905j38333q4928I0181B6067J33903G7396b7043
$$ plain form
17879 237092 153636 130421 -162008 -77590 -8893 -88474 -105651 -76949 27804 -119529 155413
17867 36938 192555 -78525 -194761 55678 -48562 182381 226981 -85653 -302535 8816 109107
17856 109107 -347997 62905 -85684 117617 44855 -416301 -102309 39106 44911 236723 205103
17845 205103 96610 98891 -203346 -57191 -336608 -64321 178046 -7699 93161 -152565 -69871
17833 35238 31720 -40066 94236 55546 119994 10571 91259 -301592 93429 153022 -358915
17821 90876 -24412 173727 1792 -103450 -190822 -66945 208819 -81417 161212 -68694 351710
17809 -107136 44636 -51635 -123141 -19909 -7511 -33487 -5157 136091 -39410 -161399 -61347
17797 16742 -282728 94270 -103109 -50946 -198785 -341830 -120217 -143083 73524 127825 176087
$$ packed form
17879B37092q3456k3215a62008g7590h893p9581j7177K8702B7804a19529A55413
17867C6938J55617g8525j16236E5678d8562A82381M4600h5653k16882H816J00291
17856A09107c47997F2905h5684A17617D4855d16301a02309C9106N805J91812l1620
17845B05103I6610K281b03346e7191k79417f4321A78046g699I3161a52565f9871
17833C5238l518d0066I4236l8690O4448A0571Q0688c01592I3429N9593c58915
17821I0876b4412A73727A792a03450q7372f6945B08819h1417A61212f8694C51710
17809a07136D4636e1635p1506a9909g511k5976e157A36091c9410j21989f1347
17797A6742b82728I4270a03109e0946j47839j43045a20217k2866G3524N4301M8262
$$ plain form
17786 176087 19060 -408259 52479 36482 -288888 179963 16110 105671 98388 -209552 31738
17774 108550 -211039 66200 -57824 36265 -330697 111907 77497 24586 -63106 -145534 -82900
17763 -82900 -100063 -106173 -196140 -100775 122430 -204414 -189031 -123260 -38295 -44503 287992
17751 -315176 -84091 -346565 -9749 64619 -311654 50957 -86893 -183898 -270512 -216157 105240
17739 68923 158959 -34542 8498 259524 153624 20571 81974 -160302 91298 -31588 102707
17727 100257 257679 242610 -119797 232924 243897 -19834 -340271 172426 -126501 201810
17716 -321140 170645 -28046 266175 -174045 26489 -7557 302120 128398 -177930 25003
17705 135673 61373 -45963 172469 -922 111254 -144524 338334 176208 -1056 119179 -134822
$$ packed form
17786A76087A9060d08259E2479j5997b88888A79963A6110Q9561p283b09552C1738
17774A08550b11039F6200e7824C6265c30697A11907l4410B4586f3106q2428O2634
17763h2900j7163o110q9967R5365A22430b04414J5383O5771c8295o208B87992
17751c15176h4091k62474i749F4619c11654E0957h6893r7005q6614N4355A05240
17739F8923R0036c4542H498K51026j05900B0571O1403a60302I1298c1588A02707
17727A00257J57422j5069a19797B32924J0973a9834l20437A72426a26501B01810
17716c21140A70645b8046B66175a74045B6489g557C02120A28398a77930B5003
17705A35673F1373d5963A72469i22A11254a44524C38334j62126a056A19179a34822
$$ plain form
17693 55449 369073 -196378 262861 75707 -25059 -235959 181229 -843 146017 -122135 573389
17681 136262 8075 -153286 360254 -89129 -68839 315471 38866 -194978 159 284794 43807
17669 -49051 -130779 32247 -112469 44276 2211 -67114 108954 -3003 186323 186346 138811 143054
17657 143054 5880 189322 -120742 173805 -200085 115905 65825 127149 131701 178566 225230
17646 225230 219391 67723 -106800 -5830 89534 120860 115656 -330926 345967 312255 296220
17635 296220 333935 120786 -3503 314928 -154997 -77699 -19446 -80536 28777 256679 62436
17623 328094 -151950 67489 -78901 -1695 -19251 364 106881 -79496 309187 300038 104220
17611 51719 -47477 -119488 -104988 -94130 -174146 58360 -200170 197460 -123277 138614 -48286
$$ packed form
17693E5449L13624a96378B62861G5707b5059k10900A81229h43A46017a22135E73389
17681A36262H075a53286C60254h9129K0290C15471C8866a94978A59K84635D3807
17669d9051q1728C2247a12469D4276B211f7114A08954c003A86323K3m7535M243
17657A43054E880J83442a20742A73805b00085A15905n0080O1324M552M6865M6664
17646B25230n839F7723a06800e830H9534L1326n204c30926C45967l3712j6035
17635B96220L7715A20786c503C14928a54997P7298a9446o1090B8777K27902F2436
17623C28094a51950F7489g8901a695j7556C64J06517g9496C09187r149A04220
17611E1719d7477p2011J4500J0858q0016E8360b00170A97460a23277A38614d8286
$$ plain form
17599 72040 60192 80812 71515 98334 -12303 143151 243129 -257113 -95265 287274 144896
17588 144896 212088 96764 94905 256666 43940 155946 -137606 -182763 -57839 24945 -49357
17576 272844 100102 180819 -303947 102746 -93271 186203 39007 229338 381205 191870
17566 191870 -60248 266527 266611 144377 -2216 124367 29628 199082 217581 -117500 197563
17554 100965 -132153 -74335 -44800 -28586 22842 379430 151521 -408914 -205333 158942
17543 33304 309532 137385 -133328 430672 173233 61453 104661 190343 -177057 -194550
17533 -194550 39512 -150204 109222 365815 -24956 -32826 154395 -2579 149260 -9177 43569
17521 194382 -214881 228732 23327 -85986 -100956 -109027 427032 117405 552925 -32851 290154
$$ packed form
17599G2040j1848K0620r297K6819a2303A43151R9978b57113i5265B87274j42378
17588A44896O7192I6764j859J61761D3940J12006a37606m5157e7839B4945d9357
17576B72844A00102Q0717c03947A02746i3271A86203C9007J90331J51867j89335
17566A91870f0248B66527Q4j22234b216A24367B9628J69454J8499a17500A97563
17554A00965a32153N7818K9535J6214B2842L56588A51521d08914K03581A58942
17543C3304K76228A37385a33328D30672A73233F1453M3208Q5682a77057j7493
17533a94550C9512a50204A09222K56593b4956p870A54395b579A49260i177D3569
17521A94382b14881B28732B3327h5986j4970q071D27032A17405M35520c2851B90154
$$ plain form
17509 -158058 344068 252864 9363 165561 274035 281931 -216013 70458 82827 218884 136263
17498 136263 239863 -122272 136104 280716 262752 4379 76406 274846 -83290 273647
17487 -109084 225293 -152370 229290 216052 4421 44833 66802 141696 589591 182656 66764
17475 296108 147488 155289 155389 283453 117568 194380 -97750 36540 89278 -123760 198819
17463 266246 157097 -211113 119946 -19955 45022 28140 -32291 102178 110366 325601 46337
17451 159196 576418 449771 -139026 -65153 89439 271589 395281 -125039 8788 193945
17441 193945 246175 69467 229770 25213 307892 88653 -9302 111313 659394 46560 375269
17430 375269 146819 238020 193858 163835 345878 232435 165062 127082 307622 170999
$$ packed form
17509a58058C44068r1204I363J56198J08474P896b16013G0458J2369J36057q2621
17498A36263J03600a22272A36104J44612j7964D379P2027J98440h3290B73647
17487a09084B25293a52370B29290j3238D421M0412K1969P4894M47895A82656F6764
17475B96108A47488P801J00J28064A17568P6812i7750C6540N2738a23760A98819
17463B66246j09149b11113A19946a9955D5022j6882c2291A02178Q188K15235D6337
17451A59196M17222j26647a39026f5153H9439J82150J23692a25039H788J85157
17441A93945N2230F9467J60303B5213K82679H8653i302A11313N48081D6560L28709
17430C75269A46819R1201m4162l0023J82043j13443o7373l7980J80540j36623
$$ plain form
17420 170999 -81907 292061 -5855 123326 451015 432638 233545 256777 205351 343420 229957
17409 229957 104623 124058 110532 93860 391002 468471 492866 400143 221939 63817 316220
17398 316220 275414 228974 147292 253098 207362 32882 130467 92599 142062 -40385 273744
17386 119341 59822 -70381 342063 81247 -36241 361714 290455 232240 113622 7741 399043
17375 399043 265715 104357 352074 295086 -73704 181547 -33880 203746 59275 251410
17365 251410 276513 105554 241501 472233 123712 275161 89487 153937 113398 168056
17355 168056 164229 348419 -33651 229858 257100 -131474 276137 175058 110890 265869
17345 265869 306755 118660 168093 8479 4097 -351456 176476 423567 378973 -139033 -151937
$$ packed form
17420A70999h1907B92061e855A23326L27689j8377j99093K3232n1426J38069j13463
17409B29957A04623J9435j3526j6672K97142P7469K4395r2723j78204F3817K52403
17398C16220m0806m6440q1682J05806m5736C2882R7585l7868M9463d0385B73744
17386A19341n9519g0381C42063H1247c6241C61714p1259n8215A13622G741L91302
17375C99043j33328A04357K47717n6988g3704A81547c3880B03746E9275J92135
17365B51410K5103A05554J35947K30732A23712J51449H9487O4450m0539N4658
17355A68056l827J84190c3651B29858K7242a31474B76137j01079o4168J54979
17345B65869M0886A18660M9433H479D097c51456A76476K47091m4594a39033j2904
$$ plain form
17334 -151937 302168 125625 318613 -68454 237177 335752 -49552 262225 96514 228060
17324 228060 275591 332177 168057 -274873 113893 284514 24529 413409 300265 -84687
17313 200276 542965 334022 74034 371133 114438 311510 130909 28245 64396 147136
17303 147136 373816 121260 302308 28150 475137 275446 64590 252397 182951 -113829
17292 147284 68504 159612 336078 -100116 297071 456622 183617 239737 16832 -49248
17281 51316 -166354 228862 259054 74928 191164 281910 229105 -212536 281719 438153
17271 438153 315171 220115 231031 233010 132773 106089 -158597 362829 125619 33069 178812
17260 178812 494247 80540 352925 227960 206544 28638 234540 167368 10254 73434 232731
$$ packed form
17334a51937C02168A25625J92988f8454B37177R8575d9552B62225I6514J31546
17324B28060M7531N6586j64120b74873A13893J70621B4529L88880j13144h4687
17313B00276L42689k08943G4034K97099A14438J97072A30909B8245L6151Q2740
17303A47136K26680A21260J81048B8150M46987j99691F4590J87807o9446a13829
17292A47284F8504R1108J76466a00116B97071J59551A83617N6120A6832d9248
17281E1316a66354B28862L0192G4928J16236R0746n2805b12536B81719J56434
17271D38153j22982r5056J0916J979j00237k6684a58597C62829A25619C3069J45743
17260A78812L15435H0540K72385j24965k1416B8638K05902o7172A0254O3180J59297
$$ plain form
17249 232731 557086 77800 193957 472858 53566 426176 257720 316532 38025 4743 97627
17238 97627 104069 355436 13916 506558 -66829 290174 300946 232478 39739 182341 264701
17227 264701 25690 230113 706729 2298 144668 343645 52746 213848 -67255 231309
17216 290186 146769 471162 240304 415491 287121 276116 -73173 31640 196008 468728
17206 468728 118828 92754 19436 504643 214916 -13752 256230 171332 234543 450260
17196 450260 92636 122185 279551 50002 219309 281933 -195156 -93543 206802 331735
17186 331735 449087 307420 73813 140326 319289 231268 143494 40755 201407 413448
17176 413448 237268 115981 136253 265752 -102014 514765 327657 194325 -3568 370948
$$ packed form
17249B32731L24355G7800J16157K78901E3566L72610j68456N8812C8025D743R2884
17238I7627O442K51367A3916M92642f6829B90174J0772o8468C9739J42602Q2360
17227B64701B5690K04423M76616B298J42370J98977E2746J61102f7255B31309
17216B90186j43417L24393k30858J75187j28370j1005g3173C1640J64368K72720
17206D68728A18828k6074A9436M85207B14916a3752B56230q4898O3211K15717
17196D50260I2636K9549J57366E0002J69307O2624a95156i3543B06802J24933
17186C31735J17352j41667G3813O6513J78963q8021q7774D0755J60652K12041
17176D13448j76180A15981K0272J29499a02014E14765j87108j33332c568C70948
$$ plain form
17165 373935 147079 400128 214231 225090 390508 274499 300405 177794 333187 269778
17155 269778 215169 61571 -16599 386733 476110 384797 -7768 30307 625866 143893 302504
17144 302504 510281 336137 647584 407035 230249 -139444 643979 104649 384593 395434
17134 395434 426813 578137 80513 478500 116013 344221 407210 420947 202587 451380
17124 451380 458775 410986 235505 288086 374362 399024 185980 588261 481278 346123 181279
17113 181279 447207 457227 91822 513817 475247 526670 314261 46927 284704 140073
17102 461070 158538 326097 580569 311202 378428 653497 487738 376830 629919 373701
17092 373701 513359 394665 109482 397451 507008 349263 394251 370180 235518 750720
$$ packed form
17165C73935A47079K53049j85897J0859J65418j16009K5906j22611J55393o3409
17155B69778n4609F1571a6599C86733Q9377r1313g768C0307N95559A43893J58611
17144C02504K07777j74144L11447k40549j76786a39444F43979A04649K79944J0841
17134C95434L1379J51324H0513L97987A16013K28208O2989J3737B02587K48793
17124D51380P395m7789j75481N2581Q6276K4662A85980M02281j06983j35155j64844
17113A81279K65928J0020I1822M21995l8570N1423k12409D6927K37777A40073
17102D61070A58538J67559K54472k69367O7226K75069j65759j10908K53089k56218
17092C73701J39658j18694A09482K87969J09557j57745M4988k4071j34662N15202
$$ plain form
17082 750720 233815 249264 275397 486796 561114 669682 345217 685795 568528 -54746
17071 386610 758547 419730 308970 351102 53920 547844 470730 190832 724411 686150
17061 686150 230271 462125 945030 164170 409868 386266 421060 504315 374850 528846
17051 528846 238766 574802 376452 247739 656716 663915 419627 203052 309892 546155
17041 546155 572481 584168 550427 353630 833663 821719 323779 387260 567938 445645
17031 445645 575753 774940 442633 509266 610511 413908 655835 714559 404614 652444
17021 652444 361903 518431 565293 410212 594454 483748 771513 638555 795113 837744
17011 837744 343931 714378 847928 256168 562889 763223 621545 646348 784525 924641
$$ packed form
17082G50720B33815J5449K6133K11399P4318J08568l24465L40578j17267e4746
17071C86610L71937l38817j10760M2132E3920M93924p7114A90832N33579l8261
17061F86150B30271K31854M82905A64170K45698k3602L4794Q3255j29465J53996
17051E28846B38766L36036j98350j28713M08977P199k44288B03052J06840K36263
17041E46155K6326J1687l3741j96797M80033j1944C23779O3481J80678j22293
17031D45645J30108J99187l32307O6633J01245j96603K41927N8724l09945K47830
17021F52444k90541J56528M6862j55081J84242j10706K87765j32958J56558M2631
17011H37744C43931L70447J33550B56168L06721K00334j41678K4803J38177J40116
$$ plain form
17001 924641 634601 856487 822560 476456 560826 736093 625369 945967 1023863 693437
16991 693437 1013696 782934 997331 888547 1067259 860280 446107 770942 759072 690732
16981 690732 957817 839410 561373 796818 707571 1106033 866266 1010828 783491 1036694
16971 1036694 882193 782295 1158670 698149 995680 1198364 835250 729781 794793 821069
16961 821069 857342 1032658 841810 860156 696026 917765 751187 877487 850434 1143185
16951 1143185 1119660 1028345 1080513 1192108 1235468 1494939 994712 932212 1334403 989117
16941 989117 1288724 821477 1233637 1199089 1331860 1302640 1079010 1018471 1268038 1179451
16931 1179451 1154907 1159697 970055 1340503 1186929 1176699 1111135 1494237 1362549 1346934
$$ packed form
17001I24641k90040K21886l3927l46104Q4370J75267j10724L20598P7896l30426
16991F93437L20259k30762K14397j08784J78712k06979m14173L24835j1870o8340
16981F90732K67085j18407k78037K35445q9247L98462k39767J44562k27337K53203
16971A036694j54501r9898L76375m60521K97531K02684l63114j05469O5012K6276
16961H21069L6273J75316j90848J8346j64130K21739j66578J26300k7053K92751
16951A143185k3525r1315N2168J11595M3360K59471n00227o2500M02191l45286
16941I89117K99607m67247M12160l4548J32771k9220k23630o0539K49567q8587
16931A179451k4544M790j89642L70448j53574j0230o5564L83102j31688j5615
$$ plain form
16921 1346934 1137343 1296551 1521362 1510313 1391555 1502592 1496630 1359367 1502268 1219519
16911 1219519 1641355 1612484 1371666 1336182 1285405 1687804 1524874 1372055 1339999 1575702
16901 1575702 1536258 1804488 1570331 1652227 1644204 1612626 1630665 1687431 1750025 1696492 1924641
16890 1924641 1740327 1627372 1807368 1940753 1712332 2050586 2126016 1993046 1829196 1767156
16880 1767156 2191159 2227046 2156274 2395424 2176593 2142180 2362309 2245766 2676253 2339831
16870 2339831 2301730 2062262 2447251 2355502 2060336 2300027 2311874 2426453 2761991 2862695
16860 2862695 2682092 2550133 2983878 2594582 2957394 2923733 2912199 3036293 2895471 2795357
16850 2795357 3004303 3301940 3185644 3291243 3136062 3298649 3117411 3070915 3399545 3400237
$$ packed form
16921A346934k09591J59208K24811j1049j18758J11037n962j37263J42901k82749
16911A219519M21836k8871k40818l5484n0777M02399j62930j52819l2056K35703
16901A575702l9444K68230k34157Q1896q023l1578J8039N6766O2594n3533K28149
16890A924641j84314j12955J79996J33385k28421L38254P5430j32970j63850o2040
16880A767156M24003L5887p0772K39150k18831l4413K20129j16543M30487l36422
16870B339831l8101k39468L84989r1749k95166K39691J1847J14579L35538J00704
16860B862695j80603j31959M33745l89296L62812l3661j1534J24094j40822j00114
16850B795357K08946K97637j16296J05599j55181J62587j81238m6496L28630O92
$$ plain form
16840 3400237 3437341 3720806 3910872 3664908 3983756 3652593 4017955 3821335 3950141 3978130
16830 3978130 3908105 3888594 3924340 4063971 4236121 4438952 4487607 4376632 4571362 4561449
16820 4561449 4856198 4834074 5032340 4920042 5400850 4861900 5145729 5522234 5178852 5403438
16810 5403438 5703338 5728128 5603441 6244420 6173791 6212107 6610041 6590288 6797983 6912224
16800 6912224 7372320 7036605 7356945 7486226 7733455 7716556 7985402 8237543 8369348 8405727
16790 8405727 8754512 8964602 9139539 9430775 9222843 9895830 10252758 10387592 10580821
16781 10580821 10919841 11127376 11579531 11825628 11892242 12482979 12868084 12967238 13269655 13774577
16771 13774577 14409250 14684292 15078998 15813536 16271109 16662139 17196224 17775935 18259472
$$ packed form
16840C400237L7104K83465J90066k45964L18848l31163L65362j96620J28806K7989
16830C978130p0025j9511L5746J39631J72150K02831M8655j10975J94730r913
16820D561449K94749k2124J98266j12298M80808n38950K83829L76505l43382K24586
16810E403438K99900K4790j24687O40979p0629L8316L97934j9753K07695J14241
16800F912224M60096l35715L20340J29281K47229j6899K68846K52141J31805L6379
16790H405727L48785K10090J74937K91236k07932O72987L56928J34834J93229
16781A0580821L39020K07535M52155K46097O6614N90737L85105R9154L02417N04922
16771A3774577O34673K75042L94706P34538M57573L91030N34085N79711M83537
$$ plain form
16762 18259472 19083185 19328321 20124154 20715078 21503953 22116822 23233196 24108932 24718577
16753 24718577 25584642 26711128 27743976 29402330 30182677 31396439 32283900 33997154
16745 33997154 35363287 37025927 38531102 40477949 41873402 44067722 46177286 48280194
16737 48280194 50485376 53324721 56006148 58448363 61871283 65018164 68425917 71843904
16729 71843904 75710078 79591630 84131411 88483852 93475717 98527294 103774829 109456650
16721 109456650 114838759 120439359 126700027 132681817 138564313 144379352 150442616 155665131
16713 155665131 160797581 165177160 169362657 172515323 174893754 176477892 177240785 177333669
16705 177333669 175954130 173727612 170835955 167393390 163008280 157932706 153229781 147280868
$$ packed form
16762A8259472Q23713K45136P95833N90924P88875O12869J116374Q75736O09645
16753B4718577Q66065J126486J032848J658354P80347J213762Q87461J713254
16745C3997154J366133J662640J505175J946847J395453K194320K109564K102908
16737D8280194K205182K839345K681427K442215L422920L146881L407753L417987
16729G1843904L866174L881552M539781M352441M991865N051577N247535N681821
16721A09456650N382109N600600O260668N981790N882496N815039O063264N222515
16713A55665131N132450M379579M185497L152666K378431J584138P62893R2884
16705A77333669j379539k226518k891657l442565m385110n075574m702925n948913
$$ plain form
16697 147280868 141540657 135477110 129795283 123701081 117549875 112030534 106491408 100652509
16689 100652509 95745047 90681822 86073079 81553187 77168997 72991220 69299877 65527885
16681 65527885 62373865 59055737 56376069 53406479 51028554 48513597 46304479 43776393
16673 43776393 41461751 39767924 38297185 36227897 34480141 33191318 31959120 30291849
16665 30291849 29338481 27881549 27019945 25737579 24886009 23863306 22925955 22273713 21318307
16656 21318307 20436578 20082541 19225102 18598905 17667067 17344101 16673181 15836288 15655975
16647 15655975 15620176 14784871 14440202 13691359 13558596 12814142 12469098 12385077 12195265 11572823
16637 11572823 11080644 10977725 10730671 10570768 10035310 9709956 9628504 9388210 9228844
$$ packed form
16697A47280868n740211o063547n681827o094202o151206n519341n539126n838899
16689A00652509m907462n063225m608743m519892m384190m177777l691343l771992
16681F5527885l154020l318128k679668k969590k377925k514957k209118k528086
16673D3776393k314642j693827j470739k069288j747756j288823j232198j667271
16665C0291849r53368j456932q61604j282366q51570j022703r37351o52242r55406
16656B1318307q81729l54037q57439o26197r31838l22966o70920q36893j80313
16647A5655975l5799q35305l44669p48843j32763p44454l45044q4021j89812o22442
16637A1572823m92179j02919k47054j59903n35458l25354q1452k40294j59366
$$ plain form
16628 9228844 8902513 8705129 8643686 8099640 8126971 7867468 7795383 7356043 7242990 7433592
16618 7433592 6664181 6925214 6819433 6332384 6428241 6637903 6345739 5888416 5744336 5792207
16608 5792207 5610133 5676400 5488238 5387272 5258908 4866207 5018664 5067896 5035682 4892610
16598 4892610 4794145 4434299 4447734 4367784 4313213 4083434 4342281 4260216 3797985 3839750
16588 3839750 3959695 3784959 3694961 3554276 3639027 3690436 3750593 3444968 3301318 3460978
16578 3460978 3172211 3346967 3089471 3298273 3258573 3027292 3088674 2772731 2891015 2827644
16568 2827644 2848665 2771177 2623962 2630341 2785804 2617012 2766038 2688266 2663732 2319716
16558 2319716 2596716 2611260 2367572 2535693 2459042 2303843 2055094 2213534 2272721 2280309
$$ packed form
16628I228844l26331j97384o1443n44046K7331k59503p2085m39340j13053J90602
16618G433592p69411K61033j05781m87049R5857K09662k92164m57323j44080M7871
16608E792207j82074O6267j88162j00966j28364l92701J52457M9232l2214j43072
16598D892610r8465l59846J3435p9950n4571k29779K58847q2065m62231M1765
16588C839750J19945j74736q9998j40685Q4751N1409O0157l05625j43650J59660
16578C460978k88767J74756k57496K08802l9700k31281O1382l15943J18284o3371
16568B827644K1021p7488j47215O379J55463j68792J49026p7772k4534l44016
16558B319716K77000J4544k43688J68121p6651j55199k48749J58440N9187P588
$$ plain form
16548 2280309 2189815 1953352 2138986 2108139 2216682 1744284 1869655 1985555 1837759 1821520
16538 1821520 1936924 1651632 1486045 1913645 1912559 1596817 1640628 1792725 1803669 1412606
16528 1412606 1680193 1555472 1427538 1736385 1290372 1766272 1506450 1639259 1676700 1388080
16518 1388080 1529250 1500247 1187770 1580448 1567168 1253741 1118227 1614433 1389115 1507482
16508 1507482 1174406 1203542 1248173 1227830 1385012 1065451 1209661 1562476 1207356 1159725
16498 1159725 1260304 1260500 1402013 1000856 1040432 1102710 1315968 924531 1243533 845336
16488 845336 1354035 1213852 1118578 1076164 1090436 1175238 1247486 1170955 1083312 831533 1003250
16477 1003250 964515 946912 1049029 645614 1231007 1258913 958717 900580 827530 785163
$$ packed form
16548B280309r0494k36463J85634l0847J08543m72398J25371J15900j47796j6239
16538A821520J15404k85292j65587M27600j086l15742M3811J52097J0944l91063
16528A412606K67587j24721j27934L08847m46013M75900k59822J32809L7441k88620
16518A388080J41170k9003l12477L92678j3280l13427j35514M96206k25318J18367
16508A507482l33076K9136M4631k0343J57182l19561J44210L52815l55120m7631
16498A159725J00579J96J41513m01157L9576O2278K13258l91437L19002l98197
16488H45336N08699j40183r5274m2414J4272Q4802P2248p6531q7643k51779J71717
16477A003250l8735j7603J02117m03415N85393K7906l00196n8137p3050m2367
$$ plain form
16467 785163 914591 830689 381292 1152875 819042 1013015 883275 851163 1072657 1139951
16457 1139951 737995 973680 740230 666781 864046 790186 774404 698769 586052 685355
16447 685355 600313 366712 768975 783178 858944 429133 485115 653005 653942 779909 595114
16436 595114 578371 384108 369386 304951 774306 500536 737490 619316 601541 379421
16426 379421 588109 632521 883702 614722 690369 733725 604458 315948 639448 920875
16416 920875 756077 358522 310899 888368 694839 103074 532309 783146 1029288 711449
16406 711449 131958 549524 600381 467906 595197 774030 372716 356987 462337 739244
16396 739244 358385 335085 393254 672226 232333 373714 337984 456954 286129 560184
$$ packed form
16467G85163J29428q3902C81292P71583l33833J93973j29740l2112K21494O7294
16457A139951m01956K35685k33450p3449J97265p3860j5782p5635j12717R9303
16447F85355q5042k33601M02263J4203P5766D29133N5982J67890R37J25967j84795
16436E95114j6743j94263j4722o4435M69355k73770K36954j18174j7775k22120
16426C79421K08688M4412K51181k68980P5647M3356j29267k88510L23500K81427
16416I20875j64798C58522m7623N77469j93529A03074M29235K50837K46142l17839
16406G11449A31958M17566N0857j32475J27291J78833C72716j5729J05350K76907
16396G39244C58385k3300N8169K78972B32333J41381l5730J18970j70825K74055
$$ plain form
16386 560184 479229 36326 409754 626869 530060 763361 548981 228131 330136 496925
16376 496925 413359 564847 465411 -24980 491378 430707 353933 429063 566860 413683 478081
16365 478081 390610 333386 394543 280708 152325 521266 571780 438539 -34631 674873
16354 426944 293168 342677 258260 514605 239056 288772 609157 427750 449278 309921
16344 309921 295472 165609 318937 62699 480633 415468 678738 487863 332206 295140
16334 295140 139309 111637 192580 391134 405090 342137 243217 466718 536421 366514 361540
16323 361540 213401 395070 297079 80101 203940 318437 394532 469470 361121 305282
16313 305282 112242 148895 314049 253037 371174 397746 466496 41673 -74108 190442 414134
$$ packed form
16386E60184q0955C6326L73428K17115r6809K33301k14380B28131J02005J66789
16376D96925q3566J51488r9436b4980D91378o0671p6774P5130J37797j53177O4398
16365D78081q7471n7224O1157j13835j28383L68941N0514j33241c4631F74873
16354D26944j33776M9509q4417K56345B39056M9716L20385j81407K1528j39357
16344C09921j4449j29863J53328F2699M17934o5165K63270j90875j55657l7066
16334B95140A39309k7672Q0943J98554J3956o2953r8920K23501O9703j69907m974
16323C61540j48139J81669r7991H0101J23839J14497P6095P4938j08349n5839
16313C05282A12242L6653J65154o1012J18137K6572O8750D1673g4108A90442K23692
$$ plain form
16302 414134 237717 109385 255113 155866 6184 297145 198403 371221 401038 244438
16292 244438 24555 248377 150458 379421 250508 429278 352050 189363 272841 277262 283949
16281 283949 327544 316512 421434 276374 226123 118360 278456 36090 448056 344469
16271 344469 132752 -157439 199863 110070 492679 271741 228413 437317 40191 -223778
16260 224942 227820 145366 220268 538512 593775 306098 211542 200059 497431 218171 214972
16249 214972 107823 -183883 8353 75809 342082 219564 341879 158229 258436 -55256
16238 265906 264752 245976 567129 54875 -60898 454533 68198 55526 109105 27651 29504
16227 29504 11751 99620 85457 255765 182234 205872 -47020 103318 194729 414948 53927
$$ packed form
16302D14134j76417A09385J45728r9247F184K90961r8742J72818K9817j56600
16292B44438B4555K23822r7919K28963j28913J78770p7228j62687Q3478M421O687
16281B83949M3595j1032J04922j45060n0251j07763J60096C6090M11966j03587
16271C44469A32752a57439A99863q9793L82609k20938m3328K08904D0191b23778
16260B24942K878q2454P4902L18244N5263k87677r4556j1483K97372B18171l199
16249B14972j07149a83883H353O7456K66273j22518J22315A58229J00207e5256
16238B65906j154j8776L21153E4875f0898D54533F8198j2672N3579B7651J853
16227B9504A1751Q7869j4163J70308p3531K3638d7020A03318R1411K20219E3927
$$ plain form
16215 107810 225967 -160169 -124006 52550 363620 358601 80789 254365 223647 -29802 125427
16203 2101 443888 193183 -80637 374397 69726 64587 -73906 186462 -143583 -137335 539474
16191 -124344 -41387 497307 111107 248277 -49084 -135563 26524 99213 -12281 227839 70681
16179 -118153 127079 150724 405440 -55691 200451 270700 77527 7953 46312 -245250 -10458
16167 285881 -181682 -174907 -114958 -24773 115435 430139 30104 119813 121957 376826 -107520
16155 255943 239610 315567 -94730 313364 86721 232504 115814 -97193 28822 242899 -70317
16143 257980 -11285 281637 272470 235039 156596 96550 48810 -106199 223009 17557 -3848
16131 -205963 154991 -273510 56078 -15299 125178 374949 -63827 73771 -189618 -29823
$$ packed form
16215A07810J18157a60169L6163E2550L11070n019H0789J73576l0718b9802A25427
16203B101M41787A93183h0637C74397F9726n139g3906A86462a43583O248E39474
16191a24344d1387D97307A11107J37170d9084q6479B6524P2689a2281B27839G0681
16179a18153A27079K3645K54716e5691B00451P0249G7527G953L8359b45250a0458
16167B85881a81682O775N9949b4773A15435L14704C0104Q9709K144K54869a07520
16155B55943j6333P5957i4730C13364H6721J45783A15814i7193B8822K14077g0317
16143B57980a1285B81637r167l7431p8443o0046m7740a06199B23009A7557c848
16131b05963A54991b73510E6078a5299A25178K49771f3827G3771a89618b9823
$$ plain form
16120 -35301 -233633 -115098 -29693 288281 73177 200454 -183026 67316 46857 -4079 254538
16108 -220985 106169 151873 -241902 287609 -94823 -177997 31775 -103757 155344 305270
16098 305270 -113738 156009 206070 107404 305019 287234 7419 -138039 -62976 13811 47758
16087 47758 -7062 -25589 180301 -152791 307695 96905 87822 128140 -148424 70518 -111217
16075 108871 -145092 73754 326565 -20438 130972 -248692 76242 182475 163625 -16484
16064 -340413 -48791 -105214 -24472 40506 110324 -88534 -200450 -78446 -190115 -256082 98016
16052 -91103 161228 235338 53465 -11896 -64967 -131995 -227137 -79558 95366 193162 -124192
16040 -381131 176338 -83328 177665 -89089 -11408 -48899 -98178 32664 101050 38411 -56720
$$ packed form
16120c5301j98332a15098b9693B88281G3177J27277a83026F7316k0459d079B54538
16108b20985A06169M5704b41902B87609i4823q3174C1775a03757A55344J49926
16098C05270a13738A56009N0061r8666J97615j7785G419a38039f2976A3811L3947
16087D7758g062j8527A80301a52791C07695I6905r083M0318a48424G0518a11217
16075A08871a45092G3754K52811b0438A30972b48692G6242J06233j8850a6484
16064c40413d8791n6423b4472D0506O9818h8534j11916g8446j11669o5967I8016
16052i1103A61228P4110E3465a1896n3071o7028r5142g9558I5366R7796a24192
16040c81131A76338h3328A77665h9089a1408l7491m9279C2664O8386C8411e6720
$$ plain form
16028 139563 188996 214349 49986 -194614 208477 102917 92228 -257375 -102226 254553
16017 120051 -116774 147407 -126284 -180901 239657 -186550 16005 311263 274565 223684
16007 223684 -43956 -263564 -83842 209351 -232230 -45895 -94449 -388403 -234839 56837
15996 -8078 -87181 -41251 -44272 217598 221233 207276 -47634 17423 -11989 152575 77234 22265
15983 180596 -121617 -48924 -126299 35110 -95978 119053 77054 217745 157939 81093 -89163
15971 33817 28818 -59550 148489 -82282 210728 -102812 187222 368601 173549 -205682
15960 63546 -4082 17559 1778 165427 -36796 -50548 105202 -212676 323831 104714 -33548
15948 117155 -256301 -17508 -13834 -8590 -62178 55948 56415 -183281 98460 3810 214504 -60451
$$ packed form
16028A39563M9433K5353D9986a94614B08477A02917j0689b57375a02226B54553
16017A20051a16774A47407a26284n4617B39657a86550A6005K95258l6698n0881
16007B23684d3956k19608h3842B09351b32230d5895m8554k93954J53564E6837
15996h078p9103d1251l021B17598L635j3957d7634A7423a1989A52575p5341B2265
15983A80596a21617d8924p7375C5110i5978A19053m1999J40691n9806p6846h9163
15971C3817m999e9550A48489h2282B10728a02812A87222J81379A73549b05682
15960F3546d082A7559A778J63649c6796j3752A05202b12676C23831A04714c3548
15948A17155b56301a7508L674N244n3588E5948M67a83281I8460C810K10694f0451
$$ plain form
15935 -114815 125921 -117211 -54454 -151614 -61854 122951 -96625 161015 -166637 106956
15924 109876 -110874 -113357 63866 -280322 -349225 -61752 -220646 272211 -168826 -62053 -120857
15913 -120857 125849 84409 -245823 62470 189232 200832 -198281 -135310 -64928 48364 -311753
15901 -151657 167866 -181522 206657 -218632 40000 65845 -266977 -224072 -203282 33308
15890 -115232 -62213 -54559 -16088 259261 121683 -10128 -12081 75869 246379 -112573 105309
15878 -62456 132004 47146 -144164 -30973 260267 93044 -5496 -56696 88271 265619 -9167
15866 -122606 74205 118960 -59866 -91339 154057 65277 -35175 -81120 186707 -165106 -309969
15855 -309969 479138 -28874 -236279 -81950 18556 -169823 -67497 -90282 211012 -85786 45198
$$ packed form
15935a14815A25921a17211e4454r7160f1854A22951i6625A61015a66637A06956
15924A09876a10874k483F3866b80322o8903f1752j58894B72211a68826f2053n8804
15913a20857A25849m1440b45823F2470J26762J1600a98281O2971f4928D8364c11753
15901a51657A67866a81522B06657b18632D0000K5845b66977M2905K0790C3308
15890a15232N3019P654a6088B59261A21683a0128j953G5869J70510a12573A05309
15878f2456A32004D7146a44164c0973B60267I3044e496n1200H8271J77348i167
15866a22606G4205M4755e9866l1473A54057F5277c5175m5945A86707a65106j44863
15855c09969D79138b8874k07405h1950A8556a69823f7497k2785B11012h5786D5198
$$ plain form
15843 -100589 -114658 -245305 53706 -150317 -20199 -2490 -138698 50201 -29774 -37602 -83473
15832 -83473 -62411 -185682 78937 232892 -4502 262875 27843 359157 -139168 36673 -196212
15820 -13663 -52876 -140225 191293 78330 123693 -244044 -623169 89995 152162 -79542 -167357
15809 -167357 -46576 159287 11624 150620 83570 151388 -178516 -190357 -77245 -153263 -245150
15798 -245150 -33914 -78538 -190205 -223758 -208083 -150408 155689 124393 59618 -212656 11818
15786 7059 -89878 -200088 260650 -95617 16069 -330624 4699 64734 -80268 72221 -41598
15774 -64670 -3406 64759 -159477 342284 -209363 -135774 -31214 -185867 120874 16240 114818
15763 114818 119960 37508 -45089 -146140 -397654 110806 -180599 27779 -211038 244961
$$ packed form
15843a00589j4069j30647E3706a50317b0199b490j36208E0201b9774p828m5871
15832h3473K1062j23271G8937J53955d502B62875B7843L31314a39168C6673a96212
15820a3663l9213q7349A91293G8330M5363b44044l79125H9995O2167g9542q7815
15809a67357d6576A59287A1624J38996o7050O7818a78516j1841g7245p6018r1887
15798b45150c3914m4624j11667l3553J5675N7675A55689l1296E9618b12656A1818
15786G059h9878j10210B60650i5617A6069c30624D699O0035h0268G2221d1598
15774f4670c406F4759a59477C42284b09363P3589c1214j54653A20874A6240R8578
15763A14818N142C7508d5089j01051k51514A10806a80599B7779b11038B44961
$$ plain form
15752 -125610 102963 -367773 121951 -125213 149603 -25281 -218024 36708 5190 142228
15742 142228 -79724 98376 20566 289550 -73528 225745 -100991 246934 -299518 -19518
15731 -125183 -105272 322425 -357902 32636 298068 166093 3732 -131264 -170003 -239164 -68671
15719 131471 310532 -44817 -200250 -82106 -367223 22082 -127211 -250867 -245985 -95815 -166240
15708 -166240 -280578 -177989 -127735 171034 -61453 213587 312400 -296724 -120283 -323157
15698 -323157 -29721 -7994 36898 -255049 -222186 -294555 143775 -103253 -213344 -111046 -61221
15687 -61221 85950 77730 222520 -239609 -279219 -87862 -335 -274941 35240 -209415 -34011
15675 222006 231701 22162 -135927 199184 -342639 -202226 101441 -186109 -103249 125347
$$ packed form
15752a25610A02963c67773A21951a25213A49603b5281j92743C6708E190J37038
15742A42228g9724I8376B0566K68984g3528B25745a00991B46934b99518a9518
15731a25183J9911C22425c57902C2636K65432j31975C732a31264l8739o9161f8671
15719A31471J79061d4817j55433h2106k85117B2082a27211j23656M882i5815p0425
15708a66240j14338J02589N0254A71034f1453B13587R8813b96724a20283k02874
15698c23157b9721g994C6898b55049L2863p2369A43775a03253j10091J02298M9825
15687f1221H5950q220J44790b39609l9610h7862c35k74606C5240b09415c4011
15675B22006R695B2162a35927A99184c42639J40413A01441a86109Q2860A25347
$$ plain form
15664 -260136 -27464 102603 96817 -30510 322619 -99022 66013 179451 74885 158950 313409
15653 313409 126406 20404 -126642 -158197 114624 104999 298901 108952 -130959 3949 107166
15642 107166 -167275 -52579 95402 -24191 -9417 -273986 187094 159129 39484 237534 228198
15631 228198 -287592 250317 150237 -309738 90734 210688 61068 7183 -12320 128608
15620 302818 210801 59035 -217503 21804 -69185 91455 140448 127599 110583 -130580 -67017
15609 -67017 -148970 -279738 -27807 -247416 -157001 -247848 -82928 -263208 -10094 56482 -266446
15597 151668 -49627 29159 -80554 10058 221659 241626 66692 -126382 3017 -1742 497469
15585 -121414 307983 291314 -86162 -138938 -311909 -245042 -138720 71377 68461 -307330 1739
$$ packed form
15664b60136b7464A02603n786c0510C22619i9022F6013J13438G4885Q4065J54459
15653C13409A26406B0404a26642l1555A14624r625J93902A08952a30959C949J03217
15642A07166a67275e2579I5402b4191i417k64569A87094k7965C9484J98050r336
15631B28198b87592B50317j00080c09738I0734J19954F1068G183a2320A28608
15620C02818r2017E9035b17503B1804f9185I1455M8993j2849j7016a30580O3563
15609f7017q1953j30768b7807k19609R0415r0847h2928j80280a0094E6482b66446
15597A51668d9627B9159h0554A0058K11601J9967F6692a26382C017a742D97469
15585a21414C07983j6669h6162n2776j72971O6867J06322G1377k916c07330A739
$$ plain form
15573 -2303 -144510 33987 -261637 79773 -236213 135878 184157 -432798 374069 14940 -56172
15561 63023 -165577 101997 67305 -167183 20870 179224 -388444 36420 -48802 5783 132501
15550 132501 -82397 203733 207426 -71703 18401 -6910 171827 64334 -21549 -42868 125946
15538 -77251 -186846 -81008 321973 -19753 -328189 72915 75128 -51857 158009 -342776 96791
15526 -100594 233728 -63209 -331643 98025 161723 60099 149384 -151634 93585 -158316 -36419
15514 -146099 -168526 318769 -17461 -96114 -113411 391014 -2689 -32295 60667 -277307 -188977
15503 -188977 35714 -21273 276218 -104813 61206 -282966 -51934 -85624 -131715 -38192 -154629
15492 -154629 -165046 62479 -34275 129668 13429 -101987 -28621 -66448 49334 113115 111006
$$ packed form
15573b303j42207C3987b61637G9773b36213A35878M8279d32798C74069A4940e6172
15561F3023a65577A01997l4692a67183B0870J58354c88444C6420d8802E783J26718
15550A32501h2397B03733L693g1703A8401f910A71827F4334b1549k1319A25946
15538g7251j09595h1008C21973a9753l08436G2915K213e1857A58009c42776I6791
15526a00594B33728f3209k68434I8025O3698F0099Q9285a51634I3585a58316c6419
15514a46099k2427C18769a7461p8653j7297C91014b689k9606F0667b77307Q8330
15503a88977C5714b1273B76218a04813F1206b82966e1934l3690m6091c8192j16437
15492a54629j0417F2479c4275A29668A3429a01987b8621l7827D9334O3781k109
$$ plain form
15481 111006 -82744 86957 -383801 270415 -236753 188007 96477 -90080 -230770 -364627
15471 -364627 -161135 8033 -21464 -99571 72954 126144 150304 158155 -247974 364897 19870
15459 -185949 122078 94525 -71572 251434 -44594 -14497 -166530 -125903 -29604 -113257 275627
15447 -56189 139643 182005 44205 170860 47623 130243 -115179 177161 -76282 186546 -8683
15435 -60027 26697 -100025 -40987 26920 -160329 -75830 -91014 -51430 163621 -162887 160905
15423 155134 -302750 -4887 -2704 -220467 111895 -54556 -75852 -34473 517235 164791 -309250
15411 -281187 312859 36317 45721 91532 -152422 108505 -168858 83021 196357 -171458
15400 -59855 15116 -114356 110250 -345604 -174521 2751 272752 -205401 -165263 -239913 533192
$$ packed form
15481A11006h2744H6957c83801B70415b36753A88007r1530i0080j40690j33857
15471c64627a61135H033b1464p8107G2954N3190K4160P851b47974C64897A9870
15459a85949A22078k7553g1572B51434d4594a4497j52033M0627b9604q3653B75627
15447e6189A39643M2362D4205J26655D7623Q2620a15179A77161g6282A86546h683
15435f0027B6697a00025d0987B6920a60329g5830j5184L9584A63621a62887A60905
15423A55134c02750d887K183k17763A11895e4556k1296c4473E17235A64791c09250
15411b81187C12859C6317R404M5811a52422A08505a68858H3021J13336a71458
15400e9855A5116a14356A10250c45604J71083B751K70001b05401M0138p4650E33192
$$ plain form
15388 84764 86097 153645 65929 -3381 -80298 -101714 128258 -76314 2667 77138 -256384 -196054
15376 -196054 305574 -27186 -163677 163005 442845 -231881 -28254 -427139 -116443 221080
15365 258217 13828 -1379 142993 129599 -36523 -87600 -63225 239757 -613 272760 -124988
15353 -33806 -113894 132340 209687 303168 138538 -218442 -129930 53612 -91681 -184904 238674
15341 129484 -121919 -310161 20429 -213580 145700 -232088 75311 -79550 376792 -250510
15330 35234 286778 -149132 -124029 190132 338346 108304 87857 -51100 -459464 427650
15319 -111765 -48409 -44856 146164 115930 226303 217368 51376 -166159 98657 -224965 -240906
15308 -240906 -39626 58279 184669 108057 -68857 -65250 -69673 -1211 127106 -113973 381358
$$ packed form
15388H4764J333O7548F5929c381p6917k1416A28258g6314B667P4471b56384O0330
15376a96054C05574b7186j36491A63005K79840b31881b8254l98885a16443B21080
15365B58217A3828a379A42993j3394c6523n1077K4375B39757f13B72760a24988
15353c3806q0088A32340P7347R3481A38538b18442Q8512E3612i1681r3223B38674
15341A29484a21919j88242B0429b13580A45700b32088G5311g9550C76792b50510
15330C5234K51544a49132K5103A90132J48214A08304k0447e1100m08364D27650
15319a11765d8409L553A46164l0234J10373q935E1376a66159I8657b24965j5941
15308b40906c9626E8279J26390p6612f8857L607m423a211A27106a13973C81358
$$ plain form
15296 56093 -44655 -196363 87162 259999 218899 -36388 -34353 9694 -135576 -74509 -120468
15285 -120468 70314 231271 84819 235563 366865 143028 29224 57428 -210140 107875
15274 64015 316830 -37939 126321 75910 155640 -20945 -81291 -112385 210556 189371 10197
15262 149278 206768 104266 67819 133636 -1575 -162951 -57698 129867 197183 204168 110063
15251 110063 20283 249764 -36633 -52879 15736 172442 60544 280342 62575 232144 9013
15239 81560 -79179 333939 167075 369521 690276 842041 1334535 1326142 1214357 1392587
15229 1392587 764642 214676 253922 -133377 157801 264188 -279969 273657 183658 146249
15219 146249 -158438 -130141 102588 90018 124679 167844 -85668 -141937 319649 234130 86300
$$ packed form
15296E6093d4655j51708H7162J72837m1100c6388K035I694a35576O1067m5959
15285a20468G0314J60957H4819J50744J31302A43028B9224K8204b10140A07875
15274F4015K52815c7939A26321n0411P9730b0945o0346l1094B10556k1185A0197
15262A49278N7490j02502l6447O5817a575j61376e7698A29867O7316O985r4105
15251A10063B0283K29481c6633j6246A5736J56706F0544K19798F2575J69569I013
15239H1560g9179C33939j66864K02446L20755J51765M92494q393j11785J78230
15229A392587o27945B14676L9246a33377A57801J06387b79969B73657q9999l7409
15219A46249a58438K8297A02588j2570L4661M3165h5668n6269C19649q5519H6300
$$ plain form
15207 326939 11932 210999 417610 91690 18658 -124407 180077 112205 156566 40685 96762
15196 96762 14561 -58581 58856 -46006 137405 153469 153817 45431 41819 119614 89581 -31681
15183 -81499 -87734 -102387 -235123 139563 306312 -233477 -109140 140231 23759 91269 -71107
15171 259237 67878 41727 40566 -98620 92211 341969 32866 -106227 327689 187728 -43458
15159 175344 11158 -40790 9318 -62381 305805 356192 159456 132336 -209902 46235 185370
15148 185370 -34265 -65801 -50964 153373 -199775 -179220 217726 451281 -74362 -230490
15138 -230490 355916 -179441 -40875 -62628 368122 152074 235060 89197 263 203579 -72211
15126 2015 133753 133310 136323 161219 -17012 165928 228027 -73084 -232291 77353 -27221 46309
$$ packed form
15207C26939A1932J99067K06611I1690A8658a24407A80077o7872M4361D0685N6077
15196I6762A4561e8581E8856d6006A37405J6064L48D5431l612P7795l0033c1681
15183h1499o235j4653j32736A39563J66749b33477a09140A40231B3759O7510g1107
15171B59237F7878k6151j161i8620I2211K49758C2866a06227C27689j39961d3458
15159A75344A1158d0790I318f2381C05805N0387A59456k7120b09902D6235J39135
15148A85370c4265l1536J4837A53373a99775K0555B17726K33555g4362j56128
15138b30490C55916a79441d0875k1753C68122A52074Q2986H9197B63K03316g2211
15126B015J31738m43L013K4896a7012A65928O2099g3084j59207G7353b7221D6309
$$ plain form
15113 289172 -22777 333273 260754 185461 64025 148218 220108 -185701 227860 131089 314945
15102 314945 209143 159327 206756 38666 151822 -83808 -173100 276331 83094 334195 117642
15090 -54479 -166099 137869 286050 113258 78090 351166 76675 171431 57352 302487
15080 302487 181444 133639 124427 250090 27099 68372 -32434 41050 155134 109889 481895
15069 481895 -191009 130081 2873 403603 -147841 78951 -28667 24940 -104561 406644
15058 402871 -50021 80078 66471 91003 -15165 -124925 -201534 50486 164253 106739 -311
15046 114573 440148 23587 100017 -55054 211462 142374 213540 293489 24528 119168 35862
15034 100232 155077 53417 195635 465760 170938 194118 228565 224178 67230 61084 101231
$$ packed form
15113B89172b2777C33273p2519p5293F4025Q4193P1890a85701B27860r6771J83856
15102C14945j05802m9816M7429C8666J13156h3808q9292B76331H3094K51101A17642
15090e4479j11620A37869J48181A13258l5168K73076G6675R4756E7352K45135
15080C02487j21043m7805r212J25663B7099M1273c2434D1050J14084m5245L72006
15069D81895a91009A30081B873M00730a47841G8951b8667B4940a04561D06644
15058D02871e0021H0078j3607K4532a5165j09760p6609E0486J13767n7514c11
15046A14573L25575B3587P6430e5054B11462o9088P1166P9949B4528R4640C5862
15034A00232N4845E3417J42218K70125A70938K3180L4447m387F7230o146M0147
$$ plain form
15023 101231 176525 -44708 360941 204305 379546 301516 194623 286472 398883 203890
15013 203890 6262 -58779 412012 -54457 256652 7699 350681 217165 155083 -165720 402625
15001 420666 286785 219424 34191 82147 25887 382789 379496 -24289 296397 -154309 -189471
14990 -189471 309236 268771 384641 9310 -16202 265298 72682 89043 633190 -21056 819418
14978 197798 55075 104169 -56547 159814 459494 340482 385366 430417 22721 -180682 232019
14966 221669 -23122 319689 362842 196967 226608 185428 288189 103263 201276 664600
14956 664600 326799 398710 318194 106305 13403 188764 211842 294892 346075 278635 311604
14945 311604 380455 161338 475348 210350 -114659 121235 13167 146572 277726 548771
$$ packed form
15023A01231P5294d4708C60941j56636J75241p8030j06893R1849J12411j94993
15013B03890F262e8779D12012e4457B56652G699L42982j33516o2082a65720D02625
15001D20666j33881o7361C4191M7956B5887L56902l293b4289B96397a54309l5162
14990a89471C09236m0465J15870I310a6202B65298G2682J6361N44147b1056H19418
14978A97798E5075M9094e6547A59814K99680j19012M4884M5051B2721a80682B32019
14966B21669b3122C19689M3153j65875K9641m1180J02761A03263R8013M63324
14956F64600C26799P1911q0516A06305A3403J75361K3078Q3050N1183o7440L2969
14945C11604O8851A61338L14010B10350a14659A21235A3167J33405J31154K71045
$$ plain form
14935 548771 263724 252536 300543 -114634 379288 -107924 480944 100062 125188 420737
14925 420737 303590 130547 243151 237754 40287 546881 189902 277297 -106283 447590
14914 242433 421982 174716 215394 254873 476182 93120 105333 364030 311567 46553 375557
14903 375557 409461 291063 365216 340056 210129 294628 -34032 -107282 858671 294576 93132
14891 416642 201064 512708 414407 574174 154124 287908 517754 676076 545399 173232
14880 503457 287027 526522 558037 364578 -306705 393923 501595 470602 297751 251378
14870 251378 475485 -69109 27427 773743 130367 523420 379030 532963 48645 235275
14860 235275 631606 548299 277233 443637 439008 275393 473275 248967 554455 275460
$$ packed form
14935E48771B63724j1188M8007a14634C79288a07924D80944A00062K5126K95549
14925D20737j17147A30547J12604n397D0287N06594A89902Q7395a06283D47590
14914B42433J79549A74716M0678L9479K21309I3120J2213K58697n2463D6553L29004
14903C75557L3904j18398P4153k5160j29927Q4499c4032p3250H58671B94576I3132
14891D16642B01064L11644r8301J59767A54124J33784K29846J58322j30677A73232
14880E03457k16430K39495L1515j93459c06705C93923J07672l0993j72851m6373
14870B51378K24107f9109B7427P46316A30367L93053j44390J53933D8645J86630
14860B35275L96331q3307k71066J66404m629j63615J97882k24308L05488B75460
$$ plain form
14849 783965 307748 503077 388249 460458 371008 379796 312632 320460 329855 184152 757483
14838 757483 401144 405970 -41592 575531 327783 365726 387685 610190 580638 186926 242442
14827 242442 241511 723995 436516 568185 612924 544581 327816 264031 350212 265152 618698
14816 618698 148433 472778 646902 372982 381016 368430 277511 266956 735526 408267
14806 408267 482269 740655 301235 387082 402287 597359 773534 306961 391831 538362
14796 538362 259365 423369 763746 377967 474976 192772 80828 650864 525682 127016
14785 510136 342114 624337 775329 333350 477374 669046 472033 701058 474589 876422
14775 876422 812730 465432 613006 368043 444227 385328 446444 613328 591546 778067
$$ packed form
14849G83965C07748J95329j14828P2209q9450Q788o7164P828R395j45703N73331
14838G57483l56339M826d1592E75531k47748L7943K1959K22505k9552A86926N5516
14827B42442r31M82484k87479J31669M4739o8343k16765o3785Q6181q5060L53546
14816F18698A48433L24345J74124k73920Q034j2586r0919j0555M68570l27259
14806D08267P4002K58386C01235Q5847J5205J95072J76175C06961Q4870J46531
14796E38362B59365J64004L40377C77967R7009A92772H0828N70036j25182A27016
14785E10136j68022K82223J50992C33350J44024J91672j97013K29025k26469M01833
14775H76422o3692l47298J47574k44963P6184n8899O1116J66884k1782J86521
$$ plain form
14765 778067 518829 305254 594462 831340 587581 562639 575859 726674 536704 624153
14755 624153 330376 865468 674341 437372 680680 729130 1169746 448875 669561 644820
14745 644820 277465 734738 696894 367301 869362 697838 683896 868473 564934 486319
14735 486319 522849 499021 848169 743352 793003 722922 642688 756239 836173 652278 780101
14724 780101 809987 843232 576009 799087 562139 928539 796533 685416 894432 759800
14714 759800 789880 977587 560472 653585 573645 769877 653526 820208 687812 861949
14704 861949 661889 772043 972184 891779 909272 473706 1218126 780337 745794 1121038
14694 1121038 672147 1312915 707693 961636 818153 1172992 730892 1118146 1039219 810134
$$ packed form
14765G78067k59238k13575K89208K36878k43759k4942J3220J50815j89970Q7449
14755F24153k93777N35092j91127k36969K43308M8450M40616D48875K20686k4741
14745F44820B77465M57273l7844l29593N02061j71524j3942J84577l03539p8615
14735D86319L6530k3828L49148j04817M9651p0081q0234J13551P9934j83895J27823
14724G80101K9886L3245k67223K23078k36948L66400j32006j11117K09016j34632
14714G59800L0080J87707m17115R3113p9940J96232j16351J66682j32396J74137
14704H61949k00060J10154K00141q0405J7493m35566P44420m37789l4543L75244
14694A121038m48891O40768o05222K53943j43483L54839m42100L87254p8927k29085
$$ plain form
14684 810134 984033 392098 839744 569246 995309 1158036 1353482 907675 1042396 1006122
14674 1006122 804248 1002621 788515 896814 1250904 1015343 1117219 1013638 790098
14665 790098 939237 1493459 840599 1334808 948274 862998 998316 1427879 894571 1256157
14655 1256157 899325 971906 1105284 945409 1029420 1142822 1447884 1354125 1081434 981912
14645 981912 1132970 900744 1318399 948568 1285179 979402 1203913 1342397 1215205 1197381
14635 1197381 920857 798868 1304637 1251506 1422140 1347377 1305032 997096 1471818 1208530
14625 1208530 1602658 1194952 1253881 1366639 1078595 1332895 1428310 1170566 1501410 1087916
14615 1087916 1331261 1575615 1371986 1501357 1486195 1230809 1378753 1288783 1499479 1383923
$$ packed form
14684H10134J73899C92098M47646k70498M26063J62727J95446m45807J34721l6274
14674A006122k01874J98373k14106J08299L54090k35561J01876j03581k23540
14665G90098J49139N54222o52860M94209l86534q5276J35318M29563n33308L61586
14655A256157l56832P2581J33378j59875Q4011J13402L05062r3759k72691r9522
14645I81912J51058k32226M17655l69831L36611l05777K24511J38484j27192j7824
14635A197381k76524j21989N05769n3131J70634p4763m2345l07936M74722k63288
14625A208530L94128m07706N8929J12758k88044K54300R5415k57744L30844m13494
14615A087916K43345K44354k03629J29371j5162k55386J47944q9970K10696j15556
$$ plain form
14605 1383923 1465966 1796076 1648747 1764480 1371243 1965654 1527177 1456711 1697722 1962214
14595 1962214 1549234 1699155 1788906 1591495 1581981 1799292 1556720 1529766 1689995 1625300
14585 1625300 1681055 1928463 1607718 1904812 1839146 1213192 1670912 1881280 1738042 1726130
14575 1726130 1825565 1881251 1825708 2073390 1836409 2096445 2165545 1847083 2234566 2012687
14565 2012687 2032695 2214233 2144398 2275079 1793371 1875842 2075714 2129988 2476546 2144832
14555 2144832 2342692 2462724 2421827 2362845 2715248 2414416 2670407 2788091 2797788 3006851
14545 3006851 2769537 2853088 3387005 3471611 3260950 3749238 4214858 4883744 5552555 6810468
14535 6810468 8278807 10831582 14776728 21576060 31118778 28871738 19700827 11987713
$$ packed form
14605A383923Q2043L30110j47329J15733l93237N94411m38477p0466K41011K64492
14595A962214m12980J49921Q9751j97411r514K17311k42572k6954J60229o4695
14585A625300N5755K47408l20745K97094o5666o25954M57720K10368j43238j1912
14575A726130R9435N5686n5543K47682k36981K60036O9100l18462L87483k21879
14565B012687K0008J81538o9835J30681m81708Q2471J99872N4274L46558l31714
14555B144832J97860J20032m0897n8982L52403l00832K55991J17684R697K09063
14545C006851k37314Q3551N33917Q4606k10661M88288M65620O68886O68811J257913
14535F810468J468339K552775L945146O799332R542718k247040r170911p713114
$$ plain form
14527 11987713 7388798 5359781 4086278 3480820 3217320 3060202 2896550 2630243 2666916
14518 2666916 2138362 2292498 2519651 2358748 2411743 2701042 2607245 2336249 2638021 2286470
14508 2286470 2426912 2544122 2578228 2612933 2551363 2303828 2768207 2806399 2505688 2871441
14498 2871441 2853585 3087244 2818979 2885478 3017527 2954130 2960641 3092797 3198670 3138201
14488 3138201 3087121 3124030 3131063 2943695 3367713 3395277 3198633 2960754 3348401 3607787
14478 3607787 3556863 3684318 3612279 3536826 3621533 3565042 3504846 3815421 3631312 3827084
14468 3827084 3722002 3857722 3783282 4154407 4307787 3985452 3934779 4256557 4173808 4468732
14458 4468732 4234772 4292988 4687276 4461813 4892669 4728147 4513920 4514379 4699452 4910345
$$ packed form
14527A1987713m598915k029017j273503o05458k63500j57118j63652k66307L6673
14518B666916n28554J54136K27153j60903N2995K89299r3797k70996L01772l51551
14508B286470J40442J17210L4106L4705o1570k47535M64379L8192l00711L65753
14498B871441j7856K33659k68265O6499J32049o3397O511J32156J05873o0469
14488C138201n1080L6909P033j87368M24018K7564j96644k37879L87647K59386
14478C607787n0924J27455p2039p5453Q4707n6491o0196L10575j84109J95772
14468C827084j05082J35720p4440L71125J53380l22335n0673L21778q2749K94924
14458D468732k33960N8216L94288k25463M30856j64522k14227M59J85073K10893
$$ plain form
14448 4910345 4982549 4797053 4920541 4938119 5034633 5244526 5128348 5119297 5457418 5364779
14438 5364779 5404921 5267407 5485653 5891215 6022630 5394151 5626800 6057585 5655807 6089594
14428 6089594 6243188 6430474 6361153 6382747 6110299 6878820 6370268 6829501 7220361 6704476
14418 6704476 6933219 6833259 6966840 7117758 7441493 7407611 7644770 7685247 7690599 7960430
14408 7960430 8024879 8197139 8316236 8179069 8686650 8742546 8563912 8761566 9133834 9188671
14398 9188671 9193160 9050127 9683779 9739611 9849127 10095597 10256737 10171163 10526090 10639911
14388 10639911 10849552 10628399 11320185 11274865 11428234 11586310 11797061 12079103 11896563
14379 11896563 12394597 12478525 12576745 12779844 13129103 13313958 13705647 13544016 14117462 14430722
$$ packed form
14448D910345P2204j85496J23488J7578R6514K09893j16178r051L38121r2639
14438E364779M0142j37514K18246M05562J31415o28479K32649M30785m01778M33787
14428F089594J53594J87286o9321K1594k72448P68521n08552M59233L90860n15885
14418F704476K28743r9960J33581J50918L23735l3882K37159M0477N352K69831
14408G960430O4449J72260J19097j37167N07581N5896j78634J97654L72268N4837
14398I188671M489j43033O33652N5832J09516K46470J61140q5574L54927J13821
14388A0639911K09641k21153O91786m5320J53369J58076K10751K82042j82540
14379A1896563M98034Q3928R8220K03099L49259J84855L91689j61631N73446L13260
$$ plain form
14369 14430722 14412784 14883198 15027506 15697369 15512493 16007993 16493706 16693202 16981893
14360 16981893 17121368 17687327 17988351 17927707 18916885 18876518 19262913 19870635 20368617 20608376
14350 20608376 20993076 21561539 22330439 22517266 22836426 23372724 23619133 24523972 25092361
14341 25092361 25660435 26260025 26894160 27926114 28503420 28854323 29403344 30818720 31195889
14332 31195889 31786744 32613746 33469404 34625741 35446397 36664604 37631601 38701029 39532747
14323 39532747 40907711 41678601 43118225 44675783 45840538 47290640 48921738 49839226
14315 49839226 51900106 53600274 55229118 57069035 59275572 61026128 62810778 65360914
14307 65360914 67062956 69790721 72348334 75198345 77945993 80742271 84111373 86920289
$$ packed form
14369A4430722j7938M70414J44308O69863j84876M95500M85713J99496K88691
14360A6981893J39475N65959L01024o0644R89178m0367L86395O07722M97982K39759
14350B0608376L84700N68463P68900J86827L19160N36298K46409R04839N68389
14341B5092361N68074N99590O34135J031954N77306L50903N49021J415376L77169
14332C1195889N90855Q27002Q55658J156337Q20656J218207R66997J069428Q31718
14323C9532747J374964P70890J439624J557558J164755J450102J631098R17488
14315D9839226K060880J700168J628844J839917K206537J750556J784650K550136
14307F5360914J702042K727765K557613K850011K747648K796278L369102K808916
$$ plain form
14299 86920289 90551656 94086991 97747582 101852417 105833301 110564006 115114576 120007316
14291 120007316 125337961 130988506 137480352 143014536 149951075 156525944 163795047 171951089
14283 171951089 180007617 188943910 198421476 207923812 218259992 229191656 240415230
14276 240415230 252421666 265060635 277968046 292063430 305780208 320400041 335166778
14269 335166778 350153430 364552915 378047026 390650506 402423304 412968666 422637774
14262 422637774 430588879 437533283 443766611 448667475 450239209 450237332 449838879 449683982 445696041
14253 445696041 437556802 431109365 421008675 409310495 396918005 385627779 373688315
14246 373688315 361318370 348331414 335765052 322367372 308888311 295505794 283064985
$$ packed form
14299H6920289L631367L535335L660591M104835L980884M730705M550570M892740
14291A20007316N330645N650545O491846N534184O936539O574869P269103Q156042
14283A71951089Q056528Q936293R477566R502336J0336180J0931664J1223574
14276B40415230J2006436J2638969J2907411J4095384J3716778J4619833J4766737
14269C35166778J4986652J4399485J3494111J2603480J1772798J0545362R669108
14262D22637774P951105O944404O233328M900864J571734j877l98453j54897l987941
14253D45696041q139239o447437j0100690j1698180j2392490j1290226j1939464
14246C73688315j2369945j2986956j2566362j3397680j3479061j3382517j2440809
$$ plain form
14239 283064985 271623702 259227710 247225970 235949934 224708066 214405114 204290884
14232 204290884 194603293 185211519 176582875 168114975 160265985 152636961 145262925 138191787
14224 138191787 131507682 125700911 119672110 114735893 109614448 104974990 100524387 96395326
14216 96395326 92884203 88910779 85428360 82306343 79000979 76336906 73361775 70608522
14208 70608522 68048025 65762839 63476776 61400803 59590289 57287450 55343295 53852619
14200 53852619 52021487 50786721 49460659 47675314 46383535 44751544 43312547 42208772
14192 42208772 41645766 40355529 39377114 37659178 36454868 35845622 35357298 34301459 33382803
14183 33382803 32170259 31767803 30786544 30046818 29379263 28513698 27978750 27193994 26651913
$$ packed form
14239B83064985j1441283j2395992j2001740j1276036j1241868j0302952j0114230
14232B04290884r687591r391774q628644q467900p848990p629024p374036p071138
14224A38191787o684105n806771o028801m936217n121445m639458m450603m129061
14216I6395326l511123l973424l482419l122017l305364k664073k975131k753253
14208G0608522k560497k285186k286063k075973j810514k302839j944155j490676
14200E3852619j831132j234766j326062j785345j291779j631991j438997j103775
14192D2208772n63006j290237r78415j717936j204310o09246m88324j055839r18656
14183C3382803j212544m02456r81259p39726o67555q65565n34948p84756n42081
$$ plain form
14174 26651913 25975875 25548466 24397947 24192036 23437543 23147932 22717798 22161130 21626568
14165 21626568 21007027 21076621 20326923 20168993 19762401 19262954 18806456 18601051 18005468
14156 18005468 17687423 17443452 17205293 16854816 16373477 15756114 15956908 15672430 15092241
14147 15092241 15275602 14688720 14037706 13991271 13840531 13735390 13565789 13222334 12629308
14138 12629308 12902078 12541750 12023917 12324131 11953136 11921244 11567395 11510334 11340628 10998691
14128 10998691 10864161 10634656 10557498 10527993 10308913 9898037 10242482 9783394 9767767 9458724
14118 9458724 9670831 9125000 9470139 8932548 8854208 8957906 8548509 8272652 8539538 8664948
14108 8664948 8556381 8027764 7882504 7981535 7701050 7980050 7228575 7352686 7348708 7211423
$$ packed form
14174B6651913o76038m27409j150519k05911p54493k89611m30134n56668n34562
14165B1626568o19541O9594p49698j57930m06592m99447m56498k05405n95583
14156A8005468l18045k43971k38159l50477m81339o17363K00794k84478n80189
14147A5092241J83361n86882o51014m6435j50740j05141j69601l43455n93026
14138A2629308K72770l60328n17833L00214l70995l1892l53849n7061j69706l41937
14128A0998691j34530k29505p7158k9505k19080m10876L44445m59088j5627l09043
14118I458724K12107n45831L45139n37591p8340J03698m09397k75857K66886J25410
14108H664948j08567n28617j45260R9031k80485K79000p51475J24111l978j37285
$$ plain form
14098 7211423 7113181 7159756 6798918 6652736 6899519 6754321 6824800 6589562 6587577 6510432
14088 6510432 6241660 6115133 5941859 5874798 6359356 6062207 5980759 5851310 5815531 5699278
14078 5699278 5930108 5818904 5512184 5755778 5518002 5280057 5417360 5356122 4848416 5034313
14068 5034313 5296512 5127117 4942865 4908010 4661949 4786649 4731925 4270960 4836716 4438074
14058 4438074 4710646 4801433 4186920 4576695 4103841 4426660 4161303 4145745 4175492 4258754
14048 4258754 4307693 4047588 4002890 3999767 3771443 4130087 4013321 3959233 3726106 3791186
14038 3791186 4189821 3513903 3927987 3674187 3780805 3246310 3633415 3623922 3275440 3314901
14028 3314901 3576494 3215088 3682628 3213526 3009001 3218664 3071445 3237188 2777641
$$ packed form
14098G211423r8242M6575l60838j46182K46783j45198P0479k35238j985p7145
14088F510432k68772j26527j73274o7061M84558k97149q1448j29449l5779j16253
14078E699278K30830j11204l06720K43594k37776k37945J37303o1238n07706J85897
14068E034313K62199j69395j84252l4855k46061J24700n4724m60965N65756l98642
14058D438074K72572R0787o14513L89775m72854L22819k65357j5558K9747Q3262
14048D258754M8939k60105m4698l123k28324L58644j16766n4088k33127O5080
14038C791186L98635o75918M14084k53800J06618n34495L87105r493l48482L9461
14028C314901K61593l61406M67540m69102k04525K09663j47219J65743m59547
$$ plain form
14019 2777641 3068172 3034835 3293165 3139855 2943950 3133831 2779460 3005188 2811514 3021557
14009 3021557 3045412 2548851 2672225 2782245 2260164 2776527 2624668 2535769 2801772 2466729
13999 2466729 2670867 2611623 2636738 2475238 2259515 2335442 2454910 2571275 2223804 2356497
13989 2356497 2611651 2650440 2229801 2281495 2489346 2240585 2018959 2380156 2275803 2589098
13979 2589098 2918808 2947407 3261544 3480025 4831029 6708946 10107632 16220276 26783015
13970 26783015 29682325 20891767 13743051 9643846 7276735 6007838 5200381 4447484
13962 4447484 4266638 3860132 3826593 3337464 3181236 2831421 2985749 2646028 2805911 2704186
13952 2704186 2538575 2754202 2541168 2548286 2265484 2292332 2280948 2048204 2117221 2228978
$$ packed form
14019B777641K90531l3337K58330j53310j95905J89881l54371K25728j93674K10043
14009C021557K3855m96561J23374J10020n22081N16363j51859q8899K66003l35043
13999B466729K04138n9244K5115j61500k15723P5927J19468J16365l47471J32693
13989B356497K55154L8789m20639N1694K07851k48761k21626L61197j04353L13295
13979B589098L29710K8599L14137K18481J351004J877917L398686O112644J0562739
13970B6783015K899310q790558p148716m099205k367111j268897q07457p52897
13962D447484j80846m06506l3539m89129j56228l49815J54328l39721J59883j01725
13952B704186j65611K15627k13034P118k82802K6848j1384k32744O9017J11757
$$ plain form
13942 2228978 2240041 2163796 2212773 1993294 1654333 1910049 2388267 2136681 2112677 1797637
13932 1797637 1811522 1790281 2001104 1446664 2098025 1884346 1876786 1860560 1701405 1930153
13922 1930153 1777905 1735816 1817692 1714050 1473662 1949394 1702681 1528298 1588888 1783622
13912 1783622 1578901 1594503 1858683 1295592 1327557 1476718 1376272 1246569 1285916 1573742
13902 1573742 1388384 1320362 1679874 1462319 1882853 1353603 1586524 1524603 1603350 1708153
13892 1708153 1379357 1656372 1335872 1486570 1563881 1500174 1355263 1550558 1336393 1276577
13882 1276577 1528789 1385168 976759 1568897 1471030 1329754 1265634 1476772 1369890 1439376
13872 1439376 1264141 1456137 1092771 1275928 1127335 1233209 1352015 1307952 1285760 1310443
$$ packed form
13942B228978J1063p6245M8977k19479l38961K55716M78218k51586k4004l15040
13932A797637J3885k1241K10823n54440O51361k13679p560j6226j59155K28748
13922A930153j52248m2089Q1876j03642k40388M75732k46713j74383O0590J94734
13912A783622k04721J5602K64180n63091L1965J49161j00446j29703L9347K87826
13902A573742j85358o8022L59512k17555M20534n29250K32921o1921P8747J04803
13892A708153l28796K77015l20500J50698P7311o3707j44911J95295k14165n9816
13882A276577K52212j43621m08409N92138r7867j41276o4120K11138j06882O9486
13872A439376j75235J91996l63366J83157j48593J05874J18806m4063k2192K4683
$$ plain form
13862 1310443 983847 1195445 1511225 1550581 1402114 1340447 1079747 1214189 1136747 1111959
13852 1111959 1243575 1297465 1252680 1231631 1040988 948412 941459 1291914 1329904 1008946 879399
13841 879399 1053733 1112538 1030118 1089937 760261 981150 994309 894093 951031 802847
13831 802847 1077662 1310170 745655 1187207 1271812 1128362 1162562 792190 1061133 1093164
13821 1093164 979336 528368 889699 1017139 864393 952356 1119279 860583 829292 659699
13811 659699 1170397 800437 868097 1072830 874158 916941 953704 596356 901959 636392
13801 636392 934652 840485 713716 821153 599265 617437 891750 1125971 1058652 844304
13791 844304 825890 736943 879866 939235 827727 628030 746095 734788 886624 839224
$$ packed form
13862A310443l26596K11598L15780L9356j48467o1667k60700J34442p7442k4788
13852A111959J31616N3890m4785k1049j90643r2576o953L50455L7990l20958j29547
13841H79399J74334N8805q2420N9819l29676K20889J3159j00216N6938j48184
13831H02847K74815K32508n64515M41552Q4605j43450L4200l70372K68943L2031
13821A093164j13828m50968L61331J27440j52746Q7963J66923k58696l1291j69593
13811F59699N10698l69960O7660K04733j98672M2783L6763l57348L05603k65567
13801F36392K98260r4167j26769J07437k21888J8172K74313K34221o7319k14348
13791H44304j8414q8947J42923N9369j11508j99697J18065j1307J51836m7400
$$ plain form
13781 839224 762359 859306 673816 814989 629993 748140 795211 1127963 697312 751569
13771 751569 898069 1006353 706602 558733 798091 826459 834693 1065775 467669 1001119
13761 1001119 744260 896800 692716 483532 517462 947610 584453 745532 361654 819002
13751 819002 558268 586505 528032 341990 509418 646947 785193 619078 719903 761195
13741 761195 767911 510236 377580 911855 698899 448895 485125 854391 560907 520074
13731 520074 594179 641179 756626 636169 604052 421846 556511 657481 519901 679886
13721 679886 573102 695559 362874 490942 766530 383602 529733 773953 718286 582587
13711 582587 315282 655160 909057 542805 584666 655388 269379 723597 655894 792003
$$ packed form
13781H39224p6865R6947j85490J41173j84996J18147M7071L32752m30651N4257
13771G51569J46500J08284k99751j47869K39358K8368Q234K31082D67669N33450
13761A001119k56859J52540k04084k09184L3930M30148l63157J61079C61654M57348
13751H19002k60734K8237n8473j86042J67428J37529J38246j66115J00825M1292
13741G61195O716k57675j32656N34275k12956k50004L6230L69266k93484m0833
13731E20074P4105M7000J15447j20457l2117j82206J34665J00970j37580J59985
13721F79886j06784J22457l32685J28068K75588l82928J46131K44220n5667j35699
13711E82587k67305L39878K53897l66252M1861P0722B69379M54218o7703J36109
$$ plain form
13701 792003 677594 662374 816428 446042 528101 350071 608160 816365 390284 423524
13691 423524 483857 612785 557904 506115 431153 641889 545972 434883 812411 749407 350624
13679 543600 452672 622645 310658 619854 664345 476396 551393 75424 770887 274403
13668 143664 801338 475650 446504 314714 408455 394724 561818 719799 479974 485353
13658 485353 729806 612169 494893 730769 218236 294489 418060 602182 783305 301500
13647 373384 640806 413283 432774 406551 376848 684338 568088 500345 266236 414900
13637 414900 516185 441545 351395 527695 767361 519484 380833 383462 453931 335220
13627 335220 379449 313101 491496 243750 283749 508322 164279 298514 643658 131194
$$ packed form
13701G92003j14409j5220J54054l70386Q2059j78030K58089K08205C90284L3240
13691D23524O0333J28928n4881n1789p4962K10736r5917j11089L77528o3004C50624
13679E43600r0928J69973C10658L09196M4491j87949P4997G5424O95463B74403
13668A43664O57674l25688k9146j31790R3741j3731J67094J57981k39825N379
13658D85353K44453j17637j17276K35876B18236P6253J23571J84122J81123C01500
13647C73384K67422k27523J9491k6223k9703L07490j16250o7743k34109J48664
13637D14900J01285p4640r0150J76300K39666k47877j38651K629P0469j18711
13627C35220M4229o6348J78395B43750L9999K24573A64279J34235L45144A31194
$$ plain form
13616 581991 533545 345339 174116 204654 412631 642201 382957 749146 47267 300313
13606 300313 368173 477980 262659 332370 225779 569127 475559 321526 305500 443494
13596 443494 516387 612142 541712 230651 394869 202690 421236 418214 506437 326888 343063
13585 343063 166999 605002 707412 278890 719173 201102 536838 280654 420818 222625
13575 222625 175713 717929 627506 293836 158502 473676 553932 473300 234205 697461
13565 697461 602034 139254 731706 137541 125139 132896 503518 725329 -36484 414209
13554 24926 310908 274458 755997 118262 413944 542737 429786 286611 254869 322194
13544 322194 315667 511172 95268 525502 369521 429041 322650 348984 147315 514050
$$ packed form
13616E81991m8446j88206j71223L0538K07977K29570k59244L66189D7267K53046
13606C00313O7860J09807k15321O9711j06591L43348r3568j54033j6026J37994
13596D43494P2893R5755p0430B30651J64218j92179K18546l022Q8223j79549J6175
13585C43063A66999M38003J02410B78890M40283B01102L35736k56184J40164j98193
13575B22625m6912N42216r0423B93836j35334L15174Q0256q0632B34205M63256
13565F97461r5427A39254N92452A37541j2402P757L70622K21811c6484D14209
13554B4926K85982l6450M81539A18262K95682J28793j12951j43175l1742O7325
13544C22194o527J95505I5268M30234j55981N9520j06391K6334A47315L66735
$$ plain form
13534 514050 422952 289670 126725 556156 420462 465588 345720 164668 312882 198169
13524 198169 211563 116931 307376 640899 33555 452980 232742 -41563 517585 44388
13513 260630 455519 271351 -15464 581542 292045 439543 430173 253805 325547 236870
13503 236870 298018 372766 248940 98879 221174 395697 333186 398586 501910 211730
13492 203505 248856 275097 295925 178924 289969 354517 201540 261335 322438 158329 176480
13481 176480 369910 -9509 257693 282872 335457 -83279 459386 44921 132685 417531 443537
13470 443537 249671 463580 194185 467137 391354 353933 215235 -237122 203586 528655
13460 528655 -21129 261460 24781 382470 369590 214727 254925 200898 38024 47051 436753
$$ packed form
13534E14050r1098j33282A26725M29431j35694M5126j19868A64668J48214j14713
13524A98169J3394r4632J90445L33523C3555M19425k20238d1563E17585D4388
13513B60630J94889j84168a5464E81542k89497J47498r370j76368P1742q8677
13503B36870O1148P4748j23826I8879J22295J74523o2511O5400J03324B11730
13492B03505M5351K6241K0828j17001J11045O4548j52977N9795O1103A58329J8151
13481A76480J93430i509B57693K5179N2585h3279D59386D4921Q7764K84846K6006
13470D43537j93866K13909A94185K72952p5783l7421j38698b37122B03586L25069
13460E28655b1129B61460B4781L57689j2880j54863M0198n4027C8024R027L89702
$$ plain form
13449 436753 224027 446471 186177 168757 398562 237862 217825 355647 280589 548266
13439 548266 597225 245424 222512 493049 60466 156078 83354 279368 224223 233510 413216
13428 413216 332547 226439 369700 179451 311605 222826 318836 378102 63895 -124968
13417 369585 441201 29230 349483 529298 156350 -192719 -245508 264467 92773 419090
13407 419090 375979 -78471 216709 460961 430265 36571 206743 366645 304302 240526 99347
13395 145401 348729 302627 161650 222701 40436 -49390 337501 241640 53520 156315 350953
13384 350953 278264 208496 388261 455743 431945 153876 92035 186464 -8587 176610 321500
13373 321500 346631 267305 258334 226086 311394 324519 179726 41699 370231 110411 147638
$$ packed form
13449D36753k12726K22444A86177j7420K29805j60700k0037J37822p5058K67677
13439E48266M8959B45424k2912K70537F0466R5612p2724J96014n5145R287J79706
13428D13216q0669j06108J43261A79451J32154q8779R6010N9266F3895a24968
13417C69585P1616B9230L20253J79815A56350a92719n2789B64467I2773L26317
13407D19090m3111g8471B16709K44252l0696C6571J70172J59902o2343o3776I9347
13395A45401K03328m6102j40977O1051D0436d9390C37501r5861E3520J02795J94638
13384C50953p2689o9768J79765O7482k3798A53876o1841R4429h587A76610J44890
13373C21500K5131p9326q971l2248Q5308J3125j44793D1699L28532A10411L7227
$$ plain form
13362 147638 271536 532315 341493 216992 127052 266296 556187 248281 14781 283353
13352 283353 21495 -8388 440556 159778 192371 128885 -1962 311467 387244 -263927 367709
13340 239655 326817 136340 326492 -12127 36690 343273 217196 294195 328692 286928 433039
13329 433039 108421 465840 142254 562389 312274 160168 76460 247524 -62638 434627
13318 130806 79391 198474 353228 186858 234710 465285 522990 -38163 99346 155616 125467
13307 125467 182828 397938 36740 58303 170954 152699 78938 -102072 198291 245881 428196
13296 428196 122290 192216 268288 442036 139368 86590 209013 261558 635033 111250
13285 56496 152826 122027 285065 21150 123204 -213331 157840 100328 314442 -102429
$$ packed form
13362A47638J23898K60779j90822j24501q9940J39244K89891B48281A4781K68572
13352B83353B1495h388D40556A59778L2593o3486a962C11467P5777b63927C67709
13340B39655Q7162A36340J90152a2127C6690L06583j26077P6999L4497m1764J46111
13329D33039A08421L57419A42254M20135k50115j52106G6460J71064f2638D34627
13318A30806n1415J19083J54754j66370M7852K30575N7705c8163I9346N6270l0149
13307A25467N7361K15110C6740K1563J12651j8255p3761a02072A98291M7590J82315
13296D28196A22290O9926P6072J73748A39368n2778J22423N2545L73475A11250
13285E6496R6330l0799J63038B1150J02054b13331A57840n7512K14114a02429
$$ plain form
13274 306130 139411 367473 10607 163750 -83770 55864 439268 98303 104596 -76885 129570
13262 173045 129954 89155 119163 98282 332375 215120 314439 257797 66516 -233604 -28063
13250 364189 251927 176351 -76569 194092 317092 226041 131970 236041 283900 -1699 -13163
13239 -13163 69818 164827 373490 207853 310732 271232 125749 29355 -78902 260087 64614
13227 227803 147897 137908 415512 -6808 268429 448629 -85854 114676 36439 451225 -87326
13215 117900 196641 -148868 428499 26371 35447 83967 -86263 -102710 497389 289917 -43692
13203 -157015 230863 352801 -472825 304424 242318 238143 256045 73002 -3176 373281 -83242
13191 -170936 169683 137677 -19352 145495 45274 388767 121623 595804 154452 43005
$$ packed form
13274C06130A39411K28062A0607J53143h3770E5864L83404I8303O293g6885A29570
13262A73045m3091m0799L0008k0881K34093j17255R9319n6642F6516b33604b8063
13250C64189j12262p5576g6569A94092J23000r1051r4071J04071M7859a699j1464
13239a3163F9818R5009K08663j65637J02879l9500A25749B9355g8902B60087F4614
13227B27803p9906r989K77604f808B68429J80200h5854A14676C6439M14786h7326
13215A17900P8741a48868D28499B6371R076M8520h6263j6447D97389k07472d3692
13203a57015B30863J21938d72825C04424o2106m175J7902G3002c176C73281h3242
13191a70936A69683l2006a9352A45495D5274L43493A21623M74181A54452D3005
$$ plain form
13180 136436 401914 142406 24099 151537 -87901 120451 220032 118192 -58607 274723
13169 341767 -18903 -14478 119292 180373 51367 -75544 90816 221660 95740 16473 -195081
13157 29061 141495 245040 99934 -17218 -223558 -63827 152099 362983 -119672 -183230
13147 -183230 14451 -273437 140035 258981 -106012 186594 207247 56555 226765 138931
13137 138931 169635 -269509 -190403 169045 202823 96908 73743 122541 382343 139622 263339
13126 263339 -118171 307330 -126682 144814 3075 -192049 62372 123451 72449 384256
13116 384256 40818 206987 94424 237093 -8003 -165308 144901 401938 -83082 145956
13105 19302 -79828 271399 -141669 -46682 294193 227231 -38217 -183069 -209143 295558 51626
$$ packed form
13180A36436K65478A42406B4099J27438h7901A20451R9581j01840e8607B74723
13169C41767a8903M425A19292O1081E1367g5544I0816J30844I5740A6473a95081
13157B9061J12434J03545I9934a7218k06340f3827A52099K10884a19672o3558
13147a83230A4451b73437A40035J18946a06012A86594K0653E6555J70210q7834
13137A38931L0704b69509P9106A69045L3778I6908k3165M8798K59802A39622J23717
13126B63339a18171C07330a26682A44814C075a92049F2372O1079n1002L11807
13116C84256D0818J66169I4424J42669h003j57305A44901K57037h3082A45956
13105A9302g9828B71399a41669d6682B94193o6962c8217j44852k6074B95558E1626
$$ plain form
13093 46110 241916 -27002 -108191 -21806 -297215 49199 1564 164642 151556 116478 291263
13082 291263 -106166 -69472 286038 140268 -215300 165910 139419 209177 164349 119166
13072 119166 93623 41704 -87981 12888 98135 501060 -146361 37904 -33334 -133726 29749
13060 59795 101781 -289809 263511 50040 144939 -59540 426075 -49004 455421 110893 63073
13049 63073 -131345 17703 113408 -54695 -34732 -20801 -10821 -66551 -171550 242688 164102
13038 164102 253825 -14343 334030 53382 284655 336382 -167358 156236 198519 46864 15696
13026 209094 50709 -243281 84566 186387 -19193 55088 98888 -46632 247156 97014 -38363
13014 221542 -124978 25139 166140 218175 -24538 132426 35037 8582 209675 389569 142468
$$ packed form
13093D6110J95806b7002q1189b1806k75409D9199A564J63078j3086l5078J74785
13082B91263a06166L6694B86038A40268b15300A65910k6491O9758m4828m5183
13072A19166k5543D1704h7981A2888Q5247M02925a46361C7904c3334j00392B9749
13060E9795M1986b89809B63511E0040R4899e9540D26075d9004D55421A10893m7820
13049F3073a31345A7703R5705e4695J9963J3931R980n5730j04999B42688p8586
13038A64102Q9723a4343C34030E3382K31273N1727a67358A56236M2283D6864A5696
13026B09094E0709b43281H4566J01821a9193E5088M3800d6632B47156I7014c8363
13014B21542a24978B5139J41001N2035b4538A32426C5037H582K01093J79894A42468
$$ plain form
13002 125935 195607 -76682 -157254 84028 -22174 222770 -96226 -75674 30566 47381 79336
12991 79336 -228727 142631 -287483 137836 10598 175117 85936 133162 -33454 273481
12980 38544 10781 50197 160515 301676 -97562 -22091 172854 -31826 6957 60164 18655
12968 -128932 20638 23076 238323 129041 199836 169635 120199 116707 124663 75515 105287 95361
12956 95361 -166359 37282 9355 29667 231771 -38432 39810 1337 97672 219942 -80191
12944 -19742 -201372 231552 48065 87016 284312 219422 -8619 414395 -24236 44806 73797
12933 73797 -10745 -44372 61352 4063 244541 -204998 -227117 233952 249399 -17490 -173788
12922 -173788 11395 -94373 -1617 35673 -68308 -107212 18342 100389 10084 332785 -219659
$$ packed form
13002A25935O9672g6682q0572H4028b2174B22770i6226K0552C0566J6815L1955
12991G9336b28727A42631b87483A37836A0598J64519H5936M7226c3454B73481
12980C8544A0781L9416J10318J41161i7562b2091A72854c1826F957N3207A8655
12968a28932B0638K438K15247j09282P0795l0201m9436l492P956m9148K9772r926
12956I5361a66359C7282I355K0312K02104c8432C9810A337R6335J22270h0191
12944a9742j81630B31552D8065L8951J97296o4890h619D14395b4236D4806K8991
12933G3797a0745l3627F1352D063K40478b04998k2119B33952J5447a7490j56298
12922a73788A1395i4373a617C5673f8308l8904A8342Q2047A0084L22701b19659
$$ plain form
12910 -202721 -100546 95570 -280432 118703 148432 302513 2007 218002 -47581 -279431
12900 -279431 -52208 -219148 -152442 -226232 141274 31445 244229 -85113 71436 -106131 163839
12888 139521 47244 93755 -274046 109479 -16744 99904 -36117 15590 -237403 -350786 20172
12876 144363 -40676 -59908 17950 103799 63563 150177 -111074 -18179 52670 87012 254825
12865 254825 96618 150908 -25245 242239 237611 -233811 -25284 -11076 -77581 180916 -141867
12853 -108619 3494 434466 316744 -239915 324561 75839 183126 214628 23028 -218936
12842 -56086 168285 187656 206900 267038 216662 -220929 49032 79467 437839 178657 -79262
12830 -86049 314702 -305238 -318218 233492 57097 -51313 143165 -227176 -55712 -101367 88555
$$ packed form
12910b02721a00546I5570b80432A18703K9729J54081B007K15995d7581k31850
12900b79431e2208j66940O6706p3790A41274C1445K12784h5113G1436a06131A63839
12888A39521D7244M6511b74046A09479a6744I9904c6117A5590b37403j13383B0172
12876A44363d0676j9232A7950Q5849m0236Q6614a11074a8179E2670L4342J67813
12865B54825I6618N4290b5245B42239m628b33811b5284a1076o6505A80916a41867
12853a08619C494M30972j17722b39915C24561G5839J07287L1502B3028b18936
12842e6086A68285J9371J9244O0138n0376b20929D9032L0435L58372A78657g9262
12830h6049C14702c05238j2980B33492E7097e1313A43165b27176e5712m5655H8555
$$ plain form
12818 252368 37569 301359 -234649 68552 111631 -77772 -34096 210201 83184 29130 109297
12807 109297 170965 -99761 207270 -401965 -57640 207422 -153677 -30113 27211 -160713
12796 120035 244758 -35276 190184 -72722 -68830 -83500 -43658 -307748 122934 -79111 -157327
12785 -157327 -61725 118824 -165122 -70254 23078 -103533 36253 76386 -51554 -3526 -238273
12774 -238273 -62892 359127 49174 334026 382669 -11154 -180416 -85351 9249 -49302 -100946
12763 -100946 -141183 -105524 185040 101822 270650 175273 -97571 189523 41563 4845 -116126
12751 -188094 -112616 -90610 159798 7992 -155858 -226930 194098 -54748 -213007 308954 -41628
12739 -183739 -42135 199178 197384 49827 73357 -39343 -178943 16264 43314 -1159 -71296
$$ packed form
12818B52368C7569K63790b34649F8552M3079g7772c4096B10201H3184B9130Q0167
12807A09297O1668i9761B07270d01965e7640B07422a53677c0113B7211a60713
12796A20035J24723c5276A90184g2722L892j4670L9842k64090A22934g9111p8216
12785a57327f1725A18824a65122g0254B3078a03533C6253M0133e1554c526k34747
12774b38273f2892C59127D9174K84852M8643a1154j69262h5351I249d9302n1644
12763a00946m0237L5659A85040q3218J68828r5377i7571A89523D1563D845a16126
12751a88094P5478K2006A59798G992a55858p1072A94098e4748j58259C08954d1628
12739a83739d2135A99178j794D9827K3530c9343j39600A6264K7050a159p0137
$$ plain form
12728 -71296 158661 -51200 -320187 -140798 308979 27360 -277629 -33384 78779 292977
12718 292977 306598 -102158 -102208 7255 199148 -105582 281658 161507 -278397 29418 63047
12707 63047 167610 -269853 88458 -172089 -86676 -385761 -13971 265 -102184 -22593 123470
12695 -70444 132545 44197 293143 -20091 213481 90915 18964 87914 249882 192603 174799
12684 174799 248565 173085 -79888 243848 27396 -86143 138379 -88976 189144 -113146 238346
12672 178487 -173367 297520 -330363 256850 193231 10456 -16467 229907 -144432 67913
12661 13173 -55601 131743 142983 62206 -130873 108869 -250241 -28745 -181330 -172415 131982
12649 35411 -41122 87519 -37942 -130775 80068 42377 43737 155890 -18817 172222 41737
$$ packed form
12728g1296A58661e1200k68987a40798C08979B7360b77629c3384G8779K14198
12718B92977J3621a02158n0G255J91893a05582B81658j20151b78397B9418L3629
12707F3047J04563b69853H8458a72089Q5413k99085a3971B65a02184b2593A23470
12695g0444A32545D4197K48946b0091B13481I0915A8964O8950J61968n7279j7804
12684A74799P3766p5480g9888B43848B7396h6143A38379h8976A89144a13146B38346
12672A78487a73367B97520c30363B56850o3619A0456a6467B29907a44432F7913
12661A3173e5601A31743J1240F2206a30873A08869b50241b8745j52585Q915A31982
12649C5411d1122H7519c7942r2833H0068l7691J360J12153a8817A72222D1737
$$ plain form
12637 -39185 -142994 -81954 123589 -243298 25285 323128 150154 187684 334770 -115374
12626 -151123 136673 91468 297498 134858 129352 39310 -74515 274218 234972 291185 -6609
12614 385954 117739 28705 289231 126921 -2880 155987 162019 136388 203829 331002 199664
12603 199664 95436 283626 -7485 199815 81293 -190631 217452 35184 53809 -44573 -46723
12592 -46723 -18888 101056 144473 67479 -251825 189309 299395 321211 89167 262342 -24186
12580 26795 -183042 136408 163431 108969 -103777 -28097 592364 -144182 -343787 -72214
12569 43341 83269 -212506 -86885 -526 166511 -206732 12958 62592 -7718 233520 -99850
12557 -125399 -322246 78162 216974 -115258 189855 -166038 279869 36047 107041 -254698
$$ packed form
12637c9185j03809O1040A23589b43298B5285K97843A50154L7530J47086a15374
12626a51123A36673m5205K06030A34858n506C9310g4515B74218l9246N6213f609
12614C85954A17739B8705K60526A26921b880A55987O032k5631O7441J27173j31338
12603A99664I5436J88190g485A99815H1293a90631B17452C5184J8625d4573k150
12592d6723a8888A01056M3417F7479b51825A89309J10086K1816H9167J73175b4186
12580B6795a83042A36408K7023n4462a03777b8097E92364a44182j99605g2214
12569D3341L9928b12506h6885e26A66511b06732A2958M9634g718B33520i9850
12557a25399j96847G8162J38812a15258A89855a66038B79869C6047P0994b54698
$$ plain form
12546 73545 -302241 -188495 61232 85755 -91673 262783 -62083 -236200 451000 174566
12535 90109 900 126947 283333 225150 -210514 23514 134355 85912 -415415 -258072 -116763
12523 25313 -319414 306696 -1908 -29544 -69884 -18186 193904 -49396 10769 56173 193000
12512 193000 105966 199514 131398 379354 -40451 529261 26560 -27040 -236743 167550 153335
12501 153335 170568 -16862 104357 16064 -3465 -64043 209395 203770 462400 -351091 154076
12489 -64820 29398 -154828 -50202 -133034 69091 55147 -163243 336670 14135 121180 -151670
12477 34949 65522 -39158 82265 40377 72117 -62614 -84793 -19415 -61376 -69506 61954 342928
12465 342928 -91841 -231278 -215205 38840 101115 208469 -59138 -320572 -136951 195761
$$ packed form
12546G3545c02241J13746F1232K4523i1673B62783f2083j74117D51000A74566
12535I0109I00J26047J56386n8183b10514B3514J10841m8443d15415J57343a16763
12523B5313c19414C06696a908k7636m0340a8186A93904d9396A0769M5404J36827
12512A93000q7034R3548o8116K47956d0451E29261B6560b7040k09703A67550j4215
12501A53335J7233a6862A04357A6064c465o0578B09395n625K58630c51091A54076
12489f4820B9398a54828e0202q2832F9091j3944a63243C36670A4135J07045a51670
12477C4949L0573c9158H2265D0377L1740f2614k2179a9415m1961q130F1954K80974
12465C42928i1841j39437J6073C8840O2275J07354e9138k61434a36951A95761
$$ plain form
12454 169356 -89498 80666 -296533 171266 48038 -87041 205610 -40283 111907 -82149 -222666
12443 -222666 167568 136147 -121655 251819 -52001 -17612 -1527 33482 -131097 -357944 139604
12431 85200 -305930 -191797 17823 -37809 -89166 135549 32950 264770 228931 159329 -94979
12419 -114254 239417 96537 -133391 -198840 -105519 -86081 152466 -340114 192417 -11551
12408 -50624 167521 -241105 79325 188517 -189208 -39655 -361500 334894 -166115 -133113
12398 -133113 186907 81565 -221326 66203 238764 1233 -147122 149817 16193 -134653
12387 170143 -63742 138903 -74435 89301 352087 -313226 100716 -25209 -219643 -29677
12376 260621 -97683 -93335 -441059 109483 -296149 175545 108142 44283 189456 142033 6468
$$ packed form
12454A69356h9498H0666b96533A71266D8038h7041B05610d0283A11907h2149j40517
12443b22666A67568l1421a21655B51819e2001a7612a527C3482a31097k26847A39604
12431H5200c05930J14133A7823c7809n1357A35549C2950K31820l5839o9602i4979
12419a14254B39417I6537a33391o5449R3321J9438A52466c40114A92417a1551
12408e0624A67521b41105G9325J09192a89208c9655l21845C34894a66115L3002
12398a33113A86907H1565b21326F6203J72561A233a47122A49817A6193a34653
12387A70143f3742A38903g4435H9301K62786c13226A00716b5209j94434b9677
12376B60621i7683M348l47724A09483b96149A75545o7403D4283J45173m7423F468
$$ plain form
12364 314332 -44643 37763 333188 -59442 108567 59204 -609964 66519 -246571 -140511
12354 -140511 -85195 133569 -348660 253628 44948 -177067 17978 249504 -104714 -120833
12344 -120833 20390 -346836 -13387 -196717 214186 144776 87446 -82023 -88655 -76995 -109214
12333 -109214 157262 -334814 -63281 -213430 13963 18163 -231 -186079 26125 30509 41181
12322 41181 166041 -58814 285642 183922 96795 -79548 227519 64726 -17307 363079 -60769
12310 85065 455165 36151 -185389 153806 136000 261370 49833 163111 214092 29605 -139910
12298 194734 -120999 -134696 105399 252446 146363 -242749 16694 167801 22304 95150
12288 95150 -115152 76165 -114345 -206644 14482 -155590 -303448 -264729 -232722 79107 214242
$$ packed form
12364C14332d4643C7763K95425e9442A08567m9363f09964F6519b46571J06060
12354a40511N5316A33569c48660B53628D4948a77067A7978K31526a04714j6119
12344a20833B0390c46836a3387j83330B14186o9410n7330h2023o632J1660l2219
12333a09214A57262c34814f3281j50149A3963M200b31j85848B6125M384J0672
12322D1181J24860e8814B85642j01720q7127g9548B27519F4726a7307C63079f0769
12310H5065L70100C6151a85389A53806j7806J25370D9833J13278N0981B9605a39910
12298A94734a20999j3697A05399J47047j06083b42749A6694J51107B2304P2846
12288I5150a15152G6165a14345r2299A4482a55590j47858L8719L2007G9107J35135
$$ plain form
12277 214242 -343433 -13649 -405222 116267 -79806 -20318 162998 255340 -60164 6033 -42859
12265 -262278 182245 -207966 -8994 276432 23180 284331 187618 203459 155275 -52755 149056
12253 -73345 -142315 -53569 -119256 100714 7690 78620 -378802 -317393 -42149 -32726 -22099 51555
12240 -237028 167204 40721 191977 -41793 -217291 -123438 -104108 -179564 185416 -49710 -174826
12229 -174826 48799 -142941 133295 46995 39936 -40029 -164497 218372 -6302 105526 298314
12218 298314 72603 124683 316551 101229 281273 63600 1302 478421 -174733 188955
12207 219690 86040 525712 123132 350129 -13584 -119664 537246 61028 148805 -70681
12196 227270 148380 180291 60743 92008 214305 57807 347789 323294 264971 23044 407828
$$ packed form
12277B14242c43433a3649l91573A16267g9806b0318A62998R2342f0164F033d2859
12265b62278A82245b07966h994B76432B3180K61151r6713J5841m8184e2755A49056
12253g3345o8970e3569o5687A00714G690P0930c78802O1409d2149R423J0627E1555
12240b37028A67204D0721J51256d1793j75498R3853J9330p5456A85416d9710j25116
12229a74826D8799a42941A33295D6995p059d0029j24468B18372f302A05526J92788
12218B98314G2603N2080J91868A01229J80044F3600A302M77119a74733A88955
12207B19690H6040M39672A23132K26997a3584j06080E37246F1028Q7777g0681
12196B27270p8890L1911F0743L1265J22297E7807K89982k4495n8323B3044L84784
$$ plain form
12185 407828 -29017 296191 415762 82806 356548 351651 433776 257840 14925 441849 10510
12173 126206 178021 299239 460699 159959 118043 365326 74875 317031 -245821 243479
12162 262675 -223997 -160086 87038 100875 297895 -123734 427598 -303237 -186619 -65928
12151 -75948 73295 138425 132818 175880 278515 134910 100143 190095 147654 -72885 148593
12139 -81745 161478 310098 -226845 -137399 138764 130176 -22134 187955 315037 -45734 158392
12127 113696 -166803 -167794 73350 27403 -806 11493 -16559 244241 68306 448961 243288
12116 243288 -55502 116826 100392 -53166 -110134 -59575 166970 395888 -193430 175134
12105 -10453 9294 84648 -54136 63812 33156 -122253 -236161 -213774 -75697 44411 290805
$$ packed form
12185D07828b9017B96191J19571H2806K73742m897Q2125j75936A4925M26924A0510
12173A26206N1815J21218J61460A59959m1916K47283G4875K42156b45821B43479
12162B62675b23997O3911H7038J3837J97020a23734D27598c03237J16618f5928
12151g5948G3295O5130n607M3062J02635A34910l4767Q9952m2441g2885A48593
12139h1745A61478J48620b26845Q9446A38764q588b2134A87955J27082d5734A58392
12127A13696a66803r91G3350B7403h06A1493a6559B44241F8306L80655k05673
12116B43288e5502A16826j6434e3166n6968N0559A66970K28918a93430A75134
12105a0453I294P5354e4136F3812l0656a22253j13908K2387g5697D4411K46394
$$ plain form
12094 290805 9156 -62046 -124628 126979 135441 589105 -154000 -107042 3383 98829 142119
12083 142119 -175240 -315293 -370877 157045 -139626 -234219 172825 26402 108666 211145
12073 211145 -22624 -227633 -167738 50652 114315 -114220 -47087 -127209 55700 371160 -66671
12061 360296 -11988 541506 862726 759007 745671 86704 354735 -234125 -21961 130196
12050 185503 51254 -36112 -96106 110859 72056 40294 -4708 188590 197269 27056 -93901
12038 -162887 209104 103282 114310 -151484 -253798 -375468 136979 -291806 -255429 208167
12027 -65024 230824 80413 43535 -33872 -318432 152202 7840 -91900 -442920 -90153 -6753
12015 -21343 72884 -260284 -22421 288975 -256092 284768 -96359 192939 32218 165143
$$ packed form
12094B90805I156f2046o2582A26979Q462M53664a54000M6958C383R5446M3290
12083A42119a75240j40053n5584A57045a39626r4593A72825B6402Q2264J02479
12073B11145b2624k05009N9895E0652O3663a14220d7087q0122E5700L15460f6671
12061C60296a1988E41506L21220j03719j3336H6704K68031b34125b1961A30196
12050A85503E1254c6112n9994A10859l8803l1762d708A88590Q679B7056i3901
12038a62887B09104A03282J1028a51484j02314j21670A36979b91806L6377B08167
12027f5024B30824H0413l6878c3872k84560A52202G840i1900l51020i0153f753
12015b1343G2884b60284b2421B88975b56092B84768i6359A92939C2218J32925
$$ plain form
12005 165143 -15870 100528 113836 -5790 -199519 29595 -109593 -242692 -8571 -46636 -90454
11994 -90454 -21299 -221598 245302 -305680 -153771 211349 67747 -194587 169016 -327103
11983 241767 -305909 259934 -58890 -186591 214620 -260963 -97648 -264986 34094 -186870
11972 -399801 -6323 5688 -65013 -274818 -88595 -306566 -252404 36253 -209484 3868 -224849
11960 -205401 -281699 -256376 173360 149898 -114974 99217 30807 -110367 185884 -88447 126380
11948 -102341 -75687 -233590 -310496 -88535 -201314 13111 37908 -61274 -232324 -150576 -195048
11937 -195048 -154238 -79203 -280886 109322 16967 238727 -82159 2125 -90963 -181590 205754
11925 49296 73245 -138401 263765 -50015 -173309 303710 -175143 -207374 40787 -196119
$$ packed form
12005A65143a5870A00528J3308e790j93729B9595a09593j33099h571l8065m3818
11994i0454b1299k00299B45302c05680J51909B11349F7747a94587A69016c27103
11983B41767c05909B59934e8890j27701B14620b60963i7648j67338C4094a86870
11972c99801f323E688f5013k09805h8595k17971N4162C6253b09484C868b24849
11960b05401p6298K5323A73360k3462a14974I9217C0807a10367A85884h8447A26380
11948a02341K6654j57903p6906h8535j12779A3111K4797f1274j71050Q1748m4472
11937a95048M0810P5035k01683A09322A6967K21760h2159B125i0963r0627B05754
11925D9296K3949a38401B63765e0015j23294C03710a75143l2231D0787a96119
$$ plain form
11914 -51387 -117887 -36734 294711 160424 101393 -104930 91446 92509 2963 -30443 -260014
11903 -260014 -198391 -9784 -11015 373147 -138341 263126 -176341 -19822 6679 439451 212468
11891 -121026 -11265 -68726 302371 24760 183132 156194 -20028 -356809 142440 -184666
11880 118046 -313220 -50544 85573 -64743 -394874 -90517 -43131 22417 317148 -69024 -272342
11869 -272342 16788 -135490 117987 -34648 255496 115149 81058 74248 247749 151820 193703
11858 193703 -158516 -105302 -132351 27043 -170293 270724 -558 -278747 -17779 -387340 291491
11846 -63804 75194 126078 146704 -282933 -322486 -49876 1250 206333 -41434 65000 -97942
11834 -6034 -103602 -37670 13946 -84329 -54853 139332 33177 -213241 -150321 -56006 -2313 -99272
$$ packed form
11914e1387o6500c6734B94711j34287n9031a04930I1446J063B963c0443k29571
11903b60014O1623i784j231C73147a38341B63126a76341a9822F679M32772B12468
11891a21026a1265n7461C02371B4760J58372k6938b0028l36781A42440a84666
11880A18046c13220e0544H5573f4743l30131i0517d3131B2417K94731f9024k03318
11869b72342A6788a35490A17987c4648B55496A15149l4091o810J73501r5929M1883
11858A93703a58516N3214k7049B7043a70293B70724e58k78189a7779l69561B91491
11846f3804G5194N0884K0626b82933l9553d9876A250K05083d1434F5000i7942
11834f034r7568c7670A3946h4329K9476A39332C3177b13241O2920e6006b313r6959
$$ plain form
11822 -99272 101034 359892 -113812 -91370 -15363 315110 -420630 -188881 -72358 31083
11811 68014 -90478 84367 22693 205359 288741 -103044 -124923 4928 -213294 157414 -91337
11799 -280200 -82821 15329 -115154 69359 -187560 15034 -244504 33268 315953 -12034 -89966
11788 -89966 -79250 -74407 -168934 -138301 -14199 50244 -267869 222393 202307 208468 -21910 -237637
11776 -237637 -308039 -62259 -68758 -40694 264215 -214818 26271 -82534 -1577 133713 -91111
11764 -173755 -271491 -271554 86548 -15350 306063 172992 -235260 -189586 -280424 -142202 285584
11752 120519 343219 -372482 -171230 -297774 -117813 -79914 43179 114767 -102128 256501
11741 77959 182456 14514 -59727 -105200 23782 91072 -340944 -154233 -101458 404022 -219353
$$ packed form
11822i9272A01034K58858a13812K2442a5363C15110d20630a88881g2358C1083
11811F8014i0478H4367B2693J82666Q3382a03044k1879D928b13294A57414i1337
11799b80200h2821A5329a15154F9359a87560A5034b44504C3268K82685a2034p7932
11788h9966J0716M843r4527L0633a4199E0244b67869B22393k0086O161b1910k15727
11776b37637p0402f2259o499K8064B64215b14818B6271h2534a577A33713i1111
11764a73755r7736o3H6548a5350C06063j33071b35260M5674r0838J38222B85584
11752A20519K22700c72482a71230j26544a17813L7899D3179P1588a02128B56501
11741G7959J04497A4514e9727m5473B3782O7290c40944a54233N2775D04022b19353
$$ plain form
11729 4949 22490 -234322 21836 70719 -241651 88356 -238322 39135 79534 -523884 125735
11717 75037 -19037 -101423 21440 -269108 -148225 -182028 -108692 -506779 215847 -237063 -55571
11705 9613 -3234 -304047 143406 236873 -221645 294802 -185653 -167217 249979 74172 -256929
11693 -75283 -74574 -17619 -82163 46603 -154840 -122225 348697 109862 -176839 -133580 -36682
11681 -37525 -33426 120555 65340 12098 127115 -12479 -22124 15749 69986 292014 -251113
11669 32814 -219708 127978 -10404 -123861 467622 30731 -31941 209175 -9883 191754 -74980
11657 11534 6850 92851 121680 80780 -102730 -315530 -126144 242510 -84826 118621 -75385
11645 136074 24177 -96011 -314939 27245 130823 -337134 -104687 -224593 20916 59483
$$ packed form
11729D949J7541b34322B1836M8883b41651H8356b38322C9135M0399e23884A25735
11717G5037a9037q2386B1440b69108J20883l3803P3336l98087B15847b37063e5571
11705I613c234l00813A43406R3467b21645B94802a85653J8436B49979G4172b56929
11693g5283P09a7619o4544D6603a54840L2615C48697A09862a76839M3259c6682
11681c7525M099A20555n5215A2098J15017a2479r645A5749N4237K22028b51113
11669C2814b19708A27978a0404j13457D67622C0731c1941B09175i883A91754g4980
11657A1534m684Q6001K8829m0900a02730k12800a26144B42510h4826A18621g5385
11645A36074B4177i6011k18928B7245J03578c37134a04687j19906B0916L8567
$$ plain form
11635 59483 446384 -237488 32627 43233 192683 -18296 140111 -36393 -63249 -150640 -1635
11623 94875 -145729 132102 -434884 -94664 136445 39242 -158075 -103321 -117264 374780
11612 51905 81178 52632 -154346 160782 103818 -28691 -44272 25439 -41418 -108575 45402
11600 -105758 -30543 -248311 -92097 -166836 -69398 -181990 129283 127341 -190771 -64033 -177314
11589 -177314 160595 -254031 80346 -74416 -203495 57611 -90821 339027 -12478 -348897
11579 -348897 75226 212983 -53899 170331 87615 -327001 153639 -166908 103849 -34874
11568 78561 -33265 286300 -23567 163451 174402 97689 296232 301896 119590 -84037 -78397
11557 -78397 272658 -17386 -174808 -57331 137335 35364 -137002 -105823 241691 -198993
$$ packed form
11635E9483L86901b37488C2627J0606J49450a8296A40111c6393k6856q7391a635
11623I4875a45729A32102d34884i4664A36445C9242a58075N4754j3943C74780
11612E1905K9273k8546a54346A60782n6964b8691j5581B5439d1418o7157D5402
11600a05758c0543k17768i2097p4739f9398j12592A29283j942a90771f4033j13281
11589a77314A60595b54031H0346g4416j29079E7611i0821C39027a2478l36419
11579c48897G5226J37757e3899A70331q2716c27001A53639a66908A03849c4874
11568G8561c3265B86300b3567A63451J0951p6713J98543N664A19590h4037N640
11557g8397B72658a7386j57422e7331A37335C5364a37002L1179B41691a98993
$$ plain form
11546 104506 197865 -181221 -300169 -103421 -90446 55015 347363 186456 -90355 -3223 82515
11534 -64759 -10677 253572 27954 49753 -226099 -81982 222733 251667 6969 121899 58529
11522 74913 86220 -198956 12985 1478 -10667 -84539 -27289 201596 214356 -31149 375039
11510 74824 -133889 87708 92871 -162764 3225 281275 18137 109333 167031 267182 235880
11499 235880 60690 -57732 172103 -57764 -32761 17807 145540 65662 203122 -4346 249194
11487 175016 -10095 14896 149298 253885 -110756 448027 78946 166473 55541 -9164 195476
11475 193621 110919 147763 -78680 67248 -10506 250480 66484 166722 213424 -712 -105571
11464 -105571 91425 295504 70102 276155 -94542 394321 -94487 95080 361053 428621 5378
$$ packed form
11546A04506R3359a81221j18948a03421J2975E5015K92348j60907i0355c223H2515
11534f4759a0677B53572B7954K1799b26099h1982B22733K8934F969J14930E8529
11522G4913J1307a98956A2985A478a0667p3872b7289B01596J2760c1149C75039
11510G4824a33889H7708N163a62764C225K78050A8137R1196N7698J00151l1302
11499B35880F0690e7732A72103e7764K5003A7807J27733F5662J37460d346B49194
11487A75016a0095A4896J34402J04587a10756D48027G8946Q7527E5541i164A95476
11475A93621q2702L6844g8680F7248a0506B50480F6484J00238M6702g12j04859
11464a05571I1425K04079G0102K06053i4542C94321i4487I5080K65973O7568E378
$$ plain form
11452 69046 29461 -162526 115075 266744 406095 86051 78987 131104 77284 222648 -112341
11440 -161097 99283 59373 74341 -11757 194991 102433 151501 -146688 75786 326210 -196636
11428 41051 -104010 223381 132258 10003 112603 -21137 22929 -56783 57071 176075 -65197
11416 231674 -34820 -61968 115316 55187 -10267 107259 39759 271725 124587 12626 -207711
11404 52200 -144859 -188982 -250670 139633 55763 -33133 138585 -225488 20914 223285 290586
11393 290586 -184058 70204 -124169 -261228 -86861 -247875 109038 -89583 21314 133445
11383 133445 142643 78138 -184285 49032 114770 239133 358484 -51574 -11458 133226 -76213
11371 258006 90441 -40163 48545 181727 -75185 131796 54056 133890 301331 -108231 -165192
$$ packed form
11452F9046B9461a62526A15075J51669J39351H6051p064N2117n3820J45364a12341
11440a61097I9283l9910J4968a1757A94991r2558M9068a46688G5786K50424a96636
11428D1051a04010B23381r1123A0003J02600b1137B2929e6783E7071J19004f5197
11416B31674c4820k7148A15316E5187a0267A07259C9759K31966A24587A2626b07711
11404E2200a44859m4123o1688A39633E5763c3133A38585b25488B0914K02371O7301
11393B90586a84058G0204a24169j37059h6861j61014A09038h9583B1314J12131
11383A33445R198o4505a84285D9032O5738J24363J19351e1574a1458A33226g6213
11371B58006I0441d0163D8545J33182g5185A31796E4056P9834J67441a08231n6961
$$ plain form
11360 -165192 -212493 147947 -169204 -129595 -1907 75886 34200 -82937 112092 251470 -75008
11348 -261806 120854 160713 75340 -311574 117475 -186030 -137528 91280 -329652 116389
11337 -216938 45730 34528 -89051 -221868 -18439 -70902 312901 -2128 -123871 -281812 69332
11325 214893 -103376 512 -35806 -127558 -169533 -312823 120919 -52872 -67219 116745 -166277
11313 44395 -137374 -61414 299269 -208763 -66061 110597 324263 -68512 -2432 -96315 -49437
11302 -49437 -51755 -168523 -3829 47413 350355 2557 -77957 354063 136099 -103887 79015
11290 39908 20558 -105966 -269187 -318597 -97881 60328 44331 -110719 -257147 -164266 36010
11278 -134113 148935 212303 -130468 -284181 22001 -111665 37673 24503 20893 -553275 -428811
$$ packed form
11360a65192m7301A47947a69204L9609a907G5886C4200h2937A12092J39378g5008
11348b61806A20854L9859G5340c11574A17475a86030M8502I1280c29652A16389
11337b16938D5730j1202h9051j32817a8439n2463C12901b128j21743j57941F9332
11325B14893a03376E12c5806r1752m1975j43290A20919e2872j4347A16745a66277
11313D4395a37374f1414B99269b08763f6061A10597K13666f8512b432r3883M6878
11302d9437k318j16768c829D7413L02942B557g7957C54063A36099a03887G9015
11290C9908j9350a05966j63221m9410i7881F0328j5997a10719j46428R2881C6010
11278a34113A48935O3368a30468j53713B2001a11665C7673j3170l610e53275J24464
$$ plain form
11267 -428811 -126142 41269 190075 -47514 50306 -61999 173250 41077 -197988 74512 52026
11256 52026 -45034 -238841 -196146 -38000 97238 -149290 -61094 387856 230636 -39599 -57444
11245 -57444 -7691 -214960 -203851 -136266 -258564 -132867 157957 120080 53231 281557 -185251
11233 46418 -162123 89663 -274756 -370312 -82415 190506 -195866 86924 156874 -179354 -52326
11221 -53769 165676 113915 119398 40059 66702 -12866 21998 156670 103498 -116357 -242357
11210 -242357 215245 42445 -286231 74199 25307 -325116 -374031 -99688 188033 -32458 -362041
11199 -362041 -157046 -276519 102817 -126831 -143100 -196336 -296348 -21597 -156924 103458
11188 143219 82243 -133270 -111286 -154140 -42070 -255424 70509 204561 74144 57277 -24611
$$ packed form
11267d28811a26142D1269J48806d7514E0306f1999A73250D1077a97988G4512k2486
11256E2026d5034j93807M2695c8000I7238a49290f1094C87856j57220c9599j7845
11245e7444g691k07269J1109O7585j22298J25697A57957l7877E3231K28326a85251
11233D6418a62123H9663b74756r5556h2415A90506a95866H6924O9950a79354e2326
11221e3769A65676n1761N483D0059K6643a2866B1998J34672n3172a16357j26000
11210b42357B15245D2445b86231G4199B5307c25116m8915i9688A88033c2458l29583
11199c62041a57046j19473A02817a26831j6269n3236j00012b1597j35327A03458
11188A43219o0976a33270K1984m2854d2070k13354G0509J34052G4144j6867b4611
$$ plain form
11176 -181490 65760 -35806 196651 88822 -104036 -118196 -134823 -156343 -318715 -225397 -335648
11165 -335648 -82663 -415961 -141032 214383 10024 -13131 170551 -172441 -103342 -396269
11155 -396269 -103391 302170 331792 32924 41994 155782 -73342 52186 -165847 -155317 39570
11143 83344 -73204 325647 -31228 13287 -48780 -114671 54706 336131 -50961 -178135 229198
11131 230240 -42312 100654 -268229 -22884 -100764 44442 -191167 -161123 119589 -312 75479
11119 4976 69354 -8288 37412 9742 340941 455072 -153918 61741 267046 111251 154982
11108 154982 149566 22296 127523 65953 253922 -94233 -218502 192018 189149 19045 30625
11097 30625 140672 -215781 101597 106906 66948 69145 35744 584514 290129 58162 138790
$$ packed form
11176a81490F5760c5806A96651H8822a04036j4160j6627k1520j62372R3318j10251
11165c35648h2663l33298a41032B14383A0024a3131A70551a72441O9099k92927
11155c96269a03391C02170K9622C2924R070J13788g3342E2186a65847J0530C9570
11143H3344g3204C25647c1228A3287d8780o5891E4706K81425e0961j27174B29198
11131B30240d2312A00654b68229b2884p7880D4442a91167L0044A19589c12G5479
11119D976O4378h288C7412I742L31199J14131a53918F1741K05305A11251M3731
11108A54982n416B2296J05227o1570J87969i4233j24269A92018k869A9045J1580
11097C0625J10047b15781A01597N309l9958K197l3401N48770B90129E8162Q0628
$$ plain form
11086 138790 79557 -9763 157185 39711 161074 63572 -66805 407848 451752 223581 31457
11074 -100109 195220 -72825 156445 379132 11701 63907 445525 383343 177134 84123
11063 126943 175783 116545 46006 315945 305685 420955 321056 337833 281755 104364 478641
11052 478641 390839 396375 284997 252698 417228 493045 895702 524049 492596 135892 703329
11041 703329 421973 483757 689507 780790 545242 639787 669100 662508 873242 881756 877158
11030 877158 915927 787390 644621 552475 681958 409088 1040358 577631 690959 866156
11020 866156 690476 858818 1114117 489259 697960 988094 647093 609321 647214 766732
11010 766732 778045 875298 765071 818811 567306 743742 837754 270143 238414 528614
$$ packed form
11086A38790n9233i763A57185C9711J21363F3572f6805D07848M3904B23581C1457
11074a00109A95220g2825A56445K22687A1701N2206L81618o2182A77134H4123
11063A26943M8840n9238D6006K69939j0260J15270r9899J6777n6078A04364L74277
11052D78641q7802N536j11378l2299J64530P5817M02657l71653l1453A35892N67437
11041G03329k81356O1784K05750R1283k35548R4545K9313o592K10734Q514m598
11030H77158L8769j28537j42769r2146J29483k72870O31270m62727J13328J75197
11020H66156j75680J68342K55299D89259K08701K90134l41001l7772L7893J19518
11010G66732J1313R7253j10227N3740k51505J76436R4012B70143l1729K90200
$$ plain form
11000 528614 463065 564001 569704 400166 475102 359705 396381 545778 674110 223549
10989 869703 627636 916126 457168 625418 473074 661301 458911 597372 590695 651184
10979 651184 490625 789221 842010 711881 696457 874934 781794 713108 1242062 777610
10969 777610 811826 1096226 1152120 1107265 1249030 1517308 1455724 1547063 1861928 2047747
10959 2047747 2106858 2335296 2867238 2616123 2936028 2803155 2655656 2493398 2345142 1955473
10949 1955473 1726265 1634927 1777647 1346615 1341701 1282814 1357681 1433598 1096615 1265586
10939 1265586 1137152 1131591 1164307 589790 792109 900479 717393 400125 91854 547990
10929 547990 199293 223531 478191 91478 136861 163756 -90480 73806 -95909 206938 201357
$$ packed form
11000E28614o5549J00936N703j69538P4936j15397L6676J49397J28332B23549
10989H69703k42067K88490D57168J68250j52344J88227k02390J38461o677O0489
10979F51184j60559K98596N2789j30129j5424J78477r3140o8686N28954m64452
10969G77610L4216K84400N5894m4855J41765K68278o1584R1339L14865J85819
10959B047747N9111K28438N31942k51115L19905j32873j47499j62258j48256l89669
10949A955473k29208r1338J42720m31032m914n8887P4867P5917l36983J68971
10939A265586j28434n561L2716n74517K02319J08370j83086l17268I1854M56136
10929E47990A99293K4238K54660I1478M5383K6895i0480G3806i5909B06938n581
$$ plain form
10918 201357 165707 16375 120686 -94991 21954 96678 -90859 262499 69323 219421 271605
10907 271605 -111116 -38056 73647 406656 18904 334031 -102676 62811 -260754 -108655
10896 -200634 -241107 130439 176712 199099 89647 -150627 -18309 291476 -334183 -182904
10886 -182904 -101011 166434 -300943 -206459 -9267 -89795 87841 -170794 -213450 -144903 -79480
10875 -79480 217827 6768 103180 128389 -89863 -50590 -5012 22882 37071 -89096 -267079 326747
10862 -51899 121021 -85854 -3408 128415 100938 264850 -129561 111804 -39749 126998 137988
10851 137988 -75958 162967 -334693 -3196 -127627 37508 -299527 215637 50013 17699 -259867
10839 -184323 182909 114476 -76625 -104586 -366280 -106234 -136382 -29754 23689 119370 79032
$$ packed form
10918B01357l5650A6375J04311i4991B1954P4724i0859B62499F9323J50098N2184
10907B71605a11116c8056G3647L33009A8904L15127a02676F2811b60754a08655
10896b00634m0473A30439M6273K2387H9647a50627a8309B91476c34183J51279
10886a82904Q1893A66434c00943R4484i267q0528H7841a70794m2656O8547O5423
10875g9480B17827F768R6412K5209h9863L9273e012B2882J4189h9096j77983C26747
10862e1899A21021h5854c408A28415k7477J63912a29561A11804c9749A26998J0990
10851A37988g5958A62967c34693c196j24431C7508b99527B15637E0013A7699b59867
10839a84323A82909o8433g6625k7961k61694a06234l0148b9754B3689R5681m0338
$$ plain form
10828 79032 120058 176793 -55727 -44843 207730 -42064 352727 209846 -125810 45205 -236565
10816 -332588 -367135 -17646 -332574 -98616 -153952 -404195 -4095 -227759 225090 211196 274039
10805 274039 -234629 5464 963 281522 589842 -266095 -181400 -220840 74227 88660 179063
10794 179063 318764 48924 -129859 35009 -38038 -134107 -42101 64846 -71460 209017 -281444
10782 32888 59813 -36607 -264011 80436 -354625 290162 193054 -74676 -128838 -96434 -458258
10771 -458258 -99652 -109200 105974 -271305 -39611 -138613 11967 -215740 -190243 -60339 -167603
10760 -167603 -59693 163515 353356 -34807 -382097 -75170 -137342 201558 28739 123490 7455
10748 17474 -131031 -106519 -343856 181098 -144911 121563 1282 986 -115694 -78317 -11724
$$ packed form
10828G9032M1026N6735e5727J0884B07730d2064C52727j42881a25810D5205b36565
10816c32588l4547a7646l14928i8616n5336k50243d095k23664B25090j3894O2843
10805B74039b34629E464I63K80559L08320b66095Q4695l9440G4227J4433R0403
10794A79063J39701D8924a29859C5009c8038r6069d2101F4846g1460B09017b81444
10782C2888K6925c6607k27404H0436c54625B90162r7108g4676n4162L2404l61824
10771d58258i9652r548A05974b71305c9611r9002A1967b15740K5497f0339j07264
10760a67603e9693A63515J89841c4807l47290g5170o2172B01558B8739R4751G455
10748A7474a31031K4512k37337A81098a44911A21563A282k96a15694L7377a1724
$$ plain form
10736 -321271 -12910 -26182 139888 169494 -182545 125444 -119701 243196 -1759 183090
10725 -48211 281888 178094 -112344 -9359 -187985 147391 171512 -11726 -119292 -119276 88794
10713 147938 -330128 -61268 -10656 -176270 -51231 281256 26864 -46018 -167335 254033
10702 -145669 314335 -389543 53829 1399 3854 -436911 -142582 -292245 -40050 143343 23378
10690 -397233 129934 -189808 -56560 90997 -412863 -350544 -251758 52323 19160 47455 2217
10678 25585 -252312 -106496 -93958 248026 181318 -31021 354553 128150 -99068 -43136 -143937
10667 -143937 58747 93920 112369 -117790 29386 -172884 -10089 -67609 -178365 52407 19918
10655 -345222 -83286 181715 -68563 -160906 -14396 -46266 38290 -73737 219736 -186105 110315
$$ packed form
10736c21271a2910j3272A39888K9606a82545A25444a19701B43196a759A83090
10725d8211B81888j03794a12344i359j78626A47391K4121a1726j07566J6H8794
10713A47938c30128f1268a0656j65614e1231B81256B6864d6018j21317B54033
10702a45669C14335c89543E3829A399K455d36911a42582j49663d0050A43343B3378
10690c97233A29934a89808e6560I0997d12863O2319R8786E2323A9160K8295B217
10678B5585b52312a06496J2538B48026o6708c1021C54553A28150i9068d3136j00801
10667a43937E8747L5173J8449a17790B9386a72884a0089n7520j10756E2407A9918
10655c45222h3286A81715f8563r2343a4396l1870C8290g3737B19736a86105A10315
$$ plain form
10643 -293706 -177300 -188396 -33980 -189688 -75372 -109777 10848 -21928 -96331 -161406 -296929
10632 -296929 -111718 -145687 323764 -157842 -18220 266105 -81295 268952 -83559 340152
10621 -38419 9584 -117417 -147333 -276835 -72339 -325464 228551 -338795 90384 -294360 110592
10609 -6108 152523 285132 -94294 -95554 72282 358102 -129708 -52838 -288516 -126360 -63056
10597 -104369 -81636 -280316 108781 -40685 -213445 -202 167933 -37346 95930 -62955 -251854
10586 -251854 226288 -189873 -89604 -201406 -135609 -486360 120051 -75388 -115536 -83491
10576 -83491 77523 -35275 -199970 17470 370939 -124967 -54961 77061 -12267 6505 -296240
10564 60043 -115664 184395 123930 -66411 -36633 273077 -175294 183243 -145602 518642
$$ packed form
10643b93706J16406j1096c3980j55708g5372l4405A0848b1928p4403o5075j35523
10632b96929a11718l3969C23764a57842a8220B66105h1295B68952h3559C40152
10621c8419I584a17417k9916j29502g2339k53125B28551c38795I0384b94360A10592
10609f108A52523J32609i4294j260G2282K85820a29708e2838k35678a26360f3056
10597a04369K2733j98680A08781d0685j72760b02A67933c7346I5930f2955j88899
10586b51854B26288a89873h9604j11802O5797l50751A20051g5388m0148L2045
10576h3491G7523c5275j64695A7470L53469a24967e4961G7061a2267F505b96240
10564F0043a15664A84395o0465f6411K9778B73077a75294A83243a45602E18642
$$ plain form
10553 -152779 202955 179412 21167 -159613 25983 266847 -35744 44600 -203615 -179838 156533
10541 9418 -258396 253259 138965 -322848 -272491 96119 -47499 34340 90416 -136024 -109553
10530 -109553 -200965 -267406 136533 2651 45359 -107725 253804 -21868 81353 -4813 -6441
10519 -6441 40647 -362030 -262954 -3857 -125382 -211231 -61484 239972 -119831 298855 -314900
10507 -347757 -202612 180298 -128725 -26803 74253 -408671 51590 -159677 57158 -147226
10496 259033 25908 -241162 -10977 -274180 4708 91696 -190165 -107681 -71905 33748 83358
10485 83358 69378 63339 48005 -281210 -31081 -141882 234377 283714 -169241 145338 89210
10474 89210 -30324 -225905 357030 -255635 -240254 -288479 -76500 207342 44024 30342 373532
$$ packed form
10553a52779B02955k3543B1167a59613B5983K40864c5744D4600b03615K3777A56533
10541I418b58396B53259j14294c22848N0357I6119d7499C4340N6076a36024K6471
10530a09553r1412o6441A36533B651M2708a07725B53804b1868H1353d813j628
10519f441D0647c62030R9076c857j21525q5849f1484B39972a19831B98855c14900
10507c47757J45145A80298a28725b6803G4253d08671E1590a59677E7158a47226
10496B59033B5908b41162a0977k63203D708Q6988a90165Q2484L5776C3748M9610
10485H3358j3980o039j5334b81210c1081j10801B34377M9337a69241A45338n6128
10474H9210c0324j95581C57030b55635J5381m8225g6500B07342D4024j3682L43190
$$ plain form
10463 373532 -79053 80124 67394 382269 75358 -200000 74792 235043 -51816 -5397 -22895
10452 -22895 167771 -18748 -288396 40151 265939 -96115 -431145 81513 -228346 -150549 -124855
10441 -124855 -141541 -52035 161349 -341803 111400 -29669 -148202 -124219 -112304 -283009
10431 -283009 -162127 -34638 -529323 136729 273537 -92744 -187785 89652 -356847 29480
10420 93772 194838 -161541 118594 116448 -7992 136306 -93079 -243422 -213158 83431 38491
10408 253007 -133814 203298 186348 -136497 25763 41058 -58768 272748 -113 -20294 -74028
10397 -74028 391060 83399 354011 -31893 -53010 41640 -88379 25799 -43177 234427 80819
10385 -39317 -161058 327499 250097 -151260 184171 205828 136966 28686 262627 345963 34671
$$ packed form
10463C73532g9053H0124j2730L14875G5358b00000G4792J60251e1816e397j7498
10452b2895A67771a8748k69648D0151K25788i6115l35030H1513b28346P7797K5694
10441a24855j6686e2035A61349c41803A11400b9669j18533K3983J1915j70705
10431b83009J20882c4638m94685A36729J36808i2744r5041H9652c56847B9480
10420I3772J01066a61541A18594k146g992A36306i3079j50343L0264H3431C8491
10408B53007a33814B03298j6950a36497B5763J5295e8768B72748a13k0181n3734
10397g4028C91060H3399K70612c1893k1117D1640h8379B5799d3177B34427H0819
10385c9317j21741C27499p7402a51260A84171K1657o8862B8686K33941Q3336C4671
$$ plain form
10373 114033 -40972 -81996 355213 71328 -94942 4770 -79640 374480 32027 -58323 123309
10361 359678 95574 2580 191109 300766 344507 442067 550909 177031 483769 197517
10350 478390 439602 154953 -81906 162479 572042 231695 406596 157800 204274 395020
10340 395020 199175 299626 504596 -36100 312829 634067 434762 453938 348701 509830
10330 509830 458126 193744 276326 293406 503661 162799 157128 -319996 449211 -145663
10319 28588 254771 -43598 269292 8881 204715 -211202 -116591 248070 -55383 338839 122831
10307 387000 119019 144461 153617 236939 365677 -34150 17540 122149 85369 217787 195186
10296 195186 -224662 -148878 -18494 229518 -245451 43085 71984 482625 189482 -162817
$$ packed form
10373A14033d0972m1024C55213G1328i4942D770g9640C74480C2027e8323A23309
10361C59678I5574B580J88529J09657M3741R7560J08842A77031L06738A97517
10350D78390l8788A54953h1906A62479M09563B31695J74901A57800M6474J90746
10340C95020j95845J00451K04970c6100C12829L21238j99305J9176j05237J61129
10330E09830n1704A93744Q2582J7080K10255A62799n671c19996D49211a45663
10319B8588K26183d3598B69292H881J95834b11202R4611B48070e5383C38839A22831
10307C87000A19019K5442R156Q3322J28738c4150A7540J04609l6780J32418k2601
10296A95186b24662P5784a8494B29518b45451D3085K8899M10641A89482a62817
$$ plain form
10285 -361724 244068 127257 -116066 -296372 162839 -101568 -174979 -406080 116418 -323142
10274 -48936 -481847 -17720 -2675 -262393 -172866 126333 189666 -336980 -103494 -80230 178052
10262 -78498 -207667 180331 39683 -238608 -93516 144249 -172969 -22550 26563 30719 -119624
10250 17056 -231683 576 219056 59151 209581 557807 22315 247224 134304 32378 105046
10239 105046 122089 203334 337902 5896 -133908 -172087 374076 -130077 112125 -33482 73839
10227 193002 -15643 -147518 -248765 -198345 41464 -3680 -86170 -248017 53660 -49548 -22908
10215 49916 -137020 -236262 -284231 151474 22231 225336 214706 -157191 -209222 -138727 -197002
10204 -197002 -42330 117777 61397 -70203 56237 -64931 -408749 -319776 -264470 332436 112888
$$ packed form
10285c61724B44068j16811a16066j80306A62839a01568p3411k31101A16418c23142
10274d8936m32911a7720b675k59718Q9527A26333O3333c36980a03494K3264A78052
10262g8498j29169A80331C9683b38608i3516A44249a72969b2550B6563M156a19624
10250A7056b31683E76K18480E9151J50430L48226B2315K24909j12920C2378P2668
10239A05046J7043Q1245J34568E896a33908l8179C74076a30077A12125c3482G3839
10227A93002a5643j31875j01247N0420D1464c680q2490j61847E3660d9548b2908
10215D9916a37020r9242m7969A51474B2231K03105j0630a57191n2031P0495n8275
10204a97002d2330A17777n6380g0203E6237f4931l43818Q8973N5306C32436A12888
$$ plain form
10192 -61475 -173808 -308847 7266 5171 -199116 -314929 69536 7486 -397336 274812 -80768
10180 -95927 -94691 -45570 112502 260350 34470 -252278 -233336 73028 120250 144931 -84200
10168 -64978 31552 -228828 -40744 -391838 126761 -210011 -26674 3407 -109309 59442 79426
10157 79426 -18857 -288824 -80483 47426 -12082 -215906 -107494 -121789 -99736 162626 127342
10146 127342 301058 -170780 -19944 -32713 -46729 -281415 52477 -85875 -4086 -225053 135469
10134 -249276 213133 35559 -146854 -179723 -216561 53134 318296 -1905 -62969 -225478 -649
10122 18489 -135349 -97859 -83120 -3949 351422 -130628 153810 18108 -26069 159280 -32299
10110 -2016 -177300 -196751 156017 92042 -18491 -73926 -100276 275235 -304795 -8523 61500
$$ packed form
10192f1475j12333j35039G266k095a99116j15813F9536G486c97336B74812h0768
10180i5927J236d5570A12502J47848C4470b52278J8942G3028M7222K4681h4200
10168f4978C1552b28828d0744l51094A26761b10011b6674C407a09309E9442J9984
10157G9426a8857k69967h0483D7426a2082k03824a07494j4295K2053A62626l5284
10146A27342J73716a70780a9944j2769j4016k34686E2477h5875d086k20967A35469
10134b49276B13133C5559a46854l2869l6838E3134K65162a905o1064j62509f49
10122A8489a35349L7490J4739c949C51422a30628A53810A8108b6069A59280c2299
10110b016j75284j9451A56017o3975a8491n5435k6350B75235c04795h523F1500
$$ plain form
10098 55735 -302826 -206754 340241 -113117 -379087 276554 -55402 -66918 -56763 -163447
10088 -163447 -98566 192619 -142941 -462777 -125779 -83779 297357 -119137 31607 350515
10078 350515 -121143 -25893 -138895 -115995 -101268 40790 -68242 155780 -287027 96148 -109252
10066 136464 -25616 -151208 181815 -334595 -21718 175058 -117747 -21516 -193358 -35955
10055 105549 -208707 -192518 -79602 -94940 -116287 18999 -168680 -73041 -61506 174888 139966
10044 139966 -95078 -134694 -53551 -177351 51083 109151 47874 -465841 303519 -10949 -175297
10033 -175297 -256206 50461 -212719 106439 -187842 -101958 -205169 134023 -218394 -80110
10022 178827 -416139 74155 106567 -38262 -64817 -50779 329302 105669 -17207 227056 44504
$$ packed form
10098E5735c02826R6072C40241a13117k65970B76554e5402j1516J0155j06684
10088a63447O4881A92619a42941l19836a25779M2000B97357a19137C1607L18908
10078C50515a21143b5893j13002K2900J4727D0790f8242A55780b87027I6148a09252
10066A36464b5616j25592A81815c34595b1718A75058a17747b1516j71842c5955
10055A05549b08707J6189g9602j5338k1347A8999a68680g3041J1535A74888l4922
10044A39966i5078l9616e3551j23800E1083N8068D7874d65841C03519a0949j64348
10033a75297q0909E0461b12719A06439a87842Q5884j03211A34023b18394h0110
10022A78827d16139G4155L2412c8262k6555J4038C29302A05669a7207B27056D4504
$$ plain form
10010 47888 -15247 183870 -12856 -143104 41858 -144108 47558 61539 79102 -113319 -7233
9998 -22235 -385094 -174264 -326465 -56737 -196296 -134083 -91220 -222138 20826 -122445 -90662
9987 -90662 -35579 -232103 -13455 -290794 -98372 -200751 69466 -298574 -208145 -176909 64124
9975 -405548 172585 -116494 -309948 260990 -148753 -405242 248632 -276046 -110234 112670
9964 -224413 -275288 -193072 87203 -15274 92527 213447 94541 -474933 -196368 -177423 87746
9952 -294269 282993 -230435 -148082 84991 -187802 38707 -25375 76092 -41985 217764 -85110
9940 -219723 -18359 -104889 -110823 -47806 110018 -94594 -16098 1062 -296327 103376 -205224
9928 -111077 56461 -187814 -252739 -40892 71235 -469641 -144770 -262513 -119458 255318
$$ packed form
10010D7888a5247A83870a2856j30248D1858a44108D7558J3981J7563a13319g233
9998b2235l62859a74264j52201e6737j39559O2213M2863j30918B0826a22445L1783
9987i0662c5579j96524a3455k77339i8372j02379F9466b98574R0429L1236F4124
9975d05548A72585a16494j93454B60990a48753k56489B48632b76046a10234A12670
9964b24413n0875Q2216H7203a5274I2527J20920I4541d74933a96368J8945H7746
9952b94269B82993b30435Q2353H4991a87802C8707b5375G6092d1985B17764h5110
9940b19723a8359q6530n934d7806A10018i4594a6098A062b96327A03376b05224
9928a11077E6461a87814o4925d0892G1235d69641a44770j17743a19458B55318
$$ plain form
9917 -139759 -71309 -44212 -41408 -348422 122724 -220095 28565 262441 -132060 -335230 -130816
9905 -156359 215051 -213677 203021 262797 40792 57020 -375792 30646 -19057 30468 -128627
9893 -143994 41529 211288 -275917 -146481 -47689 -309700 -9753 -124387 -121339 33509 151904
9882 151904 -368335 124659 253329 -302343 202152 231048 -404525 414015 -72141 37199
9871 287164 -488046 29638 96760 323127 266563 -89799 7417 -116738 102089 109624 -226221
9859 25910 -79568 -78885 -227535 -142182 -82358 132652 28794 299025 12148 135584 -20890
9847 51053 -429858 -114210 -4545 74255 -100016 -53657 -117248 -151588 -45365 -74651 41367
9835 250202 41013 274590 -95124 74061 -171413 43930 12801 -36786 -313483 -251446 -223474
$$ packed form
9917a39759O8450K7097K804l07014A22724b20095B8565K33876a32060k03170a30816
9905a56359B15051b13677B03021N9776D0792J6228c75792C0646a9057C0468a28627
9893a43994D1529J69759b75917J29436d7689k62011i753j14634L048C3509J18395
9882A51904c68335A24659J28670c02343B02152K8896d04525D14015g2141C7199
9871B87164d88046B9638O7122K26367n6564h9799G417a16738A02089P535b26221
9859B5910g9568O83j48650Q5353N9824A32652B8794K70231A2148J23436b0890
9847E1053d29858a14210d545G4255a00016M6359o3591l4340d5365k9286D1367
9835B50202D1013K33577i5124G4061a71413D3930A2801c6786k76697O2037K7972
$$ plain form
9824 -223474 -34948 -96802 138495 -148311 -312876 -75265 -109502 140482 59788 -271954 -110425
9812 -82565 9246 -3850 -175234 47031 -41207 368470 64598 -415516 49377 -57646 85481 -73781
9799 80768 35124 -41834 155378 -158176 -2723 36384 -238951 -229199 79065 -209676 -5314 157796
9786 -205597 -100576 -261696 20793 -29101 -133789 -86248 -181399 -175975 -294120 -419541 -205009
9774 -93848 -288574 104714 65264 62472 -165841 -31539 24093 247412 -106432 102192 -79096
9762 260325 -193752 42388 -160526 4751 77865 28397 94536 -217257 -266534 76256 253259
9751 253259 61786 4441 -299157 240673 -66026 -7225 -270998 -464622 -294479 -93908 80587
9739 134861 -371538 195223 181710 -43718 -26498 -254210 30279 -11049 60534 3362 -251935
$$ packed form
9824b23474c4948o1854A38495a48311j64565g5265l4237A40482E9788b71954a10425
9812h2565I246c850j71384D7031d1207C68470F4598d15516D9377e7646H5481g3781
9799H0768C5124d1834A55378a58176b723C6384b38951R752G9065b09676e314A57796
9786b05597a00576j61120B0793b9101j04688M7541r5151N424j18145j25421b05009
9774i3848j94726A04714l9450k792a65841c1539B4093K23319a06432A02192g9096
9762B60325a93752D2388a60526D751P3114B8397O6139b17257m9277G6256J77003
9751B53259F1786D441b99157B40673f6026g225k63773j93624J70143i3908H0587
9739A34861c71538A95223j3513d3718J7220k27712C0279a1049F0534C362b51935
$$ plain form
9727 -192953 -181528 -222348 38072 -115258 -45729 -197617 7413 -138500 -113400 155746 -176965
9715 -126760 -40257 -170167 127497 -157047 -11792 -182827 29190 -161392 -119067 343457
9704 10310 -336671 -206561 -189243 28388 -142508 -112862 121943 -110333 49416 31907 103802
9693 103802 -67982 -233346 25379 -162066 -186477 131189 21121 63464 -100393 3520 -108734
9681 17150 -49538 -66291 -45506 -316206 244235 145206 -206998 16450 -78759 -16224 -379690
9670 -379690 -101393 -208528 -309760 -202472 -58017 -263505 -224657 -430365 -314603 169352
9659 -45763 -8362 322406 -62208 -164023 -216354 24744 -86749 92630 -65489 47202 -220853
9647 -41043 124756 -53806 69459 117146 46573 -136541 -76180 -21333 140381 43598 -263197
$$ packed form
9727a92953J1425m0820C8072a15258d5729j51888G413a38500K5100A55746a76965
9715a26760d0257j29910A27497a57047a1792j71035B9190a61392M2325C43457
9704A0310c36671J30110J7318B8388a42508K9646A21943a10333D9416j7509P1895
9693A03802f7982j65364B5379a62066k4411A31189B1121M2343a00393C520a08734
9681A7150d9538j6753K0785k70700B44235r9029b06998A6450g8759a6224l63466
9670c79690a01393j07135j01232J07288e8017k05488L8848k05708J15762A69352
9659d5763h362C22406f2208j01815n2331B4744h6749I2630f5489D7202b20853
9647d1043A24756e3806F9459M7687D6573a36541O0361b1333A40381D3598b63197
$$ plain form
9635 171037 259426 -123507 -140040 38491 115771 -269223 -146108 317282 -178794 -208433 -142437
9624 -142437 367054 -116606 -18559 366785 -168031 -209459 -27013 166788 -54501 88031 -45776
9612 61293 -41421 226751 -86270 -265967 -180562 14499 74389 -164589 -146297 -168136 -267660
9601 -267660 217499 -230199 -279196 -113346 -199486 68877 -159704 -190295 30478 55069 -59458
9589 -44267 -7387 -69398 -168753 351141 186921 -294848 -38000 10976 -185307 -306138 -235483
9578 -235483 -397802 -102591 -231139 -110795 233820 -6589 -216242 -75578 -199683 177716
9567 -270813 158497 -167820 47024 -423030 -245799 -68365 -167042 -201368 82711 -57909 -47752
9556 -47752 197470 -249 -81485 -141201 -300486 -552388 -85446 -115415 -349643 161149 -139468
$$ packed form
9635A71037Q8389a23507j6533C8491P7280b69223J23115C17282a78794k9639O5996
9624a42437C67054a16606a8559C66785a68031m1428b7013A66788e4501H8031d5776
9612F1293d1421B26751h6270j79697Q5405A4499N9890a64589J8292k1839r9524
9601b67660B17499b30199m8997a13346q6140F8877a59704l0591C0478K4591e9458
9589d4267g387o2011r9355C51141j64220b94848c8000A0976a85307j20831P0655
9578b35483j62319a02591j28548a10795B33820f589k09653g5578j24105A77716
9567b70813A58497a67820D7024d23030J77231f8365r8677l4326H2711e7909J0157
9556d7752A97470b49q1236n9716j59285k51902h5446k9969k34228A61149a39468
$$ plain form
9544 -112331 -371781 66923 106343 -9751 126434 -132433 -137060 109678 -75733 108396 24596
9532 262579 -31364 -33040 -36293 10989 11236 -196909 -12137 200206 243997 -218448 43835 -191782
9519 -59909 97143 337654 -275766 56687 -57438 -234399 -79557 23570 -194188 -419661 -9176
9507 -32425 144950 5825 154718 -256433 -45073 46623 -162719 -31872 -78129 -187553 -53706
9495 -57625 -13347 -6699 -317645 34982 -56817 -1750 13223 -27781 -411459 89804 67672 54168
9483 54168 -200962 -260411 -166070 39229 -97951 111559 -352364 -81251 5646 29892 192572
9472 192572 44204 146757 -66123 181083 157979 -126110 43488 -320180 184145 -2468 151215
9460 -124158 -95009 -56233 66685 218640 -43802 19244 -250453 -146278 217809 -39722 -157821
$$ packed form
9544a12331k59450F6923L9420i751A26434a32433m627A09678g5733A08396B4596
9532B62579c1364j676l253A0989K47a96909a2137B00206M3791b18448D3835a91782
9519e9909I7143K40511b75766E6687e7438j76961g9557B3570a94188k25473i176
9507c2425A44950E825J48893b56433d5073D6623a62719c1872m6257j09424e3706
9495e7625a3347O648l10946C4982e6817a750A3223b7781l83678H9804k2132j3504
9483E4168b00962n9449R4341C9229i7951A11559c52364h1251E646K4246J62680
9472A92572D4204J02553f6123A81083k3104a26110D3488c20180A84145b468A51215
9460a24158K9149L8776F6685J51955d3802A9244b50453J04175B17809c9722j18099
$$ plain form
9449 -157821 -131612 144858 -234837 19208 -303477 -233279 -276684 180919 1186 -353236 -49276
9437 91649 -62912 31964 338031 -208255 -40913 -369490 -171153 -72066 -85816 333702 -229225
9425 -184337 -86230 40635 -127965 -106566 -15523 -102423 -103281 66309 145963 -85906 -39140 232662
9412 -15647 -121590 87148 -301827 -299964 -84549 11102 -59079 -208427 -102895 -454946 -8355
9400 -11363 136411 -149278 233139 -118770 -120288 -11629 -141560 -242276 166865 260884 -64070
9388 -96389 -8276 264651 116384 -46412 -101572 -229630 43162 -175241 39041 8584 -26566
9376 -30702 206149 -24727 -360014 149824 60622 -115313 274049 -120847 -311376 -23288
9365 10489 -188120 141479 -228901 163347 3733 82609 118059 -138091 -342387 -42320 35548
$$ packed form
9449a57821K6209A44858b34837A9208c03477P0198m3405A80919A186c53236d9276
9437I1649f2912C1964L06067b08255d0913l28577a71153g2066j3750C33702b29225
9425a84337h6230D0635a27965K1399a5523q6900q58F6309P9654h5906c9140B32662
9412a5647j05943H7148c01827J863h4549A1102e9079j49348a02895l52051h355
9400a1363A36411a49278B33139a18770j518a1629j29931j00716A66865R4019f4070
9388i6389h276B64651A16384d6412n5160j28058D3162a75241C9041H584b6566
9376c0702B06149b4727l35287A49824F0622a15313B74049a20847j90529b3288
9365A0489a88120A41479b28901A63347C733P8876L5450a38091k04296d2320C5548
$$ plain form
9353 -187230 25928 -119220 34008 78440 -20475 -210291 -101712 -202906 294707 -88065 -5686
9341 -90423 -348278 -185032 -22552 19518 76936 -296101 -133765 -33327 -130751 80004 132062
9330 132062 -274720 -59501 -228407 99250 15817 185216 -9792 -168266 37898 -68387 -65558
9319 -65558 77713 53413 80909 66730 -48227 -283019 -79944 164896 -119715 -27023 282278
9307 129806 -46827 -133019 -30035 91691 -112304 71001 60788 -173385 58971 147604 -32866
9295 89094 -44176 105453 -52563 -165921 286427 -193409 -465297 84152 127274 27700 -220044
9283 -56559 -258135 -174213 -270151 120977 44770 126346 -163993 -318959 161619 -16956 -94319
9272 -94319 114773 -102020 -142590 -291531 -45093 -21414 -332844 -276191 -208859 7959 71397
$$ packed form
9353a87230B5928a19220C4008M4432b0475j89816a01712j01194B94707h8065e686
9341i0423k57855J63246b2552A9518N7418b96101a33765c3327r7424H0004N2058
9330A32062b74720e9501j68906I9250A5817J69399i792j58474C7898f8387K829
9319f5558G7713k4300K7496j4179d8227k34792g9944A64896a19715b7023B82278
9307A29806d6827q6192c0035I1691a12304G1001j0213a73385E8971Q8633c2866
9295H9094d4176A05453e2563j13358B86427a93409k71888H4152M3122B7700b20044
9283e6559k01576Q3922r5938A20977D4770Q1576a63993j54966A61619a6956p7363
9272i4319A14773a02020m0570j48941d5093b1414l11430N6653O7332G959O3438
$$ plain form
9261 71397 71577 -106308 196234 42496 -347539 -314826 -345164 -267012 -74327 -125224 -256840
9250 -256840 -279732 -114270 -109474 -112354 -66769 30542 177061 160071 -191758 -382038 -74786
9238 47658 -227926 -62041 -10924 -112979 156754 148481 321487 226093 -78255 -200960 134242
9226 -121687 -49946 -151311 82358 171221 -239495 -62455 164891 -496824 66507 50479 -48528
9214 -343806 8535 -109603 162319 -231208 -118892 82544 -91268 514141 -291640 32588 -50276
9202 10768 -208709 -166148 84138 -217051 -406904 -286497 207168 -165472 -218966 150993
9191 77572 -264343 -191019 -122073 14541 -303159 165761 -100752 -157758 102095 -15514 -71166
9180 -71166 -39391 -68523 -203402 -106538 38001 -63412 -85269 181235 -83951 93187 -322975
$$ packed form
9261G1397J80a06308A96234D2496c47539L2713l0338P8152g4327n0897j31616
9250b56840k2892a14270M796k880M5585C0542J46519j6990a91758j90280g4786
9238D7658b27926f2041a0924j02055A56754q273J73006r5394g8255j22705A34242
9226a21687d9946j01365H2358Q8863b39495f2455A64891d96824F6507j6028d8528
9214c43806H535a09603A62319b31208J12316H2544i1268E14141b91640C2588e0276
9202A0768b08709M2561H4138b17051j89853J20407B07168a65472n3494A50993
9191G7572b64343P3324O8946A4541c03159A65761a00752n7006A02095a5514n5652
9180g1166L1775k9132j34879R6864C8001f3412k1857A81235h3951I3187c22975
$$ plain form
9168 -57296 35043 170977 -36027 -39676 -280062 71224 -165125 -44191 -305464 131977 63743
9156 218409 22398 -159656 188695 167654 -73759 -168721 -267408 99983 -113868 -134557 -326967
9145 -326967 -99929 -198670 143162 -20042 84071 -41588 128782 13846 164016 126503 -146730
9133 -148682 102674 -336911 -31857 234840 222335 85318 4059 -121608 123580 -4067 214349
9121 -28289 -180729 67589 187953 -55248 -22908 84409 20490 81410 -110089 -37464 -81449
9110 -81449 -210767 -281100 -135486 -103496 155770 -63834 -56775 -164909 163256 110524 -359122
9098 145395 115542 -276444 -101345 -216482 -17227 175885 -141522 65943 -84185 239448
9087 -190601 14452 28011 -176508 23485 219541 -303286 -143325 -146665 79167 118850 -60274
$$ packed form
9168e7296C5043J35934c6027l649k40386G1224a65125d4191k61273A31977F3743
9156B18409B2398a59656A88695k1041g3759r4962r8687I9983a13868k0689j92410
9145c26967i9929r8741A43162b0042H4071d1588A28782A3846J50170l7513a46730
9133a48682A02674c36911c1857B34840j2505H5318D059a21608A23580d067B14349
9121b8289j52440F7589J20364e5248b2908H4409B0490O0920a10089c7464m3985
9110h1449j29318p0333a35486L1990A55770f3834P059j08134A63256n2732c59122
9098A45395k9853b76444a01345j15137a7227A75885a41522F5943h4185B39448
9087a90601A4452J3559a76508B3485J96056c03286a43325l340G9167L9683f0274
$$ plain form
9075 -447868 -211652 205860 -214038 267454 -251205 -262225 294756 -83309 -76966 -13369 -174913
9064 -174913 49254 -335549 -423507 41862 -39942 -81004 111095 -52849 -16266 179962 117722
9053 117722 -186353 -78559 -102655 -44716 -195325 -25709 -109499 -66762 -15288 -78153 -58373
9042 -58373 -112540 123565 -61202 -213481 84664 166975 -133266 134420 18146 -44595 -229149
9031 -229149 29143 22602 57016 -20493 34744 -107147 -48402 140439 -93208 -310808 -135238
9019 45397 -228998 105136 -307441 168989 67239 49695 -218904 113996 17348 29697 178786
9008 178786 45873 -153213 -29782 -128867 -105317 -41590 -102543 -11730 -117781 -212729 -7403
8996 -33010 -460169 241868 -228802 -74435 81592 116777 16487 -156013 -74388 275086 310664
$$ packed form
9075d47868b11652B05860b14038B67454b51205j1020B94756h3309O343a3369j61544
9064a74913D9254c35549q7958D1862c9942m1062A11095e2849a6266A79962o2240
9053A17722a86353g8559k4096d4716j50609b5709q3790M2737a5288o2865J9780
9042e8373n4167A23565f1202j52279H4664Q2311a33266A34420A8146d4595j84554
9031b29149B9143o541L4414b0493C4744a07147d8402A40439i3208k17600a35238
9019D5397b28998A05136c07441A68989F7239j7544b18904A13996A7348J2349J49089
9008A78786D5873a53213b9782r9085K3550d1590o0953a1730j06051r4948g403
8996c3010m27159B41868b28802g4435H1592L5185A6487a56013g4388B75086L5578
$$ plain form
8985 310664 -347513 -55552 -128918 -78196 -48829 -181092 -121363 -124830 28068 17331 -61737
8973 -166288 -225345 212856 -139526 95865 -2161 -49788 -235476 31438 40236 -148776 -279351
8962 -279351 141613 236722 -6970 -204586 -272652 -199102 136146 -209122 146045 79301 -18390
8950 -132825 182267 154013 -66058 196553 4847 125278 107366 -265345 18102 -462206 -65827
8938 -202105 -149157 -206244 -160689 -76867 -15527 141651 -181898 29773 158586 245829 -253674
8926 326005 -21502 138854 184696 -52918 367036 -20456 -115260 260861 -128243 157345 83601
8915 83601 326978 45156 230122 434023 401284 891781 915882 1881618 2547478 5064821
8905 5064821 9602357 4125945 2344444 1279968 759453 850053 524151 540357 271753
$$ packed form
8985C10664c47513e5552p3366N0722K9367j32263N9729l467B8068j0737f1737
8973a66288n9057B12856a39526I5865b161m7627j85688C1438Q798a48776j30575
8962b79351A41613R5109f970j97616o8066P3550A36146b09122A46045o6744a8390
8950a32825A82267k8254f6058A96553D847J20431j7912b65345A8102d62206f5827
8938b02105N2948n7087M5555g6867a5527A41651a81898B9773J28813Q7243b53674
8926C26005b1502A38854M5842e2918C67036b0456r4804B60861a28243A57345p3744
8915H3601K43377D5156J84966K03901l2739M90497K4101R65736O65860K517343
8905E064821M537536D125945j781501j064476n20515R0600l25902J6206k68604
$$ plain form
8896 271753 229760 108190 191549 46831 65220 -291465 383334 -193858 -120870 -12218 -14136
8885 -14136 237422 -264271 159336 -69960 -55629 89218 21582 -282112 -186836 -173788 -179424
8874 -179424 -278399 -90057 153328 -212768 20905 24835 37806 -84139 -95403 -13945 -218757
8863 -218757 -71257 75945 96531 8389 -340185 -38265 11199 -88698 -94310 83821 67485 -32241
8850 -20460 -24170 -149030 -182775 -243088 -235311 -30849 432639 -50732 -71508 299813 -20320 -325111
$$ packed form
8896B71753m1993A08190Q3359D6831J8389b91465C83334a93858P2988a2218j918
8885a4136B37422b64271A59336f9960J4331H9218B1582b82112R5276J3048n636
8874a79424r8975i0057A53328b12768B0905L930J2971h4139j1264a3945k04812
8863b18757g1257G5945K0586H389c40185c8265A1199h8698n612H3821j6336c2241
8850b0460l710j24860l3745o0313P777c0849D32639e0732k0776B99813b0320l04791
$$ [...]
##END NTUPLES=NMR SPECTRUM
##END=
