
##TITLE=UV1150_M2-1005-1001_6301592_ZFADy4AhCl
##JCAMPDX= 6.0         $$ Bruker NMR JCAMP-DX V2.0
##DATA TYPE= NMR SPECTRUM
##DATA CLASS= NTUPLES
##ORIGIN= BRUKER
##OWNER= Administrator
$$ 1.72 TOPSPIN		Version 2.1
$$ 2012-06-06 01:18:02.812 -0500  Administrator@TOPSPIN
$$ Compression mode = diff/dup
##.OBSERVE FREQUENCY= 400.13188235
##.OBSERVE NUCLEUS= ^1H
##.ACQUISITION MODE= SIMULTANEOUS (DQD)
##.ACQUISITION SCHEME= undefined
##.AVERAGES= 64
##.DIGITISER RES= 22
##SPECTROMETER/DATA SYSTEM= spect
##.PULSE SEQUENCE= noesygpps1d.comp
##.SOLVENT NAME= COFFEE_meoh
##.SHIFT REFERENCE= INTERNAL, COFFEE_meoh, 1, 14.96701
##AUDIT TRAIL= $$ (NUMBER, WHEN, WHO, WHERE, PROCESS, VERSION, WHAT)
$$ ##TITLE= Audit trail, TOPSPIN		Version 2.1
$$ ##JCAMPDX= 5.01
$$ ##ORIGIN= Bruker BioSpin GmbH
$$ ##OWNER= Administrator
$$ $$ C:\Bruker\TOPSPIN/data/COFFEE/nmr/UV1150_M2-1005-1001_6301592_ZFADy4AhCl/12/pdata/1/auditp.txt
$$ ##AUDIT TRAIL=  $$ (NUMBER, WHEN, WHO, WHERE, PROCESS, VERSION, WHAT)
(   1,<2012-06-06 01:17:57.468 -0500>,<Administrator>,<TOPSPIN>,<go>,<TOPSPIN 2.1>,
      <created by zg
	started at 2012-06-06 01:06:27.281 -0500,
	POWCHK enabled, PULCHK disabled,
       configuration hash MD5:
       D5 CA 7A 23 FE 6B EE E2 50 67 74 61 24 F7 5E 3B
       data hash MD5: 64K
       73 97 B8 55 80 B9 C0 8B 87 B1 C9 1F A3 2B 9B A0>)
(   2,<2012-06-06 01:18:00.406 -0500>,<Administrator>,<TOPSPIN>,<proc1d>,<TOPSPIN 2.1>,
      <Start of raw data processing
       efp LB = 0.3 FT_mod = 6 PKNL = 1 PHC0 = 0 PHC1 = 0 SI = 128K 
       data hash MD5: 128K
       4F 5C 28 AA 61 A1 7A ED D2 F2 A0 01 32 0E BA 7A>)
(   3,<2012-06-06 01:18:01.625 -0500>,<Administrator>,<TOPSPIN>,<proc1d>,<TOPSPIN 2.1>,
      <pk PHC0 = 29.94324 PHC1 = 0 
       data hash MD5: 128K
       D3 E8 7B 0D AA 4F 47 FD 15 BA E5 5E 47 A3 6D AA>)
(   4,<2012-06-06 01:18:02.468 -0500>,<Administrator>,<TOPSPIN>,<proc1d>,<TOPSPIN 2.1>,
      <abs ABSG = 1 
       data hash MD5: 128K
       C4 07 B3 1D B8 37 B3 9B FB 2B 07 A3 C3 4D 53 07>)
(   5,<2012-06-06 01:18:02.531 -0500>,<Administrator>,<TOPSPIN>,<proc1d>,<TOPSPIN 2.1>,
      <abs ABSG = 2 
       data hash MD5: 128K
       83 83 45 C6 A9 45 25 4F 06 8A AC 37 6A 86 B7 CC>)
(   6,<2012-06-06 01:18:02.593 -0500>,<Administrator>,<TOPSPIN>,<proc1d>,<TOPSPIN 2.1>,
      <abs ABSG = 3 
       data hash MD5: 128K
       4F 65 72 7A 4D FB D9 36 D8 B3 B1 CD C3 C1 D0 31>)
(   7,<2012-06-06 01:18:02.671 -0500>,<Administrator>,<TOPSPIN>,<proc1d>,<TOPSPIN 2.1>,
      <abs ABSG = 4 
       data hash MD5: 128K
       51 DE 16 B3 9B 84 F5 2E 7D 7C 52 DE 0A 66 04 19>)
(   8,<2012-06-06 01:18:02.734 -0500>,<Administrator>,<TOPSPIN>,<proc1d>,<TOPSPIN 2.1>,
      <abs ABSG = 5 
       data hash MD5: 128K
       AD 9A 20 1B F3 F2 8F 0D 27 85 B9 AA 1B F3 31 C9>)
$$ ##END=
$$ 
$$ $$ hash MD5
$$ $$ C8 46 4C 77 48 AE F7 1D BE 08 9A 56 F9 F8 0F 2B
##$RELAX= 
##$RELAX= 
##$RELAX= 
##$RELAX= 
##$RELAX= 
##$RELAX= 
##$RELAX= 
##$RELAX= 
$$ Bruker specific parameters
$$ [...]
##$TP07= 0
##$TPNAME0= <>
##$TPNAME1= <>
##$TPNAME2= <>
##$TPNAME3= <>
##$TPNAME4= <>
##$TPNAME5= <>
##$TPNAME6= <>
##$TPNAME7= <>
##$TPOAL= (0..7)
0.5 0.5 0.5 0.5 0.5 0.5 0.5 0.5
##$TPOFFS= (0..7)
0 0 0 0 0 0 0 0
##$TUNHIN= 0
##$TUNHOUT= 0
##$TUNXOUT= 0
##$USERA1= <user>
##$USERA2= <user>
##$USERA3= <user>
##$USERA4= <user>
##$USERA5= <user>
##$V9= 5
##$VALIST= <valist>
##$VCLIST= <CCCCCCCCCCCCCCC>
##$VD= 0
##$VDLIST= <DDDDDDDDDDDDDDD>
##$VPLIST= <PPPPPPPPPPPPPPP>
##$VTLIST= <TTTTTTTTTTTTTTT>
##$WBST= 2048
##$WBSW= 25
##$XGAIN= (0..3)
0 0 0 0
##$XL= 0
##$YL= 0
##$YMAX_a= 9833826
##$YMIN_a= -6858842
##$ZGOPTNS= <>
##$ZL1= 120
##$ZL2= 120
##$ZL3= 120
##$ZL4= 120
##$ABSF1= 14.96701
##$ABSF2= -5.585521
##$ABSG= 5
##$ABSL= 3
##$ALPHA= 0
##$AQORDER= 0
##$ASSFAC= 0
##$ASSFACI= 0
##$ASSFACX= 0
##$ASSWID= 0
##$AUNMP= <proc_prof1d_extract.lims>
##$AXLEFT= 0
##$AXNAME= <>
##$AXNUC= <1H>
##$AXRIGHT= 0
##$AXTYPE= 0
##$AXUNIT= <>
##$AZFE= 0.1
##$AZFW= 0.1
##$BCFW= 0
##$BC_mod= 0
##$BYTORDP= 0
##$COROFFS= 0
##$CY= 15
##$DATMOD= 1
##$DC= 0
##$DFILT= <>
##$DTYPP= 0
##$F1P= 0
##$F2P= 0
##$FCOR= 0.5
##$FTSIZE= 131072
##$FT_mod= 6
##$GAMMA= 0
##$GB= 0
##$INTBC= 1
##$INTSCL= 1
##$ISEN= 128
##$LB= 0.3
##$LEV0= 0
##$LPBIN= 0
##$MAXI= 10000
##$MC2= 0
##$MEAN= 0
##$ME_mod= 0
##$MI= 0
##$NCOEF= 0
##$NC_proc= -3
##$NLEV= 6
##$NOISF1= 0
##$NOISF2= 0
##$NSP= 0
##$NTH_PI= 0
##$NZP= 0
##$OFFSET= 14.96701
##$PC= 1
##$PHC0= 29.94324
##$PHC1= 0
##$PH_mod= 1
##$PKNL= yes
##$PPARMOD= 0
##$PPDIAG= 0
##$PPIPTYP= 0
##$PPMPNUM= 2147483647
##$PPRESOL= 1
##$PSCAL= 4
##$PSIGN= 0
##$PYNMP= <proc.py>
##$REVERSE= no
##$SF= 400.130005443456
##$SI= 131072
##$SIGF1= 0
##$SIGF2= 0
##$SINO= 400
##$SIOLD= 131072
##$SPECTYP= <>
##$SREGLST= <1H.CDCl3>
##$SSB= 0
##$STSI= 131072
##$STSR= 0
##$SW_p= 8223.68421052632
##$SYMM= 0
##$S_DEV= 0
##$TDeff= 65536
##$TDoff= 0
##$TI= <>
##$TILT= no
##$TM1= 0
##$TM2= 0
##$TOPLEV= 0
##$USERP1= <user>
##$USERP2= <user>
##$USERP3= <user>
##$USERP4= <user>
##$USERP5= <user>
##$WDW= 1
##$XDIM= 131072
##$YMAX_p= 489007442
##$YMIN_p= -457607440
##$CURPLOT= <Network HP LaserJet P1505>
##$CURPRIN= <$Network HP LaserJet P1505>
##$DFORMAT= <normdp>
##$LAYOUT= <+/1D_H.xwp>
##$LFORMAT= <normlp>
##$PFORMAT= <normpl>
##$SURQMSG= 1
$$ End of Bruker specific parameters
$$ ---------------------------------
##NTUPLES= NMR SPECTRUM
##VAR_NAME=  FREQUENCY,     SPECTRUM/REAL,   SPECTRUM/IMAG
##SYMBOL=    X,             R,               I
##VAR_TYPE=  INDEPENDENT,   DEPENDENT,       DEPENDENT
##VAR_FORM=  AFFN,          ASDF,            ASDF
##VAR_DIM=   131072,        131072,          131072
##UNITS=     HZ,            ARBITRARY UNITS, ARBITRARY UNITS
##FACTOR=    0.0627417313425165, 1,          1
##FIRST=     8223.62146879498, 2860,         -97751
##LAST=      0,             7172,            -98062
##MIN=       0,             -457607440,      0
##MAX=       8223.62146879498, 489007442,    0
$$ Real data points
##PAGE= N=1
##DATA TABLE= (X++(R..R)), XYDATA
$$ [...]
63562G04064K1226K3246K4439K5126K6980L0486L4313L7081L8741M0052M1551
63551A047305M3339M5254M6711M6636M4063L8889L1940K4336J6910J0148M369
63540A399900k83l920o814r159j1092j2833j4566j6099j7120j7955j9639k2747
63528A247673k6375k8871k9538k9088k8336k7064k4515k0677j6649j3746j2331
63517I90483j1493r930p275m360j926M98L772P442R957J0770J1143J2347J4084
63504A025512J5506J6860J8784K0716K1476K1373K2095K4260K6495K7603K8482
63493A269162L0904L5252M0344M4987M8654N0900N0999M8269M2297L3117K1759
63482A716644J0308P00o551j1988j5814j7712j7927j7556j7394j7230j6767j6774
$$ y = [704064, 725290, 748536, 772975, 798101, 825081, 855567, 889880, 926961, 965702, 1005754, 1047305, 1090644, 1135898, 1182609, 1229245, 1273308, 1312197, 1344137, 1368473, 1385383, 1395531, 1399900, 1399617, 1395697, 1388883, 1379724, 1368632, 1355799, 1341233, 1325134, 1308014, 1290059, 1270420, 1247673, 1221298, 1192427, 1162889, 1133801, 1105465, 1078401, 1053886, 1033209, 1016560, 1002814, 990483, 978990, 969060, 961785, 957425, 955499, 955997, 959769, 967211, 977168, 987938, 999081, 1011428, 1025512, 1041018, 1057878, 1076662, 1097378, 1118854, 1140227, 1162322, 1186582, 1213077, 1240680, 1269162, 1300066, 1335318, 1375662, 1420649, 1469303, 1520203, 1571202, 1619471, 1661768, 1694885, 1716644, 1726952, 1727652, 1721101, 1709113, 1693299, 1675587, 1657660, 1640104, 1622710, 1605480, 1588713, 1571939]
63470A571939j8603k2653k7778l2278l5200l6728l7645l8667m0112m1694m2535
63459A198046m1779l9648l7477l6091l4437l0876k5835k1894k0650k0717j9785
63448H68857j7612j5613j4308j2954j1312r976q864p209n376m907o139p324p058
63435G40205o017n268m353k509o34k66j235j918j330L00K539M815N941N219L874
63420G39363L857N222O185N676M253K416m0k610l852l544l505n197p681r064q791
63405G22688p500n664l744k769l330m398m432l302j942n75J339L605N159N758
63391G00893O545Q518J1226J3526J5007J6125J7344J8567J9396J9785K0456K2356
63379H89744K5648K9480L3050L6328L9197M0524L9031L5046L0466K6967K4860
$$ y = [1571939, 1553336, 1530683, 1502905, 1470627, 1435427, 1398699, 1361054, 1322387, 1282275, 1240581, 1198046, 1156267, 1116619, 1079142, 1043051, 1008614, 977738, 951903, 930009, 909359, 888642, 868857, 851245, 835632, 821324, 808370, 797058, 787082, 778218, 771009, 765633, 760726, 754587, 747263, 740205, 734188, 728920, 724567, 722058, 721424, 721158, 719923, 718005, 716675, 716975, 719514, 724329, 730270, 735489, 739363, 743220, 748442, 754627, 760303, 764556, 766972, 766932, 764322, 760470, 756926, 753421, 748224, 740543, 731479, 722688, 715188, 709524, 705780, 703011, 699681, 695283, 690851, 687549, 685607, 685032, 686371, 689976, 695135, 700893, 707438, 715956, 727182, 740708, 755715, 771840, 789184, 807751, 827147, 846932, 867388, 889744, 915392, 944872, 977922, 1014250, 1053447, 1093971, 1133002, 1168048, 1198514, 1225481, 1250341]
63368A250341K3652K2990K2943K4034K6991L1865L7367M1824M4852M7309M9547
63357A623715N0570M9192M5154L8803L0542K1126J1787L528l289q328j1184j2450
63345A839166j3947j6921k0575k3356k5259k7727l1502l5739l9364m2283m4805
63334A517688m6588m6676m4330l9788l4504l0507k8735k7875k5536k0909j5617
63323A156623j1677r293p139m216p03K640N286P200Q875J1021J3901J7126K0311
63310A209955K3536K6747K9222L0348L0639L1185L2409L4111L6429L9531M2456
63299A566568M3735M3511M3569M4547M4394M0712L3558K4760J5537O313j973q268
63287A896963j3001j7468k1625k4166k4952k5578k7024k8624l0103l2902l7954
$$ y = [1250341, 1273993, 1296983, 1319926, 1343960, 1370951, 1402816, 1440183, 1482007, 1526859, 1574168, 1623715, 1674285, 1723477, 1768631, 1807434, 1837976, 1859102, 1870889, 1874417, 1871128, 1862800, 1851616, 1839166, 1825219, 1808298, 1787723, 1764367, 1739108, 1711381, 1679879, 1644140, 1604776, 1562493, 1517688, 1471100, 1424424, 1380094, 1340306, 1305802, 1275295, 1246560, 1218685, 1193149, 1172240, 1156623, 1144946, 1135653, 1128514, 1124298, 1123595, 1126235, 1131521, 1138721, 1147596, 1158617, 1172518, 1189644, 1209955, 1233491, 1260238, 1289460, 1319808, 1350447, 1381632, 1414041, 1448152, 1484581, 1524112, 1566568, 1610303, 1653814, 1697383, 1741930, 1786324, 1827036, 1860594, 1885354, 1900891, 1907204, 1905231, 1896963, 1883962, 1866494, 1844869, 1820703, 1795751, 1770173, 1743149, 1714525, 1684422, 1651520, 1613566]
63276A613566m3491m6650m6541m4433m1655l8866l6773l5752l4775l2237k8147
63265A184246k4200k1365j8617j4831j1042r834j2561j7700k2055k3582k2962
63254I85497k2339k2647k2726k1306j8923j7201j6753j6767j6343j5271j3546
63243G81675j1157q530o495n544n556o171o952p357p132o658o447o601p246q840
63229F80989j1216j2858j2361j0288q433p449o526n264m299l932l610l120l040
63216E88593l547l976m005m093m309l978k966k116j855j641j327j625k528k722
63202E47905j530j17L13K39N90J100J153J123J487J735J622K382M899P642Q316
63187E78859P023N889O000O628P165P844Q613R107R836J1651J3858J4689J3939
$$ y = [1613566, 1570075, 1523425, 1476884, 1432451, 1390796, 1351930, 1315157, 1279405, 1244630, 1212393, 1184246, 1160046, 1138681, 1120064, 1105233, 1094191, 1084357, 1071796, 1054096, 1032041, 1008459, 985497, 963158, 940511, 917785, 896479, 877556, 860355, 843602, 826835, 810492, 795221, 781675, 770518, 761988, 755493, 749949, 744393, 738222, 731270, 723913, 716781, 710123, 703676, 697075, 689829, 680989, 669773, 656915, 644554, 634266, 625833, 618384, 611858, 606594, 602295, 598363, 594753, 591633, 588593, 585046, 581070, 577065, 572972, 568663, 564685, 561719, 559603, 557748, 556107, 554780, 553155, 550627, 547905, 546375, 546258, 546571, 546810, 547400, 548500, 549653, 550776, 552263, 553998, 555620, 558002, 562901, 570543, 578859, 585882, 591771, 597771, 604399, 611564, 619408, 628021, 637128, 646964, 658615, 672473, 687162, 701101]
63174G01101J3386J4165J5444J6250J6879J7679J8018J7471J6790J6620J6390
63163H80193J5492J4602J4683J5448J5879J5737J5480J5182J4510J3484J2351
63152A043041J0860Q491N388K451M00r30k403m802q025j0933j2273j1860j0552
63139A008853r115p596n864m093k469r03O59K083L338M589N977P704J0132J3118
63125A026413J5505J6212J5760J5675J6409J7123J7559J8542K0104K0782J9685
63114A219769J7903J6702J5559J3351J0485Q286O908N373L260Q84j881n489r502
63101A301608j2870j5563j8699k2704k6402k8411k8687k8278k8067k8073k7644
63090A036210k6026k3137j9857j7367j6162j5804j5450j4432j2668j0800r559
$$ y = [701101, 714487, 728652, 744096, 760346, 777225, 794904, 812922, 830393, 847183, 863803, 880193, 895685, 910287, 924970, 940418, 956297, 972034, 987514, 1002696, 1017206, 1030690, 1043041, 1053901, 1062392, 1067780, 1070231, 1070631, 1069701, 1067298, 1062496, 1054471, 1043538, 1031265, 1019405, 1008853, 999738, 992142, 986278, 982185, 979716, 978813, 979472, 981555, 984893, 989482, 995459, 1003163, 1013295, 1026413, 1041918, 1058130, 1073890, 1089565, 1105974, 1123097, 1140656, 1159198, 1179302, 1200084, 1219769, 1237672, 1254374, 1269933, 1283284, 1293769, 1302055, 1308963, 1314336, 1317596, 1318480, 1316599, 1311110, 1301608, 1288738, 1273175, 1254476, 1231772, 1205370, 1176959, 1148272, 1119994, 1091927, 1063854, 1036210, 1010184, 987047, 967190, 949823, 933661, 917857, 902407, 887975, 875307, 864507, 854948]
63079H54948q827p728n862l777k030o52P9n12j910j946Q06M945P901Q909Q881
63064H53225Q191O643N193N421P049P976P303O429O537O834O255N315N030N252
63050I42653N356N543O236O955O917O209N475N041N124O042P365P735O670N711
63036A029032O485Q177Q405O330L615K223K474L329L578K512K57k167l565l508
63022A067177k458j298j068k444m733n970n027l130k221k248j527N00K545L713
63008A041811M835O807R053J0582J1605J3009J4882J6592J7984J9556K1670K4265
62996A212651K7131K9941L2164L3558L4585L5865L7379L8709L9821M1118M2639
62985A605561M3715M3595M2192M0271L8875L8392L8097L6976L5085L3503L2720
$$ y = [854948, 846121, 838393, 832531, 828754, 826724, 826072, 826151, 825639, 823729, 821783, 822589, 827534, 835435, 844344, 853225, 861416, 868059, 873252, 878673, 885722, 893698, 901001, 907430, 913967, 920801, 927056, 932371, 937401, 942653, 948009, 953552, 959788, 966743, 973660, 979869, 985344, 990385, 995509, 1001551, 1008916, 1016651, 1023321, 1029032, 1035517, 1043694, 1052099, 1058429, 1062044, 1064267, 1066741, 1070070, 1073648, 1076160, 1076417, 1074250, 1070685, 1067177, 1064719, 1063421, 1062353, 1059909, 1055176, 1049206, 1044179, 1041049, 1038828, 1036580, 1035053, 1035553, 1038098, 1041811, 1046646, 1053453, 1062506, 1073088, 1084693, 1097702, 1112584, 1129176, 1147160, 1166716, 1188386, 1212651, 1239782, 1269723, 1301887, 1335445, 1370030, 1405895, 1443274, 1481983, 1521804, 1562922, 1605561, 1649276, 1692871, 1735063, 1775334, 1814209, 1852601, 1890698, 1927674, 1962759, 1996262, 2028982]
62974B028982L1745K9420K6007K2598J9332J5211R624L036l942j1254j8753k5577
62962B126429l0685l3606l4526l4197l3961l4949l6645l6878l4045k8855k3255
62951A764827j8165j3182q120l497N76M772R439J4039J8198K2343K6602K9883
62939A847715L1096L0801L0695L1603L2876L3621L3534L2483L0310K7529K5307
62928B187570K4116K2907K0209J5789J0631N547L61n628j2855k1161k9875l8093
62916B179518m5060n0401n4095n6454n8062n9317n9884n9069n6953n4610n2805
62905A572808n1112m8818m6078m3407m0626l7474l4737l3390l2633l0428k6516
62894A147589k3368k3138k4803k5663k4760k3347k2522k2081k1726k1663k1530
$$ y = [2028982, 2060727, 2090147, 2116154, 2138752, 2158084, 2173295, 2182919, 2185955, 2182013, 2170759, 2152006, 2126429, 2095744, 2062138, 2027612, 1993415, 1959454, 1924505, 1887860, 1850982, 1816937, 1788082, 1764827, 1746662, 1733480, 1725360, 1721863, 1722439, 1727211, 1736650, 1750689, 1768887, 1791230, 1817832, 1847715, 1878811, 1909612, 1940307, 1971910, 2004786, 2038407, 2071941, 2104424, 2134734, 2162263, 2187570, 2211686, 2234593, 2254802, 2270591, 2281222, 2286769, 2287130, 2281502, 2268647, 2247486, 2217611, 2179518, 2134458, 2084057, 2029962, 1973508, 1915446, 1856129, 1796245, 1737176, 1680223, 1625613, 1572808, 1521696, 1472878, 1426800, 1383393, 1342767, 1305293, 1270556, 1237166, 1204533, 1174105, 1147589, 1124221, 1101083, 1076280, 1050617, 1025857, 1002510, 979988, 957907, 936181, 914518, 892988]
62883H92988k0162j7270j4305j2695j1992j0877r369q687r083r212q060o458n978
62870G48840o996q470r231q803p235m883k471q75n58j355k698l843m112l423k553
62855F81334k331k553k183p97P47J431J299J090J094R99O73M40N49Q78J251J692
62839F85613K321L291M791O733Q386Q800P755O028M574L609K569Q13j554l477
62825G40252l788k511j051p60j737l443n836q861j1370j1926j0722r274q095o291
62811F54587l956l109m895p398p895o332m763m077l368k256j712k109k334j602
62797E98781o74m33m21J30Q36P49j55j031j317j125p77n64p35j219j577j500j085
62780E87883m72K36N87L2j098j650j091j54M62J070K083L002L208K956K660K048
$$ y = [892988, 872826, 855556, 841251, 828556, 816564, 805687, 796318, 787631, 778548, 769336, 761276, 754818, 748840, 741844, 733374, 724143, 715340, 708105, 703222, 700751, 699876, 699318, 697963, 695265, 691422, 687310, 683887, 681334, 679003, 676450, 674267, 673470, 674217, 675648, 676947, 678037, 679131, 680130, 680803, 681243, 681792, 682670, 683921, 685613, 687934, 691225, 696016, 702749, 711135, 719935, 727690, 733718, 738292, 741901, 744470, 745283, 743729, 740252, 736464, 733953, 732902, 732142, 730405, 726962, 721126, 712265, 700895, 688969, 678247, 668973, 660878, 654587, 650631, 647522, 642627, 635229, 627334, 621002, 616239, 612162, 608794, 606538, 604826, 602717, 600383, 598781, 598107, 597674, 597253, 597383, 598219, 598968, 598813, 597782, 596465, 595340, 594563, 593999, 593264, 592045, 590468, 588968, 587883, 587411, 587647, 588234, 588266, 587168, 585518, 584427, 584273, 584735, 585805, 587888, 590890, 594098, 597054, 599714, 601762]
62764F01762J091Q70K103L510L364K258K368M007N020M120K879L340N192O650
62750F48534O982O762O355N640M915M860N594O716Q076R704J1081J1504J1194
62737G47917J1208J2084J3310J4356J5406J6678J7761J8342J9221K1779K6349
62726I34411L1559L5656L8148L9913M1879M4032M5905M7535M9392N1454N2955
62715A412839N3260N2523N1130M8867M5116L9689L3002K5442J7019P768j778j0785
62703A774092j8650k5310l1077l6166m0357m3212m4726m5625m6742m8153m9171
62692A344903m9105m7804m5474m2448l9298l6792l5278l4201l2554k9891k6647
62681I25411k3466k0570j8000j6108j5282j5134j4446j2288r078o251m926m990
$$ y = [601762, 602853, 603723, 605826, 609336, 612700, 614958, 617326, 621333, 626353, 630473, 633352, 636692, 641884, 648534, 655516, 662278, 668633, 674273, 679188, 684048, 689642, 696358, 704434, 714138, 725219, 736723, 747917, 759125, 771209, 784519, 798875, 814281, 830959, 848720, 867062, 886283, 908062, 934411, 965970, 1001626, 1039774, 1079687, 1121566, 1165598, 1211503, 1259038, 1308430, 1359884, 1412839, 1466099, 1518622, 1569752, 1618619, 1663735, 1703424, 1736426, 1761868, 1778887, 1786655, 1784877, 1774092, 1755442, 1730132, 1699055, 1662889, 1622532, 1579320, 1534594, 1488969, 1442227, 1394074, 1344903, 1295798, 1247994, 1202520, 1160072, 1120774, 1083982, 1048704, 1014503, 981949, 952058, 925411, 901945, 881375, 863375, 847267, 831985, 816851, 802405, 790117, 781039, 774788, 769862, 764872]
62669G64872n350m842l035m36K022L853N398P087Q591R102Q542Q010Q678J0606
62655H23098J2868J4714J6229J8021K0573K3821K7129K9835L2062L4858L9073
62644A092281M4148M8498N1249N3123N5304N7941O0338O2263O4238O6345O7605
62633A723333O7101O5186O2787N9692N4358M5700L4452K2468J1051L77r931k0199
62621B116375l0507m0599m9909n7852o4014o8020o9609o9106o7455o5454o3268
62610A470582o0962n8962n7343n5191n1591m6991m2730l9460l6948l5154l4159
62599I51091l2986l0098k5624k1683j9603j8140j5627j2733j1424j1854j2117
62588G39202j1051r615r044r111q864q103p224o283n050l713k897l032l877m565
$$ y = [764872, 759522, 754680, 751645, 751209, 753231, 757084, 762482, 769569, 778160, 787262, 795804, 803814, 812492, 823098, 835966, 850680, 866909, 884930, 905503, 929324, 956453, 986288, 1018350, 1053208, 1092281, 1136429, 1184927, 1236176, 1289299, 1344603, 1402544, 1462882, 1525145, 1589383, 1655728, 1723333, 1790434, 1855620, 1918407, 1978099, 2032457, 2078157, 2112609, 2135077, 2146128, 2146505, 2136574, 2116375, 2085868, 2045269, 1995360, 1937508, 1873494, 1805474, 1735865, 1666759, 1599304, 1533850, 1470582, 1409620, 1350658, 1293315, 1238124, 1186533, 1139542, 1096812, 1057352, 1020404, 985250, 951091, 918105, 888007, 862383, 840700, 821097, 802957, 787330, 774597, 763173, 751319, 739202, 728151, 718536, 709492, 700381, 691517, 683414, 676190, 669907, 664857, 661144, 658247, 655215, 651338, 646773]
62574F46773m095k332o12o50k423l797k991q35K79n42j773j785r12n17p86n58
62558F22444P60K264K940L084L623M554N026M830M747N206N613N571N923P626
62544F84211J0067J1625J1875J2126J3533J5562J6932J7484J8284K0133K2566
62533H54398K4409K4895K4140K2768K1297J9755J7710J4660J0480N768J719o96
62521A041303j830l380o794j1581j5780j8181j9534k1188k3231k4633k4724k3692
62509H46755k1773j9049j6318j5095j5891j7110j6524j3756j0547q603p933p353
62497F76803n975l936k252k147l830n768n911m128k574k884l858l097l21K349
62483F32471L257K827K154J575J345K318M698P034P706P017O692P593Q941R766
$$ y = [646773, 642678, 640346, 639734, 639084, 636661, 632864, 629873, 629038, 629317, 628775, 627002, 625217, 624305, 623788, 623002, 622444, 623204, 625468, 628408, 631492, 635115, 639669, 644695, 649525, 654272, 659478, 665091, 670662, 676585, 684211, 694278, 705903, 717778, 729904, 743437, 758999, 775931, 793415, 811699, 831832, 854398, 878807, 903702, 927842, 950610, 971907, 991662, 1009372, 1024032, 1034512, 1040280, 1041999, 1041303, 1039473, 1036093, 1029299, 1017718, 1001938, 983757, 964223, 943035, 919804, 895171, 870447, 846755, 824982, 805933, 789615, 774520, 758629, 741519, 724995, 711239, 700692, 692089, 684156, 676803, 670828, 666892, 664640, 662493, 658663, 652895, 646984, 642856, 640282, 637398, 633540, 630443, 630122, 632471, 635728, 638555, 640709, 642284, 643629, 645947, 650645, 657679, 665385, 672402, 679094, 686687, 695628, 705394]
62469G05394J0041J0344J1177J2796J5058J7273J8889K0340K2553K5450K7835
62458H97150K9125L0393L2889L6201L8892M0746M3111M6526M9201M8976M6255
62447A339465M3459M1486L8403L2635K6028K1893K0619J9258J5607J0692O552
62436A616097L509R66o14k21J961N012Q805J3624J8693K2880K6686L1708L7841
62423A786947M2664M4296M3550M2311M0831L7560L1240K2358J2683L750m437j3249
62411B090504k3658l4680m4192n1141n6191o0187o3159o5081o6465o7374o6667
62400A491709o3261n7808n2350m8339m5472m2447l8462l3936k9926k6877k4262
62389A028569k1557j9159j7691j6686j4867j1843q741o920o582o798o345m611
$$ y = [705394, 715435, 725779, 736956, 749752, 764810, 782083, 800972, 821312, 843865, 869315, 897150, 926275, 956668, 989557, 1025758, 1064650, 1105396, 1148507, 1195033, 1244234, 1293210, 1339465, 1382924, 1424410, 1462813, 1495448, 1521476, 1543369, 1563988, 1583246, 1598853, 1609545, 1616097, 1619606, 1620572, 1619958, 1619737, 1621698, 1626710, 1635515, 1649139, 1667832, 1690712, 1717398, 1749106, 1786947, 1829611, 1873907, 1917457, 1959768, 2000599, 2038159, 2069399, 2091757, 2104440, 2108190, 2103753, 2090504, 2066846, 2032166, 1987974, 1936833, 1880642, 1820455, 1757296, 1692215, 1625750, 1558376, 1491709, 1428448, 1370640, 1318290, 1269951, 1224479, 1182032, 1143570, 1109634, 1079708, 1052831, 1028569, 1007012, 987853, 970162, 953476, 938609, 926766, 918025, 911105, 904523, 897725, 891380, 886769]
62377H86769k238q66j512l346m858n925p527r598j0672j0011q583p492o806o597
62363H00738p581r685j1300j1109r747q512p442n915m310l645m018m526m457l617
62349G04874k121p59q19k455l852l259j257K39P79J638L556N607O508N974M850
62334G19503M621O469R824J2237J1910R909Q643Q654Q612Q280R377J2845J7028
62321H47912J9619K0406K0955K2190K3317K3112K1668K0581K1303K3578K6015
62310A090656K8194L1135L5274L9351M2364M5282M9244N3258N5779N7848O2094
62299A590479O8803P5467Q0343Q3923Q6336Q6006Q2189P6602P0834O3883N3888
62288B418753M1016K7091J3410M47j1180k0847k8586l4741l9682m4433n0264n6770
$$ y = [886769, 884531, 883665, 882153, 878807, 873949, 868024, 860497, 850899, 840227, 830216, 821633, 814141, 807335, 800738, 793157, 783472, 772172, 761063, 751316, 742804, 735362, 729447, 725137, 721492, 717474, 712948, 708491, 704874, 702753, 701994, 701175, 698720, 694868, 691609, 690352, 690591, 691370, 693008, 696564, 702171, 708679, 714653, 719503, 724124, 730593, 740417, 752654, 764564, 774473, 783116, 791770, 800382, 808662, 818039, 830884, 847912, 867531, 887937, 908892, 931082, 954399, 977511, 999179, 1019760, 1041063, 1064641, 1090656, 1118850, 1149985, 1185259, 1224610, 1266974, 1312256, 1361500, 1414758, 1470537, 1528385, 1590479, 1659282, 1734749, 1815092, 1899015, 1985351, 2071357, 2153546, 2230148, 2300982, 2364865, 2418753, 2459769, 2486860, 2500270, 2500717, 2489537, 2468690, 2440104, 2405363, 2365681, 2321248, 2270984, 2214214]
62276B214214o1620o3392o3298o2900o1636n8401n4192n0974m8687m5633m1479
62265A602002l7765l5479l4076l3007l2525l2623l2690l2559l2658l2820l2071
62254A233729k9892k6836k3903k2075k2031k3153k3219k0579j6387j3191j1598
62243A000865j0223q664q156q757q404n918k931j285l34J428L443L946K941K247
62229I60198K870M128N430P179R451J1155J1327J0496J0089J0893J2530J4188
62217A069934J5420J6330J7275J8447J9847K1568K3863K6763K9885L2837L5624
62206A327793L8525M1771M5543N0028N5122O0245O4835O9034P3585P8894Q4249
62195A989624Q8124Q9415Q8340Q5794Q1794P5113O4905N2107L8461K4664J0529
$$ y = [2214214, 2152594, 2089202, 2025904, 1963004, 1901368, 1842967, 1788775, 1737801, 1689114, 1643481, 1602002, 1564237, 1528758, 1494682, 1461675, 1429150, 1396527, 1363837, 1331278, 1298620, 1265800, 1233729, 1203837, 1177001, 1153098, 1131023, 1108992, 1085839, 1062620, 1042041, 1025654, 1012463, 1000865, 990642, 981978, 973822, 965065, 956661, 950743, 947812, 946527, 946193, 947621, 951064, 955010, 957951, 960198, 963068, 967196, 972626, 979805, 989256, 1000411, 1011738, 1022234, 1032323, 1043216, 1055746, 1069934, 1085354, 1101684, 1118959, 1137406, 1157253, 1178821, 1202684, 1229447, 1259332, 1292169, 1327793, 1366318, 1408089, 1453632, 1503660, 1558782, 1619027, 1683862, 1752896, 1826481, 1905375, 1989624, 2077748, 2167163, 2255503, 2341297, 2423091, 2498204, 2563109, 2615216, 2653677, 2678341, 2688870]
62184B688870l356j5563k5735l5237m5376n5897o5653p3659p9030q1183q1004
62173B127177q0577q0564p9015p4190o7555o2222n8984n5875n1445m6490m2162
62162A428098l8272l4225l0317k7181k4828k3016k1664k0376j8261j4965j1313
62151A163680q446o838o363o498o169m340j400R61J820K176L393N471P648R670
62137A154765J1428J2294J2149J2387J4378J7384J9432J9944J9982K0146K0049
62126A334338J9910K0761K2482K3357K2517K1299K1155K1473K0810J9260J8062
62115A565424J7562J7210J7382J9636K4782L1672L8286M3421M7165N0287N3386
62104A926213N6265N8117N8367N6924N3350M6657L6849K6035J6670Q968J275p085
$$ y = [2688870, 2685514, 2669951, 2644216, 2608979, 2563603, 2507706, 2442053, 2368394, 2289364, 2208181, 2127177, 2046600, 1966036, 1887021, 1812831, 1745276, 1683054, 1624070, 1568195, 1516750, 1470260, 1428098, 1389826, 1355601, 1325284, 1298103, 1273275, 1250259, 1228595, 1208219, 1189958, 1174993, 1163680, 1155234, 1148396, 1142033, 1135535, 1129366, 1125026, 1123626, 1124587, 1126407, 1128583, 1131976, 1137447, 1145095, 1154765, 1166193, 1178487, 1190636, 1203023, 1217401, 1234785, 1254217, 1274161, 1294143, 1314289, 1334338, 1354248, 1375009, 1397491, 1420848, 1443365, 1464664, 1485819, 1507292, 1528102, 1547362, 1565424, 1582986, 1600196, 1617578, 1637214, 1661996, 1693668, 1731954, 1775375, 1822540, 1872827, 1926213, 1982478, 2040595, 2098962, 2155886, 2209236, 2255893, 2292742, 2318777, 2335447, 2344415, 2345690, 2338605]
62092B338605j4935k1461k7617l4450m1301m6788n0655n3408n4881n4568n3044
62081A885497n1538m9992m6908m1687l6044l2168l0056k7576k3185j7761j3441
62070A515141j1175j0013q709p279o548o541o139m379j518J345L390M597N618
62057A467790P292R759J1689J0967O835J202k746l359j733k75l96j727l238m835
62043A497225p450j1402j5262j7154j6990j6255j5535j3639r887n845l470k468
62031A361868j100J040K867M213O414R984J3455J5390J6334J7792K0232K3132
62019A491621K6195K9382L2061L3317L3212L3035L4095L6449L8889M0120M0129
62008A868505M0273M1672M3696M4684M4039M2581M0803L8005L3604K8088K1862
$$ y = [2338605, 2323670, 2302209, 2274592, 2240142, 2198841, 2152053, 2101398, 2047990, 1993109, 1938541, 1885497, 1833959, 1783967, 1737059, 1695372, 1659328, 1627160, 1597104, 1569528, 1546343, 1528582, 1515141, 1503966, 1493953, 1485244, 1477965, 1471417, 1464876, 1458737, 1454358, 1452840, 1454185, 1457575, 1462172, 1467790, 1475082, 1484841, 1496530, 1507497, 1514332, 1515534, 1512788, 1509429, 1507696, 1507421, 1507025, 1505298, 1502060, 1497225, 1489775, 1478373, 1463111, 1445957, 1428967, 1412712, 1397177, 1383538, 1373651, 1367806, 1364336, 1361868, 1360768, 1361808, 1364675, 1368888, 1375302, 1385286, 1398741, 1414131, 1430465, 1448257, 1468489, 1491621, 1517816, 1547198, 1579259, 1612576, 1645788, 1678823, 1712918, 1749367, 1788256, 1828376, 1868505, 1908778, 1950450, 1994146, 2038830, 2082869, 2125450, 2166253, 2204258, 2237862, 2265950, 2287812]
61997B287812J4376N486l340j0533j6491k2712k9417l5477m0418m4891m9132n2425
61985B002838n4393n5527n6132n5899n4863n3630n2328n0486m8288m6654m5424
61974A429214m2844l7950l2361k8467k6541k4872k2303j9348j6973j5411j4397
61963A147747j3796j3701j4310j5639j7087j7666j7119j6407j6466j6827j6276
61952I72453j4539j2499j0794r192p377n553l951k420p51J063L010M997O565P114
61938I28126O527N094K955K79k081l073k819k639l366m469n354o516q523j0620
61924H93521j1485j1100j0745j1131j1530j1032r775q410p069n560m305m165n169
61911G82045o015n365l438j733j177j067k04J368K452K385J973K465M109O117
$$ y = [2287812, 2302188, 2307674, 2304334, 2293801, 2277310, 2254598, 2225181, 2189704, 2149286, 2104395, 2055263, 2002838, 1948445, 1892918, 1836786, 1780887, 1726024, 1672394, 1620066, 1569580, 1521292, 1474638, 1429214, 1386370, 1348420, 1316059, 1287592, 1261051, 1236179, 1213876, 1194528, 1177555, 1162144, 1147747, 1133951, 1120250, 1105940, 1090301, 1073214, 1055548, 1038429, 1022022, 1005556, 988729, 972453, 957914, 945415, 934621, 925429, 918052, 912499, 908548, 906128, 905377, 906440, 909450, 914447, 921012, 928126, 934653, 939747, 942702, 942981, 940900, 937827, 935008, 932369, 929003, 924534, 919180, 912664, 904141, 893521, 882036, 870936, 860191, 849060, 837530, 826498, 816723, 808313, 801244, 795684, 791379, 787214, 782045, 776030, 770665, 767227, 765494, 764317, 763250, 763046, 764414, 766866, 769251, 771224, 773689, 777798, 783915]
61897G83915P734R004J0519J2652J4994J6604J7001J6927J7799K0354K4057K7903
61885I79463L1356L4367L7098L9913M3152M6471M8802M9536M9464M9974N1398
61874A460994N2662N2514N0631M7546M3948M0232L6432L2308K7584K2162J6280
61863A883293J0562N773K113j183n040r073j1469j0767p407l137Q27M700R400
61850A868592J5252K1228K5467K6984K6865K6949K7193K5464K0490J3750P467
61839B105701J822m372j1280j7996k4302l0485l5604l7968l7631l6549l5952l5313
61827A800071l4372l4135l4916l5236l4038l2640l2877l4391l5198l4161l1555
61816A426552k7967k4042k0839j9048j7983j6334j3610r996n535n26L876O780
$$ y = [783915, 791649, 800653, 811172, 823824, 838818, 855422, 872423, 889350, 907149, 927503, 951560, 979463, 1010819, 1045186, 1082284, 1122197, 1165349, 1211820, 1260622, 1310158, 1359622, 1409596, 1460994, 1513656, 1566170, 1616801, 1664347, 1708295, 1748527, 1784959, 1817267, 1844851, 1867013, 1883293, 1893855, 1899628, 1901741, 1900558, 1895518, 1886445, 1874976, 1864209, 1856802, 1853665, 1854492, 1859192, 1868592, 1883844, 1905072, 1930539, 1957523, 1984388, 2011337, 2038530, 2063994, 2084484, 2098234, 2105701, 2107523, 2103151, 2091871, 2073875, 2049573, 2019088, 1983484, 1945516, 1907885, 1871336, 1835384, 1800071, 1765699, 1731564, 1696648, 1661412, 1627374, 1594734, 1561857, 1527466, 1492268, 1458107, 1426552, 1398585, 1374543, 1353704, 1334656, 1316673, 1300339, 1286729, 1276733, 1271198, 1270672, 1274548, 1281328]
61804A281328R005J2280J7173K2725K7733L1547L4246L7091M1970M9073N5955
61793A620126O0425O3436O7243P1539P4022P4384P4755P5813P5392P1919O6542
61782B395596O0350N2013M0329K7108J5239N215m162j2639j8482k1061k1223j9301
61770B498982j4781q148j285M298Q419J1256J2752J3184J3045J1915Q426J616
61758B559679q256k0144l2568m3767n2641n9587o5437o9714p1252p0570o9996
61747A995747p0892p2105p1782o9542o6088o1797n6814n1825m7699m4619m2133
61736A340451l9726l6927l3399k9471k6053k3616k1755k0088j8811j7967j6950
61725A055688j5405j3792j2425j0770q571o806o427o854o829o190n530m622k774
$$ y = [1281328, 1290333, 1302613, 1319786, 1342511, 1370244, 1401791, 1436037, 1473128, 1515098, 1564171, 1620126, 1680551, 1743987, 1811230, 1882769, 1956791, 2031175, 2105930, 2181743, 2257135, 2329054, 2395596, 2455946, 2507959, 2548288, 2575396, 2590635, 2595850, 2591688, 2579049, 2560567, 2539506, 2518283, 2498982, 2484201, 2476053, 2474768, 2479066, 2487485, 2498741, 2511493, 2524677, 2537722, 2549637, 2558063, 2559679, 2551423, 2531279, 2498711, 2454944, 2402303, 2342716, 2277279, 2207565, 2136313, 2065743, 1995747, 1924855, 1852750, 1780968, 1711426, 1645338, 1583541, 1526727, 1474902, 1427203, 1382584, 1340451, 1300725, 1263798, 1230399, 1200928, 1174875, 1151259, 1129504, 1109416, 1090605, 1072638, 1055688, 1040283, 1026491, 1014066, 1003296, 994725, 987919, 981492, 974638, 967809, 961619, 956089, 951467, 948693]
61712I48693n22O97O64P19J668K825L640M843P023R267J0265J0016R485R210R166
61697A027659R433R894R650P765M615J584n05k008l558n353p394r658j1745j2976
61683A017403j3182j2938j2802j2666j2173j1408j0723j0038q791o758m597l265
61671H98062k873k447j081R05K347K636K247J832J449R56N63M84N02L46J56J10
61655I06194l9m89r24j152j767l307n153o259o743p571q679q811p578o389o622
61640H34711p863q809r048q939q475p440o330n894n862n276m217m062n493p149
61626G39854p058n118l237l022l990m528m093l674l990m244l393j953j391j856
61612F88307j905p38N63P68L59N45J234J275L86m14k83N67J609K727L975N230
$$ y = [948693, 948171, 948868, 949532, 950251, 951919, 954744, 958384, 963227, 970250, 979517, 989782, 999798, 1009283, 1018493, 1027659, 1037092, 1046986, 1056636, 1064401, 1069016, 1070600, 1070095, 1068087, 1064529, 1059176, 1051782, 1042124, 1030379, 1017403, 1004221, 991283, 978481, 965815, 953642, 942234, 931511, 921473, 912682, 905924, 901327, 898062, 895189, 892742, 891661, 892566, 894913, 897549, 899796, 901628, 903077, 904033, 904596, 905080, 905582, 905928, 906084, 906194, 906155, 905666, 904742, 903590, 901823, 898516, 893363, 887104, 880361, 872790, 864111, 855300, 847722, 841333, 834711, 826848, 818039, 808991, 800052, 791577, 784137, 777807, 771913, 766051, 760775, 756558, 752496, 747003, 739854, 732796, 727678, 724441, 721419, 717429, 712901, 708808, 705134, 701144, 696900, 693507, 691554, 690163, 688307, 686402, 685664, 686227, 686995, 687354, 687899, 689133, 690408, 690794, 690380, 690097, 690664, 692273, 695000, 698975, 704205]
61596G04205O345P173P514P438P527Q128Q556P863O322N326N689O781P505P423
61582H03795O886O636P242Q184P754M939J218q79j105j758m095o285o135m424
61568H21973l881n552p907r204r246q766q308p977p511o515n205m560n032n503
61554G26806m615k887k219l358n138o449p572q954r996j0046r625r654r986r930
61540F26377r691j0049j0554r463o139k606j647l674o412p656p359o572n502l761
61526E35292j990j583k535l033j977o96j031k606l404k499p79Q23K207L193L207
61511E22589K371J577J065J73j027j210K31J900K161J270O16P10J176J967L282
61496E38851M599N120M834M123K803P99p05m25R60J635J414J714K652K428N21
$$ y = [704205, 710550, 717723, 725237, 732675, 740202, 748330, 756886, 764749, 771071, 776397, 782086, 788867, 796372, 803795, 810681, 817317, 824559, 832743, 840497, 845436, 846654, 845775, 844670, 842912, 838817, 832532, 826397, 821973, 818092, 812540, 804633, 795429, 786183, 777417, 769109, 761132, 753621, 747106, 741901, 737341, 732309, 726806, 722191, 719304, 717085, 713727, 708589, 702140, 694568, 685614, 675618, 665572, 655947, 646293, 636307, 626377, 616686, 606637, 596083, 586620, 580481, 577875, 576228, 572554, 566142, 558486, 551127, 544555, 539053, 535292, 533302, 531719, 529184, 526151, 524174, 523478, 522447, 519841, 516437, 513938, 513159, 513982, 516189, 519382, 522589, 524960, 526537, 527602, 527775, 526748, 525538, 525769, 527669, 529830, 531100, 531716, 532426, 533602, 535569, 538851, 543450, 548570, 553404, 557527, 560330, 561129, 560424, 559999, 560959, 562594, 564008, 565722, 568374, 570802, 571323]
61481E71323p32O94L444M834M656M701N277M761K729J215J858L468L616J723n74
61466F12993j586j172l62j70p94j641j979j568p01K09P28M01p84k025k368j761
61450E97420r48l78J90R49J746K501L216L444K716J650J616K818L743L205J927
61435F25815J326J655K432L759N821P515P172M724J916J42q11j612k108j799q35
61420F55112K24J250K500L796M246L071O28j580k278j763j369j623j662q34J04
61405F59822K16k7L74J101R27j88q41j34J267K253K425J913J159R87J965L454
61389F76673M344M671N308O028N605M178L668M962O325N816L881K265J697K037
61375G37458L501N973P921P880O456N311M648L446J780J001J532K372K932L727
$$ y = [571323, 570591, 571285, 574729, 579563, 584219, 588920, 594197, 598958, 601687, 602902, 604760, 608228, 611844, 613567, 612993, 611407, 610235, 609873, 609703, 608909, 607268, 605289, 603721, 603020, 603229, 603957, 604358, 603574, 601549, 599181, 597420, 596472, 596094, 596284, 597233, 598979, 601480, 604696, 608140, 610856, 612506, 614122, 616940, 620683, 623888, 625815, 627141, 628796, 631228, 634987, 640808, 648323, 655495, 660219, 662135, 662277, 661466, 659854, 657746, 655947, 655112, 655336, 656586, 659086, 662882, 667128, 670199, 670827, 669247, 666969, 665206, 663837, 662214, 660552, 659718, 659822, 660038, 660011, 660385, 661486, 662413, 662225, 661384, 661250, 662517, 664770, 667195, 669108, 670267, 671254, 673219, 676673, 681017, 685688, 690996, 697024, 702629, 706807, 710475, 715437, 721762, 727578, 731459, 733724, 735421, 737458, 740959, 746932, 754853, 762733, 769189, 774500, 779148, 782594, 784374, 785375, 786907, 789279, 792211, 795938]
61361G95938M786M950L508J357j07l54L57J401J729M30k017l883m110l429l068
61346G97488l266l668m399n703o929o768m739j977k85k94p78j51J392K017Q53
61331G62793o27p91k43n94j621j664m27Q40J916L845O117O371M161K551L924O357
61315G92908O594N044M911P062Q834Q116O052M955N445O685P858Q340P481N359
61301H85644L246K577L611N427O944P746Q345R662J1965J4369J5843J6359J6505
61288A008243J6379J5778J5022J4440J3256J0503P059N216N702O608O034M376
61276A128616L032K138R18n72j612k351l708n901q073r442r830r244p945o858
61262A069168o861p475p285n819m067k889j962q28J51O90J531L337N241N779N172
$$ y = [795938, 800724, 805674, 809182, 810539, 810432, 810078, 810435, 811836, 813565, 813995, 811978, 808095, 803985, 800556, 797488, 794222, 790554, 786155, 780452, 773523, 766755, 762016, 760039, 759754, 759460, 758682, 758531, 759923, 761940, 762793, 762166, 761375, 761132, 760538, 758917, 757253, 756826, 757666, 759582, 763427, 769544, 775915, 780076, 782627, 786551, 792908, 799502, 804546, 809457, 816519, 825353, 833469, 839521, 844476, 849921, 856606, 864464, 872804, 880285, 885644, 888890, 891467, 895078, 900505, 907449, 915195, 923540, 933202, 945167, 959536, 975379, 991738, 1008243, 1024622, 1040400, 1055422, 1069862, 1083118, 1093621, 1100680, 1105896, 1111598, 1118206, 1124240, 1128616, 1131648, 1133786, 1134704, 1134132, 1132520, 1130169, 1126461, 1120560, 1112487, 1103045, 1093215, 1083971, 1076026, 1069168, 1062307, 1054832, 1047547, 1041728, 1037661, 1034772, 1032810, 1031982, 1032133, 1032823, 1034354, 1037691, 1042932, 1048711, 1053883]
61247A053883N448P942J1625J4235J4461J2540R464O231L385O57k690o563r436
61234A121182r820q151o422n989o555p295p862p897o767m651l019k887l145j884
61220A038838R55L596N008N972P301Q541R209R970J1466J2994J3614J3741J4200
61207A155405J4303J2688J0009Q864J0559J3505J5594J6757J8046J9370J9669
61196A314769J8655J6967J4870J2223R582P972P289O081L361k75l627o145p755
61183A393967q522r115j0725j3589j6159j6783j5856j5288j5919j6501j5518j3182
61171A226810j1015r928r366q354o844n627n016m264k687j024p99k317m128m845
61157A150596m687m533m266l064r96P00R77q2j605k536k108n48P48O75J1O38L033
$$ y = [1053883, 1059331, 1067273, 1078898, 1093133, 1107594, 1120134, 1129598, 1135829, 1139214, 1139871, 1137181, 1130618, 1121182, 1111362, 1103211, 1096789, 1090800, 1084245, 1076950, 1069088, 1061191, 1054424, 1049773, 1046754, 1043867, 1040722, 1038838, 1039793, 1043389, 1048397, 1054369, 1061670, 1070211, 1079420, 1089390, 1100856, 1113850, 1127464, 1141205, 1155405, 1169708, 1182396, 1192405, 1201269, 1211828, 1225333, 1240927, 1257684, 1275730, 1295100, 1314769, 1333424, 1350391, 1365261, 1377484, 1387066, 1395038, 1402327, 1408408, 1411769, 1411494, 1407867, 1401722, 1393967, 1385445, 1376330, 1365605, 1352016, 1335857, 1319074, 1303218, 1287930, 1272011, 1255510, 1239992, 1226810, 1215795, 1205867, 1196501, 1188147, 1181303, 1175676, 1170660, 1166396, 1163709, 1162685, 1161886, 1159569, 1155441, 1150596, 1145909, 1141376, 1137110, 1134046, 1133050, 1133750, 1134727, 1134645, 1133040, 1130504, 1128396, 1127848, 1128596, 1129271, 1129282, 1129920, 1132953]
61140A132953N639P081P942R616J2297J4992J6960J8180J8672J8234J6871J4889
61128A294326J2561R998P354M883K947K058K484L506L600J975m03j941k257k338
61114A338753l036m239n474o547p373p851q235r072j0392j1395j1400j0899j1098
61101A231742j2515j4406j5657j5768j4852j3075j0622q094o352n707n627n409
61089A103658m888m278l675l224l478m942p276r453j0790j1409j1704j1920j2199
61076A004422j2445j1984r995o604l075o28M96Q07J006J925M117P102R624J1233
61062I96001J2927J5554J8281J9531J9105J8352J8395J9185K0262K1528K2862
61051A201983K3650K3259K1775J9999J8823J8517J8445J7515J5171J1967Q875
$$ y = [1132953, 1138592, 1145673, 1153615, 1163231, 1175528, 1190520, 1207480, 1225660, 1244332, 1262566, 1279437, 1294326, 1306887, 1316885, 1324239, 1329122, 1332069, 1334127, 1336611, 1340117, 1343717, 1345692, 1345289, 1343348, 1341091, 1338753, 1335717, 1331478, 1326004, 1319457, 1312084, 1304233, 1295998, 1286926, 1276534, 1265139, 1253739, 1242840, 1231742, 1219227, 1204821, 1189164, 1173396, 1158544, 1145469, 1134847, 1126753, 1120401, 1114694, 1109067, 1103658, 1098770, 1094492, 1090817, 1087593, 1084115, 1079173, 1071897, 1062444, 1051654, 1040245, 1028541, 1016621, 1004422, 991977, 979993, 969998, 963394, 960319, 959691, 960187, 960994, 962000, 963925, 968042, 975144, 984768, 996001, 1008928, 1024482, 1042763, 1062294, 1081399, 1099751, 1118146, 1137331, 1157593, 1179121, 1201983, 1225633, 1248892, 1270667, 1290666, 1309489, 1328006, 1346451, 1363966, 1379137, 1391104, 1399979]
61040A399979O170L293k68m269p933j0566j1919j2272j2279j2589j3404j4359
61028A309584j4898j4775j4194j3401j2350j0986r853r691j0158r705p483m744
61016A177346l262k825j686O57K666L118K760K979M085N672P523R322J0526J1345
61002A230226J2794J5043J6928J7965J9483K2501K5798K7714K8760L0775L4259
60991A482246L8198M1810M4828M6873M8273N0770N5535O1125O5395O8716P3060
60980B076829P8544Q3512Q7841R3253J00002J06089J10572J15183J21600J29365
60970C102790J37626J46845J57436J68391J78545J87907J96971K06248K17185
60961D699944K31700K49944K70317K92526L18475L49066L82317M16223M51887
$$ y = [1399979, 1406149, 1409442, 1409174, 1404905, 1396972, 1386406, 1374487, 1362215, 1349936, 1337347, 1323943, 1309584, 1294686, 1279911, 1265717, 1252316, 1239966, 1228980, 1219127, 1209436, 1199278, 1189573, 1182090, 1177346, 1174084, 1171259, 1169573, 1170230, 1172896, 1176014, 1178774, 1181753, 1185838, 1191510, 1199033, 1208355, 1218881, 1230226, 1243020, 1258063, 1274991, 1292956, 1312439, 1334940, 1360738, 1388452, 1417212, 1447987, 1482246, 1520444, 1562254, 1607082, 1653955, 1702228, 1752998, 1808533, 1869658, 1935053, 2003769, 2076829, 2155373, 2238885, 2326726, 2419979, 2519981, 2626070, 2736642, 2851825, 2973425, 3102790, 3240416, 3387261, 3544697, 3713088, 3891633, 4079540, 4276511, 4482759, 4699944, 4931644, 5181588, 5451905, 5744431, 6062906, 6411972, 6794289, 7210512, 7662399]
60952G662399M92899N43561O08206O89372P85279Q92072J009896J143405J295432
60943A5122521J465673J657955J881582K140286K427252K735690L054949L327727
60935C3813635L416156L159516K514241J640112Q17835K61985J3508l905J25132
60926D5758215L22274M51153L19245j95243j016380j897436k587901k977934l103997
60917C5071996l058343k915435k720468k503461k283176k066307j854603j652005
60909A6018198j462568j286663j124067r78039q52613p47838o60590n88173n28552
60900G789095m78758m35966l99154l67662l39198l11290k83715k57667k33596
60891D682089k11716j93482j80234j70828j62578j54199j46239j38990j31823
$$ y = [7662399, 8155298, 8698859, 9307065, 9996437, 10781716, 11673788, 12683684, 13827089, 15122521, 16588194, 18246149, 20127731, 22268017, 24695269, 27430959, 30485908, 33813635, 37229791, 40389307, 42903548, 44543660, 45361495, 45623480, 45636988, 45633083, 45758215, 46080489, 46531642, 46850887, 46655644, 45639264, 43741828, 41153927, 38175993, 35071996, 32013653, 29098218, 26377750, 23874289, 21591113, 19524806, 17670203, 16018198, 14555630, 13268967, 12144900, 11166861, 10314248, 9566410, 8905820, 8317647, 7789095, 7310337, 6874371, 6475217, 6107555, 5768357, 5457067, 5173352, 4915685, 4682089, 4470373, 4276891, 4096657, 3925829, 3763251, 3609052, 3462813, 3323823, 3192000]
60882C192000j24452j17336j10693j04362r8520r3533q9245q5377q2197p9735
60872B206550p6847p2477o7453o3581o1032n8176n4075m9684m6171m3318m0280
60861A573456l6901l3635l0712k8015k5434k2964k0613j8410j6367j4465j2787
60850A313153j1513j0603r795r109q923r199r275q783q207p910p409o413n903
60837A200111o984r125j0756j1434j2198j3715j5256j5787j5153j3843j2459j1738
60825A051663j2466j4741j7603j9644k0043j9099j7923j7338j6933j5701j3777
60814H66395j2645j3028j3593j2853j1355j0491r873p810m316j638j349k482l117
60801G61845k472q77R76K103J749M77k66k25o55k000k681j306J252L211M186M756
$$ y = [3192000, 3067548, 2950212, 2839519, 2735157, 2636637, 2543104, 2453859, 2368482, 2286285, 2206550, 2129703, 2057226, 1989773, 1926192, 1865160, 1806984, 1752909, 1703225, 1657054, 1613736, 1573456, 1536555, 1502920, 1472208, 1444193, 1418759, 1395795, 1375182, 1356772, 1340405, 1325940, 1313153, 1301640, 1291037, 1281242, 1272133, 1263210, 1254011, 1244736, 1235953, 1227746, 1219836, 1212427, 1206014, 1200111, 1193127, 1184002, 1173246, 1161812, 1149614, 1135899, 1120643, 1104856, 1089703, 1075860, 1063401, 1051663, 1039197, 1024456, 1006853, 987209, 967166, 948067, 930144, 912806, 895873, 880172, 866395, 853750, 840722, 827129, 814276, 802921, 792430, 782557, 774747, 770431, 768793, 767444, 764962, 761845, 759373, 758496, 759472, 761575, 763324, 763801, 763535, 763310, 762655, 760655, 757974, 756668, 757920, 761131, 765317, 770073]
60785G70073M712L513K011J838L042L799K777O67j005j663j841k210k902l587
60771G79224l998m302m678m586l314j501j058k727m739n076m131l588l551k767
60757G29208j414j329l115n210o492p746r495j0368r281p601p181p462o592m626
60743F41296l327l152k857k185k536m290n616n213m439n103o410n968l268l46
60729E86586Q90N21l35r86j236r37r1J109K537M006M786M030J979R6m41J19Q59
60712F03492J495K337L303L805L567L062K979L585M562N160M593K735N43o12l87
60697F44219J19l57j679k442j658L1J101P58m30j367j400n66O09J321Q44p80k631
60680F35692l769m154m425m978n619n979n886n314m465l802l643l702l465k976
$$ y = [770073, 774785, 778298, 780309, 782147, 785189, 788988, 791765, 792432, 791427, 789764, 787923, 785713, 782811, 779224, 775226, 770924, 766246, 761660, 758346, 756845, 755787, 753060, 748321, 743245, 739114, 735526, 731975, 729208, 727794, 726465, 723350, 718140, 711648, 703902, 694407, 684039, 674758, 667157, 659976, 652514, 645922, 641296, 637969, 634817, 631960, 629775, 627239, 622949, 617333, 612120, 607681, 602578, 596168, 590200, 586932, 586586, 587476, 587997, 587662, 586676, 585440, 584503, 584412, 585521, 588058, 592064, 596850, 600880, 602859, 602955, 602514, 602633, 603492, 604987, 607324, 610627, 614432, 617999, 621061, 624040, 627625, 632187, 637347, 641940, 644675, 645218, 644606, 644219, 644338, 643981, 642302, 639860, 638202, 638233, 639334, 640092, 639662, 638295, 636895, 636329, 636938, 638259, 639103, 638323, 635692, 631923, 627769, 623344, 618366, 612747, 606768, 600882, 595568, 591103, 587301, 583658, 579956, 576491, 573515]
60666E73515k750k807k481j446m62n94j913l269l281j492J140K883K720J334L17
60651E61414M53J192J766K037K140K085K016K171K257J724J073J781M090N893
60637E92092N167K811J669K888M773N323M528L587L120K967L025L310L470L007
60623F41737K024J312J474K194K497J779M49o15j120j485j969k315k515l096m141
60608F36210m736m232l481l806n094n945n606m720m131l983m119m413m468l748
60594E73728k253m94J249K900L970L880K998K400K406K324J728R36O7j147k254
60579E92438k130q05J6q69k560l536l740l964m168l783l101k925l020k283n42
60564E55028R72J229O15K64P67J808K677K956K935L331M448N733O396O216N441
$$ y = [573515, 570765, 567958, 565477, 564031, 563569, 562975, 561062, 557793, 554512, 553020, 554160, 557043, 559763, 561097, 561414, 561867, 563059, 564825, 566862, 569002, 571087, 573103, 575274, 577531, 579255, 580328, 582109, 586199, 592092, 597259, 600070, 601739, 604627, 609400, 614723, 619251, 622838, 625958, 628925, 631950, 635260, 638730, 641737, 643761, 645073, 646547, 648741, 651238, 653017, 653466, 652851, 651731, 650246, 648277, 645962, 643447, 640351, 636210, 631474, 627242, 623761, 619955, 614861, 608916, 603310, 598590, 594459, 590476, 586357, 581944, 577476, 573728, 571475, 570981, 572230, 575130, 579100, 582980, 585978, 588378, 590784, 593108, 594836, 595772, 595839, 594692, 592438, 590308, 589503, 589519, 588650, 586090, 582554, 578814, 574850, 570682, 566899, 563798, 560873, 557853, 555570, 555028, 556000, 557229, 557844, 558108, 558875, 560683, 563360, 566316, 569251, 572582, 577030, 582763, 589159, 595375, 600816]
60549F00816M285K911J696J090J264K033K868K991J986N53M0R44K447L680M625
60534F34229N418N694N361N223N885O703O593N407L724J894K14o29k94M98J026
60519F86946J825L799O551Q812J0260J1643J3234J4315J4304J3516J2867J3448
60507H11520J5921J9421K1688K1424J9956J9124J8343J5633J1096O985M166J085
60495I86362k966n880n514k733k1J736L412N451P373R151J1649J5449K0056K4448
60481A067973K7956L0809L4053L8624M4069M8595N0789N0894N0128M9051M6908
60470A539849M2230L4030K2920J1120P47p939j5865k2946k7742k9502k9202k8070
60458A489630k6217k3398j9998j6439j2546q212l871L13M695R042J2357J4723
$$ y = [600816, 605101, 608012, 609708, 610798, 612062, 614095, 616963, 619954, 621940, 622493, 622533, 623477, 625924, 629604, 634229, 639647, 645341, 650702, 655925, 661810, 668513, 675106, 680513, 684237, 686131, 686345, 685716, 685422, 685920, 686946, 688771, 692570, 699121, 707933, 718193, 729836, 743070, 757385, 771689, 785205, 798072, 811520, 827441, 846862, 868550, 889974, 909930, 929054, 947397, 963030, 974126, 981111, 985277, 986362, 983396, 977516, 972002, 969269, 969248, 970984, 974396, 979847, 987220, 996371, 1008020, 1023469, 1043525, 1067973, 1095929, 1126738, 1160791, 1199415, 1243484, 1292079, 1342868, 1393762, 1443890, 1492941, 1539849, 1582079, 1616109, 1639029, 1650149, 1650896, 1642957, 1627092, 1604146, 1576404, 1546902, 1517700, 1489630, 1463413, 1440015, 1420017, 1403578, 1391032, 1382820, 1378949, 1379262, 1383957, 1392999, 1405356, 1420079]
60446A420079J7972K3317K9534L4866L9738M5941N3871O2174O9656P5979Q0876
60435A954003Q4121Q6034Q6651Q4754P9240P1197O3102N6113M9637M3388L8123
60424B696363L4052L0051K4845J7687P768n533k1494l8576n6315p4976r2913j06351
60412B414608j13027j14438j13199j09731j03334r5200q7872q2036p6043o8930
60402A450798o2004n6675n2333m7553m2356l7907l4510l1345k8041k5198k3037
60391A009839k0790j8114j6014j5297j4976j3595j1663j0949j1415j0838q187
60380H58001n506n141o432o950o007n148n475o303o464n628m144k763k524l873
60366G85643n809o920p084p135p172o609n670n210m950l694j553j93k95n15J50
$$ y = [1420079, 1438051, 1461368, 1490902, 1525768, 1565506, 1611447, 1665318, 1727492, 1797148, 1873127, 1954003, 2038124, 2124158, 2210809, 2295563, 2374803, 2446000, 2509102, 2565215, 2614852, 2658240, 2696363, 2730415, 2760466, 2785311, 2802998, 2810766, 2805233, 2783739, 2745163, 2688848, 2613872, 2520959, 2414608, 2301581, 2187143, 2073944, 1964213, 1860879, 1765679, 1677807, 1595771, 1519728, 1450798, 1388794, 1332119, 1279786, 1232233, 1189877, 1151970, 1117460, 1086115, 1058074, 1032876, 1009839, 989049, 970935, 954921, 939624, 924648, 911053, 899390, 888441, 877026, 866188, 858001, 852495, 847354, 840922, 833972, 827965, 822817, 817342, 811039, 804575, 798947, 794803, 792040, 789516, 785643, 779834, 772914, 765830, 758695, 751523, 744914, 739244, 734034, 729084, 725390, 723837, 723644, 723349, 722834, 722984]
60351G22984O78n2j151j036K34J406K094K787L316K795J136m31n64J001L253M507
60335G42957L701J662N45J432L040L471K450J087K04P2J073L261N415N888M476
60320G80734K582J502J412K021L168M497N257M874L469J755N60K68M94O64J033
60305H14290K441M669O035N524M372M397N453N941N327M657M819N881P972J1062
60291H92840J3682J3754J1255Q517P170O291M467K079K52j242l347n682o804o277
60277I36955n172m501m275m227m399m727m716l948k592j375j206k558m755o149
60263H82355n712m207l184k972k538j200N19K077L917O707J0158J3271J5383J6509
60249I31083J7016J7539J8871K1280K4063K6250K7603K8231K7501K4292J8588
$$ y = [722984, 723662, 723610, 722459, 721423, 721657, 723063, 725157, 727944, 731260, 734055, 735191, 734760, 734196, 735197, 738450, 742957, 746658, 748320, 748865, 750297, 753337, 756808, 759258, 760345, 760549, 760621, 761694, 764955, 770370, 776258, 780734, 783316, 784818, 786230, 788251, 791419, 795916, 801173, 806047, 809516, 811271, 811831, 812099, 812593, 813257, 814290, 816731, 821400, 827435, 832959, 837331, 841728, 847181, 853122, 858449, 863106, 867925, 873806, 881778, 892840, 906522, 920276, 931531, 940048, 947218, 953509, 957976, 960055, 960307, 959065, 955718, 950036, 943232, 936955, 931783, 927282, 923007, 918780, 914381, 909654, 904938, 900990, 898398, 897023, 895817, 893259, 888504, 882355, 876643, 872436, 869252, 866280, 863742, 862542, 863061, 865138, 869055, 875762, 885920, 899191, 914574, 931083, 948099, 965638, 984509, 1005789, 1029852, 1056102, 1083705, 1111936, 1139437, 1163729, 1182317]
60238A182317J1923N655n17p608j5419k2480k7666l0901l2179l0987k7376k2868
60226I81894j9429j7625j6431j4792j2775j1163j0363j0098r850r328q496p403
60214H34141o020m309k500j218j135k281l810m637m518m236m509m855m083j994
60200G84036q3O4j362k761l187l194l502l664k657l26K332M102M413L560K466
60185G80237K092K626L340L418K777J929J294R79R25R07O41K35K88J245K763M113
60169H09809N021N701O252O457O118N287M296L804M493O284Q103Q832Q375P481
60155H96313O769O438O611P245P849P909P620P631Q154Q879R577J0046R563P407
60141A008011M268K218K711N031P122P466N858L036L13r11j32J645K702K126M42
$$ y = [1182317, 1194240, 1199895, 1199378, 1191770, 1176351, 1153871, 1126205, 1095304, 1063125, 1032138, 1004762, 981894, 962465, 944840, 928409, 913617, 900842, 889679, 879316, 869218, 859368, 850040, 841544, 834141, 828121, 823812, 821312, 820094, 818959, 816678, 812868, 808231, 803713, 799477, 794968, 790113, 786030, 784036, 783953, 784017, 782655, 779894, 776707, 773513, 770011, 766347, 763690, 763364, 765696, 769798, 774211, 777771, 780237, 782329, 784955, 788295, 791713, 794490, 796419, 797713, 798692, 799617, 800524, 801165, 801400, 801688, 802933, 805696, 809809, 814830, 820531, 826783, 833240, 839358, 844645, 848941, 852745, 857238, 863522, 871625, 880457, 888832, 896313, 903082, 909520, 916131, 923376, 931225, 939134, 946754, 954385, 962539, 971418, 980995, 991041, 1000604, 1008011, 1012279, 1014497, 1017208, 1022239, 1029361, 1036827, 1042685, 1045721, 1046034, 1045123, 1044991, 1046636, 1049338, 1051464, 1051906]
60126A051906j131j725j310n13m9r2k26p3J90K59M19J319K866L924L571K392J845
60109A063572K264K357J098o93j547j600k327m038n156m522l082k331k171j549
60095A040275m07M96J214K499M132M896M445L833L813L911L625L387L639L913
60081A083671L667L228L228L705M400N264O087O311N874N640O210O884O574N361
60067A156104M386M526N840P827R550R948Q926P914Q503J0610J2715J3698J3729
60054A274276J3438J3098J2750J2495J2317J2010J1296R871P534M722K588J935
60042A388330K155J746p3k746n149o441o297m929l003j147L98J362J073p56l149
60027A361374m612m851m958n826p055p816q109q796j0558j3110j5330j6280j6249
$$ y = [1051906, 1050775, 1049050, 1047740, 1047227, 1047178, 1047086, 1046860, 1046787, 1046977, 1047236, 1047655, 1048974, 1051840, 1055764, 1059335, 1061727, 1063572, 1065836, 1068193, 1069291, 1068598, 1067051, 1065451, 1063124, 1059086, 1053930, 1049408, 1046326, 1043995, 1041824, 1040275, 1039868, 1040364, 1041578, 1044077, 1048209, 1053105, 1057550, 1061383, 1065196, 1069107, 1072732, 1076119, 1079758, 1083671, 1087338, 1090566, 1093794, 1097499, 1101899, 1107163, 1113250, 1119561, 1125435, 1131075, 1137285, 1144169, 1150743, 1156104, 1160490, 1165016, 1170856, 1178683, 1188233, 1198181, 1207107, 1215021, 1223524, 1234134, 1246849, 1260547, 1274276, 1287714, 1300812, 1313562, 1326057, 1338374, 1350384, 1361680, 1371551, 1379085, 1383807, 1386395, 1388330, 1390485, 1392231, 1392158, 1389412, 1384263, 1377822, 1371525, 1366596, 1363593, 1362446, 1362844, 1364206, 1365279, 1364523, 1361374, 1356762, 1351911, 1346953, 1341127, 1334072, 1326256, 1318147, 1309351, 1298793, 1285683, 1270353, 1254073, 1237824]
60014A237824j6445j7379j8059j7489j6337j6039j6562j6468j5191j3798j3099
60003A060958j2482j1349j0337j0125j0069r227p979p355p412p469p480p824q009
59990I43841o988m805k670j266j22J055J639J228M93L03O91J229J712J882J205
59975I39427l30j689j818j028o12j333k812m266n222n591n450m890l871k424j143
59960H96948r50j954l099l516l786m915o455o763n205k972j457q64q29j285j910
59945H50988j654n5J416N70k840o547q020o743m194k282j958k646k721r89J984
59930H14309M276M549L207J632Q35J170K569M428N726O039O162O854P243N704
59916H74703K564N22J403L530L694J303j079j405o22o32j323j077M88K035K586
$$ y = [1237824, 1221379, 1204000, 1185941, 1168452, 1152115, 1136076, 1119514, 1103046, 1087855, 1074057, 1060958, 1048476, 1037127, 1026790, 1016665, 1006596, 997369, 989390, 982035, 974623, 967154, 959674, 951850, 943841, 936853, 932048, 929378, 928112, 927990, 929045, 930684, 931912, 932405, 932708, 933399, 934628, 936340, 938222, 939427, 939097, 937408, 935590, 934562, 933950, 932617, 929805, 925539, 920317, 914726, 909276, 904386, 900515, 898091, 896948, 895998, 894044, 890945, 887429, 883643, 878728, 872273, 865510, 860305, 857333, 855876, 855012, 854183, 852898, 850988, 849334, 849279, 850695, 851265, 848425, 841878, 833858, 827115, 822921, 820639, 818681, 816035, 813314, 812325, 814309, 818585, 823134, 826341, 827973, 828808, 829978, 832547, 836975, 842701, 848740, 854902, 861756, 868999, 874703, 877267, 877789, 879192, 882722, 886416, 887719, 886640, 885235, 884613, 883981, 882658, 881581, 882069, 884104, 886690]
59901H86690K575K457J771L06q42n70N29P30o21k363k987k210r36j17P2M6M2k32
59883H84340r92j612j163K15J109M52j088j838q71J352L757N465O149O047N609
59868I06931M947L963L199L760N944Q566J0328J1328J2386J3379J3266J1592R135
59855A018724P179O704P955J0047J1353J1103J0222R800R297P514M795K926K901
59842A120520M116N510O149M951J665j744k604p94J108J445J281J933K804K946
59828A149286L010L945M999M687K970J115J81P22K887N529O376M717K922L515
59814A196861N560O010L980J473O9p26j535j681o24P91J446J194L70q88k106k234
59798A207960p88J381L024L784M174M809N882P026P494P036O531P062Q391R065
$$ y = [886690, 889265, 891722, 893493, 893799, 892957, 892387, 892916, 893646, 893025, 890662, 887675, 885465, 884529, 884412, 884484, 884530, 884572, 884340, 883348, 881736, 880573, 880788, 881897, 882349, 881261, 879423, 878552, 879904, 883661, 889126, 895275, 901322, 906931, 911878, 915841, 919040, 922800, 928744, 937310, 947638, 958966, 971352, 984731, 997997, 1009589, 1018724, 1025903, 1032607, 1040562, 1050609, 1061962, 1073065, 1083287, 1093087, 1102384, 1109898, 1114693, 1117619, 1120520, 1124636, 1130146, 1136295, 1141246, 1142911, 1141167, 1138563, 1137769, 1138877, 1140322, 1141603, 1143536, 1146340, 1149286, 1152296, 1156241, 1161240, 1165927, 1168897, 1170012, 1170193, 1170915, 1173802, 1179331, 1185707, 1190424, 1193346, 1196861, 1202421, 1208431, 1212411, 1213884, 1213953, 1213227, 1211692, 1210011, 1209387, 1210178, 1211624, 1212818, 1213188, 1212300, 1210194, 1207960, 1207172, 1208553, 1211577, 1215361, 1219535, 1224344, 1230226, 1237252, 1244746, 1251782, 1258313, 1265375, 1273766, 1282831]
59784A282831Q073N661K536p16l314m339l581j836k69m9k186o574j1225j3810
59770A251202j4283j4681j6041j7002j6189j4416j3314j2862j1830j0031q607
59759A101946q089p574o088l977k466k250k889l424l450l479m058m776m601l262
59745A041563j697r58j210j984k754k960k163p42J54j14q58j062o96m64o60j003
59729A022392j268j448j409j052q02j326k707m170m827m450l560k886k720k787
59715I86980k757k702k767k592j648j55J063J724K384L335M061M275M682N953
59701A001836P495Q096P526O772O870Q112J0217J2618J4593J5671J5946J5688
59689A131440J4869J3421J1668J0062Q704P547O771O392N884M838L737L223K757
$$ y = [1282831, 1290904, 1296565, 1299101, 1298385, 1295071, 1290732, 1287151, 1285315, 1285046, 1284997, 1282811, 1276237, 1265012, 1251202, 1236919, 1222238, 1206197, 1189195, 1173006, 1158590, 1145276, 1132414, 1120584, 1110553, 1101946, 1093857, 1086283, 1080195, 1076218, 1073752, 1071502, 1068613, 1065189, 1061739, 1058260, 1054202, 1049426, 1044825, 1041563, 1039866, 1038908, 1037698, 1035714, 1032960, 1030000, 1027837, 1027095, 1027249, 1027135, 1026277, 1025215, 1024519, 1024055, 1023395, 1022392, 1021124, 1019676, 1018267, 1017215, 1016413, 1015087, 1012380, 1008210, 1003383, 998933, 995373, 992487, 989767, 986980, 984223, 981521, 978754, 976162, 974514, 974359, 975422, 977146, 979530, 982865, 986926, 991201, 995883, 1001836, 1009331, 1017427, 1024953, 1031725, 1038595, 1046707, 1056924, 1069542, 1084135, 1099806, 1115752, 1131440, 1146309, 1159730, 1171398, 1181460, 1190164, 1197711, 1204482, 1210874, 1216758, 1221596, 1225333, 1228556, 1231313]
59676A231313R70k360n510o516n206l202k245k942m871p201r123r978r467p866
59662A155796n925m352l393k964l068l662m266m212l499k806k346j250J230M345
59648A119628O574P618Q770J0926J3079J3497J2096J0746J1069J2642J3801J3744
59636A254190J2965J1696R170N142J312r0J009K400K349J284L24n80k021l474
59622A295676l734k801k065k364k956k895k617l284m957o283o229n390n111n669
59608A239321n966n096l515k215j343k43J368L100M670O218P720Q774R159R087
59594A271039Q744Q196P733P618P367O066L664J005j567m575p979j0664j2134
59581A284513j3503j5677j7629j7879j6913j6513j7142j7587j7081j6067j4814
$$ y = [1231313, 1232283, 1229923, 1224413, 1217897, 1212691, 1209489, 1207244, 1204302, 1199431, 1192230, 1183107, 1173129, 1163662, 1155796, 1149871, 1145519, 1142126, 1139162, 1136094, 1132432, 1128166, 1123954, 1120455, 1117649, 1115303, 1114053, 1115283, 1119628, 1126202, 1133820, 1142590, 1153516, 1166595, 1180092, 1192188, 1202934, 1214003, 1226645, 1240446, 1254190, 1267155, 1278851, 1288021, 1293163, 1294475, 1294385, 1295394, 1297794, 1300143, 1301427, 1301751, 1301171, 1299150, 1295676, 1291942, 1289141, 1287076, 1284712, 1281756, 1278861, 1276244, 1272960, 1268003, 1261720, 1255491, 1250101, 1244990, 1239321, 1233355, 1228259, 1224744, 1222529, 1221186, 1220943, 1222311, 1225411, 1230081, 1236299, 1244019, 1252793, 1261952, 1271039, 1279783, 1287979, 1295712, 1303330, 1310697, 1316763, 1320427, 1321432, 1319865, 1315290, 1307311, 1296647, 1284513, 1271010, 1255333, 1237704, 1219825, 1202912, 1186399, 1169257, 1151670, 1134589, 1118522, 1103708]
59570A103708j2881j0496r048r384j0658j1613j2143j2754j3253j3035j2289j1921
59558I64233j2261j2584j2103j0950r923r482r221q303o348l930k176j890k913
59545H62149m201m632l914k774k036j596p44O08J609J648J191J017J209J332J253
59530H52119J109R04N36r5j290l265n152n280l332j430j831m085n814n877n221
59515H11996m797m369l736l458l720l715k922j924j288o48L05R69Q60P12J504
59500G85769L038M348M995N081M490L245K213K401L635M937O082P698R676J0712
59486H58320R952Q428Q175J0300J4305J8802K2326K3964K4081K4260K5431K5934
59474A074278K2560J4415M896j429l457l740m318m390k760n34L32l4k3N49K03
$$ y = [1103708, 1090827, 1080331, 1071283, 1061899, 1051241, 1039628, 1027485, 1014731, 1001478, 988443, 976154, 964233, 951972, 939388, 927285, 916335, 906412, 896930, 887709, 879406, 873058, 869128, 866952, 865062, 862149, 857948, 853316, 849402, 846628, 844592, 842996, 842252, 842860, 844469, 846117, 847308, 848325, 849534, 850866, 852119, 853228, 854132, 854668, 854573, 853283, 850018, 844866, 839586, 836254, 834824, 832993, 828908, 823094, 817217, 811996, 807199, 802830, 799094, 795636, 791916, 788201, 785279, 783355, 782067, 781419, 781724, 782693, 783553, 784265, 785769, 788807, 793155, 798150, 803231, 807721, 810966, 813179, 815580, 819215, 824152, 830234, 837932, 847608, 858320, 868272, 876700, 884875, 895175, 909480, 928282, 950608, 974572, 998653, 1022913, 1048344, 1074278, 1096838, 1111253, 1116149, 1114720, 1111263, 1107523, 1103205, 1098815, 1096055, 1095521, 1095853, 1095819, 1095796, 1096345, 1096548]
59459A096548j499l101l583l849n016o686p869q650r834j1698j3831j5603j6146
59446I89183j4721j1862r381q369p981p045n992n969o740p013o542o272o304n238
59432H79754k227J362L298L031K186K593M271N483M790K857J991L720P066R514
59418I29689R408P167M436K577J730R78n19k283k789j353O29J039n65k563l273
59403I44308k532j214J60J735L571N119N666N235M737N010N890O613O902O919
59389I98119O298M351J613j3M65J714J940J222O58Q0j602m052n445m967l665k463
59373I94253j035P60J946J987J826K335K901K800K806M023O038P823R644J2371
59359A050478J5514J7827J9620K2264K5519K7624K8600L0741L4308L5048K8586
$$ y = [1096548, 1095049, 1091948, 1088365, 1084516, 1079500, 1072814, 1064945, 1056295, 1046461, 1034763, 1020932, 1005329, 989183, 974462, 962600, 953219, 944850, 936869, 929824, 923832, 917863, 911123, 904110, 897568, 891296, 884992, 879754, 877527, 878889, 882187, 885218, 887404, 889997, 894268, 899751, 904541, 907398, 909389, 913109, 920175, 929689, 939097, 946264, 950700, 953277, 955007, 955985, 955466, 953183, 950394, 949041, 949670, 950709, 950144, 947581, 944308, 941776, 940562, 940722, 942457, 946028, 951147, 956813, 962048, 966785, 971795, 977685, 984298, 991200, 998119, 1004417, 1008768, 1010381, 1010368, 1010833, 1012547, 1014487, 1015709, 1016367, 1016447, 1014845, 1010793, 1005348, 1000381, 996716, 994253, 993218, 993978, 995924, 997911, 999737, 1002072, 1004973, 1007773, 1010579, 1014602, 1020640, 1028463, 1038107, 1050478, 1065992, 1083819, 1103439, 1125703, 1151222, 1178846, 1207446, 1238187, 1272495, 1307543, 1336129]
59348A336129J6244L990l856p537q729p600m059N75N063R823J4818J6985J2422
59335A384268J417j0859j9325k3074k4060k3595k1669j8447j4620j0603o744m006
59323A208683l076k935j723Q32L166M284M908N790O343O009N683O402P414P109
59309A258889N428L928L552L702L574L084K303J270O92J483L129L759K711J731
59295A299235K654M912O712P773R276J1538J3498J4554J5315J6206J6796J6987
59283A435456J7543J8687J9273J8331J6476J4904J3755J2504J1210J0099Q471
59272A596709N500K011j71q33j890m627p779r383r547r964j1236j2266j2404j2696
59258A511424j4211j6199j7026j6515j6113j6732j7459j6907j5127j3474j2930
$$ y = [1336129, 1352373, 1356363, 1352507, 1344970, 1336241, 1328641, 1324582, 1325157, 1330220, 1340043, 1354861, 1371846, 1384268, 1385685, 1374826, 1355501, 1332427, 1308367, 1284772, 1263103, 1244656, 1230036, 1219433, 1212689, 1208683, 1205607, 1202672, 1200949, 1201781, 1204947, 1209231, 1214139, 1219929, 1226272, 1232281, 1237964, 1244366, 1251780, 1258889, 1264317, 1268245, 1271797, 1275499, 1279073, 1282157, 1284460, 1285730, 1286422, 1287905, 1291034, 1294793, 1297504, 1299235, 1301889, 1306801, 1313513, 1321286, 1330562, 1342100, 1355598, 1370152, 1385467, 1401673, 1418469, 1435456, 1452999, 1471686, 1490959, 1509290, 1525766, 1540670, 1554425, 1566929, 1578139, 1588238, 1596709, 1602209, 1604220, 1604049, 1603216, 1601326, 1596699, 1588920, 1579537, 1569990, 1560026, 1548790, 1536524, 1524120, 1511424, 1497213, 1481014, 1463988, 1447473, 1431360, 1414628, 1397169, 1380262, 1365135, 1351661, 1338731]
59247A338731j3188j3240j2320j0219p229l885n31K925O665J0397J3313J4485
59235A325904J3034Q341O92q261j6241k1739k4485k4956k3944k2351k0611j8368
59223A167015j5434j2698j1092r819p158l222j79R28J913M727Q393J0353J0008
59210A143735R099Q961R248R357R516J0031J0600J0776J0259Q636N765K537K82
59197A248802p38j368k035k197j541p43o34j395k791m395n358m864l154j315J61
59182A216435J609K793K576P51r32n52J711L998M955M654L769K731J727Q25%o93
59166A246357j043j000r04j244k264l787n301o323o914p577q278q098o665n320
59152A181639n616o921p088n599m287m406m792l975k593k162k576k402j153L22
$$ y = [1338731, 1325543, 1312303, 1299983, 1289764, 1282535, 1278650, 1278119, 1281044, 1287709, 1298106, 1311419, 1325904, 1338938, 1347279, 1347971, 1339710, 1323469, 1301730, 1277245, 1252289, 1228345, 1205994, 1185383, 1167015, 1151581, 1138883, 1127791, 1117972, 1110814, 1107592, 1107413, 1108341, 1110254, 1114981, 1123374, 1133727, 1143735, 1152834, 1161795, 1171043, 1180400, 1189916, 1199947, 1210547, 1221323, 1231582, 1240218, 1245983, 1248520, 1248802, 1248064, 1246696, 1244661, 1242464, 1240923, 1240180, 1239546, 1238151, 1235360, 1230965, 1225607, 1220743, 1217589, 1216274, 1216435, 1218044, 1220837, 1223413, 1224164, 1223232, 1222680, 1224391, 1228389, 1233344, 1237998, 1241767, 1244498, 1246225, 1247050, 1247050, 1246357, 1245314, 1244314, 1243410, 1242166, 1239902, 1236115, 1230814, 1224491, 1217577, 1210000, 1201722, 1193624, 1186959, 1181639, 1176023, 1169102, 1162014, 1156415, 1152128, 1147722, 1142930, 1138955, 1136362, 1134200, 1131624, 1129222, 1128069, 1128391]
59138A128391J369K171K954L605M130M639N046N425O386Q273J0249J1074J0686
59125A204398J0243J0643J1600J2138J1485R711P879P194P560P506O063M019K592
59112A313031J604Q9j953l703m965o147p012o841n904n430n911o527o539o164
59098A247628n845n739o235p894j0271j1899j2105j2035j2997j4445j4604j2889
59086A120670j0782j0063j0741j1193j0134q042o348n683n516n420n680o254o160
59073A018654m702k670j288n40M52J847L157M482O315Q214R216R683J1215J4196
59059A078231J6863J7556J6762J6075J6158J6580J6918J7038J6891J6739J7075
59048A262886J7643J7261J5324J2857J1139R948Q294O325N198N135M890L445J195
$$ y = [1128391, 1129760, 1131931, 1134885, 1138490, 1142620, 1147259, 1152305, 1157730, 1164116, 1172389, 1182638, 1193712, 1204398, 1214641, 1225284, 1236884, 1249022, 1260507, 1270218, 1278097, 1285291, 1292851, 1300357, 1306420, 1310439, 1313031, 1314635, 1314724, 1312771, 1309068, 1304103, 1297956, 1290944, 1284103, 1278199, 1272769, 1266858, 1260331, 1253792, 1247628, 1241783, 1236044, 1229809, 1221915, 1211644, 1199745, 1187640, 1175605, 1162608, 1148163, 1133559, 1120670, 1109888, 1099825, 1089084, 1077891, 1067757, 1059715, 1053367, 1047684, 1042168, 1036748, 1031068, 1024814, 1018654, 1013952, 1011282, 1009994, 1009454, 1009906, 1011753, 1014910, 1019392, 1025707, 1033921, 1043137, 1052820, 1064035, 1078231, 1095094, 1112650, 1129412, 1145487, 1161645, 1178225, 1195143, 1212181, 1229072, 1245811, 1262886, 1280529, 1297790, 1313114, 1325971, 1337110, 1347058, 1355352, 1361677, 1366875, 1372010, 1376900, 1380345, 1381540]
59035A381540r19k556l754m299m023l375l075l426m330n773p726r775j1396j2587
59021A304526j3748j4870j5490j5544j5643j6011j5876j4542j2716j1821j2170
59010A146095j2715j2561j1720j0244p833m928l157l674n549o780o505n504m837
58997A050088m862n391n916n711m460k732j392o48k69k99p63r36P5K005L529L839
58981A026157L385L037L199L863M783N507N858O408P739R322J0023R755R763J1021
58967A119820J3270J5820J8373K0636K2048K2528K2851K3715K4855K5524K5171
58956A354611K3312J9319J3247O674J937K01L32k8k076m522n226m089l392m616
58942A395684o126n442k970j522k358l828m368m708o160q419j0348j1612j2271
$$ y = [1381540, 1380621, 1378065, 1374311, 1370012, 1365989, 1362614, 1359539, 1356113, 1351783, 1346010, 1338284, 1328509, 1317113, 1304526, 1290778, 1275908, 1260418, 1244874, 1229231, 1213220, 1197344, 1182802, 1170086, 1158265, 1146095, 1133380, 1120819, 1109099, 1098855, 1091022, 1086094, 1082937, 1079263, 1073714, 1066934, 1060429, 1054925, 1050088, 1045226, 1039835, 1033919, 1028208, 1023748, 1021016, 1019624, 1018976, 1018707, 1018408, 1017645, 1016709, 1016784, 1018789, 1022318, 1026157, 1029542, 1032579, 1035778, 1039641, 1044424, 1049931, 1055789, 1062197, 1069936, 1079258, 1089281, 1099036, 1108799, 1119820, 1133090, 1148910, 1167283, 1187919, 1209967, 1232495, 1255346, 1279061, 1303916, 1329440, 1354611, 1377923, 1397242, 1410489, 1417163, 1419100, 1419301, 1419633, 1419605, 1417529, 1413007, 1407781, 1403692, 1400300, 1395684, 1389558, 1384116, 1381146, 1379624, 1377266, 1373438, 1369070, 1364362, 1358202, 1349783, 1339435, 1327823, 1315552]
58929A315552j2009j1043j0735j1771j2722j2001j0431j0012j0650j0228p924
58918A196026n390m062l118j010K165M985O578P168P321P517Q130R058R487Q847
58904A253702P823P681Q483Q675O873L551M31j503k695l914n246o486p814r516
58890A260045j1386j2910j3803j3849j2610j0021p153n611n948p082p391o102
58878A146179l899k512l412o146q345q031n646l037j066N19J348N27j424k605
58864A102450k288j795k096k263j394m47p07j643j960j678j571j291N9K028L222
58849A088626L348L283L400L529M417P302J1720J5434J7106J7466J7284J5934
58837A208849J3098J0441R894J1015J1724J1418J1797J4174J7263J8619J7710
$$ y = [1315552, 1303543, 1292500, 1281765, 1269994, 1257272, 1245271, 1234840, 1224828, 1214178, 1203950, 1196026, 1190636, 1186574, 1183456, 1182446, 1184611, 1189596, 1196174, 1203342, 1210663, 1218180, 1226310, 1235368, 1244855, 1253702, 1261525, 1269206, 1277689, 1286364, 1293237, 1296788, 1297219, 1295716, 1293021, 1289107, 1283861, 1277375, 1269561, 1260045, 1248659, 1235749, 1221946, 1208097, 1195487, 1185466, 1178313, 1172702, 1166754, 1159672, 1152281, 1146179, 1142280, 1139768, 1136356, 1130210, 1121865, 1113834, 1108188, 1105151, 1104085, 1104604, 1105952, 1106479, 1105055, 1102450, 1100162, 1098367, 1096271, 1094008, 1092614, 1092167, 1091460, 1089817, 1087857, 1086179, 1084608, 1083317, 1083376, 1085404, 1088626, 1091974, 1095257, 1098657, 1102186, 1106603, 1113905, 1125625, 1141059, 1158165, 1175631, 1192915, 1208849, 1221947, 1232388, 1242282, 1253297, 1265021, 1276439, 1288236, 1302410, 1319673, 1338292, 1356002]
58826A356002J6450J6589J7546J7531J6133J4673J3978J3148J1155Q678P193O850
58814A515926O461N401M330L859L643L205K763K616K320J139r33l177m996o383
58800A536174p633r037j0904j3529j6764j9701k1132k0654j9211j8172j7947j7878
58788A343612j7421j6767j6177j5433j4478j3927j4266j4956j5036j4294j3224
58777A177633j2100j0877r822r469r929j0799j1684j2253j1964j0432q170o228
58765A053906n044m178l155k014r84k64r9n03q37l97N58J036P79N60P73O72l42
58748A040467j339p93J313L081K609j17l337n206n201m187l422l604m644n941
58734A009679o623n863l527o04J372J606P71M18J733M659P957J0129J0522R759
$$ y = [1356002, 1372452, 1389041, 1406587, 1424118, 1440251, 1454924, 1468902, 1482050, 1493205, 1501883, 1509076, 1515926, 1522387, 1527788, 1532118, 1535977, 1539620, 1542825, 1545588, 1548204, 1550524, 1551663, 1550730, 1547553, 1542557, 1536174, 1528541, 1519504, 1508600, 1495071, 1478307, 1458606, 1437474, 1416820, 1397609, 1379437, 1361490, 1343612, 1326191, 1309424, 1293247, 1277814, 1263336, 1249409, 1235143, 1220187, 1205151, 1190857, 1177633, 1165533, 1154656, 1144834, 1135365, 1125436, 1114637, 1102953, 1090700, 1078736, 1068304, 1060134, 1053906, 1048862, 1044684, 1041529, 1039515, 1038531, 1038267, 1038168, 1037665, 1036828, 1036431, 1036989, 1038025, 1038804, 1039364, 1040137, 1040809, 1040467, 1039128, 1038335, 1039648, 1042729, 1045338, 1045221, 1041884, 1036678, 1031477, 1027290, 1023868, 1020264, 1015620, 1009679, 1003056, 997193, 993666, 993062, 994434, 996040, 996811, 997229, 998962, 1003621, 1011578, 1021707, 1032229, 1041988]
58720A041988R017R019R675J0512J1087J1059J0284Q943P483O113M404J644k157
58707A139071n667p162o350m868m462n059n369m944m555m540m212l360k905l305
58693A072313l481k507j245r78j284r61l36o82j534p58K289N604P406Q359R719
58678A091924J0831J0306Q767Q461J0180J2332J3349J3542J3843J3919J2800J0845
58666A231099R713J0193J1019J0511Q674P038O661P177P802Q373R014R428R250
58653A345952Q791Q762R236R282P651L702k121q408j3590j6903j8690j9750k0748
58640A293166k2329k5014k8449l1196l1967l0864k9002k7211k5710k4578k3588
58629I93258k1868j8755j5068j2598j1993j2002j1146r393p631o165m540k591
$$ y = [1041988, 1051005, 1060024, 1069699, 1080211, 1091298, 1102357, 1112641, 1121584, 1129067, 1135180, 1139584, 1141228, 1139071, 1133404, 1126242, 1119892, 1115024, 1110562, 1105503, 1100134, 1095190, 1090635, 1086095, 1081883, 1078523, 1075618, 1072313, 1068832, 1066325, 1065080, 1064102, 1062818, 1061857, 1061521, 1060839, 1059305, 1058547, 1060836, 1066440, 1073846, 1082205, 1091924, 1102755, 1113061, 1121828, 1130289, 1140469, 1152801, 1166150, 1179692, 1193535, 1207454, 1220254, 1231099, 1240812, 1251005, 1262024, 1272535, 1281209, 1288247, 1294908, 1302085, 1309887, 1318260, 1327274, 1336702, 1345952, 1354743, 1363505, 1372741, 1382023, 1389674, 1393376, 1391255, 1382847, 1369257, 1352354, 1333664, 1313914, 1293166, 1270837, 1245823, 1217374, 1186178, 1154211, 1123347, 1094345, 1067134, 1041424, 1016846, 993258, 971390, 952635, 937567, 924969, 912976, 900974, 889828, 880435, 872804, 866639, 862099, 859508]
58617H59508q64P5K86K02M5k46n66m81L82J837L303M429N419O726Q529J0408J1391
58600I10383J0561Q056N288L584K631R79j901m819o415o679o490o394o397o300
58586H96087n716m360k810k299l188m492n474o617q056q304o104k803j039j362
58572H33463j930j571j290k328m263n726n813m263j444J170J681q1j965j901j55
58557H03584J636K847M035N259N684N025M185L999M155L934L351K880K542K103
58543H55219J959K726L836L829K647K351M318O735O699M353K822L838N653O115
58529I13100N767O373P976R259R848J0504J1652J3220J5383J7941J9506J8885
58517A059414J7049J6124J6661J7374J7374J7076J6930J6856J7136J8459K0699
$$ y = [859508, 858644, 858719, 859005, 859207, 859252, 859006, 858440, 857959, 858341, 860178, 863481, 867910, 873329, 880055, 888584, 898992, 910383, 920944, 929000, 934288, 937872, 940503, 941482, 939581, 934762, 928347, 921668, 915178, 908784, 902387, 896087, 890371, 886011, 883201, 880902, 877714, 873222, 867748, 861131, 853075, 844771, 838667, 835864, 834825, 833463, 831533, 829962, 828672, 826344, 822081, 816355, 810542, 806279, 804835, 806005, 807686, 807605, 805640, 803739, 803584, 805220, 808067, 812102, 817361, 823045, 828070, 832255, 836254, 840409, 844343, 847694, 850574, 853116, 855219, 857178, 859904, 863740, 867569, 870216, 872567, 876885, 883620, 890319, 894672, 897494, 901332, 906985, 913100, 918867, 925240, 933216, 942475, 952323, 962827, 974479, 987699, 1003082, 1021023, 1040529, 1059414, 1076463, 1092587, 1109248, 1126622, 1143996, 1161072, 1178002, 1194858, 1211994, 1230453, 1251152]
58506A251152K2830K4322K5636K7202K8952L0825L2670L3682L3073L1232K9035
58495A570611K6070K1097J4366Q000L595O85k015n064q477j2232j5953j8854k0520
58482A561309k1256k1641k2361k4156k6932k9134k9199k7531k5964k5436k5441
58471A282258k5311k4540k2206j7966j3508j1065j0392r319p407o712q351j0702
58459A114779j1883j1912j1295r696p355n874n981o098m686k513j108m46J86L41
58445A036459o44j921k161j570j244j171m44J034K502L512L947L538K589K567
58431A046993M498P324R116R506R651J0240J0965J1713J2788J4047J4913J5398
58419A177152J6149J7430J8733J9352J8827J7026J4402J1845R736P455M332O36
$$ y = [1251152, 1273982, 1298304, 1323940, 1351142, 1380094, 1410919, 1443589, 1477271, 1510344, 1541576, 1570611, 1596681, 1617778, 1632144, 1640144, 1643739, 1644424, 1642409, 1637345, 1628868, 1616636, 1600683, 1581829, 1561309, 1540053, 1518412, 1496051, 1471895, 1444963, 1415829, 1386630, 1359099, 1333135, 1307699, 1282258, 1256947, 1232407, 1210201, 1192235, 1178727, 1167662, 1157270, 1147951, 1140544, 1133832, 1125481, 1114779, 1102896, 1090984, 1079689, 1069993, 1062638, 1056764, 1050783, 1044685, 1039999, 1037486, 1036378, 1035932, 1036118, 1036459, 1035815, 1033894, 1031733, 1030163, 1028919, 1027748, 1027304, 1028338, 1030840, 1034352, 1038299, 1041837, 1044426, 1046993, 1051491, 1058815, 1067931, 1077437, 1087088, 1097328, 1108293, 1120006, 1132794, 1146841, 1161754, 1177152, 1193301, 1210731, 1229464, 1248816, 1267643, 1284669, 1299071, 1310916, 1320652, 1328107, 1332439, 1333075]
58407A333075k797n462p212q063q399q702q663p356m786k282p54M42K077L625
58393A274743M311M653N708P404Q554Q075N516J253l060n253m929m072m440n418
58379A293045n566m958m385l392j244Q85R24r57k296j563L27K106L854N948P815
58364A290543Q882R738J1157J2555J2386R979O279K652m13l175n591p033p155
58351A340804o501n853n366n002n277o541p700o864l670J04K560L527L951M414
58337A302586M834N030N024N137N788O750O894N610M122M157N381N702M236K418
58323A373669J763K101K493K561K384K317L222N533P986Q952R128J0801J4149
58310A447059J6588J6538J5394J4685J3827J2145J0944J1608J3365J4726J5537
$$ y = [1333075, 1330278, 1324816, 1317604, 1309541, 1301142, 1292440, 1283777, 1276421, 1271635, 1269353, 1268599, 1269041, 1271118, 1274743, 1279054, 1283707, 1289415, 1296819, 1305373, 1313448, 1318964, 1320217, 1317157, 1311904, 1306975, 1302903, 1298463, 1293045, 1287479, 1282521, 1278136, 1274744, 1273500, 1274385, 1275309, 1274352, 1272056, 1270493, 1270820, 1272926, 1276780, 1282728, 1290543, 1299425, 1309163, 1320320, 1332875, 1345261, 1355240, 1361519, 1364171, 1363758, 1360583, 1354992, 1347959, 1340804, 1334303, 1328450, 1323084, 1318082, 1312805, 1306264, 1298564, 1291700, 1288030, 1288134, 1290694, 1294221, 1298172, 1302586, 1307420, 1312450, 1317474, 1322611, 1328399, 1335149, 1342043, 1347653, 1351775, 1355932, 1361313, 1367015, 1371251, 1373669, 1375432, 1377533, 1380026, 1382587, 1384971, 1387288, 1390510, 1396043, 1404029, 1412981, 1422109, 1432910, 1447059, 1463647, 1480185, 1495579, 1510264, 1524091, 1536236, 1547180, 1558788, 1572153, 1586879, 1602416]
58299A602416J6132J6063J5268J4895J5377J5232J3437J1399J0876J1427J1745
58288A754267J2021J3119J4659J5684J6090J5981J5012J3786J4243J6961J9754
58277A921577K0677K0795K2112K4365K5905K6248K5822K4626K3047K2523K3555
58266B181252K4464K3899K2799K2187K1051J8576J6486J6671J8167J8948J9022
58255B403522J9429J9886J9927K0790K3587K7032K9252L0308L0931L0731K9932
58244B685327L0553L3413L6181L7047L7692L9857M1775M1531M1095M3002M5496
58233C112969M5367M3546M3452M5436M7341M9092N2144N5563N6993N6762N7148
58222C665813N8634O0551O3889O9478P4957P7775P9590Q3405Q8102R0541R1398
$$ y = [1602416, 1618548, 1634611, 1649879, 1664774, 1680151, 1695383, 1708820, 1720219, 1731095, 1742522, 1754267, 1766288, 1779407, 1794066, 1809750, 1825840, 1841821, 1856833, 1870619, 1884862, 1901823, 1921577, 1942254, 1963049, 1985161, 2009526, 2035431, 2061679, 2087501, 2112127, 2135174, 2157697, 2181252, 2205716, 2229615, 2252414, 2274601, 2295652, 2314228, 2330714, 2347385, 2365552, 2384500, 2403522, 2422951, 2442837, 2462764, 2483554, 2507141, 2534173, 2563425, 2593733, 2624664, 2655395, 2685327, 2715880, 2749293, 2785474, 2822521, 2860213, 2900070, 2941845, 2983376, 3024471, 3067473, 3112969, 3158336, 3201882, 3245334, 3290770, 3338111, 3387203, 3439347, 3494910, 3551903, 3608665, 3665813, 3724447, 3784998, 3848887, 3918365, 3993322, 4071097, 4150687, 4234092, 4322194, 4412735, 4504133]
58211D504133R3879R8015J01269J03670J07337J12073J16399J21712J30227J40001
58201E628715J47191J52069J57649J63903J68885J73966J81920J91127J97797
58192G163222K02830K10321K20699K31667K44433K62118K83381L04636L27077
58183I450384L54055L83190M09328M34089M63666M98055N31653N64078O00881
58174A3689379O43292O86890P30864P79101Q31496Q83985R37974R99648J068825
58165B1251454J138528J206770J278769J356965J439749J530720J637364J759159
58157C2599478J888797K026246K178946K347232K523787K709557K915801L148063
58149E2337907L403161L684260M002992M364587M768827N229105N772749O420084
$$ y = [4504133, 4598012, 4696027, 4797296, 4900966, 5008303, 5120376, 5236775, 5358487, 5488714, 5628715, 5775906, 5927975, 6085624, 6249527, 6418412, 6592378, 6774298, 6965425, 7163222, 7366052, 7576373, 7797072, 8028739, 8273172, 8535290, 8818671, 9123307, 9450384, 9804439, 10187629, 10596957, 11031046, 11494712, 11992767, 12524420, 13088498, 13689379, 14332671, 15019561, 15750425, 16529526, 17361022, 18245007, 19182981, 20182629, 21251454, 22389982, 23596752, 24875521, 26232486, 27672235, 29202955, 30840319, 32599478, 34488275, 36514521, 38693467, 41040699, 43564486, 46274043, 49189844, 52337907, 55741068, 59425328, 63428320, 67792907, 72561734, 77790839, 83563588, 89983672]
58141H9983672P181893Q076709R125437J0328134J1676058J3189390J4908305
58134A64469598J6840951J8957970K1243286K3707903K6358917K9207839L2231945
58127C33018409L5058673L6515064L4731279K8227145J7275103M181769p984633
58120D81022809j7151404k3007756k6419191k8361490k9336233k9450159k8743042
58113B98553534k7375284k5598057k3631850k1595784j9536229j7494476j5531769
58106A47790085j3706585j2056299j0601387r346235q272352p348076o550593
58099G9908558n868669n286523m781135m336982l949221l610555l308549l037903
58091D5729021k801914k598127k414110k240648k078417j928648j787727j654667
$$ y = [89983672, 97165565, 105242274, 114367711, 124695845, 136371903, 149561293, 164469598, 181310549, 200268519, 221511805, 245219708, 271578625, 300786464, 333018409, 368077082, 404592146, 439323425, 467550570, 484825673, 489007442, 481022809, 463871405, 440863649, 414444458, 386082968, 356746735, 327296576, 298553534, 271178250, 245580193, 221948343, 200352559, 180816330, 163321854, 147790085, 134083500, 122027201, 111425814, 102079579, 93807227, 86459151, 79908558, 74039889, 68753366, 63972231, 59635249, 55686028, 52075473, 48766924, 45729021, 42927107, 40328980, 37914870, 35674222, 33595805, 31667157, 29879430, 28224763]
58083B8224763j534179j427970j330700j237802j150262j069431r94407r26602
58075A8553410q69559q21924p77337p33053o92169o56005o21345n86856n55197
58066A2239965n26913m98850m70546m45512m24349m03132l80556l60148l43174
58057H386785l25807l06042k87313k72409k59343k45999k33618k22951k12083
58048F021220k00748j91960j86613j81006j72492j63300j56290j51069j46728
58039D471014j44167j43057j40398j34784j28689j24197j19878j14117j08077
58030C313650j03112r8372r3152q8684q5716q3064q0148p8018p6591p4033p0253
58019B382507o7695o7242o6772o5130o4003o4201o3660o1033n7961n5802n3342
$$ y = [28224763, 26690584, 25262614, 23931914, 22694112, 21543850, 20474419, 19480012, 18553410, 17683851, 16861927, 16084590, 15351537, 14659368, 14003363, 13382018, 12795162, 12239965, 11713052, 11214202, 10743656, 10298144, 9873795, 9470663, 9090107, 8729959, 8386785, 8060978, 7754936, 7467623, 7195214, 6935871, 6689872, 6456254, 6233303, 6021220, 5820472, 5628512, 5441899, 5260893, 5088401, 4925101, 4768811, 4617742, 4471014, 4326847, 4183790, 4043392, 3908608, 3779919, 3655722, 3535844, 3421727, 3313650, 3210538, 3112166, 3019014, 2930330, 2844614, 2761550, 2681402, 2603384, 2526793, 2452760, 2382507, 2314812, 2247570, 2180798, 2115668, 2051665, 1987464, 1923804, 1862771, 1804810, 1749008, 1695666]
58008A695666m9639m5992m3193l9906l5683l2472l1101k9363k5864k2745k2232
57997A317476k3200k3478k3101k2950k2534k1399k0601k0660k0096j8013j5953
57986A085491j5244j4602j2389r396p426o963p789r884j2102j2211j0076q626
57974I58783r749j1467j1334j0383j1034j2866j3362j1856j0274j0332j1931j3888
57962H20307j4895j4199j2345j0716r802q883p702o975o780o141m824l805l327
57949G09913k490j432j758l825n655n659m456l007j086J272K852L092K964K965
57935F93690K238O63m51q68k150m553n803m604k889k696l192k884k610l962o410
57920F53519q288r110r121q022o062m725m623m286k795j742k599m036l990k702
$$ y = [1695666, 1646027, 1600035, 1556842, 1516936, 1481253, 1448781, 1417680, 1388317, 1362453, 1339708, 1317476, 1294276, 1270798, 1247697, 1224747, 1202213, 1180814, 1160213, 1139553, 1119457, 1101444, 1085491, 1070247, 1055645, 1043256, 1033860, 1026434, 1019471, 1011682, 1001798, 989696, 977485, 967409, 958783, 949034, 937567, 926233, 915850, 904816, 891950, 878588, 866732, 856458, 846126, 834195, 820307, 805412, 791213, 778868, 768152, 758350, 749467, 741765, 734790, 728010, 721869, 717045, 713240, 709913, 707423, 705991, 704233, 700408, 694753, 689094, 684638, 681631, 680545, 681817, 684669, 687761, 690725, 693690, 695928, 696591, 696140, 695272, 693122, 688569, 682766, 678162, 675273, 672577, 669385, 666501, 663891, 659929, 653519, 645231, 636121, 627000, 618978, 612916, 608191, 603568, 599282, 596487, 594745, 592146, 588110, 584120, 581418]
57906E81418j434kJ961K931J441j095k237k139k734m210n103n321o239p861q373
57891E41003o844m453k730k056k047k175j891j070j57O98K010L819N203N752O327
57876E41389P411Q016P430O595O346N823M224K737K781L495K936R32j167k701
57862E96247l920m793n304o170p612q354p495o316o343o644n265k607j036j465
57848E22923k467k677k203j638j187q17r6J656L956M701K579p87k608k172p95
57833E18368N11J510J677O61n07n25K26M10j47p39j544l121m615m519l096k083
57817E02467k135k301k012j826k132k688l398m232m592m083l477l370k628n1K970
57802D66512L792K288J054J699L241M509N840P524Q595Q332P583P428P567O992
$$ y = [581418, 579984, 579982, 581943, 584874, 586315, 585220, 582983, 580844, 578110, 573900, 568797, 563476, 557237, 549376, 541003, 534159, 529706, 526976, 524920, 522873, 520698, 518807, 517737, 517580, 518278, 520288, 524107, 529310, 535062, 541389, 548800, 556816, 564246, 570841, 577187, 583010, 587234, 589971, 592752, 596247, 599183, 600115, 598948, 596247, 592327, 587534, 582230, 576060, 568448, 560094, 552599, 546283, 539940, 533296, 528031, 525424, 524388, 522923, 520456, 517779, 515576, 513938, 512751, 511934, 511838, 513494, 517450, 522151, 524730, 523943, 521335, 519163, 518368, 518879, 520389, 522066, 522727, 522220, 521695, 521921, 522331, 522184, 521445, 519901, 516780, 512165, 507646, 504550, 502467, 500332, 498031, 496019, 494193, 492061, 489373, 485975, 481743, 477151, 473068, 469591, 466221, 463593, 463542, 466512, 470304, 472592, 473646, 475345, 478586, 483095, 488935, 496459, 505054, 513386, 520969, 528397, 535964, 542956]
57788E42956N496L760K427J665J239P35j16j197k271l162l546l162k579k982m578
57773E34685o128o590o243n543m266k769k462l618m348l438k581l634n219m687
57759D73159k302n79k26J88Q38J52k043l759l919l659l947m211m080m379n508
57744D35725o613p021o908o292n036m014m207m471k607R15K872J826L00J133L827
57729C99429N973O455N626L966K198J620K748M430N381N711O132O721P324Q081
57715D71795Q631Q021O322N161N602O534O216M489K368M75j039j792j715j794
57701E19274l185n764q223r341q791p184n693n083m830l776j820j82J85l75j021
57686D54191j392j456j258j064j008n57P64K189K450J663J190J569K085K465L253
$$ y = [542956, 548452, 552212, 554639, 556304, 557543, 558278, 558162, 556965, 554694, 551532, 547986, 544824, 542245, 539263, 534685, 528557, 521967, 515724, 510181, 505915, 503146, 500684, 497066, 492718, 489280, 486699, 483065, 477846, 473159, 470857, 470278, 470052, 470240, 471078, 471230, 469187, 465428, 461509, 457850, 453903, 449692, 445612, 441233, 435725, 429112, 422091, 415183, 408891, 403855, 399841, 395634, 391163, 388556, 389471, 392343, 394169, 394469, 395602, 399429, 405402, 411857, 417483, 421449, 423647, 425267, 428015, 432445, 437826, 443537, 449669, 456390, 463714, 471795, 480426, 488447, 494769, 499930, 505532, 512066, 518282, 522771, 525139, 525614, 524575, 522783, 521068, 519274, 516089, 510325, 502102, 492761, 483970, 476786, 471093, 466010, 461180, 457404, 455584, 455402, 455587, 455212, 454191, 452799, 451343, 450085, 449021, 448013, 447456, 448220, 450409, 452859, 454522, 455712, 457281, 459366, 461831, 465084]
57671D65084M095L556J485j36K25J629K270J898J553J883K728L567L661K570J098
57656D97166N96R41M68j498l598m703n562o976p899o984m988l954m561n670n999
57641D36779n150l429j712j072j684k473k468j870j292p70l06m36j338k037j428
57626D09314M34K671M493N272M753L898M475O916R577J1034J2022J4030J7057
57613E05946K0159K3412K7727L3111L8452M2947M6623M9328M9908M6465L7456
57602I21534K3161O253r775k3076l3561m0812m3686m2525l9903l7769l5338l1120
57590F13383k5773k1291j8470j6761j5672j4614j2326q371m706l761n208o347
57578D60083n545l644j978p53K21O41J53j034k374l289l348k698k180k423l097
$$ y = [465084, 469179, 472735, 474220, 474084, 474309, 475938, 478208, 480106, 481659, 483542, 486270, 489837, 493498, 496068, 497166, 497762, 498703, 499171, 497673, 494075, 489372, 483810, 476834, 468935, 461951, 456963, 453009, 448448, 442778, 436779, 431629, 428200, 426488, 425416, 423732, 421259, 418791, 416921, 415629, 414859, 414553, 414117, 412779, 410742, 409314, 409748, 412419, 416912, 422184, 426937, 430835, 435310, 442226, 451803, 462837, 474859, 488889, 505946, 526105, 549517, 577244, 610355, 648807, 691754, 738377, 787705, 837613, 884078, 921534, 944695, 950948, 941173, 918097, 884536, 843724, 800038, 757513, 717610, 679841, 644503, 613383, 587610, 566319, 547849, 531088, 515416, 500802, 488476, 480105, 475399, 471638, 466430, 460083, 454538, 450894, 448916, 448163, 448384, 449025, 449178, 448144, 445770, 442481, 439133, 436435, 434255, 431832, 428735]
57563D28735l531l582l316k462j078q9k68j167j877k272k511k202j193m53p73
57548D01961j221m29J006J089o76k552k862j701j38R84J112kj803l134l316k689
57532C85629k019j818k161k757l261l753m505n110m632l066j668j200q73L5P26
57517C49567J72j093j963k596l706m757m601l385k127r07P57K070J561n08k123
57502C26361k188j566j334j534j847j987j284N58K117J425j176l035k590j136
57488C10784m94m81J86J624K652K399J215K68N59J988L276L412K857K575K284
57473C35104R25j214k477k132j288j076j295j357j279j010M9J992L709L991K804
57458C35446J106lK31J744L449M227M242M350M499L987L278L836N649O682N597
$$ y = [428735, 425204, 421622, 418306, 415844, 414766, 414677, 414409, 413242, 411365, 409093, 406582, 404380, 403187, 402734, 401961, 400740, 400311, 401317, 402406, 401730, 399178, 396316, 394615, 394477, 395461, 396573, 396571, 394768, 391634, 388318, 385629, 383610, 381792, 379631, 376874, 373613, 369860, 365355, 360245, 355613, 352547, 350879, 349679, 348806, 348841, 349567, 349739, 348646, 346683, 344087, 340381, 335624, 331023, 327638, 325511, 324604, 325361, 327431, 328992, 328484, 326361, 324173, 322607, 321273, 319739, 317892, 315905, 314621, 315179, 317296, 318721, 317545, 314510, 311920, 310784, 310290, 309809, 309995, 311619, 314271, 316670, 317885, 318153, 318712, 320700, 323976, 327388, 330245, 332820, 335104, 336029, 334815, 332338, 330206, 328918, 327842, 326547, 325190, 323911, 322901, 322950, 324942, 328651, 332642, 335446, 336552, 336549, 336780, 338524, 341973, 346200, 350442, 354792, 359291, 363278, 366556, 370392, 376041, 382723, 388320]
57443C88320L558K324J952J607J399J898K561K198P63m74n29L69J378J871J767
57428D10962J460J423J655J736J473J044M77m58j621k385k353j678o53L71P12
57413D12165p3j225j444o13J63L99Q33J810K516K503K655L595M313L631K151J449
57397D34828J872K385K364K327K858L687M049L524K444J657J754K419K849K824
57383D71841K849L133L242K959K756L031L490L691L565L128K403J898K366L673
57369E14025M731M941M903N184N346M800L874L312L333L692M064M055L633L787
57355E73680N624Q316R340P651N393N263P125Q567Q042O206M656M603O255Q340
57341F69061Q639O244L023J733K937M925O323P342Q387Q937Q467P565P274P670
$$ y = [388320, 391878, 394202, 396154, 397761, 399160, 401058, 403619, 405817, 406580, 406106, 405577, 405946, 407324, 409195, 410962, 412422, 413845, 415500, 417236, 418709, 419753, 420230, 419772, 418151, 415766, 413413, 411735, 411082, 411453, 412165, 412092, 410867, 409423, 408810, 408973, 409372, 410205, 412015, 414531, 417034, 419689, 423284, 427597, 431228, 433379, 434828, 436700, 439085, 441449, 443776, 446634, 450321, 454370, 457894, 460338, 461995, 463749, 466168, 469017, 471841, 474690, 477823, 481065, 484024, 486780, 489811, 493301, 496992, 500557, 503685, 506088, 507986, 510352, 514025, 518756, 523697, 528600, 533784, 539130, 543930, 547804, 551116, 554449, 558141, 562205, 566260, 569893, 573680, 579304, 587620, 596960, 604611, 610004, 615267, 622392, 630959, 639001, 645207, 649863, 654466, 660721, 669061, 677700, 683944, 686967, 688700, 691637, 696562, 702885, 710227, 718614, 727551, 736018, 743583, 750857, 758527]
57327G58527P723O669N240N155P209J0102J1638J1014R354Q059P593P976R295
57314H65554J1217J2944J4286J5906J7865J8910J8120J6390J5418J5865J7235
57303A039710J8786J9645J9001J7224J6064J6604J7728J7807J6977J6436J6283
57292A232265J5771J5156J5441J6422J6852J6613J6942J8163J8888J8171J7015
57281A417699J6792J7298J7464J7210J7437J8443J9425J9680J9631K0125K1119
57270A622323K1644K1229K0652K0686K0702J9634J8089J7942J9506K0792K0422
57259A843621J9670K0311K1765K2167K1296K0535K0483K0503K0444K0870K1631
57248B073296K1848K1481K1361K1591K1565K1620K2804K4686K5400K4589K4300
$$ y = [758527, 766250, 772919, 778159, 783314, 790523, 800625, 812263, 823277, 832631, 840690, 848283, 856259, 865554, 876771, 889715, 904001, 919907, 937772, 956682, 974802, 991192, 1006610, 1022475, 1039710, 1058496, 1078141, 1097142, 1114366, 1130430, 1147034, 1164762, 1182569, 1199546, 1215982, 1232265, 1248036, 1263192, 1278633, 1295055, 1311907, 1328520, 1345462, 1363625, 1382513, 1400684, 1417699, 1434491, 1451789, 1469253, 1486463, 1503900, 1522343, 1541768, 1561448, 1581079, 1601204, 1622323, 1643967, 1665196, 1685848, 1706534, 1727236, 1746870, 1764959, 1782901, 1802407, 1823199, 1843621, 1863291, 1883602, 1905367, 1927534, 1948830, 1969365, 1989848, 2010351, 2030795, 2051665, 2073296, 2095144, 2116625, 2137986, 2159577, 2181142, 2202762, 2225566, 2250252, 2275652, 2300241, 2324541]
57237B324541K5769K7142K6135K3637K2562K3783K5241K5178K4374K4551K5929
57226B598842K7410K8418K9368L0453L0985L0389K9194K8488K8602K9004K9276
57215B920429K9507K9698K9539K9069K8764K8698K8256K7181K6199K6038K6507
57204C229885K7105K7844K8788K9447K9455K9274K9429K9662K9658K9850L0550
57193C550947L0936L0105K8462K6947K5518K3778K2398K2371K3230K3636K3518
57182C831846K3915K4944K5659K5953K6680K7699K7708K6548K5807K6358K7034
57171D120151K6667K5882K5696K5699K4926K3541K2267K0916J8784J5974J3205
57160D363708J0664Q069N665M166L728L680L374K831K473K607L188L869M190L840
$$ y = [2324541, 2350310, 2377452, 2403587, 2427224, 2449786, 2473569, 2498810, 2523988, 2548362, 2572913, 2598842, 2626252, 2654670, 2684038, 2714491, 2745476, 2775865, 2805059, 2833547, 2862149, 2891153, 2920429, 2949936, 2979634, 3009173, 3038242, 3067006, 3095704, 3123960, 3151141, 3177340, 3203378, 3229885, 3256990, 3284834, 3313622, 3343069, 3372524, 3401798, 3431227, 3460889, 3490547, 3520397, 3550947, 3581883, 3611988, 3640450, 3667397, 3692915, 3716693, 3739091, 3761462, 3784692, 3808328, 3831846, 3855761, 3880705, 3906364, 3932317, 3958997, 3986696, 4014404, 4040952, 4066759, 4093117, 4120151, 4146818, 4172700, 4198396, 4224095, 4249021, 4272562, 4294829, 4315745, 4334529, 4350503, 4363708, 4374372, 4382441, 4388106, 4392272, 4396000, 4399680, 4403054, 4405885, 4408358, 4410965, 4414153, 4418022, 4422212, 4426052]
57146D426052K875J764J271J872L164M300N231O865R517J1961J2926J2846J3047
57133D513691J3791J4426J5077J6562J8474J8910J6663J2710R173P624Q528J1422
57121D677051J5118J8395K0663K1644K0894J8367J4929J1226O541jp694j5226
57109D801907k2946l2351m3430n4468o4508p4225q4051r3295j01366j08069j12418
57098D010780j13129j10953j08646j08026j08724j10344j13807j19567j26396
57089B991188j32988j39322j45551j51047j55337j58488j59894j58318j53823
57080A636420j47993j41763j35139j29624j28362j32581j40194j49476j61841
57071C69447j79145i934k22435k45001k69366k97096l29314l66962m10203m58520
$$ y = [4426052, 4428927, 4430691, 4431962, 4433834, 4436998, 4441298, 4446529, 4453394, 4462911, 4474872, 4487798, 4500644, 4513691, 4527482, 4541908, 4556985, 4573547, 4592021, 4610931, 4627594, 4640304, 4649477, 4657101, 4665629, 4677051, 4692169, 4710564, 4731227, 4752871, 4773765, 4792132, 4807061, 4818287, 4824828, 4824827, 4817133, 4801907, 4778961, 4746610, 4703180, 4648712, 4584204, 4509979, 4425928, 4332633, 4231267, 4123198, 4010780, 3897651, 3786698, 3678052, 3570026, 3461302, 3350958, 3237151, 3117584, 2991188, 2858200, 2718878, 2573327, 2422280, 2266943, 2108455, 1948561, 1790243, 1636420, 1488427, 1346664, 1211525, 1081901, 953539, 820958, 680764, 531288, 369447, 190302, -9934, -232369, -477370, -746736, -1043832, -1373146, -1740108, -2150311, -2608831]
57061b608831n12241n72477o38909p09858p85668q69731r64905j071528j190582
57052i924730j325939j481348j657851j856671k082264k340115k634050k968460
57044b6271428l350932l790223m294330m873831n545351o329778p249584q329230
57036g0034687r592282j1051925j2704430j4531457j6501831j8567031k0661298
57029a73644941k2710419k4633810k6338980k7735111k8760458k9351197k9313197
57022c62488113k8213950k5486414k0762836j4192280o463847J480976Q803181
57015d47323283J4953433J9665040K2875560K4676442K5292724K5048845K4299156
57008b90512083K3343619K2369285K1443669K0550949J9639008J8653871J7559614
$$ y = [-2608831, -3121072, -3693549, -4332458, -5042316, -5827984, -6697715, -7662620, -8734148, -9924730, -11250669, -12732017, -14389868, -16246539, -18328803, -20668918, -23302968, -26271428, -29622360, -33412583, -37706913, -42580744, -48126095, -54455873, -61705457, -70034687, -79626969, -90678894, -103383324, -117914781, -134416612, -152983643, -173644941, -196355360, -220989170, -247328150, -275063261, -303823719, -333174916, -362488113, -390702063, -416188477, -436951313, -451143593, -457607440, -456126464, -447323283, -432369850, -412704810, -389829250, -365152808, -339860084, -314811239, -290512083, -267168464, -244799179, -223355510, -202804561, -183165553, -164511682, -146952068]
57001a46952068J6348665J5041838J3678366J2303633J0961286R688631Q512585
56994f0417064P447866O499007N663515M933887M299783L750718L276945K868323
56986b1677020K514733K208560J945284J720710J528950J363864J220886J096423
56978h077610R86860Q89549Q03795P29438O65030O08427N58690N16074M80236
56969a839511M49479M22055L97453a94809A60792L34528L11184K87815K67994
56960A362313K51548K33219K07939J76402J43958J14999R0466P0143N4465M3277
56950B748729L4859K7483K0806J4966R569M323l09m002p202j0212j2454j3497
56938B813059j4124j5568j8203k1706k6084l1697l8326m4792m9782n3043n5732
$$ y = [-146952068, -130603403, -115561565, -101883199, -89579566, -78618280, -68929649, -60417064, -52969198, -46470191, -40806676, -35872789, -31573006, -27822288, -24545343, -21677020, -19162287, -16953727, -15008443, -13287733, -11758783, -10394919, -9174033, -8077610, -7090750, -6201201, -5397406, -4667968, -4002938, -3394511, -2835821, -2319747, -1839511, -1390032, -967977, -570524, -194809, 160792, 495320, 806504, 1094319, 1362313, 1613861, 1847080, 2055019, 2231421, 2375379, 2490378, 2580844, 2650987, 2705452, 2748729, 2783588, 2811071, 2831877, 2846843, 2856412, 2860735, 2860426, 2856424, 2849222, 2839010, 2826556, 2813059, 2798935, 2783367, 2765164, 2743458, 2717374, 2685677, 2647351, 2602559, 2552777, 2499734, 2444002]
56927B444002n9229o3401o6528o7554o7811o9602p3528p8388q3272q8226r2885
56916A633578r6308r8656j01475j05533j09778j13302j16892j21446j25974j28512
56906E15702j28135j24782j17938C7575e6617q1156o9163n7465m5735l5278k7476
56895c72890k2172j8296j5318j3295j2080j1274j0780j0701j0730j0248q985p141
56883e23910m879k218M72K492L769N298Q080J1870J5585J8666K1414K4105K6475
56870c92781K8059K8137K5493J9430J1312L986r16m013o148p014o843p588j0302
56857c19188j2540j1043o487k899k171k004j49K123K530J692K060M074N795O037
56843c32170N778O169O851O954O714P222Q964J1149J2489J2481J1872J1710J2129
$$ y = [2444002, 2384773, 2321372, 2254844, 2187290, 2119479, 2049877, 1976349, 1897961, 1814689, 1726463, 1633578, 1537270, 1438614, 1337139, 1231606, 1121828, 1008526, 891634, 770188, 644214, 515702, 387567, 262785, 144847, 37575, -56617, -137773, -206936, -264401, -310136, -345414, -372890, -395062, -413358, -428676, -441971, -454051, -465325, -476105, -486806, -497536, -507784, -516769, -523910, -528789, -531007, -530535, -528043, -524274, -518976, -510896, -499026, -483441, -464775, -443361, -419256, -392781, -364722, -336585, -311092, -291662, -280350, -276364, -277280, -281293, -287441, -294455, -301298, -308886, -319188, -331728, -342771, -349258, -352157, -354328, -356332, -356481, -354358, -351828, -350136, -348076, -344002, -338207, -332170, -326392, -320223, -313372, -306418, -299704, -292482, -283518, -272369, -259880, -247399, -235527, -223817, -211688]
56830b11688J2411J2255J2337J3404J5299J7133J7848J6524J2938Q240M302J905
56818f7092L17j062j707j287p31q25p31P16L117N423Q028J1999J6553g841A2442
56802C3885K4778K9140L2081L2626L1005K6878J9760J0935L244j441l556m471
56790B34864m778m453l887l699l618k452M38M227P804J1471J6481K2854K8778
56777C04030L2874L5973L9543M3028M4286M2352L8080L1864K2578R790m288j6387
56765F23723k4846k9829l1783l1124k8907k6219k2973j8466j3154q554n168j738
56753C80962K919Q433J3752J8631K3388K7876L1382L3011L1518K5380J4234K08
56741F11694j3000k2635k8262l0962l1955l1953l0986k8626k4826k0621j7412
$$ y = [-211688, -199277, -187022, -174685, -161281, -145982, -128849, -111001, -94477, -81539, -73299, -68997, -67092, -66775, -67837, -69544, -70831, -71562, -72387, -73118, -72402, -69285, -63862, -55834, -43835, -27282, -7841, 12442, 33885, 58663, 87803, 119884, 152510, 183515, 210393, 230153, 241088, 244332, 242891, 239335, 234864, 230086, 225633, 221746, 218047, 214429, 211977, 212415, 216642, 224446, 235917, 252398, 275252, 304030, 336904, 372877, 412420, 455448, 499734, 542086, 580166, 612030, 634608, 644398, 640110, 623723, 598877, 569048, 537265, 506141, 477234, 451015, 428042, 409576, 396422, 387868, 382700, 380962, 383881, 392314, 406066, 424697, 448085, 475961, 507343, 540354, 571872, 597252, 611486, 611694, 598694, 576059, 547797, 516835, 484880, 452927, 421941, 393315, 368489, 347868, 330456]
56730C30456j5276j2852r234n277k266J37L553Q520J3524J6586J7094J5630J2663
56717C73258Q084J855n458j2648j8199k1015k1322k0656k0301j9984j8636j6286
56705B08692j4266j3467j3288j2757j1797j0809r678q176o836o393o442n807m286
56692H4690l062l021l529l439k584j648j084q37q82j303j954k488k731k630k068
56677E1430j127l04j04m92j132j897k606k627j497R1P43rj178j658j450j211j138
56660C3834q22P6J390K574K979K316J106M18R25K279L600M230L911K684J106J83
56644F2789N48J700K451K060P01r11k007k050j114PM46J33k75l15j57j45k24n
56626F3632P95K007K953K862J706N30M85J561K624K851K557K451K657K805K657
$$ y = [330456, 315180, 302328, 293094, 287817, 285551, 285688, 289241, 297761, 311285, 327871, 344965, 360595, 373258, 381342, 383197, 377739, 365091, 346892, 325877, 304555, 283899, 263598, 243614, 224978, 208692, 194426, 180959, 167671, 154914, 143117, 132308, 122630, 114454, 107618, 101225, 94783, 88976, 84690, 81628, 78607, 75078, 71639, 69055, 67407, 66323, 65486, 64604, 63301, 61347, 58859, 56128, 53498, 51430, 50303, 49999, 49895, 49403, 48271, 46374, 43768, 41141, 39644, 39735, 40478, 40469, 39291, 37633, 36183, 34972, 33834, 33012, 33088, 34478, 37052, 40031, 42347, 43453, 43871, 44796, 47075, 50675, 54905, 58816, 61500, 62606, 62789, 63337, 65037, 67488, 69548, 70249, 69338, 67331, 65281, 64167, 64174, 64620, 64753, 64478, 64163, 64006, 63861, 63637, 63632, 64427, 66434, 69387, 72249, 73955, 74485, 74970, 76531, 79155, 82006, 84563, 87014, 89671, 92476, 95133]
56611I5133K091J022k44q15j71R50J285O06j03J6Q94K119L371M037L362J628L64
56594A15545N96J517J776J438J519J992J725M94m13q9O75O64j62j098j919k711
56578A21549l119k754j979j407q94J03J444K442K940L297L472L104K521K614L423
56563A36756L760K748J028j07k78j87n29j222j653j382n90J04K12l23j333k468
56547A34536k960k113m56L26m99j383m38J747K760J627r7p40l42L18R69J344Q89
56530A35488p9j80R29J513J85j729j934m82N50L70M59K003M044M937M381L193
56514A53648J980R93O80J447K880L891L847L350L717N631Q290J0026R879Q499
56500B18758P416P676R222J1230J2729J3101J2325J0731Q599O292M603M160M387
$$ y = [95133, 97224, 98246, 98002, 97187, 97016, 97966, 99251, 99857, 99754, 99770, 100664, 102783, 106154, 110191, 113553, 115181, 115545, 116141, 117658, 119434, 120872, 122391, 124383, 126108, 126602, 126189, 126100, 126775, 127439, 127277, 126179, 124260, 121549, 118430, 115676, 113697, 112290, 111396, 111499, 112943, 115385, 118325, 121622, 125094, 128198, 130719, 133333, 136756, 140516, 143264, 144292, 144185, 143907, 143720, 143191, 141969, 140316, 138934, 138344, 138448, 138660, 138337, 137004, 134536, 131576, 129463, 129007, 129333, 128834, 127451, 127013, 128760, 131520, 133147, 133050, 132310, 131968, 132286, 133255, 134599, 135488, 135409, 135229, 136158, 137671, 137856, 136127, 134193, 133711, 134261, 134631, 135090, 137093, 141137, 146074, 150455, 153648, 155628, 156621, 157301, 158748, 161628, 165519, 169366, 172716, 176433, 182064, 190354, 200380, 210259, 218758, 226174, 233850, 243072, 254302, 267031, 280132, 292457, 303188, 311787, 318079, 322682, 326842, 331229]
56487C31229M017K932K440L010L040J118j468k226j032k80j392l008l350k679
56473C32351k409k889l473m076n236o771p526o824n326m045l155k373k052k945
56459B73251m700n525m167j836j036k436m055m053l176l272m289m345k756j290
56445B26315j709l331m040l086j665r43o79j66L58P3j053k054k237j879j437p46
56429B01721L97J439J601J044O97J040J672K012J764Q27m06r10j00J064J160L80
56413B15402J66Q89J458J505J935K680K005o02k784k320k16J135J497K278L503
56398B28531L879L304K907K717J661j4n95L76J381J438J377J900K300K040J894
56383B55096K404K709K066J319J547K232K030Q06l12m04N73K172L670M148L222
$$ y = [331229, 335246, 338178, 340618, 343628, 346668, 347786, 346318, 344092, 343060, 342780, 341388, 338380, 335030, 332351, 329942, 327053, 323580, 319504, 314268, 307497, 299971, 293147, 287821, 283776, 280621, 278248, 276196, 273251, 268551, 263026, 258859, 257023, 255987, 253551, 249496, 245443, 242267, 238995, 234706, 230361, 227605, 226315, 224606, 221275, 217235, 214149, 212484, 211541, 210862, 210696, 211054, 211127, 210074, 208020, 205783, 203904, 202467, 201721, 202118, 203557, 205158, 206202, 206899, 207939, 209611, 211623, 213387, 214214, 213808, 212898, 212798, 213862, 215022, 215402, 215568, 216457, 217915, 219420, 221355, 224035, 226040, 225438, 222654, 220334, 220118, 221253, 222750, 225028, 228531, 232410, 235714, 238621, 241338, 242999, 242985, 242390, 242766, 244147, 245585, 246962, 248862, 251162, 253202, 255096, 257500, 260209, 262275, 263594, 265141, 267373, 269403, 270209, 269897, 269493, 270066, 272238, 275908, 280056, 283278]
56368B83278J586M01K39P51J068M11j187k591k548j147J88M24rj07L62P97O53
56351B82569j2o73q36m83k6L18P42J286J602J665K009K590K352R51m6P93K234
56334B97035J792o08k375j820o5J087J427J685K049K198J873Q54o94j643q44J073
56318C03024K155J623N79l5n39j100r92j35K35n16j224p33L24P11L92J28J46L17
56300C04360P21J182J024O9q70j187j144r39k50P00J040R53J917M209N767M858
56284C22410K470N88n41j635k125p81J872L779L925L173K629K514K702L194L789
56269C47963M053L740K986K218K056K750L580L587L037L100L832L839K521J134
56255C90396P94Q93O52P65K030L553L913L370L351M368N617O206N799M653L725
$$ y = [283278, 284864, 285265, 285504, 286255, 287323, 287734, 286547, 283956, 281408, 280261, 280449, 280873, 280864, 280757, 281119, 281916, 282569, 282557, 281884, 281048, 280565, 280539, 280857, 281599, 282885, 284487, 286152, 288161, 290751, 293103, 294054, 294008, 294801, 297035, 298827, 298219, 295844, 294024, 293959, 295046, 296473, 298158, 300207, 302405, 304278, 305132, 304438, 302795, 301951, 303024, 305179, 306802, 307381, 307346, 306807, 305707, 304715, 304580, 304815, 304299, 303075, 302342, 302666, 303377, 303769, 303897, 304043, 304360, 305081, 306263, 307287, 307356, 306486, 305299, 304155, 303216, 302966, 303666, 304706, 305659, 307576, 311785, 317552, 322410, 324880, 325468, 324927, 323292, 321167, 320386, 322258, 326037, 329962, 333135, 335764, 338278, 340980, 344174, 347963, 352016, 355756, 358742, 360960, 363016, 365766, 369346, 372933, 375970, 379070, 382902, 386741, 389262, 390396, 391190, 392083, 392735, 393500, 395530, 399083, 402996, 406366, 409717, 414085, 419702, 425908, 431707, 436360, 440085]
56240D40085L968M874M921M067M156N896P274O566N111N174O482P117O767O811
56226E19269P841R089R791R497P774N364M601O709R528J0067Q571P785Q863J0457
56212F35206J1449J2191J3045J3940J5390J7781J9793J9734J8521J9050K2257
56201H18357K5912K7812K8261K8839L0572L3868L8597M3557M7258M9858N3028
56190A225919N7635O2857O7787P2462P6830Q0182Q2198Q3421Q4169Q3972Q2420
56179B059852P9732P6043P0923O3775N4260M2540K9613J6905M891p157j9248k9774
56167B442355l7786m4874n2862o0707o5875o8072o9172o9975o9673o8379o7473
56156A767507o6955o4942o0524n5137n0398m6491m3241m0979l9606l8360l7123
$$ y = [440085, 444053, 448927, 453848, 457915, 462071, 467967, 475241, 481807, 486918, 492092, 498574, 505691, 512458, 519269, 527110, 536199, 545990, 555487, 563261, 568625, 573226, 579935, 589463, 599530, 608101, 615886, 624749, 635206, 646655, 658846, 671891, 685831, 701221, 719002, 738795, 758529, 777050, 796100, 818357, 844269, 872081, 900342, 929181, 959753, 993621, 1032218, 1075775, 1123033, 1172891, 1225919, 1283554, 1346411, 1414198, 1486660, 1563490, 1643672, 1725870, 1809291, 1893460, 1977432, 2059852, 2139584, 2215627, 2286550, 2350325, 2404585, 2447125, 2476738, 2493643, 2498534, 2491377, 2472129, 2442355, 2404569, 2359695, 2306833, 2246126, 2180251, 2112179, 2043007, 1973032, 1903359, 1834980, 1767507, 1700552, 1635610, 1575086, 1519949, 1469551, 1423060, 1379819, 1338840, 1299234, 1260874, 1223751]
56145A223751l6443l5801l3513k9009k3875j9974j7785j6787j6224j5115j2957
56134I66268j0668r606r558r063p793o921o946o785n486l390j229O30J823K144
56120H93420K209K686L056K487J611J775K762L173K923L317M683N952O697P563
56106I44314Q566R061R470J0914J2927J3842J3661J4257J6343J8581K0156K1759
56094A113851K3466K4182K4098K5251K8616L2753L6364M0116M4875N0170N5493
56083A499235O1213O7275P2947P8881Q7379R9343J12610J24299J32976J37586
56073B473744J36412J28724J16242J01765Q7383P4589O4435N6512M8943M0156
56063C328905K9855J8368O549l794j1273j6744k1899k6574l0093l4934m5417o1980
$$ y = [1223751, 1187308, 1151507, 1117994, 1088985, 1065110, 1045136, 1027351, 1010564, 994340, 979225, 966268, 955600, 945994, 936436, 927373, 919580, 912659, 905713, 898928, 893442, 890052, 888823, 889453, 891276, 893420, 895629, 898315, 901371, 903858, 905469, 907244, 910006, 913179, 916102, 919419, 924102, 930054, 936751, 944314, 952880, 961941, 971411, 982325, 995252, 1009094, 1022755, 1037012, 1053355, 1071936, 1092092, 1113851, 1137317, 1161499, 1185597, 1210848, 1239464, 1272217, 1308581, 1348697, 1393572, 1443742, 1499235, 1560448, 1627723, 1700670, 1779551, 1866930, 1966273, 2078883, 2203182, 2336158, 2473744, 2610156, 2738880, 2855122, 2956887, 3044270, 3118859, 3183294, 3239806, 3288749, 3328905, 3358760, 3377128, 3383677, 3379883, 3368610, 3351866, 3329967, 3303393, 3273300, 3238366, 3192949, 3130969]
56051C130969p9900r4702j05715j13244j15882j12845j06236r8622r0332q0930
56041B132561p1341o2641n4486m6344l8735l1991k5582j9728j5674j3306j0714
56030A742019p233m508l216j344K530O664Q801R416J0307J1713J2711J3012J2809
56017A813681J2224J2069J3652J6753J9421K0694K1690K3248K4562K5035K5392
56006B028421K6062K6562K7158K8910L1465L3302L4517L6523L8678L8612L6636
55995B386846L6125L8392M0890M1689M1891M2146M0899L8242L7446M0161M3549
55984B828276M4764M5014M6602M9151N1314N3438N6055N8336O0122O2768O6321
55973C422161O8821P0000P2304P6706Q1038Q4111Q7570R1949R5092R6542R9294
$$ y = [3130969, 3051069, 2956367, 2850652, 2737408, 2621526, 2508681, 2402445, 2303823, 2213491, 2132561, 2061220, 1998579, 1944093, 1897749, 1859014, 1827023, 1801441, 1781713, 1766039, 1752733, 1742019, 1734786, 1730278, 1727062, 1725718, 1728248, 1734912, 1743713, 1753129, 1763436, 1775149, 1787860, 1800872, 1813681, 1825905, 1837974, 1851626, 1868379, 1887800, 1908494, 1930184, 1953432, 1977994, 2003029, 2028421, 2054483, 2081045, 2108203, 2137113, 2168578, 2201880, 2236397, 2272920, 2311598, 2350210, 2386846, 2422971, 2461363, 2502253, 2543942, 2585833, 2627979, 2668878, 2707120, 2744566, 2784727, 2828276, 2873040, 2918054, 2964656, 3013807, 3065121, 3118559, 3174614, 3232950, 3293072, 3355840, 3422161, 3490982, 3560982, 3633286, 3709992, 3791030, 3875141, 3962711, 4054660, 4149752, 4246294, 4345588]
55962D345588J05050J11891J18549J26502J35719J43286J48574J54971J64025
55953E554155J72962J80399J89076K00418K12103K23705K38696K57789K76704
55944G506007K93804L13221L36786L60040L80457M02377M29058M57136M84026
55935A0962912N13352N47605N82883O16700O53534O96539P41412P84809Q30925
55926A6930671Q83181R37558R91154J048925J114835J185158J258194J341239
55918B5690915J439732J548943J664509J790768J930156K076344K228005K397159
55910D0766531K593008K810426L046333L313377L624469L979277M381681M855715
55902F9370817N428372O112016O917464P862114Q946618J0150134J1475548J2975469
$$ y = [4345588, 4450638, 4562529, 4681078, 4807580, 4943299, 5086585, 5235159, 5390130, 5554155, 5727117, 5907516, 6096592, 6297010, 6509113, 6732818, 6971514, 7229303, 7506007, 7799811, 8113032, 8449818, 8809858, 9190315, 9592692, 10021750, 10478886, 10962912, 11476264, 12023869, 12606752, 13223452, 13876986, 14573525, 15314937, 16099746, 16930671, 17813852, 18751410, 19742564, 20791489, 21906324, 23091482, 24349676, 25690915, 27130647, 28679590, 30344099, 32134867, 34065023, 36141367, 38369372, 40766531, 43359539, 46169965, 49216298, 52529675, 56154144, 60133421, 64515102, 69370817, 74799189, 80911205, 87828669, 95690783, 104637401, 114787535, 126263083, 139238552]
55894A39238552J4707431J6692191J8940514K1469098K4234674K7085569K9796342
55887B92164371L2000554L2907245L1195804K5624482J6116498M269125p391573
55880D26886506j6802002k3179781k6808139k8363899k8482047k7658145k6249382
55873B49343111k4478816k2486049k0389951j8292477j6255573j4317466j2523819
55866A20598960j0918873r519739q322018p318184o491212n804443n219677m717860
55858F2286954m288548l912213l569763l258922k984841k742806k523645k326971
55850C6679245k154969k000777j855848j721594j602099j492559j386289j286175
55842B3178935j197978j118718j042146r69452r04380q43825p83365p26453o78330
$$ y = [139238552, 153945983, 170638174, 189578688, 211047786, 235282460, 262368029, 292164371, 324164925, 357072170, 388267974, 413892456, 430008954, 434278079, 426886506, 410084504, 386904723, 360096584, 331732685, 303250638, 275592493, 249343111, 224864295, 202378246, 181988295, 163695818, 147440245, 133122779, 120598960, 109680087, 100160348, 91838330, 84520146, 78028934, 72224491, 67004814, 62286954, 57998406, 54086193, 50516430, 47257508, 44272667, 41529861, 39006216, 36679245, 34524276, 32523499, 30667651, 28946057, 27343958, 25851399, 24465110, 23178935, 21980957, 20862239, 19820093, 18850641, 17946261, 17102436, 16319071, 15592618, 14914288]
55833A4914288o35994n93413n51598n14592m80727m46649m15069l89620l66677
55824A0519949l40861l14047k90490k67844k42151k17584k01901j95352j92688
55815H257031j93209k00076k12036k24026k34488k44735k53055k56297k55450
55806F183659k53097k47584k36257k22222k11133k03255j95004j86030j78268
55797D250809j70220j59214j47605j39897j35018j28055j18558j10787j06481
55788C034974j03499j00877r9310r7260r2252q5679q1067p8229p4183o9012o5558
55777B088048o4027o2108n9917n9561o0149n8303n3622m8988m5538m1775l7498
55766A496562l4362l2635l1253l0591l1430l2027l0231k7522k6769k7058k5253
$$ y = [14914288, 14278294, 13684881, 13133283, 12618691, 12137964, 11691315, 11276246, 10886626, 10519949, 10179088, 9865041, 9574551, 9306707, 9064556, 8846972, 8645071, 8449719, 8257031, 8063822, 7863746, 7651710, 7427684, 7193196, 6948461, 6695406, 6439109, 6183659, 5930562, 5682978, 5446721, 5224499, 5013366, 4810111, 4615107, 4429077, 4250809, 4080589, 3921375, 3773770, 3633873, 3498855, 3370800, 3252242, 3141455, 3034974, 2931475, 2830598, 2731288, 2634028, 2541776, 2456097, 2375030, 2296801, 2222618, 2153606, 2088048, 2024021, 1961913, 1901996, 1842435, 1782286, 1723983, 1670361, 1621373, 1575835, 1534060, 1496562, 1462200, 1429565, 1398312, 1367721, 1336291, 1304264, 1274033, 1246511, 1219742, 1192684, 1167431]
55755A167431k1700j9593j9350j8480j6624j5851j5978j4354j0609p215n086k715
55743I99876L9J528J864K845M147L675J799J184K007J578p82k702l285m643p815
55728A001315j0843j2101j2191j1703j0337r157j0384j3956j7200j8693j9486
55717H55264k0043j9271j7351j6167j5764j3621q782l894j636j699k643m383p216
55704G22794j0233j2172j2637j1888j0622r956j0043r156o096k995l103o100q497
55691F09296q652q283q757r196r108r692j1260j1948j0511q172o578n738n159
55678D96242n110n632n898n514n186n490o155o814p201o634m967l863n235q344
55664D14199j0312r552o997m199k194j928l487m948m228j979m54J86J739M311
$$ y = [1167431, 1145731, 1126138, 1106788, 1088308, 1071684, 1055833, 1039855, 1025501, 1014892, 1007677, 1002591, 999876, 999915, 1001443, 1003307, 1006152, 1010299, 1013974, 1015773, 1016957, 1018964, 1020542, 1019760, 1017058, 1013773, 1009130, 1001315, 990472, 978371, 966180, 954477, 944140, 934983, 924599, 910643, 893443, 874750, 855264, 835221, 815950, 798599, 782432, 766668, 753047, 744265, 740371, 738735, 737036, 734393, 730010, 722794, 712561, 700389, 687752, 675864, 665242, 655286, 645243, 636087, 629991, 626996, 623893, 617793, 609296, 600644, 592361, 583604, 574408, 565300, 555608, 544348, 532400, 521889, 513717, 507139, 501401, 496242, 491132, 485500, 479602, 474088, 468902, 463412, 457257, 450443, 443242, 436608, 431641, 427778, 422543, 414199, 403887, 394335, 387338, 383139, 380945, 379017, 375530, 370582, 366354, 364375, 363921, 364107, 365846, 370157]
55650C70157N797N330M382L815K644N13j288k256l649n969p724p843p304p338
55636C49267p760p934p661o566m410k451k490m029m458k666m07N40M36J96M1K86
55620B99934J501L069L442K449J515J202N64o40j348j325j721k891l858m399n283
55605B92211n948m686j884k34p59j347m33P71J178J917L733M986M469L840M842
55590C02656O200N836M296L408K935J328j190k805k888k492k444k794l772n593
55576C02681p527q486q467q227p924p042n523m054l347l632m469m845l909j987
55562B23242k46N62L48r17k825l830k699o83m03k277m034m142l576l475l337k688
55546A89020k489l359m079l359j800p77n26n35p05j038j105p62m76l80j19R0l42
$$ y = [370157, 375954, 381284, 385666, 389481, 392125, 392638, 391350, 389094, 385445, 379476, 371752, 363909, 356605, 349267, 341507, 333573, 325912, 319346, 314936, 312485, 309995, 305966, 301508, 298842, 298435, 298975, 299411, 299607, 299648, 299934, 301435, 304504, 307946, 310395, 311910, 313112, 313676, 313036, 311688, 310363, 308642, 305751, 301893, 297494, 292211, 286263, 281577, 279693, 279459, 278700, 277353, 276920, 277691, 278869, 280786, 284519, 289505, 293974, 297814, 302656, 308856, 314692, 318988, 322396, 325331, 326659, 325469, 322664, 319776, 317284, 314840, 312046, 308274, 302681, 295154, 286668, 278201, 269974, 262050, 255008, 249485, 245431, 242084, 238452, 233983, 229138, 225229, 223242, 222996, 223558, 223906, 222989, 220164, 216334, 213635, 212952, 212549, 210272, 206238, 202096, 198520, 195045, 191708, 189020, 186531, 183172, 179093, 175734, 173934, 173157, 172631, 172096, 171391, 170353, 169248, 168486, 168010, 167630, 167511, 167601, 167259]
55529A67259q78l42P37M20j466k673j972p90l83J04J354K105J492Q78J446K045
55513A69336J505R85J810K831K418J355J221J409L77j234j551o25j93q66j870
55498A76908k854l789l730j974Q0M54n34r71l97J01L48J239K518K621J010j161
55482A69869k840l895m189l508k419j693r96M23J996K402J662R69O25p4r78r88
55466A56366p0L06p76k448l386l297k835k861l775m784m311k022R3Q4j176j178
55450A23930N84K074J770M57l65k56M36J287J698J235L53o3m1l70j210j943k454
55433A27122l202l924l626k251j070r24j111o08N71J710K277K039J023j26m32
55418A17468L99J655K520K749K341J240l07j597k091j968j811j876j813j172l06
$$ y = [167259, 166381, 166039, 166776, 167196, 165730, 163057, 161085, 160295, 159912, 160016, 161370, 163475, 164967, 165845, 167291, 169336, 170841, 171826, 173636, 176467, 178885, 180240, 181461, 182870, 183247, 182013, 180462, 179837, 179644, 178778, 176908, 174054, 170265, 166535, 164561, 164641, 165095, 164561, 163590, 163193, 163294, 163642, 164881, 167399, 170020, 171030, 169869, 167029, 163134, 158945, 155437, 153018, 151325, 150329, 150752, 152748, 155150, 156812, 157781, 158406, 158332, 157354, 156366, 156296, 156602, 155826, 153378, 149992, 146695, 143860, 140999, 137224, 132440, 128129, 126107, 126200, 126284, 125108, 123930, 124514, 126588, 128358, 128815, 128450, 128194, 128630, 129917, 131615, 132850, 133203, 133140, 133099, 132729, 131519, 129576, 127122, 123920, 119996, 116370, 114119, 113049, 112125, 111014, 110406, 110977, 112687, 114964, 117003, 118026, 117900, 117468, 117867, 119522, 122042, 124791, 127132, 128372, 128065, 126468, 124377, 122409, 120598, 118722, 116909, 115737, 115431]
55403A15431l96k051m061m465k952j071J28J206K474K732J165q16j282l76L81
55388A06047N37O97Q08L97R1Q90K123K056O16l81R9J133J675J767J409j2k259
55371A17693l621k801o07J169J822K032K646L728M514M005J990m26j733j429j57
55356A28825J138J578M32k030m030l816j677N65J788K114J609J14j524j821q31
55341A22434l99j532k916k922j838r89n95J02J046J183J59q28m72P68R92p08k756
55324A10729k796p26J128J171N29R23J949K032J200R24J546J806J075J99j60l85
55308A21144o76n11Q8K03m81j222j796k957m481m566k398Q0N37o53j333p86k24
55291I9968l31k06R05K234K576J919J274J269J478J087o6j245j579r73j79O4k64
$$ y = [115431, 115035, 112984, 108923, 104458, 101506, 100435, 100563, 101769, 104243, 106975, 108140, 107324, 106042, 105666, 106047, 106584, 107281, 108089, 108486, 108577, 109467, 111590, 113646, 114262, 113881, 113980, 115113, 116788, 118555, 119964, 119952, 117693, 114072, 111271, 110664, 111833, 113655, 115687, 118333, 122061, 126575, 130580, 132570, 132144, 130411, 128982, 128825, 129963, 131541, 131973, 129943, 125913, 122097, 120420, 120985, 122773, 124887, 126496, 126610, 125086, 123265, 122434, 122035, 120503, 117587, 114665, 112827, 111838, 111243, 111345, 112391, 113574, 113733, 112905, 112433, 113201, 114193, 113485, 110729, 107933, 107207, 108335, 109506, 110035, 110958, 112907, 114939, 116139, 117063, 118609, 120415, 121490, 121689, 121529, 121144, 120468, 119957, 120045, 120248, 119767, 118545, 116749, 113792, 109311, 104745, 102347, 102427, 102964, 102311, 100978, 100192, 99968, 99637, 99431, 100336, 102570, 105146, 107065, 108339, 109608, 111086, 112173, 112107, 110862, 109283, 108310, 108131, 108195, 107931]
55274A07931n92n09j85j38m90o01J77J387J715P39k67MJ088J632J541J865K657
55257A17954K557R88o77j009n33p34j764k333j696o80m50j051j651j817j899k125
55241A03080j969r96J04K45k80RJ423K146P67j377j841m53P22N64K03Q20J810
55224A04977J967J187J96n38q61n88J09N65M44K11L50O23N26l6q32j580j837j262
55206A03621k86R9m20j056j063n65O5Q48J584J435N4j414j419LJ190R32m6k0J567
55187A05109L239K992N59k134k935j558O24K276K958K652J538K61m65p48j246
55172A13122j950j996r68N02J573J907J315k55j943k239o65J424K379J938P97
55157A14941o72k288l226k504l60J664K290J714J162J483K306K443J172q62k175
$$ y = [107931, 107339, 106830, 106645, 106507, 106017, 105416, 105593, 106980, 108695, 109434, 109167, 109171, 110259, 111891, 113432, 115297, 117954, 120511, 121499, 120822, 119813, 119280, 118546, 116782, 114449, 112753, 112073, 111623, 110572, 108921, 107104, 105205, 103080, 101111, 100115, 100219, 100464, 100184, 100193, 101616, 103762, 104529, 103152, 101311, 100858, 101580, 102144, 102347, 103167, 104977, 106944, 108131, 108327, 107789, 106928, 106340, 106449, 107014, 107458, 107669, 108019, 108642, 109168, 109132, 108300, 106720, 104883, 103621, 103335, 103434, 103014, 101958, 100895, 100330, 100395, 101243, 102827, 104262, 104316, 102902, 101483, 101486, 102676, 103608, 103562, 103542, 105109, 108348, 111340, 111899, 109765, 106830, 105272, 105896, 108172, 111130, 113782, 115320, 115581, 115116, 114368, 113122, 111172, 109176, 108208, 108710, 110283, 112190, 113505, 113250, 111307, 109068, 108403, 109827, 112206, 114144, 114941, 114269, 111981, 108755, 106251, 105891, 107555, 109845, 111559, 112721, 114204, 116510, 118953, 120125, 119263, 117088]
55142A17088j926n79R40K288L534M276L530P86k950n525n415l166p77M13P58J149
55126A14424J545J333O17K05M08O28J86q45j726j651n15O58N85n69j009M08K507
55109A17189L304K526J414P19K66O1K73L28m15j206p50N81J067K63m52k67o2o45
55091A24194j522k000k035j435J08J672J582p6j260r84n63q26m64J299K541J372
55075A21603q34j356r5R00R19J025J341N98j277k386j394O95K010J883R06j35
55059A24403q67j454k292l171l046j299J127K685K947K484J586K60q19p77J04
55044A21871O35L47j48l37j90N21J935L063K435J90j702j773o15L95Q89J319J901
55027A30736K481K918L007K435J292J70o51j600k912l816l336j682k00J11m05
$$ y = [117088, 115162, 114583, 115523, 117811, 121345, 125621, 129151, 129937, 126987, 121462, 116047, 112881, 112104, 112517, 113275, 114424, 115969, 117302, 117919, 118124, 118532, 119160, 119346, 118501, 116775, 115124, 114609, 115267, 115852, 115283, 114274, 114682, 117189, 120493, 123019, 124433, 125152, 125418, 125479, 125752, 126080, 125665, 124459, 123709, 124290, 125357, 125620, 125168, 124901, 124839, 124194, 122672, 120672, 118637, 117202, 117310, 118982, 120564, 120488, 119228, 118244, 117681, 116855, 116391, 117690, 120231, 121603, 120769, 119413, 119318, 120218, 121137, 122162, 123503, 124101, 122824, 120438, 119044, 119739, 121749, 123632, 124538, 124403, 123536, 122082, 119790, 116619, 113573, 112274, 113401, 116086, 119033, 121517, 123103, 123363, 122544, 121767, 121871, 122506, 122853, 122705, 122368, 122178, 122699, 124634, 127697, 130132, 130322, 128620, 126847, 126232, 126627, 127516, 128835, 130736, 133217, 136135, 139142, 141577, 142869, 143039, 142388, 140788, 137876, 134060, 130724, 129042, 128842, 128953, 128548]
55012A28548p26l91K25O84J047J429J489R12R6l77p38j504j951n50K458M398L294
54995A38343N98p64k97p1j288k739k923j914m29J317K876L053J422m80q16K02
54979A36090P67K8j040j303q99o87j013j553j875j720j037j43L27L9n49o62j54
54962A24616L66M11J97J98M24M80J32m23p55m74M03J169J005J44m4J207K710K703
54944A34469J230Q5L93J462K119K019J230j17j248r71O32J838J490N97O89J488
54928A47405J541M70p86j589k007j765l44J698K767K165J053R21J707K079J241
54913A56556j17p37l30J37j64o53j69J069J397J9j605j523J85J662J554K64r30
54896A56615j211q07o19j144j646j063K06N61l35p64M04J754J475J85k46L65P62
$$ y = [128548, 127822, 127431, 127656, 128340, 129387, 130816, 132305, 133217, 133313, 132936, 132198, 130694, 128743, 128193, 130651, 135049, 138343, 138941, 138177, 137880, 137809, 136521, 133782, 130859, 128945, 128516, 129833, 132709, 135762, 137184, 136704, 135888, 136090, 136857, 136885, 135845, 134542, 133643, 132956, 131943, 130390, 128515, 126795, 125758, 125615, 125942, 125981, 125432, 124770, 124616, 124982, 125393, 125590, 125788, 126212, 126692, 126824, 126401, 125646, 125172, 125575, 126744, 127749, 127893, 127849, 129056, 131766, 134469, 135699, 135784, 136177, 137639, 139758, 141777, 143007, 142890, 141642, 140671, 141303, 143141, 144631, 145228, 145917, 147405, 148946, 149416, 148630, 147041, 145034, 143269, 142925, 144623, 147390, 149555, 150608, 151529, 153236, 155315, 156556, 156439, 155702, 155372, 155509, 155345, 154692, 154523, 155592, 156989, 157008, 155403, 153880, 154065, 155727, 157281, 157545, 156615, 155404, 154597, 153978, 152834, 151188, 150125, 150331, 150892, 150557, 149793, 150197, 151951, 153426, 153611, 153365, 153730, 154492]
54879A54492P89J355K159J894P41L60J095J460R80J139K638L964L977L774M428
54864A85245M702L117Q75N11K441M874O616P941Q976R141Q388P357N983L476M4
54849B59687k747l999m656n839p041p001n813m922n150n760n718n105m629m284
54835A87023l301j502P3L52m61j259j365q47K37J932L574L785K006l64j005J162
54819A90040N031Q359R520Q500O557N094M750N403O445O759N042J218k682m244
54805B55792l641l663o047q863q822n602k387k010l940n588n512m370l355k859
54791A89133k722k898l328l625l383k751k299k299k431k214j565q33m96p27j130
54776A56432j010k51K25o00k429l838l872k850j370N04K483L497K916J703J271
$$ y = [154492, 155281, 156636, 158795, 160689, 161430, 161790, 162885, 164345, 165325, 166464, 169102, 173066, 177043, 180817, 185245, 189947, 193064, 193939, 194450, 196891, 201765, 208381, 216322, 225298, 234439, 242827, 250184, 256167, 259643, 259687, 256940, 252941, 248285, 242446, 235405, 228404, 222591, 217669, 212519, 206759, 201041, 195936, 191307, 187023, 183722, 182220, 182293, 182645, 182184, 180925, 179560, 178713, 178950, 180882, 184456, 188241, 190247, 189883, 188878, 190040, 195071, 203430, 212950, 221450, 228007, 233101, 237851, 243254, 249699, 256458, 261500, 262718, 260036, 255792, 252151, 248488, 242441, 233578, 224756, 219154, 216767, 214757, 210817, 205229, 199717, 195347, 191992, 189133, 186411, 183513, 180185, 176560, 173177, 170426, 168127, 165828, 163397, 161183, 159618, 158785, 158289, 157562, 156432, 155422, 155171, 155396, 154796, 152367, 148529, 144657, 141807, 140437, 140941, 143424, 146921, 149837, 151540, 152811]
54761A52811J495J069l35j440j158J43J444K166K087J060m93j490j273l65L63
54746A56084Q22J432K106K253J722J043O14J40p60j655j543j25J488J859Q60k84
54730A66056n99l46j34J09O75J229J287J123J276J510J234P85J145K309L060K612
54714A83331J587J035J297K108L043L502L100K480L005N092P504Q731Q573P796
54700B42184O888N734M188K433Q76j01m52p76j875l902o196p903q436p537n592
54685B19533l799l148l274l079k379j799j259q6J051K19k759n078m176j000J468
54670A90435K004J680J453J228J211K148L746M509L753K691K743L823M949N762
54656B32135O449O757N965L790P93k086m111m963m811m203l752l849m588n726
$$ y = [152811, 154306, 155375, 155040, 153600, 152442, 152585, 154029, 156195, 158282, 159342, 158849, 157359, 156086, 155721, 156084, 156906, 158338, 160444, 162697, 164419, 165462, 166076, 166216, 165456, 163801, 162258, 162133, 163621, 165480, 166340, 166056, 165457, 165111, 164977, 165086, 165761, 166990, 168277, 169400, 170676, 172186, 173420, 174205, 175350, 177659, 180719, 183331, 184918, 185953, 187250, 189358, 192401, 195903, 199003, 201483, 204488, 209580, 217084, 225815, 234388, 242184, 249072, 254806, 258994, 261427, 262303, 262202, 261750, 260974, 259099, 255197, 249001, 241098, 232662, 225125, 219533, 215734, 212586, 209312, 206233, 203854, 202055, 200796, 200710, 201761, 201980, 199221, 194143, 189967, 188967, 190435, 192439, 194119, 195572, 196800, 198011, 200159, 203905, 208414, 212167, 214858, 217601, 221424, 226373, 232135, 238584, 245341, 251306, 255096, 255889, 253803, 249692, 244729, 239918, 235715, 231963, 228114, 223526, 217800]
54642B17800o646o596n242l113j391j028j823k548k299j659j954l316m258l600
54628A72327k110j401j677j612l09J533K687K738K069J140K97j06L4K90Q8o62
54612A75326j493j807j257O3J558K307J667j25j915k451j427J96J046N77o42j763
54596A69860k412k436j470N06K482K964J607k78j116o82m2k18j241k326k575j676
54580A60947k38O83O80M43P21J144P64k63n47O15K017K069R05KL0K31n2m65o06
54561A69080q15j285j243M6J922K881K242O73p18j078j9J985L441L053J225k83
54545A81107l22O46J583K111K361K282J677O78k27o00l28K56M64k00j350j893
54529A88245j170K48J171J134P74Q14R43K31j317k235j282P88K023J736J089J048
$$ y = [217800, 211154, 204558, 199316, 196203, 194812, 193784, 191961, 189413, 187114, 185455, 183501, 180185, 175927, 172327, 170217, 168816, 167139, 165527, 165218, 166751, 169438, 172176, 174245, 175385, 175682, 175576, 175610, 175900, 175988, 175326, 173833, 172026, 170769, 170832, 172390, 174697, 176364, 176239, 174324, 171873, 170446, 170642, 171688, 172265, 171623, 169860, 167448, 165012, 163542, 164048, 166530, 169494, 171101, 170823, 169707, 169025, 168983, 168765, 167524, 165198, 162623, 160947, 160709, 161392, 162072, 162515, 163236, 164380, 165144, 164881, 164334, 164949, 166966, 169035, 169940, 169942, 169972, 170203, 170151, 169686, 169080, 168265, 166980, 165737, 165783, 167705, 170586, 172828, 173501, 172783, 171705, 171686, 173671, 177112, 180165, 181390, 181107, 180785, 181431, 183014, 185125, 187486, 189768, 191445, 192123, 191896, 191296, 190968, 191224, 191688, 191488, 190138, 188245, 187075, 187323, 188494, 189628, 190402, 191216, 192159, 192390, 191073, 188838, 187556, 188344, 190367, 192103, 193192, 194240]
54513A94240J038L86k19J50R28Q32j46q70q13m31n6K96K57l60n73O37K339K432
54495B00067O99p06l12Q85J443J542J959K412K237J674J204N95k11j70J419L286
54479B18023L525K142Q44N38N56L32L48R56J485J229M83j12p22j978l654m427
54463B19568l271q38J054J387R67J178K080K428J441k29j451j883j897j837j709
54448B16988j371o73L07J155J598J978K783L677L656K222j08k332l357k247P62
54433B25038L588L983K174N88P32J792K637L425M296M229K629P27q4k82r64j541
54417B52967n08J990M163M945M804M232L069J595Q15J175J898K118J883J758J956
54402B88860K205K028J120k09j028p33J32M57p2p24o87L7O67K81j335l304m463
$$ y = [194240, 195278, 195664, 195445, 195595, 196523, 197355, 197209, 196339, 195526, 195095, 195039, 195335, 195592, 195232, 194659, 195296, 197635, 200067, 200766, 200060, 199748, 200633, 202076, 203618, 205577, 207989, 210226, 211900, 213104, 213699, 213488, 213318, 214737, 218023, 221548, 223690, 224534, 225072, 225628, 225960, 226308, 227264, 228749, 229978, 230461, 230349, 229627, 227649, 223995, 219568, 216297, 215459, 216513, 217900, 218867, 220045, 222125, 224553, 225994, 225765, 224314, 222431, 220534, 218697, 216988, 215617, 214944, 215251, 216406, 218004, 219982, 222765, 226442, 230098, 232320, 232212, 229880, 226523, 224276, 225038, 228626, 232609, 234783, 235371, 236103, 237895, 240532, 243957, 248253, 252482, 255111, 255838, 255754, 255472, 254508, 252967, 252459, 254449, 258612, 263557, 268361, 272593, 275662, 277257, 278072, 279247, 281145, 283263, 285146, 286904, 288860, 291065, 293093, 294213, 294004, 292976, 292243, 292375, 292832, 292760, 292036, 291349, 291386, 292053, 292334, 290999, 287695, 283232]
54385B83232m676m778n065m685l074j075J41N02O24O40M22L63R32J701J706N19
54369B67429j540l685m690l508p69J173Q09o32q56O24K426L360L131J735l34j661
54353B63012j295l69q18k617l784l128j445R3J256K059K116J420Q46J311K689
54338B61346L870L690K025J72l98j5m97k266l166j483J156J800J73j433j684j307
54322B61983r14q3J027J291M62k60J2Q71J708K294K183J012m12q55n25o51j257
54305B67886j231m95l1K90J547L221L352J863J057J915K551J465k08j199k203
54290B79780l682m146k818j747k716m003l088r63o31k272l112j853k31qq46j644
54274B46020k004j892j402j179j690k056j016R94K186J834Q53K8p69j455j516
$$ y = [283232, 278556, 273778, 268713, 264028, 260954, 259879, 260020, 260522, 261146, 261786, 262208, 262571, 263503, 265204, 266910, 267429, 265889, 262204, 257514, 254006, 253237, 254410, 255219, 254587, 253731, 254355, 256781, 260141, 263272, 265007, 264673, 263012, 261717, 261348, 260530, 257913, 254129, 251001, 249556, 249649, 250905, 252964, 255080, 256500, 257346, 258657, 261346, 265216, 268906, 270931, 271103, 270705, 270690, 270193, 267927, 264761, 263278, 264434, 266234, 266407, 264974, 263290, 261983, 261069, 260986, 262013, 263304, 263766, 263506, 263518, 264389, 266097, 268391, 270574, 271586, 271174, 270319, 269794, 269143, 267886, 266655, 266160, 266129, 266419, 267966, 271187, 274539, 276402, 277459, 279374, 281925, 283390, 283182, 281983, 279780, 276098, 271952, 269134, 267387, 264671, 260668, 257580, 256617, 255986, 253714, 250602, 248749, 248518, 248510, 247664, 246020, 244016, 242124, 240722, 239543, 237853, 235797, 234781, 235775, 237961, 239795, 240648, 240676, 239907, 238452, 236936]
54259B36936j221j511k231j959k17J524J802R61J63m18j338k488k992k406j339
54244B23266p18p42o31L89J861K242O90j640k667j583M99J790J206j032l350l747
54228B15833j811M26O30r63j961j069M26P63K0m91j69M88R40J160J297J473J787
54211B18779K106J930R11n14j341r66K88J602K433K710K538J935R88j4p98j366
54195B31221j784j833j177J86J799L002L134J824m01k154k455j779j192p76j1
54180B27604O29k0j702k548j644l94l80j197j509j088n05J88R67R59l56j688j443
54163B15873k70k70j776k731j679L56J527J394O79q4q04j298j254o74j3J07m55
54146B08628q59j1J696K179J66k799m152l521k561j930n60J883L860M135L346
$$ y = [236936, 235715, 234204, 231973, 230014, 229797, 231321, 233123, 234084, 234247, 233829, 232491, 230003, 227011, 224605, 223266, 222548, 221806, 221175, 221564, 223425, 225667, 226357, 224717, 222050, 220467, 220966, 222756, 223962, 222930, 219580, 215833, 214022, 214448, 215078, 214115, 212154, 211085, 211511, 212274, 212294, 211803, 211634, 212122, 213062, 214222, 215519, 216992, 218779, 220885, 222815, 223726, 223212, 221871, 220905, 221193, 222795, 225228, 227938, 230476, 232411, 233399, 233385, 232587, 231221, 229437, 227604, 226427, 226613, 228412, 231414, 234548, 236372, 235971, 233817, 231362, 229583, 228391, 227615, 227604, 228233, 228213, 226511, 223963, 222319, 221925, 221545, 220348, 218839, 217751, 217246, 217434, 218401, 219360, 219004, 217316, 215873, 215603, 215333, 213557, 210826, 209147, 209503, 211030, 212424, 213103, 213019, 212215, 210917, 209663, 208989, 208976, 209083, 208628, 207769, 207758, 209454, 211633, 211799, 209000, 204848, 201327, 198766, 196836, 196276, 198159, 202019, 206154, 209500]
54131B09500K502J503K91p6R51J860R34j092j913q18O28J013N61J5m72p71k96
54114B14320J066K318K447J782J478J896K229J725O83m7j63j77o57j581k438k748
54098B22133k406j685j106j030j260j204o67j81k20m21j29N04O18p0q11p91n9
54081B11215Q36J484J625J131M46N26J685K851K648J064o58j599j770j271J27
54066B20340K029L022K167M10m02J76Q59N92r7j84K77M00j11o07m46K64R19J053
54048B30661P63O41J051J356N00j216j780J43L157M712M220L111K126N64j495
54033B48514k346j160M37O43N0L48J677K934L898N149O285O086M437K529J117
54018B80598O3m49J00J065Q51q02k200k066j255j188j766j909j304m19N97J928
$$ y = [209500, 212002, 213505, 213796, 213720, 214671, 216531, 217465, 216373, 214460, 213642, 214270, 215283, 215844, 215859, 215387, 214616, 214320, 215386, 217704, 220151, 221933, 223411, 225307, 227536, 229261, 229944, 229897, 229734, 229557, 228900, 227319, 224881, 222133, 219727, 218042, 216936, 215906, 214646, 213442, 212775, 212594, 212374, 211953, 211824, 212328, 212946, 212876, 212065, 211274, 211215, 212051, 213535, 215160, 216291, 216737, 217263, 218948, 221799, 224447, 225511, 224853, 223254, 221484, 220213, 220340, 222369, 225391, 227558, 227968, 227566, 227742, 228601, 229193, 229096, 228912, 229189, 229589, 229478, 228871, 228425, 228689, 229608, 230661, 231424, 232065, 233116, 234472, 234972, 233756, 231976, 232119, 235276, 239988, 244208, 247319, 249445, 250009, 248514, 246168, 245008, 245445, 246088, 246138, 246486, 248163, 251097, 254995, 260144, 266429, 272515, 276952, 279481, 280598, 280661, 280212, 280312, 281377, 282228, 281426, 279226, 277160, 275905, 274717, 272951, 271042, 269738, 269319, 269916, 271844]
54002B71844L242L846L602K915J995Q62M5M86K378M567N486M577K670J111O87
53987C10313J366K754M411N738O150N814N788O767P954P925O719O060P168R066
53973C93993R717Q490O882O788Q438J0177J0125Q114N793M771M928M923M079L025
53959D90243K486K289J915J421J174J050M32j040l068m953o081o292o059o189
53945D67328p093q418r430r715r270q149o462m822m348n593p430p776o002m052
53931C68768m244o182p058n311k563j203j357j533j269j443k308k937k773k226
53917C26361j533l29J172J893J358M10j09l18l93J15J207J807J251O29J305K751
53901C37577L174K064Q77J016K194L129L129K702K955M596P211R505J0510J0530
$$ y = [271844, 275086, 278932, 282534, 285449, 287444, 288306, 288351, 288837, 291215, 295782, 301268, 305845, 308515, 309626, 310313, 311679, 314433, 318844, 324582, 330732, 336546, 342334, 349101, 357055, 364980, 371699, 377759, 384927, 393993, 403710, 412200, 419082, 425870, 434308, 444485, 454610, 462724, 468517, 473288, 478216, 483139, 487218, 490243, 492729, 495018, 496933, 498354, 499528, 500578, 501010, 499970, 496902, 491949, 485868, 479576, 473517, 467328, 460235, 451817, 442387, 432672, 423402, 415253, 408791, 403969, 399621, 394028, 386598, 378822, 372820, 368768, 364524, 358342, 351284, 345973, 343410, 342207, 340850, 339317, 338048, 336605, 334297, 331360, 328587, 326361, 324828, 324499, 325671, 327564, 328922, 329332, 329223, 328905, 328512, 328627, 329834, 331641, 332892, 333521, 334826, 337577, 340751, 342815, 343692, 344708, 346902, 350031, 353160, 355862, 358817, 363413, 370624, 380129, 390639, 401169]
53887D01169J0549J1027J1709J2333J2810J2659J1088Q001M453J830P56R09J524
53874E00817J889J724J358J367J881K523L117M043N469O679O730N697M669M504
53860E52467N119O099P330Q684R623R715R292R109R610J0812J2478J3828J3685
53847F77851J1801R684Q969R147Q217N623K951J383N9k015l978m469l959m128
53833G17136n521p312q977j0688j2135j2502j1787j1015j0939j1494j2557j4154
53821E88055j5601j5530j3261r669o538n329o332q381r620r278q313p825p581
53808D64797p130p321q993j0793j0397p733n026l563k571j571j519k748l887l983
53794C87562l903m496n020m635l889l370k457q56J18n75j837k138j878k241k878
$$ y = [401169, 411718, 422745, 434454, 446787, 459597, 472256, 483344, 491345, 495798, 497628, 498384, 499293, 500817, 502706, 504430, 505788, 507155, 509036, 511559, 514676, 518719, 524188, 530867, 537597, 543294, 547963, 552467, 557586, 563685, 571015, 579699, 589322, 599037, 608329, 617438, 627048, 637860, 650338, 664166, 677851, 689652, 699336, 708305, 717452, 725669, 731292, 734243, 735626, 735685, 733670, 729692, 725223, 721264, 717136, 711615, 704303, 695326, 684638, 672503, 660001, 648214, 637199, 626260, 614766, 602209, 588055, 572454, 556924, 543663, 533994, 527456, 522127, 515795, 507414, 497794, 488516, 480203, 472378, 464797, 457667, 450346, 441353, 430560, 420163, 412430, 407404, 403841, 401270, 399699, 398180, 395432, 391545, 387562, 383659, 379163, 374143, 369508, 365619, 362249, 359792, 358936, 359054, 358479, 356642, 354504, 352626, 350385, 347507]
53779C47507k680j968j774j617k57J728K380J325J68k11o85j760k389j727n11
53764C37529J86M10P65J319J807K118K171J874J565J785K427K846K949L313M105
53749C67169M855N404O133O984P388P416P846Q625Q477O797M965M807O460Q527
53735D61853R785R928R162P963P057O772O510N400L399J376J21l08l18k46j86
53720E28268k26o52j714l143m272m984o110q230j0374j0927r774q553q466q957
53706D41886r033q749q483p649n491k810j557k484m186m872m327l626l441l424
53692C71754l100k708k718k914k482j205j05l83j767k536j469N76J555N98j076
53677C52020j825j629j852l100m120l283o27K208L741L564J819r62l269l204o04
$$ y = [347507, 344827, 342859, 341085, 339468, 339211, 340939, 343319, 344644, 344812, 344601, 343916, 342156, 339767, 338040, 337529, 337715, 338125, 338890, 340209, 342016, 344134, 346305, 348179, 349744, 351529, 353956, 356802, 359751, 363064, 367169, 372024, 377428, 383561, 390545, 397933, 405349, 413195, 421820, 430297, 437094, 442059, 446866, 453326, 461853, 471638, 481566, 490728, 498691, 505748, 512520, 519030, 524430, 527829, 529205, 529326, 529018, 528700, 528454, 528268, 528042, 527390, 525676, 522533, 518261, 513277, 507167, 498937, 488563, 477636, 467862, 459309, 450843, 441886, 432853, 424104, 415621, 407972, 402481, 399671, 398114, 395630, 391444, 386572, 382245, 378619, 375178, 371754, 368654, 365946, 363228, 360314, 357832, 356627, 356522, 356139, 354372, 351836, 350367, 350943, 352498, 353096, 352020, 350195, 348566, 346714, 343614, 339494, 336211, 335584, 337792, 341533, 345097, 346916, 345954, 342685, 339481, 338877]
53662C38877K268L185K490K190L012L716L166J797P50O47J476K820L799L683K853
53647C76729K480K960L553L750M010M599M836M327L944M483N034M000J515m63
53633D25757n11P96K059K761L364M272N236N537M618K654O62k56L8O61O79q9j210
53616D57028k200k751k650j867o74M61J199J451J281O97l67j775k903k910j567
53601D42453K98J449J438Q56L72j45j254k831l807l208j276O90J584J424J024
53586D39067J030J378J626J555J322J147J022R32J199K166L440L867K855J408
53572D64014J080J979K677K290J601J608J958J809J500J995L110L702L621L999
53558D96943N343O679P095O876O506N759M706M352N182N981N513M506M522N477
$$ y = [338877, 341145, 344330, 346820, 349010, 352022, 355738, 358904, 360701, 361451, 362098, 363574, 366394, 370193, 373876, 376729, 379209, 382169, 385722, 389472, 393482, 398081, 402917, 407244, 411188, 415671, 420705, 424705, 426220, 425757, 425246, 426042, 428101, 430862, 434226, 438498, 443734, 449271, 453889, 456543, 457205, 456949, 456987, 457648, 458327, 458238, 457028, 454828, 452077, 449427, 447560, 446886, 447347, 448546, 449997, 451278, 451975, 451608, 449833, 446930, 444020, 442453, 442751, 444200, 445638, 446494, 446866, 446721, 445467, 442636, 438829, 435621, 434345, 435035, 436619, 438043, 439067, 440097, 441475, 443101, 444656, 445978, 447125, 448147, 449079, 450278, 452444, 455884, 459751, 462606, 464014, 465094, 467073, 469750, 472040, 473641, 475249, 477207, 479016, 480516, 482511, 485621, 489323, 492944, 496943, 502286, 508965, 516060, 522936, 529442, 535201, 539907, 544259, 549441, 555422, 560935, 565441, 569963, 575440]
53544E75440N951N641N602O049N772M295K944K935L720M160M134M058L756K970
53530F37427K160J784J447O76j71o97j384k569l402l105k493k729l158k231j95
53515F21360J038P22Ll45q68j603j415m8R41N10k55j35J01q12k316k897k338j456
53497F10187l61J332L091L953M060M273M518L978K698J625J264J538K589M325
53483F49070N636N636N280O065P573Q252Q388R836J2655J4427J3811J2516J2669
53470G71814J4144J5727J7192J8779K0084K0905K2024K3783K5048K4895K4328
53459I98723K4891K6454K7790K8658K9928L2080L4753L7372L9316M0053M0029
53448A360047M0697M2671M4528M4525M2843M1151M0586M1217M2746M4483M5214
$$ y = [575440, 581391, 587032, 592634, 598683, 604455, 608750, 611694, 614629, 618349, 622509, 626643, 630701, 634457, 637427, 639587, 641371, 642818, 643494, 643323, 642626, 641242, 638673, 635271, 632166, 629673, 626944, 623786, 621555, 621360, 622398, 623120, 623123, 622778, 621910, 620307, 618892, 618844, 619785, 620295, 620040, 619905, 620006, 619194, 616878, 613981, 611643, 610187, 609826, 611158, 614249, 618202, 622262, 626535, 631053, 635031, 637729, 639354, 640618, 642156, 644745, 649070, 654706, 660342, 665622, 671687, 679260, 687512, 695900, 705736, 718391, 732818, 746629, 759145, 771814, 785958, 801685, 818877, 837656, 857740, 878645, 900669, 924452, 949500, 974395, 998723, 1023614, 1050068, 1077858, 1106516, 1136444, 1168524, 1203277, 1240649, 1279965, 1320018, 1360047, 1400744, 1443415, 1487943, 1532468, 1575311, 1616462, 1657048, 1698265, 1741011, 1785494, 1830708]
53437A830708M4292M2424M0544L8685L6937L6315L7204L7905L6615L4171L2896
53426B248696L3149L3074L1696L0130K9445K9160K8504K7620K6834K5884K4455
53415B568647K2619K0290J7154J3500J0258P881N818L239k76m701r479j3700j7160
53402B624090k0816k5187k8874l0128k9518k9475l1121l3254l4623l5487l6365
53391B289242l6931l6935l6981l7518l7977l7669l6733l5620l4371l2831l0940
53380A894736k8489k5363k2139j9626j7679j5459j2803j0188p317l317J319M656
53368A738331N950O955R658J3863J7973K1114K3451K5305K7031K9261L2343L5919
53356A987154L9473M2766M5469M7283M8721N0854N3807N6660N9198O2440O6688
$$ y = [1830708, 1875000, 1917424, 1957968, 1996653, 2033590, 2069905, 2107109, 2145014, 2181629, 2215800, 2248696, 2281845, 2314919, 2346615, 2376745, 2406190, 2435350, 2463854, 2491474, 2518308, 2544192, 2568647, 2591266, 2611556, 2628710, 2642210, 2652468, 2660349, 2666167, 2669406, 2669130, 2664429, 2654950, 2641250, 2624090, 2603274, 2578087, 2549213, 2519085, 2489567, 2460092, 2428971, 2395717, 2361094, 2325607, 2289242, 2252311, 2215376, 2178395, 2140877, 2102900, 2065231, 2028498, 1992878, 1958507, 1925676, 1894736, 1866247, 1840884, 1818745, 1799119, 1781440, 1765981, 1753178, 1742990, 1735673, 1732356, 1733675, 1738331, 1744281, 1751236, 1760894, 1774757, 1792730, 1813844, 1837295, 1862600, 1889631, 1918892, 1951235, 1987154, 2026627, 2069393, 2114862, 2162145, 2210866, 2261720, 2315527, 2372187, 2431385, 2493825, 2560513]
53345B560513P0505P2742P4232P6261P8571Q0434Q2624Q6365R0902R4057R5160
53334C462366R5659R6714R7791R8166R8419R9461J00882J01113R8946R4462Q8674
53323D532653Q2810P7823P4153P1583O9239O5973O1070N4745M7816M0985L4463
53312E213313K8117K1606J4530O661k139j2328k4341l7369m9359n9211o8150p7567
53300D953763q6348r2180r5189r7854j01168j03326j03099j02164j02481j03299
53290C966655j02604j00276r7852r6035r4317r2615r1510r1044r0507q9373q7416
53279B933106q4273p9913p5179p0966o7077o2725n7752n2561m7390m2580l8919
53268B253771l6714l4942l2333k8892k5475k2365j9387j6910j5505j4761j3509
$$ y = [2560513, 2631018, 2703760, 2777992, 2854253, 2932824, 3013258, 3095882, 3182247, 3273149, 3367206, 3462366, 3558025, 3654739, 3752530, 3850696, 3949115, 4048576, 4149458, 4250571, 4349517, 4443979, 4532653, 4615463, 4693286, 4767439, 4839022, 4908261, 4974234, 5035304, 5090049, 5137865, 5178850, 5213313, 5241430, 5263036, 5277566, 5284227, 5282088, 5269760, 5245419, 5208050, 5158691, 5099480, 5031330, 4953763, 4867415, 4775235, 4680046, 4582192, 4481024, 4377698, 4274599, 4172435, 4069954, 3966655, 3864051, 3763775, 3665923, 3569888, 3475571, 3382956, 3291446, 3200402, 3109895, 3020522, 2933106, 2848833, 2768920, 2693741, 2622775, 2555698, 2492973, 2435221, 2382660, 2335270, 2292690, 2253771, 2217057, 2182115, 2149782, 2120890, 2095415, 2073050, 2053663, 2036753, 2021248, 2006487, 1992978]
53257A992978j1125p942m601j684L91J825L259M639N138M982O150R868J4465J7461
53243B035804J9138K1961K6721L1286L3414L3187L2210L1895L2961L5313L7862
53232B371752L9463M0450M2265M5211M7613M7697M5465M2222L9036L6173L3546
53221B830893L1064K8725K6423K3682J9805J4730R428M916J089k966p782j3189
53209B966818j8749k3864k7881l0785l3523l6998m1102m5200m8930n1948n3874
53198B553964n5287n7590o0866o3059o2715o1270o0752o0531n8741n6034n4967
53187A902152n5811n6076n4578n3102n3033n3041n1549m9276m7640m6437m4919
53176A336690m3707m3684m3900m2356l8535l3791k9641k6669k4804k3647k2629
$$ y = [1992978, 1981853, 1973911, 1969310, 1967626, 1968017, 1969842, 1973101, 1977740, 1982878, 1987860, 1994010, 2003878, 2018343, 2035804, 2054942, 2076903, 2103624, 2134910, 2168324, 2201511, 2233721, 2265616, 2298577, 2333890, 2371752, 2411215, 2451665, 2493930, 2539141, 2586754, 2634451, 2679916, 2722138, 2761174, 2797347, 2830893, 2861957, 2890682, 2917105, 2940787, 2960592, 2975322, 2984750, 2989666, 2990755, 2987789, 2980007, 2966818, 2948069, 2924205, 2896324, 2865539, 2832016, 2795018, 2753916, 2708716, 2659786, 2607838, 2553964, 2498677, 2441087, 2380221, 2317162, 2254447, 2193177, 2132425, 2071894, 2013153, 1957119, 1902152, 1846341, 1790265, 1735687, 1682585, 1629552, 1576511, 1524962, 1475686, 1428046, 1381609, 1336690, 1292983, 1249299, 1205399, 1163043, 1124508, 1090717, 1061076, 1034407, 1009603, 985956, 963327]
53165I63327k1435k0109j8714j7408j6873j7667j8983j9250j8296j7611j7994
53154G58987j8390j7833j6971j6506j5590j3272j0566r328r712j0248j0093r743
53142F00735r713r847r966j0158j0291j0058r587r360r545r826r864r518q864
53129D74138q225p795p097n551l810l485m851n879m678k085n36r28k010k589k869
53114D11750l483m357n004n132m625l513k208j291q81n55J8O75R93O99j15r67
53098C82004j351j238j018q45n14m0J74P6Q0J18o20k296l669l614k805k713l346
53081C58383l259j794r8L65l94j059m78J261K939L345K450J406J178J538J706
53066C67489J573J705K381L155L306K456R76n2J54Q57M21j323k341j071J127J722
$$ y = [963327, 941892, 921783, 903069, 885661, 868788, 851121, 832138, 812888, 794592, 776981, 758987, 740597, 722764, 705793, 689287, 673697, 660425, 649859, 640531, 630819, 620571, 610478, 600735, 591022, 581175, 571209, 561051, 550760, 540702, 531115, 521755, 512210, 502384, 492520, 483002, 474138, 465913, 458118, 451021, 445470, 441660, 438175, 433324, 427445, 422767, 420682, 420146, 419218, 417208, 414619, 411750, 408267, 403910, 398906, 393774, 389149, 385636, 383428, 382137, 381256, 380701, 380719, 381394, 382387, 383086, 382971, 382004, 380653, 379415, 378397, 377552, 377038, 376998, 377172, 377248, 377328, 377446, 376826, 374530, 370861, 367247, 364442, 361729, 358383, 355124, 353330, 353232, 353597, 353203, 352144, 351666, 352927, 355866, 359211, 361661, 363067, 364245, 365783, 367489, 369062, 370767, 373148, 376303, 379609, 382065, 383041, 382989, 383143, 384000, 384421, 383098, 380757, 379686, 380813, 382535]
53050C82535N56k31K46L24j222k849k590j418k185n299p452n639j159J827J329
53035C56773m72o50N76P64q25k220j878q66q69j508j246j05L67l25q14l7J123
53018C47788J090m03k278l492l744l148j858j81J253J657O40j223k599k486j064
53003C29952O54J712J572J59j773k728j828j10L56j171l249l949k821r14N33J011
52987C17406P35K25j13j68N3N33J052J065K76q18j482j665j872k148j977j299
52971C09803q42j012j113l00J112J957J700R07K52l58j328k469l021k575j508
52956C01205m07N87J562K259K188J399O18N28J193K234L080K962J262j595m000
52941C15075m449k928p44P67J209J072J129J679K157J767O64j8L13P71K35r95
$$ y = [382535, 383091, 382860, 383106, 383430, 382208, 379359, 376769, 375351, 373166, 367867, 360415, 354776, 353617, 355444, 356773, 356301, 355651, 356227, 356991, 356166, 353946, 352068, 351202, 350333, 348825, 347579, 347474, 347841, 347516, 346702, 346665, 347788, 348878, 348475, 346197, 342705, 338961, 335813, 333955, 333774, 335027, 336684, 337324, 336101, 333502, 331016, 329952, 330606, 332318, 333890, 334049, 332276, 329548, 327720, 327610, 327966, 326795, 323546, 319597, 316776, 315862, 316395, 317406, 318141, 318366, 318253, 318085, 318138, 318671, 319723, 320788, 321064, 320246, 318764, 317099, 315227, 313079, 311102, 309803, 308961, 307949, 306836, 306536, 307648, 309605, 311305, 312212, 312464, 312106, 310778, 308309, 305288, 302713, 301205, 300798, 301385, 302947, 305206, 307394, 308793, 309411, 309939, 311132, 313366, 316446, 319408, 320670, 319075, 315075, 310626, 307698, 306954, 307721, 308930, 310002, 311131, 312810, 314967, 316734, 317398, 317380, 317693, 318464, 318699, 317704]
52925C17704j628j206n44k89N0J240L055M370M359L360K424K094J776O69q76j627
52909C34931j242q62j434k208j817k59J173J588J184M94r0j61K92L94p34k566
52893C28683l606l290k482j900j152J93J486J639M55j133j933j459m16j65j269
52878C13651k658k918k150j716k171k598k105r28L18J397J980J464o8j447j689
52863B98362j024k04M88R27P28j52r47j005o01k54J19O19O50k62j370j437k94
52846B94343J099J896J960J417M93l67q06r38j018r77p33m60p0R14K301K760J463
52829C03277l66p57M77J733J963J612J201M41p63j574j182J80J654K556K561J787
52813C14800R87R51J513J854J858K174K851K999K316J713J786J772Q91k31o45
$$ y = [317704, 316076, 314870, 314326, 314037, 314087, 315327, 318382, 322752, 327111, 330471, 332895, 334989, 336765, 337434, 336558, 334931, 333689, 332827, 331393, 329185, 327368, 327109, 328282, 329870, 331054, 331548, 331458, 331297, 331589, 331983, 331249, 328683, 325077, 321787, 319305, 317405, 316253, 316446, 317932, 319571, 320026, 318893, 316960, 315501, 315085, 314920, 313651, 310993, 308075, 305925, 304209, 302038, 299440, 297335, 296407, 296725, 298122, 300102, 301566, 301498, 300051, 298362, 297338, 297134, 297622, 298549, 299277, 299125, 298178, 297173, 296572, 296318, 296437, 297056, 297706, 297444, 296074, 294637, 294343, 295442, 297338, 299298, 300715, 301208, 300841, 300035, 299097, 298079, 297102, 296369, 295909, 295839, 296753, 299054, 301814, 303277, 302911, 302154, 302631, 304364, 306327, 307939, 309140, 309581, 308818, 307244, 306062, 306242, 307896, 310452, 313013, 314800, 315787, 316738, 318251, 320105, 321963, 324137, 326988, 329987, 332303, 334016, 335802, 337574, 338465, 338234, 337589]
52798C37589p08j422k670l328k926k030j254q23r76j780k601k795k819l627m986
52783C02844n394l969j504M81R76k23k345l629k630jK022K268J732J606J525P55
52767B94514o9K51J502K231J710N41n69j552k394k668k033n94J301L187M398M461
52751C04217L681K808K147J336Q6j335k357k412j210P45J992J226j206l489m240
52736C01989l761l270l353l508k938j497J46J139J323J273J383J230K39j336k614
52721B86445k979k388j026P07K100K637K509K051J083m31j521j133K51J103R32
52706B90340O30O22O5j506k989k952j321P89K188K178R28k51J11J824L073K744
52690B96473J678J132J169J329J669K088J703J75j223j115R5J079J567K083K387
$$ y = [337589, 336881, 335459, 332789, 329461, 326535, 324505, 323251, 322428, 321452, 319672, 317071, 314276, 311457, 307830, 302844, 297450, 293481, 291977, 292458, 293434, 293211, 290866, 287237, 284607, 284606, 286628, 288896, 290628, 292234, 293759, 294514, 294445, 294696, 296198, 298429, 300139, 300680, 300111, 298559, 296165, 293497, 291464, 290870, 292171, 295358, 299756, 304217, 307898, 310706, 312853, 314189, 314275, 312940, 310583, 308171, 306961, 307706, 309698, 310924, 309718, 306229, 301989, 298228, 294958, 291605, 288097, 285159, 283662, 283808, 284947, 286270, 287543, 288926, 290156, 290395, 289059, 286445, 283466, 281078, 280052, 280759, 282859, 285496, 288005, 290056, 291139, 290708, 289187, 288054, 288305, 289408, 290340, 290970, 291592, 291657, 290151, 287162, 284210, 282889, 283678, 285866, 288044, 288972, 288721, 288832, 290656, 293729, 296473, 298151, 299283, 300452, 301781, 303450, 305538, 307241, 307416, 306193, 305078, 305173, 306252, 307819, 309902, 312289]
52675C12289J754M83l33m28m64o66o35l46j11L11J254J993J419l7o19M02J824
52658C18090K227J409r8j722k702k406j248m28m33p21r16j263j675j583r85n70
52642C04976l90L39J707K469J598l73k039k318r07J411K799K087N85N64J678J121
52626C15307j919m393l596j064K4m20j25J166J330k03j210k85Q84K10j606k262
52610C01838j069N87J488J769J939J886J224J07p37p03L9P60J052J334K160L192
52594C16866L404K447J313J266K272K877J765p34k887l379k627j927j720j321
52580C17615m53L1n14j205n73J538L792M889M563L261J622L87K8K78M55L18J97
52563C36229K86L63K14r5n29j226k156k946l117k401r60M02O76k39j211j291j085
$$ y = [312289, 314043, 314526, 314193, 313765, 313301, 312635, 312000, 311654, 311543, 311854, 313108, 315101, 316520, 316483, 315864, 316266, 318090, 320317, 321726, 321628, 319906, 317204, 314798, 313550, 313122, 312689, 311968, 311052, 309789, 308114, 306531, 305546, 304976, 304586, 304925, 306632, 309101, 310699, 310326, 308287, 305969, 305062, 306473, 309272, 311359, 311944, 312508, 314186, 315307, 313388, 308995, 305399, 304335, 304359, 303939, 303814, 304980, 306310, 306107, 304897, 304612, 305496, 305706, 304100, 301838, 300769, 301356, 302844, 304613, 306552, 308438, 309662, 309769, 309032, 308329, 308368, 309128, 310180, 311514, 313674, 316866, 320270, 322717, 324030, 325296, 327568, 330445, 332210, 331476, 328589, 325210, 322583, 320656, 318936, 317615, 317162, 317193, 316679, 315474, 314901, 316439, 320231, 325120, 329683, 332944, 334566, 334953, 334981, 335259, 335714, 336032, 336229, 336515, 336878, 337092, 336997, 336468, 335242, 333086, 330140, 327023, 324622, 323662, 324064, 324740, 324501, 323290, 321999, 320914]
52546C20914j687k551j854O86K830K527N66o50k62M30K83k25q8P97J806K454K398
52529C28374J267p21k224j796M09K617L473L480L893M635M334K475M74p9M56M04
52513C51471p65j781j642j189j825l335m068l060j085M40P92R8j007j544q15O12
52497C31297J151O9j354j334J33J355J070l22j663k135j411L84K395L456L276
52482C36367K590J944J076q0q45r03j020j690j926p07J041J444L95l24K65J135
52466C38762J175Q23R50J250Q21l12j239j357p77K21J423K508L088L016K506K127
52450C54985K529L685M495L890K384J568J812J577l08k756l782l071k029j727
52436C63252j959k170k285k370k226j586l99J048K133K270J630J059Q53K14j360
$$ y = [320914, 319227, 316676, 314822, 315508, 318338, 320865, 321431, 320781, 320519, 320949, 321232, 321007, 320919, 321716, 323522, 325976, 328374, 329641, 328920, 326696, 324900, 325309, 327926, 331399, 334879, 338772, 343407, 347741, 350216, 350690, 350611, 351067, 351471, 350706, 348925, 347283, 346094, 344269, 340934, 336866, 333806, 332721, 333161, 333953, 334051, 333044, 331500, 330685, 331297, 332448, 332517, 331163, 329829, 329962, 331317, 332387, 332065, 330402, 328267, 326856, 327240, 329635, 333091, 336367, 338957, 340901, 341977, 341897, 341052, 340149, 339129, 337439, 335513, 334806, 335847, 337291, 337686, 337362, 337627, 338762, 339937, 340760, 341710, 342960, 343781, 343469, 342230, 340873, 340096, 340317, 341740, 344248, 347336, 350352, 352858, 354985, 357514, 361199, 365694, 369584, 371968, 373536, 375348, 376925, 376617, 373861, 370079, 367008, 364979, 363252, 361293, 359123, 356838, 354468, 352242, 350656, 350257, 351305, 353438, 355708, 357338, 358397, 359250, 359464, 358104]
52421C58104k753k344k62J600J857J034M88P69J379J547Q93k19q01j20J301K103
52405C64576J720J186J878L646M687L476O59j276o28J511K466J200o31j209j059
52390C82202j922l908n162m342k129j18Q08O83j9n93m91J48P05Q68O49k14j875
52373C65290l363l142j129Q30J155L70LN37J316J723J550O49o61j197k9K068L288
52356C69258K908J841J022M49M7M11J846L519M484N098O379Q173R056Q290O922
52341D29703O279O007M474J042k807m944m783l627k962k877k385j117j81r22l059
52326D17841m591l885j433Q63J819J839J806J971K115K269K668L247L494K998
52312D33021K032J518K169L536M258L684K831L099M269M724L681K158J413J368
$$ y = [358104, 355351, 353007, 352745, 354345, 356202, 357236, 357724, 358493, 359872, 361419, 362312, 362093, 361292, 361172, 362473, 364576, 366296, 367482, 369360, 373006, 377693, 381169, 381828, 380552, 379924, 381435, 383901, 385101, 384470, 383261, 382202, 380280, 376372, 371210, 366868, 364739, 364621, 365429, 366112, 366093, 365500, 365009, 365157, 365862, 366730, 367379, 367165, 365290, 361927, 358785, 357656, 358486, 359641, 360011, 360014, 360551, 361867, 363590, 365140, 365789, 365128, 363931, 363902, 365970, 369258, 372166, 374007, 375029, 375478, 375525, 375936, 377782, 381301, 385785, 390883, 397262, 405435, 414491, 422781, 429703, 435982, 441989, 446463, 447505, 444698, 439754, 434971, 431344, 428382, 425505, 423120, 422003, 421822, 420900, 417841, 413250, 409365, 407932, 408795, 410614, 412453, 414259, 416230, 418345, 420614, 423282, 426529, 430023, 433021, 435053, 436571, 438740, 442276, 446534, 450218, 453049, 456148, 460417, 465141, 468822, 470980, 472393, 473761]
$$ [...]
##END NTUPLES=NMR SPECTRUM
##END=
