
##TITLE=UV1151_M2-1005-1001_6301648_rXnfeYM4Q0
##JCAMPDX= 6.0         $$ Bruker NMR JCAMP-DX V2.0
##DATA TYPE= NMR SPECTRUM
##DATA CLASS= NTUPLES
##ORIGIN= BRUKER
##OWNER= Administrator
$$ 1.72 TOPSPIN		Version 2.1
$$ 2012-06-06 03:32:18.187 -0500  Administrator@TOPSPIN
$$ Compression mode = diff/dup
##.OBSERVE FREQUENCY= 400.13188235
##.OBSERVE NUCLEUS= ^1H
##.ACQUISITION MODE= SIMULTANEOUS (DQD)
##.ACQUISITION SCHEME= undefined
##.AVERAGES= 8
##.DIGITISER RES= 22
##SPECTROMETER/DATA SYSTEM= spect
##.PULSE SEQUENCE= zg30
##.SOLVENT NAME= COFFEE_meoh
##.SHIFT REFERENCE= INTERNAL, COFFEE_meoh, 1, 14.98061
##AUDIT TRAIL= $$ (NUMBER, WHEN, WHO, WHERE, PROCESS, VERSION, WHAT)
$$ ##TITLE= Audit trail, TOPSPIN		Version 2.1
$$ ##JCAMPDX= 5.01
$$ ##ORIGIN= Bruker BioSpin GmbH
$$ ##OWNER= Administrator
$$ $$ C:\Bruker\TOPSPIN/data/COFFEE/nmr/UV1151_M2-1005-1001_6301648_rXnfeYM4Q0/10/pdata/1/auditp.txt
$$ ##AUDIT TRAIL=  $$ (NUMBER, WHEN, WHO, WHERE, PROCESS, VERSION, WHAT)
(   1,<2012-06-06 03:32:10.250 -0500>,<Administrator>,<TOPSPIN>,<go>,<TOPSPIN 2.1>,
      <created by zg
	started at 2012-06-06 03:31:03.390 -0500,
	POWCHK enabled, PULCHK disabled,
       configuration hash MD5:
       D5 CA 7A 23 FE 6B EE E2 50 67 74 61 24 F7 5E 3B
       data hash MD5: 64K
       8E E3 F6 6E A2 59 CF 15 C0 76 AE B9 54 A0 E2 5B>)
(   2,<2012-06-06 03:32:13.640 -0500>,<Administrator>,<TOPSPIN>,<proc1d>,<TOPSPIN 2.1>,
      <Start of raw data processing
       efp LB = 0 FT_mod = 6 PKNL = 1 PHC0 = 0 PHC1 = 0 SI = 32K 
       data hash MD5: 32K
       64 0B E6 65 15 D1 C2 B4 CD 27 33 12 04 68 74 56>)
(   3,<2012-06-06 03:32:14.031 -0500>,<Administrator>,<TOPSPIN>,<proc1d>,<TOPSPIN 2.1>,
      <pk PHC0 = 210.3442 PHC1 = 0 
       data hash MD5: 32K
       7A 25 27 1C 62 87 75 6B 3E D7 A4 20 EB E8 63 7B>)
(   4,<2012-06-06 03:32:14.093 -0500>,<Administrator>,<TOPSPIN>,<proc1d>,<TOPSPIN 2.1>,
      <abs ABSG = 1 
       data hash MD5: 32K
       B7 55 E7 7A 7B 2A 3C F9 61 CD 19 1C A5 2C 93 D5>)
(   5,<2012-06-06 03:32:14.125 -0500>,<Administrator>,<TOPSPIN>,<proc1d>,<TOPSPIN 2.1>,
      <abs ABSG = 2 
       data hash MD5: 32K
       4D EC 4F 67 35 88 12 BF FD F4 7E 24 81 65 0C 0A>)
(   6,<2012-06-06 03:32:14.156 -0500>,<Administrator>,<TOPSPIN>,<proc1d>,<TOPSPIN 2.1>,
      <abs ABSG = 3 
       data hash MD5: 32K
       AC 22 67 78 CC 9F 36 F5 60 51 1D 0D F6 6F D4 56>)
(   7,<2012-06-06 03:32:14.187 -0500>,<Administrator>,<TOPSPIN>,<proc1d>,<TOPSPIN 2.1>,
      <abs ABSG = 4 
       data hash MD5: 32K
       69 38 07 96 74 7F E6 F7 53 A9 46 2F B7 5F C4 74>)
(   8,<2012-06-06 03:32:14.218 -0500>,<Administrator>,<TOPSPIN>,<proc1d>,<TOPSPIN 2.1>,
      <abs ABSG = 5 
       data hash MD5: 32K
       CE 7A 3D C3 03 5F 72 BD B6 AA F7 0A 2A 26 2C 72>)
$$ ##END=
$$ 
$$ $$ hash MD5
$$ $$ B5 8B 00 D5 2C F7 ED CF 28 2B 96 AA 95 42 72 1B
##$RELAX= 
##$RELAX= 
##$RELAX= 
##$RELAX= 
##$RELAX= 
##$RELAX= 
##$RELAX= 
$$ Bruker specific parameters
$$ --------------------------
$$ [...]
##$TP= (0..7)
150 150 150 150 150 150 150 150
##$TP07= 0
##$TPNAME0= <>
##$TPNAME1= <>
##$TPNAME2= <>
##$TPNAME3= <>
##$TPNAME4= <>
##$TPNAME5= <>
##$TPNAME6= <>
##$TPNAME7= <>
##$TPOAL= (0..7)
0.5 0.5 0.5 0.5 0.5 0.5 0.5 0.5
##$TPOFFS= (0..7)
0 0 0 0 0 0 0 0
##$TUNHIN= 0
##$TUNHOUT= 0
##$TUNXOUT= 0
##$USERA1= <user>
##$USERA2= <user>
##$USERA3= <user>
##$USERA4= <user>
##$USERA5= <user>
##$V9= 5
##$VALIST= <valist>
##$VCLIST= <CCCCCCCCCCCCCCC>
##$VD= 0
##$VDLIST= <DDDDDDDDDDDDDDD>
##$VPLIST= <PPPPPPPPPPPPPPP>
##$VTLIST= <TTTTTTTTTTTTTTT>
##$WBST= 2048
##$WBSW= 25
##$XGAIN= (0..3)
0 0 0 0
##$XL= 0
##$YL= 0
##$YMAX_a= 510514
##$YMIN_a= -615898
##$ZGOPTNS= <>
##$ZL1= 120
##$ZL2= 120
##$ZL3= 120
##$ZL4= 120
##$ABSF1= 14.98061
##$ABSF2= -5.57192
##$ABSG= 5
##$ABSL= 3
##$ALPHA= 0
##$AQORDER= 0
##$ASSFAC= 0
##$ASSFACI= 0
##$ASSFACX= 0
##$ASSWID= 0
##$AUNMP= <proc_prof1d_extract_pilot.lims>
##$AXLEFT= 0
##$AXNAME= <>
##$AXNUC= <1H>
##$AXRIGHT= 0
##$AXTYPE= 0
##$AXUNIT= <>
##$AZFE= 0.1
##$AZFW= 0.1
##$BCFW= 0
##$BC_mod= 0
##$BYTORDP= 0
##$COROFFS= 0
##$CY= 15
##$DATMOD= 1
##$DC= 0
##$DFILT= <>
##$DTYPP= 0
##$F1P= 0
##$F2P= 0
##$FCOR= 0.5
##$FTSIZE= 32768
##$FT_mod= 6
##$GAMMA= 0
##$GB= 0
##$INTBC= 1
##$INTSCL= 1
##$ISEN= 128
##$LB= 0
##$LEV0= 0
##$LPBIN= 0
##$MAXI= 10000
##$MC2= 0
##$MEAN= 0
##$ME_mod= 0
##$MI= 0
##$NCOEF= 0
##$NC_proc= -8
##$NLEV= 6
##$NOISF1= 0
##$NOISF2= 0
##$NSP= 0
##$NTH_PI= 0
##$NZP= 0
##$OFFSET= 14.98061
##$PC= 1
##$PHC0= 210.3442
##$PHC1= 0
##$PH_mod= 1
##$PKNL= yes
##$PPARMOD= 0
##$PPDIAG= 0
##$PPIPTYP= 0
##$PPMPNUM= 2147483647
##$PPRESOL= 1
##$PSCAL= 4
##$PSIGN= 0
##$PYNMP= <proc.py>
##$REVERSE= no
##$SF= 400.13
##$SI= 32768
##$SIGF1= 0
##$SIGF2= 0
##$SINO= 400
##$SIOLD= 32768
##$SPECTYP= <>
##$SREGLST= <1H.CDCl3>
##$SSB= 0
##$STSI= 32768
##$STSR= 0
##$SW_p= 8223.68421052632
##$SYMM= 0
##$S_DEV= 0
##$TDeff= 65536
##$TDoff= 0
##$TI= <>
##$TILT= no
##$TM1= 0
##$TM2= 0
##$TOPLEV= 0
##$USERP1= <user>
##$USERP2= <user>
##$USERP3= <user>
##$USERP4= <user>
##$USERP5= <user>
##$WDW= 1
##$XDIM= 32768
##$YMAX_p= 457616746
##$YMIN_p= -705516
##$CURPLOT= <Network HP LaserJet P1505>
##$CURPRIN= <$Network HP LaserJet P1505>
##$DFORMAT= <normdp>
##$LAYOUT= <+/1D_H.xwp>
##$LFORMAT= <normlp>
##$PFORMAT= <normpl>
##$SURQMSG= 1
$$ End of Bruker specific parameters
$$ ---------------------------------
##NTUPLES= NMR SPECTRUM
##VAR_NAME=  FREQUENCY,     SPECTRUM/REAL,   SPECTRUM/IMAG
##SYMBOL=    X,             R,               I
##VAR_TYPE=  INDEPENDENT,   DEPENDENT,       DEPENDENT
##VAR_FORM=  AFFN,          ASDF,            ASDF
##VAR_DIM=   32768,         32768,           32768
##UNITS=     HZ,            ARBITRARY UNITS, ARBITRARY UNITS
##FACTOR=    0.250966925370066, 1,           1
##FIRST=     8223.43324360095, -99858,       -35947
##LAST=      0,             -118091,         150564
##MIN=       0,             -705516,         0
##MAX=       8223.43324360095, 457616746,    0
$$ Real data points
##PAGE= N=1
##DATA TABLE= (X++(R..R)), XYDATA
$$ [...]
19536B36530G5332K8374A3026i7377p6987G4069L5571c48887B34135r7577b9682
19524a23177L743E0629N04988d39197a35289O239K5828j58717O0166H218K57221
19513B65439a93313G449f97r8931A60868b08258J8763Q9913j83006M9793j9485
19502b52280c4140k25117Q6899L5998j38185B15801c99521h2382r029D2978f8529
19490c2628p0347A20146L0778b29B30703G8295k023c36301J61266A70091k6764
19479A43327a1521k69497J20144m6033f1058j90683g2240I4058H675a10410m9026
19468a59436k01141A97351g0795l64711B3746g9345l07097a45582n2512j0984
19458b09078P1649o7206m9137a26368M7304A77333J10622A08901g2286l2615B4910
$$ plain form
19536 236530 75332 103706 13026 -97377 -174364 74069 109640 -348887 234135 136558 -29682
19524 -123177 -119434 50629 555617 -439197 -135289 -129050 -103222 -261939 -201773 8218 265439
19513 265439 -193313 7449 -697 -99628 160868 -208258 -189495 -99582 -282588 -232795 -252280
19502 -252280 -34140 -259257 -172358 -136360 -274545 215801 -399521 -82382 -91411 42978 -68529
19490 -32628 -102975 120146 150924 -229 230703 78295 76272 -336301 -175035 170091 143327
19479 143327 -11521 -281018 -160874 -206907 -61058 -251741 -72240 94058 8675 -110410 -159436
19468 -159436 -360577 197351 -70795 -435506 23746 -79345 -386442 -145582 -198094 -209078
19458 -209078 -137429 -204635 -253772 -126368 -79064 177333 287955 108901 -72286 -104901 24910
19446c22837e1174a8079k36765B67011d5934j11680I7138b22563p1681J19809
19436a74435L6670d9919A2102M4439G416d1867j03258f8168n0929E2125A8013
19424H937c54728A44305h921j62315K9766j8262O1715I9087J03805b71815c4010
19412A24637a63741C4848a91917G0996a336m8371j22985F1396O5704j6754a69519
19400a04625k482j16531C4830j0318c0611j92963A05914J69043E3304a13259k2577
19389a35836a4203I7152O0481m7831a03639a7144j55226n6255B54025O5196a42119
19377H1219K7067c4218j32384B5835J28282c09193A34527K0328a24394E1692K43408
19366B95100a5952A87935a43302B7521J786P5219K06720b05715J5135h8227n4273
$$ plain form
19446 -322837 -51174 -18079 -254844 267011 -45934 -157614 97138 -222563 -294244 -174435
19436 -174435 -137765 -49919 12102 56541 7416 -41867 -145125 -68168 -119097 52125 18013
19424 8937 -354728 144305 -8921 -171236 -141470 -159732 -98017 99087 202892 -271815 -34010
19412 124637 -163741 34848 -191917 70996 -1336 -49707 -172692 61396 127100 110346 -169519
19400 -104625 -107107 -223638 34830 24512 -30611 -223574 105914 274957 53304 -113259 -135836
19389 -135836 -14203 97152 157633 109802 -103639 -17144 -172370 -228625 254025 319221 -142119
19377 81219 108286 -34218 -166602 25835 154117 -309193 134527 154855 -124394 51692 295100
19366 295100 -15952 187935 -143302 27521 29307 104526 311246 -205715 -190580 -88227 -142500
19355a42500d7410j64991d4089B09823a47449g2155k6530k6084J8940k05764C3384
19343B18968d3437C7811e7731j74581E8251J94953a10473j28568B70776b93175
19332a51028F11339A06782b9960G7428b421j51121M4626q298p0626j85620c9526
19320d80809b3747l3090p0203B8453a99813C05009j49395E5194N3185c35099B06401
19308A70960E6524j2290G530a08066c7654B2425d2819B4933R3380G683Q2005b3489
19295a0210k12628d058B94473B7366b39784D6020O3176J81911a52G7711b44421
19283f1746q3159a2769G6366a75462b6979E7944b76452H2529b71458L7394F2327
19271a02541L6924n5872b28C69743a38584m4267f6222A84639o7214k4285b42606
$$ plain form
19355 -142500 -47410 -212401 -44089 209823 -147449 -72155 -98685 -124769 -105829 -311593 33384
19343 218968 -43437 37811 -57731 -232312 58251 253204 -110473 -239041 270776 -293175
19332 -151028 611339 106782 -29960 77428 -2421 -153542 -108916 -117214 -187840 -373460 -39526
19320 -480809 -23747 -56837 -127040 28453 -199813 305009 155614 55194 108379 -335099 206401
19308 170960 56524 44234 7530 -108066 -37654 22425 -42819 24933 118313 7683 89688 -23489
19295 -10210 -222838 -4058 294473 27366 -239784 46020 109196 291107 -152 77711 -244421
19283 -61746 -144905 -12769 76366 -175462 -26979 57944 -276452 82529 -271458 -234064 62327
19271 -102541 -65617 -121489 -228 369743 -138584 -182851 -66222 184639 117425 93140 -242606
19259b3276G9478c11160D4237d36271a22925j39259J1455a00405C27739g4554
19248c9799j27273l2103a5936p5942j95624J38887a6984j88069j24007f8096n5378
19237a23474b6535j0051c069G4723a41469q6231R0781j88136f3575A08208N7001
19226A65209l8907a4495j31043j52614E8913J9196i0308j03773c2227B01891k2442
19215A79449a95260A04532d2585m8856j47575b6107q2384o6682n99a6952H7608
19203b6928o6731j34951E2202c6754k26283e1354o9844M6332L3584j095j35345
19192a77722A01932h3386p5005m44957a22978e269j18581n8947j04149q8881A03995
19180B48709a54463l0644A4925R2419M8110C6465j7520K08299d7658D2817b18080
$$ plain form
19259 -23276 79478 -311160 44237 -436271 -122925 -262184 -250729 -100405 327739 -74554
19248 -39799 -167072 -199175 -15936 -91878 -287502 -148615 -16984 -205053 -329060 -68096 -123474
19237 -123474 -26535 -36586 -3069 74723 -141469 -227700 -136919 -325055 -63575 108208 165209
19226 165209 126302 -14495 -145538 -298152 58913 78109 -90308 -194081 -32227 201891 179449
19215 179449 -195260 104532 -42585 -91441 -239016 -26107 -108491 -175173 -175772 -16952 87608
19203 -26928 -93659 -228610 52202 -36754 -263037 -51354 -121198 -74866 -41282 -42377 -177722
19192 -177722 101932 -83386 -158391 -603348 -122978 -5269 -123850 -182797 -286946 -375827 103995
19180 248709 -154463 -185107 14925 107344 155454 36465 18945 227244 -47658 42817 -218080
19168b72070C48917a18445e3080A12419J76811i5417K0410j57169B43603a03266
19157A10180b7161q6317K3097C73633a76657A42929e0389B40656a11678j47880
19147b59558p7790C78955b77260C3454a4173j32237O8756q4417g6815j15196e7
19135F3141a88089b8988D1737c36451A38716e64456d7151j80894A9078a77399
19124e7517k30507a04520k87511f0650a6133m4547A49102b33690J5738A9001Q2032
19113A01033d7664G0995A8040b47606A14044b14688A33883a77873A73483f620
19102b9400a0491j7847k03796H0931r714b16835g2639K4880j52655g0165G0845
19090C26131g5659b9692J2721r594C0805h8071A40471o2338e3186k27411C5868
$$ plain form
19168 -272070 348917 -118445 -53080 112419 289230 -95417 -75007 -232176 243603 -103266
19157 110180 -27161 -113478 -90381 373633 -176657 142929 -50389 240656 -111678 -259558
19147 -259558 -337348 378955 -277260 33454 -14173 -146410 -77654 -162071 -76815 -192011 -57
19135 63141 -188089 -28988 41737 -336451 138716 -564456 -47151 -228045 19078 -177399
19124 -57517 -288024 -104520 -392031 -60650 -16133 -60680 149102 -233690 -217952 19001 101033
19113 101033 -47664 70995 18040 -247606 114044 -214688 133883 -177873 173483 -6620
19102 -29400 -10491 -28338 -232134 80931 71217 -216835 -72639 -47759 -200414 -70165 70845
19090 326131 -75659 -29692 -16971 -26565 30805 -88071 140471 78133 -53186 -280597 35868
19078A3522b1082q0739b4959l04152H0405J000a9662n8080l62227A44318f5195
19066C5904b2561j67485C1503J44073c01320E211J50786A3124b5677k77369a31009
19054D56245A1256a17209G1020A4804L85464h6852G9368h217A0478b03710A057
19042a4195j73748L0806G940g328G002M5939d29435a68308B9222c94114F3884
19030g2569k03893o378a11666A23209e8994A79596D7545A026K06676e5798A83335
19018A35987J7353n0534b01218A71608a43660B82694r3980F6860R534b06745A61106
19006D5597A9421L47698a95125j07536F4031c03202c1707C4037o283a92474d424
18994h3693a6052k13460m349d1782q9633A01247A2855b18350c6375m9189L4258
$$ plain form
19078 13522 -21082 -101821 -24959 -329111 80405 81405 -19662 -77742 -439969 144318 -65195
19066 35904 -22561 -190046 31503 175576 -301320 5211 155997 13124 -25677 -303046 -131009
19054 456245 11256 -117209 71020 14804 400268 -86852 79368 -8217 10478 -203710 1057
19042 -14195 -187943 -157137 7940 -7328 7002 52941 -429435 -168308 29222 -394114 63884
19030 -72569 -276462 -282840 -111666 123209 -58994 179596 47545 1026 207702 -55798 183335
19018 135987 153340 102806 -201218 171608 -143660 282694 188714 66860 76394 -206745 161106
19006 45597 19421 367119 -195125 -302661 64031 -303202 -31707 34037 27754 -192474 -4424
18994 -83693 -16052 -229512 -233861 -41782 -131415 101247 12855 -218350 -36375 -85564 -51306
18983e1306A33148c76018a11360o6180O8749a958j36901j02257A37610a10198
18972a16722a0267j09914d2353a702j43748P1357j84884D7036i5227b4097j549
18961b5646A65218H170J19933n3955G776b96622k3380A99209a2032j5364j9351
18950d6747p0435c681k05731R4314H0664c33294I2358p741k531g2984B74272a31294
18937a07752n9654b971q3106K5065q4178B29395a9346r1228k2026D86693i0434
18925D02548g3607j83730A97825b59674J13795A90146R0874I5744a72421F9217
18914a72917J400P1162A45840a68485n78B66449F9792M9243a06540A15670C1149
18902d5311E1476J16864e72635A9737a59731c8780k35622G280K1187j355h160
$$ plain form
18983 -51306 133148 -376018 -111360 -177540 -108791 -1958 -138859 -241116 137610 -110198
18972 -116722 -10267 -120181 -42353 -1702 -145450 -74093 -258977 47036 -95227 -24097 -25646
18961 -25646 165218 8170 128103 74148 7776 -296622 -320002 199209 -12032 -27396 -46747
18950 -46747 -117182 -3681 -209412 -115098 80664 -333294 92358 84617 82086 -72984 274272 -131294
18937 -107752 -167406 -2971 -86077 -61012 -145190 229395 -19346 -110574 -132600 486693 -90434
18925 402548 -73607 -257337 197825 -259674 -145879 190146 281020 95744 -172421 69217
18914 -172917 -171517 -100355 145840 -168485 -169063 266449 69792 119035 -106540 115670 31149
18902 -45311 51476 168340 -572635 19737 -159731 -38780 -274402 7280 28467 27112 -8160
18890A3857L3870e48366d8751A82061A3053K67480A09462M3835e2727m0410B65215
18878A53252g1678k02913n6120a32479O0094B26388a77796m4739g1902A19492
18867d9663l9083l10300a15948D7169b42176h6892k33710B0558d2528A49439m9222
18856A00217C8482O649d39967O0017a57181c5554k61645J14717e3552A59284N1139
18845B10423b9829j0139q9782L9192E2747K61239A08934a9180m4810J3511j63530
18834b14009G759i3073h924j95865d8299r1921B08164b15899a01400n9155P2025
18823h8530B75595n6332A5495J15173b51448M2071r3267B60044a15282I159b26752
18811A55825a23736j58418B5085R376f4618C68566j02314j15686K11260H9336
$$ plain form
18890 13857 47727 -548366 -48751 182061 13053 280533 109462 153297 -52727 -93137 265215
18878 153252 -71678 -274591 -330711 -132479 -72385 226388 -177796 -222535 -71902 119492
18867 -49663 -88746 -399046 -115948 47169 -242176 -86892 -320602 20558 -42528 149439 100217
18856 100217 38482 45131 -439967 -379950 -157181 -35554 -297199 -182482 -53552 159284 210423
18845 210423 -29829 -39968 -129750 -90558 52747 313986 108934 -19180 -63990 -50479 -214009
18834 -214009 7759 -93073 -8924 -204789 -48299 -140220 208164 -215899 -101400 -160555 -88530
18823 -88530 275595 219263 15495 130668 -251448 -209377 -302644 260044 -115282 9159 -226752
18811 155825 -123736 -282154 25085 34461 -64618 368566 266252 150566 361826 89336
18800c56602a17227M3427G2720C1759b68982A57695a12208k21503f0908g841m1853
18789d9694k28828A39477c6550o5421I0680e38234a7158o1956K5681B33187a51615
18777a56640n3011j09794d8569E9740b1632j00820C33636a1912b629B50385c7828
18765B4699j719J5559b2088j59605A79771i5447G2469j4075e19999B39410h3892
18753b51028a02198A63771E1412a6868k05449B05277P2576b5464j48015O2074
18743a11405d1643C3817a81870N8262k902O2122F7841M7416D7955b58628H2361
18731B11393p2857b7895J697B2647g3371k52301A2462a66745A39228c21864c9662
18719b3260B9688a79923N1216B31976a00449L1385r8932B41487a07509E3573a00864
$$ plain form
18800 -356602 -117227 -73800 72720 31759 -268982 157695 -112208 -333711 -60908 -7841 -49694
18789 -49694 -278522 139477 -36550 -101971 90680 -538234 -17158 -79114 -53433 233187 -151615
18777 -156640 -209651 -319445 -48569 59740 -21632 -122452 333636 -11912 -2629 250385 -37828
18765 24699 22980 38539 -22088 -181693 179771 -95447 72469 58394 -519999 239410 -83892
18753 -251028 -102198 163771 51412 -16868 -222317 205277 277853 -25464 -173479 -111405
18743 -111405 -41643 33817 -181870 -123608 -126510 -64388 67841 115257 47955 -258628 82361
18731 211393 138536 -27895 -26198 22647 -73371 -325672 12462 -166745 139228 -321864 -39662
18719 -23260 29688 -179923 -128707 231976 -100449 -69064 -167996 241487 -107509 53573 -100864
18707g2808j4990b9793j36791g7207B7009J99537a23404L9417E4127f674j55247
18696a61921j39016B39469D1435a97150C38736r5381I4466N8913a05426J4240
18686i1186j77287a6079r4179N1986b5796A4454a8697j5333B991J7768M62588
18675D83347a35447A62253i3909A2207b0720p7013l7399B8576c47309B40624b06360
18663a83247D12615b06228k17450C2629I73d13951B05220P420c2212A41975b23190
18651a39011D3053b80087E4566J9982a10510j15233A18160a06550o8405B0102
18640A90127f618C71665a00990j22478i6978m6626a45A84072d38284a98710C8499
18628H136a42085N4463L3627A28359l2534h9765A45719o0310b17370f5507C13004
$$ plain form
18707 -72808 -87798 -29793 -166584 -77207 27009 226546 -123404 -83987 54127 -6674 -161921
18696 -161921 -300937 239469 41435 -197150 338736 243355 94466 153379 -105426 -91186
18686 -91186 -268473 -16079 -110258 -58272 -25796 14454 -18697 -34030 2991 20759 483347
18675 483347 -135447 162253 -93909 12207 -20720 -97733 -135132 28576 -347309 240624 -206360
18663 -183247 412615 -206228 -423678 32629 973 -413951 205220 212640 -32212 141975 -223190
18651 -139011 43053 -280087 54566 74548 -110510 -225743 118160 -106550 -174955 20102
18640 190127 -6618 371665 -100990 -223468 -96978 -143604 -145 184072 -438284 -198710 38499
18628 8136 -142085 -87622 -53995 128359 95825 -89765 145719 85409 -217370 -65507 313004
18616a13180c9608E9017J98477d8186B376i3253H4736a33850A50584e04405i5802
18604A69924b38837g5351H3599O2703i7741j74844e4921o5385o9451c3642q8082
18593a21724r2270Q0570B0969a09862F6502a58311r6802G8819a1827A8702a85620
18581i9284b4853n1076F2048a77454A09741b24317A04350A723a28121D0458a47621
18569A01721C5080a87951h898A56704o2291d21536A65516b8215j02449M6798I2253
18557g1590L445A30722b24226R9968B3055a89301h189j17067C739b51779A10612
18545g7338k1301n5797d1431D31496a9994j70637Q9738m0406q0013r1235B99550
18533H9482A9820J90679i0910A0957J43505a16506j29692H2881a03935k88936
$$ plain form
18616 -113180 -39608 59017 257494 -48186 2376 -93253 84736 -133850 150584 -504405 -95802
18604 169924 -238837 -75351 83599 146302 -97741 -272585 -54921 -120306 -189757 -33642 -121724
18593 -121724 -213994 -133424 20969 -109862 66502 -158311 -255113 78819 -11827 18702 -185620
18581 -99284 -24853 -75929 62048 -177454 109741 -224317 104350 1723 -128121 40458 -147621
18569 101721 35080 -187951 -8898 156704 94413 -421536 165516 -28215 -130664 -83866 92253
18557 -71590 -68145 130722 -224226 -124258 23055 -189301 -8189 -125256 3739 -251779 110612
18545 -77338 -98639 -154436 -41431 431496 -19994 -190631 -100893 -141299 -221312 -312547 299550
18533 89482 19820 210499 -90910 10957 154462 -116506 -246198 82881 -103935 -392871
18523c92871L9301B16750i3616j07312A01355l0511c57302A26068n0966C669b01972
18511C369i1324o7685A9922p73q19N6738j4995a34554A36307c59013B0622e8422
18498i5916F1585a52294I5194d0195A56200N9890H2458b23626b7342D46201A22724
18486A60212b07401A30643j4821A0716a67548L848C09599l4231h142j89280g0257
18474h0219J482E565b82121G2507L935K0578a31054j932c6595j49461H4312a18267
18461a76404D3764J96362A05422F442c3604p3890a1227k8165k45975L2437L849
18450b49081F4492d5508l22201d3340c309o1707I5223J04955H4743N0190b16707
18438a34382q6046g0908n6329e8645j27552A03190c75808Q1464j5317A26523a06236
$$ plain form
18523 -392871 -353570 216750 -93616 -200928 101355 70844 -357302 126068 75102 3669 -201972
18511 3369 -91324 -159009 19922 19149 18330 75068 60073 -134554 136307 -359013 20622 -58422
18498 -95916 61585 -152294 95194 -40195 156200 216090 82458 -223626 -27342 446201 122724
18486 160212 -207401 130643 115822 10716 -167548 -163700 309599 275368 -8142 -197422 -70257
18474 -80219 -78737 5565 -282121 72507 76442 97020 -131054 -132986 -36595 -186056 84312 -118267
18461 -176404 43764 240126 105422 6442 -33604 -107494 -11227 -39392 -285367 -252930 -249081
18450 -249081 64492 -45508 -367709 -43340 -3309 -65016 95223 200178 84743 134933 -216707
18438 -134382 -220428 -70908 -127237 -58645 -186197 103190 -375808 -294344 -309661 126523 -106236
18426B8973a45348B4185a74237N5807B01866C0789a87951k7699J07151H931J43669
18415A52600d2349A81066b76696A05165a54899A84483o4510h6647C9572f5700
18404e42352a28505L0652n455L7138j55916a8748m4044j06200C712h882n0997
18393e9879B9383i728G4602a57746b7790C0815Q1573Q8951g0340A74972K3336
18382A98308b87559C1841j4707K34118e6538j31548A75142C159c9077A30837j980
18371A28857f7467l2143m01229B917P521a06447k33388f3728k10344A8151c2845
18359i6958E9925b89370D1903i9683A11958P1766g1602c3103k3914A7993J50640
18348A68633a41404b8253k05694A00723a57300K4500m8170a6689A27251d8222
$$ plain form
18426 28973 -145348 24185 -174237 -118430 201866 30789 -187951 -215650 -108499 8931 152600
18415 152600 -42349 181066 -276696 105165 -154899 184483 119973 -86647 39572 -65700
18404 -542352 -128505 -97853 -103308 -66170 -222086 -18748 -62792 -168992 3712 -8882 -59879
18393 -59879 29383 -9728 74602 -157746 -27790 30815 112388 201339 -70340 174972 198308
18382 198308 -287559 31841 17134 251252 -56538 -188086 175142 3159 -39077 130837 128857
18371 128857 -67467 -99610 -500839 2917 10438 -106447 -339835 -63728 -274072 18151 -32845
18359 -96958 59925 -289370 41903 -99683 111958 183724 -71602 -33103 -57017 17993 168633
18348 168633 -141404 -28253 -233947 100723 -157300 -132800 -180970 -16689 127251 -48222
18337b62975A2271a36638F2621d5178n3007k89305d3333F671d06742e0835B91072
18325A73516a27870F9152a53244k15050F9537i4027D4147c7111A76427L1011b541
18313a30969k4028G2134j3309a49770b1863r9090N5899k6243A52264A8419a78676
18301A07739C6048b55622J05652C00287B7148e38171A26153a26191B22259c6182
18290C9722J31713b08456e2975r925K2460G6585b15650R8851n6282P0952j4405
18279a16534a2859k46040A55452a23055k53429D5303b6542H4525a74336B94781
18268a04337B37164b6008A25883d7297j09545q2916o225N6650d812B80300E4798
18256a645A40497a43460l0098N1681C4645b14234A1185K273g1833j20086A5463
$$ plain form
18337 -262975 12271 -136638 62621 -45178 -98185 -387490 -43333 6671 -406742 -50835 291072
18325 173516 -127870 69152 -153244 -368294 69537 -94027 44147 -37111 176427 207438 -2541
18313 -130969 -154997 72134 58825 -149770 -21863 -120953 -65054 -91297 152264 18419 -178676
18301 107739 36048 -255622 -149970 300287 27148 -538171 126153 -126191 222259 -36182
18290 39722 171435 -208456 -52975 -62900 -40440 76585 -215650 -116799 -173081 -102129 -116534
18279 -116534 -12859 -258899 155452 -123055 -376484 45303 -26542 84525 -174336 294781
18268 -104337 237164 -26008 125883 -47297 -156842 -239758 -245983 -189333 -4812 280300 54798
18256 -1645 140497 -143460 -173558 -121877 34645 -214234 11185 13458 -71833 -191919 15463
18244c26447e3386B5360J38840b17026o7258I3360i2155A73342F3842a23473b7193
18232g7772F2383L30331K0219h4490B6119J49874Q1436A04781k1529b70511J29099
18221a41412I7136h9301j18481G0000K03340A30304K7698a62864n0309i7534C06292
18209a4010I1858A9128d03625B46501i8297B4524c03334o7578C69964c43026A47650
18197e4923m934p055F7449J6026b41759G6763d7917K151j81430L6644H523d05055
18184B53648C8945a05001C56291G1899c61297J63237A53085K3956a61470m6556
18174b08026f4035m3292d4178B74037a67574I7238R1024a94761P7810J3097B53362
18162F0217b22570c8173A37605f702G5943J36549d684C8572L7959L7453a0841
$$ plain form
18244 -326447 -53386 25360 164200 -217026 -284284 93360 -92155 173342 63842 -123473 -27193
18232 -77772 62383 392714 412933 -84490 26119 175993 257429 104781 83252 -270511 -141412
18221 -141412 97136 -89301 -207782 70000 273340 130304 158002 -162864 -213173 -97534 306292
18209 -14010 91858 19128 -403625 246501 -98297 24524 -303334 -370912 369964 -343026 147650
18197 -54923 -59857 -66912 67449 83475 -241759 76763 -47917 -45766 -227196 -190552 8523 -405055
18184 253648 38945 -105001 356291 71899 -361297 -198060 153085 177041 -161470 -208026
18174 -208026 -64035 -107327 -44178 274037 -167574 97238 188262 -194761 -116951 -103854 253362
18162 60217 -222570 -38173 137605 -6702 75943 212492 -4684 38572 76531 113984 -10841
18150b77481r0865J06158B14949k9953c1815A79767c51105G010a23396M1209r7332
18139a79519A08493M8607f3130E3287b59398I6077K50379P824I8631i2299M673
18128h7626D3507L8775K9574b30513a2417A02841a04796j44868g6582D4163j233
18117D2930K16231C708a35882q9469A80935A2599J14683b5826o1898j00748r3
18106a88565e2308j6351K2560q0414d8523A23975c3817A36916a67755J9322A15099
18094i4084B63709P5559A03910d19917B33156b15319m4083C37906B1616J76659
18084A98275H5074g50p1783o818L3699E3044J37487m7024l4957Q0531E6993a89977
18071c17521G180a20230k19127P593J65558M6588j7224A13099A4622a44881K8066
$$ plain form
18150 -277481 -368346 -262188 214949 184996 -31815 179767 -351105 7010 -123396 -82187 -179519
18139 -179519 108493 157100 -63130 53287 -259398 96077 346456 354280 98631 -92299 -87626
18128 -87626 43507 82282 111856 -230513 -12417 102841 -104796 -249664 -76582 44163 42930
18117 42930 259161 3708 -135882 -225351 180935 12599 127282 -25826 -87724 -188472 -188565
18106 -188565 -52308 -68659 -46099 -126513 -48523 123975 -33817 136916 -167755 -148433 115099
18094 -94084 263709 339268 103910 -419917 233156 -215319 -259402 337906 21616 198275
18084 198275 85074 -750 -72533 -79351 -45652 53044 190531 143507 108550 189081 56993 -189977
18071 -317521 7180 -120230 -339357 -331764 -166206 -119618 -136842 113099 14622 -144881 -116815
18060a16815L9452d817A09835R9492l962c74691a76710J2919j476O1943B35836
18048a9535k99467g2560m8105C88814j1243h4126C85477E6689a1108o4256A49227
18036b49617C1122O5138K76315b5658n8187C0979J31172o8597H289i3817L1703
18025f2114j22077d9445G9908j4259e8298j9792b1878A02208l5005f1415B04539
18013A96906a81506H267J99730i5863J0222B48307b27506g4758B42542a86079
18002a14395A9483L8348a64114B9626E418A753f2117o7697A8176b9382C3896h6049
17989b10940C9968f8355G230J24276b2145A42262a71051B01903n9138D3701K76353
17978C20054A7138b89008g0473k4469D94639h5200k93872f470I1313J8363O7735
$$ plain form
18060 -116815 -77363 -4817 109835 209327 205365 -374691 -176710 -163791 -165267 -103324 235836
18048 -19535 -319002 -72560 -120665 388814 377571 -84126 385477 56689 -11108 -75364 149227
18036 -249617 31122 96260 372575 -25658 -83845 30979 162151 93554 8289 -93817 -62114
18025 -62114 -184191 -49445 79908 65649 -58298 -78090 -21878 102208 67203 -61415 204539
18013 196906 -181506 8267 207997 -95863 -85641 248307 -227506 -74758 242542 -186079
18002 -114395 19483 57831 -164114 29626 5418 1753 -62117 -129814 18176 -29382 33896 -86049
17989 -210940 39968 -68355 7230 131506 -22145 142262 -171051 201903 142765 43701 320054
17978 320054 17138 -289008 -70473 -94942 494639 -85200 -379072 -6470 91313 109676 177411
17967A77411j9805c9066j9506o7510l0080M4052j23765I0041g4309j48251J7195
17956b05365h2952k60412A39968A5355c11920A06896g7197R998k03656E23740
17945C38843c15854a20155n8032F6092L0479g5873B24782h9631C69610b2646j28412
17934a51058L0813C18745c5047I2170c42253F8196a42733A05178f6204J4652E9874
17922b29154f5151A67072b54561G2175c5230G5027K5660b16402A29836j5976C0951
17910B06399a27853m2845B25312H2226a3902l02129a56797c2550H6270a19773
17899f5168B46962A08056a01327j03745j66640B0211M30246f2249A28030b86459
17888a44500a4787A25501d2453L55E8178a43072A72398b70697B9210e6145j60341
$$ plain form
17967 177411 157606 -39066 -58572 -126082 -156162 -112110 -235875 90041 -74309 -222560 -205365
17956 -205365 -82952 -343364 139968 15355 -311920 106896 -77197 -67199 -270855 523740
17945 338843 -315854 -120155 -178187 66092 96571 -75873 224782 -89631 369610 -22646 -151058
17934 -151058 -120245 318745 -35047 92170 -342253 68196 -142733 105178 -66204 -51552 59874
17922 -229154 -65151 167072 -254561 72175 -35230 75027 100687 -216402 129836 113860 30951
17910 206399 -127853 -170698 225312 82226 -13902 -316031 -156797 -32550 86270 -119773
17899 -65168 246962 108056 -101327 -205072 -371712 20211 450457 -62249 128030 -286459
17888 -144500 -14787 125501 -42453 -42098 58178 -143072 172398 -270697 29210 -56145 -216486
17877b16486C12048A32599p418I654b96862N9080F1459J07603a79495B00725i5634
17865E40284f2632B68787a69197A7538M22964C520a9793F6704a33910j49603C1149
17853g0754r1374D5547J25413Q4557k714m3085k4288b41728C01684l7322m8999
17842B15363a56476j9693m2892H2894b0322Q323j42679F0023c35579G7614P8484
17831A56098L8692Q2293b25799b8070j12836A94549F5274J09555c57489a3922
17820A66861a21988A43299b8243j4258B25652B5249K91079j44652a54906a5294
17809a17983C4899c56619A9403a59656E908K3813a07247M9108k92658a29372A14035
17797e9005L103C7127J98666D188e3380k3925I2203a51504K2464d1076j78925
$$ plain form
17877 -216486 312048 132599 125181 9654 -296862 -237782 61459 169062 -179495 200725 -95634
17865 540284 -62632 268787 -169197 17538 440502 3520 -19793 66704 -133910 -283513 31149
17853 -70754 -162128 45547 170960 255517 252803 209718 185430 -241728 301684 264362 215363
17842 215363 -156476 -176169 -219061 82894 -20322 -11999 -154678 60023 -335579 77614 156098
17831 156098 194790 277083 -225799 -28070 -140906 194549 65274 174829 -357489 -13922
17820 166861 -121988 143299 -28243 -42501 225652 25249 316328 171676 -154906 -15294
17809 -117983 34899 -356619 19403 -159656 5908 29721 -107247 -58139 -350797 -129372 114035
17797 -59005 -55902 37127 235793 4188 -53380 -77305 92203 -151504 -129040 -41076 -220001
17786b20001A04890K9716d3671E6229k4027d6948K2205k50174G4308a03934L366
17775a00568B49567A2858a59427a4106k17117j09762f422p6824B58318a09169
17764A22761E8556A1453J65647b2639A83663G5526a81540e4696j24583o3821j01862
17753c44962A9436M608i384e58F9878B6352a84090a2429D04048A7021i7506G7755
17740A3157a51470A72027K00270b87812B65773C6190d7487F9544a0180A67338
17729A49153O547a7542A2932L11098G4007Q8064a52325e9872k27583M0696a0821
17717D2493a83543h0698j48806g642k96580a06225A03717i4271j31850J4563B94041
17705D8525q843d0218r2039l2364C14337G1015J44745a44155r3903N0159A10665
$$ plain form
17786 -220001 104890 134606 -43671 56229 32202 -46948 -24743 -274917 74308 -103934 -100568
17775 -100568 249567 12858 -159427 -14106 -231223 -340985 -6422 -83246 258318 -109169
17764 122761 58556 11453 177100 -22639 183663 75526 -181540 -54696 -179279 -243100 -344962
17753 -344962 19436 24044 -9384 -558 69878 26352 -184090 -12429 404048 17021 -97506 77755
17740 13157 -151470 172027 372297 -287812 265773 36190 -47487 69544 -10180 167338
17729 149153 155700 -17542 12932 324030 74007 162071 -152325 -59872 -287455 -246759 -10821
17717 42493 -183543 -80698 -229504 -7642 -304222 -106225 103717 -94271 -226121 -211558 294041
17705 48525 39682 -40218 -132257 -164621 314337 71015 215760 -144155 -238058 -187899 110665
17693a24157D7826J8546a28107r0755H2057c56807A36141N2001F2032k6221h1534
17681G9362F130b4980C82016E2904J15632b0367o2313b4248l3947o6207a3672
17669B19544a0545j234H6981h5199B0433I792O178J58501o8721E0850K90030f3793
17656B2430P4012J28865d963p7458G4722K91355f7533K4121A78723d65C7945J18663
17644A56608h657j82451k1301c5039C92457b75718M3764J1597B3464J57415F7019
17632C1077M3691O090L1858d8817j89267g0868l6233r8856n9111a0274D7945b7513
17619b3102I6032b0257j43090a8890B94349a27894C57901b23686D5312b95312
17608b2585B4317G079J18305a55887P2694R155A03661c94673E9291b08207B29300
$$ plain form
17693 -124157 47826 66372 -128107 -218862 82057 -356807 136141 188142 62032 35811 -81534
17681 79362 6130 -24980 382016 52904 168536 -20367 -82680 -24248 -58195 -124402 -13672
17669 219544 -10545 -11779 86981 -85199 20433 9792 15970 174471 105750 50850 340880 -63793
17656 22430 96442 225307 -4963 -82421 74722 366077 -67533 -43412 178723 -465 37945 156608
17644 156608 -8657 -191108 -212409 -35039 392457 -275718 -231954 -220357 23464 180879 67019
17632 31077 74768 80858 112716 -48817 -238084 -70868 -107101 -205957 -265068 -10274 47945 -27513
17619 -23102 96032 -20257 -163347 -18890 294349 -127894 357901 -223686 45312 -295312
17608 -22585 24317 7079 125384 -155887 -83193 -74038 103661 -394673 59291 -208207 229300
17596h2227B54245A06194L19616c2133A21938Q2258C3668P1180J01502J15556
17586C21906C9921i0126M2427f658A68579J96982j29570a68255a1484D4522J39445
17575A83967j9205J4208N623K53343k01747r1673K07314B8482L8645c5237j67912
17564b03149A00751N2997i0706G500b84800i9951a5234B6829P5207a76472B39792
17552A44317b7868G1441J2433J4615J08023a06404F9661J41200b48469Q7576A22655
17540C16308A02720K33766b82900A48794C3056K88411j23494m7214A7653l660
17530A3993J48407a57086r1002A46631i6450C25314j42506J0221C1825Q281N0732
17519I0838a36879I1672L0483k2877g9588j14676L9914B64684a03483k09323A32758
$$ plain form
17596 -82227 254245 106194 425810 -32133 121938 204196 33668 104848 206350 321906
17586 321906 39921 -90126 -47699 -6658 168579 365561 235991 -168255 -11484 44522 183967
17575 183967 164762 178970 184593 437936 236189 144516 351830 28482 67127 -35237 -203149
17564 -203149 100751 153748 -90706 7500 -284800 -99951 -15234 26829 102036 -176472 239792
17552 144317 -27868 71441 83874 98489 206512 -106404 69661 210861 -248469 -160893 122655
17540 316308 102720 336486 -282900 148794 33056 321467 197973 150759 17653 13993
17530 13993 162400 -157086 -248088 146631 -96450 325314 182808 193029 31825 40106 90838
17519 90838 -136879 91672 122155 99278 -79588 -194264 -154350 264684 -103483 -312806 132758
17507A1026R4248h7974n0005I0845Q4594b30319B2430L2370Q8060C5240J26956
17496A62196a54029A03113q448A682J05312a17631A8545K05901b0263j60094H7593
17484a1171L093B87358A16605K11705c26755A84638A6508Q3145a91851B40320
17473b487A28218O0356b39855C91160p7086p1610E2727K33841A5417J83173b09185
17461C24064i039C01344p2261J70187j80984r2521c2596B38349A6807a26158c467
17449A37117J45655r4998q9625M51657o9527m7999a5516B04092C7166M31730j49088
17438C19808m8367L07234B43045J22895K1825n374J64549k56022I6024q232J85501
17427B73293A05423L10282j77608O9160O0426r3113J45801P436E3551L30806A38663
$$ plain form
17507 11026 105274 -87974 -137979 90845 175439 -230319 22430 54800 142860 35240 162196
17496 162196 -154029 103113 94665 1682 106994 -117631 18545 224446 -20263 -180357 87593
17484 -11171 -8078 287358 116605 328310 -326755 184638 16508 99653 -191851 240320
17473 -2487 128218 188574 -239855 391160 314074 242464 52727 286568 15417 198590 -209185
17461 324064 -9039 301344 229083 399270 218286 125765 -32596 238349 16807 -126158 -3467
17449 137117 282772 187774 98149 549806 480279 432280 -15516 204092 37166 468896 319808
17438 319808 271441 578675 243045 365940 387765 382391 546940 290918 96024 87792 273293
17427 273293 105423 415705 238097 307257 367683 274570 420371 427807 53551 384357 138663
17415B46639o6540K0305A1059a04405C19041p4293H9686a52317e9267H7436K09209
17404B96645j05850L42081k6526j61595A69448K08070A03999K57774j48669M794
17394B17898b531j53534K1893r2884A71741l5524J12333j754J99225k21657j9315
17383B05049m1107p963J59473n1446C7866J5473b28905E71055b4755B95234A04182
17371B66000E9212O4144J30428q634M6016j38639a32009l800B871L56587A16588
17359A88080Q4687o1321M8289N8676j44743c20993D14942j05776J02032a27772
17348b85546G6386b3737B80901m199A11647D9571j6027K11546n0987n0038N699
17337A49764O2419b739A31796h7687G7650O585P0388J71042b04329h9587B1589
$$ plain form
17415 246639 180099 200404 11059 -104405 319041 244748 89686 -152317 -59267 87436 296645
17404 296645 190795 532876 506350 344755 169448 377518 103999 361773 213104 217898
17394 217898 -2531 -156065 -134172 -227056 171741 136217 248550 246796 446021 224364 205049
17383 205049 163942 155979 315452 264006 37866 53339 -228905 571055 -24755 295234 104182
17371 266000 59212 123356 253784 245150 291166 152527 -132009 -135809 2871 359458 116588
17359 188080 272767 211446 259735 318411 173668 -320993 414942 309166 411198 -127772
17348 -285546 76386 -23737 280901 276702 111647 49571 33544 245090 194103 144065 149764
17337 149764 212183 -2739 131796 -87687 77650 84235 154623 325665 -204329 -89587 21589
17325a9255E8771L11526G8495J09329l1363J20824c6889E779K7218e2744A03227
17313A66041b0661A42466K03876c1434A74319J0062b2270j8046B48261C603L27473
17302C31076k0889a17179A04098Q4956J22816j17891J54029A46484i0207C34555
17291A33457K84169q8966J73043A06113h7794A80251R6946n7284a72933A31347
17280C76126j56792O577A03455g4884Q948G7953L42684A95695K42815k16431E4488
17268B40651j09701n8954L56050A43074E6074M7989K44548n4340A17178J91052
17258C08230n5181G149J31424M1177K27176m9529A43864A2281b16037C16840G6662
17246A73037K7296L99452B04447M80l6393a58296C24476a59761B08108b55148
$$ plain form
17325 -19255 58771 370297 78495 187824 156461 277285 -36889 5779 32997 -52744 103227
17313 166041 -20661 142466 346342 -31434 174319 184381 -22270 -40316 248261 3603 331076
17302 331076 310187 -117179 104098 189054 311870 193979 348008 146484 -90207 334555
17291 133457 417626 328660 501703 106113 -87794 180251 277197 219913 -172933 131347
17280 376126 219334 225911 103455 -74884 -65936 77953 420637 195695 438510 222079 54488
17268 240651 130950 71996 428046 143074 56074 104063 348611 294271 117178 308230
17258 308230 253049 7149 138573 179750 406926 357397 143864 12281 -216037 316840 76662
17246 173037 200333 599785 204447 204927 168534 -158296 324476 -159761 208108 -255148
17235a19163A33808J4769J94603A33651K14057d7230C01885e8479C7932K77552
17225C15484p5652m7932J99936D8271p944L13229M5973j63236J96976F0441K71058
17214C31499a288C16566j02069H9006K28306M8750l4310L0748l4524A53098j4042
17203A39056J27615e045C26068j60349p3690C4867K42292c3642H2476J07879j9847
17192A70508J17263D7631L80289A57982J17827K18628J42737e6908g384C24696
17181B35417J00254h3483A61229C4850N0427N1533E6964K2567M48872B05565L7632
17170B43197o4142L06890q2380A25810K29094D3513M64763A62195E2930j03j7107
17159C5720N8672K35386H5359M64198k17073a6396C25251j53635K50164J21979
$$ plain form
17235 -119163 133808 148577 343180 133651 347708 -47230 301885 -58479 37932 315484
17225 315484 239832 191900 391836 48271 40327 353556 399529 236293 433269 60441 331499
17214 331499 -1288 316566 214497 89006 317312 366062 331752 362500 327976 153098 139056
17203 139056 266671 -5045 326068 165719 92029 34867 277159 -33642 82476 190355 170508
17192 170508 287771 47631 427920 157982 275809 494437 637174 -56908 -7384 324696
17181 235417 335671 -83483 161229 34850 85277 136810 56964 79531 528403 205565 243197
17170 243197 179055 485945 403565 125810 354904 43513 508276 162195 52930 52827 35720
17159 35720 94392 329778 85359 549557 332484 -16396 325251 171616 421780 543759
17149E43759k36220J06414j96139K71820k26408J27490O13q2491J84568B14501
17138B33310A14187L51128j33245J78538k47580D5933L51942J20558a1153B09739
17127C50966L9978h5624C19319L2946E2982O0429J86155A40070L251L17677N1366
17116E12364o1102r7981M64383B50788K37570G1698L04060Q3834j68115o2497
17106B28980L40063F7473M03261j58892J23381O0815j11335j78725Q0596l3921
17096B52653j20700M10944k40036l03Q82j31053J42470L8555j5643P2602A89888
17084E31658B44331J45416M12299C11311K98053k62903N2497Q93p7088q9003K14767
17073D48527a42421B88922J28217P4694p7717l3157k6309J03129k14143K73172
$$ plain form
17149 543759 307539 413953 217814 489634 263226 390716 391329 308838 493406 214501
17138 233310 114187 465315 332070 510608 263028 45933 397875 518433 -11153 209739
17127 350966 390944 -85624 319319 352265 52982 113411 299566 140070 143321 460998 512364
17116 512364 451262 353281 817664 250788 488358 71698 375758 459592 291477 228980
17106 228980 569043 67473 470734 311842 435223 496038 384703 205978 286574 252653
17096 252653 131953 542897 302861 302558 303440 172387 314857 353412 337769 410371 189888
17084 531658 244331 389747 802046 311311 609364 346461 398958 399851 322763 233760 448527
17073 448527 -142421 288922 417139 491833 414116 380959 354650 457779 243636 516808
17063E16808Q4383j62453j2994O6527M0900A55433N18352R2302k39095J17520
17053F44512B28858L64222j85440J03082K13690B97924L38046j88945K856M72118
17043I21999C34777R4406Q3210j83875L19054k68269J34402O0070j91627K7938
17033D10086R5565j73557J74431R8657o5660q0016o4283J73720q533n1823A46999
17021G01801l43119j640M26531m129n8193q4012r6721L29250R824k38894k30750
17010D09948o2899J18489L5117A94512M37761m4077o340n3725K42984j50403r7099
16999E23613P317j25582J2038Q3793L600J09205k72609K65852n0925L67237l16924
16988F06615n2714M75757k37686n5438J0906j40150K94356D11974O90419j46174
$$ plain form
17063 516808 601191 438738 425744 492271 533171 155433 673785 766087 526992 644512
17053 644512 228858 593080 407640 510722 724412 297924 635970 447025 449881 921999
17043 921999 334777 429183 512393 328518 647572 379303 513705 573775 382148 410086
17033 410086 505651 332094 506525 605182 539522 459506 395223 568943 560410 508587 146999
17021 701801 358682 357042 783573 779444 721251 637239 540518 869768 879592 640698 409948
17010 409948 347049 465538 500655 194512 632273 588196 581856 528131 771115 620712 523613
16999 523613 530930 405348 417386 501179 504779 613984 341375 607227 556302 923539 606615
16988 606615 553901 1029658 791972 736534 747440 607290 901646 411974 1102393 956219
16978I56219l29419J9979J66500N3228L4351k21663J39648l749C67633P03416
16968A071049l32993r8484K11695J15122l015j68988j10166k07k7682L23510k45417
16957G34424J21049L06884j34347r1984k19748N1375L95631j57559R0981l93054
16947G03652L91220j49724L00673j87128J61087k64315J18582r0832N2499j72378
16937H63336J62114k84168K22470M25413k17368l51129J65831J9903J09126k95194
16927H20334J43867P6167O3278q8276J37819L3775o0603K06066o8736o5025K25091
16916A423757k75782J30603K20366J02566k96047j50894N88503n02523M04522
16907A645071j10448k60910J51144k22318L84393L31902k60607K76361l18004
$$ plain form
16978 956219 626800 646779 813279 866507 900858 679195 818843 815094 367633 1071049
16968 1071049 738056 639572 851267 966389 963374 794386 684220 684013 656331 979841 734424
16957 734424 855473 1162357 1028010 936026 716278 767653 1163284 1005725 1096706 703652
16947 703652 1094872 945148 1245821 1058693 1219780 955465 1074047 983215 1035714 863336
16937 863336 1025450 741282 963752 1389165 1171797 820668 986499 1006402 1115528 820334
16927 820334 964201 1040368 1103646 1015370 1153189 1186964 1126361 1332427 1263691 1198666 1423757
16916 1423757 1147975 1278578 1498944 1601510 1305463 1154569 1743072 1240549 1645071
16907 1645071 1534623 1273713 1424857 1202539 1586932 1918834 1658227 1934588 1616584
16898A616584r3393j79134m9292K34240k59245M94641j97577j6615L52732l89343
16888A513598J29214l31626L54601J50297l44571M5064M24634o0157J77997l86216
16878A672835L18528J8435j361K17664l46151K06830J67376O3445k89021q0052
16868A948528J39768J49874L0363O8680O4029j62521k34234O93286n63836L37025
16858B470962j31123L13849m40661L69940m0137J03759M6530J72688J41486k35821
16848B771472R1684L83702m31753J31832K72515J29087q3459J35795n5321J01972
16838C447526m47044L80667J17407N6810o758l53842J38654M13492k58279M85887
16828C974520m74217L12833N1713N7735l24065N20632L0818L67231k94051L66414
$$ plain form
16898 1616584 1523191 1344057 1294765 1529005 1269760 1764401 1566824 1550209 1902941 1513598
16888 1513598 1642812 1311186 1665787 1816084 1471513 1516577 1941211 1881054 2059051 1672835
16878 1672835 1991363 2009798 2008437 2226101 1879950 2086780 2254156 2317601 2028580 1948528
16868 1948528 2088296 2238170 2268533 2337213 2401242 2238721 2004487 2697773 2133937 2470962
16858 2470962 2339839 2653688 2213027 2582967 2542830 2646589 2693119 2865807 3007293 2771472
16848 2771472 2863156 3246858 2815105 2946937 3219452 3348539 3265080 3400875 3345554 3447526
16838 3447526 3000482 3381149 3498556 3555366 3548608 3194766 3333420 3746912 3488633 3974520
16828 3974520 3500303 3813136 3864849 3922584 3598519 4119151 4149969 4517200 4223149 4589563
16818D589563j38948j09797L77837o9063m3729M27988j73778K26201M08326l54587
16808E140013L79034J19224K20812n5236K29250j64560J72450L36200N8420J56292
16798F591899m9812M11462J64621j80421O84058j75044K09053O0138K5401N46180
16788H287535L81424J75598L99381L3474K716p1512O06827J49043L09004M77142
16778A0750632j6910O80093j27999M58493M36340K35499M72569L29173K61390
16769A3479280N00837O24547L85852L26661N70937O88153L59904P29598P17921
16760A8383690N07508P46156O72645O91763Q44861Q29666P15705R35218J168048
16751B5495260Q44378J389471Q21238J539386J115991J376682J479233J647522
$$ plain form
16818 4589563 4450615 4340818 4718655 4649592 4605863 5033851 4860073 5086274 5494600 5140013
16808 5140013 5519047 5638271 5859083 5803847 6033097 5868537 6040987 6377187 6435607 6591899
16798 6591899 6542087 6953549 7118170 6937749 7621807 7446763 7655816 7715954 7741355 8287535
16788 8287535 8668959 8844557 9243938 9277412 9280128 9208616 9815443 9964486 10273490 10750632
16778 10750632 10733722 11413815 11285816 11744309 12180649 12416148 12888717 13217890 13479280
16769 13479280 13980117 14604664 14990516 15317177 15888114 16576267 16936171 17665769 18383690
16760 18383690 18891198 19637354 20309999 21001762 21846623 22676289 23391994 24327212 25495260
16751 25495260 26339638 27729109 28550347 30089733 31205724 32582406 34061639 35709161
16743C5709161J373695J862739J764665K202986K108363J831488K909052K477106
16735E2239255K756805K714976L174612L108354L691701L742033M043478M209966
16727G9681180M493924M739709M763234N704337N372171N322287O113666N763903
16719A21954411O240165O482662N664729N696971N981095N142545M843101M074314
16711A66079993L865233K720386J896001J015836J79418j063680j969704l103921
16703A69619562l312990m094068n131582n354742n427976n914579o010948o474877
16695A27897800n952190n988628o126426n345021n771924m717265n276531m502784
16687H4217031m800406m127630m250087l503030l713826l383099l415003k741494
$$ plain form
16743 35709161 37082856 38945595 40710260 42913246 45021609 46853097 49762149 52239255
16735 52239255 54996060 57711036 60885648 63994002 67685703 71427736 75471214 79681180
16727 79681180 84175104 88914813 93678047 99382384 104754555 110076842 116190508 121954411
16719 121954411 128194576 134677238 140341967 146038938 152020033 157162578 162005679 166079993
16711 166079993 169945226 172665612 174561613 175577449 175756867 174693187 172723483 169619562
16703 169619562 166306572 162212504 157080922 151726180 146298204 140383625 134372677 127897800
16695 127897800 121945610 115956982 109830556 104485535 98713611 93996346 88719815 84217031
16687 84217031 79416625 75288995 71038908 67535878 63822052 60438953 57023950 54282456
16679E4282456k710484k480534k373971k588121j781143k155945j817055j692642
16671C6682561j740053j584292j413579j833315p44782j351156j173184j255545
16663B5586655q13546j098586m97429j164294o51820q29728r62389p31004j24516
16654A8713343j055945o23478m80796q25777m19546n63772k10208l18730l04589
16645A3910502p52874k51794n51230q7786n34868l64370k68772m28415K9215l57844
16635A0341764l41305n00148J04305m13337m57275j19050j42459k05494l25653
16626G941348r1279l14363j11812n03863J22624j84347m53997M9120l83858L14034
16616F383607l59985j05700J15010l3502n07716J68925k64745o386N4382l30001
$$ plain form
16679 54282456 51571972 49091438 46717467 44129346 42348203 40192258 38375203 36682561
16671 36682561 34942508 33358216 31944637 30111322 29366540 28015384 26842200 25586655
16663 25586655 24773109 23674523 23177094 22012800 21360980 20531252 19568863 18837859 18713343
16654 18713343 17657398 17033920 16553124 15727347 15307801 14744029 14533821 14215091 13910502
16645 13910502 13157628 12905834 12354604 12266818 11731950 11367580 11098808 10670393 10699608 10341764
16635 10341764 10000459 9500311 9604616 9191279 8734004 8614954 8472495 8267001 7941348
16626 7941348 7850069 7535706 7423894 6920031 7042655 6858308 6404311 6453431 6069573 6383607
16616 6383607 6023622 5917922 6032932 5999430 5491714 5660639 5395894 5389508 5443890 5113889
16606E113889j38926J6349O7648l44751k1602Q7458m184j58805l68228Q4650J4197
16595D347695K596j59676k72344M8967m78338L44041j5363l7809K54371n77100
16585C457040J74534n4046m5886m92055J88634P6351l01737n585O0258K38469
16575C295977m85833L58651N4665n24465J1480J0051m07959M33500J12550l66888
16565B491729K10410k11447P3731j75138L03146l47786K06328L1833n51928L37691
16555B368569k33746K54750m78780o8222O36433l28664j93254j27407j28531K51224
16545A952372k2536j36913n3405j05711L00881m2665n38220J18015J62069J79425
16535A813312j15301j16584J0703J01205P4087j89725j45002k14420L85365p4366
$$ plain form
16606 5113889 4974963 4991312 5058960 4714209 4692607 4780065 4775881 4617076 4248848 4333498 4347695
16595 4347695 4350291 4190615 3918271 3967238 3488900 3832941 3817578 3779769 4034140 3457040
16585 3457040 3631574 3577528 3531642 3039587 3228221 3304572 3002835 2997250 3057508 3295977
16575 3295977 2810144 3168795 3223460 2698995 2710475 2720526 2312567 2746067 2858617 2491729
16565 2491729 2702139 2490692 2564423 2389285 2692431 2344645 2550973 2582806 2030878 2368569
16555 2368569 2134823 2389573 1910793 1842571 2479004 2150340 1957086 1829679 1701148 1952372
16545 1952372 1929836 1792923 1739518 1633807 1934688 1892023 1353803 1471818 1633887 1813312
16535 1813312 1698011 1581427 1592130 1693335 1767422 1577697 1432695 1218275 1603640 1529274
16525A529274j25153L08349k46552j23135M0086J94064l23919J37786J5672m9071
16515A357401j70712L75858m74506M52934n31948L31683j82700J66456k32740
16506A091726J2386K88512j11888Q3529k72150L42937l89766l78165O76472k48197
16496A095396P8146k94278J65998R6831N6789O8055l83758q45j12696J58924J21874
16485A050436q8109r266J10291k97884K05908m12425Q49454n57942l4111k09892
16475F06460K62235J10071l04459J30149n4207K34076Q1182q0010j45619L30716
16465A170594C97446M98378k68733P1277L1500K16885j88213L16038j74886p5216
16455H24476k3931j44823K38403J00523l85686R6886k3259K38281k79114J30011
$$ plain form
16525 1529274 1404121 1712470 1465918 1342783 1382869 1576933 1253014 1390800 1406472 1357401
16515 1357401 1186689 1562547 1088041 1540975 1009027 1340710 1158010 1324466 1091726
16506 1091726 1104112 1392624 1280736 1364265 1092115 1435052 1045286 667121 1343593 1095396
16496 1095396 1173542 879264 1045262 1142093 1198882 1266937 883179 882334 769638 928562 1050436
16485 1050436 962327 953061 1063352 765468 971376 558951 1408405 850463 816352 606460
16475 606460 868695 978766 674307 804456 750249 984325 1065507 985497 839878 1170594
16465 1170594 397446 895824 627091 698368 729868 946753 758540 1074578 899692 824476
16455 824476 800545 655722 894125 994648 608962 705848 682589 920870 641756 771767
16445G71767R2748k27758J96230k46992R8829M107O638J63117l53893n383L34131
16434H33541k54522J22250j17977p3603J52249j55498J89272M8186j93314M44213
16424I94797l03962C30983L87038Q6194k43677j07045j88212L16363K4498j33108
16414D73034O7964M8581J02272J48812D00395m5234J59185Q2727j31078l0677
16404D35318Q745j71260L38000j20055K42011j4182j15902j21979J90371k63115
16394D07952o002C2181N47189q8147k00389Q4967J7256L28596j54145j61716J12625
16383E18417l0308B16673J25415k2453A19423M423L90889q7713j2519b3050B02055
16371C43958K50480B76932A4757O85999C01158k1817N44869l19939o2508L9597
$$ plain form
16445 771767 864515 636757 832987 585995 684824 688931 695569 858686 504793 499410 833541
16434 833541 579019 701269 583292 509689 661938 506440 695712 743898 550584 994797
16424 994797 690835 330983 718021 804215 560538 453493 265281 581644 606142 473034
16414 473034 540998 589579 691851 840663 400395 355161 514346 597073 465995 435318
16404 435318 444063 272803 610803 490748 732759 718577 602675 480696 671067 407952
16394 407952 401950 32181 579370 491223 290834 375801 393057 721653 567508 405792 518417
16383 518417 488109 216673 342088 319635 119423 123846 514735 427022 414503 -23050 202055
16371 343958 594438 276932 14757 700756 301158 279341 824210 504271 441763 481360
16361D81360j88684J13708M3052M1900J10317b18480E67184H3505Q7445L35665
16351E06615k43627J30474j81669K99429R903q6427k00781L67938k62901j01797
16341B37157J0249Q6125r6463K82677n2783j67789O0124l8165j52345L22222k09565
16330B81444K4551m0J31614j76004L46651k22678B869M64433i0501D08649N5427
16319D64076C8460K73231J96683J38439k85408Q0226A72803J42863l9671p4173
16309B01822E9879K81368J82093j94396j18855J43313m2530J38619j21790A38106
16298D5739K01644J55556J00770C1984a56363C66866I2857L47170I2622L60771
16288D53393j62967J53192m2207k3962j50070K51538j5743n1514N662j98516J82956
$$ plain form
16361 481360 292676 406384 449436 491336 601653 -218480 567184 83505 170950 506615
16351 506615 262988 393462 211793 511222 521125 434698 233917 601855 338954 237157
16341 237157 247406 333531 237068 519745 466962 299173 359297 321132 168787 491009 281444
16330 281444 305995 305955 437569 261565 608216 385538 2869 467302 -90501 408649 464076
16319 464076 38460 311691 508374 646813 361405 441631 172803 315666 275995 201822
16309 201822 59879 341247 523340 328944 210089 353402 310872 449491 327701 138106
16298 45739 247383 402939 503709 31984 -156363 366866 92857 440027 92622 453393
16288 453393 290426 443618 401411 377449 227379 478917 463174 411660 417322 218806 401762
16277D01762A42565a25343B21708F0646L05570m981c03957B51868J337l0874R819
16266B32150e6810A61500J36844D1108i7883c231A06071m2911K32794K3933j06990
16255B12897P1766A17511K08211K7661C6153J79959J86790b7915A32595P5558
16245B08153L2849a12841c9201B84879J13703o9993q4820a64003B96810A29296
16234A46358n045J02162a58448A30275K09650m8928c3715O098B94538b17769b2860
16222D15596j66401j03742k4958K1311b7060A3892M5986J96442c4054A63648E2360
16210A13262b04627A4810J95798e7472A92284d018o7283A2367c2221B17995J66941
16199C84936l9595A20304E3959P8820K71104r0296A0602P0006J098b2979C07534
$$ plain form
16277 401762 142565 -125343 221708 60646 366216 361235 -303957 251868 253205 222331 232150
16266 232150 -56810 161500 298344 41108 -97883 -3231 106071 63160 295954 319887 212897
16255 212897 284663 117511 325722 353383 36153 216112 402902 -27915 132595 208153
16245 208153 241002 -112841 -39201 284879 398582 328589 243769 -164003 296810 129296
16234 146358 141313 243475 -158448 130275 339925 290997 -33715 -27617 294538 -217769 -22860
16222 415596 249195 145453 120495 141806 -27060 13892 59878 256320 -34054 163648 52360
16210 113262 -204627 14810 210608 -57472 192284 -4018 -71301 12367 -32221 217995 384936
16199 384936 345341 120304 53959 132779 403883 313587 10602 80608 81706 -22979 307534
16187a39365E8227M28633A05095k974L70201d9595A27516L97367h7975c4759k22507
16176b57266A08424P4742h8052A89674A7658M28846k05247J87391A40214J67553
16166C07767n9117o4676m1630J05792K68757B29958N8016q9893J58959i3743A5976
16154A78709a3834B20694E6293j3082a6085j44391D35700j47828e6459A38694
16143A6091b77093A03388D8082g425j40156k4300p0967A1017L0185Q5183a35055
16131B63699a22061A90084B0718K5122c941E7799o347G694a11119E1224g6505
16119A41482J51431i8946j26841H2493O0176K44211A57705M7386K0127l4791I399
16107C50922A04975k2917h9104B48899j4211P3853P222e076n9784C76725a42057
$$ plain form
16187 -139365 58227 486860 105095 102121 472322 -49595 127516 524883 -87975 -34759 -257266
16176 -257266 108424 183166 -88052 189674 17658 446504 241257 428648 140214 307767
16166 307767 248650 183974 142344 248136 516893 229958 287974 198081 357040 -93743 15976
16154 178709 -13834 220694 56293 43211 -16085 -160476 435700 287872 -56459 138694
16143 16091 -277093 103388 48082 -7425 -147581 -171881 -242848 11017 41202 126385 -135055
16131 263699 -122061 190084 20718 45840 -3941 57799 51452 7694 -111119 51224 -76505
16119 141482 292913 -98946 -225787 82493 142669 386880 157705 205091 225218 190427 9399
16107 350922 104975 82058 -89104 248899 234688 308541 315763 -5076 -64860 376725 -142057
16095b25360A48250a88761B03457n6359J26633a41048e7901j95280B77200F3229
16084b75815g4337A78146F8433b79575i459G5993C0511g967a920B88139d8149
16072B76422M1650q5957c07977E2047i3487j36519j04921G3169g1000E9686a51157
16060D04684A00365f8757A11264a59455k3403Q3556o9260B83539a98154M821A53047
16048A48978J11806a77239G2962d3302m0062F1673K09000p8057O0298f0193j48526
16037b08719M2282A50881a09291N0548B45168c35922J05600Q0485q5163b9407
16026D8581a20926j13282j78303d772E6971l492b99369E1386a82451E457a02945
16014B76913e1077A0482K93224A50998i6146j21227d9485A05819K9906J49891
$$ plain form
16095 -225360 148250 -188761 203457 147098 273731 -141048 -57901 -253181 277200 63229
16084 -275815 -74337 178146 68433 -279575 -9459 75993 30511 -7967 -1920 288139 -48149
16072 276422 318072 232115 -307977 52047 -93487 -230006 -334927 73169 -71000 59686 -151157
16060 404684 100365 -68757 111264 -159455 -182858 -99302 -168562 283539 -198154 -193333 153047
16048 148978 260784 -177239 72962 -43302 -83364 61673 270673 192616 252914 -60193 -208719
16037 -208719 -166437 150881 -109291 -58743 245168 -335922 -230322 -149837 -235000 -29407
16026 48581 -120926 -234208 -412511 -4772 56971 53479 -299369 51386 -182451 5457 -102945
16014 276913 -51077 10482 303706 150998 -96146 -217373 -49485 105819 135725 285616
16004B85616a08796M8404A83051J004a28488A33067J02216b1905A01228J25963
15994B27191d6457b1282j03065A67917m9658N012a37310l1387L0081l5195F5710
15982C09250A34620a46830A14337L95644j22660j23198b0969C9343K15840j10647
15972A44536m2919d0163C24126i540j11993A51164B7235J090d0987C49019j52377
15961A96642H3188a23932F9933q995b4574j11530k33532Q2193I4955f9811f71
15949a03359j31945a5285k87342A6221f2641e466A2870d2602A0354a87639J6421
15938a71218H8880a90906r4799J35337I143e5473j0784F4891J05546b65096I4076
15926a06778j3133j37373g0809K1492B16918h6639j35320H8015a24948A9924e5825
$$ plain form
16004 285616 -108796 -60392 183051 184055 -128488 133067 235283 -21905 101228 227191
15994 227191 -46457 -21282 -124347 167917 118259 123271 -137310 -168697 -138616 -173811 65710
15982 309250 134620 -146830 114337 509981 387321 264123 -20969 39343 255183 144536
15972 144536 101617 -40163 324126 -9540 -121533 151164 27235 28325 -40987 349019 196642
15961 196642 83188 -123932 69933 60938 -24574 -136104 -369636 -287443 94955 -69811 -671
15949 -103359 -235304 -15285 -302627 16221 -62641 -5466 12870 -42602 10354 -187639 -171218
15938 -171218 88880 -190906 -285705 -150368 9143 -55473 -66257 64891 170437 -265096 94076
15926 -106778 -119911 -257284 -70809 -49317 216918 -86639 -221959 88015 -124948 19924 -55825
15914c05984B32843K1903E9525a60469H9089h3265c1635k29662h9747k22848P7055
15903b35540m754H8075b04724d4802p1829H4884a5344k57439H8740b35236A08671
15891a31103B96526o6954d8380A00506J4715a88191G6838K15860b6544o2686B03933
15879a19577j40653d5823q1169L0172k44666a02048d0303J989A17005a61356B15461
15867A2816J1163K21686b33056D6630A0731d1937B2392O9188k5271J8441J47337
15856B32087D4610L4547c59857J45623A37492O8532A00647b56223a12715F4000
15845b5082B51252A00112b06662R9571M4345A38540d8995l6686A57191G7700b32961
15833c30409B26075g1792B43384a92719R5300j37535b9328R171B3067a01231m0198
$$ plain form
15914 -305984 232843 254746 59525 -160469 89089 -83265 -31635 -261297 -89747 -312595 -235540
15903 -235540 -240294 88075 -204724 -44802 -116631 84884 -15344 -272783 88740 -235236 108671
15891 -131103 296526 229572 -48380 100506 115221 -188191 76838 292698 -26544 -89230 203933
15879 -119577 -260230 -45823 -126992 -96820 -341486 -102048 -40303 -38314 117005 -161356 215461
15867 12816 23979 245665 -233056 46630 10731 -41937 22392 91580 66309 84750 232087
15856 232087 44610 79157 -359857 -214234 137492 206024 100647 -256223 -112715 64000
15845 -25082 251252 100112 -206662 -107091 -62746 138540 -48995 -85681 157191 77700 -232961
15833 -330409 226075 -71792 243384 -192719 -97419 -234954 -29328 -20157 23067 -101231 -141429
15822a41429j8836E5267O8851n502c760A04445c64501D5075c43237C22827P4218
15811C97045b84230A85470B1158a0483F6502b37041J4512A59272c03915A42330
15800b06895c2624i478A68368C9501K04377b29919J14454j60069a30373A24049
15789a30290n8049C5883b98747a29257L0990k40981M3077A03519e9255K0327B50532
15777a62203A62448A0806b2841j26512K7702j41052L7321P4987J6888k10671J71246
15766a72932D36430b11530I5834a04964j68488a411j99154R6926A97725C4786
15755E4646D692L142J63599a08687r7731M9054e0373A39760a78890h9086d945
15743D2628K06775d9563a9638j49401B10179F7150J39137a07365C9114K78926
$$ plain form
15822 -141429 -160265 55267 124118 118616 -3760 104445 -364501 45075 -343237 322827 397045
15811 397045 -284230 185470 21158 -10483 66502 -237041 -222529 159272 -303915 142330
15800 -206895 -32624 -9478 168368 39501 243878 -229919 -115465 -275534 -130373 124049
15789 -130290 -188339 35883 -298747 -129257 -98267 -339248 -296171 103519 -59255 -38928 250532
15777 -162203 162448 10806 -22841 -149353 -121651 -262703 -225382 -150395 -133507 -344178 -172932
15766 -172932 436430 -211530 95834 -104964 -273452 -1411 -200565 -103639 197725 34786
15755 54646 4692 7834 171433 -108687 -206418 -157364 -50373 139760 -178890 -89086 -4945
15743 42628 249403 -49563 -19638 -169039 210179 67150 206287 -107365 39114 318040
15733C18040b228D4331a13552j83087i7310M3450j33520B34138E666a24701I251
15721c8530D4308c43386D0796b74333H3109a56651a2002A4748L5992b46134a18929
15709B41260a01021p4236A9127P58i4441e92m06351H8817c2740j2066B39092L8076
15697B77168c60254f5477B4984a36100E6453f24330B51463A5978J46001e0182
15686a41482k42957G3298e2584j81125c9190A25121J75180a55494e4512B2270
15675E3485J39810b04226M2579M6644G138f246o4551C5040a23338C06460a07405
15663A26364b70728k03881a05086d8115l4725K1138p6424e0466C046L055i8015
15651c5398i445L294l06563a05534B04635C5606a86154F3542O2859h2798c2979
$$ plain form
15733 318040 -2228 44331 -113552 -296639 -97310 -53860 -187380 234138 5666 -124701 9251
15721 -38530 44308 -343386 40796 -274333 83109 -156651 -12002 14748 50740 -246134 -118929
15709 241260 -101021 -175257 19127 19885 -94441 -592 -406943 88817 -32740 -44806 239092 277168
15697 277168 -360254 -65477 24984 -136100 56453 -624330 251463 15978 161979 -50182
15686 -141482 -384439 73298 -52584 -233709 -39190 125121 300301 -155494 -54512 22270
15675 53485 193295 -204226 -161647 -115003 7138 -6246 -70797 35040 -123338 306460 -107405
15663 126364 -270728 -474609 -105086 -48115 -82840 -61702 -138126 -50466 3046 6101 -98015
15651 -35398 -9445 -6151 -312714 -105534 204635 35606 -186154 63542 126401 -82798 -32979
15639b0259j50963F3888c35647B74797G522a80598f3780j59595A85379p8486c7721
15627c9425B66211c56284a316l00564F2284N5810a53359d2308H1126b50776J09418
15616a41358J1026A2855M8658a98023L8597j15363l3114D4068J08515a66463a0426
15604B62955d5940k30597I5518b52114f9016G5230c82140D0737c96991b4361D3753
15592D18141C7816a06664l06691A65186M7506A0473J5652c83466A11485b45483
15581g486q0517A38544b11678D5278c38373k7089A1677g0479m710j68146H9516
15569H6954e5699r7381L8641B33887I7607a41790k7151d769A9613m067e698k92831
15557b98529B4753M6440a73316h5886j3020D5999a47916D03452C5181J93958o8199
$$ plain form
15639 -20259 -171222 63888 -335647 274797 7522 -180598 -63780 -223375 185379 106893 -37721
15627 -39425 266211 -356284 -1316 -301880 62284 118094 -153359 -42308 81126 -250776 -141358
15616 -141358 -130332 12855 61513 -198023 -159426 -274789 -307903 44068 152583 -166463 -10426
15604 262955 -45940 -276537 95518 -252114 -69016 75230 -382140 40737 -396991 -24361 43753
15592 418141 37816 -106664 -413355 165186 212692 10473 26125 -383466 111485 -245483
15581 -7486 -88003 138544 -211678 45278 -338373 -365462 11677 -70479 -75189 -243335 89516
15569 86954 -55699 -153080 -114439 233887 97607 -141790 -168941 -4769 19613 15546 -5698 -298529
15557 -298529 24753 71193 -173316 -85886 -98906 45999 -147916 403452 35181 229139 160940
15546A60940e3345l46782F5315c13328I2668b61963a02737A46885l3212d3032
15535a07561j31823D0942a0224j98696A25387a82829Q8406n2551B51869a47291
15524B05419i4661j89549i6996E0599h3515k9120A75429c770A2062P8174R2025
15513A82261a026j56610A22222e3888A07617g8299E7805c81871C26407i1309C31885
15501E0255J77517J44156a98082A7652O6559a60874A5017i9863j3371G0555o638
15490F3917B8281J94687C0747K17286l7469a44122a6346j21979A1156O2120A9300
15478A99684r7138Q6989r3595l2723b99883A29193a07311A22886b4942A24262
15467F1957a99230j27272C97362A2256K17671a0041B54314F2219d8314B08765
$$ plain form
15546 160940 -53345 -400127 65315 -313328 92668 -261963 -102737 146885 113673 -43032
15535 -107561 -239384 40942 -10224 -208920 125387 -182829 -94423 -146974 251869 -147291
15524 205419 -94661 -284210 -96996 50599 -83515 -112635 175429 -3770 12062 90236 182261
15513 182261 -1026 -157636 122222 -53888 107617 -78299 57805 -381871 326407 -91309 331885
15501 50255 227772 371928 -198082 17652 84211 -160874 15017 -99863 -113234 70555 63917
15490 63917 28281 222968 30747 248033 210564 -144122 -16346 -138325 11156 73276 19300
15478 199684 102546 189535 95940 63217 -299883 129193 -107311 122886 -24942 124262
15467 61957 -199230 -326502 397362 12256 229927 -10041 254314 62219 -48314 208765
15456B89794A2618C758L7819K05095j06295c56374B25373a6290k5005B7566L2646
15445F0212j3123d1918B58418b8616k13193H1436R5114a8403j62875j55456a03385
15433c25104a18625L603l2230A74852q2002h3826A28126D1122J74755c514A44802
15421c9755B03361a52748o6921r9298a37513M2549k92322a21800A1451K54927
15411B66378c09876a34454A54179h9031k9909I5644L3920c16003K8808A53342
15400D1432b15827m289i6701L2351A00986b7267k53956D5247N130g1318k61708
15389c33026f1606B87568a18106l8564J4469B29261o503F2844N4613D330P0178
15378G4508A0522N2583i3641D10191b57200A72138B7396Q0147a47714F0295P5985
$$ plain form
15456 289794 12618 3758 41577 246672 140377 -356374 225373 -16290 -41295 27566 60212
15445 60212 47089 -41918 258418 -28616 -241809 81436 176550 -18403 -181278 -336734 -103385
15433 -325104 -118625 -115022 -147252 174852 92850 -83826 128126 41122 215877 -3514 144802
15421 -39755 203361 -152748 -219669 -318967 -137513 -94964 -387286 -121800 11451 266378
15411 266378 -309876 -134454 154179 -89031 -118940 95644 129564 -316003 -287195 153342
15400 41432 -215827 -220116 -96701 -64350 100986 -27267 -281223 45247 50377 -71318 -333026
15389 -333026 -61606 287568 -118106 -156670 -142201 229261 222758 62844 117457 4330 74508
15378 74508 10522 63105 -93641 410191 -257200 172138 27396 107543 -147714 60295 136280
15367A36280C1419C723a7788G3239N1292E6490f4462H6462L1941a08777g122k2147
15355b9269j05539G4878a3624B35728I0424B9761P6051J11703I6489Q9979b2128
15343a07654G5287j3729k4117J0442a6726A15870k4078M9270J94825a11569r2154
15332b03723k8602A30741J66243a87111a8881p8261j27386e5044B24928a30885
15321a06492B38947m6627b25423C2950N6891a43982A23897e2721j92665B1362
15310g1144b9475F17R114K24673a68447A70985C9829K42525E1845L79693A15972
15298f4811I4732J59205p1811q0049K59191f0019A27842r47E5778K7515e802r5298
15286a01100A94922b94667h5980B50911j19450M1228G4327O6209d9480j64068
$$ plain form
15367 136280 31419 3723 -17788 73239 124531 56490 -64462 86462 118403 -108777 -7122 -29269
15355 -29269 -134808 74878 -13624 235728 90424 29761 105812 217515 96489 186468 -22128
15343 -107654 75287 61558 37441 47883 -16726 115870 91792 141062 335887 -111569 -203723
15332 -203723 -232325 130741 296984 -187111 -18881 -97142 -224528 -55044 224928 -130885
15321 -106492 238947 192320 -225423 32950 89841 -143982 123897 -52721 -245386 21362
15310 -71144 -29475 617 9731 234404 -168447 170985 39829 282354 51845 431538 115972
15298 -64811 94732 253937 182126 102077 361268 -60019 127842 126895 55778 83293 -5802 -101100
15286 -101100 194922 -294667 -85980 250911 131461 172689 74327 140536 -49480 -213548
15276b13548j45598J07253B81571A17380Q4232k6068a30789k06511e4264A9049
15265a42650j38165B17726a44804A5128R8850b06158c515D832b96753i7922k19579
15254c17501J02501a8929O291H6070a05507A93414K7163a12273A59282m9916j4724
15243I4642K38224I5174L06711j42640a25160C62988a14832I0586M96174L20742
15233I07502O45006l72845j15923M63871n33666B26109P6803r0089f8781i000
15222A80942e2338B3503N7413g4134C2189R3929l4606Q0184L82079a14798l8238
15211a53036B94464j36411e0844B40635K49040B25781A4290Q6831j5473C2351
15200f1854J4467l0940A52004m9090c1587E563K67483k7333N1218H3953b4364
$$ plain form
15276 -213548 -359146 -251893 281571 117380 201612 175544 -130789 -337300 -54264 19049
15265 -142650 -280815 217726 -144804 15128 113978 -206158 -3515 4832 -296753 -97922 -317501
15254 -317501 -215000 -18929 -12638 86070 -105507 193414 220577 -112273 159282 109366 94642
15243 94642 332866 95174 401885 259245 -125160 362988 -114832 90586 586760 907502
15233 907502 1552508 1179663 1063740 1527611 993945 226109 302912 212823 -68781 -9000
15222 180942 -52338 23503 80916 -74134 32189 126118 91512 171696 553775 -114798 -153036
15211 -153036 294464 158053 -50844 240635 489675 225781 14290 101121 85648 32351
15200 -61854 -47387 -78327 152004 102914 -31587 5563 273046 245713 296931 83953 -24364
15188a06610k42288A69834f6962A33618J54506N62185c6605N496A77748M0101
15178B17849b3583j45614g0279A6076J21080a34991E5445Q7400E0696d2211B67467
15166F6981J3617a76905A41521o3990K4007a86565B1636d63455i2842I4061c82
15154a02170D05270d0899R764k47698i393D53361A93371E1149a46675A46609f8000
15142a48247B85943b7021B3373K26193g3837C24071A50781l4270K62630c3437
15131B19220n8706J09981A1622c1816C3011d3962A6786J35043M0885F9453M1429
15120A10882J70448k0251a48036J4599B01913B8473J7648M7042L2456N0104l8214
15109A37509M70002j58553c0524A81576n6811P6535K9702j6004f6415A93070q8515
$$ plain form
15188 -106610 -348898 169834 -66962 133618 288124 850309 -36605 -31109 177748 217849
15178 217849 -23583 -169197 -70279 16076 137156 -134991 55445 142845 50696 -42211 267467
15166 66981 80598 -176905 141521 77531 101538 -186565 21636 -463455 -92842 94061 -382
15154 -102170 405270 -40899 -31135 -278833 -9393 453361 193371 51149 -146675 146609 -68000
15142 -148247 285943 -27021 23373 249566 -73837 324071 150781 116511 379141 -33437
15131 219220 160514 270495 11622 -31816 33011 -43962 16786 151829 192714 69453 110882
15120 110882 281330 261079 -148036 -133437 201913 28473 46121 93163 125619 175723 137509
15109 137509 607511 448958 -30524 181576 124765 201300 231002 214998 -66415 193070 104555
15098A04555K4755d955D64027d6271C7319a8594E06035B49686g9483B00824K8109
15087B28933N1048d5622A55797m9163K53847f5900m286E0553R5581j1932a0222
15075D8350J96111K3518j11246J8614J30197B4495f0010a6115D30926H8367J31438
15064B19805b74844b3502m3213A89430E089c4471C23749b14547B5319a00136A44764
15052B32909b7349C93702J9553A76107K46975i9980B22685j11041m2055b347B54142
15040B32070Q7423h10A70270a4779B03676K24316p9935C5147L1632Q4401k8221
15029A22959C2546h8506C37956e5004C04503O774b24444g88A60166L5218E9804
15017C70580D9364J29148J6521g686C76612j08808D9664J37421C0445M27779j39143
$$ plain form
15098 104555 129310 -4955 464027 -46271 37319 -18594 506035 249686 -79483 200824 228933
15087 228933 279981 -45622 155797 106634 360481 -65900 -70186 50553 146134 134202 -10222
15075 48350 244461 267979 156733 175347 305544 24495 -60010 -16115 430926 88367 219805
15064 219805 -274844 -23502 -66715 189430 5089 -34471 323749 -214547 25319 -100136 144764
15052 232909 -27349 393702 413255 176107 423082 -99980 222685 111644 69589 -2347 254142
15040 232070 319493 -810 170270 -14779 203676 427992 348057 35147 66779 151180 122959
15029 122959 32546 -88506 337956 -55004 304503 311277 -224444 -788 160166 195384 59804
15017 370580 49364 178512 195033 -7686 376612 267804 49664 187085 30445 458224 319081
15006C19081C445J82649O1746A01579J60256F0615K74235C5732A5260O9832K47217
14995C32309A63037j3322J59484m8616A15077E1008O4081K46015k4970q9645A10375
14983F9194J76474e9820B1997L24212G8455K74108G8749q696K29852l2864Q4539
14972C51580N5064j61050J95179A42546E5206J47527H134L77375F9846J25268
14962A95114K88110j48156J99179j92422d7271A05074o69J09611O0944R5616M1350
14951D11926p6394J85437j98835o818J05961j06987r1396J76154p1983j60930
14941A66135J15289L84540i7614B77729L8553E8345k6829i7322B90281J45969
14931D36250D4688K73877J3147R668A56312J52506K419p4679J21482C3647P0073
$$ plain form
15006 319081 3445 186094 247840 101579 261835 60615 334850 35732 15260 85092 332309
14995 332309 163037 149715 309199 260583 115077 51008 115089 361104 336134 246489 110375
14983 69194 245668 -59820 21997 346209 78455 352563 78749 70053 299905 267041 351580
14972 351580 406644 245594 440773 142546 55206 202733 8134 385509 69846 195114
14962 195114 483224 335068 534247 341825 -47271 105074 104405 214016 274960 370576 411926
14951 411926 335532 520969 322134 315316 421277 314290 222894 399048 327065 166135
14941 166135 281424 665964 -97614 277729 316282 58345 31516 -97322 290281 436250
14931 436250 44688 318565 331712 341380 156312 308818 311237 236558 358040 33647 103720
14920A03720J56307n6231R9189K41929j06989j89516K07150A45267J03389L03297
14910E51953H7803M3049K22205p7266j8222d9832C12334a32755A02726J11876
14900B14602J70673A59208R6863j06396M38047D7103J89513N8266K41436N5659
14890E91977j4485A61013N9639J52595k7004j16844J60245J45693j48426H9004
14879c8866C72020H0362c9235A53834J18700J18740A03669Q1489J48677o3480
14869B70355M87996g4341C34231J29486j03870m7615l7323L03360p5153p0561
14859D32555J20838l8139j24007k9438K20823H0305J79389k3568J58091l5976
14849C58241j09944L40541B49171N7242p6547J76058j841M0106B12878K90645
$$ plain form
14920 103720 260027 203796 302985 544914 437925 248409 455559 145267 248656 551953
14910 551953 87803 130852 353057 275791 257569 -49832 312334 -132755 102726 214602
14900 214602 385275 159208 256071 149675 587722 47103 236616 294882 536318 591977
14890 591977 577492 161013 220652 373247 346243 229399 389644 535337 386911 89004
14879 -38866 372020 80362 -39235 153834 272534 391274 103669 185158 333835 270355
14869 270355 758351 -74341 334231 463717 359847 312232 274909 578269 503116 432555
14859 432555 553393 515254 391247 361809 582632 80305 259694 236126 394217 358241
14849 358241 248297 588838 249171 306413 229866 405924 404083 444189 212878 503523
14839E03523q5988N5324q9602j28122q2647k4189R6291n668K61289j11177L06328
14828F95362j98387K0240Q8172j75332j46174J04915j33610K94845M12734D23150
14817D42564j44827L09281Q222j43850q2337K89042j76399l7695j07449J14756
14807D71308L55084k73518B26963K29749B24427K15816K88984O0355C75512J84108
14797E59620j78199L50591j34860k17051j02739K86865A91105M00614J59961C65433
14786D99344j94743n5408N45581l06608J76941G2511L04959K09659k60891K92766
14776F19004j70435A20485N94717B39001K50806l5845J46137j43937P1523J85274
14766G12959k18902M745k2255J46448l4689k58985M53390j39118J09667j35490
$$ plain form
14839 503523 417535 472859 383257 255135 172488 148299 244590 238922 500211 389034 695362
14828 695362 496975 517215 605387 430055 283881 388796 255186 550031 962765 423150
14817 442564 297737 607018 615240 471390 389053 678095 501696 464001 356552 471308
14807 471308 826392 552874 226963 456712 224427 440243 729227 789582 375512 559620
14797 559620 381421 732012 597152 380101 277362 564227 191105 591719 751680 365433
14786 499344 304601 249193 794774 488166 665107 72511 377470 587129 326238 619004
14776 619004 448569 120485 715202 239001 489807 453962 600099 456162 527685 712959
14766 712959 494057 498802 476547 622995 588306 329321 782711 643593 753260 617770
14756F17770j70009K3927P6055q7842N5489J42363l01080J26162J07363k70444
14746C19754O7884J98440j37170n321O8766L46046k09836L51679k23945j52910
14736F23387J4965J18779k31277j36918L09376k88057M48985k59824j84269K08002
14726F23149j46342K48317l8775K08569j61041L2364B89150M77165k04123K14071
14716G76263j72898J6512L001J97341P5056j18719q2916M78231C40549K47626
14706E88175L74158k11306j50375n8924N05199l84420O8510j6627l9969R8959
14696G73380P6087k37528R5083J15929K92563n34999K71036j07855O5441J34479
14686I43616k4123L8087j4677n1025L3838o103l45472N32398l51441J68138k51635
$$ plain form
14756 617770 447761 471688 547743 459901 515390 657753 356673 482835 590198 319754
14746 319754 387638 586078 448908 443587 512353 858399 648563 1000242 776297 623387
14736 623387 638352 757131 525854 388936 698312 410255 859240 599416 415147 623149
14726 623149 476807 725124 686349 894918 733877 766241 289150 766315 562192 776263
14716 776263 603365 619877 622878 820219 895275 776556 693640 1171871 340549 588175
14706 588175 962333 751027 600652 541728 1046927 662507 731017 714390 674421 773380
14696 773380 849467 611939 707022 822951 1115514 580515 851551 743696 809137 943616
14686 943616 919493 957580 942903 891878 925716 919613 574141 1106539 755098 923236 671601
14675F71601j8442K21653N4794l131Q869k83599K2531M28568k95369l9108L15955
14664A084322J24892K6604E31927K93725p4186l47268P13719q6086l58650K55767
14654I28948K35227o3152J90119m01601j36364l2551J31572j76871P2805K23788
14644I71920M5270L3081J10171k27036K6216M26205j89006k97421L3616M9101
14634I82117J96282k18906k01561K50575O6669K42250n18123N14589l61322O4777
14624A017347M23664k15194j5019K5026l42982M81667k87168J28890m1435J45988
14614A320784n077J45001k44348Q2052j01419M68571l39801k17389N22332k43667
14604A387039j80927l4337J89352J17163j71969k21754l8521J35049J90426J97104
$$ plain form
14675 671601 653159 874812 929606 926475 935344 651745 674276 1102844 807475 768367 1084322
14664 1084322 1209214 1235818 531927 825652 751466 404198 1117917 1031831 673181 928948
14654 928948 1164175 1101023 1291142 889541 753177 720626 852198 675327 748132 971920
14644 971920 1017190 1050271 1160442 933406 959622 1385827 1196821 899400 933016 982117
14634 982117 1178399 959493 757932 1008507 1075176 1317426 799303 1313892 952570 1017347
14624 1017347 1441011 1225817 1210798 1235824 892842 1374509 1087341 1216231 1174796 1320784
14614 1320784 1315707 1460708 1216360 1298412 1196993 1665564 1325763 1108374 1630706 1387039
14604 1387039 1206112 1171775 1361127 1478290 1306321 1084567 1046046 1181095 1371521 1568625
14594A568625j33016P3528L1603J63895l20853J79499O478m5102k92502M66989
14584A699144K94525l26340n1546r4612K13297K1955j69251j58101N28541j29894
14574A827718j1016l07721N05808n76469K10309L07381k88486J640j36051M27903
14564A961016K06377j92169J08055j38715j15863L11354M317m08282L4796J55276
14554A926162J83388j93367J48813K68866O745k25741L42578O6363K47797k79086
14544B492518N56031j16435J75475M10251J15762M25568P25887M60294J222442
14535F467793J531907K778618L833018O748190J0260385m421014r260135o583529
14527A1355233m633855j859350p10344j162865k39680m33682j30340L79620l32140
$$ plain form
14594 1568625 1435609 1509137 1540740 1704635 1383782 1563281 1569759 1524657 1232155 1699144
14584 1699144 1993669 1667329 1615783 1521171 1734468 1756423 1587172 1429071 1957612 1827718
14574 1827718 1816702 1508981 2014789 1438320 1648629 1956010 1667524 1669164 1533113 1961016
14564 1961016 2167393 1975224 2083279 1944564 1828701 2140055 2144372 1736090 1770886 1926162
14554 1926162 2109550 1916183 2064996 2333862 2340607 2114866 2457444 2523807 2771604 2492518
14544 2492518 3048549 2932114 3107589 3517840 3633602 4059170 4785057 5245351 6467793
14535 6467793 7999700 10778318 14611336 21359526 31619911 27198897 17938762 11355233
14527 11355233 6721378 4862028 4151684 2988819 2749139 2315457 2185117 2564737 2232597
14518B232597L51937k40713j28414k8709l0742J98190l87217L50010k6440n9828
14508B230671P2394J38110n6565k38512L23932J32683o091k77835q3151L8531
14498B274167L56515k81536L15081j48592r9685J87248L43527m90797L94529L5431
14488B885888J14756j68753K72392j27520K1613q3586k66511K03187K13541J56958
14478C221965m0476l31342J49997L80043n8813Q5584j15449J31737j58533J53498
14468C418211q8734N475L07459p380J6995m3085L33462j40299K33860K6563J01576
14457D164103k98438K10620m6394J10362J47680j93204K41979k53251K89045j01309
14447D271193L50685n00969O19467j82004J08495j2087O4261j14624N1312J46747
$$ plain form
14518 2232597 2584534 2343821 2215407 2186698 2155956 2354146 1966929 2316939 2290499 2230671
14508 2230671 2303065 2441175 2384610 2146098 2470030 2602713 2596622 2318787 2235636 2274167
14498 2274167 2630682 2349146 2664227 2515635 2415950 2603198 2946725 2455928 2850457 2885888
14488 2885888 3000644 2831891 3104283 2976763 2998376 2914790 2648279 2851466 3065007 3221965
14478 3221965 3181489 2850147 3000144 3380187 3321374 3406958 3291509 3423246 3264713 3418211
14468 3418211 3329477 3334952 3642411 3635031 3652026 3608941 3942403 3802104 4035964 4062527 4164103
14457 4164103 3865665 4076285 4029891 4140253 4287933 4094729 4336708 4083457 4372502 4271193
14447 4271193 4621878 4120909 4740376 4558372 4666867 4654780 4719041 4604417 4655729 4802476
14437D802476J81838L59577m89847K04636M36760n40412O86958k51264J79454
14428E570176O7350j08653K61256k15234J06559L02982P4698Q9381K150k71303
14418E879362M50433N07943j30219m47316K99761K72028q8976M20357k14920M99131
14408G447584k96353Q8415N69527n43903J50690O22720j87529m662J53186M7443
14398H047118L49561j89505M97370J02470k88495K64593O72063m98017L14970
14389I272128K78657L59251K16922p0820J40256L94064j38279J58220M42525m98396
14379A0554528L41166J72120L22674J67802K10501K50626P453K92151L63437J25781
14369A2808239K61852L87310M5044L91626K95362O9787P40910k96868O24899M76102
$$ plain form
14437 4802476 4984314 5343891 4854044 5058680 5495440 4955028 5641986 5390722 5570176
14428 5570176 5637526 5528873 5790129 5574895 5681454 5984436 6059134 6148515 6150665 5879362
14418 5879362 6329795 6837738 6707519 6260203 6559964 6831992 6743016 7163373 6948453 7447584
14408 7447584 7151231 7239646 7809173 7265270 7415960 8038680 7851151 7846489 7999675 8047118
14398 8047118 8396679 8207174 8704544 8807014 8518519 8783112 9455175 8957158 9272128
14389 9272128 9550785 9910036 10126958 10056138 10196394 10590458 10452179 10610399 11052924 10554528
14379 10554528 10895694 11067814 11390488 11558290 11768791 12019417 12026870 12319021 12682458 12808239
14369 12808239 13070091 13457401 13502445 13894071 14189433 14259220 15000130 14703262 15328161 15804263
14359A5804263j15333Q22585j25334N52491L2850L10433N27950L75491O27975
14350A8813371J60960M02138K43511P83183O10411j84494J140818J62418K61176
14341B2393492P91842N60502O1275J019709O89105P22165K85320P26417M35270
14332B7685097Q91690R93122O70185P33751N83184J017233Q86604R36300J368634
14323C5765800L10721J297751J262812R09979J463679J477900N11267J821328
14315D4821237J245466J614255J591173J762950J511454J985149J506269K314375
14307E8352328J849313K154165K318222K480862K664688K970180K435154K854640
14299G8079552L606728L400615L193860L644084M074594M173892M611331M648867
$$ plain form
14359 15804263 15688930 16511515 16386181 16938672 16971522 17281955 17809905 18185396 18813371
14350 18813371 18974331 19376469 19619980 20403163 21013574 20829080 21969898 22132316 22393492
14341 22393492 23185334 23745836 23807111 24826820 25515925 26238090 26523410 27249827 27685097
14332 27685097 28576787 29569909 30240094 30973845 31557029 32574262 33460866 34397166 35765800
14323 35765800 36076521 37374272 38637084 39547063 41010742 42488642 42999909 44821237
14315 44821237 46066703 47680958 49272131 51035081 52546535 54531684 56037953 58352328
14307 58352328 60201641 62355806 64674028 67154890 69819578 72789758 75224912 78079552
14299 78079552 81686280 85086895 88280755 91924839 95999433 100173325 104784656 109433523
14291A09433523N011548N307202N421756O286120O194316P601693O889023Q075455
14283A60220636Q203022Q779819R356922R814199J0386857J0940991J1776385
14276B29478831J1999372J2774307J3624022J4598138J3994244J4450843J4530391
14269C25450148J4727052J4808517J4349926J3832633J2807369J1923421J1141516
14262D19040582R902216Q856697Q058480N328884K415103J542327J488722R83735
14254D57616746n210340o668895o714083p955234j1801435j2094448j3256438
14247C93915873j3320330j4559635j4184731j4419442j4625035j4199612j4164400
14240B94442688j3273018j2512135j2322394j2376852j1407494j1344295j0619941
$$ plain form
14291 109433523 114445071 119752273 125174029 131460149 137654465 145256158 152145181 160220636
14283 160220636 168423658 177203477 186560399 196374598 206761455 217702446 229478831
14276 229478831 241478203 254252510 267876532 282474670 296468914 310919757 325450148
14269 325450148 340177200 354985717 369335643 383168276 395975645 407899066 419040582
14262 419040582 428942798 437799495 445857975 451186859 453601962 455144289 456633011 457616746
14254 457616746 452406406 445737511 439023428 431068194 419266759 407172311 393915873
14247 393915873 380595543 366035908 351851177 337431735 322806700 308607088 294442688
14240 294442688 281169670 268657535 256335141 243958289 232550795 221206500 210586559
14233B10586559j1022710j0569335r859213r148380q286110q173880p670327o790286
14225A39066318o721349o340838n284389n802489n343341m652327m510035l963882
14217I6447668m121058l731162l464878l668598k859537l319142k782826k875416
14209F9625051k573954k701782k105326k226024j909633k074116j962825j837962
14201E2233429j406040j657319j346854j471771j876082j221971j231373r13697
14193D1108322j338858p67843j118345j623288n55508j219915r19833p72104o19085
14184C2173543p91434j026383r16178o44064q48951n11597p06417n23342r41371
14175B5263806m03675m80434l02891q55156n49051n99597r07068O5210o35944
$$ plain form
14233 210586559 199563849 188994514 179135301 169986921 161700811 153526931 145856604 139066318
14225 139066318 132344969 126004131 120719742 114917253 109573912 104921585 100411550 96447668
14217 96447668 92326610 88595448 85130570 81461972 78602435 75283293 72500467 69625051
14209 69625051 67051097 64349315 62243989 60017965 58108332 56034216 54071391 52233429
14201 52233429 50827389 49170070 47823216 46351445 44475363 43253392 42022019 41108322
14193 41108322 39769464 39001621 37883276 36259988 35704480 34484565 33564732 32792628 32173543
14184 32173543 31382109 30355726 29439548 28795484 27946533 27434936 26728519 26205177 25263806
14175 25263806 24860131 24379697 24076806 23221650 22672599 22073002 21165934 21231144 20595200
14166B0595200m41561n02892k13387n84090o86233l11817k98416N873P7053j029393
14156A6610337j27813m63736J6581m33032m19072j92859n34457n53638J54729
14147A4057040j21056n00081k73176P5213q11967M06840k82860m32826k99384
14138A1817743k684k01202K8669l02857k18155k67199j85874N8201l10078j46654
14128A0269910l12472J18200j67085l49510l3172l27157k08622J28389j96943
14119H921538p7873j35464k50393k20488K02936k68248k01785K6680j41419k73070
14109G582414J10311J24376n93516M08575k10506r3382k84008k7486j82332l53698
14099F480748J64296j77380J67379m53405L34992m29422M54706m94381l4032q5965
$$ plain form
14166 20595200 20153639 19650747 19437360 18853270 18167037 17855220 17556804 17562677 17639730 16610337
14156 16610337 16482524 16018788 16035369 15602337 15183265 14990406 14455949 13902311 14057040
14147 14057040 13935984 13435903 13162727 13237940 12425973 12832813 12549953 12117127 11817743
14138 11817743 11815059 11613857 11642526 11339669 11121514 10854315 10668441 10726642 10416564 10269910
14128 10269910 9957438 10075638 9908553 9559043 9525871 9198714 8990092 9118481 8921538
14119 8921538 8843665 8708201 8457808 8237320 8440256 8172008 7970223 7996903 7855484 7582414
14109 7582414 7692725 7817101 7223585 7632160 7421654 7328272 7044264 7016778 6834446 6480748
14099 6480748 6645044 6467664 6635043 6181638 6516630 6087208 6541914 6047533 6013501 5927536
14089E927536J04401J03654m14111j09425r1107K76564J12921o46317N01872p35894
14079E030094L09114J2461l80399L00738k36122l14810j13679J64460K0102l4176
14069D757783q5357J12200l81773L03448L5745k42679M8185k57723j17329J05601
14059D278101J42189j99133n3640O8406o0973j71340r5845J15253m47664M42474
14049D017828l87129j0435j91134M35324k9737m64910L33533k61868n0003k53578
14039C137891J55051J75888L980k82249l1626L75419k25857J13189j19464J09146
14029C411368m21927J64413r1030J06224P234N6038r5401j5280m07879K06938
14019B920698M0009J06872k34970K64087j80298l645l26117Q162K37271k62080
$$ plain form
14089 5927536 6031937 6135591 5721480 5612055 5520948 5797512 5910433 5264116 5765988 5030094
14079 5030094 5339208 5351669 4971270 5272008 5035886 4721076 4607397 4771857 4791959 4757783
14069 4757783 4672426 4784626 4402853 4706301 4742046 4499367 4547552 4289829 4172500 4278101
14059 4278101 4420290 4221157 4167517 4235923 4174950 4003610 3907765 4023018 3575354 4017828
14049 4017828 3630699 3620264 3429130 3864454 3834717 3369807 3703340 3441472 3391469 3137891
14039 3137891 3292942 3468830 3472810 3190561 3158935 3534354 3308497 3421686 3302222 3411368
14029 3411368 2989441 3153854 3062824 3169048 3176282 3232320 3136919 3121639 2713760 2920698
14019 2920698 2960707 3067579 2832609 3096696 2916398 2912753 2586636 2594798 2832069 2569989
14009B569989l8862o2154J42877J71945P4228m07878J69848m20609L61980j70231
13999B391133p1341K03056o84977N71259l31926L20283k02620m52400P26840n20907
13989A948400L59844N1441l37092J19919l3204R346K58150r4180L2317J02233
13979B417174J52093J60876O60456M50236J057430K334442L073704O163598J1400509
13970B7870518O85441r462105o307045l763098k354892j540854k52450r21661
13962C953854k59892m67119J30884k23425o15544N1339l61644J72968l2937K58570
13952B607054j13781j17043k18970K63232r1388P1375k94918m8206n10691O71100
13942B217764k50440k31478K97024j82300j9992k54414K87775K1587k35624J16031
$$ plain form
14009 2569989 2531127 2468973 2611850 2783795 2858023 2450145 2619993 2199384 2561364 2391133
13999 2391133 2319792 2522848 1837871 2409130 2077204 2397487 2194867 1742467 2469307 1948400
13989 1948400 2308244 2359685 2022593 2142512 2109308 2118654 2376804 2282624 2314941 2417174
13979 2417174 2569267 2730143 3390599 3840835 4898265 7232707 10306411 16470009 27870518
13970 27870518 28555959 19093854 12786809 9023711 6668819 5127965 4875515 3953854
13962 3953854 3693962 3226843 3357727 3134302 2518758 2570097 2208453 2381421 2348484 2607054
13952 2607054 2493273 2376230 2157260 2420492 2329104 2400479 2105561 2057355 1546664 2217764
13942 2217764 1967324 1735846 2032870 1850570 1830578 1576164 1863939 1885526 1649902 1765933
13932A765933j29774l6278o6888N1404J47627n5003j14424j19588K89219K16675
13922A948903r4273k47417N3826m2561K32138j1118k28764p7793j12785J59280
13912A579436J41818l91271J48668k59147J42812L44204l68534K25905k18918
13903A344973K18151k3544m71064m4183K84706m7809L41597o29307J51878K88230
13893A413628j28598K1449J77154J31111j08372j83114n4853P5558j36793O9341
13883A276511M40001n48236K15377l10316k90472M61839j89842K9429k40750K45360
13873A088901N2911j60104K79528n272p6854Q9119k84765Q8776o8906k78007r2814
13862F32513M65603j65215J27770K88436l88997L61479J8480n43684L30983j25456
$$ plain form
13932 1765933 1636159 1599881 1532993 1584397 1732024 1677021 1562597 1443009 1732228 1948903
13922 1948903 1854630 1607213 1661039 1618478 1850616 1839498 1610734 1532941 1420156 1579436
13912 1579436 1721254 1329983 1478651 1219504 1362316 1706520 1337986 1563891 1344973
13903 1344973 1563124 1539580 1068516 1024333 1309039 1261230 1602827 973520 1125398 1413628
13893 1413628 1285030 1306479 1483633 1614744 1506372 1323258 1268405 1343963 1207170 1276511
13883 1276511 1716512 1168276 1383653 1073337 782865 1244704 1054862 1084291 843541 1088901
13873 1088901 1141812 981708 1261236 1255964 1179110 1268229 983464 1072240 1003334 725327 632513
13862 632513 1098116 932901 1060671 1349107 960110 1321589 1340069 796385 1127368 1001912
13852A001912K18541J67249o67871L44178j81037M1494R5432l4646L5798K02910
13842A223960k62967k1898N8887j54198J68637j31474N3282m9905p623j9935K05245
13831A062011j5036j63993m091j3534r7212m7683K17718j24667q0077J80802J47708
13820A061946j21864l37338M9090K61042k80300L67820n3108j85351j19562O3067
13810G05442k5976K36620K84480k22828j34170k63273N05350k25075L54345l45410
13800H69505l03322J75966K45640m82320N30977l54656P1405J45115k15567L09045
13790I91788k28590J9642k03272J42250j07836J53688p5506J50168q8809l9097
13780G14426K65119C32532N56332j33336j02528K18901r7592j64577J57022P7070
$$ plain form
13852 1001912 1220453 1387702 719831 1064009 882972 924466 1019898 985252 1021050 1223960
13842 1223960 960993 939095 997982 843784 1012421 880947 934229 884324 876701 856766 1062011
13831 1062011 1046975 882982 878891 865357 768145 720462 938180 813513 733436 914238 1061946
13820 1061946 940082 602744 651834 912876 632576 1000396 947288 761937 642375 705442
13810 705442 679466 916086 1200566 977738 843568 580295 1085645 860570 1214915 869505
13800 869505 566183 742149 987789 505469 1036446 681790 753195 898310 682743 991788
13790 991788 763198 782840 579568 721818 613982 767670 692164 842332 753523 714426
13780 714426 979545 332532 888864 755528 653000 871901 774309 609732 766754 843824
13770H43824j77163m8553K39180B70083K62672J18672J31702J6816l28547j0168
13760D61230N9694K90204k20233k5225j04367J5044R8836J48947j88887L45890
13750H81133D34666M22386l20297J05327L322q1200K34474k73957p2070L17540
13740G70191k37586R1584k7128j49599L76438j75651J42597k37808J93551B14079
13729C25845J79946L28148j34316J35519l13791K27525j97333J39730K45110C79825
13718H14509k43372Q1685K4832k16538J10540J19915K5061l0142k88730l797K57416
13707F51379k95694j25333L3306N8482K63294j28832k7306M7367j80087K34201
13697E30777K4326B30520K16504j74378K43188p2901K23788M2461B89200K04390
$$ plain form
13770 843824 666661 618108 857288 270083 532755 651427 783129 799945 471398 461230
13760 461230 520924 811128 590895 565670 461303 476347 575183 724130 535243 881133
13750 881133 434666 857052 536755 642082 645404 564204 798678 524721 452651 770191
13740 770191 532605 624189 597061 447462 823900 648249 790846 553038 746589 214079
13729 325845 505791 833939 699623 835142 521351 748876 551543 691273 936383 379825
13718 814509 571137 652822 677654 461116 571656 691571 716632 686490 397760 393963 651379
13707 651379 355685 230352 263658 322140 585434 456602 429296 476663 296576 530777
13697 530777 555103 230520 447024 272646 515834 442933 666721 709182 289200 493590
13687D93590k25792J70406j09517n2880J15967Q7797J79412j35794j17133A28809
13676G15881j85556Q4216p2706L5871o2586K7098k56447J75539J17074k03565
13666C74819L538K91665B44887M16315B04546N18586A14405N28186j82046j21340
13656C39205M82022A45563J02731N11235C20553J91767k55366J73225j15022J92713
13646E07870k20196J99563j66652N9693J06315K80684j06960k70260K1979j96296
13636B15740b9262C60180J14035J38342G1258L47949R3735A14388L19664j07293
13626C26759Q0955j0433a6232E51869B72353K05531r6854J16858r0113L24952
13616G32727j78753p1319j62280A27494J71481K4896J86294H3254M92040B30842
$$ plain form
13687 493590 267798 438204 328687 275807 391774 479571 658983 523189 406056 128809
13676 715881 530325 614541 541835 577706 515120 542218 285771 461310 578384 374819
13666 374819 378357 670022 244887 661202 204546 723132 114405 642591 460545 339205
13656 339205 821227 145563 248294 759529 320553 512320 256954 430179 315157 507870
13646 507870 287674 487237 320585 380278 486593 767277 660317 390057 412036 215740
13636 215740 -29262 360180 474215 612557 71258 419207 512942 114388 434052 326759
13626 326759 407714 397281 -16232 551869 272353 477884 381030 497888 407775 732727
13616 732727 553974 482655 320375 127494 298975 323871 510165 83254 575294 230842
13605C16041K17411j40569J84953n452j39533j06623j729q9749k1761O0514q5072
13594A88431J84641k9855K34647j77566q6208r9476K56524n672n9441p210L78782
13583G77597l81259J08272j16702j06278n6720J07896D7813O5885J91840H8935
13572i8628D24099r4346K59096j79854A20002J21390J40137A87487o0020L06718
13562D34185M6342A09367K20215F7333L21910j12630A26590k1508K54190P2122
13552D31394i1898D73856J48802e4470D36695j27345J38999A21722K6905k2770
13542A25857K16592A64871q0652K95275K56494k94737m6711P9597A63483K7578
13532A91061p2076C5202L22648H4375J67148j09906K88023N2035A35633N0057
$$ plain form
13605 316041 533452 392883 577836 572384 432851 326228 324499 234750 212989 273503 188431
13594 188431 373072 343217 577864 400298 314090 214614 471138 465466 406025 398815 777597
13583 777597 396338 504610 387908 281630 224910 332806 47813 113698 305538 88935
13572 -98628 424099 329753 588849 408995 120002 241392 381529 187487 127467 434185
13562 434185 480527 109367 329582 67333 389243 276613 126590 105082 359272 431394
13552 431394 -91898 473856 622658 -54470 436695 309350 448349 121722 148627 125857
13542 125857 342449 164871 84219 379494 635988 341251 294540 374137 163483 191061
13532 191061 118985 35202 357850 84375 251523 141617 429640 481675 135633 185690
13522A85690J68015R5247j61065J8350J37052r3488l4447J74841A47850L29227
13512D77077A98469J02448N7816q1958k0476K35378A79907n0238K2180Q0527A08340
13500D75151B5072J1265L99682b43222B58710K5380M454K2307j278G3056J42644
13489B15700o0736L42965B45675J00108J80158J92023C13409r5842J44207A58921
13478a09351C34558q1625p0743k2788j3365M08492B31309J11922A69433l9477
13468A29956g4555C20006i517D17236a40048C00260q4140k9722I2864o86K69401
13457C61579A05589J95457J69804j44586l2602N2924e9689I6015K71600j67999
13447A99616R1631L3907C5026P6221K06244j16387L6610N7004P8901k9154A03821
$$ plain form
13522 185690 353705 448952 287887 306237 443289 349801 315354 490195 147850 477077
13512 477077 198469 300917 358733 276775 256299 491677 179907 129669 151849 232376 108340
13500 475151 25072 36337 436019 -243222 258710 284090 288544 310851 309573 73056 215700
13489 215700 154964 497929 245675 345783 525941 717964 313409 217567 361774 158921
13478 -109351 334558 252933 182190 159402 146037 554529 231309 343231 169433 129956
13468 129956 -74555 320006 -9517 417236 -140048 300260 216120 186398 92864 92178 361579
13457 361579 105589 301046 470850 326264 293662 346586 -59689 96015 367615 199616
13447 199616 291247 325154 35026 111247 317491 201104 237714 294718 373619 344465 103821
13435A24767J15961H4730J63507f2124l1218A38797L9596J29033A5772K27533
13425B43305O2592A52484K23753j12784C5065J58070B58J33160J49756a18813
13414A23987B150g1396E1101g4106G6928N3785e3794D94915j81331j44192L79924
13403E49316C7933K00340c1923B9573M50106A05708n901K94225O7907j04423A58142
13391B52352M438b3293C81312g3016G746M3401j8434a76181B02160A5960J86021
13380B01981B2496L93589A59816R7629N2401E5994o266P585M02515L159D8235
13368c4926C90032E9111L63178D5203g7319A2556J12464j3397c7068D48909B23115
13356b2059B92686A00535K5793N5031J68711O2291A29446J02380q6479K0419K00122
$$ plain form
13435 124767 240728 84730 248237 -62124 -93342 138797 178393 307426 15772 243305
13425 243305 305897 152484 376237 263453 35065 193135 258 133418 283174 -118813
13414 123987 2150 -71396 51101 -74106 76928 130713 -53794 494915 313584 169392 549316
13403 549316 37933 238273 -31923 29573 479679 105708 99807 394032 461939 357516 158142
13391 252352 256790 -23293 381312 -73016 7746 51147 32713 -176181 202160 15960 201981
13380 201981 22496 416085 159816 257445 309846 55994 49728 57313 459828 462987 48235
13368 -34926 390032 59111 422289 45203 -77319 12556 125020 111623 -37068 448909 223115
13356 -22059 292686 100535 126328 181359 350070 412361 129446 231826 145347 165766 365888
13345C65888b51772C03369G090N88520B81360O0039j17131A4587K94064A52988
13334E1210k2489L67175K5137A35237K16796J5677J12711k1036b5550A83603J45035
13323C28638j46728L57990A31470M53508E7784N1347n4289J24546L31572I0989
13312A72501M5890K19384a3203D80875g4B73995E2391L64654H7918J91247j01415
13301A77750o4314B1053J57905J66427G0445J74707o1332p4313N9795J59811a40955
13289G5781M2747D481J95741q7798M9032J50135M0153E6511e8545E8774h1373
13277B3917a20411P14B5152K71058A18742Q2118c2853A27530Q6953A04316a41376
13265C00787J92366H7097J66286m9330K9053b9191n9170D2686O9702J46984j0041
$$ plain form
13345 365888 -251772 303369 7090 595610 281360 341399 224268 14587 308651 152988
13334 51210 28721 395896 421033 135237 352033 367710 480421 459385 -25550 183603 328638
13323 328638 181910 539900 131470 584978 57784 109131 54842 179388 510960 90989
13312 172501 218391 437775 -13203 480875 -74 273995 52391 417045 87918 279165 177750
13301 177750 113436 21053 178958 345385 70445 245152 183820 109507 169302 329113 -140955
13289 75781 118528 4481 200222 112424 161456 311591 351744 56511 -58545 58774 -81373
13277 23917 -120411 -119697 25152 296210 118742 200860 -32853 127530 214483 104316 -141376
13265 300787 493153 87097 253383 204053 233106 -29191 -88361 42686 112388 259372 249331
13254B49331h9848A14762K0246f4273A05883K45196j24112l7381n4852Q4779F2182
13242C04428A18542l4434M6655P4259Q1300c342D3348O0530b37657A97961A8054
13230B45128a3466B63191K22695A04480E630a50136C14559o2942c4037C3125O5656
13219I8781P3940d9741A51817J10529O6524A28809L8423K856J02952K500A37494
13207B05684N1094A07071m2488e4659A6239g4642A50825A4586L55286a98941D47099
13195B918K94787C8975e0113o886C18330a68574C91059F0225J9003a07716A90032
13183A05744N9981a34133M6456A12244a04395p6307I646a75568C7339a17684A01398
13171B40717A04534a0695j89793A27070p534J97599H3578K0591N0366A251K04073
$$ plain form
13254 249331 -89848 114762 135008 -64273 105883 351079 226967 189586 134734 219513 62182
13242 304428 118542 84108 130763 205022 286322 -3342 43348 103878 -237657 197961 18054
13230 245128 -13466 263191 485886 104480 5630 -150136 314559 251617 -34037 33125 98781
13219 98781 172721 -49741 151817 262346 328870 128809 167232 170088 273040 275540 137494
13207 205684 256778 107071 64583 -54659 16239 -74642 150825 14586 369872 -198941 447099
13195 2918 297705 38975 -50113 -56999 318330 -168574 391059 60225 79228 -107716 190032
13183 105744 165725 -134133 -87677 112244 -104395 -180702 9646 -175568 37339 -117684 101398
13171 240717 104534 -10695 -200488 127070 119536 317135 83578 104169 154535 1251 205324
13160B05324a18355b7632B54877f7038B7857a49415e4891D2731a15898B79145
13149B0356J94151a64364G1257b21301c308A29514K11534H2606a61963B5334J05003
13138A30337K83548j10355j17038a15451o159C86978A07590h3879A06537J64644
13128B71181H645R9220l7558n04l3689r237a51273D3044o580K0140K5579c6406
13115C90475Q3475c5878r0779C72750b1741f299F9360D063a45241A55327n4927
13104A00400a09621A56317c9457A45975k9721l7743J04010E6210a429j79542B1424
13092B60463C7173c63775H938Q019L6672K26141a12509G5314a88907E03181G8798
13080B36954n2870c51539C7150c40155b312k05222M9147A34878D1378b14422A04546
$$ plain form
13160 205324 -118355 -27632 254877 -67038 27857 -149415 -54891 42731 -115898 279145
13149 20356 214507 -164364 71257 -221301 -3308 129514 341048 82606 -161963 25334 130337
13138 130337 413885 303530 186492 -115451 -121610 386978 107590 -83879 106537 271181
13128 271181 8645 107865 70307 69803 36114 26877 -151273 43044 36464 56604 82183 -36406
13115 390475 473950 -35878 -126657 372750 -21741 -6299 69360 4063 -145241 155327 100400
13104 100400 -109621 156317 -39457 145975 116254 78511 182521 56210 -1429 -180971 21424
13092 260463 37173 -363775 8938 16957 53629 279770 -112509 75314 -188907 503181 78798
13080 236954 184084 -351539 37150 -340155 -2312 -207534 -158387 134878 41378 -214422 104546
13068a50095D5929a82234d9226G9459a29744N5065H3057K07281c89A41180J27075
13057B68255q5276P3779a8996B12117a5864A18106i7666j33253B59886a72682
13046C98032A91674f3756j39606B07889d8799j73495j35604A38380o3280J26782
13036B01882b2368q8101l8639A39112A4218L93835d4558J4163l2979K0890D51975
13024D6820c71517A68384A3704J14832a04048K967p649C25341j39803J46316b48736
13012A81177M6833a21863A28595d7493A22051n3122j0911J73349k8285b09375
13001C13569b47145B11077a51875a7908B27335B0339J90495q4903b40796G9047
12990a18l120j3813B4190a75015P2309o6938B02307G5813J21098P422a2922j36923
$$ plain form
13068 -150095 45929 -182234 -49226 79459 -129744 -74679 83057 290338 -389 141180 268255
13057 268255 182979 256758 -18996 212117 -15864 118106 -97666 -230919 259886 -172682
13046 398032 191674 -63756 -203362 207889 -48799 -222294 -357898 138380 75100 201882
13036 201882 -22368 -110469 -149108 139112 14218 408053 -44558 -30395 -63374 -42484 451975
13024 46820 -371517 168384 13704 128536 -104048 -101081 -108730 325341 185538 331854 -248736
13012 181177 228010 -121863 128595 -47493 122051 68929 58018 231367 203082 -209375
13001 313569 -247145 211077 -151875 -17908 227335 20339 210834 125931 -240796 79047
12990 -118 -3238 -17051 24190 -175015 -102706 -169644 202307 75813 196911 204333 -12922 -149845
12978a49845b0675A14857D7885a29431B80527A23070b3740C00927G9464c60562
12967D5758a32426M1616C8171g7391D7139b23707f4803A48646c999B58923A21553
12955F9615e763A12173J02813a74547B7403h4597A85596c75929c4688B26687a72932
12943f2797C39236G1541L47138d33841a12657C24591A20406C128K0690c54549
12932a75691l07026B45952j04396a31498E5980J85323b9166C09462C9276a26295
12921g1981C9339K08853r1900j4220F3612P8780m5207A299N5135a94748E112j440
12909C672a49276A43420K16693j44652k1548G7771a1820k28076f9341q3739C378
12897C1481a3328o7455k5998I5248N3567i5934A853J64892J4283E6186d35247
$$ plain form
12978 -149845 -20675 114857 47885 -129431 280527 123070 -23740 300927 79464 -360562
12967 45758 -132426 -90810 38171 -77391 47139 -223707 -64803 148646 -3999 258923 121553
12955 69615 -5763 112173 214986 -174547 27403 -84597 185596 -375929 -34688 226687 -172932
12943 -62797 339236 71541 418679 -433841 -112657 324591 120406 3128 23818 -354549
12932 -175691 -482717 245952 141556 -131498 55980 241303 -29166 309462 39276 -126295
12921 -71981 39339 248192 156292 142072 63612 142392 97185 1299 56434 -194748 5112 3672
12909 3672 -149276 143420 360113 215461 193913 77771 -11820 -239896 -69341 -153080 3378
12897 31481 -13328 -80783 -106781 95248 148815 -95934 1853 166745 181028 56186 -435247
12885I7818L02641A28372N4145r557M9429J14788A64747K56422G0557b39211G6323
12873g8552C98167D6590a20658B47589H677J5276a10809G7130p543e0863j1500
12862f2363B20009J88981c02369A51799C2290a88229G5237P5232k3063N3856p7727
12851A03535e3605B94139a96588n1128b0783A65331e5207A67482o5128N3886a07793
12839B36778a25742B44446b7195A36066m9449P3924e7148r9893A98187l9795J21160
12828B79552J15K0297n1203C7010a56900g5456j2171D9820d416I9067A9610d46391
12815C619N7947b35578B01748D8270J08178P1931O0199d16077a80705Q3110I8167
12803C4639l095K58194c5050l9957K6365j54440B61022B3090a38697C17818a2598
$$ plain form
12885 97818 400459 128372 182517 172960 222389 337177 164747 421169 70557 -239211 76323
12873 -78552 398167 46590 -120658 247589 8677 23953 -110809 77130 69587 -50863 -62363
12862 -62363 220009 408990 -302369 151799 32290 -188229 75237 150469 127406 181262 103535
12851 103535 -53605 294139 -196588 -247716 -20783 165331 -55207 167482 102354 156240 -107793
12839 236778 -125742 244446 -27195 136066 86617 160541 -57148 -157041 198187 158392 279552
12828 279552 279667 299964 248761 37010 -156900 -75456 -87627 49820 -4416 99067 19610 -446391
12815 3619 61566 -235578 201748 48270 156448 228379 288578 -416077 -180705 -97595 98167
12803 34639 31544 289738 -35050 -75007 -48642 -203082 261022 23090 -138697 317818 -12598
12791a12212b7236P965A70660a05654j63802O2502E498a82643N7730E027K05276
12780B10303p3545b90017a6690j13529k06185G8571K31556o8051a94519I3557
12769E5747J43985J8794J6374a39968A52912f3159k52557K7704A66826a55732
12758a14636J7733E1087J78709i942n9534E63473b11470L4792K6913e8145p8223
12747a36368a6771j89410O3244j63358f299l08533a45284A19391Q4230g1994F0713
12735a6696I8858A5983L00982A19782A0138a00970D34030E1025J40599a01504
12724B00363d757n5551A54026D5676K25790j25003G2538i8611D7688h5316p5252
12713a60568C12722o0503D565a18696c9353A24353f0755B74438D9702a44070G6512
$$ plain form
12791 -112212 -27236 -19271 170660 -105654 -269456 -206954 5498 -182643 -124913 5027 210303
12780 210303 136758 -290017 -16690 -130219 -336404 78571 310127 242076 -194519 93557
12769 55747 199732 218526 234900 -139968 152912 -63159 -315716 -288012 166826 -155732
12758 -114636 -96903 51087 229796 -9942 -69476 563473 -211470 -176678 -149765 -58145 -136368
12747 -136368 -16771 -206181 -142937 -306295 -6299 -314832 -145284 119391 203621 -71994 60713
12735 -16696 98858 15983 316965 119782 10138 -100970 434030 51025 191624 -101504
12724 200363 -4757 -60308 154026 45676 271466 146463 72538 -98611 47688 -85316 -160568
12713 -160568 312722 252219 4565 -118696 -39353 124353 -60755 274438 49702 -144070 76512
12701A5916J9490M387L24298f0626D0827e9256k3874A64752k0490e657A91628
12689B52724G4133j9187H644M49843k00800c2653m1621A26959K7004O5489j02711
12678A16741b6026n2742K0378j47405A18792K22420A50704A8097R3446a59434
12667A14951c5011A60882a89812C22302a35714A06716h3641A11482D1612a37615
12656A24532m8707M0708D6181A8214L1890c01458G7614L30918I7665P9947d7940
12644A62004J13977h5209c0798H5250A6193K25848N1559a01849B41310o0753J24066
12633C04623A0643a27995C11168q8391F2773J90573E5325d5577A88905Q8545b79656
12621a67398F5030K04470A14004a11382c4968B00337J1103i9526M2622A85117
$$ plain form
12701 15916 35406 39793 364091 -60626 40827 -59256 -83130 164752 144262 -5657 191628
12689 252724 74133 54946 8644 458487 257687 -32653 -74274 126959 153963 219452 116741
12678 116741 -26026 -78768 -58390 -205795 118792 341212 150704 18097 111543 -159434
12667 114951 -35011 160882 -189812 322302 -135714 106716 -83641 111482 41612 -137615
12656 124532 75825 116533 46181 18214 50104 -301458 77614 408532 97665 177612 -47940
12644 162004 275981 -85209 -30798 85250 16193 242041 293600 -101849 241310 180557 304623
12633 304623 10643 -127995 311168 222777 62773 253346 55325 -45577 188905 277450 -279656
12621 -167398 65030 269500 114004 -111382 -34968 200337 211440 -99526 -56904 185117
12610B19134a3080A92077C1075i5856J4682m8264F81282a37378B9755g0667F5897
12598F830b23946M0406F5438g6076E3490O3926f2653j46383A53575k7468a84497
12586C63874j03578H1196N5545L7461a23528B42236r7293K6689a76201l0110M6771
12575a59540C99359F6419b60864H5811K35937R353a07436L7941A51324d9867F2369
12563B3479J21607B9942a15683j88947A18585e634A31481c15956B74976j1555
12553B63421b3692q8066A85576H1273e1060C376a1243E2740M7944a20152I5814
12541A00692J8924a33776F9076h9095A68056i9882C34724G6132c6925a516k80922
12530b82438A32707J38912A00506C0101K31212a39386P673A2165J48478g0106
$$ plain form
12610 219134 -13080 192077 31075 -95856 -81174 -129438 681282 -137378 29755 -70667 65897
12598 6830 -223946 -183540 65438 -76076 53490 117416 -62653 -209036 153575 126107 -184497
12586 363874 260296 81196 136741 174202 -123528 242236 144943 171632 -176201 -206311 -159540
12575 -159540 399359 66419 -260864 85811 321748 331101 -107436 -69495 151324 -49867 62369
12563 23479 145086 29942 -115683 -304630 118585 -5634 131481 -315956 274976 263421
12553 263421 -23692 -111758 185576 81273 -51060 3376 -11243 52740 100684 -120152 95814
12541 100692 119616 -133776 69076 -89095 168056 -99882 334724 76132 -36925 -1516 -282438
12530 -282438 132707 271619 100506 30101 261313 -139386 -131713 12165 160643 -70106
12519A36529Q7741H8217d602j06099D04108b12148C54124A58809J35797I4384
12508e964l677j721m7202r4090A07529a09317B67879k3681I4953a49068d6909
12496A05469J45921b0478r8454A43379a54310A14148m8820K93620f1746C533f2199
12484B06461G5276a35549A9477N21107j71809A0017N3457P7367J41827K81160
12474E63828k52003j02864b04584B19014H3244d6786j05077A39754a10587A43338
12463E632a25165c3563G0034a50362C03220H2074a57494A35374a27463j69821
12453b97284a34099a3983j54786j54167i0438A1014J05265J62832a9686C99M5939
12442D6338k2229b13895A12307b37110A97274e1859B24188b36670J00790C0117
$$ plain form
12519 136529 224270 88217 -4602 -110701 404108 -212148 354124 158809 294606 94384
12508 -5964 -9641 -11362 -58564 -152654 107529 -109317 267879 244198 94953 -149068 -46909
12496 105469 251390 -20478 -118932 143379 -154310 114148 65328 358948 -61746 3533 -62199
12484 206461 75276 -135549 19477 540584 368775 10017 63474 140841 282668 563828
12474 563828 311825 208961 -204584 219014 83244 -46786 -151863 139754 -110587 143338
12463 5632 -125165 -33563 70034 -150362 303220 82074 -157494 135374 -127463 -297284
12453 -297284 -134099 -13983 -168769 -322936 -90438 11014 116279 279111 -19686 399 46338
12442 46338 24109 -213895 112307 -237110 197274 -51859 224188 -236670 -135880 30117
12431a36984I3855e7850b920D569g2328c3616o782C68985p0705a10841H9626h6073
12418D376M28852D6643L2797A685a95048L5076E7228Q18b0653D6667b19579A24580
12405b0589j82053B35608b37963B56561c87226a72677d9239B2072J00018C6660
12394B4311J51165b50301R6245B2262a55016P3286q8862K5288C0777g2522L1928
12383d0594k0895l4611M4816q8888p167H0499a76923C0416J34098C4103c6413
12371A21103c2282F0220a16555C4086b27800A64231h8582A00341B7036h3404A6813
12359A01991b7543H5808M07784g5529k40438E0255j8418A0439J11941a89614Q7160
12348a02454B34032E1064a08174A56771j6218J46457b28760J11352C33842B6679
$$ plain form
12431 -136984 93855 -57850 -2920 4569 -72328 -33616 -40398 368985 298280 -110841 89626 -86073
12418 4376 433228 46643 79440 1685 -195048 -159972 57228 58046 -20653 46667 -219579 124580
12405 -20589 -202642 235608 -237963 256561 -387226 -172677 -49239 22072 122090 36660
12394 24311 175476 -250301 -154056 22262 -155016 -81730 -170592 -145304 30777 -72522 -40594
12383 -40594 -61489 -96100 -51284 -140172 -147339 80499 -176923 30416 164514 34103 -36413
12371 121103 -32282 60220 -116555 34086 -227800 164231 -88582 100341 27036 -83404 16813
12359 101991 -27543 85808 493592 -75529 -315967 50255 31837 10439 122380 -189614 -102454
12348 -102454 234032 51064 -108174 156771 140553 287010 -228760 -117408 333842 26679
12337A79799n6319J10013o630c36549p0460a72210b1185A17760K20498A30186
12326A17626a37828C28818j34589g2280A02414a71141A71506e6065F7277a66306
12315B39197K8872b8925B84343A3703c17098g2464A4076h2141A64786D2038a61046
12303a64489A45044F4892b44967C21443f8696B34931O2777a74678h4090D5177
12292A28559a21956A60756k2064e0648A39058b84808B15889j07943b267A94640
12281e1268a0941A74273a28259j01800L3041B99178a79776D5539f6417B7098J27983
12270A55081J9069c8902A52121a19811H1636f0378j75580B26660N8739I122g438
12258a78283P9865B20645b17063A81801h7493A07849a28575A50629o8742l1731
$$ plain form
12337 179799 123480 233493 226863 -336549 -407009 -172210 -21185 117760 338258 130186
12326 117626 -137828 328818 194229 -72280 102414 -171141 171506 -56065 67277 -166306
12315 239197 268069 -28925 284343 13703 -317098 -72464 14076 -82141 164786 42038 -161046
12303 -164489 145044 64892 -244967 321443 -68696 234931 297708 -174678 -84090 45177
12292 128559 -121956 160756 138692 -50648 139058 -284808 215889 107946 -2267 194640
12281 -51268 -10941 174273 -128259 -230059 -197018 299178 -179776 45539 -66417 27098 155081
12270 155081 174150 -38902 152121 -119811 81636 -60378 -235958 226660 285399 9122 -7438
12258 -178283 -98418 220645 -217063 181801 -87493 107849 -128575 150629 81887 50156
12248E0156J67736a66979n4720I9113L42214a8870B5663f0689m1343A44544a35377
12236B48517a85666j292A66212M9764a9647j06368A70757c4888n2856B10504O4094
12225B74598e998j15047d4357E1325j2165d3085H8663J87009A3953h3613K8691
12214e4922C30224j28196O4123b08101d3565p8913l4487F4303B3910L56650j01293
12203B79267K4798c1247C92399G7631f5800A43728R4230E9181N9841K36312a51726
12191D01320A42855g840B35551h8399C22874O8698i6513A05170a71794D5770J0373
12180E6143K18448j03483a20325A9102P9981J46458d9774B84760a26084B41425
12169e3157G6027B600Q6578A9722J7234K16418A1991L2316a07235B49255q6220
$$ plain form
12248 50156 217892 -166979 -221699 99113 441327 -18870 25663 -60689 -102032 144544 -135377
12236 248517 -185666 -186958 166212 215976 -19647 -126015 170757 -34888 -87744 210504 274598
12225 274598 -5998 -121045 -44357 51325 39160 -43085 88663 275672 13953 -83613 -54922
12214 -54922 330224 202028 266151 -208101 -43565 -122478 -156965 64303 23910 380560 279267
12203 279267 304065 -31247 392399 77631 -65800 143728 237958 59181 119022 355334 -151726
12191 401320 142855 -7840 235551 -88399 322874 391572 -96513 105170 -171794 45770 56143
12180 56143 274591 171108 -120325 19102 99083 245541 -49774 284760 -126084 241425
12169 -53157 76027 2600 89178 19722 36956 253374 11991 44307 -107235 249255 163035
12158A63035a81101g0419m5829M0112I1891N4478Q5608A09300B6543a27258B17176
12146H7842n483a77025h0441c2699j52354c7860k9487j19076O4372L3514A59697
12134H2360L76095C9507L39159j67289j9744G4724i8498k8857B14360J48794C7019
12122B34065b626m5726E8169f6739j17869L2996F443K18340K36110j32984H6085
12110a25388A34922g0378q327A51434b2410k476C9276j9133J54804j9204j0556
12099A45187a80959C27623c0206B60307A21187J56645F0514c9725A30556P4055
12089B04611R559q6176B5006a07828A97504n2001C5582J33711a48853D2674b4599
12077B8539d09105N6217a30776D20062b19365a6357C6202a53234A47840a410D2973
$$ plain form
12158 163035 -181101 -70419 -116248 -76136 91891 146369 231977 109300 26543 -127258 217176
12146 87842 82359 -177025 -80441 -32699 -185053 -37860 -67347 -186423 -122051 -88537 159697
12134 82360 458455 39507 378666 211377 191633 74724 -98498 -127355 214360 363154 37019
12122 234065 -2626 -48352 58169 -66739 -184608 -151612 6443 224783 460893 327909 86085
12110 -125388 134922 -70378 -78705 151434 -22410 -24886 39276 20143 174947 155743 145187
12099 145187 -180959 327623 -30206 260307 121187 277832 60514 -39725 130556 204611
12089 204611 214170 127994 25006 -107828 197504 145503 35582 169293 -148853 42674 -24599
12077 28539 -409105 -352888 -130776 420062 -219365 -16357 36202 -153234 147840 -1410 42973
12065B20046B5064a89077k54228H8506b48507h7579A56999e9938B88944P75745
12055A064689D18525F6849b11769A12983B1729J55782a87290g825j9669j05661
12045a33155N8857a759j45534C7324R8214d6092A04217J08867b59567A52186b63029
12033B70204c09031a30912j29744D37582A20976D4397e9101j63489b6263E7725
12022B3297J2475a96831A11725N279a07542B48051c1695j39595N8843b1628j14380
12011a36008k3859B005a57107q7527O7597c3585f906G9659O4074b24309N2149
12000a72160A5142P6750d599n6945A49483g675j13267e2995A26264j212a82251
11988b42342G2581c5471B34677b66890A78544J32720r4386a18526A2288b19749
$$ plain form
12065 220046 25064 -189077 -443305 88506 -248507 -87579 156999 -59938 288944 1064689
12055 1064689 418525 66849 -211769 112983 21729 177511 -187290 -7825 -27494 -133155
12045 -133155 -74298 -1759 -147293 37324 135538 -46092 104217 213084 -259567 152186 -263029
12033 270204 -309031 -130912 -260656 437582 120976 44397 -59101 -222590 -26263 57725
12022 23297 35772 -196831 111725 117004 -107542 248051 -31695 -171290 -112447 -21628 -136008
12011 -136008 -159867 2005 -157107 -244634 -177037 -33585 -6906 79659 143733 -224309 -172160
12000 -172160 15142 91892 -4599 -61544 149483 -7675 -120942 -52995 126264 125052 -182251
11988 -242342 72581 -35471 234677 -266890 178544 311264 216878 -118526 12288 -219749
11977c11672H0918g0486E90a3489A70859a34129B8987e5758j40552D1481i2479
11965e0829J5509p4968j2416A07367d4000m7098j55161A91251I4944b2853I3052
11953d67025H2301b0714A13701j6150J07435b7871O720j6928F1396g1598c4505
11941a44061f8826L2600j48089b3087j13767j21984H5016B8282f6848c2505B54155
11929A01106d2994C494i7048l08109E6645c31314A83879o2177h6675j9278A7129
11917A38545a84618j2258Q0124I8368a11300d9267B89403C4557b15121f1813A48091
11905H5074j0266b51554L9162I2851a37452M5698H0787a52221L9194p4799o2437
11894b50263a07309j29195G7824d4228A55244f8954j63494E2483J24921d062B47332
$$ plain form
11977 -311672 80918 -70486 590 -13489 170859 -134129 28987 -55758 -196310 41481 -92479
11965 -50829 -35320 -110288 -122704 107367 -44000 -91098 -246259 191251 94944 -22853 93052
11953 -467025 82301 -20714 113701 97551 204986 -27871 -21151 -38079 61396 -71598 -34505
11941 -144061 -68826 -36226 -184315 -23087 -136854 -258838 85016 28282 -66848 -32505 254155
11929 101106 -42994 3494 -97048 -405157 56645 -331314 183879 121702 -86675 -105953 17129
11917 138545 -184618 -196876 -116752 98368 -111300 -49267 289403 34557 -215121 -61813 148091
11905 85074 74808 -251554 -212392 92851 -137452 -91754 80787 -152221 -113027 -187826 -250263
11894 -250263 -107309 -236504 77824 -44228 155244 -68954 -232448 52483 177404 -4062 247332
11882a42300I552M2604a36668k36113A06926j2824a79599e9871J2138h622j12936
11871a21558L1771B8416N3253P7264f6606B4477E558J08682i8295r7938j2956
11860b09189a6200A81346a38792d9113a8252j13106B77222g0305A80159K05984
11850C86143c5829C92960a26232B3788K06619C5324J81080a73226O9934A46873
11839c82519a81089C06547f4089I9132P513L8946d8269a6541p6694D00879a42805
11827e3131j8326q9856j63Q698A68092L10279E2201a59739d2683k587l800j25476
11815a74546b567H1340a2719k29508O1860j38456a30720F8456J435J97482j15562
11804A51811C0731J7730J37375a68259f1861J3242m0472h041n1938o0078r9d1189
$$ plain form
11882 -142300 9552 52156 -136668 -372781 106926 94102 -179599 -59871 -47733 -8622 -121558
11871 -121558 -89787 28416 81669 158933 -66606 24477 5558 114240 -98295 -196233 -209189
11860 -209189 -16200 181346 -138792 -49113 -18252 -131358 277222 -70305 180159 386143
11850 386143 -35829 392960 -126232 23788 230407 35324 216404 -173226 -103292 146873
11839 -382519 -181089 306547 -64089 99132 106645 145591 -48269 -16541 -93235 400879 -142805
11827 -53131 -71457 -161313 -161476 -152778 168092 478371 52201 -159739 -42683 -45270 -49070 -174546
11815 -174546 -2567 81340 -12719 -242227 -180367 -318823 -130720 68456 69891 267373 151811
11804 151811 30731 48461 185836 -168259 -61861 -48619 -89091 -8041 -59979 -120057 -120156 -41189
11791B2195a9868B07941e0755o0714l02114J74196R744h7669B03496r8458b96879
11779G8832a97611M138J0973b2771k76447a19103e1337a0050B430a52409l56741
11768e09150B7432P092b01558H1260a24623A19817K036b99686C8437P9316b21604
11756C5403b18173k31437B25108c60281A63706a20672r2721l499o7924D3240a82950
11744A74539a43123A77865f1539m0117E8240a19851j70332a42914e3290B3015
11733B24098D7003M1969d61j4934k30521O4614M9091I0796g7050k99368D5105
11721b1345p0026J0596i987j06144L2904A95327J53483g6252D11858a56382e1218
11709b9323o2119I1434a53984o252B55883a44547C38908b98426B26360A8293c8272
$$ plain form
11791 22195 -19868 207941 -50755 -111469 -413583 -239387 -229643 -87669 203496 105038 -296879
11779 78832 -197611 -193473 -182500 -22771 -299218 -119103 -51337 -10050 2430 -152409 -509150
11768 -509150 27432 34524 -201558 81260 -124623 119817 121853 -299686 38437 117753 -221604
11756 35403 -218173 -449610 225108 -360281 163706 -120672 -213393 -216892 -284816 43240 -182950
11744 174539 -143123 177865 -61539 -101656 58240 -119851 -290183 -142914 -53290 23015
11733 224098 47003 88972 -461 -15395 -245916 -181302 -132211 90796 -77050 -376418 45105
11721 -21345 -91371 -80775 -9987 -116131 -83227 195327 348810 -76252 411858 -156382 -51218
11709 -29323 -91442 91434 -153984 -160236 255883 -144547 338908 -298426 226360 18293 -38272
11697b85995A96239o0364C2996a05819j6249e9258J9089I6690c53722h6909c0537
11685C7616k860j3963a55912n7571q8329J16243L1688B2640i5452k8382J7693
11674a06141j71531C21140N0359a18275A79156a23770A31348a64174g6525J5667
11664f0858A16121k5612K6083f8994A44931J76890j49920d1592A11525b73162
11653a25960e260C14144a45902C0521P6881a82453M6258L5624D4216N191R167
11642E8574K56359a12277H109J6522c74273A24832f2721B62478I1958K5182d3132
11630d36771A21521a93033I7118h1516D78396A68873C3315L28129H909b02596
11619A912b1605o858B10166o4272D8819c6250q1423c8643k56175c8957a5515k19742
$$ plain form
11697 -285995 196239 135875 32996 -105819 -122068 -59258 -40169 96690 -353722 -86909 -30537
11685 37616 34756 20793 -155912 -213483 -301812 -185569 -153881 22640 -95452 -123834 -106141
11674 -106141 -277672 321140 371499 -118275 179156 -123770 131348 -164174 -76525 -60858
11664 -60858 116121 90509 116592 -68994 144931 321821 171901 -41592 111525 -273162
11653 -125960 -5260 314144 -145902 30521 107402 -182453 -136195 -100571 44216 49407 58574
11642 58574 314933 -112277 8109 24631 -374273 124832 -62721 262478 91958 117140 -43132
11630 -436771 121521 -193033 97118 -81516 478396 168873 33315 361444 8909 -202596
11619 1912 -21605 -28463 210166 145894 48819 -36250 -117673 -38643 -294818 -38957 -15515 -235257
11607b35257c9748B14762o6200a1084H423a49489c5334c439A61810d8420A93843
11595B2810K10108a25160D5845a7045A58539Q053A1791c8013j52765d9971B6683
11583C6675D420J24160e4466B89412d2892j63057H4649J65932b29284i568A80384
11571b01875A72803H2911e5524o396C50957a48446l0370f932k84105a35682e3672
11559a14013A21327i9678B07748q9482A4960J95363q5484d2636m05082e5261a6276
11547B28539h0208A88438A2698a54409C13709e4897A09932B8255a09291j91376
11537c00667I5384J59215b81560a04359O599C45377c14582J43114j04736A2041
11526C36268h5455j08234j02774a20694L4157k0587M9661j57910R6082H1159K04228
$$ plain form
11607 -235257 -39748 214762 148562 -11084 8423 -149489 -35334 -3439 161810 -48420 193843
11595 22810 232918 -125160 45845 -17045 158539 166592 11791 -38013 -190778 -49971 26683
11583 36675 4420 128580 -54466 289412 -42892 -205949 84649 250581 -229284 -9568 180384
11571 -201875 172803 82911 -55524 -61920 350957 -148446 -178816 -6932 -291037 -135682 -53672
11559 -114013 121327 -99678 207748 118266 14960 210323 124839 -42636 -447718 -55261 -16276
11547 228539 -80208 188438 12698 -154409 313709 -54897 109932 28255 -109291 -300667
11537 -300667 95384 254599 -281560 -104359 -97760 345377 -314582 -171468 -276204 12041
11526 336268 -85455 -193689 -296463 -120694 -86537 -107124 -57463 -215373 -119291 81159 285387
11515B85387E1656J83394f5517C90946L1277A56253N6286D4583f7433B9675a362
11503A31858a22790A11659L50572B25408p4937b41075B87509A14132L2386J11758
11493B58276C1210P0398L1706E8746P6901e1341G2864K60973e9715b2297F8549
11481C34554m5328K82511D2051Q3187K17140a53112A40129a32949A51198o5015
11471H6183P4332h9187A9931f579A09118a40836j08626F9944J73013r4023J05962
11460B54896j12191J08671e9247A86672c32568G9430K68436i2687A26832J99388
11450C26220o6388M5607j11046a87154C76114f4046A44896C6250J16963F2454
11439D54933E1212f9262A31119J76090d12030B54558c81191C6131d473r0686a9784
$$ plain form
11515 285387 51656 235050 -65517 390946 422223 156253 212539 44583 -67433 29675 -1362
11503 131858 -122790 111659 462231 225408 150471 -241075 287509 114132 146518 258276
11493 258276 31210 101608 133314 58746 135647 -51341 72864 333837 -59715 -22297 68549
11481 334554 289226 571737 42051 125238 342378 -153112 140129 -132949 151198 86183
11471 86183 160515 -89187 19931 -6579 109118 -140836 -249462 69944 242957 148934 254896
11460 254896 142705 251376 -59247 186672 -332568 79430 347866 -92687 126832 326220
11450 326220 259832 305439 194393 -187154 376114 -64046 144896 36250 153213 62454
11439 454933 51212 -69262 131119 307209 -412030 254558 -381191 36131 -4473 -95159 -19784
11427f7985q6806e5576j43290F8420R5903a16693C09626a99452b5891B48519k7496
11416B21023e34593I0816a0805C57064c55959A63505b13898E4921J3630d781o8998
11405g3779j20484F8983J18969b39868J3955f373I9502j7661M0606a17000C34031
11393a51216f1062C35717I355e6987A34494c81625f6928H0125i5639o02j6089
11382a12330E1286J73431b00197A81756G8870N2474d1072p6387M4914L5890n5871
11371i2526A01303c37938a56419K5467m3521E3696a35061B82378b39156a15233
11360g5662B48330I3162b8563I8282g2176j0342H1573A9302H691a37908C13896
11348b23577A03115g9694F8312O5061K021J303e3189B11513K223a57750E0573
$$ plain form
11427 -67985 -154791 -55576 -198866 68420 164323 -116693 309626 -199452 -25891 248519 221023
11416 221023 -534593 90816 -10805 357064 -355959 163505 -213898 54921 68551 -4781 -73779
11405 -73779 -194263 68983 187952 -239868 -225913 -6373 99502 81841 122447 -117000 334031
11393 -151216 -61062 335717 9355 -56987 134494 -381625 -66928 80125 -95639 -96241 -112330
11382 -112330 51286 224717 -200197 181756 78870 131344 -41072 -117459 -72545 -36655 -92526
11371 -92526 101303 -337938 -156419 -130952 -174473 53696 -135061 282378 -239156 -115233
11360 -75662 248330 93162 -28563 98282 -72176 -82518 81573 19302 8691 -137908 313896
11348 -223577 103115 -79694 68312 133373 135394 136697 -53189 211513 213736 -157750 50573
11336A0625b02798O3552I4758i2849k07928J9062B01267e7425E1582J99212b266
11324B5099a25232B42960I812N5437B0765a7603L074A89163a4036C4961d52899
11312a27907k49479K5995A22419c567j11919L3030l5546f652j27629j13500E2041
11300A27062m4654K9794L20721A24073L2376M9014b65280a00388Q19A99379a18330
11288a82868l39636a26218B09190i0501l0036D85631a68472Q0746A3971a82757
11277g420A28921L11955c60908A7775a1727k76630a2220c903A1100a5135k7010
11266d2145m23967E2504J82874F684K13289a02104A568J24131c06051B41568r6585
11255A44983f5575k46138A07643P2252a33322A18783b28001d1713q4672C05425
$$ plain form
11336 10625 -202798 -139246 94758 -92849 -300777 -281715 201267 -57425 51582 250794 -2266
11324 25099 -125232 242960 9812 65249 20765 -17603 -14529 189163 -14036 34961 -452899
11312 -127907 -377386 -351391 122419 -3567 -115486 -82456 -118002 -6652 -134281 -247781 52041
11300 127062 82408 112202 432923 124073 156449 205463 -265280 -100388 -99569 199379 -118330
11288 -182868 -522504 -126218 209190 -90501 -120537 485631 -168472 -87726 13971 -182757
11277 -7420 128921 440876 -360908 17775 -11727 -288357 -12220 -3903 11100 -15135 -42145
11266 -42145 -466112 52504 235378 6684 219973 -102104 1568 125699 -306051 241568 144983
11255 144983 -65575 -311713 107643 179895 -133322 118783 -228001 -41713 -126385 305425
11244b7225l2076j67929j68623a11411j66063a29231j16426a6108l60649G7123
11233a64335l1026b7630k80603B23846h1987B09531g8341A29480K8780m6586A1651
11221a61112q0970a06857A5091b08270Q5308C7299J78141A06064p490a70686f9472
11209c31692R4074m2895C62407a61797G3029A9392b91302l1318G3426j9885K3097
11198G6638H108a32083M5414r5554j00580R1097R2849A56747a26666K0178B6484
11186F7773e9483A44384a31140j27844c8693j50551A64626J05276a25507A5495
11175c14063a02014A39618a33383D30619A94257k0022a53428B9296d7854A36643
11164h3797q1171B25109j09830b48439a00066b6476j31344A2695a91732R3551
$$ plain form
11244 -27225 -59301 -227230 -395853 -111411 -277474 -129231 -245657 -16108 -376757 77123
11233 -164335 -195361 -27630 -308233 223846 -81987 209531 -78341 129480 158260 111674 11651
11221 -161112 -242082 -106857 15091 -208270 -122962 37299 215440 106064 98574 -170686 -69472
11209 -331692 -237618 -280513 362407 -161797 73029 19392 -291302 -322620 73426 53541 76638
11198 76638 8108 -132083 -86669 -182223 -282803 -191706 -98857 156747 -126666 -106488 26484
11186 67773 -59483 144384 -131140 -258984 -38693 -189244 164626 269902 -125507 15495
11175 -314063 -102014 139618 -133383 430619 194257 174235 -153428 29296 -47854 136643
11164 -83797 -164968 225109 115279 -248439 -100066 -26476 -157820 12695 -191732 -98181
11154i8181A50959a84416i619j72703A14149d4257o0626b2233E777b04799R7751
11143a07048a5058o1068L7449j62144q669J01001o509B28525r6958c11786B04053
11131B33852Q2273A13085g7287F4642J26119e1116A3213J02912l0503L16109H543
11119a46445E50389c7384A28671n5135N6796J39877E3362a29358I9408N9634j9658
11108A39384g3449c0457a2517A96257g4888H4905a10352M0399C87351o7990H6131
11096A22428e5437A28412A4466i7859j06614Q3083B39569I3035b17686B98290
11085c5409A48227L9182K01320a94354B63390j12303J1078J17742a22518H2152
11074C37296E0084K00058J60376a2097j09384C50481n5080b72393C37792A35745
$$ plain form
11154 -98181 150959 -184416 -9619 -182322 114149 -44257 -104883 -22233 5777 -204799 -107048
11143 -107048 -15058 -76126 -38677 -200821 -209490 -108489 -114998 228525 131567 -311786 204053
11131 233852 316125 113085 -77287 64642 190761 -51116 13213 116125 85622 401731 8543
11119 -146445 550389 -37384 128671 73536 130332 270209 53362 -129358 99408 159042 139384
11108 139384 -73449 -30457 -12517 196257 -74888 84905 -110352 -69953 387351 319361 86131
11096 122428 -55437 128412 14466 -97859 -204473 -121390 239569 93035 -217686 298290
11085 -35409 148227 187409 388729 -194354 263390 151087 162165 279907 -122518 82152
11074 337296 50084 250142 410518 -12097 -121481 350481 295401 -272393 337792 135745
11063D39290j29579D9177J12990J51436J16342h5605E51112B66471j00264K33835
11053D00042J01597b0191B14907J23401A54687Q8034J66631P8858j44925L57826
11043G01111j39590A01580P98393k88033j38231j9475K38378K193k29936K04795
11033F69664n9122R7847J55693J4207k9427j13262K00547K720J7741R8890m71554
11022E83944q123J67713j50529j6958j24836K78497J00736l86362J94444J04871
11012G43397Q614j29079R9443k30983J29874J91970n3076j95815K37232l37089
11002D64488j5641J48425K66481j97814q3044J6587K06413p9906O6053C65430
10991H27292j13859p3683n6029O3585n9232J29315J79301j20121k19474K3163
$$ plain form
11063 439290 309711 49177 162167 313603 429945 -85605 551112 266471 166207 400042
11053 400042 501639 -20191 214907 338308 154687 242721 409352 488210 343285 701111
11043 701111 561521 101580 899973 611940 473709 454234 692612 694805 464869 669664
11033 669664 610542 708389 864082 878289 848862 735600 936147 938867 956608 1055498 583944
11022 583944 575821 743534 593005 576047 451211 729708 830444 444082 638526 743397
11012 743397 752011 622932 722375 491392 621266 813236 760160 564345 801577 464488
11002 464488 448847 597272 863753 665939 582895 599482 805895 725989 792042 365430
10991 827292 713433 639750 583721 647306 588074 717389 896690 776569 557095 580258
10981E80258Q2060P7810l39552N81044j67383k31576J69802j57853K51427j26005
10971G20032J80301j32528K0206K36470p8503M9672N5644J8367M21024L69733
10961A860418J6693K90907M2791L79066K21106r3961K88754O3319k89195k32497
10951B547401l30274l67866O6059j90208l68922r1762K27136n64959K15776L82027
10941A524408l79258J45881n55650J86858O2982C36404J81754B10240J75414i8863
10930C01875l265J30319C6433R0401J54133n0521a29753a5354I3454f1730E8410
10918D2842h8175K4547l2613B3967J86978c9884B51227K25874B26153a04713A68773
10906A39862e0026a0688C62642b76911i0726A64490b70423B03788J50669d72190
$$ plain form
10981 580258 662318 740128 400576 981620 814237 582661 752463 594610 846037 720032
10971 720032 900333 767805 788011 1024481 945978 995650 1051294 1069661 1490685 1860418
10961 1860418 1877111 2168018 2210809 2589875 2810981 2717020 3005774 3069093 2779898 2547401
10951 2547401 2217127 1849261 1915320 1725112 1356190 1264428 1491564 926605 1142381 1524408
10941 1524408 1145150 1291031 735381 922239 985221 336404 518158 210240 385654 -98863
10930 301875 298610 428929 36433 126834 280967 230446 -129753 -15354 93454 -61730 58410
10918 42842 -88175 -63628 -96241 23967 210945 -39884 251227 477101 226153 -104713 168773
10906 139862 -50026 -10688 362642 -276911 -90726 164490 -270423 203788 354457 -472190
10895A50921p3417b24925A88213H0954a09476B4124J42066p1660e377I405a70006
10883B88754a98686A58646c06349c5724m3193q1870e924A08603E3551b72254i046
10871A34537K3467J8311a33439B55265A15825C9016f0505q3557A09660L04050
10861D13710b70089d7996A90908C8679Q4403l7712c2561R99E1007g5682c1502
10849h2606E9429a54361f9554L3551j68892A181a25273I2914a92976A27742a8656
10837a46164E6386b00186j566M2439A87173l0215b18450A06314e1365j17656R362
10826a59659C1096K25285G5028N07485a64961C75a97255H6059l3942b76065D0701
10814a38222d2388m08252a11416C22974d9516k49126b0638A61993G851a37661
$$ plain form
10895 150921 77504 -224925 188213 80954 -109476 24124 166190 94530 -5377 9405 -170006
10883 288754 -198686 158646 -306349 -35724 -78917 -160787 -5924 108603 53551 -272254 -9046
10871 134537 158004 176315 -133439 255265 115825 39016 -60505 -144062 109660 413710
10861 413710 -270089 -47996 190908 38679 123082 85370 -32561 -31562 51007 -75682 -31502
10849 -82606 59429 -154361 -69554 -36003 -204895 1181 -125273 92914 -192976 127742 -18656
10837 -146164 56386 -200186 -201752 -159313 187173 156958 -218450 106314 -51365 -169021 -159659
10826 -159659 31096 256381 75028 582513 -164961 375 -197255 86059 52117 -276065 40701
10814 -138222 -42388 -450640 -111416 322974 -49516 -298642 -20638 161993 7851 -137661
10803a80950D98620b05881d1459k58943c6877j37559j27909J22348A13716a84521
10792a14192A3824b18056J2618J6735B95328c7491k73581H4206b187C08828A3652
10780D5428d37029B77227E8560N8978C375a15507A27512K15306b73597B95143
10769a85813A84383c13079B99048j25883A0339Q5129d9900m1645A90730J86297
10759C77027h221A67038n2691a53255f4054a4306f089l1822C0679a20783G4078
10747e9127k14427h1343k38077I6485b62400a04406j75800A09328k3914J23957
10737B09371c35652A25513O5652M8818B6414N7819K2590P8837o9660m2615c77055
10725c09018F757b82396J23342j09160B22864i3868d6484k27898f1319p552B72592
$$ plain form
10803 -180950 498620 -205881 -41459 -300402 -36877 -174436 -302345 -179997 113716 -184521
10792 -114192 13824 -218056 -205438 -188703 295328 -37491 -311072 84206 -2187 308828 13652
10780 45428 -437029 277227 58560 117538 3375 -115507 127512 342818 -273597 295143
10769 -185813 184383 -313079 299048 173165 10339 95468 -49900 -91545 190730 377027
10759 377027 -8221 167038 114347 -153255 -64054 -14306 -6089 -37911 30679 -120783 74078
10747 -59127 -273554 -81343 -319420 96485 -262400 -104406 -280206 109328 85414 209371
10737 209371 -335652 125513 191165 239983 26414 84233 106823 185660 116000 73385 -377055
10725 -309018 6757 -282396 -159054 -268214 222864 -93868 -46484 -274382 -61319 -68871 272592
10713B7688M0443l0980a02718M3474k61007f8090q9901H37a71145n2483B04979
10701a16389k65594a63218A12523a84646d3228q2696m7741a1453q2879L1337J1897
10690e1098B10602a5855l02703B29962h0347D9415b03318M7399k64086i1581B32807
10678b46700l9361c7259k69132g7019p1142B0662e9236C9656a67736K0777A22205
10666A08357f7113q8951d0609l3166j09233A02704a08388k83331c5472o8833M4004
10655f0301k0318m2417n003o0369i025k2372A05610a35317A85867a81614M1558
10644a40056e6034k2495G4567O1350e3504k15132J30622A6409d6811E9166l339
10633E5827O4154E182a0386j66073m3986o1788f4734l06523c0519B17451b89452
$$ plain form
10713 27688 68131 37151 -102718 -59244 -320251 -68090 -157991 837 -171145 -223628 204979
10701 -116389 -381983 -163218 112523 -184646 -43228 -125924 -173665 -11453 -94332 -62995 -51098
10690 -51098 210602 -15855 -318558 229962 -80347 49415 -203318 -155919 -420005 -91581 232807
10678 -246700 -286061 -37259 -306391 -77019 -148161 20662 -59236 39656 -167736 -146959 122205
10666 108357 -67113 -156064 -40609 -73775 -183008 102704 -108388 -391719 -35472 -104305 -60301
10655 -60301 -80619 -123036 -128039 -188408 -9025 -31397 105610 -135317 185867 -181614 -140056
10644 -140056 -56034 -78529 74567 135917 -53504 -268636 -138014 16409 -46811 59166 55827
10633 55827 119981 5182 -10386 -176459 -220445 -282233 -64734 -371257 -30519 217451 -289452
10621a05436j26845A27645c04932f5346A05091J25837a98684B73113a41098b7854
10610e4012j02103c6057A01658J08668a94105Q5621k01492H4498d89259H265a74716
10598I9198a71581K7905I6959e0933n13602A20349a03309G8480b31569D4748J10526
10587A55274A9849K06313i2996r2931R0571A06060O091J12681E7421c7164m206
10576d1370o496I5179i0847K2513C28632A09655M9707b24885Q2279J5923C270
10564a93500B12142A5085R8010D5781N2860B8132c12433j8081i0541d3950B55277
10552a98210A52075a49680F1162h1485k86351a24465M540p8957R2250F389R4548
10541A00937J67832G4K4473a59598k83651g9070E4466e5981D2190p21a53240O0891
$$ plain form
10621 -105436 -232281 127645 -304932 -65346 105091 230928 -198684 273113 -141098 -27854
10610 -54012 -156115 -36057 101658 210326 -194105 -108484 -309976 84498 -489259 8265 -174716
10598 99198 -171581 -143676 96959 -50933 -564535 120349 -103309 78480 -231569 44748 155274
10587 155274 19849 226162 -92996 -185927 -95356 106060 112151 224832 57421 -37164 -41370
10576 -41370 -47866 95179 -90847 -68334 328632 109655 159362 -224885 -142606 -126683 3270
10564 -193500 212142 15085 113095 45781 98641 28132 -312433 -330514 -90541 -43950 255277
10552 -198210 152075 -149680 61162 -81485 -367836 -124465 -119925 -198882 -106632 6389 100937
10541 100937 268769 74 24547 -159598 -443249 -79070 54466 -55981 42190 41469 -153240 -92349
10529i2349A4503a4711B8112d2495H8486e8845A28820e55442D1618a11657l3950
10518a45607H0676K49551a66494B35721a59243k1837h8864l10770b0337k87708
10508c08045Q2919j36992J39212q7512a44747k9462k61717G5262O125g2758m08738
10497d81496a32257k61916A0821a6894B2287b68100F6732R2059j5442b7667k00737
10486b28404f0465A40721a11924L0723A34469K36490E9484M0773h272j77468N3538
10475a32202L0256c9995B99016b529l7871j29113c4296K24r2519J9293B34706
10463B79986c43425B41584j15701d3898A72843K14017A29260j0216e12603b50277
10452h095B31647I5206a64518A64814d53187A29770k2157C0490K7493a41689K7690
$$ plain form
10529 -92349 14503 -14711 28112 -42495 88486 -58845 128820 -555442 41618 -111657 -145607
10518 -145607 80676 330227 -166494 235721 -159243 -181080 -88864 -399634 -20337 -308045
10508 -308045 -225126 -362118 -222906 -310418 -144747 -174209 -435926 75262 81387 -72758 -481496
10497 -481496 -132257 -394173 10821 -16894 22287 -268100 66732 158791 143349 -27667 -228404
10486 -228404 -60465 140721 -111924 -81201 134469 370959 59484 100257 -8272 -185740 -132202
10475 -132202 -101946 -39995 299016 -2529 -40400 -169513 -34296 -34072 -126591 -107298 234706
10463 279986 -343425 241584 125883 -43898 172843 386860 129260 119044 -512603 -250277
10452 -8095 231647 95206 -164518 164814 -453187 129770 107613 30490 57983 -141689 -113999
10441a13999q5306C78750C4881b79679A53923b19100b3834K974k06165N9212A01547
10429c20240R4358h9361a8502H1813d3600A6541K7739J06354b02817m7147d814
10417b16768B32124C241b4941l3821m3345o2705l3112i7988k8045l5022A60939
10405B2956a35405k46623B5160a98829A51413m0332a28145M8148A43976j4690
10395A29286J2008J4991J77367A38238j8741f7718k13790A15411N0332b30286
10384B18741J2974e9534A44666A4136b33137F2725b30921I0711n426J19461l9378
10373A65368Q0657M2667G3931j6264k536K27854C2685L22407e1828E8012K99983
10362C57995j54090L0092K94936d8411B20453J0064P6551j13743D0329K97788
$$ plain form
10441 -113999 -199305 378750 34881 -279679 153923 -219100 -23834 -20860 -227025 -167813 101547
10429 -320240 -225882 -89361 -18502 81813 -43600 16541 44280 150634 -202817 -249964 -4814
10417 -216768 232124 3241 -24941 -58762 -102107 -164812 -197924 -97988 -126033 -161055 160939
10405 22956 -135405 -382028 25160 -198829 151413 111081 -128145 -79997 143976 129286
10395 129286 141294 156285 333652 138238 119497 -67718 -281508 115411 165743 -230286
10384 218741 231715 -59534 144666 14136 -233137 62725 -230921 90711 85285 204746 165368
10373 165368 246025 288692 73931 57667 55131 282985 32685 355092 -51828 58012 357995
10362 357995 203905 233997 528933 -48411 220453 230517 307068 193325 40329 338117
10352C38117L572j67257L16314A28680L83951j77416p8767l9043k8847J8879a24292
10340A18642n3546K18736L69283m1356j93008A04756J66313R9087A38311E8291
10329B08755P5848m3267i1780C52381j493j390e57E6804M12730j71373b2609m6917
10317f9526i440A45515J16831B6383c28733a03056A50348p2078J84718L0256K9464
10306C22708K36227k26424a3771B69489D6131G411R0703L08970c029j44991C35445
10294E4343e3856j44303A11140m1788j5565K45110k1607a63720I6614k8428a23327
10282a67010L3819l8522k6379I9870a64382D7965b52907C3001m120j3263a31133
10270d8742k4661j14991F2325g9146A33632j1101k4254a52880O7990A2434a62458
$$ plain form
10352 338117 341689 174432 490746 128680 512631 335215 256448 217405 188558 207437 -124292
10340 118642 65096 283832 653115 611759 418751 104756 271069 370156 138311 58291
10329 208755 284603 241336 -91780 352381 350888 349498 -557 56804 469534 298161 -22609 -69526
10317 -69526 -9440 145515 262346 26383 -328733 -103056 150348 78270 262988 293244 322708
10306 322708 558935 332511 -13771 269489 46131 7411 98114 407084 -3029 -148020 335445
10294 54343 -53856 -198159 111140 69352 53787 298897 277290 -163720 96614 68186 -123327
10282 -167010 -133191 -171713 -198092 99870 -164382 47965 -252907 33001 28881 15618 -131133
10270 -48742 -73403 -188394 62325 -79146 133632 122531 98277 -152880 -84890 12434 -162458
10258A96182b4426j10661q9648D2022c5725O219k89473J26045O1075b9952F0757
10246c15982A96719K02665q7245A02443b0570A83511D3906a04757B70480a65796
10235H0960b7954q1247H9974k0081P0360a30443D4159L54751j76660c38792h6158
10223c03917r5266f8404F2157b09277g9078A00394i2590F7411J7518L00791b05245
10211A18006b00341N8725D6797d3962j64462M2418n0524p1286e2962j92579j25277
10200c70818f35m11897C00583H0544K09659e2595O821m5441m5224N4548j04650
10189a86541A3411e2567k7655C7836J29468a44006j00723F3367E406J916b9838
10177b68494F4988g0061A81382K07756b13154b6646q5735K7656k05177J20589
$$ plain form
10258 196182 -24426 -135087 -224735 42022 -35725 -29506 -318979 -192934 -131859 -29952 60757
10246 -315982 196719 399384 312139 102443 -20570 183511 43906 -104757 270480 -165796
10235 80960 -27954 -109201 89974 69893 140253 -130443 44159 398910 222250 -338792 -86158
10223 -303917 -399183 -68404 62157 -209277 -79078 100394 -92590 67411 84929 385720 -205245
10211 118006 -200341 -141616 46797 -43962 -208424 -166006 -216530 -287816 -52962 -245541 -370818
10200 -370818 -635 -412532 300583 80544 290203 -52595 -45774 -91215 -136439 -81891 -186541
10189 -186541 13411 -52567 -80222 37836 167304 -144006 -244729 63367 5406 7322 -29838
10177 -268494 64988 -70061 181382 389138 -213154 -26646 -112381 -84725 -289902 -169313
10167a69313H4505b66629r8261A71992c57076J42580D4252J2280J46292E0850
10156a497k20884a10870B16213R4035g955k02676E7622J01633c0877J1713C26836
10144A4275M0742b4136j11164A29249b74004f2740D0046e13786a99118d7281n9285
10133a06566A48160b728A50982i8509o905F7256a61298b0187G9352a14313G9693
10121b47044g5813j07942M3360E0570b39755A07217a66415M4518k21226A16465
10110b65090c0082k47624K8794B40998H9163b16093J07017k32130I0081a32628
10099F2444j4574h2701k43543i6011c1235k49220A69336a97979G0120h6209B08019
10087C0916K7751a75612L9452o6390A86972i2991j97799J34214a7537B10237h9424
$$ plain form
10167 -169313 84505 -266629 -364890 171992 -357076 -214496 44252 56532 202824 50850
10156 -1497 -222381 -110870 216213 310248 -7955 -210631 57622 159255 -30877 -19164 326836
10144 14275 55017 -24136 -135300 129249 -274004 -62740 40046 -513786 -199118 -47281 -106566
10133 -106566 148160 -2728 150982 -98509 -105414 67256 -161298 -20187 79352 -114313 79693
10121 -247044 -75813 -183755 -140395 50570 -239755 107217 -166415 -121897 -343123 116465
10110 -265090 -30082 -277706 -248912 240998 89163 -216093 -109076 -341206 90081 -132628
10099 62444 47870 -82701 -326244 -96011 -31235 -280455 169336 -197979 70120 -86209 208019
10087 30916 58667 -175612 -136160 -202550 186972 -92991 -290790 -156576 -17537 210237 -89424
10075b49711g4016B9930c22222g6951j53266E7982b47391a7096j06756A60820
10064c70248M4683a07161j03895E5864d4849q8427d0516A87417b52497r1327a30672
10052B30668f4827B4690K170b47306e2314J2588j94905B27789m426D74Q4334J14931
10040A99739B725a45063C59990A4566b2760l08473P0189e3113A29722f49274F3702
10028A56604B2488a31843A29197J27779A7957a03456c3226m79803B07318d09456
10017c76282a16739G7646d850A53701g9280a5268j42973l09005a48060g2372E636
10005g6606J7019F0922m330g4092n04050a12510C6626d79614a90837k0114A5382
9993A0427c13897A32524a96752M9095C93833c16451J18951h7001a324G1281J65050
$$ plain form
10075 -249711 -74016 29930 -322222 -76951 -230217 57982 -247391 -17096 -123852 160820
10064 -370248 -325565 -107161 -211056 55864 -44849 -133276 -40516 187417 -252497 -343824 -130672
10052 230668 -64827 24690 26860 -247306 -52314 -39726 -234631 227789 223363 474 84808 199739
10040 199739 2725 -145063 359990 14566 -22760 -331233 -261044 -53113 129722 -649274 63702
10028 156604 22488 -131843 129197 256976 17957 -103456 -33226 -513029 207318 -409456
10017 -376282 -116739 77646 -4850 153701 -79280 -15268 -158241 -467246 -148060 -72372 5636
10005 -76606 -59587 60922 56592 -74092 -578142 -112510 36626 -479614 -190837 -210951 15382
9993 10427 -313897 132524 -196752 -147657 393833 -316451 -197500 -87001 -1324 71281 236331
9982B36331a91453f1686j11781f7781l76672P2793e9295B49982d1989C5330J19608
9971A54938d07077b4202Q039j5206q2052a0161j47010E3866a37029C14312a62501
9959b07167A069L00613a27521b2956o0610r1085k79031a82152g1330L5398a1510
9947b17540A88603a38105I3464b91972a00893m598J0044B2315b06740e4184A51966
9935c06748E4043b07655A73739a85347A58577i1656J2775A27763i2030p9627D6690
9923A08316C4683k46J30862a5664A49313a94761c0829j71298d1410E437a6377
9911G8497a00090B04606I493a01310B55805a56186f8726A04623a03963K9951j3005
9900h7017p3525l5566n1152c3064A91966a7497k2633k15169J20715e7233j89752
$$ plain form
9982 236331 -191453 -61686 -173467 -67781 -444453 -371660 -59295 249982 -41989 35330 154938
9971 154938 -407077 -24202 -16163 -31369 -113421 -10161 -157171 53866 -137029 314312 -162501
9959 -207167 1069 301682 -127521 -22956 -83566 -174651 -453682 -182152 -71330 -35932 -11510
9947 -217540 188603 -138105 93464 -291972 -100893 -105491 -95447 22315 -206740 -54184 151966
9935 -306748 54043 -207655 173739 -185347 158577 -91656 -78881 127763 -92030 -171657 46690
9923 108316 34683 34437 165299 -15664 149313 -194761 -30829 -202127 -41410 5437 -16377
9911 78497 -100090 204606 9493 -101310 255805 -156186 -68726 104623 -103963 -74012 -87017
9900 -87017 -160542 -196108 -247260 -33064 191966 -17497 -40130 -255299 -134584 -57233 -246985
9889b46985I1494b40805R7945A33411O5832A8887a29627K124j35891L3123j01523
9878c31794g3111j10907E8977K6710f0358I176O4193j4557c04666H7344g2766
9866b92616a7534A08286a3069A44424f8411j01249k5441I9815b2311k88717g2500
9854a41813A551O4802B5946a19280l7692E3891b48838A48867b38116B37957R3664
9843C31621J5660g7122j28883j51192g6611j84627o913H5180b20601a9251k39139
9832b58390Q009J2852j5793d9947C4800a359q131l39604g0806n1669E9016K6254
9820H5270a88973n0656K9132I6664b0444G5710a40208A95206b76795H3894b25275
9808g6902j3358b1519n6339A30244K08228b12288M8893E192a09406A22987a62345
$$ plain form
9889 -246985 91494 -240805 -142860 133411 199243 18887 -129627 -127503 -263394 -230271 -331794
9878 -331794 -73111 -184018 58977 85687 -60358 9176 73369 58812 -304666 87344 -72766
9866 -292616 -17534 108286 -13069 144424 -68411 -169660 -195101 99815 -22311 -311028 -72500
9854 -141813 1551 66353 25946 -119280 -156972 53891 -248838 148867 -238116 237957 331621
9843 331621 347281 -77122 -206005 -357197 -76611 -261238 -268151 85180 -220601 -19251 -258390
9832 -258390 -250381 -237529 -253322 -49947 34800 -1359 -9490 -349094 -70806 -122475 59016 85270
9820 85270 -188973 -239629 -210497 96664 -20444 75710 -140208 195206 -276795 83894 -225275
9808 -76902 -90260 -21519 -77858 130244 338472 -212288 -163395 5192 -109406 122987 -162345
9796b70380A29649b70811a15578D6828R4938m9438k6363L0332a18812j10308C5515
9784a13660L8387A44011l0673b34275a04135G7081c1768b651k21194p9520c0277
9772f4722b7336A28772l2910e1019B21853a6943j59643C80295h974A54429h4270
9760d3027m9466k6437H5217a91882H8309f3397C5629b61981a20497A36596a56540
9748B14870N0241d3448A69785J39577C4663a81465m5375H9844D366b01534E72
9736B72476a81133D6215O2741k9947O7026M3562L52416c6666b016r9054C6582
9724i1745d5087D1146R9681b08024A38678a08232I2491a36344c0909q1555d6828
9712E2556Q9426m6131c33573A14436a79534C7430i7174g762A5120i2751J9593
$$ plain form
9796 -270380 129649 -270811 -115578 46828 141766 92328 65965 96297 -118812 -229120 35515
9784 -113660 -75273 144011 113338 -234275 -104135 77081 -31768 -2651 -223845 -303365 -30277
9772 -64722 -27336 128772 95862 -51019 221853 -16943 -176586 380295 -8974 154429 -84270
9760 -43027 -92493 -118930 85217 -191882 88309 -63397 35629 -261981 -120497 136596 -156540
9748 214870 265111 -43448 169785 309362 34663 -181465 -226840 89844 4366 -201534 572
9736 272476 -181133 46215 108956 79009 146035 189597 542013 -36666 -2016 -101070 36582
9724 -91745 -45087 41146 140827 -208024 138678 -108232 92491 -136344 -30909 -112464 -46828
9712 52556 141982 95851 -333573 114436 -179534 37430 -97174 -7762 15120 -92751 -73158
9701g3158A5622K05262G9484a16244o6783A71221B7121a5878m49064j00119f4583
9689e28757a20484J7188K8454l39335a37396a6958B55027j7823a15716A18296
9678H2572a2502C4134c88822H965a41879j87019a1106G3535b19527M7332e0205
9666I9135R8461q160d07714G5084l1923J5817R6134d9713p3684m0058f9481C4566
9653H2313c49632a68967k275n1555N5074b2436B496g3696n8046k68255h3406a3496
9640e7039k08570h9130K5422j42467E5644k6739c2863o0384n2320b2820l42997
9629c65817k6883a85773d7433G7391c19229O1266c8137B21498a21742e9369j40323
9618a99692A64529b4084m11282K10513b7430r6772K3396P438B50959d1877F4437
$$ plain form
9701 -73158 15622 220884 79484 -116244 -183027 171221 27121 -15878 -464942 -565061 -64583
9689 -528757 -120484 -103296 -74842 -414177 -137396 -16958 255027 237204 -115716 118296
9678 82572 -12502 34134 -388822 8965 -141879 -328898 -11106 73535 -219527 -172195 -50205
9666 99135 197596 189436 -407714 75084 43161 58978 155112 -49713 -123397 -163455 -69481 34566
9653 82313 -349632 -168967 -171242 -222797 -167723 -22436 2496 -73696 -131742 -399997 -83406 -13496
9640 -57039 -265609 -89130 -63708 -206175 55644 28905 -32863 -93247 -145567 -22820 -365817
9629 -365817 -392700 -185773 -47433 77391 -319229 -257963 -38137 221498 -121742 -59369 -199692
9618 -199692 164529 -24084 -435366 -224853 -27430 -124202 -100806 -93368 250959 -41877 64437
9606a05439j36035A28903b37667a12141A58754f6664o7293D1635a51420j58615
9596c10035A95368a33087P900A48766A5339m137J32943b44332Q0463K254k60884
9585d22499J53118B7052a04720d020j671H2428e0787j00593A96076a55503A33568
9573h8922A65666b4755p07j35114M3478A25737c51980C5405f4620A78404b03319
9561c75917E3082J02702c01555h246A28891K3759a02558j38120G4010b00631a1635
9549G273K4565b0294A45924E3059L8268D945J54978C9856d5072k47055A23026
9537A72517p9613a12470j45348P4909d823q195C89708A14097a20204j49808B09032
9525a77622j05692J37418B672a04267j2488c0346j30184f9855a1610k14211i2008
$$ plain form
9606 -105439 -241474 128903 -237667 -112141 158754 -66664 -133957 41635 -151420 -310035
9596 -310035 195368 -133087 -125187 148766 15339 11202 144145 -244332 -163869 -161615 -422499
9585 -422499 -269381 27052 -104720 -4020 -5691 82428 -50787 -151380 196076 -155503 133568
9573 -88922 165666 -24755 -25462 -160576 -117098 125737 -351980 35405 -64620 178404 -203319
9561 -375917 53082 155784 -301555 -8246 128891 152650 -102558 -240678 74010 -200631 -11635
9549 7273 31838 -20294 145924 53059 91327 4945 159923 39856 -45072 -292127 123026
9537 172517 92904 -112470 -257818 -182909 -4823 -13018 389708 114097 -120204 -270012 209032
9525 -177622 -283314 -145896 2672 -104267 -116755 -30346 -160530 -69855 -11610 -225821 -92008
9513e0764B8539h2311C61566A09595b66747B53542g6576r397A07243J98361a67490
9501d1210F1588c12441A00220b92569O4834L6802B0625f2484p7369o6O5024q777
9489h3672H7868a70234J4647J8155K7693A07968J26285p0494d22786b3644D8642
9477c74387g1049k85314J60813B41094E1547g6270K9005H783L7610a63666j98082
9466c61748b0470A09196k5078B4511a36530N429O3432k14636D7808J28334f7667
9454b77779b7655j66071f8780j2926b3751G9784F311d3790k49898C08161A14266
9442d1611j00823O8782j7262r1703L5075I9670L3376D2955c6307r4407G821d218
9429a08811A54329k006d22429c2071k1395q4733l1354N4082k4105j58877B2301
$$ plain form
9513 -50764 28539 -82311 361566 109595 -266747 253542 -76576 -85973 107243 305604 -167490
9501 -41210 61588 -312441 100220 -292569 -227735 -190933 20625 -62484 -139853 -139919 -74895 -83672
9489 -83672 87868 -170234 -155587 -137432 -109739 107968 234253 163759 -422786 -23644 48642
9477 -374387 -71049 -356363 -195550 241094 51547 -76270 -47265 8783 46393 -163666 -361748
9466 -361748 -20470 109196 84118 24511 -136530 -131101 -67669 -282305 47808 176142 -67667
9454 -277779 -27655 -193726 -68780 -81706 -23751 79784 6311 -43790 -293688 308161 114266
9442 -41611 -142434 -73652 -90914 -182617 -147542 99670 133046 42955 -36307 -130714 7821 -4218
9429 -108811 154329 152323 -422429 -32071 -53466 -138199 -169553 -115471 -139576 -298453 22301
9417d85619a47643N6830o2857K7445A6832L52826A09170a12190A03786d3450j77966
9406b21416A06506B4975d7649A9398b60108N4840B23130b42074C9263h3286l61591
9395d44877a65355A68615J27915D6945a27445A7229b8166B10867H1484M4131f6036
9383b8052k69793h6871b3626h106k72074B07797E1516b00395H7137L8761a47647
9371c18784p4784J93416d394j91798A55463J43878b05287j19220C740c06577a6188
9359B5343b83355C84349a63297O6238A57239a6608A74083p8344J00254a45669
9348A27098a52931A97943b60669D6483a59919H1657f4155C24554a67615a1349
9337a08411B4418d9095k51514H5711c6948H982Q6071b74003e2595j88448G193
$$ plain form
9417 -485619 -147643 -90813 -153670 -126225 16832 369658 109170 -112190 103786 -43450 -221416
9406 -221416 106506 24975 -47649 19398 -260108 -205268 223130 -242074 39263 -83286 -444877
9395 -444877 -165355 168615 296530 46945 -127445 17229 -28166 210867 81484 125615 -66036
9383 -28052 -297845 -86871 -23626 -8106 -280180 207797 51516 -200395 87137 125898 -147647
9371 -318784 -393568 -200152 -4394 -196192 155463 299341 -205287 -324507 3740 -306577 -16188
9359 25343 -283355 384349 -163297 -97059 157239 -16608 174083 95739 195993 -145669
9348 127098 -152931 197943 -260669 46483 -159919 81657 -64155 324554 -167615 -11349
9337 -108411 24418 -49095 -300609 85711 -36948 8982 95053 -274003 -52595 -241043 7193
9325A12105n3439c36444a08943j31670n4525A09700a86423B436M7971A4203b7739
9313i8978I7061m2827d0148A20979c01969A22549j0460E057d06329A9822a84263
9301h6746n5153m6155a1643A87533j8824a07513A35426n1282a60343l4766M6669
9290a48440k84332d2937j19866g1904k6675q8154A70113a09826m3735A14053g2798
9278i1478j96635P6947A00137d80633J98734B39634B2952N6103B7433a40618B41643
9266b37376A92376b168k43585Q7431e5726l36634I2436i6740I4604b47036j43261
9255c90297A96876h7747l0514A26208L8348K4228p6300b85146D0735b39037h5829
9243A58051a77394G503Q5406a47430F5184h8701D48502E3324J34662c37060d7346
$$ plain form
9325 112105 58666 -336444 -108943 -240613 -295138 109700 -186423 2436 50407 14203 -27739
9313 -98978 97061 54234 -40148 120979 -301969 122549 112089 5057 -406329 19822 -184263
9301 -86746 -141899 -188054 -11643 187533 168709 -107513 135426 84144 -160343 -195109 -148440
9290 -148440 -432772 -42937 -162803 -71904 -98579 -186733 170113 -109826 -153561 114053 -72798
9278 -91478 -288113 -211166 100137 -480633 -281899 239634 22952 79055 27433 -140618 241643
9266 -237376 192376 -2168 -245753 -158322 -55726 -392360 92436 -96740 94604 -247036 -390297
9255 -390297 196876 -87747 -118261 126208 164556 188784 112484 -285146 40735 -239037 -85829
9243 158051 -177394 7503 92909 -147430 65184 -88701 448502 53324 187986 -337060 -47346
9231F509b09089F0094J06253e2729A84242j9121a81953K7369L9082A71498P289
9220A78787a69683P9130B63329a32770A9981c8285B5119b01561P602a0050F3256
9208A17725M0436b77920e6388r6751A48058b9265C48867p7702G4907c0225H0885
9196F075O5143O250D757J84129c2481j01490C5622J35083b83255F4458b83140
9184E4921b60953H7810O1431b25339d1374n0652r6429n9866a21240E952R4161
9173A00113i3354j47480c7559l6103r2384B30138H2087b04758d550C5183J56240
9162A91423a64873C7899a52437A18397g6140A37408d7497A3995b45004A74419
9151f5892k07306j51392G8818P5181f6993n0979j93904g440A09761n4292e0702
$$ plain form
9231 6509 -209089 60094 166347 -52729 184242 165121 -181953 -154584 -115502 171498 178787
9220 178787 -169683 -90553 263329 -132770 19981 -38285 25119 -201561 -193959 -10050 63256
9208 117725 158161 -277920 -56388 -153139 148058 -29265 348867 271165 74907 -30225 80885
9196 6075 71218 77468 4757 188886 -32481 -133971 35622 170705 -283255 64458 -283140
9184 54921 -260953 87810 149241 -225339 -41374 -92026 -188455 -248321 -121240 5952 100113
9173 100113 -93354 -240834 -37559 -73662 -166046 230138 82087 -204758 -4550 35183 191423
9162 191423 -164873 37899 -152437 118397 -76140 137408 -47497 13995 -245004 174419
9151 -65892 -273198 -424590 78818 153999 -66993 -117972 -311876 -7440 109761 55469 -50702
9139b95217C47893c2683C31398A1158K1346a90037F8878J01992b92049J36463
9129a55586q466f4289A9133L9114L85J93591c09810F5094a63369d6972H5330B798
9116E2318k0073a46942G1182a98104A35566R6856g4118k22266A52939c8838B30387
9104a91090F9840Q2817A4982O0990a23926j19063d9933k52206M8290a7868A31086
9092A12805o487J84665g2489K0708A33640n0868e29614B34215G5653B0908J22209
9081A43117A8000R0871a01990m8639N4039D1262a08085M4862B81868a37196b2404
9069g7776k10604L3104b8333j36773B428c9137n4976A52933C9053e535k06601
9058b12136A33037b81136B91701e6743j84437L9767R9327q8436E4372c4679m4089
$$ plain form
9139 -295217 347893 -32683 331398 11158 32504 -190037 68878 170870 -292049 -155586
9129 -155586 -164052 -64289 19133 58247 58632 252223 -309810 65094 -163369 -46972 85330 2798
9116 52318 32245 -146942 71182 -198104 135566 232422 -74118 -296384 152939 -38838 230387
9104 -191090 69840 152657 14982 75972 -123926 -242989 -49933 -302139 -253849 -17868 131086
9092 112805 106318 290983 -72489 -51781 133640 82772 -529614 234215 75653 20908 143117
9081 143117 18000 108871 -101990 -150629 -96590 41262 -108085 -63223 281868 -137196 -22404
9069 -77776 -288380 -255276 -28333 -165106 2428 -39137 -94113 152933 39053 -5535 -212136
9058 -212136 133037 -281136 291701 -56743 -241180 -201413 -102086 -190522 54372 -34679 -78768
9047g8768K3193A15639J80895j14112b15185a6949A00252C2418J70264i7782D2130
9035b5973l07565a64876Q1709b9953A39075J07475A10091a69375M9007l01131
9025d21499a20358C27998a55225c7986E8762a71188D4466a22655j77681Q6087
9015b14249n8178a04865j70627J1909J8545A14925a4605A09821a67562l87589
9005e55151J60259a76759p3613M1180d4871B5042K19372o2681f278A6199b0669
8993D2548M6381h3391r165b4403k82995A8463b4938m4056k38088d2293A35562
8981a11377e929k00616A98049a05783r0992Q9700A04051f2400Q570m8427D0335
8969b84449d7151l784p9472K0750k389A59034A0078M478L0831a29047d4802e062
$$ plain form
9047 -78768 -55575 115639 296534 182422 -215185 -16949 100252 32418 202682 -97782 42130
9035 -25973 -333538 -164876 -83167 -29953 139075 246550 110091 -169375 -120368 -421499
9025 -421499 -120358 327998 -155225 -37986 58762 -171188 44466 -122655 -300336 -214249
9015 -214249 -272427 -104865 -275492 -263583 -245038 114925 -14605 109821 -167562 -555151
9005 -555151 -394892 -176759 -250372 -209192 -44871 25042 244414 181733 -6278 16199 -20669
8993 42548 88929 -83391 -92556 -24403 -307398 18463 -24938 -68994 -307082 -42293 135562
8981 -111377 -5929 -206545 198049 -105783 -196775 -107075 104051 -62400 -53830 -102257 40335
8969 -284449 -47151 -50935 -130407 -109657 -112046 159034 10078 14556 45387 -129047 -44802 -5062
8956F5975b49680A72348R0983c9648j8612j49911a5701A72155D1732c20440P5309
8945b45131B4974d9143j24569M9553k10746P6237C2262d3198I0011b02349j15217
8934c17566e5984A15193C5946J30717D3223j2003a18313A16342k3210b40196J19438
8923a20758F7019K7402b30745B76476k4473O9250J81095b04670c5075j07912B43157
8911B98357R5964K42031K57460O75792N68680L082453L784094D061518j844224
8902B217294A073090k88540l66108q7779E6137L0886N0236k4798l8104O6498L12727
8891D53582b06306A33431n8765N9072g5541A37963o8889l3880A0880R7446P059
8880A15385j9551P2679A8487i3827E0828b04057O2501e7057j93349J10540d4397
$$ plain form
8956 65975 -249680 172348 263331 -39648 -58260 -208171 -15701 172155 41732 -320440 -245131
8945 -245131 24974 -49143 -173712 -124159 -334905 -258668 32262 -43198 90011 -202349 -317566
8934 -317566 -55984 115193 35946 166663 43223 31220 -118313 116342 93132 -240196 -120758
8923 -120758 67019 94421 -230745 276476 252003 321253 502348 -204670 -35075 -142987 243157
8911 298357 394321 636352 893812 1569604 2138284 5220737 9004831 4061518 2217294
8902 2217294 1073090 784550 418442 330663 56137 87023 137259 112461 74357 140855 453582
8891 453582 -206306 133431 74666 133738 -75541 137963 69074 35194 10880 108326 115385
8880 115385 95834 168513 18487 -93827 50828 -204057 -141556 -57057 -250406 -139866 -44397
8868a62846C01721E4710k2625a45195N6350F8327d74555a05298r4810A73136o2662
8857A10474O4721F5296B3173a30789E4346A5170d5032A47769d55625a50987o3790
8846b14777A76558i7667q8393c0872D9409K04247a44278A18488b03901o11B2706
8834c0318j55845H333P7595a7494m22722M014a13901A5925a1374G7021b64603
$$ plain form
8868 -162846 301721 54710 32085 -145195 -88845 68327 -474555 -105298 -200108 173136 110474
8857 110474 175195 65296 23173 -130789 54346 15170 -45032 147769 -455625 -150987 -214777
8846 -214777 176558 -97667 -186060 -30872 49409 253656 -144278 118488 -203901 -204512 22706
8834 -30318 -186163 8333 85928 -17494 -440216 -436202 -113901 15925 -11374 77021 -264603
$$ [...]
##END NTUPLES=NMR SPECTRUM
##END=
