
##TITLE=UV1151_M2-1005-1001_6301648_rXnfeYM4Q0
##JCAMPDX= 6.0         $$ Bruker NMR JCAMP-DX V2.0
##DATA TYPE= NMR SPECTRUM
##DATA CLASS= NTUPLES
##ORIGIN= BRUKER
##OWNER= Administrator
$$ 1.72 TOPSPIN		Version 2.1
$$ 2012-06-06 03:45:21.359 -0500  Administrator@TOPSPIN
$$ Compression mode = diff/dup
##.OBSERVE FREQUENCY= 400.13188235
##.OBSERVE NUCLEUS= ^1H
##.ACQUISITION MODE= SIMULTANEOUS (DQD)
##.ACQUISITION SCHEME= undefined
##.AVERAGES= 64
##.DIGITISER RES= 22
##SPECTROMETER/DATA SYSTEM= spect
##.PULSE SEQUENCE= noesygpps1d.comp
##.SOLVENT NAME= COFFEE_meoh
##.SHIFT REFERENCE= INTERNAL, COFFEE_meoh, 1, 14.96693
##AUDIT TRAIL= $$ (NUMBER, WHEN, WHO, WHERE, PROCESS, VERSION, WHAT)
$$ ##TITLE= Audit trail, TOPSPIN		Version 2.1
$$ ##JCAMPDX= 5.01
$$ ##ORIGIN= Bruker BioSpin GmbH
$$ ##OWNER= Administrator
$$ $$ C:\Bruker\TOPSPIN/data/COFFEE/nmr/UV1151_M2-1005-1001_6301648_rXnfeYM4Q0/12/pdata/1/auditp.txt
$$ ##AUDIT TRAIL=  $$ (NUMBER, WHEN, WHO, WHERE, PROCESS, VERSION, WHAT)
(   1,<2012-06-06 03:45:16.109 -0500>,<Administrator>,<TOPSPIN>,<go>,<TOPSPIN 2.1>,
      <created by zg
	started at 2012-06-06 03:33:45.828 -0500,
	POWCHK enabled, PULCHK disabled,
       configuration hash MD5:
       D5 CA 7A 23 FE 6B EE E2 50 67 74 61 24 F7 5E 3B
       data hash MD5: 64K
       4B 7D A3 3B A9 6A BB 06 12 89 87 DA A3 8B 84 50>)
(   2,<2012-06-06 03:45:18.921 -0500>,<Administrator>,<TOPSPIN>,<proc1d>,<TOPSPIN 2.1>,
      <Start of raw data processing
       efp LB = 0.3 FT_mod = 6 PKNL = 1 PHC0 = 0 PHC1 = 0 SI = 128K 
       data hash MD5: 128K
       B3 2B 47 62 78 D2 05 90 46 29 DF CD C6 8D F1 A5>)
(   3,<2012-06-06 03:45:20.171 -0500>,<Administrator>,<TOPSPIN>,<proc1d>,<TOPSPIN 2.1>,
      <pk PHC0 = 32.42065 PHC1 = 0 
       data hash MD5: 128K
       8C 1F 45 72 06 9B E7 FF 16 DD 66 58 FA DE 94 B6>)
(   4,<2012-06-06 03:45:21.015 -0500>,<Administrator>,<TOPSPIN>,<proc1d>,<TOPSPIN 2.1>,
      <abs ABSG = 1 
       data hash MD5: 128K
       7E 8D 1F 67 83 25 43 1D BA E2 8E 88 37 0E 29 7E>)
(   5,<2012-06-06 03:45:21.093 -0500>,<Administrator>,<TOPSPIN>,<proc1d>,<TOPSPIN 2.1>,
      <abs ABSG = 2 
       data hash MD5: 128K
       B3 ED B1 A4 35 6D B5 50 0F 24 0C 82 15 DF F3 73>)
(   6,<2012-06-06 03:45:21.156 -0500>,<Administrator>,<TOPSPIN>,<proc1d>,<TOPSPIN 2.1>,
      <abs ABSG = 3 
       data hash MD5: 128K
       AD 4B AD B7 13 3B 51 13 DA C9 4C 9A 28 91 02 28>)
(   7,<2012-06-06 03:45:21.218 -0500>,<Administrator>,<TOPSPIN>,<proc1d>,<TOPSPIN 2.1>,
      <abs ABSG = 4 
       data hash MD5: 128K
       F9 AB 52 CA 6A 0E FA 1F E8 7F D1 F7 84 21 60 A4>)
(   8,<2012-06-06 03:45:21.281 -0500>,<Administrator>,<TOPSPIN>,<proc1d>,<TOPSPIN 2.1>,
      <abs ABSG = 5 
       data hash MD5: 128K
       46 C9 3B 39 1E 3E D7 2B 6F 31 78 9C 20 53 3D 83>)
$$ ##END=
$$ 
$$ $$ hash MD5
$$ $$ D6 7E 37 AB E6 B8 32 0F 72 3C 76 20 19 AA 0B 45
##$RELAX= 
##$RELAX= 
##$RELAX= 
##$RELAX= 
##$RELAX= 
##$RELAX= 
##$RELAX= 
##$RELAX= 
$$ Bruker specific parameters
$$ [...]
##$TP07= 0
##$TPNAME0= <>
##$TPNAME1= <>
##$TPNAME2= <>
##$TPNAME3= <>
##$TPNAME4= <>
##$TPNAME5= <>
##$TPNAME6= <>
##$TPNAME7= <>
##$TPOAL= (0..7)
0.5 0.5 0.5 0.5 0.5 0.5 0.5 0.5
##$TPOFFS= (0..7)
0 0 0 0 0 0 0 0
##$TUNHIN= 0
##$TUNHOUT= 0
##$TUNXOUT= 0
##$USERA1= <user>
##$USERA2= <user>
##$USERA3= <user>
##$USERA4= <user>
##$USERA5= <user>
##$V9= 5
##$VALIST= <valist>
##$VCLIST= <CCCCCCCCCCCCCCC>
##$VD= 0
##$VDLIST= <DDDDDDDDDDDDDDD>
##$VPLIST= <PPPPPPPPPPPPPPP>
##$VTLIST= <TTTTTTTTTTTTTTT>
##$WBST= 2048
##$WBSW= 25
##$XGAIN= (0..3)
0 0 0 0
##$XL= 0
##$YL= 0
##$YMAX_a= 9174675
##$YMIN_a= -6376854
##$ZGOPTNS= <>
##$ZL1= 120
##$ZL2= 120
##$ZL3= 120
##$ZL4= 120
##$ABSF1= 14.96693
##$ABSF2= -5.5856
##$ABSG= 5
##$ABSL= 3
##$ALPHA= 0
##$AQORDER= 0
##$ASSFAC= 0
##$ASSFACI= 0
##$ASSFACX= 0
##$ASSWID= 0
##$AUNMP= <proc_prof1d_extract.lims>
##$AXLEFT= 0
##$AXNAME= <>
##$AXNUC= <1H>
##$AXRIGHT= 0
##$AXTYPE= 0
##$AXUNIT= <>
##$AZFE= 0.1
##$AZFW= 0.1
##$BCFW= 0
##$BC_mod= 0
##$BYTORDP= 0
##$COROFFS= 0
##$CY= 15
##$DATMOD= 1
##$DC= 0
##$DFILT= <>
##$DTYPP= 0
##$F1P= 0
##$F2P= 0
##$FCOR= 0.5
##$FTSIZE= 131072
##$FT_mod= 6
##$GAMMA= 0
##$GB= 0
##$INTBC= 1
##$INTSCL= 1
##$ISEN= 128
##$LB= 0.3
##$LEV0= 0
##$LPBIN= 0
##$MAXI= 10000
##$MC2= 0
##$MEAN= 0
##$ME_mod= 0
##$MI= 0
##$NCOEF= 0
##$NC_proc= -3
##$NLEV= 6
##$NOISF1= 0
##$NOISF2= 0
##$NSP= 0
##$NTH_PI= 0
##$NZP= 0
##$OFFSET= 14.96693
##$PC= 1
##$PHC0= 32.42065
##$PHC1= 0
##$PH_mod= 1
##$PKNL= yes
##$PPARMOD= 0
##$PPDIAG= 0
##$PPIPTYP= 0
##$PPMPNUM= 2147483647
##$PPRESOL= 1
##$PSCAL= 4
##$PSIGN= 0
##$PYNMP= <proc.py>
##$REVERSE= no
##$SF= 400.130005473356
##$SI= 131072
##$SIGF1= 0
##$SIGF2= 0
##$SINO= 400
##$SIOLD= 131072
##$SPECTYP= <>
##$SREGLST= <1H.CDCl3>
##$SSB= 0
##$STSI= 131072
##$STSR= 0
##$SW_p= 8223.68421052632
##$SYMM= 0
##$S_DEV= 0
##$TDeff= 65536
##$TDoff= 0
##$TI= <>
##$TILT= no
##$TM1= 0
##$TM2= 0
##$TOPLEV= 0
##$USERP1= <user>
##$USERP2= <user>
##$USERP3= <user>
##$USERP4= <user>
##$USERP5= <user>
##$WDW= 1
##$XDIM= 131072
##$YMAX_p= 448057693
##$YMIN_p= -421282611
##$CURPLOT= <Network HP LaserJet P1505>
##$CURPRIN= <$Network HP LaserJet P1505>
##$DFORMAT= <normdp>
##$LAYOUT= <+/1D_H.xwp>
##$LFORMAT= <normlp>
##$PFORMAT= <normpl>
##$SURQMSG= 1
$$ End of Bruker specific parameters
$$ ---------------------------------
##NTUPLES= NMR SPECTRUM
##VAR_NAME=  FREQUENCY,     SPECTRUM/REAL,   SPECTRUM/IMAG
##SYMBOL=    X,             R,               I
##VAR_TYPE=  INDEPENDENT,   DEPENDENT,       DEPENDENT
##VAR_FORM=  AFFN,          ASDF,            ASDF
##VAR_DIM=   131072,        131072,          131072
##UNITS=     HZ,            ARBITRARY UNITS, ARBITRARY UNITS
##FACTOR=    0.0627417313425165, 1,          1
##FIRST=     8223.62146879498, 2771,         -91092
##LAST=      0,             2970,            -90191
##MIN=       0,             -421282611,      0
##MAX=       8223.62146879498, 448057693,    0
$$ Real data points
##PAGE= N=1
##DATA TABLE= (X++(R..R)), XYDATA
$$ [...]
64768 203434 205061 205826 205743 206025 207717 210775 214475 218140 221429 224515 228052 232398 236842 240284 242815
64753 242815 245858 250493 256226 261679 265954 269086 271707 274484 277447 279745 280573 280259 279725 278890 276688
64738 276688 272910 268848 265510 262207 257880 253071 249536 248199 248299 248305 247029 244199 240688 238020 237051
64723 237051 237283 237826 238619 240117 242258 244493 246521 248296 249628 250609 252210 255489 260227 265075 269072
64708 269072 272270 275034 277731 281204 286412 293079 299428 303872 306478 308354 310154 311832 313440 315437
64694 315437 318166 321486 324938 327970 329983 330464 329343 327194 324823 322395 318995 313437 305741 297466
64680 297466 290256 284364 279042 273982 269592 266012 262756 259580 257036 255839 256184 257888 260593 263446
64666 263446 265139 264801 262746 260173 258467 258786 261534 265782 269740 272420 274438 276722 278909 279787 279029
64651 279029 277662 276804 276584 276412 275725 274243 271925 269035 266111 263706 262114 261262 260727 259926 258450 256231
64635 256231 253445 250514 248222 247360 248052 249710 251810 254258 256778 258640 259569 260307 261512 262628 262794
64620 262794 262585 263642 266637 270733 275293 280903 288073 295862 302658 307847 311987 315698 319045 321776
64606 321776 323499 323730 322296 319716 316810 313921 310795 307240 303582 300413 297951 295714 292966 289656
64592 289656 286794 285511 285769 286523 287274 288817 292086 296831 301940 306648 310862 314646 318104 321637 325710
64577 325710 330389 335624 341882 349783 358968 367894 375048 379914 382512 382574 379871 375161 370013 365298 360255
64562 360255 353628 345624 338075 332425 328169 323864 319189 315096 312053 309241 305855 302228 299025 296045
64548 296045 292694 289197 286529 285408 286058 288607 292790 297359 300777 302714 304176 306037 308229 310561
64534 310561 313492 317492 322216 326924 331419 336104 341321 347033 352837 357759 360356 359950 357995 357424 359867
64519 359867 363708 365597 363912 360075 356285 352873 348708 343580 338884 335854 334158 332626 330438 327189
64505 327189 322664 317210 311626 306106 300060 293608 288218 284834 282282 278897 275037 272434 271466 270828 269803
64490 269803 269027 268699 267756 265540 262893 260880 259631 259155 260055 262510 265490 267788 268984 268801 266774 263596
64474 263596 261574 262323 264663 266021 265343 263550 261851 260972 261458 263229 264983 265332 264403 263287 262345 261414
64458 261414 261324 263488 267826 272521 276071 278220 278794 277430 275129 274458 277049 281878 286940 291628 296499
64443 296499 301779 307406 313862 321543 329516 336137 340851 344377 347198 348960 349583 349889 350513 350817 349603
64428 349603 346723 343436 341123 339922 338879 337341 335857 335372 335722 335560 333984 331623 329547 327547 324291
64413 324291 319230 313680 309727 308404 309129 310522 311466 311588 311196 310941 311372 312621 314385 316245 318142 320584
64397 320584 324264 329338 335160 340771 345571 349417 352297 354275 355908 358486 363500 371535 381635 391945
64383 391945 401281 410087 419654 430525 442085 453795 466307 480950 498430 518466 540506 564326
64371 564326 590076 618349 650165 686222 725965 768086 812453 860980 915871 977224 1043087
64360 1043087 1111747 1183011 1257025 1332720 1408154 1481853 1552941 1620149 1681575 1735620 1781400
64349 1781400 1817857 1843064 1855119 1853679 1840257 1817144 1786255 1748711 1704796 1653964 1595211
64338 1595211 1528007 1453254 1373533 1292379 1212985 1137199 1065542 998008 934702 875814 821449
64327 821449 771847 727526 688720 654724 624197 596265 570968 548470 528306 509810 493054
64316 493054 478736 467022 457086 448142 440444 434491 429328 422662 413264 402696 393777 387502 382281
64303 382281 376276 369561 363602 359335 356493 354432 352855 351702 350907 350432 350332 350675 351509 352728 353875
64288 353875 354351 354172 354428 356594 361259 367516 373431 377109 377708 375818 372816 369756 367007 364841 363736
64273 363736 363767 364302 364858 365833 367848 370720 373656 376135 378003 379114 379638 380326 381497 381908 379706 374606
64257 374606 368321 362762 358684 356132 355005 354674 353950 352051 349101 345297 340299 333943 326959 320450 315044
64242 315044 310864 307742 305111 302346 299652 297960 297481 297117 295949 294585 294177 294673 294992 294651 294387 295258
64226 295258 297803 301840 306517 310842 314696 318919 323864 328539 332095 335475 340337 346662 352856 358109
64212 358109 363131 368232 372183 373759 373435 372756 372688 373211 373809 373745 372480 370493 369191 369416 370506 371316 371570
64195 371570 371540 371072 369870 368262 366674 364512 360590 354741 348177 342193 337356 334043 332745 333267 334344
64180 334344 334851 335168 336729 340324 345341 350771 356516 363388 371845 381042 389407 396127 401781 407473 413764
64165 413764 420831 429204 439517 451476 463736 475094 485351 494851 503729 511980 519730 526933 533063
64152 533063 537566 540366 541520 540655 537302 531644 524451 516398 507871 499167 490242 480465 469476 458341
64138 458341 448977 442125 436642 431139 425538 420495 416085 411969 408454 406473 406581 408638 412313 417141
64124 417141 422050 425529 426515 424747 420405 414092 407227 401583 397900 395206 391837 386889 380607 373812
64110 373812 367190 360816 354154 346801 339300 332781 327662 323311 319246 316031 314430 314137 314031 313494 312904
64095 312904 312965 313994 315715 317345 318163 318503 319850 323229 327632 330832 331764 331336 330817 330360 329514 328355
64079 328355 327351 326549 325583 324241 322506 320266 317608 315230 314015 314221 315482 317401 319585 321247 321713
64064 321713 321521 322216 324594 327704 330110 331595 332985 334779 336939 339942 344989 352694 362098 371404 379369
64049 379369 385718 390641 394386 397179 399090 399937 399531 398096 396438 395760 397122 400617 405021 408728 411229
64034 411229 413190 414865 415118 412641 407624 401453 395063 388440 381580 374941 368804 362999 357565 352912
64020 352912 348965 344872 340060 335038 330589 326666 322741 318941 316102 314741 314550 314913 315466 316099 316822
64005 316822 317765 318978 320099 320426 319570 318065 317296 318654 322449 327464 331818 334515 336112 337789 340081
63990 340081 342822 345966 349821 354353 358810 362380 365005 367210 369341 371382 373590 376787 381511 386994
63976 386994 391547 394215 395696 397225 398887 399621 398835 397406 396866 398039 400731 404288 408022 411365 414115
63961 414115 416623 419375 422268 424457 425099 424327 423327 423229 423857 423907 422675 421220 421281 423191 425538 426919
63945 426919 427320 427608 428443 430230 433450 438219 443646 448371 451847 454795 458272 462567 467143 471603 476538
63930 476538 483249 492538 503972 516501 529437 542484 555334 568110 581936 598007 615991 634415
63918 634415 652786 672145 693238 715471 738453 763148 790381 819374 849305 881389 917646
63907 917646 957987 1000291 1043287 1087764 1134829 1184662 1237471 1294284 1356103 1423367 1496923
63896 1496923 1578583 1670073 1772206 1885596 2011328 2150391 2303422 2471793 2658080 2864467
63886 2864467 3091151 3337113 3601858 3885356 4186487 4502482 4829852 5165227 5505361
63877 5505361 5846891 6185776 6516020 6828895 7114433 7364472 7574367 7741891 7865113
63868 7865113 7941702 7969830 7949025 7879770 7762504 7597643 7387104 7135856 6851578 6542548
63858 6542548 6215967 5877993 5534448 5190657 4850870 4518570 4197484 3891749 3604843
63849 3604843 3338553 3093169 2868364 2663548 2477496 2308230 2153777 2013148 1886315
63840 1886315 1773143 1672551 1582815 1502261 1429390 1362711 1301042 1243864 1190921 1141680 1095815
63829 1095815 1054026 1017334 985291 955738 926861 898846 872975 849807 829114 811135 796717
63818 796717 786095 778357 772399 767859 764828 763213 762910 764345 768267 774880 783432 792832 802570 812781
63804 812781 823410 833752 843273 852787 864113 878146 893611 908151 920414 930555 938896 944926
63792 944926 947987 948364 946964 943969 938340 928945 915930 900662 884355 867014 847835 826483 803764
63779 803764 781052 759185 737991 716762 694964 672526 649791 627572 607056 588991 572617
63768 572617 555896 537345 517484 498092 480410 464737 451392 440812 432408 424430 415601 406257
63756 406257 397458 389801 383616 379314 376593 374055 370712 367240 364726 362824 360502 357962 356173 354761
63742 354761 352146 347912 343334 339147 334482 328729 322888 318091 314132 310588 308224 307852 308480 307974 305361
63727 305361 301587 298310 296632 296606 297134 296653 294617 292049 290215 289331 289125 289857 291787 294137 295590 295565
63711 295565 294257 291930 289099 286933 286353 286782 286700 285314 282972 280322 278017 276969 277666 279266 280422
63696 280422 281126 282798 286353 291032 295340 298432 300454 302173 304360 306980 309099 310209 311331 313879
63682 313879 317678 321328 324502 328552 334528 341928 349905 358423 367409 375792 382513 387931 393366 399575
63668 399575 406389 413512 420979 428902 437219 445600 453435 460229 466194 472002 477700 482330 484876 485145
63654 485145 483569 480790 477684 474980 472325 468420 462734 456516 451387 447431 443538 439290 435613 433569
63640 433569 433137 433300 433006 432108 431581 432603 435212 438262 440893 443409 446358 449588 452912 456917 461989
63625 461989 467069 470632 472693 474598 476833 478326 478199 477135 476583 477618 480926 486788 494357 501852 508325
63610 508325 514633 521892 529668 536521 541743 545471 547465 546999 544002 539323 533750 527563 521010 514229
63596 514229 506552 497129 486789 478184 473128 470441 467411 463010 458622 455815 454478 453407 451921 450481
63582 450481 450162 451842 455568 460491 465654 470853 476454 482502 488643 495023 502571 512040 523291 535865
63568 535865 549744 565076 581572 598826 617015 636796 658657 682861 709771 739558 771575
63557 771575 804638 838140 872559 908701 946744 986197 1026554 1067724 1109868 1152748 1195066
63546 1195066 1234328 1267513 1292215 1307621 1314846 1316383 1314627 1310481 1303421 1293094 1280584 1267818
63534 1267818 1255917 1244408 1231776 1216435 1197433 1174808 1149467 1122577 1095180 1068364 1043305
63523 1043305 1020599 999840 980434 962782 948160 937481 930489 926088 923106 921043 920541 922952 928913
63510 928913 937549 947495 958352 970457 983702 997677 1012886 1030551 1050796 1072016 1092599 1112651
63498 1112651 1133643 1156953 1183156 1212109 1243138 1275585 1309601 1346166 1386070 1429254 1475069
63487 1475069 1522305 1568492 1609901 1642953 1665530 1676987 1677879 1670287 1657619 1643073 1628341 1613993
63475 1613993 1600296 1587031 1573174 1557762 1540677 1521818 1499991 1473704 1442864 1408827 1372909
63464 1372909 1335711 1297620 1258872 1219134 1178118 1136924 1097796 1062251 1030220 1001205 975231
63453 975231 952181 931203 911625 893767 878028 863699 849634 835805 823351 813172 805185 798824
63441 798824 793420 788072 782017 775443 769249 763724 758164 752202 746742 742878 740471 738676 737412 737203
63427 737203 737786 738249 738814 741138 746137 752583 758793 764718 771149 777605 782676 786224 789458 792531 793666
63412 793666 791432 786658 781129 775398 768974 761817 754279 745911 735702 723688 711388 700391 691138
63399 691138 683243 676404 670794 666991 665576 666409 668325 670182 672391 676862 685083 696637 709909 723927
63385 723927 739081 756263 775768 797141 819699 842992 867026 892483 920768 953270 990072
63374 990072 1029295 1067943 1103346 1133981 1159589 1181298 1201330 1221711 1243165 1265895 1291236
63363 1291236 1321414 1357415 1398206 1442507 1490056 1540222 1590473 1637585 1679811 1716580 1746615
63352 1746615 1767969 1780015 1784032 1781442 1772614 1757900 1738918 1717918 1696198 1673538 1648989 1622002
63340 1622002 1592915 1562354 1530065 1494928 1456707 1417353 1379497 1343777 1308829 1274025 1240989
63329 1240989 1211797 1186752 1164824 1145724 1130539 1120463 1115411 1113855 1113742 1113772 1114032 1115321 1118007
63316 1118007 1122057 1128104 1137611 1151559 1169555 1190603 1214086 1239536 1266096 1293077 1320843 1350574
63304 1350574 1383153 1418583 1456344 1496051 1537825 1582021 1628294 1675061 1720430 1763425 1803299
63293 1803299 1837578 1862376 1875631 1879126 1876382 1869339 1858122 1842987 1824759 1803646 1779310 1752231
63281 1752231 1723612 1693635 1661105 1625207 1586499 1545729 1502882 1458215 1413309 1370203 1330020
63270 1330020 1293100 1259747 1229945 1202813 1177373 1153820 1133410 1117131 1104856 1095359 1086446 1075411
63258 1075411 1060407 1041586 1020377 997714 973748 949283 926391 906920 890893 876942 863953
63247 863953 851756 840595 830631 821885 814066 806430 798337 789990 782059 774399 765782 755382 744097
63234 744097 733800 725389 718134 710907 703400 695856 688096 679394 669331 658473 648100 639381 632768
63221 632768 627949 624150 620457 616081 610716 604806 599225 594356 589554 583788 576777 569291 562441 556995
63207 556995 553150 550319 547121 542396 536658 531919 529508 528526 527044 524300 520949 517545 514006 510627
63193 510627 508477 508193 509075 510028 510987 512833 516081 520091 523528 525407 525874 526201 527872 531451 536402 541862
63177 541862 547237 552060 555988 559303 562964 567801 573953 581221 589303 597333 604030 609087 613827 619648
63163 619648 626334 632917 639615 647424 655925 663208 668530 673605 680310 688154 695124 700340 704696 709178
63149 709178 713621 717166 719160 719448 718302 716201 713532 710678 708471 707976 709330 711399 713237 715455 719310
63134 719310 724887 731164 737689 745080 753877 764007 775611 789240 804720 820699 836006 850773
63122 850773 865651 880519 894751 908326 921885 935800 949751 963145 975558 986889 997420
63111 997420 1007630 1017652 1027035 1035131 1041420 1045232 1045643 1042124 1035095 1025442 1013695 1000033 984801
63098 984801 968495 951318 933134 913821 893443 872279 850957 830325 810797 792127 774244
63087 774244 758037 744665 734086 724909 715900 707315 700577 696840 695838 695904 695135 692792 689711 687358
63073 687358 686672 687850 690764 695059 700023 704902 709458 714038 719114 724916 731306 737904 744579 751992
63059 751992 761131 771844 782334 790763 797062 802544 808008 813089 817392 821447 826353 833056 841967 852599
63045 852599 863605 873940 884088 895359 907820 919846 930097 939053 947973 957155 966006 974241
63033 974241 981968 988809 993921 997019 998584 998834 997169 993238 988095 983487 979857 975734 969522 961379
63019 961379 952602 943505 933210 921840 911499 903884 897761 890294 880640 870789 862913 857450 854132
63006 854132 853109 854023 855238 855508 855870 858643 864745 872945 881564 890036 898919 909316 922404 938723
62992 938723 957626 977725 997980 1018025 1037687 1056804 1075593 1094671 1114526 1135268 1156878
62981 1156878 1179221 1201706 1223310 1243188 1261152 1277518 1292653 1306714 1319663 1331443 1342071
62970 1342071 1351295 1358119 1361158 1359932 1355652 1350184 1344226 1336854 1326850 1314101 1299594 1284488 1269489
62957 1269489 1254959 1241253 1228749 1217693 1208301 1201158 1197319 1197701 1202402 1210815 1222203 1235779 1250511
62944 1250511 1265701 1281938 1300752 1322903 1347481 1372998 1398779 1424904 1451458 1478361 1505407
62933 1505407 1531884 1556737 1579699 1601631 1622987 1642770 1660051 1675724 1691093 1704988 1714116
62922 1714116 1716562 1713193 1704915 1690339 1667654 1637702 1603450 1566816 1527591 1485460 1441478 1396999
62910 1396999 1352466 1308292 1266155 1228043 1193944 1161537 1128682 1095634 1064261 1035592 1008907
62899 1008907 983103 958043 934274 912132 891614 872675 855126 838474 822314 806550 790883
62888 790883 774540 757215 739913 723960 709195 694039 677600 660934 645819 632896 621499
62877 621499 610985 601611 594104 588663 584496 580370 575754 571374 568500 567658 568113 568391 567133 563803 559130
62862 559130 554670 551446 549081 546719 544509 543429 543718 544357 544305 543507 542494 541794 542094 544150 547849 551873
62846 551873 554921 556978 559008 561907 566287 572782 581711 592417 603410 613299 621524 628509 635338 642871
62832 642871 650726 657331 661297 662628 662442 661936 661796 661959 661438 658873 653941 647903 642245 637082 631455
62817 631455 624706 616749 607348 596177 583757 571551 560915 552301 545367 539339 533363 527168 521331
62804 521331 516339 511641 506439 501157 496958 493760 490065 485202 480464 477177 474678 471370 467090 463153
62790 463153 460401 458557 457546 458121 460535 463366 464462 462925 459766 456735 454839 453901 453141 451872 449771
62775 449771 446999 444445 443569 445245 448582 451531 452968 453588 454357 454953 454643 454100 454991 457759 461008 463441
62759 463441 465317 467487 469877 471762 472884 473507 473727 473553 473555 474665 477275 480946 485017 489170 493511 498437
62743 498437 504260 510632 516555 521365 525397 529230 532637 535044 536836 539343 543481 549162 556118 564413
62729 564413 573817 583512 593039 603131 615135 629911 647502 667347 688371 709367 729892 750612
62717 750612 772387 795167 818034 839922 860020 877934 893931 908717 922464 934265 942834 947442
62705 947442 947899 944236 936931 926932 914790 900195 883064 864578 846254 828397 810403 792227
62693 792227 774303 756193 736755 715979 695407 676226 658076 640433 624076 610177 598607
62682 598607 588223 578618 570629 565105 561778 559379 556452 552150 546726 541426 537666 536115 536376 537384
62668 537384 538268 539205 541451 546119 552990 560897 569092 577487 585722 593124 599931 607483 616657 626987
62654 626987 637969 650285 664932 682003 701298 723283 748185 774903 802309 831293 863934
62643 863934 900650 939679 979542 1020598 1063711 1108821 1155501 1203741 1253288 1303067 1352130
62632 1352130 1400442 1447822 1492718 1532837 1566522 1592679 1610029 1617734 1616640 1608614 1594323 1572586
62620 1572586 1542311 1504322 1460773 1413390 1363102 1311039 1258991 1208546 1160208 1113663 1068620
62609 1068620 1025087 983131 942982 905406 871410 841148 813460 786885 760967 736273 713527
62598 713527 693202 675616 660564 646912 633388 619990 607859 597544 588250 579266 571246 565208
62586 565208 560832 556735 552222 547787 543890 540177 536213 532258 528841 525990 523347 520827 518773 517557
62572 517557 517259 517626 518115 518025 516880 514818 512569 510938 510275 510417 511002 511660 511814 510721 508197 505278 503633
62555 503633 504089 506048 508452 510745 512612 513433 512777 511162 509654 508877 509056 510780 514685 520220 525715
62540 525715 530182 534384 539594 545899 552476 559131 566624 575451 584998 594146 602297 609622 616651 623886
62526 623886 631534 639190 645721 649741 650568 648802 645834 642520 638360 632145 623438 613206 602948 593457
62512 593457 584559 575901 567678 560501 554583 549229 543392 536813 530230 524216 518406 512609 508186 506950
62498 506950 508428 509596 508147 505053 502823 502072 501230 499295 497326 496958 498642 501763 505471 508815 510901
62483 510901 511729 512514 514607 518292 522822 527275 531132 534510 538135 542731 548142 553450 558118 562609 567760
62468 567760 574196 582532 593289 606121 619932 634470 651138 671327 694396 718216 741417 764329
62456 764329 788013 813348 840920 870826 902397 934831 968177 1003042 1039207 1075071 1108517
62445 1108517 1137954 1162744 1183299 1200584 1214830 1224947 1230115 1231750 1232766 1234859 1237625 1240468
62433 1240468 1243959 1248812 1254844 1261907 1270931 1283161 1299069 1318719 1342272 1369167 1397697 1426596
62421 1426596 1456411 1487976 1519933 1549125 1573184 1591443 1603543 1608842 1607571 1601024 1589756 1572491
62409 1572491 1547478 1514159 1473071 1425271 1372840 1319068 1266794 1216618 1167573 1119269 1072495
62398 1072495 1027979 985764 946069 909752 877335 848220 821504 797235 776230 758840 744412
62387 744412 731904 720517 709771 699559 690516 683855 680291 679053 678214 676134 672570 668536 665287
62374 665287 663329 662095 660372 657188 652497 647191 642544 639522 638280 638102 637975 637405 636601 635841 635005 633928
62358 633928 632669 630998 628108 623686 619017 615980 614830 613886 611748 608927 606895 606416 607433 609658 612364
62343 612364 614315 615022 615723 618028 621817 625567 628671 632117 636642 641456 645606 649758 655703 664296 674595
62328 674595 685007 694812 704521 715200 727768 742758 760277 779677 799469 818285 836325 855386
62316 855386 876994 900986 926385 953084 981797 1012808 1045909 1081424 1120095 1161776 1205327
62305 1205327 1250211 1297320 1347891 1402464 1461274 1524709 1592826 1665217 1741816 1822839 1907128
62294 1907128 1991450 2072383 2148164 2217693 2278475 2327021 2361190 2381102 2387952 2383100 2368336 2345679
62282 2345679 2316238 2279779 2235771 2184549 2127460 2066403 2003262 1939259 1874841 1810553 1747831
62271 1747831 1688299 1632532 1580241 1531457 1486551 1445113 1405948 1368476 1333144 1300006 1267879
62260 1267879 1235547 1203123 1171651 1142022 1114803 1090409 1068563 1048058 1027748 1007543 988020
62249 988020 969603 952791 938572 927604 919107 911419 903619 896044 889412 884132 880380 878169 877330
62236 877330 877920 880382 884658 889475 893565 897550 903444 911911 920973 928088 932900 937350 943639 952720
62222 952720 964348 977745 992027 1006394 1020213 1033098 1045160 1057228 1070566 1086243 1104848
62211 1104848 1126577 1151287 1178803 1209641 1245028 1285376 1329146 1374552 1422278 1474854 1532915
62200 1532915 1594019 1656362 1722014 1794438 1873682 1956007 2037765 2117432 2193651 2263499 2323634
62189 2323634 2371850 2406830 2427734 2434950 2430136 2414495 2387878 2350424 2304081 2251224 2192485 2127370
62177 2127370 2056732 1983343 1910018 1838282 1768944 1702795 1640277 1581301 1525989 1475167 1429693
62166 1429693 1389549 1353854 1321545 1291851 1264444 1239410 1217031 1197543 1181168 1168241 1158869
62155 1158869 1152264 1146663 1140282 1132566 1124511 1117652 1112462 1107752 1101873 1094568 1087342 1081950 1078975 1077987
62141 1077987 1078393 1079597 1080970 1082606 1085823 1092024 1101110 1111878 1123902 1138000 1154625 1172902 1191817
62128 1191817 1211415 1231976 1252801 1272894 1292507 1312798 1333987 1354862 1374401 1392924 1411172
62117 1411172 1429103 1446479 1464203 1484137 1507596 1534740 1565452 1599942 1638154 1679429 1723525
62106 1723525 1771539 1824864 1883090 1943484 2002575 2057698 2106947 2148463 2180462 2201858 2212584
62095 2212584 2213443 2205779 2190969 2169836 2142502 2108737 2068278 2021089 1968015 1911417 1854540 1799681
62083 1799681 1747119 1695976 1645798 1597220 1551666 1510650 1474815 1443313 1414711 1388712 1366173
62072 1366173 1347147 1330077 1313767 1298895 1286357 1275252 1264340 1254855 1249651 1249511 1252302 1256245
62060 1256245 1262081 1271219 1283409 1297477 1313005 1329924 1347226 1363332 1377190 1388154 1395528 1399406
62048 1399406 1401481 1403894 1407403 1411358 1414838 1416770 1415464 1409532 1399598 1388229 1377988 1370078 1364608
62035 1364608 1361162 1359041 1357933 1358707 1362775 1370372 1380128 1390808 1402953 1418275 1437798 1461088 1487150
62022 1487150 1515438 1545783 1577707 1610467 1643997 1679368 1717612 1758126 1798937 1838802 1878385
62011 1878385 1918913 1960307 2001295 2040958 2079479 2117692 2156452 2196099 2235819 2273667 2307784
62000 2307784 2337251 2361165 2377471 2383932 2380121 2367413 2347124 2319921 2287125 2250943 2212416 2170058
61988 2170058 2121564 2066493 2006626 1944241 1880803 1817058 1753636 1691569 1632496 1577929 1527787
61977 1527787 1480132 1433193 1387551 1345674 1309331 1278101 1250366 1224932 1201434 1179989 1161103
61966 1161103 1145497 1133144 1122500 1111303 1098494 1084957 1072102 1060072 1047840 1034825 1021585
61955 1021585 1008726 995907 982678 969902 959355 951749 945871 940187 934791 931262 930861 933539 938721
61942 938721 946270 956054 966847 976504 983608 988527 992360 995154 995869 994051 990596 986397 980899 972816
61928 972816 961958 949585 937014 924491 911497 897604 882945 868282 854685 842697 831797
61917 831797 821116 810718 801557 794072 787531 781128 775260 771242 769919 770841 772578 773733 774026 774633
61903 774633 777150 781946 787858 793672 799468 806149 814254 823953 835903 851096 869559 889829 910317
61890 910317 931071 953794 980122 1010199 1043054 1078157 1116148 1158038 1204087 1253826 1306830
61879 1306830 1362879 1421324 1480874 1540332 1599266 1657708 1715451 1771861 1826135 1877358 1924303
61868 1924303 1965525 1999911 2027261 2048235 2063467 2072676 2075027 2070637 2061356 2049491 2036131 2021504
61856 2021504 2006779 1994402 1986350 1983105 1984885 1992854 2008058 2029782 2055984 2085038 2115989 2147296
61844 2147296 2176589 2201948 2222438 2237006 2243850 2241652 2230777 2212372 2186653 2153168 2112914 2069171
61832 2069171 2025420 1982628 1939265 1893971 1847586 1802242 1759085 1717715 1677772 1640094 1605678
61821 1605678 1573926 1542686 1510203 1476770 1444464 1415463 1390631 1369386 1350733 1334373 1320886
61810 1320886 1310993 1305015 1303220 1306291 1314898 1328792 1346712 1367489 1391113 1418663 1451343 1489662
61798 1489662 1533408 1582174 1635756 1694093 1757124 1825067 1898792 1979339 2066499 2157933 2250103
61787 2250103 2340189 2426943 2509791 2587599 2658658 2721513 2775170 2818268 2848593 2864270 2865732
61776 2865732 2856102 2839187 2817369 2791889 2764767 2739378 2718689 2703700 2694234 2690772 2694640 2706323
61764 2706323 2724134 2744578 2763625 2777668 2783862 2780108 2764857 2737058 2696411 2643544 2579667 2506069
61752 2506069 2424156 2335921 2244044 2151325 2059948 1971079 1884933 1801357 1720693 1644098 1572806
61741 1572806 1507060 1445921 1388052 1332584 1279538 1229881 1185158 1146480 1113515 1084602 1057973
61730 1057973 1032783 1008988 986622 965547 945830 928084 913167 901406 892143 884198 876849 870207
61718 870207 864621 860056 856222 852982 850305 848220 847133 847802 850382 853855 857199 860962 866710 874823
61704 874823 883897 892805 902305 913698 926424 938068 946729 952687 957704 963261 969555 975598 980018
61691 980018 982031 981852 980069 976761 971519 964190 955120 944676 933058 920833 909043 898319 888187
61678 888187 877857 867582 858705 852231 847897 844868 842827 841774 840990 839055 835346 831119 828561 828727
61664 828727 830686 832641 833581 833764 834023 834919 836484 838403 840233 841461 841503 839816 836188 830972 825014 819226
61648 819226 814054 809164 803622 796608 788150 779085 770245 761867 753934 746725 740514 734805 728475 720894
61634 720894 712574 704555 697597 692127 688423 686205 684394 681991 679226 677254 676551 676167 674864 672592 670349
61619 670349 668830 667733 666492 665274 664903 665805 667210 667609 666147 663579 661691 661649 663041 664674 666056
61604 666056 667709 670036 672448 673995 674570 675080 676499 679196 683127 688135 693856 699773 705747 712245 719667
61589 719667 727704 735766 743890 752689 762376 772373 781948 790764 798599 805096 810216 814516 818404 821318
61575 821318 822234 820965 818476 815770 812847 808894 803205 795820 787537 779444 772152 765310 758105 750244
61561 750244 742175 734321 726693 719545 713772 709994 707562 705193 702366 699344 695860 690722 683093 673388
61547 673388 662509 650807 638418 626008 614380 603567 593077 582874 573382 564520 555640 546666
61535 546666 538602 532367 527544 522815 517487 512218 508242 506066 504917 503360 500537 496827 493235 490215
61521 490215 487384 484307 481071 477982 475139 472641 470846 469992 469757 469559 469199 468866 468526 467766 466421 465148
61505 465148 465063 466644 469097 471060 472043 472927 474803 477620 480351 482211 483128 483279 483030 483353 485244 488258
61489 488258 490509 490776 489973 489898 491232 493492 496296 499593 502999 505965 508549 511147 513654 515855 518484
61474 518484 522728 528535 534446 539374 543515 547114 549419 549604 548039 545947 544250 543216 542584 541471 538797
61459 538797 534534 530076 526690 524128 521612 519662 519697 521799 524067 524689 523975 523779 525350 528202 530876
61444 530876 532434 533297 534840 538094 542697 547271 550916 554112 557890 562398 566813 570662 574559 579111
61430 579111 583462 585764 585176 582737 580039 577799 576217 575831 576880 578220 578320 577509 577982 580960 584873
61415 584873 587177 587234 586445 586092 586232 586548 587165 588267 589575 590559 590745 589691 587149 583520 579799 576722
61399 576722 574179 571749 569665 568883 570054 572646 575376 577626 580114 583847 588654 593290 596974 600118
61385 600118 603393 606841 610479 615089 621488 629270 637155 644649 652635 662102 672807 683455 692867 700772
61371 700772 707690 714162 720065 724858 728684 732800 738401 745268 752173 758474 764571 770870 777115 782910
61357 782910 788123 792486 795452 796746 796499 794682 791248 787110 783905 781902 778944 772585 762876 752078
61343 752078 742064 733219 725628 719732 715322 711134 706306 701440 697541 694586 691994 689794 688308 687044
61329 687044 685108 682713 681243 681560 683111 684964 686888 688993 691144 693364 696171 699839 703868 708042
61315 708042 713444 721324 731040 740245 747370 753029 758659 764621 770193 774757 778351 781503 785188 790637
61301 790637 798340 807167 815119 821248 826630 833298 842456 853808 866391 879710 894002 909720 927222
61288 927222 946897 968838 991774 1012836 1029453 1041706 1052114 1062903 1074056 1084151 1092135 1097863
61276 1097863 1101761 1104754 1107823 1110781 1111997 1110261 1106507 1102580 1098526 1092380 1082889 1071458 1060812
61263 1060812 1052394 1045621 1039281 1033029 1027472 1023073 1019263 1014930 1009863 1005190 1001965 999736 997192 994015
61249 994015 991314 990217 990786 992482 995065 998737 1003716 1009725 1015539 1019140 1018902 1014733 1007687 998749 988650
61234 988650 978559 969751 962306 955020 947027 938795 931250 924756 919345 915108 911915 909478 908275 909609
61220 909609 914047 920435 927155 933788 940887 948860 958015 969198 983234 999883 1018185 1037612 1058021
61207 1058021 1078688 1098488 1117167 1135620 1154870 1175522 1198135 1223100 1249774 1276669 1302926
61196 1302926 1328843 1354364 1377700 1396301 1409006 1416746 1421334 1424074 1425282 1424365 1420098 1411369 1398192
61183 1398192 1381946 1364356 1346174 1327056 1306766 1286121 1266412 1248019 1230114 1211903 1193693
61172 1193693 1176378 1160235 1144796 1129854 1116076 1104429 1095261 1088065 1081993 1076520 1071717 1067885
61160 1067885 1064780 1061260 1055986 1048603 1040175 1032274 1025624 1019654 1013427 1006976 1001460 997790 995350 992503
61146 992503 988364 983602 979433 976407 974459 973574 973916 975637 979061 984787 993200 1004208 1017846 1034626
61132 1034626 1054446 1075485 1095090 1111827 1125937 1137832 1147214 1154022 1159309 1164364 1169423 1173830
61120 1173830 1177161 1179600 1181473 1183005 1184416 1185704 1186386 1185947 1184589 1183039 1181496 1179284 1175797 1171268
61106 1171268 1166177 1160236 1152623 1143105 1132301 1120778 1108604 1096084 1084158 1073349 1062840 1051667
61094 1051667 1040726 1032520 1028453 1027151 1026055 1024191 1022805 1023528 1026407 1029467 1029775 1025198 1015725 1003108
61080 1003108 989091 974248 958755 943615 930286 919289 909949 901553 894076 887652 882036 877023
61068 877023 873059 871081 871846 875397 880932 887182 893377 900032 908493 919406 931901 944578 957096
61055 957096 970368 985159 1000984 1016781 1032347 1048491 1065608 1082829 1099156 1114855 1130768
61044 1130768 1146400 1159833 1169917 1177561 1184216 1189785 1192837 1192422 1188861 1183040 1175698 1167286 1157839
61031 1157839 1146956 1134374 1120527 1106328 1092623 1080144 1069434 1060314 1051802 1043253 1035193 1028408
61019 1028408 1022668 1017245 1012418 1009475 1009142 1010781 1013192 1015509 1017294 1018518 1019774 1022176 1026889 1034766
61005 1034766 1045958 1059459 1073580 1087638 1102800 1120489 1140373 1160889 1181496 1203327 1227691
60994 1227691 1254886 1284543 1316182 1349343 1383946 1420647 1460262 1502963 1548586 1597303 1649177
60983 1649177 1703576 1760192 1820315 1885887 1957458 2034175 2115508 2201740 2293023 2389324 2491244
60972 2491244 2599700 2715133 2838304 2971219 3115376 3269431 3430507 3597568 3771673
60963 3771673 3953665 4144451 4347353 4567067 4805874 5063973 5344091 5652481 5994444
60954 5994444 6372492 6790373 7255465 7775518 8356715 9007113 9738270 10561019 11483421
60945 11483421 12515620 13672706 14970788 16427673 18073624 19955456 22122938 24617443
60937 24617443 27476487 30716545 34252610 37806717 40935742 43226639 44522314 44981456
60929 44981456 44937407 44716120 44564432 44658767 45066254 45643655 46013758 45723424 44490504
60920 44490504 42336806 39517490 36348899 33087882 29908676 26921556 24184053 21709190
60912 21709190 19484927 17493890 15719542 14145030 12755251 11538697 10483196 9571306
60904 9571306 8782303 8096628 7496529 6965680 6491752 6067825 5688818 5348315 5040985
60895 5040985 4765700 4522951 4310328 4122900 3956562 3808349 3674622 3551664 3437329
60886 3437329 3330029 3227314 3127922 3034047 2948763 2871706 2799735 2731157 2666702 2606829 2550841
60875 2550841 2498525 2449999 2403819 2357821 2312251 2269796 2231904 2197063 2163122 2129374 2095711
60864 2095711 2061574 2026554 1990677 1953539 1914381 1873299 1831104 1787907 1743369 1698443 1655135
60853 1655135 1614205 1574748 1536365 1499994 1466177 1434412 1404817 1378490 1355348 1333420 1311455
60842 1311455 1290474 1271554 1253753 1235828 1218457 1202852 1188270 1172883 1156559 1140856 1126551
60831 1126551 1112877 1099158 1085565 1072047 1057892 1042810 1027385 1012048 996527 980804 965830
60820 965830 952583 940715 928598 914638 898465 881196 864827 851078 840352 831570 823043 813696
60808 813696 803675 793900 785013 776848 768987 761546 754961 749058 742985 736308 729672 723963 719207 714764
60794 714764 710365 706364 703015 700066 697221 694634 692598 690925 688853 685595 680910 675295 669821 665644
60780 665644 663262 661975 660238 656835 651764 646012 640770 636944 634839 633673 631840 628583 625305 624191
60766 624191 625401 626837 627143 627657 630360 634815 638547 640099 640501 641731 644696 648744 652331 653948 653039
60751 653039 650253 646698 643251 640772 640149 641238 642305 641550 638872 635228 630850 625356 619163 613166 607057
60736 607057 599696 591469 584589 580273 577068 572911 567690 562557 557649 551914 544932 537768 531928 528073
60722 528073 525766 523886 521233 517113 511677 505946 501615 500335 502427 506274 509624 511551 512678 513760
60708 513760 515069 517041 520188 523954 526809 528191 529391 531852 535475 539404 543620 548740 554750 560923
60694 560923 566760 572244 577364 582038 586328 590230 593515 596091 598172 599718 600236 599531 598072 596103 593109
60679 593109 588860 584253 580166 575972 570292 562943 555088 547611 540400 533285 526586 520444 514479 508667
60665 508667 503965 501444 501022 501454 501487 500755 499631 498522 497485 496424 495291 493919 491991 489588 487521
60650 487521 486492 486038 485109 483715 483072 483741 484545 483992 482042 479758 477945 477078 477959 481112 485517 489056
60634 489056 490647 491370 493147 496696 501075 505009 508401 512451 518246 525415 532469 538319 543033 547210
60620 547210 551472 556685 563691 572182 580505 587231 592385 596706 600424 603491 606180 608480 609422 608034
60606 608034 604558 599764 593580 585587 576628 568669 562948 559113 556108 552973 548913 543719 538318 533995
60592 533995 531087 529325 529280 531947 536534 540132 540513 538401 536154 534840 533459 530601 526095 521093 516947
60577 516947 513873 510699 506297 501291 497642 496347 496383 496341 496180 496594 497397 497682 497314 497164 497779 498613 498821
60560 498821 498222 497259 496573 496928 499134 503495 509377 515533 520874 524912 527688 529626 531404 533604 536267
60545 536267 538891 541009 542661 544154 545563 546827 548237 550477 554116 559311 565869 573082 579530 583956
60531 583956 586758 589900 594641 599793 603097 603994 604201 605709 609128 613972 619475 624715 628905 632356 636682
60516 636682 643237 651598 660234 668596 677830 689252 702793 717479 733166 751041 772184 796122
60504 796122 821195 845930 869390 890451 907794 921015 930978 938428 942915 943859 942166 939702 937268
60491 937268 934277 930803 929046 931998 941034 955391 973693 995247 1019941 1047653 1078420 1113027
60479 1113027 1152870 1198953 1250984 1307247 1364960 1420761 1471626 1516010 1553802 1584505 1605797
60468 1605797 1614863 1611280 1597701 1577579 1553201 1526198 1498482 1471488 1445123 1418627 1392270 1367553
60456 1367553 1346170 1329487 1318463 1313040 1311932 1314030 1319816 1330502 1346089 1365511 1388713 1417446
60444 1417446 1453637 1497807 1549381 1607787 1672979 1745367 1825395 1912620 2005134 2100471 2196995
60433 2196995 2293648 2388346 2477563 2557933 2627899 2688006 2740410 2787999 2832708 2874015 2909396
60422 2909396 2936137 2951679 2952266 2933018 2890612 2825354 2739927 2637011 2519260 2390999 2258352
60411 2258352 2127137 2001051 1881845 1770417 1667270 1572408 1485441 1406008 1333963 1269089
60401 1269089 1210831 1158570 1112107 1071571 1036672 1006286 978959 953587 929578 906868 886125
60390 886125 868351 853606 840413 826971 812753 798515 785164 773310 763440 755620 749184 743409
60378 743409 738309 734095 730358 726682 723540 721314 718829 714362 708105 702034 697104 692142 685980 679127
60364 679127 672523 666042 659365 653285 648840 645646 642206 637736 632964 629289 627544 627324 627232 626075 624045
60349 624045 622352 621712 621800 622156 622756 623547 624289 625105 626330 627736 628912 630445 633379 637219 640088 641464
60333 641464 643099 646284 649835 652198 654004 656682 659643 661004 660714 660859 662761 665466 667479 668589 669427
60318 669427 670380 671643 673646 676687 680340 683609 685782 687185 689020 692120 695836 698701 700303 701700
60304 701700 703759 706163 708685 712213 717332 722821 727096 730677 735669 742877 750906 758362 765647 773966
60290 773966 783480 793217 802425 811377 820699 830053 837654 841465 840990 837613 833222 828958 825153 821456
60276 821456 816726 810014 802279 796047 792522 790180 787191 784035 782231 781455 779770 776283 771888 767587
60262 767587 763673 760510 758576 757638 757257 758145 761631 767743 775214 783518 793439 805421 818903 833731
60248 833731 850774 870588 892858 917866 947067 981066 1017768 1053302 1084114 1107761 1122769
60237 1122769 1128714 1125927 1114626 1095085 1069043 1039806 1010042 980256 950237 921052 894459 871016
60225 871016 850023 830996 814047 798991 785272 772889 762463 754167 747357 741486 736639 732788
60213 732788 729132 724823 720046 715739 712257 708883 704955 701029 698352 697355 697339 697684 698492 699576 699716 697966
60197 697966 695369 694120 694913 696085 695704 693647 691148 689087 687458 686125 685304 685285 686115 687600 689363 690905
60181 690905 691863 692311 692779 693872 695716 697750 699323 700619 702732 706507 711518 716541 720881 724881 729189
60166 729189 733858 738217 741587 744238 747495 752418 758358 763617 767744 772154 777938 784151 789340 793851
60152 793851 799219 805884 813034 820438 828789 838131 847290 855161 861478 866266 869782 873091 877264 881599
60138 881599 883984 883640 882345 882418 884614 888458 893331 898402 902601 905651 908338 910995 912647 912517 911395
60123 911395 910491 909782 908708 907769 908054 909482 910966 912371 915090 920164 926568 931906 934676 935641 936908
60108 936908 939560 942327 942978 940955 937911 935549 933896 932181 930443 929384 929179 929393 929745 930251 930874 931747
60092 931747 933475 936507 940466 944790 949834 956526 964936 973877 981933 988263 992504 994748 996042 998263
60078 998263 1002784 1009249 1016129 1022718 1030288 1040822 1054553 1069267 1082350 1093013 1102025 1109999 1117062
60065 1117062 1123858 1131374 1139424 1146497 1151635 1155432 1158725 1161491 1163850 1166974 1171813 1177612 1182942 1187803
60051 1187803 1193604 1201273 1210336 1219773 1228927 1237504 1245141 1251022 1253930 1253370 1250942 1249478 1249983 1250372 1248331
60036 1248331 1244465 1241105 1238791 1235952 1231894 1227958 1225296 1223468 1222139 1222477 1225314 1228930 1230186 1227490
60022 1227490 1221556 1213551 1203799 1192421 1180136 1167815 1155696 1143417 1130529 1116670 1101411 1084355
60010 1084355 1065589 1045923 1026604 1008726 992834 978863 966214 953989 941559 929178 917753
59999 917753 907703 898219 888105 877301 867119 858853 852574 847474 842932 838723 834504 829879 825158
59986 825158 821315 818637 815931 811939 807403 804618 804609 805677 805546 804267 804065 806572 811079 815360 817360
59971 817360 816222 812650 808560 805688 804237 803194 801629 798955 794417 787770 780603 775518 773381 772427
59957 772427 770740 768531 767238 767408 768450 769639 770344 769939 768526 767242 766860 766560 765067 762538 760228
59942 760228 758620 757004 754753 751820 748026 743028 737399 732762 730252 729303 728368 726640 724867 724615 726806
59927 726806 730909 735692 740703 746461 753012 759041 763102 765225 766615 768200 770286 773200 777165 781539
59913 781539 785201 787944 790801 794716 799378 803597 806467 808034 809185 810973 813809 817362 821338 826025
59899 826025 831619 837316 841608 843422 842600 839597 835335 831154 828068 825830 823161 819131 814160 809672
59885 809672 806980 806417 807319 808803 810480 812205 813395 813378 812606 812630 814311 816746 818675 820389 823454 828867
59869 828867 836155 844057 851596 858729 866399 875540 885809 895987 906003 917608 932271 949287 966790
59856 966790 983761 1000048 1015384 1029774 1044036 1058485 1071627 1081663 1088808 1094592 1099443 1102740
59844 1102740 1104821 1106726 1107932 1106536 1102189 1096892 1092171 1087292 1081099 1073930 1066730 1059865 1053914 1050054
59830 1050054 1048191 1046063 1041920 1037183 1034648 1034637 1034844 1033977 1033700 1036273 1041552 1047329 1052088 1056424 1061720
59815 1061720 1068162 1074606 1080183 1085348 1091002 1097141 1102927 1107725 1111381 1113829 1115299 1116752 1119160 1122308
59801 1122308 1125168 1127384 1129337 1130699 1130297 1127925 1125169 1123704 1123560 1123676 1123372 1122683 1122049 1122442 1125149 1130608
59785 1130608 1137741 1144777 1150167 1152429 1150188 1143316 1133508 1123049 1113536 1106255 1102586 1102554 1103408 1101124
59771 1101124 1093702 1082330 1069362 1056057 1042425 1028410 1014519 1001492 989721 979153 969834 962307
59759 962307 957110 953879 951543 949656 948904 949882 951888 953499 953937 953291 951734 949235 945957 942346 938750
59744 938750 935271 931892 928420 924464 919902 915296 911443 908419 905379 901357 896124 890244 884455 879097
59730 879097 874188 869903 866679 864649 863278 861986 860854 860184 859551 858035 855400 852288 849168 845899 842577
59715 842577 840023 838985 839448 841015 843317 845715 847408 848541 850579 854788 860649 866483 871547 876976
59701 876976 884619 895083 906798 917068 924486 930355 937117 945430 953671 960534 966927 974596 983859
59688 983859 993623 1002747 1010300 1015219 1017229 1017879 1019183 1021087 1021432 1018828 1014463 1010576 1007965 1005711 1002655
59673 1002655 998266 992399 985237 977654 970896 965309 959730 952710 944315 936178 929769 925227 922123 920452
59659 920452 920069 919756 918067 915194 912978 912849 914424 916394 918065 919873 923100 929353 939497 952617
59645 952617 966550 979750 992166 1004281 1016228 1028198 1040742 1054019 1067456 1080699 1094080
59634 1094080 1107429 1119210 1127807 1133210 1136653 1139010 1140327 1140505 1139524 1137128 1133143 1128155 1123412 1120009
59620 1120009 1118338 1117905 1117362 1115224 1111089 1105850 1100407 1094774 1088798 1082943 1077563 1072172 1066424 1061364
59606 1061364 1058640 1058617 1060123 1061882 1063489 1065237 1067794 1071977 1078120 1085750 1094358 1104134 1115212 1126577
59592 1126577 1136619 1144652 1151118 1156391 1160082 1161364 1159258 1152935 1142702 1130564 1118718 1107334 1094612
59579 1094612 1079217 1061850 1044238 1027374 1011205 995495 980487 966854 955111 945032 935743
59568 935743 926547 917428 908560 899860 891412 883673 876446 868137 857083 843527 829494 816853 806249
59555 806249 797525 790045 782615 774302 765559 757697 751114 745112 739648 736011 735001 735323 734622 731712 727295
59540 727295 722988 720180 719452 720437 722217 724056 725605 726506 726361 725203 723435 721096 717835 714006 711025
59525 711025 709961 710159 710003 708878 707625 706957 706099 703473 698551 692631 687622 684301 681986 679734 677308
59510 677308 674803 672080 669283 667528 668016 670276 672151 672067 670757 670274 671683 674291 676856 678883 680750
59495 680750 683185 686789 691726 697593 703789 710178 717265 725619 735338 746199 758002 770507 783401
59482 783401 796894 812158 830414 851532 874276 898005 922887 947592 967912 979404 981495 978006
59470 978006 973633 970835 969891 970346 971633 973223 974954 976875 978567 979269 978856 977901 976588 974442 971277
59455 971277 967220 961417 952129 938976 923961 909277 895124 880748 866608 854013 843134 832826
59443 832826 822402 812514 804253 798008 793093 788081 782037 775906 771946 771027 771314 770550 768787 767714 768067
59428 768067 769168 770562 772643 775717 779668 784396 789575 794241 797754 800900 804926 809779 814420 818456
59414 818456 822070 824639 825054 823459 821259 819319 817481 815831 814876 814258 812878 810850 809998 811716 815340
59399 815340 819189 822353 825000 827746 831089 834880 838324 841250 845118 851568 860038 868088 874169 878704
59385 878704 882423 885199 886861 887542 886747 883603 878600 873480 868710 862759 854975 847448 842510 839694 836824
59370 836824 833236 830238 828962 829414 831353 834640 838703 842895 847598 854109 863354 875416 890171 907392
59356 907392 926240 945826 966881 992048 1023285 1058665 1092166 1117074 1129750 1130459 1121699 1106961
59344 1106961 1090776 1077852 1070757 1069260 1072994 1083364 1100696 1120091 1132798 1132662 1120009 1099192
59332 1099192 1074468 1049017 1025518 1005424 988233 972886 959520 949106 942097 938287 937269 938068
59320 938068 939079 939448 940158 942921 948304 955466 963144 970330 976749 983413 992012 1002950 1014607 1025258
59306 1025258 1034956 1044714 1054660 1064123 1072880 1081125 1088707 1095586 1102747 1111534 1122178 1133883 1146042
59293 1146042 1158512 1171080 1183797 1197534 1212942 1228832 1242890 1254346 1265008 1277293 1291947
59282 1291947 1307929 1323670 1337977 1350393 1361341 1371676 1381657 1390518 1397318 1402017 1405275 1407179
59270 1407179 1406667 1402678 1395741 1387818 1380328 1372945 1364834 1356331 1348296 1340211 1330413 1318507 1306193 1295142
59256 1295142 1285289 1276069 1268113 1262368 1258181 1253765 1248485 1243516 1240194 1238689 1238576 1239797 1242370 1245590
59242 1245590 1248282 1250178 1252786 1258458 1268559 1282850 1300554 1320759 1340791 1355108 1357832 1346977
59230 1346977 1325288 1297032 1265342 1232719 1201882 1174556 1150429 1128517 1108828 1091775 1076932
59219 1076932 1063706 1052575 1044379 1038746 1034394 1030736 1028178 1027081 1027384 1029107 1032312 1036637 1041610 1047290
59205 1047290 1053870 1060725 1066469 1069847 1070274 1067932 1063864 1059544 1055620 1051367 1045905 1039550 1033388 1028014
59191 1028014 1023377 1019359 1015743 1011988 1007886 1004114 1001335 998964 995620 990770 985366 980957 978505 977791
59177 977791 977580 976713 975353 974734 975503 977026 978572 980153 981716 982680 983146 984476 987517 991142 993771 995571
59161 995571 997829 1000789 1003526 1005585 1007445 1009627 1012387 1015901 1019638 1022085 1022415 1022028 1023168 1026331 1030291
59146 1030291 1034146 1037821 1040959 1043159 1045303 1048943 1054149 1059462 1064186 1069076 1074399 1078907 1081554 1082982
59132 1082982 1084557 1086876 1089829 1093235 1096839 1100454 1104578 1110025 1116582 1122909 1128269 1133487 1139550 1146093
59118 1146093 1151882 1156186 1158970 1160238 1159911 1158159 1155430 1152266 1149265 1146934 1145426 1144684 1144808 1145827 1147173
59103 1147173 1148067 1148588 1149767 1152260 1155403 1157904 1159191 1159775 1160448 1161304 1161557 1160353 1157654 1154050 1149784
59088 1149784 1144669 1139135 1134296 1130139 1124511 1115240 1103005 1090866 1080889 1072332 1063346 1053498 1044095
59075 1044095 1036573 1031004 1026015 1020142 1013453 1007673 1004467 1003928 1005077 1007337 1011025 1016749 1024888 1035240
59061 1035240 1046784 1058366 1070036 1082883 1097040 1110982 1123714 1136411 1150513 1165305 1179120
59050 1179120 1192128 1205958 1220957 1235753 1249437 1262387 1274973 1287139 1299173 1311142 1321529
59039 1321529 1328241 1331025 1331164 1328952 1323763 1316798 1311121 1307957 1305139 1300477 1294667 1289476 1284875 1279678
59025 1279678 1273538 1266416 1257076 1244044 1227665 1209794 1191769 1173827 1156066 1138706 1121537 1104104
59013 1104104 1086471 1069273 1053305 1039445 1028383 1019759 1012103 1004204 996081 988167 980323 972327 964585
59000 964585 957479 950621 943655 937296 932571 929293 926250 922765 919206 915994 912985 910158 908332 908666
58986 908666 911473 915809 920418 925007 930246 936400 942545 947707 952373 958103 965850 975333 985843 996804
58972 996804 1007741 1018629 1030175 1042911 1056187 1069140 1082432 1097817 1116155 1137165 1160976
58961 1160976 1188076 1217391 1246205 1272722 1297295 1320470 1341299 1358363 1370992 1378673 1380813 1378242
58949 1378242 1373587 1368886 1363922 1357879 1351172 1344328 1336651 1328012 1320805 1317725 1317929 1317472 1313577 1306692
58935 1306692 1298223 1288184 1275883 1261598 1246509 1231426 1216154 1199907 1182200 1163610 1145543
58924 1145543 1128905 1113205 1097435 1081633 1067064 1055075 1046303 1040660 1037334 1034878 1032091 1029074
58912 1029074 1027045 1027024 1029023 1032508 1037264 1043504 1051131 1059021 1065434 1069537 1072323 1075461 1079325 1082779
58898 1082779 1084736 1084985 1083507 1080201 1075717 1071361 1067363 1062135 1054082 1043492 1031938 1020593 1010065
58885 1010065 1001204 994816 990744 988136 986524 985916 985947 985692 984427 982124 979130 975637 971473 966383 960640
58870 960640 955123 950281 945281 939190 933086 929703 930320 932945 934334 933082 930057 926670 923739 921511
58856 921511 919760 918048 916474 915864 916688 918290 919719 920783 921804 923070 925350 930209 938699 949951
58842 949951 961936 973410 984416 995192 1005661 1016049 1027137 1039354 1051948 1063406 1072905 1081344
58830 1081344 1090676 1101972 1114509 1127213 1140428 1155293 1171809 1188758 1205354 1221463 1236221
58819 1236221 1248224 1257533 1265772 1273569 1279704 1283644 1286999 1291102 1294930 1297211 1299121 1302814 1308191 1313136
58805 1313136 1316277 1317564 1316634 1312671 1305918 1297619 1288289 1277342 1264314 1249271 1232208 1213463 1194556
58792 1194556 1177131 1161030 1144864 1128540 1113792 1101874 1092061 1082829 1073351 1063316 1052341 1040382
58780 1040382 1028199 1016831 1006765 997725 988956 979779 970252 961167 953043 945461 937852 930509 924092
58767 924092 918502 913048 907503 902298 897839 894189 891128 887982 883972 879479 876374 876114 877952 879961
58753 879961 881227 881839 881304 878663 874296 870189 867990 867714 868485 869466 869761 868465 865435 861521 857674 854267
58737 854267 851386 849277 848315 848847 851012 854326 857633 860030 861792 863916 866978 870967 875992 882412 890221
58722 890221 898850 907724 916788 926638 938265 952210 967548 982022 993586 1001555 1006286 1008564 1009645
58709 1009645 1010867 1012347 1012681 1010613 1006373 1000881 994561 987739 981210 975304 969186 962210 955244 949502
58695 949502 944865 940737 937828 937395 938963 940309 939797 937671 935279 934141 935513 939573 944982 950216 955206
58680 955206 960889 967716 975674 985191 996555 1008751 1020348 1031447 1043372 1056520 1069951 1083131
58668 1083131 1096709 1111237 1126248 1140884 1154581 1167030 1178302 1188970 1199352 1208955 1217565 1226380
58656 1226380 1236698 1247740 1257297 1264573 1270941 1277597 1283727 1287382 1287133 1282445 1273347 1260261 1243683
58643 1243683 1223908 1201375 1176964 1151336 1124326 1095739 1066306 1037090 1008474 980689 954691
58632 954691 931317 909989 889476 869691 851578 835633 821635 809419 798717 788761 779331 771597
58620 771597 766494 762831 758685 754185 751135 750234 750536 751417 753103 755292 757322 759938 764830 771997 779393
58605 779393 785760 792065 799440 807299 814358 820231 825156 829080 831695 832653 831402 827617 821946 815604
58591 815604 809210 802806 796662 790975 785103 778465 771938 767024 763746 760673 756779 752015 746496 740697
58577 740697 736015 733383 731608 728843 725253 722203 719382 715223 709976 705657 702707 699562 696159 695099
58563 695099 698123 703649 708962 712877 715248 715976 715796 716373 718485 721539 725520 731361 738497 744251 747098
58548 747098 748691 751216 754387 756612 757628 758378 759506 761481 765147 770670 776766 782069 786487 790430
58534 790430 793804 796615 799395 802177 804332 806324 810261 817581 827483 838691 851391 866075 881675
58521 881675 896440 909967 923084 936287 949358 962022 974202 986129 998696 1012929 1028751
58510 1028751 1045278 1062692 1082499 1105303 1129702 1154260 1179395 1206379 1235580 1266502 1298463
58499 1298463 1330316 1360451 1387911 1412719 1434578 1452256 1464816 1472525 1476171 1476515 1474467 1470307
58487 1470307 1462490 1449013 1430474 1410031 1389738 1368823 1346230 1322585 1298299 1271765 1241371
58476 1241371 1208111 1174796 1143604 1115481 1090667 1068552 1047990 1028769 1011839 997493 984623
58465 984623 972480 961658 952615 944882 938603 934981 933990 933379 931235 927967 924507 920418 915357 910735
58451 910735 907967 906247 903838 900640 897939 896465 896056 896531 897660 898944 900255 901927 903675 904639 905049
58436 905049 906389 909229 912503 915591 919356 924310 929768 935779 943770 954117 965226 976305 988716
58423 988716 1003007 1017009 1028891 1040017 1052632 1066708 1081252 1096743 1113662 1130161 1143706
58412 1143706 1153866 1161170 1164690 1163380 1158674 1153042 1146694 1138277 1128292 1119232 1112270 1105888 1098107 1088798
58398 1088798 1079849 1073943 1072684 1075044 1078270 1080838 1083465 1086771 1089782 1091728 1093374 1095178 1095880 1094386
58384 1094386 1091265 1086953 1080470 1071679 1062916 1056456 1052017 1048538 1046407 1045980 1046055 1046222 1048798 1055733 1065170
58369 1065170 1073737 1080925 1088762 1098519 1110108 1123315 1137140 1149300 1158908 1168259 1179442 1190677
58357 1190677 1198670 1203127 1205844 1206661 1203793 1197621 1191001 1185813 1181602 1177361 1172441 1166149 1158593 1151589
58343 1151589 1147032 1144905 1144232 1144724 1145956 1146670 1146901 1149083 1154810 1162219 1168914 1175520 1183541 1191576 1197033
58328 1197033 1200257 1203698 1207928 1211488 1213825 1215608 1217051 1218561 1221923 1228149 1235283 1240953 1245764 1251513
58314 1251513 1257813 1263582 1270237 1279917 1291767 1303370 1314607 1326697 1338778 1349163 1358841 1369871
58302 1369871 1381236 1390230 1397382 1406136 1417847 1430558 1442463 1453363 1463110 1471740 1480746 1491271
58290 1491271 1501695 1509828 1516465 1523868 1532059 1539960 1548679 1559933 1572474 1583983 1595385 1609339
58278 1609339 1625522 1641549 1657627 1676040 1696652 1717000 1736256 1755277 1773658 1790735 1808425
58267 1808425 1828769 1849648 1867284 1881878 1896206 1909919 1920553 1929411 1940810 1955503 1970129
58256 1970129 1983324 1997293 2013013 2028913 2044827 2062567 2082221 2102386 2124305 2151083 2182524
58245 2182524 2215284 2248289 2283338 2320138 2355593 2388546 2420799 2453148 2484676 2516055 2549121
58234 2549121 2583308 2616875 2651257 2689590 2731526 2774370 2818483 2866214 2916375 2965639 3014915
58223 3014915 3068243 3125825 3184419 3244388 3309602 3380172 3451953 3523809 3598800 3677628 3757689
58212 3757689 3839583 3927873 4024020 4124644 4227959 4336055 4450165 4569738 4696726 4834492
58202 4834492 4981936 5134873 5293429 5461552 5639300 5822565 6010360 6205065 6405611
58193 6405611 6608296 6814546 7030102 7256431 7491064 7736198 7998083 8277616 8570459
58184 8570459 8876620 9200795 9543478 9901759 10278958 10682780 11113697 11566439 12043472
58175 12043472 12555018 13104701 13687682 14304601 14964490 15671840 16424071 17224374 18083533
58166 18083533 19005924 19987102 21028215 22139069 23324216 24580904 25914379 27340328
58158 27340328 28869001 30502633 32251835 34137649 36173927 38365724 40729179 43294274
58150 43294274 46084489 49114965 52416386 56040646 60040940 64472096 69414490 74966756
58142 74966756 81204128 88171104 95924006 104553983 114168107 124890719 136891937 150364889
58134 150364889 165456378 182271668 200976953 221863374 245310391 271717768 301311426
58127 301311426 333557589 366342517 395773886 417305555 427673633 426223098 414751233
58120 414751233 396303818 373926282 349916316 325585121 301432763 277603231 254294902
58113 254294902 231838177 210531561 190548726 172005091 155010980 139624038 125810679
58106 125810679 113485622 102551421 92886364 84341595 76780747 70101292 64207385 58991948
58098 58991948 54359502 50240634 46570621 43276856 40299626 37604213 35160652 32929774
58090 32929774 30878754 28991976 27256190 25650741 24160704 22783559 21513987 20336253
58082 20336253 19238894 18222312 17284434 16412982 15599391 14846323 14152910 13505004 12888281
58073 12888281 12299869 11739788 11202384 10684323 10190969 9726814 9287906 8869984 8475346
58064 8475346 8105560 7755893 7422840 7108969 6814846 6534369 6263578 6006160 5765053
58055 5765053 5536477 5317312 5110298 4916549 4730665 4548908 4374800 4211028 4052965
58046 4052965 3896071 3743009 3597491 3457203 3318841 3184626 3058081 2938202 2823108
58037 2823108 2714875 2615767 2523787 2436362 2354457 2279342 2209473 2143977 2084719 2031725 1981277
58026 1981277 1931754 1886333 1846595 1808612 1769071 1730150 1694329 1659205 1621721 1583289 1546610
58015 1546610 1511233 1475865 1441331 1407875 1373369 1337420 1303424 1273501 1245414 1217381 1191658
58004 1191658 1170144 1150650 1130822 1111749 1094486 1077122 1058536 1040988 1025617 1009394 989978
57993 989978 969666 951150 933267 914414 896262 880485 865491 849964 836002 825145 814925
57982 814925 803019 791222 781580 772111 760252 747295 735503 724029 711646 700427 692537 686038
57970 686038 677859 668507 660044 651793 641785 630361 618843 606716 593264 579802 567343 554609
57958 554609 541340 530619 524454 519770 512407 502645 493346 485275 478034 472959 470930 469292 464958 458780
57944 458780 453321 448381 442612 437529 435677 436275 436637 436624 437787 439374 439214 437873 438148 440853 444256 447172
57928 447172 449747 451870 453557 456081 460082 463525 464087 462413 460411 457710 452742 446189 440296 435637
57914 435637 431231 426933 423055 418649 412880 407169 403477 401509 399976 399176 399661 399836 397882 394836 392771
57899 392771 391192 388367 385045 383401 383093 381759 378928 376288 374503 372909 372022 373236 375989 378092 378944
57884 378944 379969 381980 384481 387365 390879 394119 395989 397599 401489 408536 417526 427385 437731 447667
57870 447667 456195 463611 470692 477012 481842 485825 489709 492395 492490 490867 489292 487399 483571 478030 472362
57855 472362 466718 460252 453707 448668 444548 439171 432183 425277 419283 413677 408614 404558 400033 392837
57841 392837 383723 376049 371317 367701 363366 358636 354308 350329 346909 344728 343353 341466 339223 338372
57827 338372 339506 341087 341704 341559 341415 341816 343566 347034 350738 352500 352259 351898 352205 352073 350905 349533
57811 349533 348305 346406 343726 341356 339555 337142 333754 330941 330130 330877 331793 331843 330450 327896 326137
57796 326137 327618 332666 339290 345751 351707 356730 359796 361101 362646 365934 370335 374439 377772 380389
57782 380389 381928 381796 379581 375001 368425 361515 356114 352185 347984 342504 336627 331751 328480 326608
57768 326608 325042 321751 315448 307594 301295 297938 296358 295375 295358 296806 299137 301710 304606 307644 309800
57753 309800 310369 309686 308201 305858 302779 299453 295805 291145 285494 280001 275637 272293 269340 266238 262598
57738 262598 258750 256261 256698 259783 263785 267604 271254 274577 277069 278987 281013 282765 283233 282740 282699
57723 282699 283220 282901 281454 280674 282025 284870 287783 290086 291432 291517 291181 292396 296115 301089 305466 308414
57707 308414 309716 309165 307168 304754 302256 299057 295171 291682 288883 285401 280159 274061 268691 264378
57693 264378 260512 256911 253886 251640 250467 250979 253437 257297 261827 266609 271190 274960 277523 278538
57679 278538 277318 273743 269544 267299 267851 269821 271676 272854 272883 271325 269069 267798 267478 266139 262921
57664 262921 259467 257292 255635 253280 250748 249033 247567 245233 242374 240124 238580 237194 236134 235623
57650 235623 234538 231348 226230 220898 216559 213179 210441 208296 206756 206101 206940 209073 210716 210071 207447
57635 207447 204710 202789 200948 198607 196673 196466 198058 200344 202527 205027 208716 213445 217844 220924
57621 220924 223477 227200 232764 239769 248475 260103 274945 291579 309039 328767 353156 382616
57609 382616 415372 450133 487819 530002 575714 619939 655437 676505 681452 671896 650388 619257
57597 619257 581134 539307 497203 457788 423028 392972 365719 339577 315266 294998 279610
57586 279610 268056 259450 253650 249596 245273 240322 236802 236110 236688 236175 234515 233347 233330 233602 233189 231496
57570 231496 227981 222738 217120 212693 209812 207932 206718 205897 204700 202563 199956 197547 195070 192030
57556 192030 189053 187359 187140 187420 187288 186425 184728 182360 180040 178456 177486 176588 175691 175058 174513 173460
57540 173460 171567 169077 166720 165487 165799 166464 165304 161421 156086 150799 145419 139203 132789 127838 125149
57525 125149 124150 123866 123364 121666 118419 114515 111122 108164 104521 99657 94375 90187 88377 89191 91238
57510 91238 92136 90515 87160 83665 80619 77705 74767 71714 67957 63056 57543 52103 46413 39882 33183
57495 33183 27863 24512 22311 20297 18253 16568 16000 17243 19817 21788 21576 19748 18023 16876 15290
57480 15290 12579 9261 6284 4557 5087 8218 12630 16222 18088 18677 18196 16350 13799 12292 12625
57465 12625 13594 13674 12826 11922 11238 10434 9572 9368 10396 12373 14181 14660 13780 13002 13975 16777 19953 22382
57447 22382 24593 27989 33124 38947 43573 45759 45822 45059 44233 43070 41420 40160 40260 41472 42791 43808
57431 43808 44692 45203 44828 43739 42562 41228 39135 36497 34386 33202 32118 30352 28015 25365 22153
57416 22153 18217 13942 9635 5078 104 -4934 -9595 -13572 -16418 -17869 -18753 -20581 -23657 -26536 -28050
57401 -28050 -28995 -30811 -33320 -35116 -35902 -37032 -39453 -42244 -43941 -44657 -45944 -48600 -51451 -52833 -53003
57386 -53003 -54288 -58547 -64973 -70934 -74647 -76302 -76744 -76190 -74816 -73747 -74333 -76530 -78813 -79973 -80437
57371 -80437 -81460 -83454 -85596 -86923 -87270 -87133 -87177 -88100 -90359 -93472 -96035 -97166 -97718 -99212 -101619 -103265
57355 -103265 -103228 -102794 -103840 -106526 -109382 -111183 -111894 -112192 -112894 -114611 -117219 -119822 -121946 -124538 -128855 -134459
57339 -134459 -139276 -141821 -142598 -143080 -144071 -145438 -146874 -148274 -149577 -150673 -151535 -152327 -153342 -154720 -156208
57324 -156208 -157404 -158341 -159528 -161266 -163330 -165578 -168298 -171508 -174474 -176627 -178493 -180929 -183889 -186818
57310 -186818 -189862 -193449 -196795 -198138 -196901 -194624 -193267 -193327 -193991 -194312 -193764 -192334 -190693 -189741 -189550 -189228
57294 -189228 -188243 -187233 -186916 -186815 -185899 -184137 -182481 -181461 -180666 -179765 -179210 -179490 -180279 -180906 -181436 -182676 -185110
57277 -185110 -188307 -191553 -194643 -197759 -200908 -204023 -207483 -211857 -216841 -220972 -222952 -223136 -223288 -224884 -228029
57262 -228029 -232140 -237210 -243854 -252037 -260336 -267013 -271778 -275911 -280557 -285587 -290380 -294785 -298514 -300443
57248 -300443 -299896 -298329 -298302 -300591 -303540 -305413 -306165 -306552 -306908 -307404 -308289 -309172 -309162 -308399 -308192 -308906 -309076 -307634
57230 -307634 -305660 -304729 -304802 -305239 -306576 -309400 -312444 -313897 -314105 -315030 -317490 -320795 -324641 -329082 -332756 -333606
57214 -333606 -331829 -330094 -330154 -331012 -330997 -329899 -328280 -326298 -324146 -322416 -321234 -320141 -319216 -318999 -318913 -317425
57198 -317425 -314471 -311923 -310809 -309794 -307600 -305113 -303483 -301767 -298392 -293859 -289941 -286915 -283513 -279205
57184 -279205 -274679 -270305 -265933 -262193 -260220 -259679 -258578 -255623 -251706 -248564 -246810 -245715 -244198 -241663
57170 -241663 -238514 -236176 -236042 -238034 -240556 -242130 -242802 -243870 -246518 -250685 -254980 -257717 -258233 -257053 -254714
57155 -254714 -250930 -245291 -238012 -229144 -217551 -201791 -181897 -159237 -134588 -107482 -77741 -46678
57143 -46678 -16199 12690 40185 67154 94818 124191 155128 186318 216853 247459 279504 312882
57131 312882 345638 375870 403550 430093 456287 481075 502675 520703 536608 551799 566008
57120 566008 578288 589163 600526 613286 626379 638646 650352 661721 671096 676317 677619 677387
57108 677387 676897 675024 670673 664762 658574 651304 640643 625200 605129 581009 553505 523924 493733
57095 493733 463339 432184 399882 366203 330057 289752 244420 194109 138388 76202 7466 -66607
57082 -145714 -231998 -328602 -437232 -557768 -689614 -832658 -987378 -1154626 -1335128 -1529037
57072 -1529037 -1736499 -1958702 -2197554 -2454154 -2728654 -3021972 -3336609 -3675314 -4040212
57063 -4040212 -4434147 -4862095 -5330440 -5845568 -6413834 -7042169 -7738030 -8509303 -9364537
57054 -9364537 -10312610 -11362290 -12523795 -13811362 -15243174 -16838831 -18619316 -20610700
57046 -20610700 -22846455 -25365666 -28211906 -31436531 -35102682 -39285917 -44074172 -49570578
57038 -49570578 -55896604 -63190816 -71601882 -81276039 -92341645 -104900345 -119032361 -134805483
57030 -134805483 -152270103 -171447590 -192340079 -214957441 -239304814 -265286419 -292559765
57023 -292559765 -320418453 -347744333 -373032506 -394521421 -410476991 -419586063 -421282611
57016 -421282611 -415831455 -404155184 -387543127 -367387823 -345001733 -321500881 -297739460
57009 -297739460 -274292603 -251483658 -229447802 -208219117 -187817663 -168307796 -149813479
57002 -149813479 -132498583 -116528964 -102031319 -89063705 -77609460 -67591929 -58895059
56995 -58895059 -51379966 -44899385 -39311807 -34490247 -30322947 -26711481 -23571018 -20830420
56987 -20830420 -18429594 -16316946 -14449248 -12791449 -11314416 -9993027 -8806157 -7736314
56979 -7736314 -6768128 -5888249 -5086799 -4356711 -3690608 -3079889 -2517486 -1999494 -1522837
56970 -1522837 -1082977 -674918 -294435 63447 405454 736683 1056009 1356008 1627691 1865567
56960 1865567 2069839 2245684 2400356 2539624 2665824 2778416 2875489 2954959 3015824 3059064
56950 3059064 3086794 3100343 3099969 3086434 3061509 3026516 2981601 2926873 2862856 2789076 2703663 2605556
56938 2605556 2496220 2378230 2253154 2122214 1988452 1856841 1732119 1617037 1512394
56929 1512394 1417913 1333015 1257264 1190367 1131862 1080937 1036222 995335 955144 913461 870320
56918 870320 826724 782574 737189 691568 648163 607932 569374 531256 494699 461447 431466
56907 431466 403558 377374 353663 333369 317470 306798 300804 297177 293798 290398 287371 283832 278107
56894 278107 269423 257731 242586 223865 203309 183594 165656 148344 131036 115207 102718 93542
56882 93542 86141 79616 74688 72649 73981 78215 84825 93806 105317 119254 135482 153864 173082
56869 173082 189625 199341 200662 195608 187214 176779 164069 149060 132414 114987 97972 83052
56857 83052 71269 61929 53552 45613 38503 32174 26165 20861 17326 15550 14034 11634 8825 6591
56843 6591 5105 4473 5849 10377 17166 23705 28658 33274 39524 47735 56843 66285 76552 88155
56829 88155 101190 115928 132648 150465 167242 181159 191581 198115 200086 197849 193577 189562 186365
56816 186365 183601 181629 181044 181304 181624 182919 187023 194151 203066 213919 228870 249178 273453 299758
56802 299758 327996 359097 392902 427735 461023 489516 510028 521212 524226 521172 513779 503955
56790 503955 494100 485631 478122 471028 465463 463235 464893 469828 477679 488681 503347 522772 548423
56777 548423 580608 617954 659384 705363 755355 804733 846110 873767 885692 882226 865097 837866
56765 837866 805027 769512 732189 694278 658752 628434 603812 583913 568593 558845 555170 556799
56753 556799 562734 572917 588123 609140 636414 670059 709174 750515 788231 815902 829370 827644
56741 827644 811783 784080 748363 709471 671157 634825 600800 570041 543869 522686 505921
56730 505921 492839 482690 474626 468453 465155 465843 470526 478632 490196 505370 522861 539669 552247
56717 552247 557485 553419 540401 521359 499617 476261 450534 422705 395248 370824 350061 331857
56705 331857 315137 299727 285829 273282 261623 250946 242304 236567 232824 228833 223443 217592 212359
56692 212359 207248 201402 195299 189803 184552 179029 174480 172581 172506 171451 168244 164407 161332 158556 155549
56677 155549 153160 151980 150793 148040 143807 139318 135512 133217 133482 136186 139068 139682 138046 136193 135530
56662 135530 135995 137489 140396 144272 147439 148776 149145 150205 152191 153659 153311 151444 149438 148312 148068
56647 148068 148151 148091 147721 147127 146543 146058 145379 144155 142646 141734 142118 143782 146327 149257 151705 152606 151828
56630 151828 150819 151380 153874 157051 159478 160702 161269 162137 163975 166631 169256 171106 171923 171596 170233
56615 170233 168863 169083 171169 173303 173588 172289 171160 171249 172438 174549 177493 180513 182566 183495 183937 184296
56599 184296 184744 185767 187449 188558 187767 185770 184867 186401 189754 193685 197195 199223 199102 197650 196397
56584 196397 195576 194265 192554 191755 192112 192173 191259 190911 192846 196803 201320 205471 208943 211558 213755 216614
56568 216614 220572 224858 228686 231897 233983 233988 232239 230785 230975 231805 231777 231227 231470 232646 233701 233786 232556
56551 232556 229956 226853 225050 225436 226831 227684 227959 228282 228383 227975 228108 229857 232337 233856 234521 235836
56535 235836 238081 240085 241547 243570 246645 249899 252786 255867 259256 261886 263169 264125 265816 267647
56521 267647 268316 267835 267504 268037 268596 267939 266142 264928 266181 270072 274814 278439 280675 282885 286464 291710
56505 291710 297966 304373 310523 316743 323638 331244 339077 347302 357163 369470 383027 395349 404881
56492 404881 412020 418324 425347 433958 443955 454244 463765 472051 478651 482743 484167 484378 485241 486842
56478 486842 487251 484505 478383 470458 462975 457368 453139 448361 441832 434433 427744 421899 415820 409158
56464 409158 402727 397029 391558 385785 379907 374216 368480 362315 355782 349537 344676 342109 341440 340756 338372
56449 338372 334626 331131 328466 325679 321995 317830 313849 310224 307344 306156 306955 308489 309112 308626 308368
56434 308368 309524 311715 313261 312692 310003 306526 303704 302229 302199 303334 304682 304834 303212 300728 298624
56419 298624 297204 296412 296870 299127 302240 304390 304826 304144 302933 301465 300605 301381 303271 304366 303854 303129
56403 303129 303659 304824 304844 303213 301313 300983 303109 307247 312045 316224 319520 322475 325336 327710 329458
56388 329458 331126 333072 334811 335932 337203 340080 345037 350770 355157 356993 356955 356885 358009 360005 361931
56373 361931 363620 365614 368063 370481 372458 373804 374061 372823 370761 369519 370218 372512 375253 377486 378696
56358 378696 378765 378059 377152 376369 375917 376212 377402 378671 378772 377250 374518 371079 367629 365560 365912 367774
56342 367774 369143 369581 370513 372597 374562 375437 376094 377265 377670 375969 373393 372278 372480 371524 368437 365405
56326 365405 364867 366562 368495 369702 370761 372101 373155 373343 373062 373281 374455 376063 377031 376529 374614 372324
56310 372324 370942 370924 371599 372157 372684 373842 375708 377637 379357 381410 384037 386308 387005 386025 384342 382977
56294 382977 382511 383167 384642 386138 387224 388411 390285 392532 394554 396530 398834 400772 401194 400361 400002
56279 400002 401249 403447 405331 406565 407785 409739 412675 416117 419201 421527 423489 425334 426398 426032
56265 426032 424869 424227 424669 426139 428978 433491 438868 443922 448690 453859 458860 462309 464279 466302 468875
56250 468875 470875 471815 472815 474669 476774 478775 481467 485047 488226 490338 492826 497216 502880 508187
56236 508187 512765 517151 521079 523709 525142 526541 528998 532955 538118 543321 547271 550066 552940 555935
56222 555935 557277 556208 554978 556412 560441 564758 568186 571586 575731 580078 583900 587493 591952 598364
56208 598364 607045 616948 626196 633931 641291 649903 659947 670507 681221 692603 705055 718507 732849
56195 732849 748035 763997 781039 799911 820992 843860 868185 894401 922952 953540 985761
56184 985761 1019777 1055632 1092579 1129769 1166897 1203561 1238729 1271454 1301266 1327352 1348521
56173 1348521 1364659 1376798 1384757 1386352 1380475 1369557 1356970 1342865 1324654 1301108 1273957 1245627
56161 1245627 1217342 1189592 1162723 1136522 1110425 1084580 1059912 1037068 1016038 996704 978928
56150 978928 962191 946006 930621 916681 904369 893501 884107 876173 869172 862528 856121 849804 843076
56137 843076 836022 829887 825860 823843 823138 823604 825350 828101 831829 837123 843891 850548 855645 859519 863282
56122 863282 867150 871070 875984 882742 890371 897038 902347 907350 912766 918589 925054 932539 940785 949319
56108 949319 958298 968005 978179 988845 1000852 1014303 1027528 1039168 1050416 1063484 1078675 1094789
56096 1094789 1111742 1130739 1152277 1175929 1201889 1230920 1262855 1296819 1332961 1372592 1416778
56085 1416778 1466055 1521160 1582709 1650559 1724809 1807004 1899082 2001763 2115309 2240922 2379389
56074 2379389 2528378 2682190 2833677 2975633 3101956 3209831 3300544 3377067 3441842 3497803
56064 3497803 3549129 3597932 3641028 3672506 3689141 3691806 3683213 3666704 3645747 3621293 3589937 3546877
56052 3546877 3489728 3417296 3326748 3216108 3089130 2954244 2818818 2687086 2562481 2447886
56042 2447886 2343537 2248182 2162435 2087973 2023903 1967575 1918758 1879169 1847886 1821266 1797797
56031 1797797 1779122 1765726 1755560 1747667 1743184 1741755 1740932 1740377 1742837 1749387 1757303 1764360 1771796 1781305
56017 1781305 1792277 1803875 1816890 1831746 1847387 1863786 1882818 1904994 1927925 1949639 1971079
56006 1971079 1994023 2019060 2046802 2078375 2113179 2148494 2182546 2215837 2248815 2280976 2313065
55995 2313065 2347276 2384212 2422312 2460929 2501112 2542788 2584390 2626050 2669977 2717059 2766334
55984 2766334 2818068 2873415 2930637 2986140 3040258 3097557 3160199 3225498 3291379 3359563 3431633
55973 3431633 3506658 3584614 3667598 3755666 3846139 3938984 4038065 4144944 4256542 4371405 4493041
55962 4493041 4624105 4762474 4906425 5058768 5222192 5394975 5574892 5763155 5961070
55953 5961070 6167007 6380127 6603157 6838540 7085908 7345818 7621095 7911812 8214206
55944 8214206 8527518 8856415 9203767 9567267 9946762 10348397 10777233 11232184 11712915
55935 11712915 12225241 12774376 13358745 13975959 14629416 15324209 16062451 16847577 17686995
55926 17686995 18585358 19541394 20556047 21636887 22790081 24016404 25320743 26716950
55918 26716950 28217386 29826882 31553542 33415714 35431197 37610307 39967971 42532048
55910 42532048 45331242 48386996 51728313 55404806 59477794 64013783 69097462 74833359
55902 74833359 81317866 88622432 96817564 105997708 116271214 127751068 140577672 154931294
55894 154931294 171007772 189018372 209241224 232025538 257680250 286334972 317808319
55887 317808319 351291210 384782800 414794838 437043018 448057693 446623248 433987183
55880 433987183 412894601 386387749 357099452 327041046 297587776 269547141 243319696
55873 243319696 219078949 196878425 176702654 158512334 142263788 127879394 115220005
55866 115220005 104107950 94366057 85824167 78312501 71677133 65797441 60575072 55916119
55858 55916119 51737549 47979871 44597446 41542601 38770262 36249160 33955348 31860775
55850 31860775 29938803 28173990 26555372 25065511 23685668 22406007 21221212 20121157
55842 20121157 19094586 18136930 17245998 16414719 15636037 14909945 14237427 13611819 13024024
55833 13024024 12472029 11957500 11476955 11024388 10599559 10206190 9844270 9510735 9205292
55824 9205292 8929325 8681441 8459786 8266139 8101934 7962457 7839671 7727394 7618133
55815 7618133 7498353 7353826 7178658 6974686 6745019 6493575 6228069 5956842 5683545
55806 5683545 5409471 5138972 4877577 4626853 4386373 4158883 3948120 3753059 3569737
55797 3569737 3397790 3240123 3097001 2965381 2843515 2731597 2628291 2530997 2439388 2354810
55787 2354810 2276516 2202179 2131796 2067523 2009957 1957562 1909080 1863467 1818399 1772231 1726839
55776 1726839 1685408 1648021 1612180 1576586 1541496 1506599 1471868 1439404 1411025 1384940 1358127
55765 1358127 1331096 1306798 1285577 1264825 1243229 1221778 1200744 1179075 1156986 1136142 1117061
55754 1117061 1098988 1082278 1068155 1056001 1043479 1029730 1016362 1005224 997093 992221 990081 988721
55742 988721 986349 983433 981752 982050 984220 988610 994971 1001068 1004787 1006831 1008937 1010054 1006876 997810
55728 997810 984218 968199 951413 935598 921719 908473 893518 876141 857266 837560 817318
55717 817318 797555 779295 762306 746193 732025 721278 714134 710194 709298 709670 707068 698495 685622
55704 685622 672079 658817 644900 631249 619901 610232 599481 586941 574606 563777 553911 544702
55692 544702 536377 528069 518628 508968 500862 493741 485609 476905 470203 465970 461962 457249 453635 452345
55678 452345 452282 452394 452785 452510 449204 442286 434055 426294 418146 408780 399803 393160 388354 383503 377951
55663 377951 372336 367104 362269 357950 354180 350726 347701 345774 345459 346708 349160 352138 354768 357074
55649 357074 360382 365319 370023 371956 370978 368876 366453 363275 359839 357282 354812 350059 342683 335236
55635 335236 329532 324314 317610 309597 301941 295718 290957 287120 283280 278952 275139 273334 273203 272729 270956
55620 270956 269081 268464 269161 270796 273120 275090 275170 273347 271315 269887 267761 263679 258235 252605 246958
55605 246958 241346 236999 235332 236266 238497 240993 243642 246845 250799 254813 257469 258248 258713 261057 265655
55590 265655 271189 276791 282491 287823 291911 295074 298434 301581 302593 300924 298381 296455 294412 290889
55576 290889 285713 279220 271363 262604 254379 247569 241576 235708 230311 225782 221747 218075 215389 213602
55562 213602 211189 207034 202017 197803 195008 193430 192845 192403 190304 185527 179406 174365 171480 170116 169332
55547 169332 168603 167534 165952 164259 163083 162534 162163 161508 160479 159390 158727 158635 158650 158236 157394 156351 155005
55530 155005 153328 151928 151388 151407 151355 151182 150823 149507 147092 145498 146999 151205 155379 157684 158505 158747
55514 158747 158832 159494 161536 164254 165887 166149 166643 168287 170080 170934 170950 170280 168513 165978 163959 162735
55498 162735 160965 157750 153748 149667 145551 142359 142030 144529 146602 145239 141144 137345 135538 135187 135145
55483 135145 134660 133436 131922 130991 130692 130154 129237 128987 129702 129963 128559 126097 123745 121778 120356 120248
55467 120248 121410 122127 120993 118721 116739 115153 113486 112235 112043 112182 111448 110051 109250 109538 110298 110742
55451 110742 110240 108327 105361 102708 101508 101821 103361 106060 109278 111631 112403 112143 111313 109660 107538
55436 107538 106184 105823 105091 103334 101621 100292 97610 92622 87470 84764 84224 84122 84536 86649 89864
55421 89864 92275 93507 94790 96568 98122 99192 100087 100572 100505 101061 103309 106037 107005 106066 104987 104492
55405 104492 103612 101932 100364 99440 98723 98079 97849 97569 96191 93860 91934 91118 91013 91486 92847 94578
55389 94578 95598 96045 97215 99385 101224 101728 101280 100439 99134 97621 96896 97558 99212 101389 104118 107275
55373 107275 110302 112764 114379 114639 113464 112108 112117 113351 114311 114402 114455 114893 114983 114404 114055 114593 115294 115145
55355 115145 114220 113309 112805 112478 111910 110898 109790 109384 110003 110912 111266 111170 110985 110239 108531 107029 107412 109305
55337 109305 110380 109303 107296 106465 107697 110387 113078 114181 113174 111327 110237 109762 108530 106265 104041
55322 104041 102357 100647 98940 98197 98533 98779 98382 98087 98144 97627 96446 96296 98323 101228 103029 103537 103743
55305 103743 103814 103241 102329 101997 102376 102815 103105 103680 104643 105345 104956 103014 99661 95795 92744 91351 91493
55288 91493 92561 93964 95125 95697 96101 97159 98824 99948 99680 98428 97061 95869 94757 93797 93106 92760
55272 92760 93177 94803 96967 97833 96229 92977 89965 88505 89001 91317 94589 97259 98210 97659 96445 94897
55256 94897 93003 91219 90220 90024 89940 89320 87965 86044 84140 83176 83801 85857 88671 91758 94958 98064
55240 98064 100541 101676 101104 99313 97432 96212 95518 95171 95739 97626 99826 100838 100666 100569 100755 99974 97983
55223 97983 96735 97960 100799 103153 104472 105688 106944 107099 105609 103568 102363 102102 101858 101028 100050 99906
55207 99906 101143 103450 106156 108879 111364 112994 113278 112885 113243 114709 115912 115551 114102 113015 112802 112840
55191 112840 112717 112840 113763 115578 117883 119778 120109 118441 115768 113622 112493 111671 110561 109376 108363
55176 108363 107095 105035 102394 99951 98297 97608 97928 99074 100299 100712 100397 100718 102889 106314 108896
55161 108896 109176 107777 106545 106655 107803 108912 109297 109338 110158 112393 115186 116867 116724 115464 113792 111556
55145 111556 108914 107233 107693 109605 111264 112003 112245 112152 111752 112134 114758 119191 122955 124133 123090 121301
55129 121301 119668 118479 117824 117331 116241 114360 112417 111210 111058 112097 114049 115529 114903 112465 110674
55114 110674 111462 114144 116597 117621 117443 116817 116583 117491 119624 122183 124290 125546 125703 124664 123094 122060
55098 122060 121623 120822 119488 118783 119219 119464 118213 116129 114714 114267 114180 114256 114238 112961 109858 106879 106984
55081 106984 110562 114878 117269 117486 116660 115488 114176 113054 112282 111476 110340 109422 109699 111492 113992 115889
55065 115889 116460 116058 115397 114432 112483 109626 107144 105985 105416 104193 102646 102485 104556 107830 110847 113329
55049 113329 115849 118455 120248 120334 119003 117772 118021 119512 120610 120165 118719 117638 117634 118655 120591 123196
55033 123196 125629 127040 127636 128397 129655 130703 130961 130847 131112 131737 131822 130421 127348 123385 119761 117241
55017 117241 115591 114030 112199 110598 110140 111386 114055 117249 120225 122967 125733 128187 129448 129143 127832
55002 127832 126112 123976 121594 120235 121451 125281 129789 132694 133255 132558 132109 132346 132566 132087 130969 129442
54986 129442 127283 124430 121771 120381 120243 120689 121850 124285 127080 127923 125797 122457 120456 120641 122205
54971 122205 124091 125514 126088 126316 127109 128107 127717 125708 124401 125776 128608 130183 130015 129911 130951 132474
54955 132474 133784 134804 134961 133478 131226 130363 131402 132214 130821 127814 125091 123497 122831 123072 124154
54940 124154 125140 125080 124583 125355 127986 131126 133112 133719 133868 134174 134598 135347 137135 139978 142365 142607 140977
54923 140977 139601 140064 142018 144398 146873 149345 151036 151293 150826 151016 152221 153700 154950 156147 157356
54908 157356 158274 158758 158917 158824 158732 159175 160005 159814 157533 154353 152686 153192 154183 154141 153470 153282 153790 154770 156515
54889 156515 159279 162225 163883 163517 161542 158840 156133 153826 152006 150522 149255 148352 148304 149763 152886
54874 152886 156545 158752 158607 157588 158024 160359 162810 163832 163990 165058 167991 172311 177055 181857 187204
54859 187204 193830 201852 210633 219586 228592 237250 244320 248705 250600 250777 249162 245253 239713 234166
54845 234166 229214 223852 217320 210525 205081 201612 199381 196933 192889 186947 180508 175727 173597 173478
54831 173478 174392 175795 176960 176870 175348 173456 172143 171334 170952 171948 175336 180678 186388 191390 195894 200679
54815 200679 206090 211679 216655 220832 225003 229938 235109 239034 240878 240961 239711 237078 233242 228873 224244
54800 224244 218926 212748 206280 200029 194193 189549 187186 186470 184541 179233 171819 165602 162284 160828
54786 160828 159353 156793 153024 148823 145930 145916 148482 151480 152877 152221 150281 147975 145829 143858 141739
54771 141739 139434 137653 137294 138429 140263 142004 143277 143817 143477 142687 142323 142747 143356 143397 143033 143353 145334
54754 145334 148776 152158 153700 152883 150919 149561 149521 150219 150859 151226 151398 151268 150745 150224 150389 151437 152691
54737 152691 153140 152406 151164 150673 151884 154763 158159 160430 160675 159603 158889 159453 160732 161905 163120 164785
54721 164785 166205 166130 164685 163658 164520 167088 170511 174551 179175 183679 187272 190224 193551 197712 202442
54706 202442 207775 214310 222168 230330 237581 243783 249822 256352 262959 268537 272118 273229 271793 268143
54692 268143 262977 256831 249545 240837 231551 223605 218126 214178 210063 205567 202103 200779 201072 201508 201035
54677 201035 199739 198756 199361 201616 204016 205066 204902 204674 204755 204758 205106 207120 211168 215938 220001 223100 225524
54660 225524 227438 229565 233367 239447 246318 251684 254602 255830 256511 257041 256808 254616 249843 243454 237268
54645 237268 231975 226729 220895 215029 209611 204251 199183 196168 196286 197640 196936 193098 187933 183460 180058
54630 180058 177249 174919 173289 172578 172976 174263 175431 175455 174514 173670 173268 172509 170818 168834 167598 167284
54614 167284 167152 166475 165258 164123 163606 163607 163653 163653 163946 164506 164841 164942 165541 166779 167521 166865 165542 164697 164019
54595 164019 162576 161056 161442 164374 168387 172108 175618 179054 181374 181691 180860 180472 180750 180520 179046 176944
54579 176944 175188 173889 172334 170015 167454 165970 166473 168455 170384 171020 170100 168005 165483 163794 164290
54564 164290 167221 171310 174843 176880 177204 175815 173214 170823 170189 171590 173894 175859 177089 177720 177836
54549 177836 177646 177854 179154 181313 183172 183726 183004 181810 180890 180541 180727 181232 181808 182458 183507 185182 187360
54532 187360 189992 193406 197444 200514 200441 196681 191045 185929 182388 180202 178993 178545 178513 178693 179433 181190
54516 181190 183821 186798 189936 193352 196781 199510 201018 201339 200924 200590 201464 204343 208892 213691 217138
54501 217138 218270 217067 214435 211764 210010 209117 208511 208040 208091 208964 210648 213174 216721 221091 225288 227894
54485 227894 228145 226810 225924 227186 230412 233840 236102 237531 239372 242215 245511 248180 249282 248494 246553
54470 246553 244953 244700 245394 245852 245413 244275 242830 241217 239524 238138 237737 238842 241069 242927 242955 241289
54454 241289 239609 239341 240458 242175 243973 245520 246384 246486 246333 246298 246278 246400 247187 248419 248815 247738 246399
54437 246399 246446 248120 250709 253913 257450 260197 261232 261324 261879 262812 262956 262311 262202 263208 264534 265649
54421 265649 267066 269166 271614 274351 277903 282206 286265 289566 292834 296867 301408 305581 308723 310554
54407 310554 311406 312471 314755 317490 318701 317871 316939 317925 320433 322309 322099 320097 317451 315031 313117
54392 313117 311686 310800 310469 309975 307915 303746 298933 295586 294118 293300 292408 291926 292036 291955 291192 290052 288333
54375 288333 284914 279511 273727 269415 266868 265421 264880 265371 266498 267618 268536 269259 269554 269354 269116 269255
54359 269255 269724 270465 271589 272814 273536 273804 274239 274617 273759 271573 269961 270638 272939 274784 275070 274177 272886
54342 272886 271779 271048 270182 268608 267227 268016 271194 274292 275514 276523 279788 284244 286248 284589 282026
54327 282026 281423 282508 283156 282094 279376 275738 272540 271251 271850 272493 271712 270396 270748 273614 277543 280259
54311 280259 280567 278983 276970 275585 274705 273690 272597 272273 273184 274765 276310 278024 280672 284267 287554
54296 287554 289057 288589 287543 287393 288030 287952 286122 283028 279640 276051 271772 266829 261781 257043 252985
54281 252985 250380 249752 250256 250164 248653 246389 244188 241879 238882 235315 232000 229586 227939 226419 224712
54266 224712 223351 223095 223621 223494 222065 220803 221723 224648 227190 227602 226555 225729 225671 225837 225981 226501 227551
54249 227551 228579 228871 228195 226924 225762 225334 225689 226157 225812 224261 221969 219860 218604 218292 218681 219483
54233 219483 220200 219938 218031 214917 211944 210012 208798 207484 205739 203754 201971 201198 202192 204408 205915
54218 205915 205563 204704 205532 208082 210227 210607 210041 209660 209126 207620 205526 204029 203552 203620 203944 204749 206100
54201 206100 207627 209019 210188 210861 210516 209014 206950 205099 203690 202522 201707 201853 203322 205613 207856
54186 207856 209688 211141 211882 211410 210166 209559 210405 212061 213577 214818 215708 215418 213633 211915 212076 213413
54170 213413 213275 210631 207406 205746 205489 205180 204269 203118 201908 200857 200898 202773 205607 207445 207266 205758
54154 205758 204203 203291 202994 202926 202690 202115 201159 199619 197466 195676 195865 198343 201091 201578 199299 195815
54138 195815 192734 190540 189020 187668 185803 183391 181777 182438 184936 187336 188933 191123 194901 198842
54124 198842 200685 200082 198574 197547 197501 198877 202070 206385 210145 212226 212814 212544 211728 210551 209108 206963
54108 206963 203580 199603 196773 196029 196577 197427 198722 200493 201131 198977 195154 193020 194273 197004 198198
54093 198198 196989 194653 192473 190870 190049 190184 190975 191823 192534 193298 194149 195100 196651 199289 202381 204410
54077 204410 204666 204115 204179 205160 206267 206802 206735 206297 205568 204601 203647 203058 202941 202907 202209 200427 198251 197328 198913
54058 198913 202576 206543 209382 211069 212260 212994 212648 211028 208874 207140 206231 206120 206658 207377 207506 206772
54042 206772 205927 205889 206568 207171 207503 208165 209462 210925 212051 212728 212714 211585 209637 208158 208215 209652 211632
54025 211632 213463 214515 214237 213131 213009 215163 218650 221350 222469 223025 224159 226162 229180 233596 239208
54010 239208 244884 249666 253768 258094 263195 268931 274679 279509 282578 283742 283565 282642 281210 279487 277832
53995 277832 276334 274691 272911 271719 271815 272955 274289 275553 277516 281121 286444 292584 298343 302888 306035
53980 306035 308438 311583 317008 324895 333559 340919 346532 351707 357753 364909 373029 382180 391983 401367
53966 401367 409882 418416 427542 435833 441230 443682 445056 446543 447640 447878 447922 448298 448329 447319 445815 444631
53950 444631 443221 440107 434758 428240 421964 416382 410962 405098 398905 393074 388015 383412 378944 375040
53936 375040 372125 369397 365507 360633 356661 354659 353250 350378 345863 341187 337367 334291 331776 329983
53922 329983 328622 326862 324446 322099 320291 318128 314120 308084 301940 298377 298521 300785 302239 301306 299037
53907 299037 297608 298005 299641 301805 304580 308036 311299 313157 313486 313620 315080 318157 321875 325176 327814
53892 327814 330106 332269 334477 337313 341563 347345 353805 359832 364866 369008 372788 377031 382493 389168
53878 389168 396136 402492 408470 415484 425046 437533 451757 465740 478219 489444 500278 510711
53866 510711 519890 527773 535974 546434 559604 574263 588580 600867 609915 615575 619077 622138 625583
53853 625583 629161 632532 635958 639933 644585 649576 654392 658666 662441 666021 669368 671774 672422 671259
53839 671259 669077 666781 664727 662611 659751 655617 650266 644034 636653 627206 615516 603197 592459
53826 592459 583829 575636 565856 553899 540688 527764 516490 507310 499271 490869 481844 473564 467057
53813 467057 461205 453791 444093 433581 424109 416303 409833 404262 399101 393769 388258 383446 380019 377330
53799 377330 373953 369209 363556 357673 351975 346966 343151 340299 337632 335060 333437 333018 332559 330817 328381
53784 328381 326917 326972 327664 328472 330029 332716 335448 336509 335051 331367 326443 321784 319027 318646 319233 318841
53768 318841 317170 315807 316254 318322 320692 322395 323161 322843 321463 319986 320140 322743 326520 329412 330987
53753 330987 332840 336470 341526 346597 350948 354773 358168 360840 362857 365061 368544 373873 380727 388162
53739 388162 395675 404241 415473 429010 441521 449599 453312 455694 458955 462675 465776 468501 471692
53726 471692 475446 479489 483889 488344 491441 491746 489332 485542 481470 477214 472245 466009 458580 451061
53712 451061 444778 439637 434008 426846 419153 412581 407323 402314 396873 391061 384943 378816 373953 371795
53698 371795 372134 372997 372450 369750 364904 358292 351059 344831 340356 337014 333988 331280 329129 327090 324396
53683 324396 320980 317573 314868 313020 311908 311479 311696 312315 312938 313303 313434 313476 313521 313731 314394 315475 316314
53666 316314 316424 316545 317976 320522 322066 320968 318201 316145 315829 316453 317261 318534 320659 323468 326875
53651 326875 331124 335882 339951 342602 344622 347481 351856 357401 363437 369176 373678 376382 377765 379008
53637 379008 380931 383374 385550 386755 386919 386747 387239 388864 391308 394162 397445 401087 404218 405747 405704
53622 405704 405340 405585 405936 405392 404053 403103 403243 403937 404431 404916 406155 408370 411033 413550 415554 416643
53606 416643 416448 415072 412991 410423 407312 404031 401511 400300 399938 399685 399586 400352 402298 404741 406463 406599
53590 406599 405207 403099 401050 399120 396872 394208 391720 390100 389539 389869 391152 393841 398221 403573 408014
53575 408014 409711 408653 406832 406173 406671 407126 407222 407862 409778 413006 417616 423621 429899 434571 437030 438520
53559 438520 440262 442174 444063 446724 450754 455306 459202 462657 466823 472253 478761 486229 494441 502559
53545 502559 509722 515957 521831 527619 533356 539016 543996 547234 548667 549740 551564 553463 554252 553846 552479
53530 552479 549695 545788 543024 543272 545054 545144 542727 539864 538081 536853 535595 534793 534546 533908 532436 530811
53514 530811 529527 528581 528795 531522 536270 540388 541935 541345 539617 536827 533500 531658 532937 536770 541548
53499 541548 546288 550190 552182 552443 553160 556098 560340 563933 566828 570530 575529 580771 585293 588905 591594
53484 591594 593727 596664 601752 608789 616521 624503 633325 643283 654128 666056 679639 694553 709462
53471 709462 723497 737107 751312 766823 783966 802712 822716 843931 867077 892747 920071
53460 920071 947134 972873 998003 1024113 1052545 1084060 1118632 1155257 1192641 1230419 1269232
53449 1269232 1309532 1350947 1392967 1435582 1478868 1522516 1566205 1610061 1654175 1697895 1740125
53438 1740125 1780526 1820094 1860374 1902129 1944955 1988083 2031110 2073664 2114755 2153255 2189180
53427 2189180 2223895 2258578 2292714 2324400 2352144 2376391 2399569 2424525 2452305 2481257 2508597
53416 2508597 2532873 2554504 2574106 2591189 2604708 2614007 2618826 2619141 2615468 2608646 2598807 2585245 2567821
53403 2567821 2547750 2526303 2503333 2477797 2449199 2417775 2383789 2347510 2309563 2270511 2230262
53392 2230262 2188528 2145666 2102629 2060367 2019650 1980955 1943976 1907708 1871543 1835767 1800567
53381 1800567 1765513 1730879 1698694 1671243 1648840 1630089 1613975 1600599 1590153 1582441 1577623 1576559
53369 1576559 1580149 1588734 1601926 1618553 1637165 1657311 1679964 1706070 1735171 1766335 1799850 1836814
53357 1836814 1877344 1920372 1965170 2012123 2062046 2115661 2173558 2235675 2300786 2367266 2434276
53346 2434276 2501769 2570026 2640191 2714435 2794141 2878302 2965050 3054227 3146815 3242496 3339893
53335 3339893 3438982 3540788 3644438 3747076 3847455 3947233 4047544 4146666 4242752 4336720
53325 4336720 4430136 4521645 4608031 4688073 4763047 4833767 4899413 4959583 5015444 5067940 5116007
53314 5116007 5157401 5190697 5216004 5234226 5245929 5250536 5246307 5231240 5203981 5163841 5110419 5043831
53302 5043831 4965252 4876800 4780851 4679519 4574299 4465813 4354188 4240089 4125016 4010263
53292 4010263 3896108 3782515 3670035 3559276 3449987 3341674 3234893 3130983 3030505
53283 3030505 2932730 2836763 2742457 2650145 2560210 2473254 2390247 2312222 2239942 2173699 2113034
53272 2113034 2056919 2004942 1958192 1918212 1884995 1856805 1832076 1810477 1791706 1774411 1757449
53261 1757449 1741708 1729448 1721795 1717808 1716107 1716389 1718846 1722964 1727872 1733727 1741914 1753736 1769311
53248 1769311 1787776 1808070 1829379 1851315 1874097 1898438 1925148 1954898 1988165 2024873 2064014
53237 2064014 2104190 2144926 2187074 2231671 2278854 2328108 2378974 2430888 2482705 2533052 2580992
53226 2580992 2626001 2667715 2706324 2742826 2778177 2812348 2844628 2874321 2900438 2921422 2936400
53215 2936400 2946406 2953110 2956502 2955086 2948272 2937005 2921826 2901932 2876788 2847140 2813410 2774290
53203 2774290 2728257 2675749 2618714 2558518 2495363 2429489 2361912 2293906 2226316 2159347 2092806
53192 2092806 2026796 1962346 1900803 1842326 1785602 1729326 1673166 1616981 1560149 1502443 1444742
53181 1444742 1388119 1332935 1279413 1228062 1178642 1129899 1081629 1036017 995410 959527 926475
53170 926475 895710 867975 842767 818283 794183 772209 753285 735867 718167 700504 684254
53159 684254 669769 656591 644742 634341 624425 613437 600842 587513 574668 563044 552787 543468
53147 543468 534348 525024 515691 506575 497688 489449 482772 477808 473110 466895 458837 449979 441264 433010
53133 433010 425563 419489 414903 411155 407321 402784 397650 393090 390832 391388 392850 392255 388302 382228 376187
53118 376187 371531 368555 366743 364900 362047 358809 357171 358195 360567 362069 361904 360791 359302 357130
53104 357130 353886 349692 344992 340518 337382 336267 336312 335692 333715 331650 331064 332046 333541 334785 335682 336283
53088 336283 336720 337399 338498 339398 339267 338112 336587 334943 333037 331426 331501 333982 337784 340757 341373 339642
53072 339642 336906 334924 334574 335158 335431 335420 336588 339863 344246 347896 349978 350793 350663 349704 348425 347512
53056 347512 346899 345809 343987 342294 341758 342511 343887 345141 345704 345055 342871 339419 335596 332403 330319
53041 330319 329140 328470 328251 328606 329143 328804 326689 322927 318593 315003 313221 313827 316537 320093 322960 324302
53025 324302 324267 323509 322644 321941 321247 320322 319415 319162 319688 320302 320543 320934 321868 322179 319949 314874 308924 304423
53007 304423 302161 301404 300805 299000 295456 291496 289664 291019 293452 293675 290775 286997 285040 285381 286477
52992 286477 286817 286181 285132 283984 282605 281056 279990 280142 281568 283688 285998 288266 289998 290343 288896
52977 288896 286166 282889 279340 275832 273393 272978 274016 274644 273725 272045 271109 271267 271629 271507 271220 271329
52961 271329 271648 271485 270696 270060 270366 271320 271678 270563 268454 266698 266181 266664 267329 267662 267735 267884 268345 269080
52943 269080 269756 269936 269496 268841 268521 268533 268237 267194 265967 265715 266825 268181 268048 265697 262030 258757 257133
52926 257133 257291 258393 259357 259811 260440 262119 264570 266358 266599 266297 267353 270321 273805 276283 277907 280007
52910 280007 283137 286283 288101 288511 288747 289956 291943 293333 292935 290958 288812 287726 287654 287689 287317 286901
52894 286901 286882 286941 286253 284369 281629 278869 276984 276545 277398 278507 278483 276496 272814 268607 265310 263817
52878 263817 263878 264316 264146 263378 262479 261452 260129 259111 259322 260384 260511 258731 256367 255412 255984 256422 255569
52861 255569 253835 252147 251030 250852 251796 253136 253569 252878 252401 253188 254504 255001 254625 254265 254063 253383 252320
52844 252320 251847 252222 252473 251977 251493 251859 252583 252756 252730 253696 255851 258223 260450 263461 267771 271991 274015
52827 274015 273319 271368 269877 269364 269362 269320 269075 268932 269614 271734 274896 277537 278108 276530 274323 273313 274363
52810 274363 277183 280944 284825 288203 290738 292422 293416 293653 292772 290713 288311 286890 286987 287675 287375 285282
52794 285282 281867 278337 275966 275634 277333 279970 282140 283225 283376 282464 279793 275185 269745 264999 261649
52779 261649 259690 259293 260738 263445 265795 266232 264405 261256 258348 256979 257413 258761 259856 260301 260469
52764 260469 260585 260326 259403 258069 256789 255766 255089 255080 256078 257907 259854 261298 262270 263335 264963 267134
52748 267134 269572 272165 274776 276663 276663 274414 271071 268279 266532 265055 263175 261098 259239 257495 255603
52733 255603 253650 251739 249599 247135 245163 244906 246621 249154 251059 251926 252470 253455 254814 255827 255996
52718 255996 255532 254944 254413 253833 253271 252994 253032 253197 253660 255015 257345 259597 260451 259765 258724 258518 259215 259938
52700 259938 259759 258317 256057 254144 253743 254831 255845 255159 252987 251246 251268 252298 252795 252671 253174 254761
52684 254761 256305 256827 256968 257961 259868 261756 263090 264019 264714 265485 267293 270838 275051 277756 278217 277958
52668 277958 278574 279820 280558 280609 280714 281318 282299 283362 283733 282032 277617 271978 267745 266216 266501 266945 266491
52651 266491 264801 262157 259565 258032 257297 255928 253097 249744 247610 247629 249525 252365 255062 256875 257933
52636 257933 258940 260020 260393 259653 258678 258500 258746 258316 257399 257521 259294 261325 262198 262589 264119 266609 267969
52619 267969 267076 265359 264740 265165 265290 264872 264890 265576 265965 265774 266133 267668 269210 269525 269277 269892 271274 272216
52601 272216 272601 273348 274292 274066 272593 271951 273764 277066 279890 281955 284528 288231 292225 295221 296362
52586 296362 295356 292671 289462 286626 284157 281913 280445 280134 280056 278913 276948 275755 276077 276827 276529 274833
52570 274833 272446 270466 270090 272065 275893 280060 283289 285213 285937 285847 285770 286199 286111 283815 279506 275776
52554 275776 274732 275580 276045 275212 273864 272770 272086 272079 273058 274617 276054 277478 279468 281638 282741 282384
52538 282384 281637 281671 282675 284329 286292 287818 287814 286006 283444 281424 280429 280427 281456 283367 285600 287774 290027
52521 290027 292342 294178 295356 296592 298318 299571 299066 297109 295362 294758 294648 294209 293705 293849 294543 294953
52505 294953 294603 293884 293410 293240 292882 291980 290765 289703 288865 287984 287114 286765 287190 287943 288494 288920 289565 290341
52487 290341 290905 291361 292131 293163 293817 293675 293047 292514 292254 291976 291344 290324 289245 288449 287931 287575 287818 289518
52469 289518 292635 295485 296138 294591 292874 292921 294823 297147 298322 297680 295878 294605 295229 297368 299291
52454 299291 300025 300501 302227 305405 308998 312248 315356 318733 322237 325340 327702 329354 330454 330942 330470
52439 330470 328724 325844 322457 319284 316785 315076 313945 313053 312392 312373 313098 313791 313621 312996 313113 314040 314269
52422 314269 312774 310631 309807 310958 313317 316141 319116 321545 322377 321425 319900 319434 320958 324409 328805
52407 328805 332566 334523 334939 335101 335807 336704 337147 337060 336870 337181 338648 341390 344295 345693 345181 344106 343702
52390 343702 343457 342075 339498 337014 335548 334744 333840 332742 331923 331599 331196 329606 326208 321886 318692 318003
52374 318003 319245 320935 322606 324802 327326 328658 327715 325398 323658 323335 323620 323487 323024 323195 324650 327027
52358 327027 329364 331112 332621 334595 337200 339999 342576 344830 346675 348044 349362 351432 354545 358198
52344 358198 362090 366780 372676 378781 383238 385031 384540 382666 380247 378211 377312 377326 377143 375957 373893
52329 373893 371454 369033 367143 366269 366124 365859 365423 365825 367461 369144 369782 370169 371803 374499 376600 377365
52313 377365 377632 378090 378530 379227 381462 385716 390570 394465 397598 400915 404132 406220 407305 408486 409858
52298 409858 410346 409736 409408 410441 412179 413469 414284 415191 415993 416035 415459 415185 415881 417779 421086 425472 429362
52281 429362 431080 430944 431108 432988 435995 439310 443581 449684 456698 462581 466597 469939 474057 479518 486440
52266 486440 494794 503976 513106 522090 531539 541426 550900 559878 569649 581112 593386 605046 615837
52253 615837 626143 635660 643972 651848 660403 669181 676647 682601 688592 695668 703181 710336 717448 724880
52239 724880 732019 738364 744681 751833 759150 765176 769643 773639 778084 783096 788507 793849 797881 799432
52225 799432 799019 798552 798950 798899 796670 792563 788879 787737 789379 792440 795406 797856 800542 804316 809027
52210 809027 813751 818100 822782 828639 835592 843017 850787 859294 868550 877836 886337 893708 899955 905339
52196 905339 910639 916995 924864 933308 940831 946965 952619 958827 965686 972748 979972 987629 995415 1002285
52182 1002285 1007434 1011164 1014574 1018515 1022938 1027059 1030076 1031863 1033032 1034193 1035190 1035462 1035293 1036256 1039933
52167 1039933 1046259 1053484 1059750 1064482 1068374 1072487 1077493 1083355 1089413 1094888 1099588 1104095 1109171 1115180
52153 1115180 1122256 1130684 1140514 1150828 1160093 1167629 1174180 1180536 1186111 1189831 1192163 1195087 1199738 1205219
52139 1205219 1210297 1215242 1220965 1227178 1232748 1237544 1242530 1248057 1253352 1257868 1261898 1265444 1267781 1268787
52125 1268787 1269608 1271108 1272544 1272643 1271147 1268361 1264024 1257876 1250850 1244416 1239018 1234180 1229754 1225745 1221253
52110 1221253 1215304 1208846 1204256 1202233 1200635 1197116 1191624 1185464 1179294 1173476 1169361 1168327 1169760 1171493
52096 1171493 1172358 1172962 1173858 1174442 1174358 1174754 1176972 1180505 1183307 1184079 1183487 1182990 1183063 1182896 1181687 1179950 1179274
52079 1179274 1180681 1183376 1185569 1186557 1187495 1189867 1193747 1198032 1201915 1205408 1208723 1212038 1215864 1220813
52065 1220813 1226798 1233241 1240377 1249584 1261891 1276807 1293221 1310710 1329051 1347008 1362996 1377103
52053 1377103 1391336 1407299 1424255 1439930 1452699 1462522 1470136 1475946 1479720 1481198 1481005 1480858 1482412
52040 1482412 1485775 1489513 1492230 1493674 1494258 1494271 1494080 1494458 1495897 1497684 1498303 1496788 1493396 1489073 1484553
52025 1484553 1479764 1473741 1465379 1454797 1443901 1435092 1429336 1425690 1422537 1418879 1414690 1410687 1407858
52012 1407858 1406677 1406594 1406695 1406918 1408118 1410731 1413939 1416513 1418068 1419045 1419816 1420537 1421733 1424188 1427848 1431355
51996 1431355 1433213 1433195 1432103 1430391 1427826 1424655 1422186 1421527 1422158 1422483 1421448 1418940 1414847 1408839 1401274
51981 1401274 1393298 1385486 1377053 1367064 1355941 1345161 1335724 1327576 1320293 1313725 1307875 1302609 1297683
51968 1297683 1293009 1288958 1286226 1284950 1283866 1280907 1275016 1267061 1258733 1251045 1244146 1237907 1231991 1225813
51954 1225813 1219197 1212851 1207552 1203014 1198081 1191793 1183726 1173607 1161364 1147562 1133158 1118719 1104156
51941 1104156 1089060 1073012 1055865 1038124 1020615 1003312 985092 965487 946149 929430 915686
51930 915686 903046 889908 876624 864511 854109 844740 835160 824348 812131 799232 786391 773635
51918 773635 760844 748511 737011 725579 713318 701047 690643 682444 674994 667863 662897 661487
51906 661487 662031 661754 660322 660094 663080 668995 676249 683637 690788 697796 704807 711563 717288 721283 723457
51891 723457 723891 722260 718458 713601 709563 707355 706628 706936 708782 712965 719447 727497 736719 747234 758760
51876 758760 770164 780573 790661 802198 816090 831375 846312 859846 871353 879568 882904 881109
51864 881109 875769 868799 860961 852241 843129 834833 828174 822749 817527 812418 809107 809857 815315 823992
51850 823992 834075 844841 855296 862274 861694 852138 836063 817172 797746 778831 761436 746169
51838 746169 732393 718974 705690 693076 681138 669080 656346 643354 631037 619925 609736
51827 609736 599965 590953 584012 579820 576977 573226 568224 563987 562272 562782 564570 567751 572630 578234
51813 578234 583226 587678 592452 597208 600468 601649 601712 601726 601805 601526 600299 597211 591671 584725 578859 575849
51797 575849 575199 574915 573330 569960 565238 559972 554894 550465 546995 544659 543103 541379 538789 535657 532777
51782 532777 530293 527743 524971 522213 519353 515872 511661 507203 502842 498611 494912 492571 491835 491929 491960
51767 491960 491749 491391 490608 489170 487605 486887 487397 488578 489599 490071 490095 489933 489907 490554 492479 495681 499080
51750 499080 501279 501993 502243 502889 503526 503435 503044 503474 504802 505788 505544 504631 504125 504351 504992 505851 506747 506977
51732 506977 505699 502976 499922 497553 495835 494077 491945 489625 487150 484278 481344 479598 480015 481961
51718 481961 483691 484025 482981 481087 479056 478071 479089 481487 483661 485566 489402 496771 506270 515159 522551
51703 522551 529413 536085 541661 545837 549629 553743 557427 559528 559743 558374 555647 551758 547018 541562
51689 541562 535349 528638 521979 515731 510061 505253 501228 496924 491218 484675 479474 477358 478493 482481
51675 482481 489311 498707 509468 520185 530062 538579 545110 549542 552620 555068 556855 557997 559509 562693
51661 562693 567510 572220 574662 573734 570008 565245 561151 558315 556406 555125 554316 553193 550475 545831 540509
51646 540509 535992 532663 530332 529339 530184 532447 534963 536922 538056 537930 536017 532691 529484 527967 528634
51631 528634 530984 534184 537303 539168 538672 535625 531209 527221 524654 523090 521564 519681 517678 515777
51617 515777 514091 512967 512790 513406 514326 515545 517611 520795 524766 529269 534582 541148 549226 558935 569919
51602 569919 580780 589551 595056 597298 596360 591874 584125 574887 566345 559532 554395 550930 549436 549885
51588 549885 551694 554135 556530 558108 558022 555507 550008 541602 531530 521850 513898 507282 500735 493886
51574 493886 487745 483535 481345 480005 478230 475884 474019 473517 473951 474197 473846 473302 472662 471481 469792 468376
51558 468376 467663 467251 466905 467115 468126 469389 470644 472605 475613 478394 479245 478011 475985 474440 474210 475937
51542 475937 479366 482666 483971 483722 484355 487506 492598 498277 503997 509715 515084 519721 523533 526127 526585
51527 526585 524709 522100 521024 522096 523784 524422 524209 524818 527406 531642 536658 542316 549167 557595 567558
51512 567558 578865 591116 603598 615884 628382 641501 654349 665252 673699 680833 687854 695145
51500 695145 703428 714496 729744 748785 770351 793725 818304 842532 864458 882901 897166 906398
51488 906398 910488 910931 909255 904862 895969 882471 866252 848467 828198 804445 778216 751887 727345
51475 727345 705291 685536 667372 650322 634982 622527 612946 604487 595417 585855 577315 570776 565713
51462 565713 560863 555547 550243 545972 543225 541750 541400 542508 544945 547465 548877 549344 549536 549081 547187
51447 547187 544403 542029 539759 535866 530265 525418 523117 522014 519762 516283 513138 510575 507209 502406
51433 502406 497186 492525 488255 484126 480717 478624 477571 477007 477029 477969 479374 480068 479274 477264 474755 472074
51417 472074 469212 466546 464923 464763 465433 465889 465663 464691 462585 458973 454559 450872 448639 447274 446221
51402 446221 445796 446106 446216 445407 444543 444937 446378 447507 447949 448730 450506 452680 454695 457048 460382 464475
51386 464475 468943 474222 480914 488629 496483 504644 514237 525337 535867 543302 547260 549807 553099 557180
51372 557180 560358 561339 560355 558086 554208 547806 539190 530466 523673 518760 514039 508488 502842 498283 494904
51357 494904 492055 489622 488140 487900 488728 490532 493192 495877 497566 498627 500894 505393 510686 514326 515456
51342 515456 515108 514425 513748 513334 513741 515162 517167 519409 521924 524489 526377 527240 527827 529532 533434 539767
51326 539767 547849 556530 565303 575113 587461 602762 620372 640234 663243 689431 717001 744259
51314 744259 771727 801077 832288 863014 890725 914320 933481 947555 955753 957912 954455 945822
51302 945822 932343 914537 893068 868390 840751 810761 779835 749711 721364 694603 668962
51291 668962 644758 622854 603557 586365 570792 556703 543639 530695 517708 505934 496727 489906
51279 489906 484162 478736 473798 469254 464343 458816 453724 450347 448640 447240 444800 440948 436101 430892
51265 430892 425973 422038 419599 418599 418446 418616 419164 420334 421803 422751 422841 422711 423266 424842 427414 431080
51249 431080 435694 440287 443643 445447 446227 446183 444894 442481 440275 439589 440196 440598 439689 437671 435474 433763
51233 433763 432558 431384 429698 427352 424699 422112 419603 417268 415902 416461 418770 421413 423360 425209
51219 425209 428237 432534 436759 439666 441281 442498 444072 446206 448584 450531 451466 451456 451121 450886 450704 450602
51203 450602 451032 452320 454105 455593 456131 455450 453832 452267 451821 452434 452892 452473 452041 452880 454984 457302
51187 457302 459241 460982 462591 463801 464565 464899 464210 461744 457815 453757 450499 447904 445545 443327 441264
51172 441264 439415 438107 437370 436282 433982 431392 430639 432485 435630 438892 442486 446331 448796 448617 447007
51157 447007 446244 446826 447577 448141 449678 453016 457476 461915 465959 469844 473711 477394 480457 482337 482823
51142 482823 482401 481852 481626 481822 482327 482655 482239 481390 481336 482543 483692 483225 481311 479165 477057 474471 471886
51125 471886 470679 471057 471644 471589 471676 472657 473708 473469 471780 469601 467842 466964 467061 467656 467936 467795 468114 469341
51107 469341 470515 470583 470214 471144 473756 476436 477694 478151 479669 482822 486000 487338 487048 487119 488715 490707
51091 490707 491368 490800 490675 491800 493124 493308 492180 490264 487998 486059 485453 486218 486675 485074 481647 478035
51075 478035 474988 471843 468342 465718 465390 467392 470659 474278 477779 480708 482803 484602 487149 490879
51061 490879 495290 499881 504836 510318 515522 519204 521064 521960 522688 523345 524175 526119 529631 533469 535733
51046 535733 536132 536375 538185 541582 545259 547923 549002 548750 548108 548034 548671 549498 550407 551958 554271 556427
51030 556427 557513 557625 557177 555832 553081 549556 546708 545170 544268 543299 542438 542042 541793 541086 539906 538841
51014 538841 538497 539246 541253 544215 547222 549430 551053 553295 557109 562320 568146 574238 580779 587824 595145
50999 595145 602802 611292 620805 630716 640117 648500 655619 661196 665460 669746 675828 684537 695363 707189
50985 707189 718863 729351 738243 746152 753703 759879 762324 759794 753685 746723 740795 736420 733305 730416
50971 730416 726015 718739 708784 697602 686722 677232 669897 664895 661543 658865 656354 653850 651228 648932
50957 648932 648352 650703 655632 661735 668242 675364 683146 690992 698385 705159 711043 715862 720287 725372
50943 725372 731109 736437 740890 745232 750253 756153 763544 773541 785806 797702 806784 813409 819573 825829
50929 825829 830976 834518 837711 841723 846127 849906 853081 856574 860990 866191 871750 877287 882419 886680
50915 886680 889542 890501 889364 886549 883149 880697 880769 884337 891117 899811 909468 920541 934314 951545
50901 951545 971921 994406 1017533 1039795 1060656 1081194 1103029 1126698 1151618 1177256 1203340
50890 1203340 1229165 1253968 1278098 1302619 1327566 1351982 1376159 1402297 1432037 1464461 1497494
50879 1497494 1529975 1561056 1588827 1611597 1630138 1646882 1662840 1676734 1687056 1693372 1695389 1692412
50867 1692412 1684448 1672622 1657766 1639555 1617680 1592953 1566399 1537949 1506805 1472771 1436800
50856 1436800 1400728 1366741 1336212 1308443 1281244 1253399 1225960 1200677 1178094 1157964 1140476
50845 1140476 1125650 1112088 1097805 1082277 1066509 1051203 1036159 1021541 1008306 996765 985816
50834 985816 974346 962721 952258 943794 937345 932618 929152 926303 923725 921725 920747 920759 921495 922853
50820 922853 924500 925477 925028 923836 923781 926279 931228 937505 943933 949724 954613 959001 963744 969622 977253
50805 977253 987433 1000856 1017169 1034909 1052931 1071515 1091551 1113160 1135866 1159607 1184433
50794 1184433 1209436 1233526 1257748 1285375 1318621 1356130 1394849 1433590 1473488 1515591 1559743
50783 1559743 1605828 1654367 1705328 1757759 1811269 1866584 1923688 1980582 2035173 2087610 2139402
50772 2139402 2190728 2240161 2287058 2332749 2378890 2425636 2472110 2518064 2564556 2613165 2664811
50761 2664811 2719064 2774499 2829917 2885081 2939821 2992630 3040753 3081631 3113600 3135329 3145723
50750 3145723 3144842 3134006 3114246 3085294 3046892 3000583 2949298 2895431 2840125 2784233 2728947 2675343
50738 2675343 2624343 2577531 2537124 2504330 2478317 2457687 2442734 2435299 2436347 2444544 2457631 2474519
50726 2474519 2495414 2520314 2548062 2576749 2604366 2629054 2649424 2665016 2676251 2683717 2687666 2688083
50714 2688083 2684725 2676881 2663508 2644029 2618745 2588130 2551901 2509198 2459652 2404007 2343677 2280011
50702 2280011 2214174 2147486 2081425 2017003 1954335 1893295 1834662 1780125 1730848 1686566 1646573
50691 1646573 1611027 1580454 1554376 1531623 1511944 1496235 1485029 1477993 1475126 1477063 1483520 1492851
50679 1492851 1504118 1518399 1536825 1558497 1581939 1607686 1637340 1670336 1703783 1735977 1768355
50668 1768355 1803157 1840336 1877613 1912776 1945175 1975604 2005383 2035269 2064829 2093037 2119427
50657 2119427 2144221 2167488 2188956 2208619 2226729 2243210 2258036 2272340 2288032 2305930 2325310
50646 2325310 2345821 2368889 2396505 2429332 2466609 2507159 2549774 2593188 2636446 2678987 2719884
50635 2719884 2757500 2790408 2818258 2841448 2860639 2877024 2892209 2907068 2921353 2935105 2949787
50624 2949787 2967186 2987915 3011872 3039524 3071569 3107757 3147248 3189996 3236797 3288300 3345301
50613 3345301 3409947 3485225 3572560 3670556 3776205 3886462 3998455 4109360 4216961 4319966
50603 4319966 4417406 4508234 4591967 4669127 4740433 4805856 4864925 4917622 4964317 5004817 5037959
50592 5037959 5062258 5076725 5081135 5075939 5062248 5041818 5016680 4988543 4958703 4928814 4901634 4880412
50580 4880412 4866971 4860574 4859061 4861052 4866564 4875482 4886034 4895243 4900686 4901336 4896774 4886253 4869200
50567 4869200 4846444 4820047 4791362 4759650 4723091 4680710 4632432 4577623 4515105 4445399 4372186
50556 4372186 4300787 4235639 4179425 4133554 4098216 4072380 4054741 4044527 4040632 4040443 4040716 4039467
50544 4039467 4035716 4027354 4010731 3982995 3943777 3893961 3833899 3763893 3685553 3601347 3513025 3421576
50532 3421576 3328573 3236362 3146774 3060671 2979061 2903487 2834563 2771050 2711581 2656881 2609026
50521 2609026 2568576 2533727 2502717 2475902 2454630 2439143 2428908 2424431 2427073 2436821 2451590 2469294
50509 2469294 2489538 2512569 2537689 2563907 2591600 2622179 2656167 2692747 2731557 2773959 2821899
50498 2821899 2876067 2935919 3001336 3073530 3154000 3243009 3339527 3442494 3551389 3665165 3781287
50487 3781287 3896813 4010478 4122888 4234564 4344769 4452872 4560131 4669150 4781830
50478 4781830 4898534 5019046 5143520 5272239 5404842 5540003 5675847 5811040 5945890
50469 5945890 6082297 6222265 6366451 6514100 6663873 6814445 6964778 7114414 7263087
50460 7263087 7409540 7550913 7683689 7804670 7910322 7995848 8056159 8087964 8090312 8063378
50450 8063378 8007764 7924967 7817342 7687082 7535949 7366520 7183303 6992401 6800414 6613587
50440 6613587 6437219 6275331 6130948 6006497 5903452 5821915 5761444 5722200 5704179 5704992 5719280
50429 5719280 5740544 5762463 5778103 5779558 5760085 5716352 5647723 5554059 5435699 5295462 5138992
50418 5138992 4972273 4799370 4622808 4445115 4268934 4095986 3926961 3762706 3604949
50409 3604949 3455426 3314632 3182002 3057245 2940933 2833544 2734612 2643501 2560756 2487801
50399 2487801 2425038 2370902 2323239 2281164 2244958 2214379 2187809 2163385 2140660 2120781 2105068
50388 2105068 2093609 2085294 2079057 2074883 2073632 2076115 2082503 2092517 2105960 2122855 2142930 2165037
50376 2165037 2187460 2209254 2231145 2254633 2280378 2308181 2338511 2372845 2411951 2454889 2500732
50365 2500732 2550348 2605142 2664500 2726139 2789058 2854624 2924314 2997670 3073260 3150751 3231230
50354 3231230 3316115 3406360 3502051 3602025 3704194 3806838 3909314 4011168 4111134 4207534
50344 4207534 4299125 4384949 4463832 4534775 4597474 4651608 4695620 4726746 4742113 4739335 4716551
50333 4716551 4673061 4610298 4531482 4439813 4337297 4225589 4107675 3988212 3872122 3762887
50323 3762887 3662123 3570504 3488877 3418488 3360414 3315002 3281637 3258636 3243410 3233323 3226666
50312 3226666 3222523 3219532 3215060 3205717 3188360 3160547 3120720 3068643 3005641 2934033 2856217 2774215
50300 2774215 2689619 2603639 2517429 2432554 2350772 2273000 2198793 2127295 2058556 1993549 1933164
50289 1933164 1877737 1827478 1782585 1742579 1705944 1670997 1637336 1606235 1579481 1557769 1540301
50278 1540301 1525928 1514384 1506165 1501293 1498505 1495634 1490563 1482014 1469980 1455604 1440361 1425223
50266 1425223 1410755 1397733 1386974 1378355 1370617 1362672 1354886 1348900 1346354 1347919 1353165 1361038 1370731
50253 1370731 1382262 1396033 1411705 1427847 1442925 1456530 1469693 1484279 1501877 1522550 1544430
50242 1544430 1565013 1583019 1598715 1612726 1625564 1638404 1652895 1669335 1685829 1700226 1712369
50231 1712369 1723625 1734760 1745343 1754979 1764110 1773538 1783930 1796054 1811143 1830811 1856275 1886711
50219 1886711 1917823 1942856 1956344 1957189 1948124 1933094 1915783 1899552 1886842 1878297 1873337 1871590
50207 1871590 1873044 1877202 1883376 1891760 1903075 1917070 1932658 1949663 1969165 1991848 2017474 2046583
50195 2046583 2081238 2122992 2171142 2224097 2281701 2345257 2416134 2495603 2585317 2686359 2797754
50184 2797754 2917055 3042185 3171415 3301523 3427532 3544962 3651604 3746869 3830708 3904010
50174 3904010 3968985 4027633 4079665 4122394 4152210 4165451 4158376 4127774 4072181 3992117 3889259
50163 3889259 3766376 3628201 3481157 3331179 3182145 3036805 2898294 2769501 2651231
50154 2651231 2542196 2440965 2347002 2259703 2177623 2099346 2024553 1953755 1887569 1826736 1772184
50143 1772184 1724309 1682492 1645878 1614190 1587150 1563523 1541640 1520767 1501162 1482811 1464994
50132 1464994 1447403 1430989 1417175 1406524 1398500 1392301 1387534 1384106 1381763 1379963 1378264 1376683 1375449
50119 1375449 1374509 1373751 1373756 1375647 1379699 1384671 1389226 1393682 1399494 1407130 1415508 1423823 1433041 1444938 1460113
50104 1460113 1477589 1496090 1515047 1534425 1554318 1575172 1597976 1623516 1651267 1679607 1707643
50093 1707643 1736528 1768337 1803777 1841723 1881138 1922461 1966570 2013248 2061601 2111602 2164190
50082 2164190 2219987 2278880 2341035 2407531 2479743 2558732 2645640 2742362 2851469 2975454 3115934
50071 3115934 3273264 3446970 3636719 3842676 4064385 4299288 4542420 4787230 5026477
50062 5026477 5253419 5463809 5657340 5836576 6004170 6161362 6308500 6445290 6569211
50053 6569211 6673833 6749410 6785784 6775875 6717840 6614645 6471404 6292990 6084233 5851585
50043 5851585 5602995 5345582 5084129 4822271 4564322 4315194 4078795 3856962 3649785
50034 3649785 3456857 3278579 3116277 2970608 2840160 2722506 2616557 2522543 2439546 2364770
50024 2364770 2296229 2234710 2181541 2135418 2093207 2053401 2017052 1985236 1957203 1931473 1907499
50013 1907499 1885610 1866015 1848286 1831264 1813385 1793878 1773794 1755054 1738256 1722223 1705953
50002 1705953 1689999 1675456 1662656 1651613 1642867 1636677 1631812 1626240 1619094 1611223 1603844 1597378 1591533
49989 1591533 1585859 1580153 1574918 1571386 1570450 1571628 1573894 1577510 1583987 1593874 1605696 1617721 1629821
49976 1629821 1642651 1655936 1668970 1682346 1697566 1714890 1733053 1751457 1771257 1793687 1818526
49965 1818526 1845068 1873485 1904157 1936568 1970074 2005200 2042886 2082975 2124867 2169525 2219456
49954 2219456 2276602 2341506 2414725 2497685 2591519 2695998 2810158 2933102 3063521 3198854
49944 3198854 3335296 3468141 3592251 3703501 3800724 3885790 3961476 4029847 4092535 4150713
49934 4150713 4203311 4245785 4271640 4274744 4249860 4192632 4101271 3978394 3830066 3663094 3484033
49923 3484033 3299828 3117148 2940334 2771070 2610446 2460236 2321814 2195046 2079017
49914 2079017 1973227 1877659 1792371 1717345 1651846 1593575 1539638 1489042 1443212 1403221 1367599
49903 1367599 1334121 1302712 1274791 1250280 1227429 1205829 1187459 1173655 1162707 1152071 1141856
49892 1141856 1134218 1129701 1126211 1121992 1117804 1115193 1114053 1113361 1113361 1115135 1118093 1119756 1118614 1115767 1112869
49877 1112869 1109684 1104979 1098913 1092790 1086621 1078648 1067749 1055044 1042393 1030337 1018351 1006333
49865 1006333 994795 984082 974375 966189 959890 954829 949916 945063 941106 938237 935652 933142 931928
49852 931928 933022 935517 937538 938466 939172 940292 941488 942769 945440 950909 958909 967568 975201 981710 988311
49837 988311 996183 1005342 1014529 1022073 1026984 1029462 1030560 1031377 1032220 1032261 1030102 1025022 1017642 1009355 1001376
49822 1001376 994539 989204 984486 978083 968208 955887 944165 934710 926446 918097 910559 905468 902535
49809 902535 900053 897557 896221 896555 897369 897558 897629 898796 901552 905828 911666 918817 926176 932582 938128
49794 938128 944136 951808 961212 971414 981238 989869 996965 1002432 1006371 1009344 1012207 1015144 1017080 1016777
49780 1016777 1014412 1011272 1007870 1003313 996856 989149 981387 973982 966906 960806 956802 955178 954844 954212
49766 954212 952487 950325 949433 951109 954824 958573 961043 963074 966477 971717 977399 981966 985300 988522
49752 988522 992567 997165 1001107 1003440 1004435 1005365 1007317 1010251 1013024 1014123 1012661 1009196 1005594 1003547 1003018
49737 1003018 1002388 1000042 995440 988982 981684 974892 969312 964117 957936 950903 944686 940198 936496 932488
49723 932488 928401 924749 921181 917560 915009 914327 914129 912297 908894 906118 905509 906648 908560 910987 914178
49708 914178 918692 925525 935076 945778 955054 961995 967876 973665 978351 980482 980258 979194 978405 978044 977888
49693 977888 977731 977390 976633 974846 970845 963887 955151 947279 941969 938651 935839 932788 929248 924695 918988
49678 918988 913282 909165 907065 906208 905892 905941 906170 906288 906525 907634 910002 913147 916239 918915 921529 924799
49662 924799 929301 935206 942420 950758 959799 968936 978173 988688 1001583 1015777 1028038 1035708 1038832
49649 1038832 1039188 1038151 1036337 1034420 1032834 1030830 1027104 1021709 1016452 1013086 1011727 1011255 1010629 1009386 1007359
49634 1007359 1004453 1000751 996730 993407 992073 993496 997300 1002250 1006984 1010459 1012281 1013323 1015662 1020986
49620 1020986 1028989 1038058 1047545 1058491 1071912 1087357 1103639 1120154 1136671 1152301 1165524 1175078
49608 1175078 1180412 1181665 1179933 1177232 1175271 1174175 1173076 1171891 1171748 1173504 1176750 1180588 1184395 1187009
49594 1187009 1185943 1178814 1165793 1149839 1134143 1119815 1106170 1092582 1079488 1067927 1058674 1051770
49582 1051770 1046570 1042327 1038993 1037294 1037675 1039324 1040760 1041367 1041805 1042713 1043567 1043243 1041378 1038624 1035750
49567 1035750 1033107 1030871 1028984 1026584 1022364 1016355 1010887 1008654 1009732 1011488 1011751 1011071 1011309 1013093 1015839
49552 1015839 1019491 1024474 1029894 1033573 1034695 1035196 1037545 1042025 1047210 1052417 1058256 1064998 1071765 1077709
49538 1077709 1083105 1088790 1095062 1101455 1107319 1112481 1117539 1123453 1130472 1137615 1143656 1148561 1153397 1158892
49524 1158892 1164682 1169897 1173844 1176124 1176953 1177580 1179564 1183193 1187189 1190285 1192486 1194407 1196257 1198182
49510 1198182 1200915 1204999 1209610 1213182 1215365 1217631 1221673 1227850 1235527 1244311 1254121 1264014 1271799 1275614
49496 1275614 1275906 1275184 1275439 1276194 1275541 1272632 1268349 1263811 1259377 1255456 1253170 1253331 1255324 1257749 1259913
49481 1259913 1262078 1264598 1267427 1270214 1272204 1272349 1270435 1268164 1268371 1272815 1281064 1291479 1302817 1314876
49467 1314876 1328263 1343794 1361765 1381623 1402581 1424452 1447298 1470277 1491652 1510271 1526305
49456 1526305 1540035 1550594 1556802 1558895 1558590 1557605 1556909 1557311 1559538 1563101 1565943 1566083 1563293 1558433 1551399
49441 1551399 1540753 1525506 1506474 1485542 1464259 1443676 1424838 1408472 1394230 1380937 1367731
49430 1367731 1354558 1341626 1329113 1317660 1308435 1302095 1297955 1294713 1291814 1289648 1288538 1288195 1288257 1288716
49416 1288716 1289349 1289200 1287372 1284356 1281972 1281585 1282555 1282747 1280433 1275661 1270075 1265761 1263975 1264432 1265687
49401 1265687 1266517 1266992 1267965 1269716 1271592 1272861 1273227 1272471 1270363 1267329 1264487 1262486 1260750 1258238 1254368
49386 1254368 1248814 1241278 1232375 1224099 1218344 1215200 1213527 1212725 1212849 1213454 1213789 1214184 1215852 1219019 1222624
49371 1222624 1226340 1231673 1240216 1251710 1264652 1278190 1292722 1309080 1327766 1348561 1370484 1392541
49359 1392541 1414639 1436962 1458105 1474931 1485233 1489967 1492117 1494020 1496610 1500545 1506669 1515235 1525419
49346 1525419 1535800 1545148 1553231 1561327 1571503 1584647 1599448 1613785 1626758 1638945 1651391 1665057
49334 1665057 1680589 1697531 1714064 1728455 1740601 1751415 1761213 1769645 1776766 1782912 1787710 1790385
49322 1790385 1791015 1790368 1788517 1784841 1779518 1773786 1768501 1763677 1759754 1757996 1758839 1760929 1762733 1764455 1767567
49307 1767567 1773017 1780577 1789434 1798628 1807155 1814312 1819986 1824355 1827568 1829817 1831302 1831972 1831752 1831138 1830845
49292 1830845 1830648 1829425 1826775 1823788 1821569 1819894 1818183 1817066 1817767 1820244 1823151 1825658 1828244 1831412
49278 1831412 1834454 1835947 1834942 1831368 1825680 1818533 1810552 1802163 1793691 1785551 1778048 1770952 1763668 1756071
49264 1756071 1748977 1743504 1740038 1737994 1736586 1735723 1736025 1738005 1741446 1745723 1750593 1756352 1763230 1771042
49250 1771042 1779599 1789155 1800237 1813264 1828433 1845588 1863924 1882216 1899761 1916727 1933063 1947245
49238 1947245 1956822 1960241 1957679 1950125 1938408 1923476 1906991 1890875 1876199 1862903 1850689 1839761
49226 1839761 1830400 1822046 1813376 1803603 1793398 1784069 1775889 1767734 1758563 1748817 1739960 1733013 1727922 1724072
49212 1724072 1720788 1717389 1713410 1709011 1704867 1701559 1699309 1698194 1698023 1697859 1696234 1692328 1686669 1680387
49198 1680387 1674044 1667503 1660642 1653787 1647624 1643081 1641040 1641677 1644165 1647446 1651120 1655001 1657937 1657858 1653292
49183 1653292 1644198 1631122 1614374 1594687 1574095 1555033 1538425 1523214 1507979 1492584 1478145
49172 1478145 1465791 1455770 1447630 1440994 1436019 1433039 1431943 1432274 1433960 1437393 1442431 1447868 1452521 1456539
49158 1456539 1460877 1465572 1469333 1471028 1471031 1470879 1471932 1474436 1477540 1480243 1482624 1485904 1490745 1495868 1499307
49143 1499307 1500965 1502892 1506944 1513231 1521093 1530343 1540888 1552142 1563639 1575383 1586943 1597214
49131 1597214 1605981 1614756 1624857 1635415 1644630 1652364 1659984 1668027 1675767 1683213 1691946 1703318 1716853
49118 1716853 1730977 1744659 1758090 1772529 1789789 1811088 1835963 1862800 1890713 1920326 1952525
49107 1952525 1986819 2020945 2051593 2075629 2091476 2099652 2101785 2099451 2094433 2089255 2085827 2083581 2080406
49094 2080406 2075661 2070905 2067293 2063951 2059740 2055218 2051506 2048268 2044227 2039281 2034920 2032855 2034130 2039128
49080 2039128 2047350 2057268 2067407 2077727 2089458 2103722 2120777 2140278 2161524 2183572 2205876 2228817
49068 2228817 2253116 2278702 2304662 2330287 2355723 2381592 2408469 2436910 2467708 2501759 2539478
49057 2539478 2580299 2623105 2667525 2714572 2765490 2820262 2878157 2939716 3007181 3082924 3168839
49046 3168839 3267620 3382585 3513980 3655331 3794898 3922165 4034567 4139398 4248168 4365110
49036 4365110 4478072 4562105 4595861 4576747 4520507 4447009 4366999 4279933 4180160 4063814 3932583
49025 3932583 3793687 3656375 3527441 3409716 3304010 3210883 3130165 3060345 2999611 2946969
49015 2946969 2901861 2863439 2830746 2802861 2778477 2756275 2736225 2719532 2706603 2696038 2686425
49004 2686425 2678047 2671685 2666645 2661563 2656797 2654448 2655767 2659631 2663862 2667246 2670109 2673826 2680129 2690120
48990 2690120 2703292 2717905 2732707 2748078 2765214 2784403 2804534 2824230 2843285 2862856 2884239
48979 2884239 2907477 2931371 2954954 2978616 3003308 3028807 3053450 3075906 3096766 3117929 3140593
48968 3140593 3164317 3188011 3211314 3234716 3258727 3283428 3308757 3334702 3360988 3386896 3411676
48957 3411676 3435069 3457264 3478626 3499718 3521425 3544660 3569865 3596989 3625914 3656727 3689548
48946 3689548 3724181 3759863 3795331 3829466 3862170 3894376 3926980 3959933 3992644 4024769 4056015
48935 4056015 4085481 4112050 4135585 4157059 4177324 4196308 4213673 4229685 4244886 4259190 4271753
48924 4271753 4281820 4289590 4296275 4303175 4310460 4316898 4321129 4323222 4324658 4326745 4329418 4331607 4332336 4331363
48910 4331363 4329141 4326438 4323783 4321114 4318052 4314400 4310084 4304809 4298388 4291494 4285635 4282170 4281536 4283314
48896 4283314 4286555 4290269 4294327 4300004 4308917 4321304 4336018 4352367 4371075 4393037 4417990 4445102
48884 4445102 4474304 4506340 4541811 4580718 4622688 4667315 4714515 4764831 4818967 4876779 4937242
48873 4937242 4999689 5064550 5132522 5203641 5277563 5354138 5433224 5514567 5598343 5685003 5774045
48862 5774045 5863853 5953693 6044961 6139242 6235776 6332343 6428281 6525089 6623974 6724230 6824364
48851 6824364 6923574 7021475 7117302 7210161 7299694 7386151 7470193 7552690 7634109 7713825 7790446
48840 7790446 7862976 7931368 7996070 8057615 8116585 8173254 8227134 8277395 8323705 8365946 8403243
48829 8403243 8434215 8458364 8476370 8488876 8495854 8497305 8493404 8483436 8465631 8438940 8404369 8363884
48817 8363884 8318625 8268808 8214633 8156230 8092974 8023797 7948295 7867149 7781586 7692804 7601737
48806 7601737 7508995 7415167 7321220 7228110 7135751 7043086 6949695 6856835 6766337 6679051 6594986
48795 6594986 6514354 6437502 6364237 6294237 6227975 6166228 6108695 6054115 6002073 5953870 5911195
48784 5911195 5874432 5842648 5814809 5790658 5770549 5754838 5743653 5737465 5737600 5745361 5760226 5779628
48772 5779628 5801355 5825636 5853884 5885955 5920104 5955604 5993739 6035577 6080122 6125752 6172582
48761 6172582 6222214 6275567 6331929 6390012 6449143 6509465 6571502 6635408 6700311 6764840 6828841
48750 6828841 6894020 6961953 7031787 7100861 7167540 7232437 7297014 7362216 7428673 7496798 7565814
48739 7565814 7633642 7698840 7762115 7825100 7888211 7950642 8011822 8071419 8128033 8179390 8224317
48728 8224317 8263559 8298239 8328599 8354735 8377383 8396916 8412346 8422460 8427395 8427872 8423134 8411036
48716 8411036 8390348 8361903 8327249 8287216 8242166 8192546 8138505 8079721 8016357 7949489 7879773
48705 7879773 7806220 7727158 7642163 7552255 7458502 7361321 7260996 7158010 7052868 6946460
48695 6946460 6840668 6737597 6637837 6540389 6444793 6352511 6265444 6183690 6105673 6030199 5957469
48684 5957469 5888168 5822494 5760252 5701103 5644400 5589439 5536415 5486575 5440834 5398523 5358129
48673 5358129 5319132 5282414 5248925 5218675 5191258 5166651 5144926 5125635 5108197 5092796 5080318
48662 5080318 5071207 5064753 5059763 5055738 5053219 5052918 5054580 5056840 5058353 5059098 5060293 5063101 5067761 5074104
48648 5074104 5082281 5092457 5104208 5116901 5130485 5145352 5161593 5179033 5197803 5218026 5238971
48637 5238971 5259362 5278656 5297201 5315056 5331792 5347946 5365606 5386542 5410230 5434490 5457652
48626 5457652 5479534 5500803 5522245 5544374 5567003 5589274 5610588 5631161 5651270 5670581 5689123
48615 5689123 5708319 5729728 5752775 5774877 5794062 5810434 5824779 5836863 5845923 5852141 5856538 5859338
48603 5859338 5858840 5851954 5835647 5808041 5768614 5717812 5656776 5587378 5511982 5432651 5350587 5266512
48591 5266512 5181368 5096419 5012956 4932245 4855373 4782582 4713008 4645642 4580411 4517890 4458298
48580 4458298 4401431 4347142 4294988 4243611 4191606 4139158 4087969 4039450 3993739 3950469 3909274
48569 3909274 3869212 3828874 3787917 3747730 3709848 3674203 3639639 3605665 3573008 3542679 3515173
48558 3515173 3490531 3468698 3449671 3433327 3419173 3406544 3395488 3387074 3382077 3379600 3378078 3377774
48546 3377774 3380897 3388656 3399311 3410102 3420182 3430499 3441401 3451727 3460394 3467954 3476283 3487092
48534 3487092 3500672 3515715 3530374 3543757 3556252 3568421 3580092 3590770 3600186 3607950 3613371 3616390
48522 3616390 3618182 3619937 3621389 3621396 3619771 3617630 3615878 3614106 3611210 3606599 3600697 3594620 3589451 3585540 3582492
48507 3582492 3579844 3577485 3575259 3572633 3569155 3564769 3559190 3551411 3540398 3525895 3507967 3486243 3460508
48494 3460508 3431872 3402432 3373594 3345219 3316377 3286462 3255683 3225096 3196055 3169028 3142906
48483 3142906 3115992 3087727 3059017 3030908 3003531 2976477 2949664 2923541 2898550 2874613 2851253
48472 2851253 2828282 2806133 2785145 2764760 2744356 2724938 2708746 2696517 2686292 2676026 2666541
48461 2666541 2660366 2658036 2656871 2653285 2645020 2631318 2612619 2590778 2568463 2547539 2528410 2511010
48449 2511010 2495648 2482667 2472200 2464639 2460559 2459756 2461155 2464192 2469539 2477820 2488288 2499626 2511632
48436 2511632 2524905 2538705 2550026 2555671 2555118 2550696 2544771 2537450 2527678 2516007 2504870 2495796 2487597
48423 2487597 2478177 2467321 2456611 2447257 2439256 2432334 2426327 2420588 2414266 2407609 2402002 2398276 2395591
48410 2395591 2392392 2388022 2383088 2378671 2375302 2372370 2368574 2363441 2358230 2354685 2352926 2351259 2348109 2343513
48396 2343513 2338686 2334859 2332576 2331344 2329673 2325933 2319441 2310380 2298902 2285025 2269323 2252852 2236187
48383 2236187 2219240 2202119 2185242 2168314 2150130 2130113 2109423 2089674 2070756 2050743 2028188
48372 2028188 2004051 1980890 1960266 1941397 1922548 1903123 1883752 1864814 1846111 1828111 1812227
48361 1812227 1799161 1787871 1776840 1765590 1754447 1743761 1734116 1726240 1719891 1713802 1707587 1702469
48349 1702469 1699002 1695424 1689865 1683080 1677169 1672451 1667569 1662038 1656583 1651248 1645158 1638172 1631092 1624399
48335 1624399 1618235 1613231 1609584 1605621 1599181 1590288 1580838 1572001 1563751 1556336 1549918 1543018 1533772 1522716
48321 1522716 1512160 1502998 1494579 1487496 1483404 1481727 1479583 1475801 1472154 1469632 1466402 1461057 1455377 1451977
48307 1451977 1450946 1450416 1448994 1446376 1442887 1439550 1437504 1436694 1436276 1436433 1438197 1441352 1444453 1447039 1449705
48292 1449705 1451998 1452758 1452769 1454327 1457784 1461332 1464648 1469694 1477251 1485920 1495485 1507960 1524066 1541828
48278 1541828 1559952 1579487 1600838 1622180 1642069 1660559 1676938 1690056 1702054 1717760 1738871
48267 1738871 1762638 1787666 1816488 1850648 1887969 1927096 1970200 2018793 2071484 2128358 2192657
48256 2192657 2265470 2343859 2427020 2518900 2621797 2733303 2852894 2985499 3135335 3303401
48246 3303401 3494861 3720829 3987855 4293687 4638380 5030289 5475528 5972657 6525321
48237 6525321 7148407 7854053 8647092 9545888 10590417 11816480 13245916 14919410 16886431
48228 16886431 19078432 21180907 22710440 23294868 22894701 21758656 20207125 18480246
48220 18480246 16730688 15060826 13526861 12138765 10886499 9762804 8759568 7862669
48212 7862669 7062881 6361338 5756849 5237515 4790362 4409222 4087266 3811000 3568181
48203 3568181 3354642 3168245 3002988 2854006 2721848 2606695 2503765 2408926 2323658 2250008
48193 2250008 2185152 2125015 2069132 2018188 1970613 1925159 1883310 1846016 1811422 1778590 1749985
48182 1749985 1727377 1708642 1691315 1676037 1663802 1653074 1642582 1634006 1629024 1626161 1622972 1618769
48170 1618769 1612877 1603042 1588304 1571152 1554362 1537836 1520724 1504268 1489982 1477013 1463676 1449984
48158 1449984 1436653 1423321 1409576 1396035 1382822 1368813 1353895 1339884 1327636 1315398 1301556
48147 1301556 1286764 1271690 1255237 1237071 1219506 1204387 1190210 1174767 1158752 1144232 1131220
48136 1131220 1118473 1106311 1095940 1086907 1077676 1068112 1059322 1051648 1044638 1038339 1032982 1028020 1022908
48123 1022908 1018008 1013542 1008741 1003351 998689 995631 992745 988084 981758 975144 968700 962329 956821 953021
48109 953021 950304 947480 944469 941550 937958 933096 928295 925414 924089 922129 918410 913927 910248 908221
48095 908221 907846 908172 907650 905674 903233 901077 898049 892699 885931 880517 878167 878238 879045 879377 879037 878905
48079 878905 880202 882870 885115 885282 883654 881696 880245 879324 878954 879107 879419 879838 880980 883070 885279 886877
48063 886877 888183 889595 890727 891484 892896 895660 898838 901245 903317 906283 910320 914730 919140 923266
48049 923266 926408 928578 931342 936027 941858 947338 952715 959389 967439 975484 982650 989061 994693 999430
48035 999430 1004114 1009903 1016501 1022416 1027041 1031198 1035570 1039891 1043812 1047472 1051051 1054675 1058723 1063332
48021 1063332 1067667 1070703 1072658 1074624 1076794 1078065 1077622 1076134 1075156 1075664 1077037 1077341 1075220 1071897 1070368
48006 1070368 1071927 1074533 1075639 1075450 1075837 1077006 1077243 1075704 1073540 1072127 1071789 1072427 1073884 1075178 1074602
47991 1074602 1071186 1065357 1058014 1049743 1041008 1032199 1023279 1014083 1004996 996646 988948 981109 972498 962942
47977 962942 952508 941719 931576 922460 913398 903424 893315 884834 878470 873121 867871 862860 858307
47964 858307 853789 848753 842950 836322 829232 822697 817604 813721 810115 806257 802006 797088 791696 787128
47950 787128 784508 783072 781059 778200 775953 775288 775580 775837 775802 775601 775394 775518 776086 776551 776787 778254 782429
47933 782429 788077 791968 792852 793040 795165 798881 801900 803120 803326 803449 803425 802769 801488 800242 799759 799993
47917 799993 799900 798470 795876 793058 790353 787297 783661 779722 775510 770909 766612 763749 762111 759846 755543
47902 755543 749774 743979 738742 733909 729575 726048 723238 720863 718973 717658 716523 715072 713465 712378
47888 712378 712172 712547 713005 713397 713922 714577 714695 713394 710790 708483 708400 711179 715961 721294 725753 728273
47872 728273 728883 729004 730093 731982 733387 733929 734586 735908 736872 736079 733536 730810 729753 731091 733734 735417
47856 735417 734715 732491 730783 730331 729950 728297 725277 721541 717720 714631 713292 713941 715509 716710 717337
47841 717337 718107 719603 721714 723828 725328 726090 726657 727682 729103 730198 730519 730507 731251 733809 738556 744781
47825 744781 751088 756524 761083 764927 767782 769654 771383 773627 775849 777255 778067 778801 779063 778566 778680
47810 778680 780995 784537 786481 785916 784985 785751 787715 789103 788850 786460 781703 775751 771089 768765 766732
47795 766732 762372 755862 749637 745251 742230 739521 736536 732888 728471 724112 721059 719371 717459 713687
47781 713687 708288 703390 701035 701086 701307 699830 697285 695845 696372 697553 697983 697943 698492 699722 700798 701189
47765 701189 701118 701130 701855 703979 707825 712909 718115 722379 725509 728656 733610 741012 749604 758031 766880
47750 766880 777788 790882 804665 818321 832348 846723 860442 873613 888085 904869 922571
47739 922571 939622 956431 973807 990636 1004964 1016365 1025509 1032226 1035934 1037413 1038192 1038334 1036587
47726 1036587 1032704 1027987 1023370 1018509 1013066 1007526 1002253 996856 991128 985873 982251 980668 980603 981168 981812
47711 981812 982661 983993 985312 985647 985278 986211 989920 995275 999932 1003162 1005861 1008121 1008676 1007023 1004452
47696 1004452 1002191 999643 995188 987870 977673 965024 950934 937160 925398 916202 908888 902248 895362
47683 895362 888286 882264 878703 877509 876699 874064 869128 863318 858430 855150 852929 851083 849789 849736 850793
47668 850793 851566 850854 849263 848660 849993 852217 853521 853113 851574 849843 848219 846240 843304 839381 835019
47653 835019 830631 825990 820634 814614 808523 802878 797625 792195 785893 778440 770297 762346 755194 749016
47639 749016 743999 740356 737783 735636 733978 733683 734923 736288 736279 735139 734221 734007 733886 733783 734763 737693
47623 737693 742022 746228 748991 749991 750298 751989 756506 763083 769483 774495 778969 784072 789428 793605
47609 793605 795825 796411 796016 795269 795057 796166 798247 799731 799228 796791 793473 789932 785977 781400 776551
47594 776551 771841 767234 762747 759067 756996 756422 756463 756598 757106 758424 760763 764361 769275 774687 779325
47579 779325 783041 787269 793396 801250 809704 818131 826627 835341 844377 854088 864869 876919 890580
47566 890580 906351 924008 942319 960406 978959 999160 1020744 1042145 1062458 1082282 1102351
47555 1102351 1122074 1139786 1154153 1165147 1173742 1180509 1184453 1183585 1176847 1164898 1148775 1128717
47543 1128717 1105110 1079761 1054855 1030756 1005993 979460 951774 924410 898429 874259 851920
47532 851920 831039 811135 792219 774904 759845 747251 736771 727534 718596 709737 701523 694267
47520 694267 687417 680542 674242 669238 665063 660720 656293 652727 650221 648071 646163 645340 645940 647023 647524
47505 647524 647365 647048 646863 646874 647103 647452 647993 649358 652024 655079 656727 656445 655740 656155 657297 657626 656673
47488 656673 655500 655146 655476 655828 656278 657667 660325 663195 664776 664844 664539 664548 664135 662653 661148 661164 662405
47471 662405 662933 661593 658872 655313 650635 645110 640475 638446 639001 640882 643087 644998 645629 643945 640047
47456 640047 635423 631787 629726 628387 626392 623259 619974 617838 616786 615381 612655 609363 607095 606520
47442 606520 606921 607183 606880 606510 606892 608289 610134 611614 612293 612000 610498 607828 604745 602178 600380 599139
47426 599139 598579 598948 599806 600424 601074 602917 606261 609691 611418 611007 609610 609037 610746 615032 620863 626841
47410 626841 632340 637231 640934 642901 644072 646507 650942 655720 658824 660219 661534 664025 667475 670621
47396 670621 672116 671586 670257 670242 672828 677666 683540 689303 694165 698092 702170 707585 713966 719828 725064
47381 725064 731640 741020 752097 762804 772835 783518 795775 809551 824783 841482 858841 875490
47369 875490 890912 905915 921509 937721 953456 967167 977949 986290 993333 999059 1001938 1000965 997284
47356 997284 992760 987550 980326 970705 960249 950901 943311 936854 930627 924243 918134 913116 909267 905464
47342 905464 900460 894117 887107 879872 872677 866266 861441 858081 855356 852783 850229 847154 843019 838457
47328 838457 834894 832680 830597 827626 824284 821770 820585 820541 821428 823043 824945 826821 828804 831020 832975
47313 832975 833775 832853 830474 827816 826487 827332 829440 830824 830381 828737 826907 824761 821344 816219 809801
47298 809801 802638 794966 786822 778013 768203 757781 748540 742551 739862 737904 733693 726347 717201 708042
47284 708042 699989 693686 689417 686588 683788 680001 675525 671423 668392 666515 665617 665205 664295 662066 658756
47269 658756 655404 652650 650330 648232 646574 645463 644518 643441 642525 642168 642238 642362 642558 643030 643464 643081 641561
47252 641561 639555 638065 637448 637215 636735 635868 634776 633410 631666 629953 628971 628689 628147 626713 624935 623589
47236 623589 622456 620906 619130 617725 616413 614450 612236 611183 611748 612861 613591 614180 614966 615513 615411 614899
47220 614899 614120 612923 612037 613139 616788 621398 625317 628830 632974 637561 641896 646512 652391 659029 665023
47205 665023 670265 675793 681627 686666 690904 696051 703352 712211 721535 731162 741289 751535 761168 769304
47191 769304 774359 774434 769153 760520 751270 742973 736149 731131 727777 724965 721599 717988 715304 713697 711875
47176 711875 708873 705587 704055 705381 708782 712629 716092 719550 723683 728714 734540 740939 747338 753005
47162 753005 758132 764206 772548 782749 793246 803070 812135 820287 827424 834500 842765 851494 857883 860062
47148 860062 859146 857431 855641 853129 849849 846425 842649 837702 832191 828467 828030 829505 830042 828223 824863
47133 824863 821386 818454 816192 814854 814701 815547 816853 818181 819347 820297 821184 822476 824683 827907 831908
47118 831908 836585 842109 848557 855813 863915 873080 883099 893128 902449 911222 920109 929423 939011 948685
47104 948685 958148 966533 972617 975789 976555 975983 974827 973246 971194 968869 966694 964761 962441 958859 953810
47089 953810 947851 941439 934558 927447 920964 915654 910951 906072 901287 897436 894466 891424 887916 884484
47075 884484 881297 877496 872489 867175 863055 860498 858700 857302 857129 858817 861229 862095 860505 858193 857742
47060 857742 859686 861960 862144 859535 855007 849814 844995 841100 837689 833636 828607 823690 819944 816959
47046 816959 813741 810288 807086 803620 798929 793510 789106 786332 783860 780356 775894 770835 764640 756913
47032 756913 748881 742628 739018 737062 735164 732385 728534 723694 718042 712180 707305 704417 703094 701633
47018 701633 698997 696063 694092 692590 690000 686231 682885 680774 678806 675997 673223 672010 672576 673913
47004 673913 675043 675414 674884 674076 674035 674808 675147 674340 673378 673378 673743 673130 671551 670240 669881 670234 671225 673095
46986 673095 675572 678055 680634 683864 687514 690631 692951 695172 697557 699290 699677 699193 698800 698859 699191 699799
46970 699799 701011 703073 705886 708993 711810 714090 716226 718800 721890 725118 728297 731621 735315 739456
46956 739456 743997 748391 751294 751445 749173 746504 745396 746092 747427 748384 748989 749752 750595 750662 749302 747065
46940 747065 745268 744506 744102 743259 742160 741378 740781 739848 738856 738863 740501 743357 746512 749096 750509 750979 751902
46923 751902 754740 759364 764237 768382 772421 777433 783694 790826 798285 805054 809757 811997 813153 815104
46909 815104 818459 822629 827140 832004 837118 842236 847489 853032 858095 861238 861927 861203 860433 859954 859400
46894 859400 858858 858957 859923 861173 862071 862732 863882 866107 869398 873229 876868 879768 882021 884403 887573 891050
46878 891050 893350 893489 892220 891497 892824 896322 901074 905830 909577 912159 914515 917706 921506 924580 926309
46863 926309 927652 929616 931532 931847 930288 928267 927110 926844 926937 927355 928263 929205 929198 927504 924047 919383 914546
46846 914546 910646 908199 906982 906744 907693 909919 912742 915317 917784 921239 926465 933245 940989 949489 958645
46831 958645 967812 975953 982606 988564 995434 1004297 1014591 1024452 1032446 1038876 1045138 1051939 1058657 1064376
46817 1064376 1068878 1072337 1074751 1076216 1077406 1079150 1081628 1084451 1087459 1091033 1095556 1100945 1106832 1113030
46803 1113030 1119713 1127085 1134768 1141618 1146610 1150087 1153758 1159120 1166252 1174364 1182894 1191400 1198961 1204723
46789 1204723 1208990 1212876 1216904 1220793 1224616 1229045 1234123 1238773 1242028 1243857 1244260 1242660 1239282 1236294
46775 1236294 1236168 1239099 1243146 1246766 1250006 1253218 1256022 1258147 1260235 1263051 1266507 1270148 1274012 1278373
46761 1278373 1283131 1288244 1294271 1301563 1309046 1314878 1318516 1321531 1326099 1333138 1341891 1350687 1357892 1362830
46747 1362830 1366231 1369491 1373224 1376909 1380028 1382922 1386184 1389868 1393722 1397522 1400517 1401332 1399555 1397016
46733 1397016 1396256 1397769 1399865 1401399 1403321 1406987 1412008 1416641 1419765 1421680 1423394 1425756 1429058 1432991
46719 1432991 1437265 1442505 1449945 1459687 1469895 1478488 1485291 1491652 1498280 1504512 1509854 1515271 1522436 1532013
46705 1532013 1543036 1553928 1564146 1574871 1587800 1603077 1618914 1633678 1647766 1662560 1677959
46694 1677959 1692220 1704420 1715885 1728583 1743024 1758614 1775431 1794374 1815329 1836061 1853511
46683 1853511 1865984 1873811 1878358 1881194 1884074 1888494 1894307 1899330 1901451 1901046 1900377 1900710 1901180 1900650 1899235
46668 1899235 1897472 1895508 1894100 1894976 1898655 1902997 1905611 1906952 1909181 1912570 1915243 1916390 1917339 1918834
46654 1918834 1919385 1917389 1913220 1907984 1901599 1893573 1884616 1875792 1866489 1854729 1839651 1822666 1805931
46641 1805931 1790159 1774100 1755937 1735226 1713534 1692899 1673738 1654859 1635581 1616887 1599847
46630 1599847 1583682 1566346 1546914 1526680 1507770 1491093 1475880 1461080 1446818 1433950 1422207
46619 1422207 1409744 1395287 1380117 1366917 1356973 1349552 1343511 1338061 1332124 1324651 1315972 1307451 1299578
46606 1299578 1291861 1284729 1279675 1276858 1274501 1271614 1269502 1269331 1269919 1269441 1267805 1265716 1262872 1258992 1255430
46591 1255430 1253536 1252358 1250128 1247355 1246077 1246277 1245404 1241715 1236147 1230555 1225838 1222279 1220168 1219486 1220021
46576 1220021 1222104 1226225 1231976 1238516 1245967 1254986 1265073 1274870 1284100 1293549 1303081 1311591 1319313 1328121
46562 1328121 1338674 1349001 1356971 1362712 1367601 1372376 1377423 1383397 1389976 1395073 1396960 1396555 1396188 1396633
46548 1396633 1396751 1395632 1393571 1391059 1388153 1385057 1382216 1379538 1376311 1372203 1367843 1364315 1362435 1362466 1363947
46533 1363947 1365770 1366882 1367122 1367131 1367569 1368665 1370350 1372375 1374298 1375658 1376242 1376127 1375598 1375082 1374867 1374799 1374607
46516 1374607 1374644 1375688 1377599 1378834 1378098 1376241 1375675 1377795 1381549 1384765 1386410 1387188 1388186 1389486 1390363 1390625
46500 1390625 1391101 1392510 1394314 1395463 1396171 1398034 1402018 1407090 1411415 1414368 1416739 1419396 1422676 1426959
46486 1426959 1432873 1440503 1448914 1456974 1464471 1472165 1480897 1490948 1502214 1514542 1527558 1540362 1551980
46473 1551980 1562496 1573511 1587083 1604081 1623675 1644213 1664365 1683724 1702907 1723161 1745357
$$ [...]
##END NTUPLES=NMR SPECTRUM
##END=
