
##TITLE=UV1152_M3-1004-1000_6301692_qxS3JLbsuf
##JCAMPDX= 6.0         $$ Bruker NMR JCAMP-DX V2.0
##DATA TYPE= NMR SPECTRUM
##DATA CLASS= NTUPLES
##ORIGIN= BRUKER
##OWNER= Administrator
$$ 1.72 TOPSPIN		Version 2.1
$$ 2012-06-05 22:37:04.796 -0500  Administrator@TOPSPIN
$$ Compression mode = diff/dup
##.OBSERVE FREQUENCY= 400.13188235
##.OBSERVE NUCLEUS= ^1H
##.ACQUISITION MODE= SIMULTANEOUS (DQD)
##.ACQUISITION SCHEME= undefined
##.AVERAGES= 8
##.DIGITISER RES= 22
##SPECTROMETER/DATA SYSTEM= spect
##.PULSE SEQUENCE= zg30
##.SOLVENT NAME= COFFEE_meoh
##.SHIFT REFERENCE= INTERNAL, COFFEE_meoh, 1, 14.98061
##AUDIT TRAIL= $$ (NUMBER, WHEN, WHO, WHERE, PROCESS, VERSION, WHAT)
$$ ##TITLE= Audit trail, TOPSPIN		Version 2.1
$$ ##JCAMPDX= 5.01
$$ ##ORIGIN= Bruker BioSpin GmbH
$$ ##OWNER= Administrator
$$ $$ C:\Bruker\TOPSPIN/data/COFFEE/nmr/UV1152_M3-1004-1000_6301692_qxS3JLbsuf/10/pdata/1/auditp.txt
$$ ##AUDIT TRAIL=  $$ (NUMBER, WHEN, WHO, WHERE, PROCESS, VERSION, WHAT)
(   1,<2012-06-05 22:36:57.312 -0500>,<Administrator>,<TOPSPIN>,<go>,<TOPSPIN 2.1>,
      <created by zg
	started at 2012-06-05 22:35:50.437 -0500,
	POWCHK enabled, PULCHK disabled,
       configuration hash MD5:
       D5 CA 7A 23 FE 6B EE E2 50 67 74 61 24 F7 5E 3B
       data hash MD5: 64K
       BD 8A E0 7D 11 02 F4 27 3B F5 D1 CA 77 11 92 30>)
(   2,<2012-06-05 22:37:00.062 -0500>,<Administrator>,<TOPSPIN>,<proc1d>,<TOPSPIN 2.1>,
      <Start of raw data processing
       efp LB = 0 FT_mod = 6 PKNL = 1 PHC0 = 0 PHC1 = 0 SI = 32K 
       data hash MD5: 32K
       43 FE 6D 39 0E 42 BE 93 77 F6 42 3B 17 50 09 8E>)
(   3,<2012-06-05 22:37:00.421 -0500>,<Administrator>,<TOPSPIN>,<proc1d>,<TOPSPIN 2.1>,
      <pk PHC0 = 210.7892 PHC1 = 0 
       data hash MD5: 32K
       A8 9E 0E 53 A6 E5 03 CD 6D 79 BF 13 68 65 91 CD>)
(   4,<2012-06-05 22:37:00.640 -0500>,<Administrator>,<TOPSPIN>,<proc1d>,<TOPSPIN 2.1>,
      <abs ABSG = 1 
       data hash MD5: 32K
       DF 1A DE C4 A4 56 06 AF FB 2A F6 A0 34 F6 C5 28>)
(   5,<2012-06-05 22:37:00.703 -0500>,<Administrator>,<TOPSPIN>,<proc1d>,<TOPSPIN 2.1>,
      <abs ABSG = 2 
       data hash MD5: 32K
       13 3D E0 6E 62 0B 5B D5 36 12 CB 18 09 6A 44 94>)
(   6,<2012-06-05 22:37:00.781 -0500>,<Administrator>,<TOPSPIN>,<proc1d>,<TOPSPIN 2.1>,
      <abs ABSG = 3 
       data hash MD5: 32K
       75 66 E9 A4 B0 4E 7E 2E 1A 03 22 32 80 21 B2 2B>)
(   7,<2012-06-05 22:37:00.828 -0500>,<Administrator>,<TOPSPIN>,<proc1d>,<TOPSPIN 2.1>,
      <abs ABSG = 4 
       data hash MD5: 32K
       D3 5E B1 51 6F 7C D2 DD 8E D8 F6 AE 01 5E BF AB>)
(   8,<2012-06-05 22:37:00.843 -0500>,<Administrator>,<TOPSPIN>,<proc1d>,<TOPSPIN 2.1>,
      <abs ABSG = 5 
       data hash MD5: 32K
       D1 4D B3 A5 3C 22 08 EE 6F 98 B6 00 82 37 4A 7D>)
$$ ##END=
$$ 
$$ $$ hash MD5
$$ $$ 26 B4 EE C0 61 5A B9 95 84 0A A9 D6 23 88 5C EA
##$RELAX= 
##$RELAX= 
##$RELAX= 
##$RELAX= 
##$RELAX= 
##$RELAX= 
##$RELAX= 
$$ Bruker specific parameters
$$ --------------------------
$$ [...]
150 150 150 150 150 150 150 150
##$TP07= 0
##$TPNAME0= <>
##$TPNAME1= <>
##$TPNAME2= <>
##$TPNAME3= <>
##$TPNAME4= <>
##$TPNAME5= <>
##$TPNAME6= <>
##$TPNAME7= <>
##$TPOAL= (0..7)
0.5 0.5 0.5 0.5 0.5 0.5 0.5 0.5
##$TPOFFS= (0..7)
0 0 0 0 0 0 0 0
##$TUNHIN= 0
##$TUNHOUT= 0
##$TUNXOUT= 0
##$USERA1= <user>
##$USERA2= <user>
##$USERA3= <user>
##$USERA4= <user>
##$USERA5= <user>
##$V9= 5
##$VALIST= <valist>
##$VCLIST= <CCCCCCCCCCCCCCC>
##$VD= 0
##$VDLIST= <DDDDDDDDDDDDDDD>
##$VPLIST= <PPPPPPPPPPPPPPP>
##$VTLIST= <TTTTTTTTTTTTTTT>
##$WBST= 2048
##$WBSW= 25
##$XGAIN= (0..3)
0 0 0 0
##$XL= 0
##$YL= 0
##$YMAX_a= 532799
##$YMIN_a= -647620
##$ZGOPTNS= <>
##$ZL1= 120
##$ZL2= 120
##$ZL3= 120
##$ZL4= 120
##$ABSF1= 14.98061
##$ABSF2= -5.57192
##$ABSG= 5
##$ABSL= 3
##$ALPHA= 0
##$AQORDER= 0
##$ASSFAC= 0
##$ASSFACI= 0
##$ASSFACX= 0
##$ASSWID= 0
##$AUNMP= <proc_prof1d_extract_pilot.lims>
##$AXLEFT= 0
##$AXNAME= <>
##$AXNUC= <1H>
##$AXRIGHT= 0
##$AXTYPE= 0
##$AXUNIT= <>
##$AZFE= 0.1
##$AZFW= 0.1
##$BCFW= 0
##$BC_mod= 0
##$BYTORDP= 0
##$COROFFS= 0
##$CY= 15
##$DATMOD= 1
##$DC= 0
##$DFILT= <>
##$DTYPP= 0
##$F1P= 0
##$F2P= 0
##$FCOR= 0.5
##$FTSIZE= 32768
##$FT_mod= 6
##$GAMMA= 0
##$GB= 0
##$INTBC= 1
##$INTSCL= 1
##$ISEN= 128
##$LB= 0
##$LEV0= 0
##$LPBIN= 0
##$MAXI= 10000
##$MC2= 0
##$MEAN= 0
##$ME_mod= 0
##$MI= 0
##$NCOEF= 0
##$NC_proc= -8
##$NLEV= 6
##$NOISF1= 0
##$NOISF2= 0
##$NSP= 0
##$NTH_PI= 0
##$NZP= 0
##$OFFSET= 14.98061
##$PC= 1
##$PHC0= 210.7892
##$PHC1= 0
##$PH_mod= 1
##$PKNL= yes
##$PPARMOD= 0
##$PPDIAG= 0
##$PPIPTYP= 0
##$PPMPNUM= 2147483647
##$PPRESOL= 1
##$PSCAL= 4
##$PSIGN= 0
##$PYNMP= <proc.py>
##$REVERSE= no
##$SF= 400.13
##$SI= 32768
##$SIGF1= 0
##$SIGF2= 0
##$SINO= 400
##$SIOLD= 32768
##$SPECTYP= <>
##$SREGLST= <1H.CDCl3>
##$SSB= 0
##$STSI= 32768
##$STSR= 0
##$SW_p= 8223.68421052632
##$SYMM= 0
##$S_DEV= 0
##$TDeff= 65536
##$TDoff= 0
##$TI= <>
##$TILT= no
##$TM1= 0
##$TM2= 0
##$TOPLEV= 0
##$USERP1= <user>
##$USERP2= <user>
##$USERP3= <user>
##$USERP4= <user>
##$USERP5= <user>
##$WDW= 1
##$XDIM= 32768
##$YMAX_p= 454147658
##$YMIN_p= -705676
##$CURPLOT= <Network HP LaserJet P1505>
##$CURPRIN= <$Network HP LaserJet P1505>
##$DFORMAT= <normdp>
##$LAYOUT= <+/1D_H.xwp>
##$LFORMAT= <normlp>
##$PFORMAT= <normpl>
##$SURQMSG= 1
$$ End of Bruker specific parameters
$$ ---------------------------------
##NTUPLES= NMR SPECTRUM
##VAR_NAME=  FREQUENCY,     SPECTRUM/REAL,   SPECTRUM/IMAG
##SYMBOL=    X,             R,               I
##VAR_TYPE=  INDEPENDENT,   DEPENDENT,       DEPENDENT
##VAR_FORM=  AFFN,          ASDF,            ASDF
##VAR_DIM=   32768,         32768,           32768
##UNITS=     HZ,            ARBITRARY UNITS, ARBITRARY UNITS
##FACTOR=    0.250966925370066, 1,           1
##FIRST=     8223.43324360095, -48647,       -88421
##LAST=      0,             -47990,          -126842
##MIN=       0,             -705676,         0
##MAX=       8223.43324360095, 454147658,    0
$$ Real data points
##PAGE= N=1
##DATA TABLE= (X++(R..R)), XYDATA
$$ [...]
19521a79763A01546b24276B12422a4810B01157a10898F1605P7394J6809a6934
19510a6493k12564a02988O486j87162a31104G4595l5177a99687c9562j20370A8424
19498a69340G6839a61264k1028I8791i568j7039j27727D9259a42716A8647b21525
19486B6283N1457c05896a10342r5651A45991c00797J04902Q2302O719d6951D3827
19474c63902A48384a24375L1659A57919a40917P319C0035b950k44593N5028R0792
19463a01723A8303c98067A6201a58524A028a12470C1744J18358a4962l34541J70859
19452a78644d2672N118j18636m0894j16641a45168A37687A0395b56158j21478
19442c77636J34188A37148m0332d55487A90541A7069P2539B1088b05559b2808
$$ plain form
19521 -179763 101546 -224276 212422 -14810 201157 -110898 61605 138999 155808 -16934
19510 -16493 -229057 -102988 -96502 -283664 -131104 74595 39418 -199687 -39562 -159932 18424
19498 -169340 76839 -161264 -182292 98791 -9568 -26607 -154334 49259 -142716 18647 -221525
19486 26283 77740 -305896 -110342 -205993 145991 -300797 -195895 -113593 -106874 -46951 43827
19474 -363902 148384 -124375 -92716 157919 -140917 -133598 30035 -2950 -247543 -192515 -101723
19463 -101723 18303 -398067 16201 -158524 1028 -112470 31744 150102 -14962 -349503 -178644
19452 -178644 -42672 -37554 -156190 -197084 -313725 -145168 137687 10395 -256158 -377636
19442 -377636 -243448 137148 96816 -455487 190541 17069 89608 21088 -205559 -22808
19431c23851a18560k1770k94718J26988J07622g7609A50960b63405j40934B3558
19420A14820D0549J63543J54645F8811a46983j81150A41617o3952b09643C0316
19409a76445k26147O7475a55438F4111a03450k64069a19669p9980A58308d21066
19398A74338a10295M1993l959J8513D5069j5122a23913A83861m8790b47545a19797
19386h4183j47071L1600a2106j11979B76455H8946L1150c16827A40966a86941
19375g1326A48507k3783k6087a16947C9593K33907c17386d3116j38399e8747p5717
19364a34464j76519b4935g227D7777N7937A4792L3937e2154H4824P7206g5066
19352a28966j54363B20344f4424A85599a49009n9211B37294N3627C5547i0846
$$ plain form
19431 -323851 -118560 -140330 -435048 -308060 -200438 -77609 150960 -263405 -404339 23558
19420 114820 40549 204092 358737 68811 -146983 -328133 141617 77665 -209643 30316
19409 -176445 -402592 -335117 -155438 64111 -103450 -367519 -119669 -199649 158308 -421066
19398 174338 -110295 -68302 -72261 -53748 45069 29947 -123913 183861 135071 -247545 -119797
19386 -84183 -231254 -199654 -12106 -124085 276455 88946 120096 -316827 140966 -186941
19375 -71326 148507 124724 98637 -116947 39593 273500 -317386 -43116 -181515 -58747 -134464
19364 -134464 -310983 -24935 -7227 47777 105714 14792 48729 -52154 84824 162030 -75066
19352 -128966 -283329 220344 -64424 185599 -149009 -208220 237294 290921 35547 -90846
19341B12948a69795F444c08379B14001c94882B5189f1325l11108A61873b91866
19330a16613b0262m05462f4209a2405m92281B41410a91660c2352f557l1001A69882
19318b27154A38720a94772e1708l3047q9997j81210J64563b0115j94053F5156
19307G6177b30049J11953M7031k58346b6108j80135d6061H9519j8826a06213A45891
19295B02550a8140j55632a020B24308c3199C8637b35709n1436B636J38876L3234
19284A74746e2705q0306a8256B15944d6737A99219I7111L8595b81223b088l4148
19273c6236m8399A9466K94529h2319n8735e7762a4879k8173l06610J04172b7258
19261H783J58994f475k91848B24974a34922A01191e5895K6972j84337b2030j31640
$$ plain form
19341 212948 -169795 6444 -308379 214001 -394882 25189 -61325 -372433 161873 -291866
19330 -116613 -20262 -425724 -64209 -12405 -504686 241410 -191660 -32352 -6557 -37558 169882
19318 -227154 138720 -194772 -51708 -84755 -174752 -355962 -191399 -20115 -214168 65156
19307 76177 -230049 -118096 -71065 -329411 -26108 -206243 -46061 89519 70693 -106213 145891
19295 202550 -18140 -173772 -1020 224308 -33199 38637 -235709 -287145 2636 141512 174746
19284 174746 -52705 -133011 -18256 215944 -46737 199219 97111 135706 -281223 -2088 -36236
19273 -36236 -84635 19466 313995 -82319 -141054 -57762 -14879 -43052 -349662 -245490 -27258
19261 8783 167777 -6475 -298323 224974 -134922 101191 -55895 -28923 -213260 -22030 -153670
19250a53670K6822K7103j9148m20908d4076l40836L6500d4127a8505d349j1272
19239a5621p3773M0925a224G5090c9844A91054L0347J2245c3002q0045B53504
19227a1610j14693b1541C462K4687J91069b30774B08117R8617A11443a398k0502
19216b1900j17753a2687q9922L0807k32201f9667c2182m00629I4060b05491A15793
19204I9928a89520P5510o6783B8201J83991d14764B05751F5992b86613D0090b77215
19192A39211N4215l3648a74376O5704N1764k5381k8610A51785c9189j20365f8907
19180f4622j11812B0432J67724K36096D0842Q2026b98927d5124A51367g6188B25196
19168b37204J15176k85793B19892r6771A0929J94309I7494c85375J33756m173
$$ plain form
19250 -153670 -126848 -99745 -118893 -539801 -44076 -384912 -348412 -44127 -18505 -4349 -15621
19239 -15621 -89394 -48469 -1224 75090 -39844 191054 221401 233646 -33002 -113047 253504
19227 -11610 -126303 -21541 3462 28149 219218 -230774 208117 306734 111443 -1398 -21900
19216 -21900 -139653 -12687 -102609 -71802 -304003 -69667 -32182 -432811 94060 -205491 115793
19204 99928 -189520 -114010 -180793 28201 212192 -414764 205751 65992 -286613 40090 -277215
19192 139211 193426 159778 -174376 -108672 -56908 -82289 -110899 151785 -39189 -159554 -68907
19180 -64622 -176434 20432 188156 424252 40842 122868 -298927 -45124 151367 -76188 225196
19168 -237204 -122028 -407821 219892 123121 10929 205238 97494 -385375 -251619 -255792
19158b55792A9710J58630b49660J7519h0465b0337k51751A87820J04501C0482
19147C9000j1068e5182A3962a83749m9378A06265B0499a27029J8037D5359N565
19136E0924b59747b7149p9622l5629b0397k20656B64345j01669B7274d64047a85935
19124f7578q7914M4974I9598J74496B4132a84666P8516o5447B1448a50126E3703
19112i8825q6217O6305k2802l5851j22002J09876b8430D3812N6781b62657f6819
19100h3584j20424K0420g7559j34478Q6633K4751d028m59870D3226L0602K9525
19089A03353f2463k10386J04715k9462D6195c79783B09430c1195j17810A6428
19078b5702A37158b27420c3197k46255A7432b59063o3278A39430C1011e23878
$$ plain form
19158 -255792 19710 178340 -249660 -232141 -80465 -20337 -272088 187820 292321 30482
19147 39000 27932 -55182 13962 -183749 -233127 106265 20499 -127029 -108992 45359 50924
19136 50924 -259747 -27149 -106771 -142400 -20397 -241053 264345 162676 27274 -464047 -185935
19124 -67578 -155492 -110518 99598 274094 24132 -184666 -106150 -171597 21448 -150126 53703
19112 -98825 -185042 -118737 -141539 -177390 -299392 -189516 -28430 43812 100593 -262657 -66819
19100 -83584 -204008 -183588 -77559 -212037 -125404 -100653 -4028 -463898 43226 73828 103353
19089 103353 -62463 -272849 -168134 -197596 46195 -379783 209430 -31195 -149005 16428
19078 -25702 137158 -227420 -33197 -279452 17432 -259063 -322341 139430 31011 -523878
19067a61329O473C251J14129c95109a35551L9737j35860B89629b64392K9656j30298
19056c65034a56118a7372e491B05341l8467m9108e32209h2432K3840F3894e6485
19044a25000n8005A83591L710c05354C3158a6283n0866k33687b3764j36817f684
19032A05024K3145b15412k31456D0582M462b21300b8782k9121D5180g8356A13235
19020B87041I1571K3962L777m8920l5062J92447A10928a50232N8305A00775p691
19009I3084M7082B2731a15333D6596b4547J066E8306k7974a72443A19158b6139
18997c37690J28244A01541J22780a76909B2026a39556M9263A14384k9682a04224
18986a18165j73891H3310P3316a14042A5683g3649A3227K08130b86880B09849
$$ plain form
19067 -161329 -154856 3251 117380 -395109 -135551 -95814 -231674 289629 -264392 -234736 -365034
19056 -365034 -156118 -17372 -5491 205341 166874 117766 -532209 -82432 -58592 63894 -56485
19044 -125000 -183005 183591 187301 -305354 33158 -16283 -67149 -300836 -23764 -160581 -6684
19032 105024 128169 -215412 -446868 40582 45044 -221300 -28782 -57903 45180 -78356 113235
19020 287041 91571 115533 119310 70390 35328 227775 110928 -150232 -91927 100775 93084
19009 93084 140166 22731 -115333 46596 -24547 -23481 58306 30332 -172443 119158 -26139
18997 -337690 -209446 101541 224321 -176909 22026 -139556 -90293 114384 84702 -104224
18986 -118165 -292056 83310 156626 -114042 15683 -73649 13227 221357 -286880 209849
18975D6478a13302Q119a2814A2945K19218f6367n4811r2300a06277A55125o1489
18964I3636b52324B79724b98426A38002b74308J11402A96011e0208A57304a35352
18953a42304m0305k3820b0432o9306B4050K9514J05012c29426f1057C46095j16108
18942B29987N6900b5360k11884g4655Q30n4460B56519d5827j6160C74335c76647
18930f2608j23966L5449C86183A77599c74470J10575m2861g01A41899R856b67419
18918B09740a48320I7248l8004J25407h581j37602A0680b23465A4128K35994j09076
18907A41046B8524H209c55531h2092j33286j0476A23771b60702P4710B00559H7959
18895b96689o3266B071b70259A2256K98423j09573a35936j9908q5499M9136P3363
$$ plain form
18975 46478 -113302 -105183 -12814 12945 232163 -66367 -121178 -213478 -106277 155125 93636
18964 93636 -252324 279724 -298426 138002 -274308 -162906 196011 -50208 157304 -135352
18953 -142304 -182609 -206429 -20432 -89738 24050 53564 158576 -329426 -61057 346095 229987
18942 229987 286887 -25360 -237244 -74655 -73825 -128285 256519 -45827 -61987 374335 -376647
18930 -62608 -186574 -151125 386183 177599 -374470 -263895 -306756 -701 141899 151755 -267419
18918 209740 -148320 97248 59244 184651 -8581 -146183 10680 -223465 14128 250122 141046
18907 141046 28524 8209 -355531 -82092 -215378 -225854 123771 -260702 -185992 200559 87959
18895 -296689 -359955 2071 -270259 12256 310679 201106 -135936 -155844 -241343 -192207 -118844
18884a18844e5010E9710a65142H1935J64409j04157g0221o8852A03748i2615D2110
18872A53293b33460A49731B1322J48064f9967j17701j8569P8180A47346a05422
18861D5686n69J24332d99256H31J24614c88201a8236m19230m6031A10733a0723
18849b52551a14597N6144j81581Q4637A10245A1157c00736B48446D8275d2076
18838c08603c6338A54703g1143k13525a28123B8841M9513e983A37188J9867j0873
18827A46182a65072a7853c923m2386j51191d2770n6528F5119J05111b74898q235
18816b83133i257l0294r7990j02473A1738N1451J84238i7219B08537g6034E3913
18804D1409Q1471J48372c7782C5756K39305i9713j38671A01274R5200p229d04669
$$ plain form
18884 -118844 -55010 59710 -165142 81935 246344 142187 -70221 -139073 103748 -92615 42110
18872 153293 -233460 149731 21322 169386 -69967 -187668 -206237 -128057 147346 -105422
18861 45686 45117 169449 -499256 831 125445 -388201 -18236 -437466 -483497 110733 -10723
18849 -252551 -114597 -58453 -240034 -155397 110245 11157 -300736 248446 48275 -42076
18838 -308603 -36338 154703 -71143 -284668 -128123 28841 78354 -5983 137188 157055 146182
18827 146182 -165072 -17853 -3923 -46309 -197500 -42770 -99298 65119 170230 -274898 -283133
18816 -283133 -9257 -39551 -137541 -240014 11738 63189 247427 -97219 208537 -76034 53913
18804 41409 122880 271252 -37782 35756 275061 -99713 -238384 101274 196474 189245 -404669
18792H8590P3205c0387k39000C33237A6212a35311F063N8922J1279a14082L5773
18781g8309k7893j6053F8899a15953k02523i4759A08197a45263I6207b87111J26335
18770a60776k3642C03055C0149J75047K9862c18243I2527b34751R2702J0436L9248
18759i2365B46194H2846l2581J13345a6507k27258p241a9793k5152j90242h124
18747c3373A37426b85986A18321d0024j5144J4746A38395H733P8030A0448J95886
18736B06334a86195A20660A8105L2249M306j6973O4740A2474J20987a11569D3257
18724b8786o4704l8124k1155H8444e7217A82297J59555A41329e34l44184J26682
18713b18036A71865d09488J18296J36640m7615Q0714J5455A78247J41444c21529
$$ plain form
18792 88590 161795 -30387 -269387 333237 16212 -135311 6063 64985 76264 -114082 -78309
18781 -78309 -106202 -122255 68899 -115953 -318476 -94759 108197 -145263 96207 -287111 -160776
18770 -160776 -184418 303055 30149 205196 235058 -318243 92527 -234751 -142049 -131613 -92365
18759 -92365 246194 82846 50265 163610 -16507 -243765 -251006 -19793 -44945 -235187 -8124
18747 -33373 137426 -285986 118321 -40024 -55168 -40422 138395 8733 86763 10448 206334
18736 206334 -186195 120660 18105 50354 54660 37687 102427 12474 133461 -111569 43257
18724 -28786 -93490 -131614 -152769 88444 -57217 182297 341852 141329 -534 -344718 -218036
18713 -218036 171865 -409488 -291192 -154552 -202167 -121453 -105998 178247 319691 -321529
18702b17021j28792A70390d14309A03735a55342O6831O444A22464e6185j19016
18692a75201h6121J5576A29803D7396a62441B524b26848E9363i5995A15417a58596
18680A91204B1276d28784a51621F886a73405B2550a717p3866l8601J8j07054F5304
18667c2029B8824J36379c40688d235k43314R6082A34901M4309C4991a39693j9901
18656a59594C1495a91059E0665a23061p0066m8092A84436E1618J47042b33508
18645F1625a02382j1976q9155A43189F9312b67538c0665j15578m8636B19315g4774
18633b13851d1027l1135n8411j13730a08015k6744j46168f364n8784A52296n4937
18622I7359N6120P348g1543m84o3936F2577c07536J51374n268A4899a82494A54177
$$ plain form
18702 -217021 -345813 170390 -414309 103735 -155342 -88511 -82067 122464 -56185 -175201
18692 -175201 -86121 -70545 129803 47396 -162441 2524 -226848 59363 -95995 115417 -158596
18680 191204 21276 -428784 -151621 6886 -173405 22550 -1717 -75583 -114184 -114166 -221220 65304
18667 -32029 28824 165203 -340688 -4235 -247549 -151467 134901 179210 34991 -139693 -159594
18656 -159594 31495 -191059 50665 -123061 -193127 -241219 184436 51618 198660 -233508
18645 61625 -102382 -114358 -203513 143189 69312 -267538 -30665 -146243 -194879 219315 -74774
18633 -213851 -41027 -72162 -130573 -244303 -108015 -134759 -280927 -6364 -65148 152296 97359
18622 97359 153479 160827 -71543 -72027 -135963 62577 -307536 -156162 -161430 14899 -182494 154177
18609d3897C98505c85553h5873K781G4265l2223j7424i901H4882e60230a14064
18597a84548B8839O6644b50665P1308j41548i6131G0825a02924m3338P0281H4144
18585a97250o7060E8119g2838E1671N8966N7706e957B10352A4384c19986D10470
18573a29977b3456A76304b41450J09679d7000B28550d20256B69516b05898Q9315
18563a16583A23550g6213k0392j38368F5099C0477q529D098J13515a7236A47704
18551b01152P3447C8542O2546R3008l4182k6036d7820j28656l8653k27445a64045
18539A61563a68593k06092a39942B94961b10231R9808j61042d4925j26114K5476
18529a45563c2233k62186R0653h1125j57541G311c20747J14698J02728A91051
$$ plain form
18609 -43897 398505 -385553 -85873 -83092 74265 42042 24618 -9901 84882 -560230 -114064
18597 -184548 28839 95483 -250665 -179357 -320905 -96131 70825 -102924 -146262 -75981 84144
18585 -197250 -264310 58119 -72838 51671 110637 168343 -5957 210352 14384 -319986 410470
18573 -129977 -23456 176304 -241450 -131771 -47000 228550 -420256 269516 -205898 -116583
18563 -116583 123550 -76213 -96605 -234973 65099 30477 21948 4098 117613 -17236 147704
18551 -201152 -127705 38542 101088 194096 159914 133878 -47820 -176476 -215129 -442574 -164045
18539 161563 -168593 -374685 -139942 294961 -210231 -110423 -271465 -44925 -171039 -145563
18529 -145563 -32233 -294419 -203766 -81125 -238666 7311 -320747 -206049 -103321 191051
18518a13960I1605a9869i825j20650l0976M6628J0554C38839A8031K40570a13501
18506h9987K4535k55949a48183A87133Q3753m7649c05401E7676p955b07157k6133
18495b33290p840A79065d5535B0341N0046a24753c0963k06489d2618D1637M3652
18484H5289J98033a39532O0325A05882d32804f0039I8088a66288E9389R3202l679
18473A48912i5859B44945b2496C86737d2320A37585b77543d928H0443e3170B62214
18461A9416a99791A6300b19161G93h0917E04b81089h4836k09998M2922L6297k04066
18449d19681E1356K30092b58732A6056a00301j56482A37567A4926a85877E0202
18438B87053F6011j7527F132c99882b9994C8413J3342a59184A1082a2913r6956
$$ plain form
18518 -113960 91605 -19869 -9825 -130475 -161451 -114823 -104269 338839 18031 258601 -113501
18506 -89987 -65452 -321401 -148183 187133 270886 223237 -305401 57676 49721 -207157 -233290
18495 -233290 -241130 179065 -45535 20341 70387 -124753 -30963 -237452 -42618 41637 85289
18484 85289 283322 -139532 -79207 105882 -432804 -60039 98088 -166288 59389 152591 148912
18473 148912 -95859 244945 -22496 386737 -42320 137585 -277543 -4928 80443 -53170 262214
18461 19416 -199791 16300 -219161 793 -80917 504 -281089 -84836 -294834 -251912 -215615 -419681
18449 -419681 51356 281448 -258732 16056 -100301 -256783 137567 14926 -185877 50202
18438 287053 66011 48484 6132 -399882 -29994 38413 51755 -159184 11082 -12913 -109869
18427a09869G681J0365f6799C00804c000j89734A09250h7437k21899A45438a66973
18415h8612k34144A56966C5987N8337J50594G6462b3128q6410B24154j08083J5385
18404A31456f4908A66404g2961k2588l4615l8678d2494n1128C20940i6696L9850
18393e6846n6308A35291a36490A33806d18254c5330A46197f5587C726J07079b50196
18381B4793a06951b9955p40A32868n0577a39560O3852B3600a81973A24811i0122
18369b94250f9680b4369j4122l2936j71453b4920l68105E8519a45298B0706a87494
18357a70658m2831e7831J445m7833o7096A3072J06915m4833g2808k87920A5200
18345B87070g5125C76031b998l23570G4239B2974b01869E40365e9605B85161I3272
$$ plain form
18427 -109869 7681 18046 -66799 300804 -3000 -192734 109250 -87437 -309336 145438 -166973
18415 -88612 -322756 156966 35987 94324 244918 76462 -23128 -109538 224154 116071 131456
18404 131456 -64908 166404 -72961 -95549 -130164 -168842 -42494 -93622 320940 -96696 -56846
18393 -56846 -113154 135291 -136490 133806 -418254 -35330 146197 -65587 3726 110805 -250196
18381 24793 -106951 -29955 -30695 132868 82291 -139560 -75708 23600 -181973 124811 -90122
18369 -294250 -69680 -24369 -38491 -71427 -242880 -24920 -393025 58519 -145298 20706 -187494
18357 -170658 -213489 -57831 -56386 -104219 -171315 13072 119987 75154 -72808 -360728 15200
18345 287070 -75125 376031 -2998 -326568 74239 22974 -201869 540365 -59605 285161 93272
18333c20504p2311B02419b59669C0838b50965l6121H9065l5258g1883L5106A01481
18321B35885a45406K6136M2647r2823f2620n8442c9699A09233J91783r2660A03733
18309E897K4143a4724j23777A85706b51291C8210K98816j62458C5845r370b06998
18297C4411J78193b90258A19206h4660j228B41514A7719P4929a63918E9516c81283
18285C6799J37710b5504G3100a55139O7786j66662d413C5766O4967q464L2159
18274A24428l9509N2510b38672M9005N0553A85044a31209A21273J3176a24730
18263b93276A94015c12080A1208l612c07735E2942O0507a35866o9054A26303a63204
18251a17598E100J91755h0316j33486E12312A83728G8214d10736a55302B91444
$$ plain form
18333 -320504 -392815 202419 -259669 30838 -250965 -287086 89065 53807 -71883 -36777 101481
18321 235885 -145406 -119270 -76623 -169446 -62620 -121062 -39699 109233 301016 208356 103733
18309 5897 30040 -14724 -138501 185706 -251291 38210 337026 174568 35845 26475 -206998
18297 34411 212604 -290258 119206 -84660 -85888 241514 17719 92648 -163918 59516 -381283
18285 36799 174509 -25504 73100 -155139 -87353 -254015 -4413 35766 100733 92269 124428
18274 124428 84919 137429 -238672 -189667 -139114 185044 -131209 121273 134449 -124730
18263 -293276 194015 -312080 11208 7596 -307735 52942 113449 -135866 -204920 126303 -163204
18251 -117598 5100 196855 -80316 -213802 512312 183728 78214 -410736 -155302 291444
18240c02539i6042E2991a29393r2035e8612j4484A21115N1973d0667I6281j4729
18229H1552e4745j20322j09131i0463A9671g3108A7468c77598B5306d22640H2436
18217A55772b00827C13129c25880A69598b813k25341l4056I970g0953A88825b2273
18205F231c12288c2259j3062k32710k1181A07433C2742b6906k13625E5087b3245
18193G8222J26338G9618b86409J5913h5326p0636P2480m8515A1535c08929A30250
18181I5927B1810L5812f1817k36083g3174j14591F3582L6865L8093n8002b45501
18169B52029a56277a6928k19275A04129L0555m8264b03854A39154d0565C4329
18158i0806r720q6730E0568K16944A3591b72173B47492a51255J2492J2708d1621
$$ plain form
18240 -302539 -96042 52991 -129393 -221428 -58612 -73096 121115 173088 -40667 96281 81552
18229 81552 -54745 -175067 -284198 -90463 19671 -73108 17468 -377598 25306 -422640 82436
18217 155772 -200827 313129 -325880 169598 -2813 -228154 -262210 9970 -70953 188825 -22273
18205 6231 -312288 -32259 -45321 -278031 -299212 107433 32742 -26906 -240531 55087 -23245
18193 78222 204560 79618 -286409 -270496 -85326 -155962 -83482 -131997 11535 -308929 130250
18181 95927 21810 57622 -61817 -297900 -73174 -187765 63582 100447 138540 80538 -245501
18169 252029 -156277 -16928 -236203 104129 134684 86420 -203854 139154 -40565 34329
18158 -90806 -100526 -187256 50568 267512 13591 -272173 247492 -151255 -138763 -126055 -41621
18146d8484I4070N4653a15718G1788a29998q4035A2874e7670J1129j34312l8268
18135b19121C91158j26914c5690a0924j20870j6936k1280q5717G314J71767F1632
18123a81944b829A34105b29744A3093a11834F9457a35741r9296O9733A11684E4141
18111b43161C3236a88142P2809A63550K0730H7056L5633f3124M279B03004G0689
18099a2123O023k58441j53808A00857A1453b54135c2171j99918O286N559R2211
18088a28033C49913h6424j43504A04621m7412G713J55628a44264C03879A34323
18077a03855A24869b54770e5711k15579B21435I5917i6277l565A76484B6365a05348
18065B72180a48346a9147k1712k10083N6205A47350C9638b46412f7990A60480
$$ plain form
18146 -48484 94070 148723 -115718 71788 -129998 -214033 12874 -57670 -46541 -180853 -219121
18135 -219121 391158 264244 -35690 -10924 -131794 -148730 -170010 -255727 7314 179081 61632
18123 -181944 -2829 134105 -229744 13093 -111834 69457 -135741 -235037 -165304 111684 54141
18111 -243161 33236 -188142 -115333 163550 184280 87056 122689 -63124 -58845 203004 70689
18099 -12123 -6100 -264541 -418349 100857 11453 -254135 -32171 -232089 -225803 -220244 -128033
18088 -128033 349913 -86424 -229928 104621 57209 7713 163341 -144264 303879 134323
18077 -103855 124869 -254770 -55711 -271290 221435 95917 -96277 -99842 176484 26365 -105348
18065 272180 -148346 -19147 -40859 -250942 -194737 147350 39638 -246412 -67990 160480
18054A54500B176K00138C2604c69676g0584A48723i3576A05784k8364j2628K06150
18043B70942l0777R9181A7328a44082A37226e6262J3082k28435J30216j00608
18033b42007D7077J36906b43146A95506e5916N464j8508G4880M0356g4526a8019
18021B1879b12737j34278D8366J93205j10985a07440A55050L7075C2040b40825
18010a8115k30837f5351j68128d688B15631M9172J77914j98428i1085C11474i1282
17998A43546n5053N9882a06269M1653j18669e1766C71044F2050a93353q2889r3726
17987c69968F3653a12483c3654A04666a09174B10041j305n4546c58865j88304
17977e47169b11233g9497K7464J6821j76031B91965F9362a14452m3048f5808B42753
$$ plain form
18054 154500 2176 202314 32604 -369676 -70584 148723 -93576 105784 77420 64792 270942
18043 270942 240165 339346 17328 -144082 137226 -56262 -43180 -271615 -141399 -242007
18033 -242007 47077 183983 -243146 195506 -55916 -50452 -68960 74880 115236 -74526 -18019
18021 21879 -212737 -347015 48366 241571 130586 -107440 155050 192125 32040 -240825
18010 -18115 -248952 -65351 -233479 -4688 215631 264803 442717 244289 -91085 311474 -91282
17998 143546 88493 148375 -106269 -64616 -183285 -51766 371044 62050 -193353 -276242 -369968
17987 -369968 63653 -112483 -33654 104666 -109174 210041 208736 154190 -358865 -547169
17977 -547169 -211233 -79497 -52033 -35212 -211243 291965 69362 -114452 -157500 -65808 242753
17965a58601p8161A94207E6994O4211b06599B87757i9528A54429a1915k50973
17955b62888A6312K82167j24547h7980J3687M109l4228A70492b20139A33673f6634
17943I1155a77214a6793F6295b71591g4313b3958A70981d5091B53842f7281D2598
17931A5463a58248B88364b58987H8535H401b2724r0157j15804C3918b33830N4234
17920a79596b5810g965k00883K9881L1667m9889i1803c2953B02586b8168l28443
17909c56611g1443A65154f2386j41517H052J99796p2366n7326p754d41245a3109
17897a58317B4613a3118A27806a21295G6922J04943a27661a3892j59872F4898
17886I2626J84532n0688H5682N0283a53584r838e2662B21014e39j40719f8962
$$ plain form
17965 -158601 -236762 194207 56994 121205 -206599 287757 -99528 154429 -11915 -262888
17955 -262888 16312 298479 173932 -87980 -74293 -70184 -104412 170492 -220139 133673 -66634
17943 91155 -177214 -16793 66295 -271591 -74313 -23958 170981 -45091 253842 -67281 42598
17931 15463 -158248 288364 -258987 88535 8401 -22724 -112881 -228685 33918 -233830 -179596
17920 -179596 -25810 -7965 -208848 -178967 -147300 -197189 -91803 -32953 202586 -28168 -356611
17909 -356611 -71443 165154 -62386 -203903 8052 207848 135482 78156 70402 -441245 -13109
17897 -158317 24613 -13118 127806 -121295 76922 181865 -127661 -13892 -173764 64898
17886 92626 277158 226470 85682 135965 -153584 -163422 -52662 221014 -539 -141258 -68962
17874a71245C47013h2419j21878H0988N8653a12305J9091j33952i1764K1121C66561
17862a72813N5584A54996i6317J5462j22374A68769i0166A02252e3309A26638
17851e2929C10942a94411i6058B21768p7490C0379b80996J09762D7839R4575a12850
17839B69504b4429j35749A98018m8768c01786b0494H9767J16132G3293a84202
17828B25789K37834d9161k5107r568j91087C12259H5292d3408A39820g00l25876
17817c26576B02593I0444j74J51775K485b7184H4572J10021a56478O5934A44739
17805a01986j01034g2319C8769a96351B7834G068a42108H8676c29615C80142i6822
17793D9867a43695B32677e2219C30613a78281B36129b77395H7555d797k48731
$$ plain form
17874 -171245 347013 -82419 -204297 80988 139641 -112305 -93214 -227166 -91764 -70643 366561
17862 -172813 -117229 154996 -96317 -80855 -203229 168769 -90166 102252 -53309 126638
17851 -52929 310942 -194411 -96058 221768 144278 30379 -280996 -171234 47839 142414 -112850
17839 269504 -24429 -160178 198018 149250 -301786 -20494 89767 205899 73293 -184202
17828 225789 463623 -49161 -74268 -83836 -274923 312259 85292 -43408 139820 -700 -326576
17817 -326576 202593 90444 90270 242045 244530 -27184 84572 194593 -156478 -90544 144739
17805 -101986 -203020 -72319 38769 -196351 27834 7068 -142108 88676 -329615 380142 -96822
17793 49867 -143695 232677 -52219 330613 -178281 236129 -277395 87555 -4797 -253528
17783b53528A92667i6245r1616c6190H7358h5086m6776M0715I7236K5164J8401
17772A40801i1642i311E8543k8413J38853b09608A51452a07714j47392A5203a91796
17760a90210D1328J94747b16309G4265b87714j21688A621Q2734a46346A7543O4771
17749H2314A5987a55788B05813k5729i7293H6491a38212m460j37884B3854d68886
17737a41736m7999A20896a13103n8144q1541A58220l1871c33996l1304A19003
17726A77169a58315f2473F8991b89015A5256i7350D1888a98407C93083a68524
17715b66611e5209B64787l8239J03403B1410a10047M5926D40157A15847n3125
17705F2722a90078f2787C19760A15555Q7291a2581K706D3040b21979A90820k0747
$$ plain form
17783 -253528 192667 -96245 -187861 -36190 87358 -85086 -131862 -91147 97236 122400 140801
17772 140801 -91642 -9311 58543 30130 168983 -209608 151452 -107714 -255106 15203 -191796
17760 -190210 41328 236075 -216309 74265 -287714 -409402 1621 84355 -146346 17543 82314
17749 82314 15987 -155788 205813 180084 -97293 86491 -138212 -142672 -280556 23854 -468886
17737 -141736 -189735 120896 -113103 -171247 -252788 158220 126349 -333996 -365300 119003
17726 177169 -158315 -62473 68991 -289015 15256 -97350 41888 -198407 393083 -168524
17715 -266611 -55209 264787 226548 329951 21410 -110047 -64121 440157 115847 62722
17705 62722 -190078 -62787 319760 115555 202846 -12581 -9875 43040 -221979 190820 170073
17694A70073a48114A06003A9049Q3377h2193B19560a39893m3075q2680e5072l5265
17683i0337J1122n462B68205m4158b424G5887h7376A20751n987J07459d9804F9578
17670A22729a50792M0259o3662G6491J49419a05911M4099A85809K52387C7617
17659A18721J3867P2513I2407a08730b6419j34853D9917J31971D4543J69189a06280
17647I2955i1015C30340H1370a26825C20152a03164j71929o2891b1481B35220
17636C45166A69550e40691a5575D06267b08210d8241q8732A90887J03801b05352
17625c26040J16166R5891A90295K31699j62483A28446f8729j13110c1276q1428
17615a12704A45155K10002J79759b07528a6855A86543b7958A65282a34674B23699
$$ plain form
17694 170073 -148114 106003 19049 102426 -82193 219560 -139893 -182968 -265648 -55072 -90337
17683 -90337 -79215 -84677 268205 224047 -2424 75887 -87376 120751 114764 222223 -49804 69578
17670 122729 -150792 -110533 -174195 76491 225910 -105911 -61812 185809 438196 37617
17659 118721 132588 205101 92407 -108730 -26419 -161272 49917 181888 44543 213732 -106280
17647 92955 -91015 330340 81370 -126825 320152 -103164 -275093 -337984 -21481 235220
17636 345166 169550 -540691 -15575 406267 -208210 -48241 -136973 190887 294688 -205352
17625 -326040 -209874 -113983 190295 421994 259511 128446 -68729 -181839 -31276 -112704
17615 -112704 145155 355157 534916 -207528 -16855 186543 -27958 165282 -134674 223699
17604A33965f4377m0903A00109K9771d9099B32597r7177K72780b11157h4265r9758
17593a84023j34512A2818K9080f3851C16702E6460f9922a6056B80240F963a66666
17581C01212h9824r7419C4262c5632N974A95840a01694n1497B08654l6141O1172
17570B33685p3883m386f8194H9978b450E0673J20014R2702b19462J07755e5653
17558B22473b085k38654a17623o6779D06749A06048a38076K1378F4713J2755N0658
17547A28126n5175J12079i60k7587j73321C8415N6780h558A075J13289b53998
17535G1977a50656D48292a89407B2841j0577J84576M4891E9082b9805A85182a729
17523B40743o7364f1153p494C42675j42612E6575O3741g4869C16027r6563l5233
$$ plain form
17604 133965 -64377 -105280 100109 129880 -49099 232597 135420 408200 -211157 -84265 -184023
17593 -184023 -318535 12818 41898 -63851 316702 56460 -69922 -16056 280240 6963 -166666
17581 301212 -89824 -187243 34262 -35632 -29658 195840 -101694 -153191 208654 172513 233685
17570 233685 159802 155416 -68194 89978 -2450 50673 170687 263389 -219462 -111707 -55653
17558 222473 -2085 -240739 -117623 -184402 406749 106048 -138076 -116698 64713 77468 128126
17547 128126 72951 185030 -960 -28547 -201868 38415 95195 -8558 1075 114364 -253998
17535 71977 -150656 448292 -189407 22841 12264 196840 241731 59082 -29805 185182 -1729
17523 240743 173379 -61153 -68647 342675 200063 56575 120316 -74869 316027 219464 184231
17512A84231m7861a20496A90316R0960b28934A37212b32017M9649e2859A09909
17501A57659n8258J99908A28106J33957p5802K41201C5225a53715C38234a59944
17490D9026Q7175N0294n8293a37923A24502E3568J30295M06448A54155E2003L79817
17479D31820A78366h4485p0269A64836O8562E2066K4818e875B01419r0251c5224
17467I2752D1239M66359o9909A85217G5172K8542b83848f9177B67244A01877L9306
17456A41183J1621M4821A8889b28753B75457e0487A86522e7932A49484M3723f7880
17444A3371c1688A26217J35031e9950A45108Q0285E5931Q5796k7015L50015p3653
17433C91074A60296M21209A8614J60323l6686Q0870j11234J25466K31623k17250
$$ plain form
17512 184231 136370 -120496 190316 281276 -228934 137212 -232017 -182368 -52859 109909
17501 157659 99401 299309 128106 262063 186261 427462 35225 -153715 338234 -159944
17490 49026 136201 186495 128202 -137923 124502 53568 183863 590311 154155 52003 431820
17479 431820 178366 -84485 -154754 164836 233398 52066 76884 -5875 201419 111168 -35224
17467 92752 41239 507598 437689 185217 75172 103714 -283848 -69177 267244 101877 141183
17456 141183 152804 197625 18889 -228753 275457 -50487 186522 -57932 149484 193207 -67880
17444 13371 -31688 126217 261248 -59950 145108 225393 55931 141727 114712 464727 391074
17433 391074 160296 581505 18614 178937 142251 223121 111887 237353 468976 251726
17423B51726l4268N6207o338j26173E669L07916J65496k15684d587A05626L19985
17412D25611c1673D96297q795k42871j1337a9182B22014M9857J35628q8082j37839
17401A81578R4389J36357o4682H6830Q9484p7794a3513B39797A9475L81688g3978
17389A21692k6494L52151A55774Q8833C0317J53418j1497K65j0269J76761j66670
17378A72325a56973P4665r3208C59819a40257G7065m06M13106A50975M5891K69133
17367D65999a45771f482A86763K62236e4819G9890a9439k8911H673J08557J5660
17356A32890L42342a52727G6449J50965j09419B815Q8959M3593j303m0086d1740
17344e4047C23704C7823M0216b97890B87147k967f4627H3386A8869J27656J10255
$$ plain form
17423 251726 217458 273665 267327 141154 5669 313585 479081 263397 -4587 105626 425611
17412 425611 -31673 496297 487502 244631 233294 -19182 222014 271871 407499 319417 181578
17401 181578 275967 412324 347642 86830 176314 98520 -13513 239797 19475 401163 -73978
17389 121692 95198 447349 155774 244607 30317 183735 172238 172503 162234 338995 172325
17378 172325 -156973 -82308 -175516 359819 -140257 77065 76659 489765 150975 196866 465999
17367 465999 -145771 -6482 186763 448999 -54819 79890 -19439 -48350 8673 117230 132890
17356 132890 475232 -152727 76449 227414 117995 2815 91774 135367 134064 93978 -41740
17344 -54047 323704 37823 78039 -297890 287147 284180 -64627 83386 18869 146525 256780
17333B56780A13033L0639J29187L0094J39213A6415K33583b4302B01813P3081
17323B74894j12720E0982J41858J87845j80690a15238D0755c558B4182a2169k29197
17312b41366G0312J39665M5396J92765p8752c4141B99096p1718A03899b0939C21164
17300G0090K71178j18350b5289B83448j14220Q460B5760K7811N64J89948f8670
17288B87071A22327K22531j32438k8778L62490D0281c07084C59187j16973l7932
17278B04282J10777J82694k39934G9746J25655B5025K28196D0267b0328j4553
17268c4881A96598g5756B0352J6349N3016J69421f5141C55529A04633C7563A8489
17256e5759A50073J24234J0092b03759a0669C46634j23086j04661J2859P260O0838
$$ plain form
17333 256780 113033 143672 272859 302953 442166 16415 249998 -24302 201813 274894
17323 274894 162174 50982 192840 380685 199995 -115238 40755 -3558 24182 -12169 -241366
17312 -241366 70312 209977 255373 448138 369386 -34141 299096 227378 103899 -20939 321164
17300 70090 341268 222918 -25289 283448 169228 177688 25760 53571 54135 244083 -68670
17288 287071 122327 344858 212420 183642 546132 40281 -307084 359187 242214 204282
17278 204282 315059 497753 257819 79746 205401 25025 253221 40267 -20328 -34881
17268 -34881 196598 -75756 20352 36701 89717 259138 -65141 355529 104633 37563 18489
17256 -55759 150073 274307 284399 -203759 -10669 346634 223548 118887 131746 139006 199844
17245A99844J18816G0581K52933J4526A40775J34107A23271O0653o8893a30960
17234D2100O2619K2737m12J65877A43087O5192J42457O1703a18956B6413K51362
17223B77775c5323A60393a23345C2176K19587o1502L56663B55718K78508C088
17212B2867N6126Q070K40868D8539j9762K41901A31713J07810q2029L17187j96398
17201B78283k4149J9974o9054G2108o678N31591B51625J46007K3821A84215l234
17190A80981O1016A12936J66093o5380J95974A80307J1072J69504j75134J28009
17180C13758A30324J37849n2960i1547A77642J36355k4401J5576p2782J33184
17170C65574J52177B36108K9290a0822D35592k16754J02892m3418R7389J05094
$$ plain form
17245 199844 318660 70581 323514 338040 140775 274882 123271 183924 115031 -130960
17234 42100 104719 127456 127044 292921 143087 208279 350736 412439 -118956 26413 277775
17223 277775 -35323 160393 -123345 32176 251763 190261 546924 255718 534226 3088
17212 22867 78993 87063 327931 48539 28777 270678 131713 239523 157494 474681 278283
17201 278283 254134 274108 205054 72108 65430 597021 251625 397632 421453 184215 180981
17190 180981 241997 112936 279029 213649 409623 180307 191379 360883 185749 313758
17180 313758 130324 268173 215213 -91547 177642 313997 289596 305172 232390 365574
17170 365574 517751 236108 265398 -10822 435592 218838 321730 278312 375701 480795
17160D80795a26812B51802L35908B90333R1351O5168k17562n3827K65703A72510
17149A84471N9198p6107J14195J95816j94832L4188j45298J01941K0858J26725
17139D21155p1176k2871J20526A60120K1737n2457d685A16861K35146J71733J29103
17128F52843I7734K72987R9610j87688P4756K6603j23717J32788i937B72461j14781
17117A57680N65156k23108F9592B5784M02293o5058j14336J64237a8399F66033
17106D61655A52292L55280J98948A32815M40372a0794C13171J18602K61561m4988
17096F48346k51378j78877j050J70998J36994j40829P2182n5929q1725J40814
17086D59546j83920a22110F94927k28325A06952J84767M47933C47367L74127l05922
$$ plain form
17160 480795 -126812 251802 587710 290333 381684 446852 229290 175463 441166 172510
17149 184471 243669 167562 281757 477573 282741 316929 171631 273572 294430 421155
17139 421155 349979 327108 447634 160120 181857 129400 -4685 116861 352007 523740 652843
17128 652843 97734 370721 470331 282643 357399 384002 260285 393073 -9937 272461 157680
17117 157680 722836 499728 69592 25784 428077 363019 248683 412920 -18399 666033
17106 461655 152292 507572 706520 132815 573187 -10794 313171 431773 693334 648346
17096 648346 396968 218091 217041 388039 525033 384204 456386 400457 318732 459546
17086 459546 275626 -122110 694927 466602 106952 291719 739652 347367 721494 415572
17076D15572p8673K91185k62078H5567L32035r4265A6990K40632K79595j62469
17066C74748p1215K60497J316K1048k53290K58324o4028j69522J04952G0231L20440
17055C90671q047L40438l17150J68469n7083B46691K76241k10010J31392l5206
17045D09108n2411N09197l17709j92696Q2901K82079j01936n7161N2500K94919
17035I08791l25728B62743K71750Q9944j92707L57178k78663J66688C22060M63435
17025G85495j89610j77419k7842J80785p4252Q4310M0627J1680J44157l64320
17015D13611M53774l30336J7558j8938L22472k36283K00092n3132J40062l68549
17005E40331J5739j04613M89130D57628P6711J98365k70685L09945l48384M2284
$$ plain form
17076 415572 336899 628084 366006 85567 417602 323337 16990 257622 537217 374748
17066 374748 303533 564030 565346 586394 333104 591428 527400 357878 462830 70231 390671
17055 390671 382624 723062 405912 574381 517298 246691 522932 312922 444314 409108
17045 409108 356697 865894 548185 355489 438390 720469 618533 561372 613872 908791
17035 908791 583063 262743 534493 624437 431730 788908 510245 676933 322060 785495
17025 785495 595885 418466 390624 571409 497157 581467 622094 633774 777931 413611
17015 413611 867385 537049 554607 535669 858141 621858 821950 768818 908880 540331
17005 540331 556070 451457 940587 457628 534339 732704 462019 771964 423580 465864
16995D65864L31501o697J5069J31058k39412n6997j85384L28699L4998j96025
16985F22674O833K19788K16294k18845j94114K26179l1459j55133o0985M94330
16975A125562m13089O7482j78422L41103P8403o4454k16069J10352j15487J94013
16965I29394j57546J87212k29793n1410L07578l02943L86563o8952L68848l18211
16955A050740K43651k19403j9038j98744K66872k09146j30342L89398k09462J34749
16945A099275k04444J57008J7514K16027m52595K55238R1884j28680K69063l00563
16935A019727K19773n9676O9938J72009k26769R7785o5848k04109O5516Q5382
16925A173728L49157m13775K22710K04702l90139J07508J01013j60894M0737J37793
$$ plain form
16995 465864 797365 790668 805737 936795 697383 640386 455002 783701 818699 622674
16985 622674 629507 849295 1065589 846744 652630 878809 847350 692217 631232 1125562
16975 1125562 712473 779955 601533 942636 1021039 956585 740516 850868 735381 929394
16965 929394 771848 959060 729267 677857 985435 682492 1069055 1000103 1368951 1050740
16955 1050740 1294391 1074988 1055950 857206 1124078 914932 784590 1173988 964526 1099275
16945 1099275 894831 1051839 1069353 1285380 832785 1088023 1179907 1051227 1320290 1019727
16935 1019727 1239500 1179824 1249762 1421771 1195002 1292787 1226939 1022830 1088346 1173728
16925 1173728 1522885 1109110 1331820 1536522 1146383 1253891 1354904 1194010 1234747 1372540
16915A372540j01888J06886J91027k45172J2167K57361k33028p7798j67725O15028
16905A729398J7160j63400j4349R4715m04586N61287j64021J15941k02054O8224
16895A638315K82358j20650m45332K09976K89947L37546n9976o75796P57569k80414
16885A933543K36132N2181l86762L0975K79835J64516k16615k620j31055M24503
16875B384633k37953K44534j75919j08819j0203J18639j09612K07942J25859l09290
16865B129811K06156K20481l54781K63397j72375M40094O7794l0561K74106j09899
16855B934223l03844L98782o0280J47573J00428m78946L59117l0352j67913L06660
16845C205448J23130m23324N50073k59260J06720K25642o7726L23009l95085J00260
$$ plain form
16915 1372540 1270652 1377538 1568565 1323393 1335560 1592921 1359893 1282095 1114370 1729398
16905 1729398 1746558 1583158 1568809 1663524 1258938 1820225 1656204 1772145 1570091 1638315
16895 1638315 1920673 1800023 1354691 1564667 1854614 2192160 2132184 1456388 2213957 1933543
16885 1933543 2169675 2221856 1835094 1866069 2145904 2310420 2093805 2091185 1960130 2384633
16875 2384633 2146680 2391214 2215295 2106476 2096273 2214912 2105300 2313242 2439101 2129811
16865 2129811 2335967 2556448 2201667 2465064 2292689 2732783 2800577 2770016 3044122 2934223
16855 2934223 2630379 3029161 2968881 3116454 3216882 2737936 3097053 3066701 2898788 3205448
16845 3205448 3328578 2905254 3455327 3196067 3302787 3528429 3460703 3783712 3388627 3488887
16835C488887M21667l83249J74902J69633q0142M3808J20572J63957L8819J48394
16825D307248j37879M68328o8591l01846L99951j09750K82543J23747K75032p6030
16815E162753k56671O12586j07674L79343j07299k74213N35684k48045N61992
16806F258456n00344L08203J53977N55510l67178J99763J23706L29443J49809
16797G211345K40390k11665O14299R0623K54172l1640q110M44967L30422L02072
16787I236875J402K65818J81414J90185L76157L76471P9048O48298m13528N98649
16777A1540789M80755K31949L79124M22184N28101K6344Q03108k08250O08175
16768A4812279O70204K01429P94782O41694M61953N39412J63319P88188N27890
$$ plain form
16835 3488887 3910554 3527305 3702207 3871840 3791698 3835506 3956078 4120035 4158854 4307248
16825 4307248 4169369 4637697 4569106 4267260 4667211 4557461 4840004 4963751 5238783 5162753
16815 5162753 4906082 5518668 5410994 5790337 5683038 5408825 5944509 5696464 6258456
16806 6258456 5758112 6066315 6220292 6775802 6408624 6608387 6732093 7061536 7211345
16797 7211345 7451735 7240070 7854369 7944992 8199164 8167524 8159414 8604381 8934803 9236875
16787 9236875 9238277 9504095 9685509 9875694 10251851 10628322 10707370 11355668 10942140 11540789
16777 11540789 12021544 12253493 12632617 13054801 13582902 13609246 14412354 14204104 14812279
16768 14812279 15482483 15683912 16478694 17120388 17582341 18121753 18285072 19073260 19601150
16759A9601150J176392M02098O77014J012015Q70761P25620J207000J221888N78184
16750B7472122J068789J269241J288870J573501R01689J323863J605830J860325
16742C8364230J792318J432832K498667J854355K138957K365348K384007K599552
16734E5430266L131553K977296L103407L296692L695244L642358M176738M204019
16726H3657573M711920M690215N193006N391555N091144N952674O062730O158772
16718A26909589O162460O012477N989854O092988N862165N344597M753130M573342
16710A71700602L825339L016714J996413R24010J60295p74790j850169k771041
16702A76227373l402236m244726n257192n330366n724554o350648n914203o354749
$$ plain form
16759 19601150 20777542 21179640 21856654 22868669 23739430 24465050 25672050 26893938 27472122
16750 27472122 28540911 29810152 31099022 32672523 33574212 34898075 36503905 38364230
16742 38364230 40156548 41589380 44088047 45942402 48081359 50446707 52830714 55430266
16734 55430266 58561819 61539115 64642522 67939214 71634458 75276816 79453554 83657573
16726 83657573 88369493 93059708 98252714 103644269 108735413 114688087 120750817 126909589
16718 126909589 133072049 139084526 145074380 151167368 157029533 162374130 167127260 171700602
16710 171700602 175525941 178542655 180539068 181463078 181623373 180848583 178998414 176227373
16702 176227373 172825137 168580411 163323219 157992853 152268299 145917651 140003448 133648699
16694A33648699o429527n962195o291328n810406o050060n297896n128479n008778
16686H7670030m728010m601449m046409m047645l617560l344368l487250l035539
16678E6761800k701179k920473k486872k502531j991875j955850k436660j520657
16670C8245703j741086j636652j598078j075587j512714j331076j320132p81191
16662B7249187j437458j319155o43883m36486r46393j317924m63101j006587l59872
16653A9318328q38520m39028p09326m13273p69403n64986l8491p67336o87813
16644A4090152J45294o71059q10010q3892k66372m01711n13761l31761j30024
16635A1026856n47033q4560J4614m13465l15205j99989m23850J33311l66595m16743
$$ plain form
16694 133648699 127219172 121256977 114965649 109155243 103105183 97807287 92678808 87670030
16686 87670030 82942020 78340571 74294162 70246517 66628957 63284589 59797339 56761800
16678 56761800 54060621 51140148 48653276 46150745 44158870 42203020 39766360 38245703
16670 38245703 36504617 34867965 33269887 32194300 30681586 29350510 28030378 27249187
16662 27249187 25811729 24492574 23848691 23412205 22465812 21147888 20684787 19678200 19318328
16653 19318328 18479808 18040780 17331454 16918181 16148778 15583792 15545301 14777965 14090152
16644 14090152 14235446 13564387 12754377 12670485 12404113 12002402 11488641 11156880 11026856
16635 11026856 10479823 10395263 10409877 9996412 9681207 9481218 9057368 9190679 8824084 8407341
16625H407341m50509Q9936r8795k27761k50356j37152j35442o2295l97356o6978
16615F670633k41861l40832L16583l36745J70113n88016K84712l51024J0011K54465
16605E848039p00059K75144l91145n4643J18011j43210k32338l1059o1913o3370
16595D563457m05902L07277j46510j95035Q1156r4896j17327r6510n27796P70075
16585D137989k09906m58149J74592l3892P9386k20495j19437k26037K96195n36555
16575B883691J56088j33159N8475N2379p4553j42525j37995J56824k31352J68595
16565B756468M2998q2795o2905r6231p2856n4416K90661j45144m76819K65595
16555B364556j00420n941J465L5279P4347k11599p8292O7644j13140j4003L0309
$$ plain form
16625 8407341 7956832 8046768 7947973 7720212 7469856 7332704 7197262 7134967 6737611 6670633
16615 6670633 6428772 6087940 6404523 6067778 6237891 5649875 5934587 5583563 5593574 5848039
16605 5848039 5147980 5423124 5031979 4977336 5095347 4952137 4719799 4688740 4626827 4563457
16595 4563457 4157555 4464832 4318322 4123287 4204443 4109547 3992220 3895710 3367914 4137989
16585 4137989 3928083 3469934 3644526 3610634 3690020 3469525 3350088 3124051 3420246 2883691
16575 2883691 3039779 2906620 2965095 3017474 2942921 2800396 2662401 2819225 2587873 2756468
16565 2756468 2799466 2716671 2653766 2557535 2484679 2430263 2720924 2575780 2098961 2364556
16555 2364556 2264136 2258195 2259660 2294939 2369286 2157687 2079395 2147039 2033899 2019896 2050205
16544B050205J62432J11541m47469K27899q678j89130M5803O5606k89045J42395
16534A871559O6963j77180j80812L27210k97928j16665m2629M70839j93603R5608
16524A823362p2480k50929R8777J30299k88920M27287k02131k64363J55728l00786
16514A255844Q6626M8532n2642j57906K50428k03186J71940K1984J80425j05624
16504A496421k98615k1041o6883K00600k19166N2394J99276l642K00144l63928
16494A175560K02427k19842j31367K88061k91811J8222M6646l9474N8160j13315
16484I93267K13941J4015k43097J03845k28113L16100k74002m5481J10131J12684
16474A073290k12437J22784j41875K39783j91596Q8028k6910j38779L73629P1481
$$ plain form
16544 2050205 2212637 2324178 1876709 2104608 2095930 1906800 1952603 2018209 1729164 1871559
16534 1871559 1938522 1761342 1580530 1907740 1609812 1493147 1450518 1921357 1727754 1823362
16524 1823362 1750882 1499953 1598730 1729029 1440109 1867396 1665265 1400902 1556630 1255844
16514 1255844 1342470 1391002 1338360 1180454 1430882 1227696 1399636 1421620 1602045 1496421
16504 1496421 1197806 1176765 1109882 1310482 1091316 1143710 1342986 1339344 1539488 1175560
16494 1175560 1377987 1158145 1026778 1314839 1023028 1041250 1087896 1048422 1106582 993267
16484 993267 1207208 1221223 978126 1081971 853858 1169958 895956 850475 960606 1073290
16474 1073290 860853 983637 841762 1081545 889949 977977 951067 812288 1185917 1257398
16464A257398l62486J61712j55766r4440k13861J17188j62839J06311j77101L96200
16454H72316J47220m68231L02782j76847p7202R2532j04035L91636o1852q2606
16444H35713L1780p9384j09745K36774D20606J92606n6063j25679J66392J53434
16434G51296j79325m7477r0315p9045J10350o5892K96587j86037Q725K15021j37317
16423E96571k3863K81825r6978J89030k57452k77336K3780L84872D08133L4037
16413D42170L28283N4497k51391j62035J01870J72395k03987o3340K84474l19070
16403C83866o3660M58279j31642j77175K69324j42224L7957j58194A33324N19045
16393F52369n8108r7189K57391m9476p6580m6020k7498l4049I9333K04582O2146
$$ plain form
16464 1257398 894912 1056624 900858 806418 592557 709745 546906 653217 476116 872316
16454 872316 1019536 551305 854087 677240 600038 692570 588535 980171 918319 835713
16444 835713 867493 788109 678364 915138 420606 613212 557149 431470 597862 751296
16434 751296 571971 524494 434179 355134 465484 399592 696179 510142 518867 733888 596571
16423 596571 572708 854533 757555 946585 689133 411797 435577 820449 408133 442170
16413 442170 770453 824950 573559 411524 513394 685789 481802 418462 702936 383866
16403 383866 320206 778485 646843 469668 738992 596768 634725 476531 133324 652369
16393 652369 594261 497072 754463 704987 628407 582387 554889 520840 99333 303915 366061
16382C66061A66257K36777N0332p7792P2653J99050k44576O0484K5906k6170k23657
16371B39264K15106h0144F07537k32259K6008M136J18663k58388L81979A69372
16360D06405j52883J09183I2371L30558A09546K09298J18550A77708L04549q0681
16350D01576G7438L28903R351J45583B49235K71149J02852j26567P7740L9466
16340F13875F6518M08282j5982B03688q3418L69498A04282n250M70165O3444B57505
16328D43954A84855K39072l0263K10984j40356A30424d0176D82061k40638J54228
16318C95651P433L4745E9376M00593j20751o4008J05917A66264J85707A04033
16307B86569I6511O52825k77693A82355R169c9223C0971J48956K66790J00444
$$ plain form
16382 366061 166257 403034 453366 375574 448227 647277 402701 463185 489091 462921 239264
16371 239264 454370 -80144 607537 375278 401286 405422 524085 265697 647676 169372
16360 406405 253522 362705 92371 422929 109546 318844 437394 177708 482257 401576
16350 401576 77438 406341 415692 561275 249235 520384 623236 496669 574409 613875
16340 613875 66518 474800 458818 203688 120270 489768 104282 99032 569197 632641 257505
16328 443954 184855 423927 393664 604648 464292 130424 -40176 482061 241423 395651
16318 395651 403084 437829 59376 459969 339218 275210 381127 166264 351971 104033
16307 286569 96511 749336 471643 182355 191524 -39223 30971 179927 446717 547161
16297E47161B06629K67756l5046A82671o4427Q0979d8968A37963e1833A91421
16286C0059L76288A00384J44536J07931j01383K02183n9965a0774B80774R623
16276B90397B7285J99970K79405B38415A2680K08334l4778Q041r4130J63267l275
16265B60139J55292A72076i2082E1685M83593a71092c2751B83942p3738J69856
16255C80060K8991a8563q7293C92861J975A64832O9149K7043J144j06329J9243
16244A75082J35403c1535B50340J96176A29455L49433d6187B42987A07395K6068
16234A33463a49357F1606L62796B08026J36469j750E2194K18246d369j22893A29941
16222A32247o2093a61206A78620C3511R7195R8681K00998H9920J37070j7916J72831
$$ plain form
16297 547161 206629 474385 439339 182671 118244 199223 -48968 137963 -51833 191421
16286 30059 406347 100384 244920 352851 251468 453651 393686 -10774 280774 290397
16276 290397 27285 227255 506660 238415 12680 221014 186236 194277 100147 263414 260139
16265 260139 415431 172076 -92082 51685 535278 -171092 -32751 283942 210204 380060
16255 380060 409051 -18563 -105856 392861 394836 164832 233981 261024 262168 155839 175082
16244 175082 310485 -31535 250340 446516 129455 478888 -46187 242987 107395 133463
16234 133463 -149357 61606 424402 208026 344495 342745 52194 270440 -4369 -127262 129941
16222 132247 70154 -161206 178620 33511 130706 229387 430385 89920 226990 209074 381905
16211C81905a11669B81107D7357a20710B07091L6633N5697G6957J26901k6771
16201A77087A4970J01975K94437A43545J66361j32270j4344p6498m781J31330
16191B13343J11180j23380a08578B13679K00618A12247J03766o841k5357a48622
16180B90355b10003I8116J31317H7018B3788J34658K7991a53707D5942L9178J55964
16169B41084a09752b8541B07042e0751E5242O7211K61333A41600K0835K15229
16159C77664j67571h9984H3653L3724m9361a96523A29889k196D3429K25885J0702
16148B80016j16191a30711p8272B12661G9701Q5103A8240i5809F3452J12875J61542
16137C37869a04288J6790B75227n8798a04868G5117R9793K9357l2761c74154a68500
$$ plain form
16211 381905 -111669 281107 47357 -120710 207091 243724 299421 76957 203858 177087
16201 177087 14970 116945 411382 143545 309906 177636 163292 86794 82013 213343
16191 213343 324523 201143 -108578 213679 414297 112247 216013 209172 183815 -148622
16180 290355 -210003 98116 229433 87018 23788 158446 186437 -153707 45942 85120 241084
16169 241084 -109752 -28541 207042 -50751 55242 122453 383786 141600 162435 377664
16159 377664 210093 -89984 83653 117377 68016 -196523 129889 127693 43429 269314 280016
16148 280016 163825 -130711 -208983 212661 79701 164804 18240 -95809 63452 176327 337869
16137 337869 -104288 -87498 275227 216429 -104868 75117 174910 204267 171506 -374154 -168500
16125a04591C33138a6759B47242A15408J16245J29846G8199J84266J3560k3335
16115B52690j21810n1477a66822P9955B05981f501F944b77638B62671G6519J9042
16104I5561J64000F2311C38f7730F8211j1545J40032a96384A63804e4695a4329
16092a28229A88291e0612J1360j53054a2641A92922b7867A71465R075a83417B9257
16080B88265e9619j45889A00583K2902a36721b3031C4173L2287e5177f570C31901
16068b6310A00417g0915k8770C7747Q3234a15715I8445a38691L4485A12839b22588
16056e4920F6922K19366p6832a36310A44783c49885B96039J0552G3028a31804
16045f2720B20252I9930m480c2170A68093a25594A1966b6065H0177d1451q1460
$$ plain form
16125 -104591 333138 -16759 247242 115408 231653 361499 78199 262465 276025 252690
16115 252690 130880 79403 -166822 -86867 205981 -6501 6944 -277638 262671 76519 95561
16104 95561 259561 62311 338 -67730 68211 56666 196698 -196384 163804 -54695 -14329
16092 -128229 188291 -50612 -39252 -192306 -12641 192922 -27867 171465 180540 -183417 29257
16080 288265 -59619 -205508 100583 123485 -136721 -23031 34173 66460 -55177 -6570 331901
16068 -26310 100417 -70915 -99685 37747 120981 -115715 98445 -138691 -104206 112839 -222588
16056 -54920 66922 286288 209456 -136310 144783 -349885 296039 306591 73028 -131804
16045 -62720 220252 99930 95450 -32170 168093 -125594 11966 -26065 80177 -41451 -122911
16034a22911b3727p4588E2681a07769L1645A57253C7913a91618g0677b9023B34958
16022i2734j10324j1984h8484j81155B56523B9258J30293m5076h6380A18896E2680
16010A52569O3708a53105A45823k6363a81382p8233a08191q4646B64631j29583
16000A35048K84809g9553o9050l07272a76287B60655A13781P7175i2007j16904
15990b08911K4493h2274I6134o750J81475b87131d6056B60621n377a03577B1994
15978a94586B24335o3494a51667A77619C5044Q24p791O2101J01982K25268A80135
15966A40113N3389J19096N3892j30922a77296F7109a36772p588I9633J77830D7915
15954d36264A00767e7430n1380F9755c7124o9762b7513j35507C8742R121i171
$$ plain form
16034 -122911 -23727 -98315 52681 -107769 -76124 157253 37913 -191618 -70677 -29023 234958
16022 -92734 -203058 -215042 -88484 -269639 256523 29258 159551 114475 -86380 118896 52680
16010 152569 216277 -153105 145823 119460 -181382 -259615 -108191 -192837 264631 135048
16000 135048 419857 -79553 -148603 -455875 -176287 260655 113781 190956 -92007 -208911
15990 -208911 -184418 -82274 96134 89384 270859 -287131 -46056 260621 255244 -103577 21994
15978 -194586 224335 160841 -151667 177619 35044 35868 28077 90178 192160 417428 180135
15966 140113 193502 312598 366490 235568 -177296 67109 -136772 -144360 99633 277463 47915
15954 -436264 100767 -57430 -108810 69755 -37124 -106886 -27513 -163020 38742 47863 -9171
15942G3857B7447K11306I3410J92139k5564H2427b51613A02354b13751r276a005
15930A28031d2544k5811j65013L1579j17993i9254K6700p0711c1584j13499K5009
15919a20074m9939D0615b5876H7784b95169g2987H5563a83543R1709A94915a92139
15907A70894g5065B2117K06289m4860D009a14023K2549j28666J07991K858o710
15896a16001A93694J34040a12268k04185R9907F6274b77697a14215B00900D392
15885e628n08598f3306k10474a09278A16988J43402h7639B70195R068b44411C44646
15873a57476A16497E1084A427J07353K4940J09443h943H1002J11087H7176e7669
15861d5912A46961d0551B00135r4858d1144A28422a96637k00058e2743n4569A85070
$$ plain form
15942 73857 27447 238753 93410 285549 259985 82427 -251613 102354 -213751 -223027 -1005
15930 128031 -42544 -68355 -233368 -201789 -319782 -99254 -72554 -143265 -31584 -145083 -120074
15919 -120074 -170013 40615 -25876 87784 -295169 -72987 85563 -183543 -91834 194915 -192139
15907 170894 -75065 22117 228406 183546 4009 -114023 -91474 -220140 -112149 -109291 -116001
15896 -116001 193694 327734 -112268 -316453 -216546 66274 -277697 -114215 200900 4392
15885 -5628 -514226 -63306 -273780 -109278 116988 260390 -87639 270195 279263 -244411 344646
15873 -157476 116497 51084 1427 108780 133720 243163 -8943 81002 192089 87176 -57669
15861 -45912 146961 -40551 200135 105277 -41144 128422 -196637 -396695 -52743 -107312 185070
15849a63880j38342C8636g1614B5976a37337F3688c38968B28974b12458l0057
15839b42515A75790b22414G419a92329E3742M29099a71406A06498a50973A27509
15828H3868b05720A7134m241b15219a6475q6713c0337A59961a66357B17109a62191
15816c7955C7678A3716Q0403J62219q6722a98407B9345a89331D5623P3850l8160
15805H1313a80022l9917e9649A53083c82107J32746i1463A20672l7832b53420
15794b3469B2460K97884c06384E4757L4393A3133b00655E1787a33608m5216g8748
15782a92077j0400n8881E4549e0001A29139e2722k71560B08101a34299N9977r5246
15771a69568C9902c13400b8269r7318M9841j42830M7639j32852d0599j64863c4136
$$ plain form
15849 -163880 -302222 38636 -71614 25976 -137337 63688 -338968 228974 -212458 -242515
15839 -242515 175790 -222414 7419 -192329 53742 482841 -171406 106498 -150973 127509
15828 83868 -205720 17134 12893 -215219 -16475 -103188 -30337 159961 -166357 217109 -162191
15816 -37955 37678 13716 94119 256338 169616 -198407 29345 -189331 45623 119473 81313
15805 81313 -180022 -219939 -59649 153083 -382107 -249361 -91463 120672 82840 -253420
15794 -23469 22460 320344 -306384 54757 89150 13133 -200655 51787 -133608 -178824 -78748
15782 -192077 -202477 -261358 54549 -50001 129139 -52722 -324282 208101 -134299 -74322 -169568
15771 -169568 39902 -313400 -28269 -125587 -75746 -218576 -170937 -303789 -40599 -205462 -34136
15759A49130K46831h6878A26036a45234K4159F9188a95646G7898c25447h659H0232
15747B29730M2806H7592c83243B60341r5955f4707E9066M2841M3816c00361C24053
15735b25125D3537b05285R4747K9813r9906B47116F1497b0724k04000B5543a91529
15723I3118J37732G4854K42827e237k02118B5187J28207c43352F7705J43250a43408
15711i6173A16420e2069m1571F0086d4103c352A07770c4173B6148O6193B2019
15699F8814a70680M8290B6043g2963A51958f1388K8521C08565a21807l0956a3506
15687a33764p5546o0412O1070k80588B03482c03990L0035n0647h4699l44858a0123
15675e09294d6714C3861c46670J21208q4065A25794n8134b82250E5017b84779
$$ plain form
15759 149130 395961 -86878 126036 -145234 -121075 69188 -195646 77898 -325447 -8659 80232
15747 229730 272536 87592 -383243 260341 164386 -64707 59066 101907 145723 -300361 324053
15735 -225125 43537 -205285 -110538 -80725 -180631 247116 61497 -20724 -224724 25543 -191529
15723 93118 230850 74854 317681 -5237 -207355 25187 153394 -343352 67705 210955 -143408
15711 -96173 116420 -52069 -93640 60086 -44103 -3352 107770 -34173 26148 92341 22019
15699 68814 -170680 -122390 26043 -72963 151958 -61388 -32867 308565 -121807 -152763 -13506
15687 -133764 -209310 -269722 -208652 -489240 203482 -303990 -273955 -324602 -84699 -429557 -10123
15675 -509294 -46714 33861 -346670 -225462 -309527 125794 67660 -282250 55017 -284779
15664B2256L37109a68399O3845A67701i1966l5754e0489l0778j43993K9138E5193
15652A8975J79805b57201J17993d5058p1245C6713a28011A6958K06324I6647l277
15641I3370b09986I23a99729N369A37533a12513B36120I8235j3867b17968A03100
15629C32354b95552J21227o1913b0282G4864O0357J50328I3450a80819A96702
15618a17340j72615D81300A65409H1045b00604F566K65172I5221m4255J46191
15608A97157o9672k1851b51551A03129R3739I3057a27361e7487j23561A89667
15597a79448G2010b15591A35409d35999a10631n3207L2831n4955A54315a99222
15586E1901K09932e6496i057G5806a44789I122l384L2117Q1538C5330d6902B4872
$$ plain form
15664 22256 359365 -168399 -104554 167701 -91966 -127720 -50489 -81267 -225260 -196122 55193
15652 18975 198780 -257201 -139208 -45058 -116303 36713 -128011 16958 223282 96647 93370
15641 93370 -209986 923 -199729 -194360 137533 -112513 236120 98235 84368 -217968 103100
15629 332354 -295552 -174325 -236238 -20282 74864 135221 285549 93450 -180819 196702
15618 -117340 -289955 481300 165409 81045 -200604 6566 271738 95221 50966 197157
15608 197157 127485 105634 -251551 103129 196868 93057 -127361 -57487 -181048 189667
15597 -179448 72010 -215591 135409 -435999 -110631 -163838 -131007 -185962 154315 -199222
15586 51901 261833 -56496 -9057 75806 -144789 9122 5738 37855 119393 35330 -46902 24872
15573d56520d5107A25077n4288J54783r6718D0807b49796h4883A72494f6288o5929
15562a32217k2371M5590E2334e5301A86997a78800C7046d655j4955n2891j90726
15551b63227A25069l1360m3743B3486f462k85954F4703i3940E6703P0928b14487
15539D8788R475a24649C9591O8835m3920Q1007c69544f1925n4574b7752l645B4386
15526b66541a32670B39688k2629n5752p5979R4464C1574J60985b55304c1904I8675
15514E5034K9418f261F0630k2423a60140A74264L30487f6571A63030c18017I3149
15502H4859a62415A51570a6749E08J423d6144j45014A38988o4212K18202F4827
15490c03818j21295h0819A67904p8397C8244b7987j45774Q6090b6796j16120E8438
$$ plain form
15573 -456520 -45107 125077 70789 225572 128854 40807 -249796 -84883 172494 -66288 -132217
15562 -132217 -154588 -108998 52334 -55301 186997 -178800 37046 -4655 -19610 -72501 -263227
15551 -263227 125069 93709 49966 23486 -6462 -292416 64703 -93940 56703 127631 -214487
15539 48788 58263 -124649 39591 108426 64506 145513 -369544 -61925 -116499 -27752 -31397 24386
15526 -266541 -132670 239688 217059 161307 85328 179792 31574 192559 -255304 -31904 98675
15514 55034 84452 -6261 60630 38207 -160140 174264 504751 -66571 163030 -318017 93149
15502 84859 -162415 151570 -16749 508 1931 -46144 -191158 138988 74776 292978 64827
15490 -303818 -425113 -80819 167904 89507 38244 -27987 -173761 -87671 -26796 -142916 58438
15478B21997j00586f1549A79790a03456j04964a6609j2544k71547B1672L31271
15468C52943C5337J38429A4104K29475c05369K2376G9747A4895N5947b3410m54130
15457d77540a5253j81599I2220g3012a059m7473I9149d2929k93660D2834N2015
15446I4849N1663J69640n2253d5263M301j03555B83518p7573a86319c4186j48015
15435a82201k0072A75403b28624F0827J29850F435f1635J7703B04577J3350c43857
15423b61701J29710d3744r178j87563E3240J97160a80238A12665L20752A10804
15412a87361A29273j7173h0722A01576b54300a25504A31450J02474a50920A05791
15401C70894b79638a02341j16532K0536R5206E7560K53530a8667B839J79621a67427
$$ plain form
15478 221997 121411 -61549 179790 -103456 -208420 -16609 -29153 -300700 21672 352943
15468 352943 35337 173766 14104 243579 -305369 -282993 79747 14895 70842 -23410 -477540
15457 -477540 -15253 -196852 92220 -73012 -1059 -48532 99149 -42929 -336589 42834 94849
15446 94849 146512 316152 263899 -45263 -40962 -144517 283518 205945 -186319 -34186 -182201
15435 -182201 -202273 175403 -228624 60827 190677 6435 -61635 -43932 204577 217927 -343857
15423 -261701 -131991 -43744 -52922 -240485 53240 250400 -180238 112665 433417 110804
15412 -187361 129273 112100 -80722 101576 -254300 -125504 131450 233924 -150920 105791
15401 370894 -279638 -102341 -218873 -198337 -103131 57560 311090 -18667 2839 182460 -167427
15389a82751L4810j5830d3802A75620E8395f0161D8805a31076k00792q9499H0653
15377B2449a25254c9134A80792a66957f9086o7477p2759G6568b69044C7326O966
15366D4292a19921L7804k1860c4622D7530M5306a03013L4107j88589Q7980E7787
15354g5259D399J98927k4378a0356E4627J80818b03941A33715A9781J43116a07776
15342B5541a48044l7218A94064J6447b18485a4917C0324P2186a00282r8260i7627
15330A91766a97964L831R3960G4048b19621h1230A53654p0718K68313A73172B7660
15318a71318a7672n2984B17657q2063J65640g0622j00397H6628i9309c9253j31706
15307a70959I7154h1211A03447K67171i5274O536H9207f3910H1453J52977b24473
$$ plain form
15389 -182751 -147941 -163771 -43802 175620 58395 -60161 48805 -131076 -331868 -421367 80653
15377 22449 -125254 -39134 180792 -166957 -69086 -136563 -209322 76568 -269044 37326 44292
15366 44292 -119921 -82117 -103977 -34622 47530 92836 -103013 -68906 -257495 -169515 57787
15354 -75259 4399 203326 178948 -10356 54627 235445 -203941 133715 19781 162897 -107776
15342 25541 -148044 -185262 194064 210511 -218485 -14917 30324 102510 -100282 -198542 -97627
15330 191766 -197964 -194133 -100173 74048 -219621 -81230 153654 82936 351249 173172 27660
15318 -171318 -17672 -70656 217657 135594 301234 -70622 -171019 86628 -99309 -39253 -170959
15307 -170959 97154 -81211 103447 370618 -95274 -88738 89207 -63910 81453 234430 -224473
15295h838A6205a88090A6739K40405o6699K6821d23262I7886k8792c4641j8546
15284e3187o3653d5442B9409J99032B6441K19395n2679H1633J19364a11811d1726
15272A62851d1569o5714F8595J04893G2219P0803O6057l2162k7283i2445D09363
15260A63104i8619k35330g9760A80453g8677B2090a14603A92880c03614A9862
15249d9803B82890b3721n7893E1468L2892J9679m8807a26961D29728a33202D59677
15237B14637M7220K9292J08721K65092M02515O36125l03395K11276k00382D25065
15226C69254O7542b0794A18565J55940J17827A89230D8809K05453j01786G0782
15215A44366a16938C2136J40312k446A9720M9244M42314A54586F2719K96316j29905
$$ plain form
15295 -8838 16205 -188090 16739 257144 190445 217266 -423262 97886 69094 -34641 -53187
15284 -53187 -116840 -45442 29409 228441 26441 245836 193157 81633 200997 -111811 -41726
15272 162851 -41569 -107283 68595 173488 72219 143022 209079 176917 149634 -92445 409363
15260 163104 -98619 -333949 -79760 180453 -78677 22090 -114603 192880 -303614 19862
15249 -49803 282890 -23721 -81614 51468 84360 104039 55232 -126961 429728 -133202 459677
15237 214637 261857 291149 399870 664962 1067477 1703602 1400207 1611483 1411101 425065
15226 369254 436796 -20794 118565 274505 392332 189230 48809 254262 152476 70782
15215 144366 -116938 32136 172448 170002 19720 68964 511278 154586 62719 359035 229130
15204B29130o7371j7102o1734C4041J15749r251D6329b24324i0541C72408c3236
15192C7272h3679I9647N960m0352B6362r889a05108A5666J20329a71290F8678
15180b80197e1292k1984j3241m6027G4085A9883K17258g9611L2046B8234M47744
15169D75978F6002J22119C4881q395d9981A27979l8207J2752K44581j64978q8443
15158I3684d8332C30469a643k27956d1572J0062C1628a43654M4797o4508O2324
15147a01041A12565K744c0993m7512A40988j2938a60219G2275J66279q6598i0121
15135C44304j54438J9258J19234b3803e374C79581G5536F319Q4087Q7594R8196
15124B76196j9949e9319A93265p1373E9270R6352J02294A2701J63959j8082J40718
$$ plain form
15204 229130 161759 144657 82923 34041 149790 140539 46329 -224324 -90541 372408 -33236
15192 37272 -83679 99647 105607 65255 26362 16473 -105108 15666 135995 -171290 68678
15180 -280197 -51292 -73276 -86517 -132544 74085 19883 237141 -79611 -47565 28234 475978
15169 475978 66002 188121 34881 26486 -49981 127979 89772 102524 347105 182127 93684
15158 93684 -48332 330469 -1643 -229599 -41572 -31510 31628 -143654 -98857 -163365 -101041
15147 -101041 112565 115309 -30993 -78505 140988 128050 -160219 72275 238554 151956 -90121
15135 344304 189866 209124 328358 -23803 -5374 379581 75536 6319 90406 178000 276196
15124 276196 256247 -59319 193265 121892 59270 155622 257916 12701 176660 158578 299296
15113B99296C827a93313p137A30244J54122q2172K02336A67446K28739A97652
15102h7946j23678A35457J90095i7308O877A94636q9421b12825C83915A39418
15091B39990e6521k7805l9399A16171c6589A16916e2704C50018A6728J52031a08099
15079D12785A3742K06797J61055j36684e3850A03310J76644a8970B07434l2030
15069A75404K42871A32409b6097H0143J66245J99834j41101a78968A95675E1838
15058A43510g1749j168B33537e5791B10933r1581J36063m1509g2950I0865m0001
15047E0864N18950k66124R4445B2273L77517A01105Q9908E5981K90241j64092
15037A82130m3897P1954H328a31373f554o7229j29608A47350a07013A26940m2290
$$ plain form
15113 299296 3827 -193313 -200450 130244 284366 202194 404530 167446 396185 197652
15102 -87946 -211624 135457 325552 -97308 -90431 194636 105215 -212825 383915 139418
15091 239990 -56521 -84326 -123725 116171 -36589 116916 -52704 350018 16728 168759 -108099
15079 412785 13742 220539 381594 244910 -53850 103310 279954 -18970 207434 175404
15069 175404 418275 132409 -26097 80143 246388 446222 305121 -178968 195675 51838
15058 143510 -71749 -72917 233537 -55791 210933 119352 255415 213906 -72950 90865 50864
15047 50864 569814 303690 398135 22273 399790 101105 191013 55981 346222 182130
15037 182130 138233 210187 8328 -131373 -6554 -73783 -203391 147350 -107013 126940 84650
15026H4650a6530n8413k1878A35793r879P4095q4868P3257p6437K31030n7198
15015B85793b67893B68662o3034H0961J30951K79736A96124J02439n8669a8036
15004F3048J9716L05441f5574I6423K18003P1807l2033m9523a32000C33865j176
14993C32689A36600k284N7088E9473K57508f7452C56015q7574b04219B32227H0065
14981A57179J3396I223K19463R8209j1112j12272a33886A43478o774J38683C3928
14969B89226C26a30517A12272J54063H2928J26983i5332C89482j19338K22655
14959D92799j88409F0205J16696K84763j48135M6444M7921j97351K10382r7858
14949C23067A11978m5674N44802C00440D3872K91181E0746j661K85071k0730I4738
$$ plain form
15026 84650 -16530 -74943 -96821 135793 125914 200009 115141 188398 111961 342991 285793
15015 285793 -267893 268662 205628 80961 211912 491648 196124 298563 239894 -18036
15004 63048 82764 388205 -65574 96423 314426 386233 354200 304677 -132000 333865 332689
14993 332689 136600 134316 191404 59473 316981 -67452 356015 268441 -204219 232227 80065
14981 157179 170575 9223 228686 326895 315783 203511 -133886 143478 136704 275387 33928
14969 289226 326 -130517 112272 266335 82928 209911 -95332 389482 270144 492799
14959 492799 304390 60205 176901 461664 313529 359973 407894 210543 420925 323067
14949 323067 111978 66304 611106 300440 43872 335053 50746 49085 334156 313426 94738
14937A96624K29825A35057e3933B62718j8117J14656j27748M6344r1757a315A86984
14925C51604r6386H7292J2100K32097L2461j05415N6495m1844J46047r1083A03861
14913H9918C2554M08921j19156r1500A12399K44802K89118B55484g62B08458Q106
14902B16564e7260A89482j9969A3041M58991j73508J65218L4593k21028J09086
14892C86393A4126J397K97261A13968M7988K02789k4483M20262n8710B58993J20578
14881C79571O1603A04297N62466B76262A31693L93445p8054j72924D7370K15675
14871B63045q7176R7470N90057l12257j4844N8672B43169N3924N1256J31468A30851
14859A60732R5072Q7732m1583p5444J39724A55474k5405K79787J46063k70432
$$ plain form
14937 196624 426449 135057 -53933 262718 244601 359257 231509 277853 186096 -1315 186984
14925 351604 255218 87292 99392 331489 363950 258535 315030 273186 419233 328150 103861
14913 89918 32554 441475 322319 230819 112399 357201 646319 255484 -762 208458 216564
14902 216564 -57260 189482 169513 13041 472032 298524 463742 498335 277307 386393
14892 386393 14126 15523 312784 113968 161956 364745 340262 760524 701814 258993 379571
14881 379571 441174 104297 666763 276262 131693 525138 447084 274160 47370 263045
14871 263045 175869 273339 863396 551139 536295 594967 243169 297093 348349 479817 130851
14859 160732 255804 343536 301953 226509 366233 155474 130069 409856 555919 285487
14849B85487O4603J42278j52348L12705n2529k67097q9482L92927j70308M6878
14839E13114N5108k11470J2070j37702k1702R9939m1010O08533B60966O27297
14829H88263l39334J5228j52891R593L8224P9990j57436Q611K80453C03281o9918
14818B33363P27606I2910L52426K50307C44794K57196m7202k11448N48476B83195
14807C58409K64167K31578l74869K61068e0309D66147J11643k46523K11392o0739
14797D81920A55116M49305p6648B10039K80707f058F13727k03653J38219R9427
14787F47720K2944J8242l41498K8303J23609k03222J76878J79935j33798J95553
14777G14666p3287j40807j65425R8290L16513B96237R2000N0558L37112j81618
$$ plain form
14849 285487 350090 492368 340020 652725 600196 333099 243617 636544 466236 513114
14839 513114 568222 356752 368822 231120 209418 309357 268347 876880 260966 888263
14829 888263 548929 564157 411266 420859 459083 539073 381637 390248 670701 303281 233363
14818 233363 960969 92910 445336 695643 344794 601990 554788 343340 891816 283195
14807 358409 622576 854154 479285 740353 -50309 466147 577790 331267 542659 481920
14797 481920 155116 604421 527773 210039 490746 -6058 613727 410074 548293 647720
14787 647720 670664 688906 347408 375711 499320 296098 472976 652911 519113 714666
14777 714666 641379 500572 335147 433437 749950 296237 388237 438795 775907 594289
14767E94289K1537N0980j08114J01319J59117k10263k13463o867J31393R3804
14757F13732R6207m9129j91450M5795J65759n2094j27822k0681L73635l46241
14747E07711j11822l2947L17861K13573j71772k37122L15837N8932l78101J72972
14737F55122j66434N6704L37591k11621K86927k16661k05368K19895r1311C19227
14726G51503k9440J965K42337k30032l30703L66750j13002l8422M3830r5131J94643
14715G64298J34404m3626J05993j78308j4596J01045o4841k04841K64157j55695
14705G07990K338Q1787J17832n1872P9843L0778q3544k13148J90029L06613k08531
14694I60115r4261K51431K5826m70641K58579P3196k90934J42376k57842R8237
$$ plain form
14767 594289 615826 666806 558692 660011 819128 608865 395402 388535 519928 613732
14757 613732 709939 660810 469360 515155 680914 628820 500998 480317 853952 507711
14747 507711 395889 362942 680803 894376 722604 485482 801319 860251 482150 655122
14737 655122 488688 545392 882983 671362 958289 741628 536260 756155 664844 319227
14726 751503 722063 724028 966365 736333 405630 772380 659378 620956 664786 569655 764298
14715 764298 898702 855076 961069 782761 768165 869210 804369 599528 863685 707990
14705 707990 710328 792115 909947 858075 937918 968696 885152 672004 862033 1168646 960115
14694 960115 865854 1117285 1143111 672470 931049 1004245 713311 855687 597845 696082
14684F96082L64858k68293R3487L4851K70293n8639j57973J68944j06526j60957
14674H76127Q2165J96101k03294q3302j47775L77249l49108J48831K5058k59689
14664F62363N02285m32734L89261j43137j5419N903K44215l78153L28298j18550
14654A044332L92621k51834j13412J50241j17029o1747K30191k16124q4072J16316
14644A089483j99243N80086j31970l14387O1487J54054j96225q4736K33187M0823
14634A232559J78923Q8221j64904q5224j44148q082L44475k51598M01982l05526
14624A286678M084J39844q8074l7328j24528L6223J85933J04798j17890L63885
14614A753625l87340J67668k13015j35830J03835L34621k14709M8327K73561o1647
$$ plain form
14684 696082 1060940 792647 886134 920985 1191278 1132639 974666 1143610 1037084 876127
14674 876127 958292 1154393 951099 867797 720022 1097271 748163 896994 922052 662363
14664 662363 1164648 731914 1121175 978038 962619 968522 1212737 834584 1162882 1044332
14654 1044332 1436953 1185119 1071707 1221948 1104919 1043172 1273363 1057239 973167 1089483
14644 1089483 890240 1470326 1338356 1023969 1085456 1239510 1043285 958549 1191736 1232559
14634 1232559 1411482 1499703 1334799 1249575 1105427 1097345 1441820 1190222 1592204 1286678
14624 1286678 1290762 1430606 1342532 1305204 1180676 1216899 1402832 1507630 1389740 1753625
14614 1753625 1366285 1533953 1320938 1185108 1288943 1623564 1408855 1457182 1730743 1669096
14604A669096M5497k92700K74312k94338r5463J52309J3697Q7593m9585L8228
14594A548646R3808o8384O4136J09079p6531p3606K34204m6267r0528j76790P5532
14583A593299J42563l67905M49428j88244j37542L86193J53280k21712o7095K41957
14573A984222j34886m2028j06073M11137j20331j40701j46953K34734J90220p6378
14563B052963J78931J46603j80855L5349j93126K34381M31517m19424J75805o1180
14553B400964J30279M7904L4423K11363j22656M1118M27374k44952m3006L72633
14543C255444J57756m1763O05816l46145R29725O34027M38384Q71079J402056
14534G906379K307748M205672P463352R065606j864880j0432008n483320m362250
$$ plain form
14604 1669096 1714593 1421893 1696205 1401867 1306404 1458713 1472410 1560003 1510418 1548646
14594 1548646 1642454 1574070 1638206 1747285 1670754 1597148 1831352 1785085 1694557 1517767 1593299
14583 1593299 1735862 1367957 1817385 1629141 1491599 1877792 2031072 1809360 1742265 1984222
14573 1984222 1849336 1807308 1701235 2112372 1992041 1851340 1704387 1939121 2129341 2052963
14563 2052963 2231894 2378497 2197642 2232991 2039865 2274246 2705763 2286339 2462144 2400964
14553 2400964 2531243 2579147 2613570 2824933 2702277 2743395 3170769 2925817 2882811 3255444
14543 3255444 3413200 3371437 3977253 3631108 4560833 5194860 5633244 6504323 7906379
14534 7906379 10214127 14419799 21883151 30948757 29083877 18651869 13168549 8806299
14526H806299k908683j080980j215889m47099l12839k09191K30386m43631J77400
14517B595773j97999L7145R0505k70091k7228Q5509O4402M89355n00809J11763
14507B478325K43783r2561j99606J91659j06142J59488m9140J77076J57751J23576
14497C084209k1339l83625O5815K89604K2188K25832k56173l4895J18475j26669
14487B983422M9263J99183J54672p8644m7994J41179m5536J16290N2463r0496
14477C433802N65085o44699M21137k87256L91573j47691r4635P5613J73129r1877
14467C794181K15183q8264M40753l5945k64366R4046J10897k88661K67274K11248
14457D456346R1493j59177K17933q8718J97635j95483R2319k7234L69156k3650
$$ plain form
14526 8806299 5897616 4816636 3600747 3153648 2840809 2631618 2862004 2418373 2595773
14517 2595773 2397774 2434919 2525424 2255333 2228105 2313614 2378016 2867371 2366562 2478325
14507 2478325 2722108 2629547 2429941 2621600 2515458 2674946 2625806 2802882 2960633 3084209
14497 3084209 3062870 2679245 2745060 3034664 3056852 3282684 3026511 2991616 3110091 2983422
14487 2983422 3032685 3231868 3386540 3307896 3259902 3401081 3355545 3471835 3524298 3433802
14477 3433802 3998887 3354188 3775325 3488069 3879642 3731951 3637316 3712929 3886058 3794181
14467 3794181 4009364 3921100 4361853 4325908 4061542 4155588 4266485 3977824 4245098 4456346
14457 4456346 4547839 4388662 4606595 4517877 4715512 4520029 4612348 4585114 4954270 4930620
14447D930620J67576J88405n20940L29762K69073j07018K22280l82167O27635
14438E725226l59506M19569j87970M5339J99342j00703J6921N1223J80788J70403
14428F160632K5211j15377M34509j30843K60767J22150N5465o1216K63809O1208
14418G076315j90142J26906J26196L32416n0578k7973J96030o7122J97959J95413
14408G915420J0486J24753M5389o7010M19766J3038L59251L13898J87545l2796
14398I289740o1204N7416L23205j15568L49285J55513j0769J81616N67544j6269
14388A0720509q5108M25140K54458k03892M74219k87289N92999K98977R1973j6429
14378A2265557K94382K06252N67841j9286K27361L09983J5178M22045L58272k8697
$$ plain form
14447 4930620 5098196 5286601 4765661 5095423 5364496 5257478 5479758 5097591 5725226
14438 5725226 5365720 5785289 5597319 5642658 5842000 5741297 5758218 5809441 5990229 6160632
14428 6160632 6185843 6070466 6504975 6374132 6634899 6757049 6812514 6751298 7015107 7076315
14418 7076315 6886173 7013079 7139275 7471691 7421113 7393140 7589170 7522048 7720007 7915420
14408 7915420 7925906 8050659 8096048 8029038 8448804 8461842 8821093 9134991 9322536 9289740
14398 9289740 9228536 9285952 9609157 9493589 9842874 9998387 9987618 10169234 10736778 10720509
14388 10720509 10635401 11060541 11314999 11111107 11585326 11298037 11891036 12190013 12281986 12265557
14378 12265557 12559939 12766191 13334032 13314746 13542107 13852090 13867268 14289313 14647585 14618888
14368A4618888N11718K41521J58825L98362N17938P5331M78201J24198N20309
14359A7645291K36947N87041P3552N81253O5894O45826J9199N83319K91709Q44820
14349B1574851K64903M03547P02619O54644J59486N53294O88557O90616M00207
14340B6092724O35040P74424M85507P69351P99413O42464O73752N44629J434449
14331C2851753O99996O95956P93552R75476Q34100J019381J172684J047587J186208
14322D1276693J422470J075664J366877J432024R72804J621644J407507J555793
14314E2131476K180629J453663J840813J760778J906948J831024K809611K135906
14306F8050848K509560K168387K512265L123028K601997K867998L695875L420586
$$ plain form
14368 14618888 15130606 15372127 15530952 15929314 16447252 16522583 17000784 17124982 17645291
14359 17645291 17882238 18469279 18542831 19124084 19189978 19835804 19855003 20438322 20730031 21574851
14349 21574851 21839754 22243301 22945920 23600564 23760050 24313344 25001901 25692517 26092724
14340 26092724 26727764 27502188 27987695 28757046 29556459 30198923 30872675 31417304 32851753
14331 32851753 33551749 34247705 35041257 36016733 36850833 37870214 39042898 40090485 41276693
14322 41276693 42699163 43774827 45141704 46573728 47546532 49168176 50575683 52131476
14314 52131476 54312105 55765768 57606581 59367359 61274307 63105331 65914942 68050848
14306 68050848 70560408 72728795 75241060 78364088 80966085 83834083 87529958 90950544
14298I0950544L515566L516058M214665M422517M306518M442116M727272N445166
14290A25540422N170222O251034O216423O214804O765991P341667P633677P916857
14282A79051097Q571469R020422R153310R997748J0720001J1066562J1383046
14275B48963655J2216881J2517778J2992426J3595333J4062934J3434163J3607866
14268C41391036J3261034J2907043J2483226J2040740J0919522J0535099R609427
14261D23147127Q589466P688718O190737M956685K568466M19224N87235l023701
14253D51123957p206731o071492p887244r465874j0104842j1121595j1532134
14246C87734045j2351652j2958454j3654828j3582282j3717522j3476311j3430456
$$ plain form
14298 90950544 94466110 97982168 102196833 106619350 110925868 115367984 120095256 125540422
14290 125540422 130710644 136961678 143178101 149392905 156158896 163500563 171134240 179051097
14282 179051097 187622566 196642988 205796298 215794046 226514047 237580609 248963655
14275 248963655 261180536 273698314 286690740 300286073 314349007 327783170 341391036
14268 341391036 354652070 367559113 380042339 392083079 403002601 413537700 423147127
14261 423147127 431736593 439425311 445616048 450572733 453141199 453560423 454147658 451123957
14253 451123957 443917226 437845734 429958490 420492616 410387774 399266179 387734045
14246 387734045 375382393 362423939 348769111 335186829 321469307 307992996 294562540
14239B94562540j2791330j1834215j2398254j2596911j1512335j1169247j0699683
14232B11560565r973282j0291838r576287q954349q391354p983627p640646o560131
14224A42189051o634429n778626n580234n688640m719764m786886m592474m333265
14216A00074733l721607l563235l919630l541976l025573l018132k909086k949898
14208G3425596k459369k454346k648559j969101j876428k245597k074039j676506
14200E6021651j845613j336111j643923j769539j399274j568098j364704j010811
14192D4083578j190821j014109j300875j210288j136319r57226r78891p11285
14184C5583764j140874r93234o19797r66787o63876q57266o99915o54377n33692
$$ plain form
14239 294562540 281771210 269936995 257538741 244941830 233429495 222260248 211560565
14232 211560565 201587283 191295445 181719158 172764809 164373455 156389828 148749182 142189051
14224 142189051 135554622 129775996 124195762 118507122 113787358 109000472 104407998 100074733
14216 100074733 96353126 92789891 88870261 85328285 82302712 79284580 76375494 73425596
14208 73425596 70966227 68511881 65863322 63894221 62017793 59772196 57698157 56021651
14200 56021651 54176038 52839927 51196004 49426465 48027191 46459093 45094389 44083578
14192 44083578 42892757 41878648 40577773 39367485 38231166 37273940 36295049 35583764
14184 35583764 34442890 33449656 32829859 31863072 31199196 30341930 29642015 28987638 28453946
14175B8453946q05818n34396o99430r42219j01827o56450r95083k76794n08731
14166B2933198l82595m95650l11714o29187m26514l44722l98524k92570p46706
14157A8905016j03348n63032N4495o06222l88555l87818m92643j62801r3112k73755
14147A5888225m97618m9073l63692n27385j44249r4329l65962O1068j82242k77040
14137A3447703l04475o52497M62656l85912k51233l78512k04685K4920j19951
14128A1638014q5722n20928M0180n14660K31352n77852P2974j65249J87218O506
14118A0311833n94197J00843o05878K88835o2132m88568O8973m86321M87156m40499
14108H580045K4423k51447l15999j28862k29314J54757M7712l19731J74585l67608
$$ plain form
14175 28453946 27648128 27113732 26414302 25472083 25370256 24713806 23718723 23441929 22933198
14166 22933198 22550603 22054953 21743239 21114052 20687538 20342816 19944292 19651722 18905016
14157 18905016 18801668 18238636 18293131 17686909 17298354 16910536 16417893 16255092 16161980 15888225
14147 15888225 15390607 15341534 14977842 14450457 14306208 14211879 13845917 13906985 13724743 13447703
14137 13447703 13143228 12490731 12953387 12567475 12316242 11937730 11733045 11757965 11638014
14128 11638014 11552292 11031364 11071544 10556884 10788236 10210384 10283358 10118109 10305327 10311833
14118 10311833 9717636 9818479 9212601 9501436 9439304 8950736 9019709 8533388 9020544 8580045
14108 8580045 8604468 8353021 8037022 7908160 7678846 7833603 7881315 7561584 7736169 7368561
14098G368561J80374l40465m7308l94637L00869k42477J51986q1107R412j88467
14088F716741J7924r3n62918L71384k42054J70720q4914k80899l11026J40243
14078E935108O8277k19264k19030J63706l92962J02804o742j62520l4002o9793
14068E165582J65417k38578M11618m48056p6274l13896N74932m40818j00348j03370
14058D596209K22054R8619k53065m9854j82675n1463k34819j0180R2017j63217
14048D063626L74373k53837K84944k02621k92438K05430l7001m2891Q8759Q565
14038D196909j21406l41339J72052j08018M836J05687k33338J37463q9780k08130
14028C514936M1739k98900K90717K55526m26226l21133J44177M34589k06366k1607
$$ plain form
14098 7368561 7548935 7208470 7161162 6766525 7067394 6824917 6976903 6895796 6905208 6716741
14088 6716741 6734665 6734572 6171654 6543038 6300984 6471704 6386790 6105891 5794865 5935108
14078 5935108 6003385 5784121 5565091 5728797 5335835 5438639 5431897 5269377 5235375 5165582
14068 5165582 5330999 5092421 5504039 5055983 4979709 4665813 5240745 4799927 4699579 4596209
14058 4596209 4818263 4916882 4663817 4613963 4431288 4379825 4145006 4134826 4226843 4063626
14048 4063626 4437999 4184162 4469106 4266485 3974047 4179477 4142476 4099585 4188344 4196909
14038 4196909 4075503 3734164 3906216 3798198 3803034 3908721 3675383 3812846 3723066 3514936
14028 3514936 3556675 3257775 3548492 3804018 3377792 3056659 3200836 3635425 3429059 3407452
14018C407452j4178R1490j29390j69526o6692p4654J20502k20601J51643m6222
14008C049824l80400K98194j34815J85847l45246K04841j64373j34582L20489
13999B899779m19876J9880K32263M0966l8947k82712Q1371J07413k58076L7975
13989B420036J73916j7790j01452J51911N7209l82770q140M83173k74425J80517
13979B682185M1024M34891L30076O30994O59966J823703L536586O515872J0515326
13970B7170623L207759r527717o510540m242266k315072j633734p89861q31854
13962D527338o65311l703k5975n56517k8718m75143j6971J93517j06678k25594
13952B616245M4144k4078k01846N3319K31678l57737M5356L0515l28006K92520
$$ plain form
14018 3407452 3393274 3484764 3355374 3185848 3119156 3044502 3165004 2944403 3096046 3049824
14008 3049824 2669424 2967618 2832803 3018650 2673404 2878245 2713872 2579290 2899779
13999 2899779 2479903 2499783 2732046 2773012 2734065 2451353 2532724 2640137 2382061 2420036
13989 2420036 2593952 2576162 2474710 2626621 2683830 2301060 2292920 2776093 2501668 2682185
13979 2682185 2723209 3158100 3488176 4119170 4779136 6602839 10139425 16655297 27170623
13970 27170623 30378382 20850665 14340125 10097859 7782787 6149053 5359192 4527338
13962 4527338 3862027 3858324 3832349 3275832 3247114 2771971 2755000 2948517 2841839 2616245
13952 2616245 2660389 2636311 2434465 2487784 2719462 2361725 2407081 2437596 2109590 2402110
13942B402110l18313P0953M8968k69077L18940l89735J03930J10433j06136N2766
13932B024839o0930j82266K33384r6932J34753k56434J65909j16465L25305j14047
13922B057116L5154k36717k72628Q2627J68533m36759L89025K10026l75458j0090
13912A610829K73585m88448L65069l21280j4550M70817k87061O6414J89555j57947
13902A706983k14250K02830m7104r26j20193p7320J70487k15920L19293l54774
13892A369106O1848p4696P7496J12484j97074J58891k39247K43058j82613J46676
13882A475929k23563K14170k36596K57901O2047m79769M5013J67816J16354j75759
13872A223543M382K46704l70772K93449j77694J10695P1216r9489j38120K38869
$$ plain form
13942 2402110 2083797 2154750 2203718 1934641 2253581 1863846 1967776 2078209 1972073 2024839
13932 2024839 1963909 1781643 2015027 1918095 2052848 1796414 1962323 1845858 2171163 2057116
13922 2057116 2092270 1855553 1582925 1665552 1834085 1397326 1786351 1996377 1620919 1610829
13912 1610829 1884414 1395966 1761035 1439755 1425205 1896022 1608961 1675375 1864930 1706983
13902 1706983 1492733 1695563 1648459 1647533 1527340 1450020 1620507 1404587 1723880 1369106
13892 1369106 1430954 1356258 1433754 1546238 1349164 1508055 1268808 1511866 1329253 1475929
13882 1475929 1252366 1466536 1229940 1487841 1549888 1070119 1115132 1282948 1399302 1223543
13872 1223543 1227925 1474629 1103857 1397306 1219612 1330307 1401523 1302034 1163914 1402783
13862A402783l82044L92562k35543l515J71631k95238J88351l09958J97966m1726
13852A085269j81551K73753K17850P756r4781M570j12937l0851l18178M44589
13842A295489m16401J37774P2483j35575K20602n3072J92935o7282m38871K90511
13832A098593j39291l3411j14669L22661j27461J71343j1148p5444R3526l8785
13822A145914l23014M41027j01299J63223m74798J67246k31408K02514p5810J06226
13812A019821n3400J05538j83329L33685l62541J26404n785J25178N8758j90158
13802I74171n3574J75138j74971p2762L1065J61369k56112q4393J73182J33201
13792A006314L167J28298k05148k14658J43587j18758L72023l56845K03281j36762
$$ plain form
13862 1402783 1020739 1413301 1177758 1174243 1345874 1050636 1238987 929029 1126995 1085269
13852 1085269 903718 1177471 1395321 1403077 1308296 1312866 1199929 1169078 850900 1295489
13842 1295489 879088 1016862 1089345 953770 1174372 1121300 1314235 1246953 808082 1098593
13832 1098593 959302 925891 811222 1133883 1006422 1177765 1166617 1091173 1184699 1145914
13822 1145914 822900 1263927 1162628 1325851 851053 1018299 786891 989405 913595 1019821
13812 1019821 966421 1071959 888630 1222315 859774 986178 980393 1105571 1164329 974171
13802 974171 920597 1095735 920764 848002 879067 1040436 784324 699931 873113 1006314
13792 1006314 1009481 1137779 932631 717973 861560 742802 1114825 757980 961261 824499
13782H24499K71880j28127m4221R1451m19849N4104K41621j0837k60103J54870
13772G75288k92976K17822j8525J79805J7959k09584K36827l5587q0479n2142
13762G38408J37645j45983P319J2955j60836M01633C56504M85105j18585M0451
13752G63475K84196k81408l3594C60972M12053J05702j36610J03467R2319l30611
13742F07292j77416K51310K61079l08988J71672r8590K0364j04004j38296J9622
13732E04045O0443Q0791J70417L3957l7280j83476J29738m8914k86722O9319K82539
13721G74857j66051N5963m9228J56412j48908J18451l65457Q8715L66639m4669
13711G86724O1773p5260l10492L17512l17331K62662j97280o4370J58980p42q8389
$$ plain form
13782 824499 1096379 968252 924031 1015482 595633 649737 891358 880521 620418 775288
13772 775288 482312 700134 681609 861414 879373 669789 906616 871029 790550 738408
13762 738408 876053 730070 737389 750344 589508 991141 356504 841609 723024 763475
13752 763475 1047671 766263 732669 360972 773025 878727 742117 845584 937903 607292
13742 607292 429876 681186 942265 633277 804949 706359 726723 622719 484423 504045
13732 504045 564488 645279 815696 849653 812373 628897 758635 709721 422999 492318 774857
13721 774857 608806 664769 615541 771953 623045 741496 376039 464754 831393 786724
13711 786724 848497 773237 462745 780257 462926 725588 528308 463938 622918 622176 533787
13700E33787o5711l7497N15794m37243k2975J60724k61311L43956l00137K23790
13690F53177B11407J65184J38246p92J47558j45623J97445K4260k31119A10932
13679F04074L93568A75025L15896K81483k63855J07592j40926J3096O6129M78373
13669A032813C48941K91305B72263J69402N50725B69177L01855j20140J0301J80388
13659F41581k99654j24029M54770C02242J67607P059J23425J23122j56305P5584
13649F42734j59644A31617M40082k55155j00788P11448B71569M4571J98826j7057
13639D97909K17195k73512L8312M6001B61777A20199M68268Q7567B31957K84024
13629E15981k536B34275J69567J78779R1024A67004K03501L82475q3659B25821
$$ plain form
13700 533787 468076 430579 946373 509130 486155 646879 385568 729524 429387 653177
13690 653177 211407 376591 514837 514045 661603 515980 713425 737685 506566 110932
13679 604074 997642 175025 490921 772404 508549 616141 475215 488311 554440 1032813
13669 1032813 348941 640246 272263 441665 992390 269177 571032 450892 461193 641581
13659 641581 341927 217898 672668 302242 469849 476908 600333 723455 567150 642734
13649 642734 483090 131617 571699 316544 215756 927204 271569 316140 514966 497909
13639 497909 715104 441592 479904 525905 261777 120199 588467 676034 231957 515981
13629 515981 513445 234275 403842 582621 673645 167004 370505 752980 669321 225821
13618D25491L1414j31757J06441B11733P1451J70581m2058m3841j19486J65538
13608D13918G1748J66759K74527Q2466B26168N97984k81276q9466B00498J64069
13598C64567R5979L0449k40908P4567J01153K59260k09050j23839q7369K74829
13588E39638j10568n9695L30048B69979K9052J08323r8771L17005B4035N62373
13578E86408k3449A43552M14531q5246k30202K38811A43838J89905r9620K61977
13568D96100k00546J15094A22162J40800J21454k5388K43005k43742j50402K22355
13558D30244j65764L67671k67589j63257L6232M2616L28435B87008J41278K2401
13548D50687j89836L7660K32453k57173Q2580J94764G2673L90587B29745P4597
$$ plain form
13618 425491 456905 325148 431589 211733 283184 453765 411707 367866 248380 413918
13608 413918 71748 238507 513034 595500 226168 824152 542876 453410 200498 364567
13598 364567 460546 490995 250087 324654 425807 685067 476017 352178 264809 539638
13588 539638 429070 369375 699423 269979 299031 407354 308583 625588 24035 586408
13578 586408 562959 143552 558083 472837 242635 481446 143838 333743 234123 496100
13568 496100 295554 410648 122162 262962 384416 359028 602033 358291 207889 430244
13558 430244 264480 632151 364562 201305 237537 280153 608588 287008 428286 450687
13548 450687 260851 298511 530964 273791 356371 551135 72673 463260 229745 304342
13538C04342A34043L26164j57293N2151K27702k78411I0799M16094k36972r2629
13528A77292J57080p6222L97833l27767K9556A30478m7574A9257N82933p6725
13518E25465k03846E6043d6821F0704P1898J22072K28870k01820G4371N01710
13508E76081j43900j07968a04032E93271j36820L3012b859D42974M1229A18396
13497B67904K14685j22620j07473K7867o5105K7131L73767B79841d1107c088C44820
13485A58492M13017A25081J00530K50424F2549L66801A37086P2370L00826B09080
13474D03178j89232L53323B04441C9343M87694B39993R1461j5967m7932j30411
13464A37144K19421p1641l8017Q7944J0579q394d6645C07091j24173B8110K26955
$$ plain form
13538 304342 134043 460207 302914 355065 582767 304356 90799 506893 269921 177292
13528 177292 334372 258150 655983 328216 357772 130478 82904 19257 602190 525465
13518 525465 321619 56043 -46821 60704 132602 254674 483544 281724 74371 576081
13508 576081 432181 324213 -104032 593271 456451 489463 -2859 442974 484203 118396
13497 267904 482589 359969 252496 280363 215258 242389 616156 279841 -41107 -3088 344820
13485 158492 571509 125081 225611 476035 62549 429350 137086 209456 510282 209080
13474 403178 213946 567269 204441 39343 527037 239993 331454 315487 267555 137144
13464 137144 356565 284924 246907 334851 345430 337036 -46645 307091 182918 28110 255065
13453B55065p9470L4012K95048B9194M66446A44014k2969A5764K9612L3193M7790
13442A26359h1081F8539K97375G019J54608M12217a28928B05349J79763I6194
13431B94821J47096K7623B03244J76657m0390f4494A43290J11284j18899J42923
13421B78598E2887e9022E7117J07681K17734A54974l332F8238J60336O3046n3077
13410B38543K30660k01592R2122i6512A2215K29577E5615J98291A24758G866K54438
13399B62304L65490k36369j20361p0840I5498Q6621F1361J90031J01130n5389
13389B97133R5788q2917j19609E9349K15460J65090o221j76240C2938L35002a18713
13377H0450K85524G1444N3148K68816h9937A29088A0392K59957B2397b7149A93770
$$ plain form
13453 255065 175595 209607 504655 29194 495640 144014 121045 15764 45376 78569 126359
13442 126359 -81081 68539 365914 7019 161627 573844 -128928 205349 385112 96194
13431 294821 441917 469540 203244 379901 339511 -64494 143290 254574 135675 278598
13421 278598 52887 -59022 57117 164798 382532 154974 151642 68238 228574 291620 238543
13410 238543 469203 267611 359733 -96512 12215 241792 55615 253906 124758 7866 262304
13399 262304 627794 391425 271064 200224 95498 182119 61361 251392 352522 297133
13389 297133 392921 310004 190395 59349 274809 439899 433678 257438 32938 367940 -118713
13377 80450 365974 71444 124592 393408 -89937 129088 10392 270349 22397 -27149 193770
13365B79558A22869K06846G9044J02500L75980A57488J86010J43820k41378l1645
13355B14295K8910k6373l3852F506J18203o097K22897A62295J46905M8548A03854
13343F2184K19155A10439B1480J07054K67553A76843K84569G489K58310J79616
13333D45415C7958J96329q9389K17969j26898j8747P2137r1749j3468L25699A28016
13321B4593K18622F9717a08942A96580I0422J06033J61798j35456o1121L44455
13311E06131A68880L53700d2839B18955M9381r8084o6607J30030J23544n2069
13301C05150j43395K89088j05088B4426O3529O7478P8666L8108j14946d2255C33560
13289C09803H5931l5242K50105d3488B27050n5152b0087C05057k2339J41923K374
$$ plain form
13365 279558 122869 329715 79044 181544 557524 157488 343498 487318 245940 214295
13355 214295 243205 216832 182980 6506 124709 118612 341509 162295 309200 357748 103854
13343 62184 281339 110439 21480 128534 396087 176843 461412 7489 265799 445415
13333 445415 37958 234287 144898 362867 235969 217222 289359 197610 184142 509841 128016
13321 24593 243215 69717 -108942 196580 90422 196455 358253 222797 161676 506131
13311 506131 168880 522580 -42839 218955 268336 170252 103645 233675 357219 305150
13301 305150 161755 450843 345755 24426 87955 155433 234099 272207 157261 -42255 333560
13289 309803 85931 50689 300794 -43488 227050 171898 -20087 305057 282718 424641 427015
13278D27015j13009H1601R4133L94363A22339K45472B0052Q4222k3813b28828
13267B96311r8973j9456J5276M3290J80326K9961H7522a59226C26380a44418B94008
13255A21483a54439g0878A60016l5117E5375P2485L078J76257j0664M7870o0947
13244B83454b5612D01850a6805B28261i5686a5622B59352m6433n593J8747n8755
13233A67318e8032B7796J6690K74330H2770a30086B19576f8684B95046p2102a50268
13221A31643L2595O4341a89225A89214J11712j45259j3120C9206K13496o0464
13211A92238N5449m0039j01021a31944r9390F1368a55616A58340F4321J66268
13201B30589r3952K30474I6382J85352R5358A6907J38915f2942A80285L9979b2264
$$ plain form
13278 427015 314006 81601 175734 570097 122339 367811 20052 104274 80461 -228828
13267 296311 197338 177882 193158 236448 416774 446735 87522 -159226 326380 -144418 294008
13255 121483 -154439 -70878 160016 124899 55375 127860 130938 307195 296531 344401 283454
13244 283454 -25612 401850 -16805 228261 -95686 -15622 259352 212919 207326 226073 167318
13233 167318 -58032 27796 44486 318816 82770 -130086 219576 -68684 295046 222944 -150268
13221 131643 164238 228579 -189225 189214 300926 155667 142547 39206 252702 192238
13211 192238 247687 207648 106627 -131944 -231334 61368 -155616 158340 64321 230589
13201 230589 136637 367111 96382 281734 377092 16907 155822 -62942 180285 220264 -22264
13189h2687H9119f8415a286C31828j37429q6282b3268B80667a3344p2994A45227
13177B02466c05380B74447b57426C02023a01166A57188d6067A41508a1202D38481
13166B55069j11622n574b00591C2117f0461B22863j06975j5916g8716A49381E765
13154f6487a9996k9110A84534e3823j20292A2206K35040b3490H6307D0288J26556
13143A66844d6616r0625m501A36598b56534a09994E2657K3300B5871A0159N5531
13132F5690J50196a36126G9552a53083I077g7514k7637A39441J30166F410a01457
13120b65901G3493L55551j21031o7293h9167G3540F850L47053K1265C6507K55010
13109B91517e0768A81771E2715i9102A1482R3740m2842R5796K10063F5757K8069
$$ plain form
13189 -82687 89119 -68415 -1286 331828 194399 108117 -23268 280667 -13344 -86338 145227
13177 202466 -305380 274447 -257426 302023 -101166 157188 -46067 141508 -11202 438481
13166 255069 143447 137873 -200591 32117 -60461 222863 115888 99972 -78716 149381 5765
13154 -66487 -19996 -49106 184534 -53823 -174115 12206 247246 -23490 86307 40288 166844
13143 166844 -46616 -137241 -141742 136598 -256534 -109994 52657 75957 25871 10159 65690
13132 65690 215886 -136126 79552 -153083 9077 -77514 -105151 139441 269607 6410 -101457
13120 -265901 73493 429044 308013 240720 -89167 73540 6850 353903 375168 36507 291517
13109 291517 -50768 181771 52715 -99102 11482 105222 62380 158176 368239 65757 93826
13098I3826J8225m7375a40190C48334K3535J03667A66631j924g281A16335e2226
13086i4140K085C01064j14143C9674N3386e7541A0460e8971l3836p9949A12569
13074c0897B62477p475Q5162A31257J48105i3424I8724a2362k61742Q0616e9350
13062d853A70291p0452K95939E4482J75267I3200a75186e9033j38126F2383c1273
13050c61342A45586d9521B74785D1338b9199B16855k2048n0599K05275n0459C4908
13038F1428e8284C1524L00844f7988H4864b1717j1544A18107h0811E9321K71005
13027C30326a0346B70021l9956K09844c37867a5383H5401M8342J02288F4746a8642
13015G8369b00265j9502D2454C88J80038f2190A66251K02187A39797C7278K90471
$$ plain form
13098 93826 112051 64676 -140190 348334 371869 475536 166631 164707 -7281 116335 -52226
13086 -94140 -92055 301064 186921 39674 93060 -57541 10460 -58971 -92807 -172756 112569
13074 -30897 262477 255002 340164 131257 279362 -93424 98724 -12362 -274104 -193488 -59350
13062 -4853 170291 99839 395778 54482 229749 93200 -175186 -59033 -197159 62383 -31273
13050 -361342 145586 -49521 274785 41338 -29199 216855 194807 144208 349483 299024 34908
13038 61428 -58284 31524 332368 -67988 84864 -21717 -33261 118107 -80811 59321 330326
13027 330326 -10346 270021 230065 439909 -337867 -15383 85401 133743 236031 64746 -18642
13015 78369 -200265 -219767 42454 388 180426 -62190 166251 368438 139797 37278 327749
13004C27749A27217d9208G4133J61799H9770B0268b12593q6762I0791m4987a87338
12992B39236J88519A16231K02739a18487B70237G7628J73302J1882r2047K69975
12982D40740f7687q8929B8980L80336A21621a11310B70766b01600p9946A8418
12971a09311j15887D20555G8594J72981J93243A11238a32371E3681K7928a27834
12960E5325K36031r9807D6842J47052F3589J30360n0533i145m0677D325N691J93553
12948B03569b1667j6415B28685r0435m1455a1686E8983J00709a90034d5568C0082
12936B80689d291m9770J4228A79544a33012R712A23599A6871a40369c2316I7262
12924D9861Q7605Q5410n4995b27576C35671j43877q6261O8273B678K71449f8546
$$ plain form
13004 327749 127217 -49208 74133 235932 89770 20268 -212593 -299355 90791 45804 -187338
12992 239236 427755 116231 318970 -118487 270237 77628 250930 262812 170765 440740
12982 440740 -67687 -156616 28980 409316 121621 -111310 270766 -201600 -281546 18418
12971 -109311 -225198 420555 78594 251575 444818 111238 -132371 53681 81609 -127834
12960 55325 291356 191549 46842 193894 63589 193949 143416 -9145 -49822 4325 10016 203569
12948 203569 -21667 -38082 228685 138250 96795 -11686 58983 159692 -190034 -45568 30082
12936 280689 -4291 -54061 -39833 179544 -133012 -123300 123599 16871 -140369 -32316 97262
12924 49861 137466 222876 167881 -227576 335671 191794 105533 173806 2678 274127 -68546
12912g1411k4554h398A68865b82721B8820a16509E8866K3806B2101a13273I0440
12900a04747L0113D63338i280C9006f9584B00800b65714J06059o0868k618h7563
12888a71619A83438f3122p6234B48360A15408K05999j47911A4427J28586n673
12878A37340o2904J91314m4616E8845K89361F597O4646a86633J2893b2890D72445
12866b6283k34422F39568f163A5847c83056h2507I8138E502R5386j7606a38812
12854A85899q5190J8908e1486j62424C7103J62953b0985k766o1241A05734e1886
12842A84421g6252k52283D8190b30005J13210a7284j5965C34111E8702K7695J6350
12831A02747c0489m826C70614I8507L0915H276A096N74950a86285F1890J28377
$$ plain form
12912 -71411 -95965 -8398 168865 -282721 28820 -116509 58866 82672 22101 -113273 90440
12900 -104747 -74634 463338 -9280 39006 -69584 200800 -265714 -159655 -220523 -223141 -87563
12888 -171619 183438 -63122 -139356 248360 115408 321407 173496 14427 143013 137340
12878 137340 74436 265750 221134 58845 348206 6597 71243 -186633 -173740 -22890 472445
12866 -26283 -260705 639568 -6163 15847 -383056 -82507 98138 5502 100888 83282 -138812
12854 185899 100709 119617 -51486 -213910 37103 200056 -20985 -23751 -84992 105734 -51886
12842 184421 -76252 -328535 48190 -230005 -116795 -17284 -33249 334111 58702 86397 102747
12831 102747 -30489 -35315 370614 98507 129422 8276 1096 576046 -186285 61890 190267
12820A90267C0297J23824m5204J82734n7725b5643B26898p4969j2052J8248c0478
12808B06560h7590d1601A80262a51730A28064R6153b09984G117c10928a42090
12797H1459A2704a23855k9919a0908B83764b3119A00677a22810A02797P6984G6844
12785F8592b7642l36852a1150B99802j45714d179C0543h6111j0688b5896k30496
12774b56392J04495F7958L05557a14234G9905P5612i3930c7463a2972p676j42967
12763a63615D644a80041H0099L38551a18426A4452e6921A12337J05028K38356
12753D55721A65890F2206d6040k63917B2427a5658A43485b88052B52059b67568
12742C11212M7581F2714J71867n7613G4059K08486c44452R1474D6901i4145I465
$$ plain form
12820 190267 30297 154121 108917 291651 233926 -25643 226898 151929 139877 158125 -30478
12808 206560 -87590 -41601 180262 -151730 128064 224217 -209984 7117 -310928 -142090
12797 81459 12704 -123855 -153774 -10908 283764 -23119 100677 -122810 102797 179781 76844
12785 68592 -27642 -364494 -11150 299802 154088 -4179 30543 -86111 -96799 -25896 -256392
12774 -256392 -151897 67958 373515 -114234 79905 155517 -93930 -37463 -12972 -20648 -163615
12763 -163615 4644 -180041 80099 418650 -118426 14452 -56921 112337 217365 455721
12753 455721 165890 62206 -46040 -309957 22427 -15658 143485 -288052 252059 -267568
12742 311212 358793 62714 234581 176968 74059 282545 -344452 -252978 46901 -94145 9465
12730A0624L64531g313D748L09098l5634G9254g4118B49382a91028A71631C8464
12718F0572c14025A98622a9698q8346b7548B68490j12800P1665H9033J71729b16935
12706h098A4440M8683B0635J1832K33119q461d9434l9363o9971H2401a59130B98758
12693A23353J560j7985m7752k3839R3843D8589J85104J62996A25931K5076C7251
12681A72901m2046a42833A56695A019L7796b28498b9330A42746a78257B1320g1454
12669a12389A8593a4099k14450A95900a49904A49052A7542d2735A68632J05141
12659B73773D8659J210b1321n8955B79759G4252a83887F8772a64228b6211A4334
12647A06470d5286b1969A55971L64374J23160a71119g379B24274c8504B48200
$$ plain form
12730 10624 375155 -7313 4748 313846 278212 79254 -74118 249382 -191028 171631 38464
12718 60572 -314025 198622 -19698 -108044 -27548 268490 155690 227355 89033 260762 -216935
12706 -8098 14440 63123 20635 32467 265586 257125 -49434 -88797 -158768 82401 -159130 298758
12693 123353 124913 106928 59176 35337 129180 48589 233693 396689 125931 151007 37251
12681 172901 130855 -142833 156695 1019 38815 -228498 -29330 142746 -178257 21320 -71454
12669 -112389 18593 -14099 -228549 195900 -149904 149052 17542 -42735 168632 273773
12659 273773 48659 49869 -21321 -80276 279759 74252 -183887 68772 -164228 -26211 14334
12647 106470 -45286 -21969 155971 520345 643505 -171119 -7379 224274 -38504 248200
12636B78755C7628K25702Q3678j33692h9747E4881A1336K93568j19924L46204
12626E31184e4284k0583c2674k0752B918R2178D5817J29991L25274g9972C25528
12614B10393C6981J15653p386n121D608L74981G4519L16715P7228a09326B22905
12602B26092A12955L5269P7892j05779k8690M0089j7318R4829h2007A1285K09551
12591B20836p3634Q9119a7962m1242C83998A46197J73387m4219P8266H4118N9858
12580A43976j3361J4864J17034H0493a7770j70808A61920N3371b04279i2729C4691
12568b37537I5519Q8651a31336A44940b69183C51851e489K182n8638j18282D69023
12556G134J47342d0111J2419j08100A29804d0325j601B37115D433L62550A20615
$$ plain form
12636 278755 37628 263330 347008 213316 -89747 54881 11336 304904 184980 531184
12626 531184 -54284 -74867 -32674 -53426 2918 95096 45817 175808 501082 -79972 325528
12614 210393 36981 152634 145248 140127 4608 379589 74519 391234 468462 -109326 222905
12602 226092 112955 148224 226116 120337 91647 131736 114418 209247 -82007 11285 220836
12591 220836 147202 236321 -17962 -59204 383998 146197 319584 275365 353631 84118 143976
12580 143976 130615 145479 262513 80493 -17770 -188578 161920 215291 -204279 -92729 34691
12568 -237537 95519 184170 -131336 144940 -269183 351851 -5489 -3307 -61945 -180227 469023
12556 7134 154476 -40111 -27692 -135792 129804 -40325 -41926 237115 4433 366983 120615
12544B29693K9263b35069A49203C9572i0185A5963L46253J35270B00648a32558
12533b07725B30368f7622k1857j67975F0614i9906A44914a58285I5658K1880Q7896
12522B05434k9081c55059C42412I5710c11284I1094a82839A49199J46699K044
12512B97942J06593A86220c40j04093o8966b0153C9986L26270a87546a7371k41131
12501b58502B34436H0217K09054j06598a00952B13043p9421j9088b26829B66104
12490d5414C66312j37042j03556i2272j59874L6202k4962C07121g0G5800i0218
12478H9865B2081a30033A31932k9800C8575D81a7471C3361i7908a2551l25888
12467c38439C8689J0878L5971D2055F053b44382B02984a14392a1612A6518b692
$$ plain form
12544 229693 258956 -235069 149203 39572 -90185 15963 362216 497486 200648 -132558
12533 -207725 230368 -67622 -89479 -257454 60614 -99906 144914 -158285 95658 117538 205434
12522 205434 176353 -355059 342412 95710 -311284 91094 -182839 149199 295898 297942
12512 297942 404535 186220 -340 -104433 -173399 -20153 39986 366256 -187546 -17371 -258502
12501 -258502 234436 80217 289271 182673 -100952 213043 133622 114534 -226829 266104
12490 -45414 366312 229270 125714 -92272 -252146 -215944 -240906 307121 -70 75800 -90218
12478 89865 22081 -130033 131932 102132 38575 481 -17471 33361 -97908 -12551 -338439
12467 -338439 38689 49567 85538 42055 6053 -244382 202984 -114392 -11612 16518 -2692
12455A2286a21875F6945B4267J89057A6197b64332J17312J8439n6147H356N5156
12444F3512N1397J03629J41423E4918K8591M0058a75719p1994B20043C4881J2457
12433D7338a79803A35559R7655a63045j24719B5596c62097B82124c41344C39787
12422A39254B7143h2067H4376O2396d8906o5510l38986A90927j9014e9576j57149
12411b16725a08151k1778D4848H001a9742B76089a33754F5389A5746e8550a4398
12399A7739J33230J85580b5867F3729f7164f793A21812m4302a2344M992E3473
12387a00357L312B0050J04891J42765m7990C7641K6499J58216D6988i8554A26
12375a61785D31a50087q5223b7661c954E3549O8053D6027a0351B17021b77230
$$ plain form
12455 12286 -121875 66945 24267 213324 16197 -264332 -147020 -128581 -184728 8356 63512
12444 63512 114909 218538 359961 54918 83509 123567 -175719 -247713 220043 34881 47338
12433 47338 -179803 135559 233214 -163045 -287764 25596 -362097 282124 -341344 339787
12422 139254 27143 -82067 84376 146772 -48906 -114416 -453402 190927 171913 -59576 -216725
12411 -216725 -108151 -129929 44848 8001 -19742 276089 -133754 65389 15746 -58550 -14398
12399 17739 150969 336549 -25867 63729 -67164 -6793 121812 77510 -12344 -7352 53473
12387 -100357 -97045 20050 124941 267706 219716 37641 64140 222356 46988 -98554 126
12375 -161785 431 -150087 -235310 -27661 -3954 53549 121602 46027 -10351 217021 -277230
12363I7508l4219b10919A63326b09345g8428l8121o7684C9148L80898A7499f445
12351h3623K9007j79309B73608c51061B64230l8822F956a20144c4315E8657K4451
12340H3108K18025F1937K10482a4005j17424C681a98408B19238a98466g1869G5196
12328I5525J09928B529L411j61J26750R9324C7595K64856b50099B17125K3375
12317B40500a46958j55834b4079A16545g3835D7038J58517q0497a935A40617l7628
12306A02989M7345J34642a12248K4116l01175a02694C7463c61728a46988O5534
12296h1454G6854b7389B22705r6282K61395A88962B5023f7342I200a73726b2329
12284a16401k0665l6842o538l2979J02347A49252a1651D755g0801q979C25184
$$ plain form
12363 97508 63289 -210919 163326 -209345 -78428 -116549 -184233 39148 420046 17499 -6445
12351 -83623 -54616 -233925 273608 -351061 264230 225408 6956 -120144 -34315 58657 83108
12340 83108 301133 61937 272419 -14005 -131429 3681 -198408 219238 -198466 -71869 75196
12328 95525 205453 2529 5940 5779 132529 231853 37595 302451 -250099 217125 240500
12317 240500 -146958 -302792 -24079 116545 -73835 47038 205555 125058 -1935 140617 102989
12306 102989 150334 284976 -112248 -88132 -389307 -102694 37463 -361728 -146988 -81454
12296 -81454 76854 -27389 222705 126423 387818 188962 25023 -67342 9200 -173726 -22329
12284 -116401 -137066 -173908 -180446 -213425 -111078 149252 -11651 4755 -70801 -79780 325184
12272B77686a27482I9869l2772B8182j174J91738a3234E4056c23749K7135A05828
12260a21919G9001n883J77025j10322a43873C45944F4107L57860b23260e5946
12249B27755K7604c4939D0943K32621j26928E7753k8682c4091B7765K75158D1338
12237I1089a30629B19229c1467C36790r5191j2896j08038l1318K46096a81764
12226C08839r4257D7429q826a84242A49499J676F5202K43951j28593L3376k4197
12215A89739a9781A03557K61032j59808a62393B16431b3726B79147J01886j01828
12205B79205J415k31Q5837j59066a96115R0656C09613l6701q2812n4996K17702
12194C52806i9945A85043C0658M7561B42J07110J08980m5254M3257J2515m1200
$$ plain form
12272 277686 -127482 99869 67097 28182 27008 218746 -13234 54056 -323749 -296614 105828
12260 -121919 79001 73118 250143 139821 -143873 345944 64107 421967 -223260 -55946
12249 227755 255359 -34939 40943 273564 146636 57753 29071 -34091 27765 302923 41338
12237 91089 -130629 219229 -31467 336790 241599 228703 120665 89347 335443 -181764
12226 308839 214582 47429 38603 -184242 149499 151175 65202 309153 180560 213936 189739
12215 189739 -19781 103557 364589 204781 -162393 216431 -23726 279147 381033 279205
12205 279205 280620 280389 366226 207160 -196115 -105459 309613 272912 190100 135104 352806
12194 352806 -99945 185043 30658 78219 242 107352 216332 171078 214335 226850 185650
12183A85650J70122E8596L240L19636D9701K4271L8333K04238J68786A1564O3216
12172G4780a644B97438d37435a37637K5023c0960A08326e2158J8904d17A15443
12160d4640A08886R5584H0575a36301C51031I6520d08746H4338j2503J32235l2729
12149A71341N8157i4108H3603J41655n5725J31142a46690a7054A91243C8492c3246
12137a67815C0747c5898C00348A24895C9428e3799i901n5348F8054J06227B9030
12125c3574C3567K26547A3192K40254G1198P6860M2084J14790a035A12849i3606
12113B67194k1983a88810B29241J21695b390A00182Q5714F6221c5862A97289D2501
12101A87565P5851o6867a41204B42170l1976i6579H9045Q129K18587I917M52138
$$ plain form
12183 185650 355772 58596 61836 381472 49701 73972 112305 316543 485329 11564 74780
12172 74780 -1644 297438 -437435 -137637 -112614 -30960 108326 -52158 -33254 -417 115443
12160 -44640 108886 204470 80575 -136301 351031 96520 -408746 84338 71835 204070 171341
12149 171341 229498 -94108 83603 225258 169533 300675 -146690 -17054 191243 38492 -33246
12137 -167815 30747 -35898 300348 124895 39428 -53799 -9901 -65249 68054 174281 29030
12125 -33574 33567 260114 13192 253446 71198 148058 190142 304932 -1035 112849 -93606
12113 267194 245211 -188810 229241 350936 -2390 100182 185896 66221 -35862 197289 42501
12101 187565 263416 196549 -141204 242170 210194 -96579 89045 97174 315761 9917 462055
12090D62055f3619k5148F7736k4459c26231H8945e7652G2845J36869c03463J36901
12079a66562b3942p867l38805B6973a85703F3851C0662J31297c09603A74947b09680
12067e9115B38174M05641A66661I694b2091k38014d891q5152A83943g3880j59389
12056b33269B47466C9538O53675J40281A82621D6300b0305C0341J31838n5391
12046A06788a54711E248a78887A24169h5601B67518c00276J38536J299l26744
12036d87185a1503j11218n1564C11014j28444D9479K19904Q4976b21980A17121
12025a7520j40426B0106Q8057a80176e4506l46643C9714i286H4070J95417j21143
12014A58344o4771b05993A04774b53008l7141H6603b4889C66397G1125J56383
$$ plain form
12090 462055 -63619 -88767 67736 43277 -326231 88945 -57652 72845 209714 -303463 -166562
12079 -166562 -23942 -31809 -370614 26973 -185703 63851 30662 161959 -309603 174947 -209680
12067 -59115 238174 643815 166661 9694 -22091 -260105 -4891 -90043 183943 -73880 -233269
12056 -233269 247466 39538 693213 833494 182621 46300 -20305 30341 162179 106788
12046 106788 -154711 5248 -178887 124169 -85601 267518 -300276 -161740 -160441 -487185
12036 -487185 -11503 -122721 -174285 311014 182570 49479 269383 354359 -221980 117121
12025 -17520 -157946 20106 108163 -180176 -54506 -401149 39714 -9286 84070 279487 158344
12014 158344 93573 -205993 104774 -253008 -290149 86603 -24889 366397 71125 227508
12004B27508a11857j43616M5747A53468B3134i4113j39565A18041b00494h5758
11993a27951B18620b23872f84p2952m7393A98520c3383k37627h0429A19175J09043
11982B28218n6837b15289N8734O8528a0301j07687G9103C2098a19570K595e1602
11970B64431g3406B11414f8743n6988K1566j67020H7997J78795d91091b01282
11959f8417C18238n3621a20157l848j11365p6642A24957N7277h735j50877M029
11948a55583A18039g1657j61003F705a38646K8313j53041i969k03179r6041j06319
11937d15508D6580c166G7372f7238K029j28806P5688A80483B8318b48030K3421
11926b24609d5097i053l38345A17092b43241a5904m68021i4925c475j98215Q6494
$$ plain form
12004 227508 -111857 -255473 -209726 153468 23134 -94113 -233678 118041 -200494 -85758
11993 -127951 218620 -223872 -684 -73636 -121029 198520 -33383 -271010 -80429 119175 228218
11982 228218 171381 -215289 -156555 -88027 -10301 -117988 79103 32098 -119570 -116975 -51602
11970 264431 -73406 211414 -68743 -125731 -104165 -271185 87997 266792 -491091 -201282
11959 -68417 318238 264617 -120157 -124005 -235370 -312012 124957 182234 -8735 -159612 -155583
11948 -155583 118039 -71657 -232660 6705 -138646 -110333 -263374 -9969 -213148 -309189 -415508
11937 -415508 46580 -3166 77372 -67238 -65209 -194015 -118327 180483 28318 -248030 -224609
11926 -224609 -45097 -9053 -347398 117092 -243241 -15904 -483925 -94925 -3475 -201690 -115196
11915a15196I9427K76226a02093k41713b0616C7375O0731f5397D06759f0626k93879
11904c54505A27377q893a62722a2532F5410J40344A1395J75763a0510F8052G396
11892a45147d5007A29700c76870A2986K01251b94444l5418C4464h2856j30976
11882b13832H6069a0378q0946j39994o7016a1286F2535a48888K723H0031O8373
11871A48404n576e4296j75258C2803c06140G2722K6422b49455A87902p9729L1500
11860A39673l0114K00353D0039c5584B14047B3661a53399f2850A39518b11175
11849A74887b88566A80336a96975A98392C3473a32470D96487H9276m372b11055
11838a37074d2440j25607k29908j81770a2615B0384g9738K8155k28984e7221m8260
$$ plain form
11915 -115196 99427 375653 -102093 -343806 -20616 37375 98106 -65397 406759 -60626 -354505
11904 -354505 127377 118484 -162722 -12532 65410 205754 11395 187158 -10510 68052 7396
11892 -145147 -45007 129700 -376870 12986 214237 -294444 -329862 34464 -82856 -213832
11882 -213832 86069 -10378 -91324 -231318 -298334 -11286 62535 -148888 -146165 80031 148404
11871 148404 142828 -54296 -229554 32803 -306140 72722 99144 -249455 187902 108173 139673
11860 139673 109559 309912 40039 -35584 214047 23661 -153399 -62850 139518 -211175
11849 174887 -288566 180336 -196975 198392 33473 -132470 496487 89276 84904 -211055
11838 -137074 -42440 -168047 -397955 -579725 -12615 20384 -79738 -51583 -280567 -57221 -105481
11827a05481l2157a5198r4905E195a40213A31669m1602a60519B00475b3590j86318
11816b09908C0221b09426A81760a9237F8977a23299k52374J73677L6013I6638
11805h8270b6075k55503D7664c10188a6221N765r6124b7691N134B09602E0200
11793A48619h9874m2704D2512K82369a48977h271j98644B1923a51628b1715j47105
11782a68820P4188l8145A23690h1624j1904L4873A09524g7249K0i350A16967h3416
11769D283b9697l3558L1533j69066C08530b98381G7384i6591j10276B27371c44662
11757F8487a61929l14163e3210j64239j49981c55D83686B02434b69090H8920A0643
11745a32336D4203Q606J37509J16511b06815A48326p2463a91784A60959D113h1222
$$ plain form
11827 -105481 -137638 -15198 -110103 5195 -140213 131669 90067 -160519 200475 -23590 -209908
11816 -209908 30221 -209426 181760 -19237 68977 -123299 -375673 -201996 -165983 96638
11805 -88270 -26075 -281578 47664 -310188 -16221 -10456 -106580 -27691 -22557 209602 50200
11793 148619 -89874 -132578 42512 324881 -148977 -8271 -206915 21923 -151628 -21715 -168820
11782 -168820 -94632 -132777 123690 -81624 -93528 -58655 109524 -77249 -77229 -9350 116967 -83416
11769 4283 -29697 -63255 -31722 -200788 308530 -298381 77384 -96591 -206867 227371 -344662
11757 68487 -161929 -476092 -53210 -217449 -367430 -355 483686 202434 -269090 88920 10643
11745 -132336 44203 52809 190318 306829 -206815 148326 75863 -191784 160959 4113 -81222
11733D15732C7603b42887b6901k19525q8179c2515p1202C53429F6623k4759h2962
11721B3247c00462L9885j7974A80118r623c07183B60263E7075c91062f201F0495
11709f2642B56766g4444j6557D2966a14561M1797r0382I6664c62925A16288N538
11698A21826J55035c5724I3154a7514r0959L8347A96822a39529E510M2656A4778
11686C78325i381A99512K4185D1863g4620A45920M6877a47490d7683j23609D2843
11674C14794b78298B27679a38846q562f2323J4366D42956a02659C97719A10460
11663b02798A70462F1777a27155F3837K33222a82303A71316c2011j16442A26000
11652a33090a8058A23283h7916k14071d274k35008P9033G5346c5847A14579a99074
$$ plain form
11733 415732 37603 -242887 -26901 -246426 -334605 -32515 -103717 353429 66623 41864 -82962
11721 23247 -300462 -260577 -278551 180118 170495 -307183 260263 57075 -391062 -6201 60495
11709 -62642 256766 -74444 -91001 42966 -114561 -72764 -163146 96664 -362925 116288 121826
11698 121826 276861 -35724 93154 -17514 -108473 -70126 196822 -139529 5510 48166 14778
11686 378325 -9381 199512 223697 41863 -74620 145920 192797 -147490 -47683 -171292 42843
11674 314794 -278298 227679 -138846 -147408 -62323 -47957 442956 -102659 397719 110460
11663 -202798 170462 61777 -127155 63837 297059 -182303 171316 -32011 -148453 126000
11652 -133090 -18058 123283 -87916 -301987 -4274 -239282 -160249 75346 -35847 114579 -199074
11640d06278a10204A88418a76543a119j6699k8199A04592e0682l7792a4364j46832
11629a61196A22585a13609R466o7636g4616l38756A39543o6579c8334B3417d4800
11617a23687d9503B04989b3423l6060j43608o1338L8939F8446a40866m0684E759
11605A14015a90492B61867o7228f7111m9673j97972D1172a26893q0151A62879
11594b93369B84915j11468d6990j08875k24769d9588A7929J35874j5849C8739
11583e8697j21914g1474A87659m7628n9035c1863j1445C7932Q3936d1465E501
11571B63785I3060b79494a19963e9003B00430I4050m1471a5081B82999f199B5867
11559c58997b1641C14570G7439J8279d03307O2259B11128c22065G4322f967A83564
$$ plain form
11640 -406278 -110204 188418 -176543 -1119 -17818 -46017 104592 -50682 -88474 -14364 -161196
11629 -161196 122585 -113609 -104143 -171779 -74616 -413372 139543 72964 -38334 23417 -44800
11617 -123687 -49503 204989 -23423 -59483 -203091 -264429 -225490 68446 -140866 -181550 5759
11605 114015 -190492 261867 194639 -67111 -116784 -314756 41172 -126893 -207044 162879
11594 -293369 284915 173447 -46990 -155865 -380634 -49588 17929 153803 137954 38739
11583 -58697 -180611 -71474 187659 140031 80996 -31863 -43308 37932 121868 -41465 5501
11571 263785 93060 -279494 -119963 -59003 200430 94050 52579 -15081 282999 -6199 25867
11559 -358997 -21641 314570 77439 95718 -403307 -341048 211128 -322065 74322 -6967 183564
11547B3334K87929d2296q1504A1544b916D1750a025E3224J09352J42748c989n5550
11535e9539j17386B80892b27794P4978A26092L3143a29433K7188B72138f3575
11524A47018m1939I356J84534J1426H3122L2886g2188A42771a52780C29618b57100
11512A73414a40103H3951c0684B8987n906O2034i7231B1948P7551J68157A19873
11500a03317A28011k1988i8431A01459J83499j0276J65855E2922O43230b0483
11489A43002L39229k30941r5048m3901M29806D1274a59703c8464E0901L327J20024
11478A74252p5903J87269l7855G3108a49548B78855J87581j74688K3756A00890
11467C4277J88059N9261a14467G933a190C23810o7910f0336C87148j46336J2053
$$ plain form
11547 23334 311263 -42296 -123800 11544 -2916 41750 -1025 53224 162576 305324 -3989 -59539
11535 -59539 -176925 280892 -227794 -152816 126092 159235 -129433 -102245 272138 -63575
11524 147018 105079 9356 193890 205316 83122 116008 -72188 142771 -152780 329618 -257100
11512 173414 -140103 83951 -30684 28987 23081 85115 -97231 21948 99499 267656 119873
11500 -103317 128011 106023 -98431 101459 284958 274682 440537 52922 696152 -20483
11489 143002 482231 251290 156242 112341 542147 41274 -159703 -38464 50901 54228 174252
11478 174252 98349 285618 247763 73108 -149548 278855 466436 291748 315504 100890
11467 34277 222336 281597 -114467 7933 -1190 323810 255900 -60336 387148 240812 252865
11456B52865E3482r848L35977A05150f8102A82022J61863A45436a57685G7657
11445C92267A79200J21620a43715E9263L65678c1307k0150A02888b3727F6451
11434I9381D1061J08249J1810K6300F6541n880K32337A27665g9375k6762H1563
11422b48671h588C95188i9090A3309c5686j50923H3406m0300b670A34150J55999
11411B90149c09732D68764A54724P7806b8013n1044m6494B7638b34700h8776p2535
11400a61311B70908A20806c1285j22293o3865P7647I4379J28416a50333e8381
11389b36249B62509b84335b6238C817b55234b675r4434B7097b44534L4843A38946
11377A97098J35389c66355a35735B36226n3379G0930a30908A32317a06186A22790
$$ plain form
11456 252865 53482 43634 379611 105150 -68102 182022 343885 145436 -157685 77657
11445 392267 179200 300820 -143715 59263 424941 -31307 -51457 102888 -23727 66451
11434 99381 41061 149310 161120 187420 66541 60661 292998 127665 -79375 -106137 81563
11422 -248671 -8588 395188 -99090 13309 -35686 -186609 83406 43106 -2670 134150 290149
11411 290149 -309732 468764 154724 232530 -28013 -79057 -125551 27638 -234700 -88776 -161311
11400 -161311 270908 120806 -31285 -153578 -217443 -139796 94379 222795 -150333 -58381
11389 -236249 262509 -284335 -26238 3817 -255234 -2675 -97109 27097 -244534 -209691 138946
11377 197098 332487 -366355 -135735 236226 182847 70930 -130908 132317 -106186 122790
11366c39444i3148B49362a61331I6315A8693b99661B09283l6381n6721b11138
11355a96056a9753I6779l6162J4319c16206a57859F5237Q0691a97597e5995J870
11344e4125B589P2805a95123B0011J24784m1885m0505I374J55068J028D0494K36511
11332B77005d06299a16612A57125A2635d6875k44720b0200e628B98389d29483
11321d0788l1542j55412R0789d418a219j07909m2850A82895b04143j02223I1918
11309B35866k1902b28205C05352Q7901a8740F9487b20537J9188d9087C4452b46070
11297a27389A23262c3157E5238K68455G5409b90794E3675J39031a47148C89171
11286a37532j76290E8734b5156j59865c7939j830j41456b6665o3291o6130A74873
$$ plain form
11366 -339444 -93148 249362 -161331 96315 18693 -299661 209283 172902 116181 -211138
11355 -196056 -19753 96779 60617 74936 -316206 -157859 65237 145928 -197597 -55995 -54125
11344 -54125 2589 75394 -195123 20011 144795 102910 62405 9374 164442 165470 40494 277005
11332 277005 -406299 -116612 157125 12635 -46875 -291595 -20200 -5628 298389 -429483
11321 -40788 -72330 -227742 -136953 -4418 -1219 -109128 -151978 182895 -204143 -306366 91918
11309 235866 213964 -228205 305352 393253 -18740 69487 -220537 -201349 -49087 34452 -246070
11297 -127389 123262 -33157 55238 323693 75409 -290794 53675 192706 -147148 389171
11286 -137532 -313822 58734 -25156 -185021 -37939 -39769 -181225 -26665 -89956 -156086 174873
11274A9492b81800C29739r0841I8669i4790k84154c143k73176a4493l4140A76837
11262C32624a18596N1946k72992h3098C56126b29440g5792r8219A11314b18922
11251F074M54647I2367j9073J5421a06894a8378B07890a44732G6272K9257b41795
11239B17002j06321D8153h4430a5560A40889a5738A02571J69728j32146g7621
11228b51171r3174g8830F3182b5448a0560l9621k63859A57296c42169c8863k99341
11217c38204B77298b39733J06621E9611J3300b78347N0164i2021p8014L3667A02803
11205b77993a24500E5299b82277G906J47111b6925k4445B40009D4876d8054C7816
11193A9758L6588a44480H3327R8227c67832E3011R1748H801J50022i3649B27017
$$ plain form
11274 19492 -281800 329739 238898 98669 -94790 -378944 -3143 -276319 -14493 -48633 176837
11262 332624 -118596 -66650 -339642 -83098 356126 -229440 -75792 -174011 111314 -218922
11251 6074 460721 92367 73294 88715 -106894 -18378 207890 -144732 76272 105529 -241795
11239 217002 110681 48153 -84430 -15560 140889 -15738 102571 272299 140153 -77621
11228 -251171 -344345 -78830 63182 -25448 -10560 -50181 -314040 157296 -342169 -38863 -338204
11217 -338204 277298 -239733 -133112 59611 72911 -278347 -228183 -92021 -170035 -136368 102803
11205 -277993 -124500 55299 -282277 7906 155017 -26925 -51370 240009 44876 -48054 37816
11193 19758 56346 -144480 83327 181554 -367832 53011 144759 8801 158823 -93649 227017
11181A25856J54324B6347J31134e6694E7489b83140j66890B04648o7577a51061
11170g1753B03709I7054b52174K199d1556A09204a63037g8116E9083L5060L40797
11159D34940E8969b7668B2256a93212B62795H5793J2611d2923j1388D4398e1873
11147b01120k0244g0812a4183p0050l15233e6745k2159A78130q3267c8740l5739
11136g4479j39453e277B48276b12617a1337A34371C9297b68656F8368c88928a49169
11124A93454a54514k21519A42628I550J11361L25948A62027L5583N9779j26045
11114A31344K57279o360A24103c11267H1427k6164P0390a55819F9740A9280K28076
11103B47356A03426B3214J41336J17699A19465b2901A45822m6798A7877g3790
$$ plain form
11181 125856 280180 26347 157481 -56694 57489 -283140 -450030 204648 137071 -151061
11170 -71753 203709 97054 -252174 -249975 -41556 109204 -163037 -78116 59083 94143 434940
11159 434940 58969 -27668 22256 -193212 262795 85793 98404 -42923 -54311 44398 -51873
11147 -201120 -221364 -70812 -14183 -84233 -399466 -56745 -78904 178130 94863 -38740 -74479
11136 -74479 -213932 -5277 248276 -212617 -11337 134371 39297 -268656 68368 -388928 -149169
11124 193454 -154514 -376033 142628 9550 120911 446859 162027 197610 257389 131344
11114 131344 388623 382263 124103 -311267 81427 55263 125653 -155819 69740 19280 247356
11103 247356 103426 23214 164550 282249 119465 -22901 145822 99024 17877 -73790
11092B39429P8414j48394H3139a6856B9297N0320k7388c1381B74490l6783J21065
11081C58772I5387J50629q0329r592J42992A45563L5869J12157A40680J23691
11071B64371C3037r759h819A07410L54542A87915g177H07724C68147p9167p8727
11060B10253J02914J43762o6364m718p7618M3462j74093L33020Q9751B94903j3462
11049B81441o055O8150K90765j72657j47480K71099o7066K14859j49584K38503
11039H21975k60109K20388J38277l21942L27012L4920k79749K44368J01729n2325
11029I74544k1294k23010Q0161r7012J44646j44112J87180l26010L21288M6704
11019I43085j56500J70809P2100j38285J35723k00271O302J39814N0087k90017
$$ plain form
11092 239429 317843 169449 83139 -16856 29297 79617 52229 -31381 274490 237707 358772
11081 358772 95387 246016 165687 156095 299087 145563 181432 293589 140680 264371
11071 264371 33037 23278 -8819 107410 461952 187915 -7177 807724 368147 288980 210253
11060 210253 313167 456929 390565 385847 308229 351691 177598 510618 600369 294903 281441
11049 281441 275386 343536 634301 461644 314164 585263 518197 733056 583472 821975
11039 821975 561866 782254 920531 598589 925601 960521 680772 925140 1026869 974544
11029 974544 953250 730240 810401 713389 858035 713923 901103 575093 896381 943085
11019 943085 786585 957394 1029494 891209 1026932 826661 832963 972777 1022864 732847
11009G32847J77466q860q8298j24826K37347D44141M17085m0338l13678J90383
10999F97593k19052K15723J12277J1957L9325l51089M34508J9184k78554K52467
10989I34339l98039O5311k15084L80433o1346k52050J75722M4467k98765M67616
10979H42604l24900J69321k4450K90966J21638l30918J01898J62605R894q4633
10969I34025K02088M61453j09199o3848J32178o7443J44108N4317L82548N4560
10959B124787K65726L75444N33105O7856K02254o0258m11162K54689l13995m44398
10949B594048m89078m6159o36047L69079J68085n27921J51473j50865j6319N6301
10939A472597k53046k27006J02740l26611m3940P5095j20666B95050K03645j26580
$$ plain form
11009 732847 910313 901453 813155 688329 925676 444141 861226 820888 507210 697593
10999 697593 478541 694264 806541 818498 857823 506734 941242 960426 681872 934339
10989 934339 536300 601611 386527 766960 705614 453564 629286 673753 374988 842604
10979 842604 517704 687025 662575 953541 1075179 744261 846159 1008764 1018658 934025
10969 934025 1136113 1597566 1488367 1424519 1556697 1489254 1633362 1687679 2070227 2124787
10959 2124787 2390513 2765957 3299062 3366918 3569172 3508914 3097752 3352441 3038446 2594048
10949 2594048 2104970 2058811 1422764 1791843 1959928 1432007 1583480 1432615 1416296 1472597
10939 1472597 1219551 992545 1095285 768674 724734 799829 679163 295050 498695 372115
10929C72115j47261O4771J58469j42927J702E678J32289M19515B6071R5896K39071
10918C61038A29505J02768j09709P6249G6354M56907A59619L8539c39598F7316
10907C0129a99470a5098B63965g3226B46866e4171A21428A1792M4357J30762i4699
10895D5671J69493b08164b2351q6147E1093g0361j83868A45643a19784A88926
10884b05200f1333B58252e6412H6003J6401B1061f8298F5536O1833c89044a47155
10872C13753D8405A4154J38525d67117C25470i2219G6524K23059G4002a37900
10861E6922b61330h302j71569A99799b44361L4363Q7765j38071g4607k33988R3428
10850b15167D53556a1954j12516A79448P038g2304D0133K04420A3994h2955j2208
$$ plain form
10929 372115 224854 289625 448094 305167 306869 5678 137967 557482 26071 121967 361038
10918 361038 129505 232273 122564 198813 76354 533261 159619 198158 -339598 67316
10907 30129 -199470 -15098 263965 -73226 246866 -54171 121428 11792 56149 186911 -94699
10895 45671 215164 -208164 -22351 -108498 51093 -70361 -254229 145643 -119784 188926
10884 -205200 -61333 258252 -56412 86003 102404 21061 -68298 65536 127369 -389044 -147155
10872 313753 48405 14154 152679 -467117 325470 -92219 76524 299583 74002 -137900
10861 56922 -261330 -8302 -179871 199799 -244361 -209998 -122233 -260304 -74607 -308595 -215167
10850 -215167 453556 -11954 -124470 179448 186486 -72304 40133 244553 13994 -82955 -95163
10839i5163A1543g5416K6275B72199b27378R0582M5770q8959B55863a98916A28863
10827e3707C06911a8361k58457A36012N7568b71242g8432k74678J67685b6664
10816A14753a79400B8481L33J57527b74038A10191P0417A8110h8800p0761B80093
10804a02731p4183N1205B1604h9016E682h2121H068a56020H1307e5575A46538
10792F6160J00991i8080j2764B08484a94012l8866R1726n2444a8840D5636a23987
10780B02460A1489N6953A7386b12430N6685J6066n3982d1297j00582O8448j29026
10769b02457A08190b92942f167r7604A30675b2350k32358h5560A75880P7254c04441
10757D8832d0719B13898E8000i3858c9522q5177f1730m6452n9014p806O6070D6051
$$ plain form
10839 -95163 11543 -75416 -49141 272199 -227378 -136796 -91026 -179985 255863 -198916 128863
10827 -53707 306911 -18361 -276818 136012 193580 -271242 -78432 -353110 -185425 -26664
10816 114753 -179400 28481 28814 186341 -274038 110191 180608 18110 -88800 -159561 280093
10804 -102731 -176914 -125709 21604 -89016 5682 -82121 8068 -156020 81307 -55575 146538
10792 66160 167151 -98080 -110844 208484 -194012 -232878 -141152 -193596 -18840 45636 -123987
10780 202460 11489 68442 17386 -212430 -155745 -139679 -193661 -41297 -141879 -73431 -202457
10769 -202457 108190 -292942 -6167 -103771 130675 -22350 -254708 -85560 175880 253134 -304441
10757 48832 -40719 213898 58000 -93858 -39522 -124699 -61730 -108182 -167196 -175002 -108932 46051
10744g6702j911l7555E0029b23053j7672B12273a07436b9925j12235A65020j5326
10733A49694L2782a49461d0172A93228F4243a1647l11972a5963l60852a06088
10722c35522H5412J41742d3789A17578L61764a80814g7065G8574b80047C09108
10711B48335a33247b7138q5450l4808A01508c54356B23379F0564i1917E1710O9920
10700A21630M9360a97394E4801a15444l3531O7418A97064m0048G6797d41814A67158
10688A75482d7609m0350o2319C6704J6139i8353j35212c674r1373a4428j70767
10677a85195B00638a9573B0876F705a83538G5533a07469E32521f4184A83887b71593
10665b78273o9346h0809j40991N0921D8025f00408G8007a38750H522P1651R1083
$$ plain form
10744 -76702 -78613 -116168 50029 -223053 -240725 212273 -107436 -29925 -142160 165020 149694
10733 149694 182476 -149461 -40172 193228 64243 -11647 -323619 -15963 -376815 -106088
10722 -335522 85412 227154 -43789 117578 479342 -180814 -77065 78574 -280047 309108
10711 248335 -133247 -27138 -112588 -147396 101508 -354356 223379 60564 -91917 51710 121630
10700 121630 170990 -197394 54801 -115444 -148975 -81557 197064 157016 76797 -441814 167158
10688 175482 -47609 -87959 -150278 36704 52843 -98353 -233565 -3674 -95047 -14428 -185195
10677 -185195 200638 -19573 20876 6705 -183538 75533 -107469 532521 -64184 183887 -271593
10665 -278273 -347619 -80809 -221800 -170879 48025 -600408 78007 -138750 8522 80173 171256
10654A71256C0623h3471c3743G3715a97067D8594c2476p9125A65671a43690k19295
10643c62985C2456d4909j47543N3346L1901M757A12897M4260a59140R17a3078
10631b1230A2785b76731J15402A64301a14667L247o3440Q562M5152L9701J6215
10620f5230H3070c02293B74720a03333M3801k32804Q7406J3496A80991c8r2137
10609i2175d0837e180B35519a67744f7473D140a24052n7221A89165b01246i8911
10597c64068L2304J56747F885b54941B35673r6237h8041c3551H6997c45098B71193
10585D01641a04953B7019m201P9555c58298a2189m3719A0554a06262d2241I9850
10573G5506a92323I9385a75117O4230A83586o9223a72559A7179c05084a02974
$$ plain form
10654 171256 30623 -83471 -33743 73715 -197067 48594 -32476 -111601 165671 -143690 -362985
10643 -362985 32456 -44909 -192452 -139106 -107205 -102448 112897 157157 -159140 -158223 -13078
10631 -21230 12785 -276731 -161329 164301 -114667 -111420 -174860 -166298 -121146 -81445 -65230
10620 -65230 83070 -302293 274720 -103333 -59532 -292336 -204930 -191434 180991 -38 -92175
10609 -92175 -40837 -5180 235519 -167744 -67473 4140 -124052 -181273 189165 -201246 -98911
10597 -364068 -331764 -175017 6885 -254941 235673 139436 -88041 -33551 86997 -345098 271193
10585 401641 -104953 27019 22818 102373 -358298 -12189 -55908 10554 -106262 -42241 99850
10573 75506 -192323 99385 -175117 -110887 183586 114363 -172559 17179 -305084 -102974
10562a16165j39027b3092j8785j10848d6436A3870a5108A17646i3532a5190A94954
10550I682a5731j39467k48938a64032k55136F3567D838P6875a20507e924A45155
10538A34504b47765a687p3768R439K5194C2711P0752a61264j25424g5538j1917
10527h7455A13347a39534C10923A10292f9761D9225c298j98173B17227m7956F7343
10515G1795l2764b14618B51268C7094O6561a11823n5626d7036j47529Q2571B65473
10503c32638a3070A80479K5195b49433k9831A06854a03855j21734J4893Q0870
10493a29826m4804j5986k74808H8319j7109c2410j16126P3805l85852a10454I6114
10481I283O927J33530B2889b93953f4087Q871l340A21191a07158b5445j39153
$$ plain form
10562 -116165 -255192 -23092 -41877 -152725 -46436 13870 -15108 117646 -93532 -15190 194954
10550 9682 -15731 -155198 -404136 -164032 -419168 63567 4838 81713 -120507 -5924 145155
10538 134504 -247765 -1687 -75455 -66016 -40822 32711 103463 -161264 -286688 -75538 -87455
10527 -87455 113347 -139534 310923 110292 -69761 49225 -3298 -201471 217227 169271 67343
10515 71795 39031 -214618 251268 37094 103655 -111823 -167449 -47036 -194565 -111994 265473
10503 -332638 -13070 180479 205674 -249433 -279264 106854 -103855 -225589 -210696 -129826
10493 -129826 -174630 -190616 -465424 88319 71210 -32410 -148536 -74731 -460583 -110454 96114
10481 9283 16210 149740 22889 -293953 -64087 -55216 -58556 121191 -107158 -25445 -164598
10470a64598P7784m899I919J26088K02684H5003a23782j11916A81426g5976B64629
10458b12742E0516j7930a71492A7049a13122l17009h8853k3770A53233h2999A10374
10446a95232b2115B931J68816O1912m0081E1058N2596K20949A7116d4697J523
10435d3174A43136c69927B35238o1659b74689H7796a59344D3366a30345I4219
10424H9465f2976G8630K5205M7830d4845q4341B22915a64735K0404C38602c15429
10412A94687F858a15690o3525g9747B95751b9805j93042R4103D55973i272B08040
10400b5145A23963b29677O1357A54813E365c96220H17R1604a80990q0598i2455
10388a05256K4410j29450K6942a3296H7084J57156a83801F513a29176D23633A34815
$$ plain form
10470 -164598 -86814 -91713 9919 136007 338691 85003 -123782 -235698 181426 -75976 264629
10458 -212742 50516 32586 -171492 17049 -113122 -430131 -88853 -112623 153233 -82999 110374
10446 -195232 -22115 2931 171747 233659 193578 51058 103654 324603 17116 -44697 -43174
10435 -43174 143136 -369927 235238 173579 -274689 87796 -159344 43366 -130345 94219
10424 89465 -62976 78630 103835 151665 -44845 -129186 222915 -164735 -144331 338602 -315429
10412 194687 6858 -115690 -179215 -79747 295751 -29805 -222847 -128744 455973 -9272 208040
10400 -25145 123963 -229677 -168320 154813 5365 -396220 817 92421 -180990 -261588 -92455
10388 -105256 -80846 -210296 -183354 -13296 87084 244240 -183801 6513 -129176 423633 134815
10376B33633J45774D5930J5502J59584F176O9313P9668K9342P3481J17341A19776
10364b7901C54593A41191M33896E0578N34597R2994j09436k30250A43015L22443
10354D65458Q9525k07832q7913J89175K20793k64555J30791k39726K60858B11802
10343H9784J175L7271L17275k04890K93987j99822M5931J28551L05656C29624
10332F64978B73734m5603K20598j62178K38206a74009n1726B32046C1892K10456
10322B42348J54478E2302i1790c8667A45252D6331O9533R5772r3803K42575g5966
10310D15590j20708A05756J34794G403K62541K089K71474a92592B9429c4767I1521
10298G2480c5486I2339C3838A0897P7159e30313A09105a27883b0200p0545A50812
$$ plain form
10376 233633 379407 45930 61432 221016 6176 75489 155157 184499 257980 375321 119776
10364 -27901 354593 141191 575087 50578 585175 678169 568733 338483 143015 465458
10354 465458 554983 347151 259238 448413 669206 404651 535442 295716 556574 211802
10343 89784 90959 128230 445505 240615 534602 334780 380711 509262 814918 329624
10332 664978 273734 228131 448729 286551 524757 -174009 -225735 232046 31892 242348
10322 242348 396826 52302 -91790 -38667 145252 46331 115864 211636 117833 360408 -75966
10310 415590 294882 105756 240550 7403 269944 272033 543507 -192592 29429 -34767 91521
10298 72480 -35486 92339 33838 10897 88056 -530313 109105 -127883 -20200 -90745 150812
10286I7972c1487j46099H242a42493n0539B3428K80364c05781D2563A046O6170
10275F7216a149o8039k0266l06896Q2155A58039a9275B76848I7737a24338B12422
10263a39678A0348O1280i6485j20295N4806B890a04776H517J71291c39341A21961
10251A33670J04352K036b227l2256k05911B61144a46026C54258K07852A50465
10240D0319h5138c415k7449A83685h5455b4469F4937b76349A27277J2671D183
10228g7855A63684c23551A0393b64325C22052a49829j04585I9019b80315k90005
10218e70320d8447H8306b03445B50447F247c87112b0879O797F0578A8587N9951
10207G8538h4540a275q3393C77708g8050C16574A14932h6002j07028B7720f3548
$$ plain form
10286 97972 -31487 -177586 8242 -142493 -193032 23428 303792 -305781 42563 1046 67216
10275 67216 -1149 -69188 -89454 -396350 -314195 158039 -19275 276848 97737 -124338 212422
10263 -139678 10348 71628 -96485 -216780 -161974 2890 -104776 8517 179808 -339341 121961
10251 133670 238022 240058 -2227 -34483 -240394 261144 -146026 354258 562110 150465
10240 40319 -85138 -3415 -30864 183685 -85455 -24469 64937 -276349 127277 139948 4183
10228 -77855 163684 -323551 10393 -264325 322052 -149829 -254414 99019 -280315 -570320
10218 -570320 -48447 88306 -203445 250447 6247 -387112 -20879 -14082 60578 18587 78538
10207 78538 -84540 -1275 -84668 377708 -78050 316574 114932 -86002 -193030 27720 -63548
10195D5206J92086e8918q9152e3434F8789b98512a2441l4647M83A56827a94929
10183I204J5655J00263E27J26045J9384e0723o8886G5506b35515B50322b95656
10171G9201Q0882b2625A39873C9397P437e537A9271a96568j95651N4785J4059
10160c23375C15039c09557B3378L28127f467j50571k7996o2835J11323j80102
10150c16648b2615Q289n8596E1282O9274g2246B11792e9056A35650D2700a8575
10138a54894B51108a68786g873k77352A3048g8424k45709d781j34714K0109C45100
10126H9968i808H3157i2660H894a18008B81057a15457G4450k7136b80248G7849
10114a39774M5808b3361I407a00082K5094J932a0391j42510A18089a24335N5729
$$ plain form
10195 45206 237292 -58918 -148070 -53434 68789 -298512 -12441 -47088 -46605 156827 -194929
10183 9204 24859 125122 527 126572 145956 -50723 -119609 75506 -235515 250322 -295656
10171 79201 160083 -22625 139873 39397 46834 -5537 19271 -196568 -392219 -337434 -323375
10160 -323375 315039 -309557 23378 351505 -6467 -157038 -185034 -247869 -136546 -316648
10150 -316648 -22615 -14326 -72922 51282 120556 -72246 211792 -59056 135650 42700 -18575
10138 -154894 251108 -168786 -7873 -285225 13048 -78424 -324133 -4781 -139495 -119386 345100
10126 89968 -9808 83157 -92660 8894 -118008 281057 -115457 74450 47314 -280248 77849
10114 -139774 -93966 -23361 9407 -100082 -74988 -73056 -10391 -152901 118089 -124335 -68606
10103f8606A90431e660j85359l4791I8397a15127a7250k0662p0639A09485c03937
10091c1131k54815a33751j57197A69772K96104g0246k04493q8624N7750I4277
10080A16867a102n5801C43024g0010f500l6557F7249a40786e7995l15669j3013
10069c86677J78603d3086k11838e0415r4452a2158A61171a26081A52778b59177
10058e87573K16241h7025o7711p5306a9425j66558N1098B9432J0528F248a1078
10046I512b31149r190J8605N5995F4211c44455M2532J12229B08a88648P9602B88818
10033h7206J3832A2985b46278P2118J9639D1245c74411J58712B79217f2457F1703
10021b614j72386C0377c10242E338a81796Q6062j94005p9270A95478q9368N504
$$ plain form
10103 -68606 190431 -5660 -191019 -225810 98397 -115127 -17250 -37912 -108551 109485 -303937
10091 -31131 -285946 -133751 -290948 169772 465876 -70246 -274739 -363363 -305613 94277
10080 116867 -1102 -56903 343024 -70010 -6500 -43057 67249 -140786 -57995 -373664 -386677
10069 -386677 -208074 -43086 -254924 -50415 -144867 -12158 161171 -126081 152778 -259177
10058 -587573 -371332 -87025 -154736 -230042 -19425 -185983 -134885 29432 39960 6248 -11078
10046 9512 -231149 -240339 -221734 -165739 64211 -344455 -301923 -189694 208 -188648 -109046 288818
10033 -87206 -73374 12985 -246278 -174160 -154521 41245 -374411 -215699 279217 -62457 61703
10021 -2614 -175000 30377 -310242 5338 -181796 -95734 -289739 -369009 195478 106110 111614
10010A11614b83466M2641d9706o5989n0166G5441C947a56306d3366B4610c3222
9998h3362k3239q536l0479A5055O5453H056L8419K31670a42506B0707f3486k34621
9986b98107R0868J9651L1952g994k93716a11787n6103L028B1165d01040a67045
9974a47347K8525K97l0295A67742c27129d8272D9226b56301k8023a2639A37099
9962a88909j22685A50499o7631b91984c5562L429E5273b07348P936b8285F8805
9950A45852B3748d1450A90247E1504J65457c31947a19429e3550F8836A0361c23357
9938A23254c0115A92978b62391G5800a26852B274b51042A02672b42601O0541A20462
9926F4592b02672H9982d51911d9111B00163b7928o4307C0988J57019a70634F924
$$ plain form
10010 111614 -283466 -240825 -49706 -115695 -165861 75441 3947 -156306 -43366 24610 -33222
9998 -83362 -106601 -115137 -145616 15055 80508 8056 46475 278145 -142506 20707 -63486 -298107
9986 -298107 -207239 -187588 -155636 -7994 -301710 -111787 -167890 -164862 21165 -401040 -167045
9974 -147347 -118822 -118525 -148820 167742 -327129 -48272 49226 -256301 -284324 -12639 137099
9962 -188909 -311594 150499 82868 -291984 -35562 -32133 55273 -207348 -199412 -28285 68805
9950 145852 23748 -41450 190247 51504 216961 -331947 -119429 -53550 68836 10361 -323357
9938 123254 -30115 192978 -262391 75800 -126852 2274 -251042 102672 -242601 -182060 120462
9926 64592 -202672 89982 -451911 -49111 200163 -27928 -92235 30988 188007 -170634 6924
9914A0896a70559N2840l67793i4389G6562N7613E4616J3762N9059a42104d2825
9902a11026n1948f6569k99106J6060B72279a71971e5960j55676B2833a33034M284
9891a28750j9068j34708J24116D088R3861B9168a11170j51403J01033A27640i4881
9879a66741Q2662l70259a99333L7153o9114k2100P7624d4950k41969A35366b76225
9867B55622j4787d27323M7141B0396Q914a34713a5718k78732B21292E2947h3155
9855a54859o3605K9564i829k45239I7990b1818j03379j66574l4564A91027i0359
9843B5524a2957o5594A06989i3090b4842G3947e9814j38698e760j35256e6525
9831b30825a14783F3736k5997e63j06827E8526J32771a31796p3876f4018C4881
$$ plain form
9914 10896 -170559 -117719 -485512 -94389 76562 134175 54616 68378 127437 -142104 -42825
9902 -111026 -162974 -66569 -365675 -349615 272279 -171971 -55960 -211636 22833 -133034 -128750
9891 -128750 -147818 -282526 -158410 4088 97949 29168 -111170 -262573 -161540 127640 -94881
9879 -166741 -84079 -454338 -199333 -162180 -231294 -253394 -175770 -44950 -286919 135366 -276225
9867 255622 240835 -427323 -380182 20396 29310 -134713 -15718 -294450 221292 52947 -83155
9855 -154859 -218464 -188900 -9829 -255068 97990 -21818 -125197 -291771 -326335 191027 -90359
9843 25524 -12957 -78551 106989 -93090 -24842 73947 -59814 -198512 -5760 -141016 -56525
9831 -230825 -114783 63736 37739 -563 -107390 58526 191297 -131796 -205672 -64018 34881
9819a39919j20575i2810J9650k15761E3554K5816b85604E6024c5470k06555Q6756
9808a55269c7416J5506A58349a36852j1311j7570d3861E3758a86247B6826e0015
9796D66776A3686Q053J21204a89527N921K3310I3041Q8650N1455n4416c7022A29677
9783I0686h9994L3181p5321l94533D2231P8635a95826E5710J53672q3686m7311
9772G8385c85771N9547J38164F9695b10865b0384j70190R1125A7407i7654A85860
9760d12682F3541b03905R2124A70739R2083a476E5915a58445j64770J56134j51286
9749c18367K9709j01042i7367H1317a8681E0138R8156a79951c9094J8111k51441
9738b72424j6286a36815O1407b4304r0474a3489o7492B57068a86091g4523E674
$$ plain form
9819 -139919 -260494 -92810 -73160 -288921 53554 79370 -285604 56024 -35470 -242025 -155269
9808 -155269 -37416 -21910 158349 -136852 -148163 -165733 -43861 53758 -186247 26826 -50015
9796 466776 13686 21739 142943 -189527 -183606 -160296 93041 181691 233146 178730 -37022 129677
9783 90686 -89994 -56813 -132134 -526667 42231 120866 -195826 55710 209382 125696 78385
9772 78385 -385771 -326224 -188060 69695 -210865 -20384 -190574 -99449 17407 -97654 185860
9760 -412682 63541 -203905 -111781 170739 262822 -1476 55915 -158445 -323215 -167081 -318367
9749 -318367 -288658 -389700 -97367 81317 -18681 50138 148294 -179951 -39094 -20983 -272424
9738 -272424 -288710 -136815 -75408 -24304 -114778 -13489 -80981 257068 -186091 -74523 5674
9726F1947b04352J3413G185M299L2240f2822A38876B866e7213A11556b54826N0536
9714b04290L0031B23461n520q1773a30853j6467k0864f0519C4243A3107e8779
9702i7255a5908l4348k39292A81032q2888c10920i0321p5226m943A04306a6802
9690b05497b043A27800j9445c0086j4614J5186A5594a05871c9109B5008f47253
9678i0283A09859J9607J6332a36630F3659b232k47721D0941d34202b12682P791
9667b04891b3940n8640J0356j17253A4106J26759E9855a16526e8182m370A58041
9655A65820q0006A3031L00519f2418E4882O8519R480a0681n1162H6855a92793
9643A67971a70439g5455m5759C16135b93060h1161C3213a27600I9259i5820m9822
$$ plain form
9726 61947 -204352 -190939 7185 11484 43724 -62822 138876 2866 -57213 111556 -254826 -204290
9714 -204290 -174259 223461 217941 136168 -130853 -147320 -168184 -60519 34243 13107 -58779
9702 -97255 -15908 -50256 -289548 181032 98144 -310920 -90321 -165547 -170490 104306 -16802
9690 -205497 -2043 127800 108355 -30086 -44700 -29514 15594 -105871 -39109 25008 -647253
9678 -90283 109859 129466 145798 -136630 63659 -2232 -249953 40941 -434202 -212682 -204891
9667 -204891 -23940 -82580 -72224 -189477 14106 140865 59855 -116526 -58182 -62552 158041
9655 165820 85814 13031 313550 -62418 54882 123401 132881 -10681 -61843 86855 -192793
9643 167971 -170439 -75455 -121214 316135 -293060 -81161 33213 -127600 99259 -95820 -145642
9632a45642j5187G6050b67477G1100a10527c2331j78651M6539L7370n9232j15749
9621c02054J42071I2899J3838B7819M5792a87789A00700R9389c5972r2992l9977
9610a68941C177Q4155J11854H639a5708n5001H8860b24752E3296K26665A26308
9598a95033K4692A0189b53042d1298j25100p6662h7085b83B2815Q6735E1058A2469
9585B28592c05732a9359m1323m6703k73862a21520E0905a65825k75195J33236
9575c07784e6014j99022O842F1471C05L8715b9006m5385l02755A32348I57P2500
9563G3457R3117g8860A33050f5017r5579G5254b4779o2729k64785B33278a24556
9551b47696p9414J25687h868B1088d3731j63771n5013i0698l3276A97486q5234
$$ plain form
9632 -145642 -160829 76050 -267477 71100 -110527 -32331 -210982 -164443 -127073 -186305 -302054
9621 -302054 -159983 92899 106737 27819 73611 -187789 100700 200089 -35972 -128964 -168941
9610 -168941 3177 87332 199186 8639 -15708 -70709 88860 -224752 53296 279961 126308
9598 -195033 -170341 10189 -253042 -41298 -166398 -243060 -87085 -283 22815 109550 51058 12469
9585 228592 -305732 -19359 -60682 -107385 -381247 -121520 50905 -165825 -441020 -307784
9575 -307784 -56014 -255036 -248194 61471 305 39020 -29006 -74391 -377146 132348 957 73457
9563 73457 166574 -78860 133050 -65017 -160596 75254 -24779 -87508 -352293 233278 -124556
9551 -247696 -327110 -201423 -8868 21088 -43731 -207502 -262515 -90698 -123974 197486 112252
9540A12252l2277b12504F8134i3457B17592H4804h5854A16732J1819J1249C5187
9528D5708b41970g5953r2979j7610B0019e8538J0829j25584A07064b39599I18
9516e2354M13A7723b51058A56880L9251a21307f603B9227l993d1639b329F5809
9503A51737a44937K5746A92415b49629A24206g0666p921j57074L5306Q5319k6496
9492a41532j3896L9028e5945B08203G6338d3969m6380j17614n1897J29011c3861
9480d88826J03580g5953C651J46705i4820A09874f743m5733I9688b56282q9273
9469c45555B8980H807e5283k28244A5259b70531c6308A67928a10398L7775J1144
9458f1479g081m02620h974l89914J53967g6368l4795M4119j65926H9301A2257
$$ plain form
9540 112252 79975 -212504 68134 -93457 217592 84804 -85854 116732 128551 139800 35187
9528 45708 -241970 -75953 -168932 -186542 20019 -58538 -47709 -173293 107064 -239599 918
9516 -52354 -51941 17723 -251058 156880 196131 -121307 -6603 29227 25234 -41639 -2329 65809
9503 151737 -144937 -119191 192415 -249629 124206 -70666 -78587 -235661 -200355 -115036 -141532
9492 -141532 -155428 -116400 -55945 208203 76338 -43969 -90349 -207963 -259860 -130849 -33861
9480 -488826 -385246 -75953 3651 150356 -94820 109874 -6743 -52476 99688 -256282 -345555
9469 -345555 28980 8807 -55283 -283527 15259 -270531 -36308 167928 -110398 -72623 -61479
9458 -61479 -7081 -409701 -8974 -398888 -244921 -76368 -111163 -67044 -232970 89301 12257
9446g6496o2037O299j38454d4709p7760m8427k2418A8455O7452g7324K9691l0467
9434g8100L4351F068O9937a34012A44089c877m07607j2100D8132i0208p1954A37640
9421a32421k49678d7558A92939a02751G1539i3508M5777B12820l8930D3757i1771
9409b23501l17388b52043l0976Q7719j47309D313L690N9042i3707J4192k95959
9398c75474a61122C00350B9507a32756F2608K26524g4037A170J86671a17356G2344
9386A73599i6161M1585K3954B02385b30926a064j69608j45128g3083j21086b6678
9374C69685A79242a24474B65437D630a48575l7128A5666a12432M05r3055E9701
9362B44413a02689n135l8386q8157c3844l424k46539C8317b7550q888f617l88081
$$ plain form
9446 -76496 -138533 -132234 -270688 -44709 -122469 -170896 -193314 18455 85907 -77324 -47633 -78100
9434 -78100 -43749 6068 76005 -134012 144089 -3877 -411484 -423584 48132 -90208 -162162 137640
9421 -132421 -382099 -47558 192939 -102751 71539 -93508 -47731 212820 173890 43757 -91771
9409 -223501 -540889 -252043 -283019 -195300 -342609 4313 8003 67045 -93707 -79515 -375474
9398 -375474 -161122 300350 29507 -132756 62608 289132 -74037 1170 187841 -117356 72344
9386 173599 -96161 -54576 -30622 202385 -230926 -1064 -170672 -315800 -73083 -194169 -26678
9374 369685 179242 -124474 265437 4630 -148575 -185703 15666 -112432 -112027 -205082 59701
9362 244413 -102689 -107824 -146210 -234367 -33844 -37268 -283807 38317 -27550 -36438 -6617 -394698
9350c94698D36665A60433G2320a14108l50714b27210f767A33179i0942j66693
9340b57635l1189c0530A58633a60801J876E6768J22590K75596A85541a5229F7551
9328b25712F0995d5352k58897N9890j26443i7466N129c3683k30838O7520a9668
9316e8894o3375K529C26252a53A44581J5995a39017A51791b84062A08314J23764
9305B32078c86774a33858d8423B9105N0430J62829a60608n7259j50116e3588j29184
9294a82772A42642L3438D8619J65226b73514E7907O2717m8742b36209j74513a17971
9282b67413F6962c16594J37798A3231a1045B200J25110b55242J00679j6034c0078
9270B34200a92716A78953d36214F1650b77996A7017Q3240a15478j57831a32713
$$ plain form
9350 -394698 436665 160433 72320 -114108 -464822 -227210 -6767 133179 -90942 -257635
9340 -257635 -288824 -30530 158633 -160801 -158925 56768 179358 454954 185541 -15229 67551
9328 -225712 60995 -45352 -304249 -244359 -370802 -97466 -92337 -33683 -264521 -197001 -19668
9316 -58894 -122269 -119740 326252 -153 144581 160576 -139017 151791 -284062 108314 232078
9305 232078 -386774 -133858 -48423 29105 79535 242364 -160608 -217867 -367983 -53588 -182772
9294 -182772 142642 176080 48619 213845 -273514 57907 120624 71882 -236209 -410722 -117971
9282 -267413 66962 -316594 -178796 13231 -11045 2200 127310 -255242 -154563 -170597 -30078
9270 234200 -192716 178953 -436214 61650 -277996 17017 100257 -115478 -273309 -132713
9259G9585a84690A66232d7788m7821B32683b23348c3326p3321A700f8906k85699
9248c54605J66931j17581d6466c413k67611h4242r7921c514l79366e0168J7221
9237c2947C3540G097b92119B88760B6166K16038m4854c18263C0053c50976J5970
9226c35006c3145F6046a84566A31253c8299A22521b34086j12832J22869f1911
9215e6879j02391d2063k80559O0842C4876P6439b23946j07992f89k57602A84256
9203F7591b35465J0334K7114j30142c2020E8123a86125d5588j53111B63409d9225
9191b86617B2072a3334j00428l0647E2960h7940J7953j02790f6518k52926g564
9179b0977A94355M0535o5817b32840k93817i9177l2794H5405M6156a78613F9724
$$ plain form
9259 79585 -184690 166232 -47788 -95609 232683 -223348 -33326 -106647 1700 -68906 -354605
9248 -354605 -187674 -305255 -46466 -3413 -271024 -84242 -182163 -3514 -382880 -50168 -32947
9237 -32947 33540 7097 -292119 288760 26166 242204 197350 -318263 30053 -350976 -335006
9226 -335006 -33145 66046 -184566 131253 -38299 122521 -234086 -346918 -224049 -61911
9215 -56879 -159270 -42063 -322622 -261780 34876 111315 -223946 -331938 -689 -258291 184256
9203 67591 -235465 -225131 -198017 -328159 -32020 58123 -186125 -45588 -198699 263409 -49225
9191 -286617 22072 -13334 -113762 -144409 52960 -87940 -69987 -172777 -66518 -319444 -7564
9179 -20977 194355 234890 169073 -232840 -526657 -99177 -131971 85405 131561 -178613 69724
9167a93701O1249A15495a41702J1065A37529b00716g1154F2008J62394a36295
9156a98723P8089F9418d5808p0693e2299O711J6778C7729p180a61142I1627l20
9144I1307b59823D2529g0683j06906k4144C9374j1578J14590G149M1927c515k69921
9132b73436D6423d6718A36141d9169A42584h0966k4240H186a21144A12002c655
9120a22278M1539K4179G086Q673c5593a1656n7286A0752L4825c47079g1971q1938
9108a53909A8911a44712d7782C11672E6805r62g460k28263A69512a27394B33630
9096e69645b70690n6492i8389b1337n4051j14624f6202o5423G964c6077B76414
9084b28878k9364A25661c55584h260n7185D14909A07289D6147a95421H2532k8504
$$ plain form
9167 -193701 -132452 115495 -141702 -130637 137529 -200716 -71154 62008 224402 -136295
9156 -198723 -120634 69418 -45808 -116501 -52299 -45588 -28810 37729 30549 -161142 91627 91307
9144 91307 -259823 42529 -70683 -177589 -201733 39374 27796 142386 7149 49076 -3515 -273436
9132 -273436 46423 -46718 136141 -49169 142584 -80966 -105206 8186 -121144 112002 -3655
9120 -122278 -80739 -56560 7086 15759 -35593 -11656 -68942 10752 45577 -347079 -71971 -153909
9108 -153909 18911 -144712 -47782 311672 56805 55843 -7460 -235723 169512 -127394 233630
9096 -569645 -270690 -327182 -98389 -21337 -75388 -190012 -66202 -131625 7964 -36077 276414
9084 -228878 -258242 125661 -355584 -8260 -65445 414909 107289 46147 -195421 82532 54028
9073E4028r655N9392L6673d1121B6834Q8913a0800A09448a27884c603C997L3847
9061C7844a49809F8078k8331a36609B20816a14361B1674c5873G8592a27265r2867
9050b20132m4883P80e2941j20387P8829C2165c21865G5222h759o096l43935a4177
9037A31336g3712C43926e7131k65519B71842a13339c806n2636G8124b53784A87518
9025I007J44785k8310E445J34926e7434j56549A17340f5203j89262C728a01649
9013b79807J05186Q5377n1713j55842a7463B7775a89721Q6839A73355a98643j2251
9002b10894B1407a54834b4376E0991c03104P0244P7962C2803a76059a7764F5911
8990a68846r489E4658k6263K53551E761K9172E493a9006j79902C3087c6623o9216
$$ plain form
9073 54028 44373 103765 140438 -41121 26834 115747 -10800 109448 -127884 -3603 3997 37844
9061 37844 -149809 68078 39747 -136609 220816 -114361 21674 -35873 78592 -127265 -220132
9050 -220132 -265015 -264235 -52941 -173328 -94499 32165 -321865 75222 -8759 -14855 -358790 -14177
9037 131336 -73712 343926 -57131 -322650 271842 -113339 -3806 -56442 78124 -253784 187518
9025 9007 153792 125482 5445 140371 -57434 -213983 117340 -65203 -254465 3728 -101649
9013 -279807 -174621 -89244 -140957 -296799 -17463 27775 -189721 -102882 173355 -198643 -210894
9002 -210894 21407 -154834 -24376 50991 -303104 -232860 -154898 32803 -176059 -17764 65911
8990 -168846 -178335 54658 28395 281946 5761 34933 5493 -19006 -198908 33087 -36623 -105839
8978a05839A9775L9471a21605b0928B31342a80037g9785c8975r4443N0999B54961
8966A9201J88611J19715b91243E2f0321j45845l24354b64009a16688j360l50993
8955d69041C48425A15836f8094o2788j73935e3578E2121d35948d8061F5323O9765
8944A35088a29197d7248l93649a74458a6829C7867d1453A34702O3376b26225N6359
8933a69866i837l45308h1994A373a87587j56129a11994N3904k10325F1591a00100
8921a60283c8123p2244B70087o0708j7505p1502Q6358a50583D38173j15103j08585
8910B14485J92671K76828O78115J679457K412887M318882D704641k050992A160690
8900G73466k11317q4282k36010j16882J96177L7090A57665A5549L08239A45424
$$ plain form
8978 -105839 19775 59246 -121605 -20928 231342 -180037 -79785 -38975 -133418 -82419 254961
8966 19201 207812 327527 -291243 52 -60321 -206166 -530520 -264009 -116688 -118048 -469041
8955 -469041 348425 115836 -68094 -130882 -304817 -53578 52121 -435948 -48061 65323 135088
8944 135088 -129197 -47248 -440897 -174458 -16829 37867 -41453 134702 198078 -226225 -169866
8933 -169866 -9837 -355145 -81994 1373 -187587 -343716 -111994 -58090 -268415 61591 -100100
8921 -160283 -38123 -110367 270087 209379 191874 120372 206730 -150583 438173 323070 214485
8910 214485 407156 683984 1362099 3041556 5454443 9773325 4704641 2653649 1160690
8900 773466 562149 477867 241857 124975 321152 358242 157665 15549 323788 145424
8889a04968D6074j9212d48293a77444D073L03945A21701b55334a44n2854A09662
8877a32446G0821J74340b90355A17155l9565c8284H4812B4729b8931k54039g2979
8865g761l24280J57132P8889B7450e6443e819j41151p0500A92173a05452E4817
8853f9306j48539O2050b1238A61893c9700E0676K62376b67025A77206c3828P176
8842b6652P254B9859N8924B6184a57898k0717j21946J4393F6756a50459j07996
$$ plain form
8889 -104968 46074 26862 -448293 -177444 4073 308018 121701 -255334 -144 -52998 109662
8877 -132446 70821 245161 -290355 117155 77590 -38284 84812 24729 -28931 -282970 -72979
8865 -7761 -332041 -174909 -96020 27450 -56443 -5819 -146970 -217470 192173 -105452 54817
8853 -69306 -217845 -155795 -21238 161893 -39700 50676 313052 -267025 177206 -33828 -26652
8842 -26652 -19398 29859 88783 26184 -157898 -178615 -300561 -286168 66756 -150459 -258455
$$ [...]
##END NTUPLES=NMR SPECTRUM
##END=
